Console Output

Skipping 167 KB.. Full Log
Number of pre-commit events : 55
Number of post-commit events: 60
Remove high timing: 129
Remove low timing : 56
Mean time for 10 runs: 84.4
Standard deviation: 19.627531683836356
===============================
Performance test: test_validatorTransactionTreeOptimizations_152332
===============================
Raw timing: 236
Raw timing: 205
Raw timing: 190
Raw timing: 226
Raw timing: 218
Raw timing: 206
Raw timing: 194
Raw timing: 191
Raw timing: 189
Raw timing: 218
Raw timing: 191
Raw timing: 192
Total number of notifications: 22221
Number of pre-commit notifications sent: 1221
Number of post-commit notifications sent: 12221
Number of validation notifications sent: 22221
Remove high timing: 236
Remove low timing : 189
Mean time for 10 runs: 203.1
Standard deviation: 12.848735346328837
===============================
Performance test: test_ReadWriteValidator_findTree_132590
===============================
Raw timing: 68
Raw timing: 79
Raw timing: 66
Raw timing: 65
Raw timing: 66
Raw timing: 77
Raw timing: 73
Raw timing: 66
Raw timing: 69
Raw timing: 65
Raw timing: 66
Raw timing: 77
Remove high timing: 79
Remove low timing : 65
Mean time for 10 runs: 69.3
Standard deviation: 4.428317965096905
===============================
Performance test: test_DoNothing
===============================
Mean time for 10 runs: NaN
Standard deviation: NaN
===============================
Tests run: 4, Failures: 0, Errors: 0, Skipped: 0, Time elapsed: 4.437 s - in org.eclipse.emf.transaction.tests.PerformanceTest
test_loadLargishModelWithoutRecording(org.eclipse.emf.transaction.tests.PerformanceTest)  Time elapsed: 1.124 s
test_validatorTransactionTreeOptimizations_152332(org.eclipse.emf.transaction.tests.PerformanceTest)  Time elapsed: 2.462 s
test_ReadWriteValidator_findTree_132590(org.eclipse.emf.transaction.tests.PerformanceTest)  Time elapsed: 0.846 s
test_DoNothing(org.eclipse.emf.transaction.tests.PerformanceTest)  Time elapsed: 0.005 s
Running org.eclipse.emf.transaction.tests.ResourceSetListenersTest
Tests run: 25, Failures: 0, Errors: 0, Skipped: 0, Time elapsed: 0.186 s - in org.eclipse.emf.transaction.tests.ResourceSetListenersTest
test_precommit_nestedChange(org.eclipse.emf.transaction.tests.ResourceSetListenersTest)  Time elapsed: 0.006 s
test_precommit_cannotClose(org.eclipse.emf.transaction.tests.ResourceSetListenersTest)  Time elapsed: 0.005 s
test_rollback_resourceChangePropagation_unloaded_145321(org.eclipse.emf.transaction.tests.ResourceSetListenersTest)  Time elapsed: 0.006 s
test_triggerCommands_cascading(org.eclipse.emf.transaction.tests.ResourceSetListenersTest)  Time elapsed: 0.006 s
test_precommit_readOnly(org.eclipse.emf.transaction.tests.ResourceSetListenersTest)  Time elapsed: 0.006 s
test_precommit(org.eclipse.emf.transaction.tests.ResourceSetListenersTest)  Time elapsed: 0.005 s
test_rollback_noEvents_145321(org.eclipse.emf.transaction.tests.ResourceSetListenersTest)  Time elapsed: 0.005 s
test_readNotifications_cascading(org.eclipse.emf.transaction.tests.ResourceSetListenersTest)  Time elapsed: 0.005 s
test_unbatchedNotifications_reuseEvents_128445(org.eclipse.emf.transaction.tests.ResourceSetListenersTest)  Time elapsed: 0.005 s
test_postcommit_ordering(org.eclipse.emf.transaction.tests.ResourceSetListenersTest)  Time elapsed: 0.034 s
test_precommit_aggregatedCascade_121508(org.eclipse.emf.transaction.tests.ResourceSetListenersTest)  Time elapsed: 0.006 s
test_postcommitIncludesTriggerChanges(org.eclipse.emf.transaction.tests.ResourceSetListenersTest)  Time elapsed: 0.005 s
test_precommit_nestedChange2(org.eclipse.emf.transaction.tests.ResourceSetListenersTest)  Time elapsed: 0.005 s
test_rollback_resourceChangePropagation_created_145321(org.eclipse.emf.transaction.tests.ResourceSetListenersTest)  Time elapsed: 0.005 s
test_triggerCommands(org.eclipse.emf.transaction.tests.ResourceSetListenersTest)  Time elapsed: 0.005 s
test_rollback_resourceChangePropagation_uri_145321(org.eclipse.emf.transaction.tests.ResourceSetListenersTest)  Time elapsed: 0.004 s
test_postcommit(org.eclipse.emf.transaction.tests.ResourceSetListenersTest)  Time elapsed: 0.005 s
test_internalListenerNotifications_177642(org.eclipse.emf.transaction.tests.ResourceSetListenersTest)  Time elapsed: 0.004 s
test_precommit_aggregated_121508(org.eclipse.emf.transaction.tests.ResourceSetListenersTest)  Time elapsed: 0.005 s
test_postcommit_readOnly(org.eclipse.emf.transaction.tests.ResourceSetListenersTest)  Time elapsed: 0.005 s
test_postcommit_nestedChange(org.eclipse.emf.transaction.tests.ResourceSetListenersTest)  Time elapsed: 0.006 s
test_unbatchedNotifications(org.eclipse.emf.transaction.tests.ResourceSetListenersTest)  Time elapsed: 0.004 s
test_recordingCommandsAsTriggers_bug157103(org.eclipse.emf.transaction.tests.ResourceSetListenersTest)  Time elapsed: 0.005 s
test_rollback_resourceChangePropagation_loaded_145321(org.eclipse.emf.transaction.tests.ResourceSetListenersTest)  Time elapsed: 0.033 s
test_DoNothing(org.eclipse.emf.transaction.tests.ResourceSetListenersTest)  Time elapsed: 0.004 s
Running org.eclipse.emf.transaction.tests.EditingDomainTest
Tests run: 3, Failures: 0, Errors: 0, Skipped: 0, Time elapsed: 0.015 s - in org.eclipse.emf.transaction.tests.EditingDomainTest
test_factoryUnmapResourceSet_161168(org.eclipse.emf.transaction.tests.EditingDomainTest)  Time elapsed: 0.005 s
test_readOnlyResourceMap_filesystem_bug156428(org.eclipse.emf.transaction.tests.EditingDomainTest)  Time elapsed: 0.006 s
test_DoNothing(org.eclipse.emf.transaction.tests.EditingDomainTest)  Time elapsed: 0.004 s
Running org.eclipse.emf.transaction.tests.ValidationRollbackTest
Got expected rollback
Tests run: 18, Failures: 0, Errors: 0, Skipped: 0, Time elapsed: 0.128 s - in org.eclipse.emf.transaction.tests.ValidationRollbackTest
test_rollbackOnAbortExecutionException_230129(org.eclipse.emf.transaction.tests.ValidationRollbackTest)  Time elapsed: 0.004 s
test_rollback(org.eclipse.emf.transaction.tests.ValidationRollbackTest)  Time elapsed: 0.005 s
test_validation(org.eclipse.emf.transaction.tests.ValidationRollbackTest)  Time elapsed: 0.004 s
test_rollback_nesting_noNotifications_206819(org.eclipse.emf.transaction.tests.ValidationRollbackTest)  Time elapsed: 0.006 s
test_rollbackNotifiesCommandStackListeners_175725(org.eclipse.emf.transaction.tests.ValidationRollbackTest)  Time elapsed: 0.007 s
test_rollbackNestingTransactionOnException_135673(org.eclipse.emf.transaction.tests.ValidationRollbackTest)  Time elapsed: 0.006 s
test_rollback_nesting_trailingNotifications_206819(org.eclipse.emf.transaction.tests.ValidationRollbackTest)  Time elapsed: 0.005 s
test_rollback_nestedTransactions_illegalSubList_227429(org.eclipse.emf.transaction.tests.ValidationRollbackTest)  Time elapsed: 0.007 s
test_rollback_nested(org.eclipse.emf.transaction.tests.ValidationRollbackTest)  Time elapsed: 0.033 s
test_rollback_outer(org.eclipse.emf.transaction.tests.ValidationRollbackTest)  Time elapsed: 0.005 s
test_validation_nestedCommitted(org.eclipse.emf.transaction.tests.ValidationRollbackTest)  Time elapsed: 0.006 s
test_danglingTransactionOnException_149340(org.eclipse.emf.transaction.tests.ValidationRollbackTest)  Time elapsed: 0.008 s
test_validation_nestedRolledBack(org.eclipse.emf.transaction.tests.ValidationRollbackTest)  Time elapsed: 0.005 s
test_triggerRollback_146853(org.eclipse.emf.transaction.tests.ValidationRollbackTest)  Time elapsed: 0.006 s
test_rollbackOnRuntimeException_185040(org.eclipse.emf.transaction.tests.ValidationRollbackTest)  Time elapsed: 0.006 s
test_triggerRollback_cancel_146853(org.eclipse.emf.transaction.tests.ValidationRollbackTest)  Time elapsed: 0.005 s
test_abort(org.eclipse.emf.transaction.tests.ValidationRollbackTest)  Time elapsed: 0.005 s
test_DoNothing(org.eclipse.emf.transaction.tests.ValidationRollbackTest)  Time elapsed: 0.004 s
Running org.eclipse.emf.transaction.tests.EditingDomainValidatorTest
Tests run: 2, Failures: 1, Errors: 0, Skipped: 0, Time elapsed: 0.012 s <<< FAILURE! - in org.eclipse.emf.transaction.tests.EditingDomainValidatorTest
test_createValidators_177643(org.eclipse.emf.transaction.tests.EditingDomainValidatorTest)  Time elapsed: 0.007 s  <<< FAILURE!
junit.framework.AssertionFailedError: expected:<1> but was:<2>
	at org.eclipse.emf.transaction.tests.EditingDomainValidatorTest.test_createValidators_177643(EditingDomainValidatorTest.java:62)

test_DoNothing(org.eclipse.emf.transaction.tests.EditingDomainValidatorTest)  Time elapsed: 0.004 s
Running org.eclipse.emf.transaction.tests.LifecycleListenersTest
Tests run: 3, Failures: 0, Errors: 0, Skipped: 0, Time elapsed: 0.015 s - in org.eclipse.emf.transaction.tests.LifecycleListenersTest
test_eventSequence_rollback(org.eclipse.emf.transaction.tests.LifecycleListenersTest)  Time elapsed: 0.005 s
test_eventSequence_commit(org.eclipse.emf.transaction.tests.LifecycleListenersTest)  Time elapsed: 0.005 s
test_DoNothing(org.eclipse.emf.transaction.tests.LifecycleListenersTest)  Time elapsed: 0.005 s
Running org.eclipse.emf.transaction.tests.UndoRedoTest
Got expected runtime exception: null
Tests run: 15, Failures: 0, Errors: 0, Skipped: 0, Time elapsed: 0.115 s - in org.eclipse.emf.transaction.tests.UndoRedoTest
test_triggerCommands_recording(org.eclipse.emf.transaction.tests.UndoRedoTest)  Time elapsed: 0.005 s
test_undoRecordingCommandWithRecordingCommandTrigger_218276(org.eclipse.emf.transaction.tests.UndoRedoTest)  Time elapsed: 0.005 s
test_undoResourceLoad(org.eclipse.emf.transaction.tests.UndoRedoTest)  Time elapsed: 0.01 s
test_nonredoableCommand_138287(org.eclipse.emf.transaction.tests.UndoRedoTest)  Time elapsed: 0.005 s
test_nonredoableTriggerCommands(org.eclipse.emf.transaction.tests.UndoRedoTest)  Time elapsed: 0.005 s
test_undoResourceUnload(org.eclipse.emf.transaction.tests.UndoRedoTest)  Time elapsed: 0.005 s
test_nonredoableTriggerCommand_138287(org.eclipse.emf.transaction.tests.UndoRedoTest)  Time elapsed: 0.005 s
test_undoNestedRecordingCommandWithRecordingCommandTrigger_218276(org.eclipse.emf.transaction.tests.UndoRedoTest)  Time elapsed: 0.006 s
test_triggerCommands_nonRecording(org.eclipse.emf.transaction.tests.UndoRedoTest)  Time elapsed: 0.035 s
test_triggerCommands_singleUndoRedo_133388(org.eclipse.emf.transaction.tests.UndoRedoTest)  Time elapsed: 0.006 s
test_recordingCommand(org.eclipse.emf.transaction.tests.UndoRedoTest)  Time elapsed: 0.005 s
test_undoRedoOptionsNotSharedbyDomains_bug207986(org.eclipse.emf.transaction.tests.UndoRedoTest)  Time elapsed: 0.005 s
test_defaultUndoRedoOptionsMapReadOnly_bug207986(org.eclipse.emf.transaction.tests.UndoRedoTest)  Time elapsed: 0.005 s
test_nonredoableTriggerCommand_RecordingCommand_138287(org.eclipse.emf.transaction.tests.UndoRedoTest)  Time elapsed: 0.005 s
test_DoNothing(org.eclipse.emf.transaction.tests.UndoRedoTest)  Time elapsed: 0.006 s
Running org.eclipse.emf.transaction.tests.AbstractTest
Tests run: 1, Failures: 0, Errors: 0, Skipped: 0, Time elapsed: 0.006 s - in org.eclipse.emf.transaction.tests.AbstractTest
test_DoNothing(org.eclipse.emf.transaction.tests.AbstractTest)  Time elapsed: 0.006 s
Running org.eclipse.emf.transaction.tests.ValidateEditTest
Got expected exception: Book does not have a title.
Got expected exception: Book does not have a title.
Got expected exception: 
Tests run: 5, Failures: 0, Errors: 0, Skipped: 0, Time elapsed: 0.062 s - in org.eclipse.emf.transaction.tests.ValidateEditTest
test_validationRollback_validateEditFails(org.eclipse.emf.transaction.tests.ValidateEditTest)  Time elapsed: 0.006 s
test_noValidateEditRequired(org.eclipse.emf.transaction.tests.ValidateEditTest)  Time elapsed: 0.006 s
test_liveValidationFailure_validateEditOK(org.eclipse.emf.transaction.tests.ValidateEditTest)  Time elapsed: 0.006 s
test_customValidateEditSupport(org.eclipse.emf.transaction.tests.ValidateEditTest)  Time elapsed: 0.038 s
test_DoNothing(org.eclipse.emf.transaction.tests.ValidateEditTest)  Time elapsed: 0.005 s
Running org.eclipse.emf.transaction.tests.NotificationFilterTest
Tests run: 6, Failures: 0, Errors: 0, Skipped: 0, Time elapsed: 0.032 s - in org.eclipse.emf.transaction.tests.NotificationFilterTest
test_filteringOnDispatch(org.eclipse.emf.transaction.tests.NotificationFilterTest)  Time elapsed: 0.006 s
test_contentTypeFilter_specific(org.eclipse.emf.transaction.tests.NotificationFilterTest)  Time elapsed: 0.005 s
test_contentTypeFilter_miss(org.eclipse.emf.transaction.tests.NotificationFilterTest)  Time elapsed: 0.006 s
test_contentTypeFilter_general(org.eclipse.emf.transaction.tests.NotificationFilterTest)  Time elapsed: 0.005 s
test_contentTypeFilter_noContent(org.eclipse.emf.transaction.tests.NotificationFilterTest)  Time elapsed: 0.005 s
test_DoNothing(org.eclipse.emf.transaction.tests.NotificationFilterTest)  Time elapsed: 0.004 s
Running org.eclipse.emf.transaction.util.tests.InternalUtilTests
Got expected exception: Attempted to beginRule: org.eclipse.emf.transaction.util.Lock$AcquireRule@13e4dd20, does not match outer scope rule: R/
Tests run: 28, Failures: 0, Errors: 0, Skipped: 0, Time elapsed: 7.63 s - in org.eclipse.emf.transaction.util.tests.InternalUtilTests
test_yield_noneWaiting(org.eclipse.emf.transaction.util.tests.LockTest)  Time elapsed: 0 s
test_uiSafeWaitForAcquire_implicitJob_bug162141(org.eclipse.emf.transaction.util.tests.LockTest)  Time elapsed: 0 s
test_interrupt_uiSafeAcquire_jobInterrupted(org.eclipse.emf.transaction.util.tests.LockTest)  Time elapsed: 1.252 s
test_interrupt_acquire_alreadyInterrupted(org.eclipse.emf.transaction.util.tests.LockTest)  Time elapsed: 0 s
test_uiSafeWaitForAcquire_beginRuleThrows_bug205857(org.eclipse.emf.transaction.util.tests.LockTest)  Time elapsed: 0.552 s
test_interrupt_acquire(org.eclipse.emf.transaction.util.tests.LockTest)  Time elapsed: 1.002 s
test_waitForAcquire(org.eclipse.emf.transaction.util.tests.LockTest)  Time elapsed: 1.002 s
test_waitForAcquire_timeout(org.eclipse.emf.transaction.util.tests.LockTest)  Time elapsed: 1.001 s
test_interrupt_uiSafeAcquire_jobCancelled(org.eclipse.emf.transaction.util.tests.LockTest)  Time elapsed: 0.752 s
test_yieldExclusion(org.eclipse.emf.transaction.util.tests.LockTest)  Time elapsed: 0.501 s
test_uiSafeWaitForAcquire(org.eclipse.emf.transaction.util.tests.LockTest)  Time elapsed: 0 s
test_acquire(org.eclipse.emf.transaction.util.tests.LockTest)  Time elapsed: 0 s
test_depth(org.eclipse.emf.transaction.util.tests.LockTest)  Time elapsed: 0 s
test_yield(org.eclipse.emf.transaction.util.tests.LockTest)  Time elapsed: 0.501 s
test_uiSafeWaitForAcquire_explicitJob_beginRule_262175(org.eclipse.emf.transaction.util.tests.LockTest)  Time elapsed: 1.001 s
test_canApply(org.eclipse.emf.transaction.util.tests.CompositeChangeDescriptionTest)  Time elapsed: 0.006 s
test_resourceChanges(org.eclipse.emf.transaction.util.tests.CompositeChangeDescriptionTest)  Time elapsed: 0.005 s
test_objectChanges(org.eclipse.emf.transaction.util.tests.CompositeChangeDescriptionTest)  Time elapsed: 0.005 s
test_objectsToAttach(org.eclipse.emf.transaction.util.tests.CompositeChangeDescriptionTest)  Time elapsed: 0.006 s
test_objectsToDetach(org.eclipse.emf.transaction.util.tests.CompositeChangeDescriptionTest)  Time elapsed: 0.005 s
test_applyAndReverse(org.eclipse.emf.transaction.util.tests.CompositeChangeDescriptionTest)  Time elapsed: 0.005 s
test_apply(org.eclipse.emf.transaction.util.tests.CompositeChangeDescriptionTest)  Time elapsed: 0.005 s
test_DoNothing(org.eclipse.emf.transaction.util.tests.CompositeChangeDescriptionTest)  Time elapsed: 0.004 s
test_getEditingDomain_EObject(org.eclipse.emf.transaction.util.tests.TransactionUtilTests)  Time elapsed: 0.004 s
test_getEditingDomain_Object(org.eclipse.emf.transaction.util.tests.TransactionUtilTests)  Time elapsed: 0.004 s
test_getEditingDomain_ResourceSet(org.eclipse.emf.transaction.util.tests.TransactionUtilTests)  Time elapsed: 0.004 s
test_getEditingDomain_Resource(org.eclipse.emf.transaction.util.tests.TransactionUtilTests)  Time elapsed: 0.005 s
test_DoNothing(org.eclipse.emf.transaction.util.tests.TransactionUtilTests)  Time elapsed: 0.004 s
Running org.eclipse.emf.transaction.util.tests.LockTest
Got expected exception: Attempted to beginRule: org.eclipse.emf.transaction.util.Lock$AcquireRule@775b1f38, does not match outer scope rule: R/
Tests run: 15, Failures: 0, Errors: 0, Skipped: 0, Time elapsed: 7.569 s - in org.eclipse.emf.transaction.util.tests.LockTest
test_yield_noneWaiting(org.eclipse.emf.transaction.util.tests.LockTest)  Time elapsed: 0 s
test_uiSafeWaitForAcquire_implicitJob_bug162141(org.eclipse.emf.transaction.util.tests.LockTest)  Time elapsed: 0 s
test_interrupt_uiSafeAcquire_jobInterrupted(org.eclipse.emf.transaction.util.tests.LockTest)  Time elapsed: 1.251 s
test_interrupt_acquire_alreadyInterrupted(org.eclipse.emf.transaction.util.tests.LockTest)  Time elapsed: 0 s
test_uiSafeWaitForAcquire_beginRuleThrows_bug205857(org.eclipse.emf.transaction.util.tests.LockTest)  Time elapsed: 0.552 s
test_interrupt_acquire(org.eclipse.emf.transaction.util.tests.LockTest)  Time elapsed: 1.002 s
test_waitForAcquire(org.eclipse.emf.transaction.util.tests.LockTest)  Time elapsed: 1.005 s
test_waitForAcquire_timeout(org.eclipse.emf.transaction.util.tests.LockTest)  Time elapsed: 1.001 s
test_interrupt_uiSafeAcquire_jobCancelled(org.eclipse.emf.transaction.util.tests.LockTest)  Time elapsed: 0.753 s
test_yieldExclusion(org.eclipse.emf.transaction.util.tests.LockTest)  Time elapsed: 0.501 s
test_uiSafeWaitForAcquire(org.eclipse.emf.transaction.util.tests.LockTest)  Time elapsed: 0.001 s
test_acquire(org.eclipse.emf.transaction.util.tests.LockTest)  Time elapsed: 0 s
test_depth(org.eclipse.emf.transaction.util.tests.LockTest)  Time elapsed: 0 s
test_yield(org.eclipse.emf.transaction.util.tests.LockTest)  Time elapsed: 0.502 s
test_uiSafeWaitForAcquire_explicitJob_beginRule_262175(org.eclipse.emf.transaction.util.tests.LockTest)  Time elapsed: 1 s
Running org.eclipse.emf.transaction.util.tests.CompositeChangeDescriptionTest
Tests run: 8, Failures: 0, Errors: 0, Skipped: 0, Time elapsed: 0.034 s - in org.eclipse.emf.transaction.util.tests.CompositeChangeDescriptionTest
test_canApply(org.eclipse.emf.transaction.util.tests.CompositeChangeDescriptionTest)  Time elapsed: 0.004 s
test_resourceChanges(org.eclipse.emf.transaction.util.tests.CompositeChangeDescriptionTest)  Time elapsed: 0.004 s
test_objectChanges(org.eclipse.emf.transaction.util.tests.CompositeChangeDescriptionTest)  Time elapsed: 0.005 s
test_objectsToAttach(org.eclipse.emf.transaction.util.tests.CompositeChangeDescriptionTest)  Time elapsed: 0.004 s
test_objectsToDetach(org.eclipse.emf.transaction.util.tests.CompositeChangeDescriptionTest)  Time elapsed: 0.004 s
test_applyAndReverse(org.eclipse.emf.transaction.util.tests.CompositeChangeDescriptionTest)  Time elapsed: 0.004 s
test_apply(org.eclipse.emf.transaction.util.tests.CompositeChangeDescriptionTest)  Time elapsed: 0.005 s
test_DoNothing(org.eclipse.emf.transaction.util.tests.CompositeChangeDescriptionTest)  Time elapsed: 0.004 s
Running org.eclipse.emf.transaction.util.tests.TransactionUtilTests
Tests run: 5, Failures: 0, Errors: 0, Skipped: 0, Time elapsed: 0.021 s - in org.eclipse.emf.transaction.util.tests.TransactionUtilTests
test_getEditingDomain_EObject(org.eclipse.emf.transaction.util.tests.TransactionUtilTests)  Time elapsed: 0.004 s
test_getEditingDomain_Object(org.eclipse.emf.transaction.util.tests.TransactionUtilTests)  Time elapsed: 0.004 s
test_getEditingDomain_ResourceSet(org.eclipse.emf.transaction.util.tests.TransactionUtilTests)  Time elapsed: 0.004 s
test_getEditingDomain_Resource(org.eclipse.emf.transaction.util.tests.TransactionUtilTests)  Time elapsed: 0.005 s
test_DoNothing(org.eclipse.emf.transaction.util.tests.TransactionUtilTests)  Time elapsed: 0.004 s
Running org.eclipse.emf.transaction.multithread.tests.ReadOperationTest
Tests run: 5, Failures: 0, Errors: 0, Skipped: 0, Time elapsed: 6.434 s - in org.eclipse.emf.transaction.multithread.tests.ReadOperationTest
testSimultaneousRead(org.eclipse.emf.transaction.multithread.tests.ReadOperationTest)  Time elapsed: 0.302 s
testMultipleLongRunningYieldingReads(org.eclipse.emf.transaction.multithread.tests.ReadOperationTest)  Time elapsed: 4.122 s
testLongRunningYieldingRead(org.eclipse.emf.transaction.multithread.tests.ReadOperationTest)  Time elapsed: 1.407 s
testReadOperation(org.eclipse.emf.transaction.multithread.tests.ReadOperationTest)  Time elapsed: 0.201 s
testNestedReads(org.eclipse.emf.transaction.multithread.tests.ReadOperationTest)  Time elapsed: 0.401 s
Running org.eclipse.emf.transaction.multithread.tests.AbstractMultithreadTest
java.lang.InterruptedException
	at org.eclipse.emf.transaction.util.Lock.uiSafeAcquire(Lock.java:420)
	at org.eclipse.emf.transaction.impl.TransactionalEditingDomainImpl.acquire(TransactionalEditingDomainImpl.java:575)
	at org.eclipse.emf.transaction.impl.TransactionalEditingDomainImpl.activate(TransactionalEditingDomainImpl.java:503)
	at org.eclipse.emf.transaction.impl.TransactionImpl.start(TransactionImpl.java:199)
	at org.eclipse.emf.transaction.impl.TransactionalCommandStackImpl.createTransaction(TransactionalCommandStackImpl.java:195)
	at org.eclipse.emf.transaction.impl.TransactionalCommandStackImpl.doExecute(TransactionalCommandStackImpl.java:54)
	at org.eclipse.emf.transaction.impl.AbstractTransactionalCommandStack.execute(AbstractTransactionalCommandStack.java:160)
	at org.eclipse.emf.transaction.multithread.tests.WriteThread.run(WriteThread.java:62)
	at org.eclipse.emf.transaction.multithread.tests.ReadWriteOperationTest.test_interruptionOfUIThread_149982(ReadWriteOperationTest.java:358)
	at java.base/jdk.internal.reflect.NativeMethodAccessorImpl.invoke0(Native Method)
	at java.base/jdk.internal.reflect.NativeMethodAccessorImpl.invoke(NativeMethodAccessorImpl.java:62)
	at java.base/jdk.internal.reflect.DelegatingMethodAccessorImpl.invoke(DelegatingMethodAccessorImpl.java:43)
	at java.base/java.lang.reflect.Method.invoke(Method.java:566)
	at junit.framework.TestCase.runTest(TestCase.java:177)
	at junit.framework.TestCase.runBare(TestCase.java:142)
	at junit.framework.TestResult$1.protect(TestResult.java:122)
	at junit.framework.TestResult.runProtected(TestResult.java:142)
	at junit.framework.TestResult.run(TestResult.java:125)
	at junit.framework.TestCase.run(TestCase.java:130)
	at junit.framework.TestSuite.runTest(TestSuite.java:241)
	at junit.framework.TestSuite.run(TestSuite.java:236)
	at junit.framework.TestSuite.runTest(TestSuite.java:241)
	at junit.framework.TestSuite.run(TestSuite.java:236)
	at org.junit.internal.runners.JUnit38ClassRunner.run(JUnit38ClassRunner.java:90)
	at org.apache.maven.surefire.junit4.JUnit4Provider.execute(JUnit4Provider.java:365)
	at org.apache.maven.surefire.junit4.JUnit4Provider.executeWithRerun(JUnit4Provider.java:273)
	at org.apache.maven.surefire.junit4.JUnit4Provider.executeTestSet(JUnit4Provider.java:238)
	at org.apache.maven.surefire.junit4.JUnit4Provider.invoke(JUnit4Provider.java:159)
	at java.base/jdk.internal.reflect.NativeMethodAccessorImpl.invoke0(Native Method)
	at java.base/jdk.internal.reflect.NativeMethodAccessorImpl.invoke(NativeMethodAccessorImpl.java:62)
	at java.base/jdk.internal.reflect.DelegatingMethodAccessorImpl.invoke(DelegatingMethodAccessorImpl.java:43)
	at java.base/java.lang.reflect.Method.invoke(Method.java:566)
	at org.apache.maven.surefire.util.ReflectionUtils.invokeMethodWithArray2(ReflectionUtils.java:206)
	at org.apache.maven.surefire.booter.ProviderFactory$ProviderProxy.invoke(ProviderFactory.java:161)
	at org.apache.maven.surefire.booter.ProviderFactory.invokeProvider(ProviderFactory.java:84)
	at org.eclipse.tycho.surefire.osgibooter.OsgiSurefireBooter.run(OsgiSurefireBooter.java:128)
	at org.eclipse.tycho.surefire.osgibooter.HeadlessTestApplication.start(HeadlessTestApplication.java:23)
	at org.eclipse.equinox.internal.app.EclipseAppHandle.run(EclipseAppHandle.java:203)
	at org.eclipse.core.runtime.internal.adaptor.EclipseAppLauncher.runApplication(EclipseAppLauncher.java:137)
	at org.eclipse.core.runtime.internal.adaptor.EclipseAppLauncher.start(EclipseAppLauncher.java:107)
	at org.eclipse.core.runtime.adaptor.EclipseStarter.run(EclipseStarter.java:401)
	at org.eclipse.core.runtime.adaptor.EclipseStarter.run(EclipseStarter.java:255)
	at java.base/jdk.internal.reflect.NativeMethodAccessorImpl.invoke0(Native Method)
	at java.base/jdk.internal.reflect.NativeMethodAccessorImpl.invoke(NativeMethodAccessorImpl.java:62)
	at java.base/jdk.internal.reflect.DelegatingMethodAccessorImpl.invoke(DelegatingMethodAccessorImpl.java:43)
	at java.base/java.lang.reflect.Method.invoke(Method.java:566)
	at org.eclipse.equinox.launcher.Main.invokeFramework(Main.java:657)
	at org.eclipse.equinox.launcher.Main.basicRun(Main.java:594)
	at org.eclipse.equinox.launcher.Main.run(Main.java:1447)
	at org.eclipse.equinox.launcher.Main.main(Main.java:1420)
Caused by: org.eclipse.core.runtime.OperationCanceledException
	at org.eclipse.core.internal.jobs.ThreadJob.waitForRun(ThreadJob.java:278)
	at org.eclipse.core.internal.jobs.ThreadJob.joinRun(ThreadJob.java:205)
	at org.eclipse.core.internal.jobs.ImplicitJobs.begin(ImplicitJobs.java:95)
	at org.eclipse.core.internal.jobs.JobManager.beginRule(JobManager.java:298)
	at org.eclipse.emf.transaction.util.Lock.uiSafeAcquire(Lock.java:355)
	... 49 more
Tests run: 13, Failures: 0, Errors: 0, Skipped: 0, Time elapsed: 10.409 s - in org.eclipse.emf.transaction.multithread.tests.AbstractMultithreadTest
testSimultaneousRead(org.eclipse.emf.transaction.multithread.tests.ReadOperationTest)  Time elapsed: 0.302 s
testMultipleLongRunningYieldingReads(org.eclipse.emf.transaction.multithread.tests.ReadOperationTest)  Time elapsed: 4.123 s
testLongRunningYieldingRead(org.eclipse.emf.transaction.multithread.tests.ReadOperationTest)  Time elapsed: 1.406 s
testReadOperation(org.eclipse.emf.transaction.multithread.tests.ReadOperationTest)  Time elapsed: 0.202 s
testNestedReads(org.eclipse.emf.transaction.multithread.tests.ReadOperationTest)  Time elapsed: 0.401 s
testWriteOperation(org.eclipse.emf.transaction.multithread.tests.WriteOperationTest)  Time elapsed: 0.201 s
testSimultaneousWrites(org.eclipse.emf.transaction.multithread.tests.WriteOperationTest)  Time elapsed: 0.302 s
testNestedWrites(org.eclipse.emf.transaction.multithread.tests.WriteOperationTest)  Time elapsed: 0.401 s
testComplexSimultaneousReadsWrites(org.eclipse.emf.transaction.multithread.tests.ReadWriteOperationTest)  Time elapsed: 0.503 s
testNestedReadInWrite(org.eclipse.emf.transaction.multithread.tests.ReadWriteOperationTest)  Time elapsed: 0.301 s
testSimultaneousReadsWrites(org.eclipse.emf.transaction.multithread.tests.ReadWriteOperationTest)  Time elapsed: 0.503 s
testLongRunningReadWithWrites(org.eclipse.emf.transaction.multithread.tests.ReadWriteOperationTest)  Time elapsed: 1.508 s
test_interruptionOfUIThread_149982(org.eclipse.emf.transaction.multithread.tests.ReadWriteOperationTest)  Time elapsed: 0.254 s
Running org.eclipse.emf.transaction.multithread.tests.WriteOperationTest
Tests run: 3, Failures: 0, Errors: 0, Skipped: 0, Time elapsed: 0.906 s - in org.eclipse.emf.transaction.multithread.tests.WriteOperationTest
testWriteOperation(org.eclipse.emf.transaction.multithread.tests.WriteOperationTest)  Time elapsed: 0.201 s
testSimultaneousWrites(org.eclipse.emf.transaction.multithread.tests.WriteOperationTest)  Time elapsed: 0.303 s
testNestedWrites(org.eclipse.emf.transaction.multithread.tests.WriteOperationTest)  Time elapsed: 0.402 s
Running org.eclipse.emf.transaction.multithread.tests.ReadWriteOperationTest
java.lang.InterruptedException
	at org.eclipse.emf.transaction.util.Lock.uiSafeAcquire(Lock.java:420)
	at org.eclipse.emf.transaction.impl.TransactionalEditingDomainImpl.acquire(TransactionalEditingDomainImpl.java:575)
	at org.eclipse.emf.transaction.impl.TransactionalEditingDomainImpl.activate(TransactionalEditingDomainImpl.java:503)
	at org.eclipse.emf.transaction.impl.TransactionImpl.start(TransactionImpl.java:199)
	at org.eclipse.emf.transaction.impl.TransactionalCommandStackImpl.createTransaction(TransactionalCommandStackImpl.java:195)
	at org.eclipse.emf.transaction.impl.TransactionalCommandStackImpl.doExecute(TransactionalCommandStackImpl.java:54)
	at org.eclipse.emf.transaction.impl.AbstractTransactionalCommandStack.execute(AbstractTransactionalCommandStack.java:160)
	at org.eclipse.emf.transaction.multithread.tests.WriteThread.run(WriteThread.java:62)
	at org.eclipse.emf.transaction.multithread.tests.ReadWriteOperationTest.test_interruptionOfUIThread_149982(ReadWriteOperationTest.java:358)
	at java.base/jdk.internal.reflect.NativeMethodAccessorImpl.invoke0(Native Method)
	at java.base/jdk.internal.reflect.NativeMethodAccessorImpl.invoke(NativeMethodAccessorImpl.java:62)
	at java.base/jdk.internal.reflect.DelegatingMethodAccessorImpl.invoke(DelegatingMethodAccessorImpl.java:43)
	at java.base/java.lang.reflect.Method.invoke(Method.java:566)
	at junit.framework.TestCase.runTest(TestCase.java:177)
	at junit.framework.TestCase.runBare(TestCase.java:142)
	at junit.framework.TestResult$1.protect(TestResult.java:122)
	at junit.framework.TestResult.runProtected(TestResult.java:142)
	at junit.framework.TestResult.run(TestResult.java:125)
	at junit.framework.TestCase.run(TestCase.java:130)
	at junit.framework.TestSuite.runTest(TestSuite.java:241)
	at junit.framework.TestSuite.run(TestSuite.java:236)
	at org.junit.internal.runners.JUnit38ClassRunner.run(JUnit38ClassRunner.java:90)
	at org.apache.maven.surefire.junit4.JUnit4Provider.execute(JUnit4Provider.java:365)
	at org.apache.maven.surefire.junit4.JUnit4Provider.executeWithRerun(JUnit4Provider.java:273)
	at org.apache.maven.surefire.junit4.JUnit4Provider.executeTestSet(JUnit4Provider.java:238)
	at org.apache.maven.surefire.junit4.JUnit4Provider.invoke(JUnit4Provider.java:159)
	at java.base/jdk.internal.reflect.NativeMethodAccessorImpl.invoke0(Native Method)
	at java.base/jdk.internal.reflect.NativeMethodAccessorImpl.invoke(NativeMethodAccessorImpl.java:62)
	at java.base/jdk.internal.reflect.DelegatingMethodAccessorImpl.invoke(DelegatingMethodAccessorImpl.java:43)
	at java.base/java.lang.reflect.Method.invoke(Method.java:566)
	at org.apache.maven.surefire.util.ReflectionUtils.invokeMethodWithArray2(ReflectionUtils.java:206)
	at org.apache.maven.surefire.booter.ProviderFactory$ProviderProxy.invoke(ProviderFactory.java:161)
	at org.apache.maven.surefire.booter.ProviderFactory.invokeProvider(ProviderFactory.java:84)
	at org.eclipse.tycho.surefire.osgibooter.OsgiSurefireBooter.run(OsgiSurefireBooter.java:128)
	at org.eclipse.tycho.surefire.osgibooter.HeadlessTestApplication.start(HeadlessTestApplication.java:23)
	at org.eclipse.equinox.internal.app.EclipseAppHandle.run(EclipseAppHandle.java:203)
	at org.eclipse.core.runtime.internal.adaptor.EclipseAppLauncher.runApplication(EclipseAppLauncher.java:137)
	at org.eclipse.core.runtime.internal.adaptor.EclipseAppLauncher.start(EclipseAppLauncher.java:107)
	at org.eclipse.core.runtime.adaptor.EclipseStarter.run(EclipseStarter.java:401)
	at org.eclipse.core.runtime.adaptor.EclipseStarter.run(EclipseStarter.java:255)
	at java.base/jdk.internal.reflect.NativeMethodAccessorImpl.invoke0(Native Method)
	at java.base/jdk.internal.reflect.NativeMethodAccessorImpl.invoke(NativeMethodAccessorImpl.java:62)
	at java.base/jdk.internal.reflect.DelegatingMethodAccessorImpl.invoke(DelegatingMethodAccessorImpl.java:43)
	at java.base/java.lang.reflect.Method.invoke(Method.java:566)
	at org.eclipse.equinox.launcher.Main.invokeFramework(Main.java:657)
	at org.eclipse.equinox.launcher.Main.basicRun(Main.java:594)
	at org.eclipse.equinox.launcher.Main.run(Main.java:1447)
	at org.eclipse.equinox.launcher.Main.main(Main.java:1420)
Caused by: org.eclipse.core.runtime.OperationCanceledException
	at org.eclipse.core.internal.jobs.ThreadJob.waitForRun(ThreadJob.java:278)
	at org.eclipse.core.internal.jobs.ThreadJob.joinRun(ThreadJob.java:205)
	at org.eclipse.core.internal.jobs.ImplicitJobs.begin(ImplicitJobs.java:95)
	at org.eclipse.core.internal.jobs.JobManager.beginRule(JobManager.java:298)
	at org.eclipse.emf.transaction.util.Lock.uiSafeAcquire(Lock.java:355)
	... 47 more
Tests run: 5, Failures: 0, Errors: 0, Skipped: 0, Time elapsed: 3.074 s - in org.eclipse.emf.transaction.multithread.tests.ReadWriteOperationTest
testComplexSimultaneousReadsWrites(org.eclipse.emf.transaction.multithread.tests.ReadWriteOperationTest)  Time elapsed: 0.508 s
testNestedReadInWrite(org.eclipse.emf.transaction.multithread.tests.ReadWriteOperationTest)  Time elapsed: 0.301 s
testSimultaneousReadsWrites(org.eclipse.emf.transaction.multithread.tests.ReadWriteOperationTest)  Time elapsed: 0.504 s
testLongRunningReadWithWrites(org.eclipse.emf.transaction.multithread.tests.ReadWriteOperationTest)  Time elapsed: 1.507 s
test_interruptionOfUIThread_149982(org.eclipse.emf.transaction.multithread.tests.ReadWriteOperationTest)  Time elapsed: 0.254 s

Results:

Failures: 
org.eclipse.emf.transaction.tests.EditingDomainValidatorTest.test_createValidators_177643(org.eclipse.emf.transaction.tests.EditingDomainValidatorTest)
  Run 1: PASS
  Run 2: EditingDomainValidatorTest.test_createValidators_177643:62 expected:<1> but was:<2>


Tests run: 447, Failures: 1, Errors: 0, Skipped: 0

[ERROR] There are test failures.

Please refer to /home/jenkins/agent/workspace/emf-transaction-master/PLATFORM/2020-06/jdk/openjdk-jdk11-latest/label/migration/org.eclipse.emf.transaction.tests/target/surefire-reports for the individual test results.
[INFO] 
[INFO] --- eclipse-jarsigner-plugin:1.3.2:sign (sign) @ org.eclipse.emf.transaction.tests ---
[INFO] Signing jar: /home/jenkins/agent/workspace/emf-transaction-master/PLATFORM/2020-06/jdk/openjdk-jdk11-latest/label/migration/org.eclipse.emf.transaction.tests/target/org.eclipse.emf.transaction.tests-1.10.1-SNAPSHOT.jar
[INFO] Signing jar: /home/jenkins/agent/workspace/emf-transaction-master/PLATFORM/2020-06/jdk/openjdk-jdk11-latest/label/migration/org.eclipse.emf.transaction.tests/target/org.eclipse.emf.transaction.tests-1.10.1-SNAPSHOT-sources.jar
[INFO] 
[INFO] --< org.eclipse.emf.transaction.plugins:org.eclipse.emf.workspace.tests >--
[INFO] Building org.eclipse.emf.workspace.tests 1.10.0-SNAPSHOT         [13/27]
[INFO] ------------------------[ eclipse-test-plugin ]-------------------------
[INFO] 
[INFO] --- maven-clean-plugin:2.5:clean (default-clean) @ org.eclipse.emf.workspace.tests ---
[INFO] 
[INFO] --- tycho-packaging-plugin:2.5.0:build-qualifier (default-build-qualifier) @ org.eclipse.emf.workspace.tests ---
[INFO] The project's OSGi version is 1.10.0.202206220708
[INFO] 
[INFO] --- tycho-packaging-plugin:2.5.0:validate-id (default-validate-id) @ org.eclipse.emf.workspace.tests ---
[INFO] 
[INFO] --- tycho-packaging-plugin:2.5.0:validate-version (default-validate-version) @ org.eclipse.emf.workspace.tests ---
[INFO] 
[INFO] --- target-platform-configuration:2.5.0:target-platform (default-target-platform) @ org.eclipse.emf.workspace.tests ---
[INFO] 
[INFO] --- maven-antrun-plugin:3.0.0:run (replace-build-token) @ org.eclipse.emf.workspace.tests ---
[INFO] Executing tasks
[INFO] Executed tasks
[INFO] 
[INFO] --- maven-resources-plugin:2.4.3:resources (default-resources) @ org.eclipse.emf.workspace.tests ---
[INFO] Using 'UTF-8' encoding to copy filtered resources.
[INFO] skip non existing resourceDirectory /home/jenkins/agent/workspace/emf-transaction-master/PLATFORM/2020-06/jdk/openjdk-jdk11-latest/label/migration/org.eclipse.emf.workspace.tests/src/main/resources
[INFO] 
[INFO] --- tycho-compiler-plugin:2.5.0:compile (default-compile) @ org.eclipse.emf.workspace.tests ---
[INFO] Compiling 34 source files to /home/jenkins/agent/workspace/emf-transaction-master/PLATFORM/2020-06/jdk/openjdk-jdk11-latest/label/migration/org.eclipse.emf.workspace.tests/target/classes
[INFO] 
[INFO] --- maven-resources-plugin:2.4.3:testResources (default-testResources) @ org.eclipse.emf.workspace.tests ---
[INFO] Using 'UTF-8' encoding to copy filtered resources.
[INFO] skip non existing resourceDirectory /home/jenkins/agent/workspace/emf-transaction-master/PLATFORM/2020-06/jdk/openjdk-jdk11-latest/label/migration/org.eclipse.emf.workspace.tests/src/test/resources
[INFO] 
[INFO] --- tycho-source-plugin:2.5.0:plugin-source (plugin-source) @ org.eclipse.emf.workspace.tests ---
[INFO] Building jar: /home/jenkins/agent/workspace/emf-transaction-master/PLATFORM/2020-06/jdk/openjdk-jdk11-latest/label/migration/org.eclipse.emf.workspace.tests/target/org.eclipse.emf.workspace.tests-1.10.0-SNAPSHOT-sources.jar
[INFO] 
[INFO] --- tycho-packaging-plugin:2.5.0:package-plugin (default-package-plugin) @ org.eclipse.emf.workspace.tests ---
[INFO] Building jar: /home/jenkins/agent/workspace/emf-transaction-master/PLATFORM/2020-06/jdk/openjdk-jdk11-latest/label/migration/org.eclipse.emf.workspace.tests/target/org.eclipse.emf.workspace.tests-1.10.0-SNAPSHOT.jar
[INFO] 
[INFO] --- tycho-p2-plugin:2.5.0:p2-metadata-default (default-p2-metadata-default) @ org.eclipse.emf.workspace.tests ---
[INFO] 
[INFO] --- tycho-surefire-plugin:2.5.0:test (default-test) @ org.eclipse.emf.workspace.tests ---
[INFO] Executing Test Runtime with timeout 0, logs (if any) will be placed at: /home/jenkins/agent/workspace/emf-transaction-master/PLATFORM/2020-06/jdk/openjdk-jdk11-latest/label/migration/org.eclipse.emf.workspace.tests/target/work/data/.metadata/.log
[INFO] Command line:
	[/opt/tools/java/openjdk/jdk-11/11.0.2+9/bin/java, -Dosgi.noShutdown=false, -Dosgi.os=linux, -Dosgi.ws=gtk, -Dosgi.arch=x86_64, -Dosgi.clean=true, -jar, /home/jenkins/agent/workspace/emf-transaction-master/PLATFORM/2020-06/jdk/openjdk-jdk11-latest/label/migration/.repository/p2/osgi/bundle/org.eclipse.equinox.launcher/1.5.700.v20200207-2156/org.eclipse.equinox.launcher-1.5.700.v20200207-2156.jar, -data, /home/jenkins/agent/workspace/emf-transaction-master/PLATFORM/2020-06/jdk/openjdk-jdk11-latest/label/migration/org.eclipse.emf.workspace.tests/target/work/data, -install, /home/jenkins/agent/workspace/emf-transaction-master/PLATFORM/2020-06/jdk/openjdk-jdk11-latest/label/migration/org.eclipse.emf.workspace.tests/target/work, -configuration, /home/jenkins/agent/workspace/emf-transaction-master/PLATFORM/2020-06/jdk/openjdk-jdk11-latest/label/migration/org.eclipse.emf.workspace.tests/target/work/configuration, -application, org.eclipse.tycho.surefire.osgibooter.headlesstest, -testproperties, /home/jenkins/agent/workspace/emf-transaction-master/PLATFORM/2020-06/jdk/openjdk-jdk11-latest/label/migration/org.eclipse.emf.workspace.tests/target/surefire.properties]
Running org.eclipse.emf.workspace.tests.MemoryLeakTest
Tests run: 8, Failures: 0, Errors: 0, Skipped: 0, Time elapsed: 0.779 s - in org.eclipse.emf.workspace.tests.MemoryLeakTest
test_crossReferenceAdapter_undoredo_operations(org.eclipse.emf.workspace.tests.MemoryLeakTest)  Time elapsed: 0.416 s
test_crossReferenceAdapter_undoredo_recordingTriggerCommands(org.eclipse.emf.workspace.tests.MemoryLeakTest)  Time elapsed: 0.04 s
test_crossReferenceAdapter_undoredo_operationTriggerOperations(org.eclipse.emf.workspace.tests.MemoryLeakTest)  Time elapsed: 0.018 s
test_crossReferenceAdapter_undoredo_normalTriggerCommands(org.eclipse.emf.workspace.tests.MemoryLeakTest)  Time elapsed: 0.016 s
test_crossReferenceAdapter_undoredo_recordingCommands(org.eclipse.emf.workspace.tests.MemoryLeakTest)  Time elapsed: 0.016 s
test_crossReferenceAdapter_undoredo_operationTriggerCommands(org.eclipse.emf.workspace.tests.MemoryLeakTest)  Time elapsed: 0.043 s
test_crossReferenceAdapter_undoredo_normalCommands(org.eclipse.emf.workspace.tests.MemoryLeakTest)  Time elapsed: 0.014 s
test_DoNothing(org.eclipse.emf.workspace.tests.MemoryLeakTest)  Time elapsed: 0.011 s
Running org.eclipse.emf.workspace.tests.EMFOperationCommandTest
Got expected exception: Uncaught exception during pre-commit trigger processing
Got expected exception: Undo of operation was rolled back (possibly due to concurrent write)
Got expected exception: Uncaught exception during pre-commit trigger processing
Got expected exception: Uncaught exception during pre-commit trigger processing
Got expected exception: Redo of operation was rolled back (possibly due to concurrent write)
Tests run: 12, Failures: 0, Errors: 0, Skipped: 0, Time elapsed: 0.259 s - in org.eclipse.emf.workspace.tests.EMFOperationCommandTest
test_multipleDisposableOperation_209491(org.eclipse.emf.workspace.tests.EMFOperationCommandTest)  Time elapsed: 0.015 s
test_operationTriggerErrorStatus_234868(org.eclipse.emf.workspace.tests.EMFOperationCommandTest)  Time elapsed: 0.021 s
test_execute_undo_redo_trigger_recordingCommand(org.eclipse.emf.workspace.tests.EMFOperationCommandTest)  Time elapsed: 0.062 s
test_operationTriggerErrorStatus_nonEMF_undo_234868(org.eclipse.emf.workspace.tests.EMFOperationCommandTest)  Time elapsed: 0.015 s
test_rollback_trigger(org.eclipse.emf.workspace.tests.EMFOperationCommandTest)  Time elapsed: 0.018 s
test_nonredoableOperation_138287(org.eclipse.emf.workspace.tests.EMFOperationCommandTest)  Time elapsed: 0.011 s
test_operationTriggerErrorStatus_nonEMF_234868(org.eclipse.emf.workspace.tests.EMFOperationCommandTest)  Time elapsed: 0.013 s
test_execute_undo_redo(org.eclipse.emf.workspace.tests.EMFOperationCommandTest)  Time elapsed: 0.051 s
test_execute_undo_redo_trigger(org.eclipse.emf.workspace.tests.EMFOperationCommandTest)  Time elapsed: 0.011 s
test_operationTriggerFails_234868(org.eclipse.emf.workspace.tests.EMFOperationCommandTest)  Time elapsed: 0.013 s
test_operationTriggerErrorStatus_nonEMF_redo_234868(org.eclipse.emf.workspace.tests.EMFOperationCommandTest)  Time elapsed: 0.013 s
test_DoNothing(org.eclipse.emf.workspace.tests.EMFOperationCommandTest)  Time elapsed: 0.01 s
Running org.eclipse.emf.workspace.tests.UndoContextTest
Tests run: 3, Failures: 0, Errors: 0, Skipped: 0, Time elapsed: 0.031 s - in org.eclipse.emf.workspace.tests.UndoContextTest
test_localChanges(org.eclipse.emf.workspace.tests.UndoContextTest)  Time elapsed: 0.011 s
test_remoteChanges(org.eclipse.emf.workspace.tests.UndoContextTest)  Time elapsed: 0.01 s
test_DoNothing(org.eclipse.emf.workspace.tests.UndoContextTest)  Time elapsed: 0.008 s
Running org.eclipse.emf.workspace.tests.CompositeEMFOperationTest
Tests run: 26, Failures: 0, Errors: 0, Skipped: 0, Time elapsed: 0.413 s - in org.eclipse.emf.workspace.tests.CompositeEMFOperationTest
test_triggerCommands_aggregate(org.eclipse.emf.workspace.tests.CompositeEMFOperationTest)  Time elapsed: 0.018 s
test_contexts(org.eclipse.emf.workspace.tests.CompositeEMFOperationTest)  Time elapsed: 0.046 s
test_execute_cancel_123614(org.eclipse.emf.workspace.tests.CompositeEMFOperationTest)  Time elapsed: 0.011 s
test_noTransactionNesting_mixed_135545(org.eclipse.emf.workspace.tests.CompositeEMFOperationTest)  Time elapsed: 0.013 s
test_validation(org.eclipse.emf.workspace.tests.CompositeEMFOperationTest)  Time elapsed: 0.011 s
test_errorInNestedAEO_transactionNesting_250253(org.eclipse.emf.workspace.tests.CompositeEMFOperationTest)  Time elapsed: 0.012 s
test_redo_cancelMonitor_123614(org.eclipse.emf.workspace.tests.CompositeEMFOperationTest)  Time elapsed: 0.009 s
test_redo_cancel_123614(org.eclipse.emf.workspace.tests.CompositeEMFOperationTest)  Time elapsed: 0.043 s
test_canRedo(org.eclipse.emf.workspace.tests.CompositeEMFOperationTest)  Time elapsed: 0.016 s
test_canUndo(org.eclipse.emf.workspace.tests.CompositeEMFOperationTest)  Time elapsed: 0.01 s
test_execute_error_123614(org.eclipse.emf.workspace.tests.CompositeEMFOperationTest)  Time elapsed: 0.009 s
test_undo_cancel_123614(org.eclipse.emf.workspace.tests.CompositeEMFOperationTest)  Time elapsed: 0.009 s
test_noTransactionNesting_pureEMF_135545(org.eclipse.emf.workspace.tests.CompositeEMFOperationTest)  Time elapsed: 0.011 s
test_noTransactionNesting_differentOptions_135545(org.eclipse.emf.workspace.tests.CompositeEMFOperationTest)  Time elapsed: 0.044 s
test_execute_cancelMonitor_123614(org.eclipse.emf.workspace.tests.CompositeEMFOperationTest)  Time elapsed: 0.008 s
test_triggerCommands(org.eclipse.emf.workspace.tests.CompositeEMFOperationTest)  Time elapsed: 0.013 s
test_canExecute(org.eclipse.emf.workspace.tests.CompositeEMFOperationTest)  Time elapsed: 0.009 s
test_undo_error_123614(org.eclipse.emf.workspace.tests.CompositeEMFOperationTest)  Time elapsed: 0.008 s
test_undo_cancelMonitor_123614(org.eclipse.emf.workspace.tests.CompositeEMFOperationTest)  Time elapsed: 0.008 s
test_errorInNestedAEO_noTransactionNesting_250253(org.eclipse.emf.workspace.tests.CompositeEMFOperationTest)  Time elapsed: 0.01 s
test_rollback_nested(org.eclipse.emf.workspace.tests.CompositeEMFOperationTest)  Time elapsed: 0.044 s
test_contexts_listIterator_125151(org.eclipse.emf.workspace.tests.CompositeEMFOperationTest)  Time elapsed: 0.007 s
test_execute_undo_redo(org.eclipse.emf.workspace.tests.CompositeEMFOperationTest)  Time elapsed: 0.012 s
test_redo_error_123614(org.eclipse.emf.workspace.tests.CompositeEMFOperationTest)  Time elapsed: 0.008 s
test_execute_undo_redo_nested(org.eclipse.emf.workspace.tests.CompositeEMFOperationTest)  Time elapsed: 0.009 s
test_DoNothing(org.eclipse.emf.workspace.tests.CompositeEMFOperationTest)  Time elapsed: 0.007 s
Running org.eclipse.emf.workspace.tests.AbstractTest
Tests run: 1, Failures: 0, Errors: 0, Skipped: 0, Time elapsed: 0.008 s - in org.eclipse.emf.workspace.tests.AbstractTest
test_DoNothing(org.eclipse.emf.workspace.tests.AbstractTest)  Time elapsed: 0.007 s
Running org.eclipse.emf.workspace.tests.AbstractEMFOperationTest
Got expected exception: operation has been executed
Got expected exception: operation has been executed
Got expected exception: operation has been executed
Tests run: 15, Failures: 0, Errors: 0, Skipped: 0, Time elapsed: 0.209 s - in org.eclipse.emf.workspace.tests.AbstractEMFOperationTest
test_triggerCommands_cascading(org.eclipse.emf.workspace.tests.AbstractEMFOperationTest)  Time elapsed: 0.013 s
test_options_124741(org.eclipse.emf.workspace.tests.AbstractEMFOperationTest)  Time elapsed: 0.009 s
test_validation(org.eclipse.emf.workspace.tests.AbstractEMFOperationTest)  Time elapsed: 0.008 s
test_inheritValidateEditOption_247691(org.eclipse.emf.workspace.tests.AbstractEMFOperationTest)  Time elapsed: 0.008 s
test_rollbackNestingTransactionOnException_135673(org.eclipse.emf.workspace.tests.AbstractEMFOperationTest)  Time elapsed: 0.007 s
test_undoWithRecordingCommandTrigger_218276(org.eclipse.emf.workspace.tests.AbstractEMFOperationTest)  Time elapsed: 0.008 s
test_executeInActiveTransaction_245393(org.eclipse.emf.workspace.tests.AbstractEMFOperationTest)  Time elapsed: 0.007 s
test_setOptions_245419(org.eclipse.emf.workspace.tests.AbstractEMFOperationTest)  Time elapsed: 0.044 s
test_nullProgressMonitors_bug150033(org.eclipse.emf.workspace.tests.AbstractEMFOperationTest)  Time elapsed: 0.009 s
test_triggerCommands(org.eclipse.emf.workspace.tests.AbstractEMFOperationTest)  Time elapsed: 0.009 s
test_triggerCommands_nonEMF(org.eclipse.emf.workspace.tests.AbstractEMFOperationTest)  Time elapsed: 0.009 s
test_rollbackOnError_250253(org.eclipse.emf.workspace.tests.AbstractEMFOperationTest)  Time elapsed: 0.008 s
test_execute_undo_redo(org.eclipse.emf.workspace.tests.AbstractEMFOperationTest)  Time elapsed: 0.013 s
test_undoRedoNonEMFOperationWithEMFChanges_155268(org.eclipse.emf.workspace.tests.AbstractEMFOperationTest)  Time elapsed: 0.045 s
test_DoNothing(org.eclipse.emf.workspace.tests.AbstractEMFOperationTest)  Time elapsed: 0.007 s
Running org.eclipse.emf.workspace.tests.AllTests
Got expected exception: operation has been executed
Got expected exception: operation has been executed
Got expected exception: operation has been executed
Got expected exception: Uncaught exception during pre-commit trigger processing
Got expected exception: Undo of operation was rolled back (possibly due to concurrent write)
Got expected exception: Uncaught exception during pre-commit trigger processing
Got expected exception: Uncaught exception during pre-commit trigger processing
Got expected exception: Redo of operation was rolled back (possibly due to concurrent write)
Tests run: 140, Failures: 0, Errors: 0, Skipped: 0, Time elapsed: 2.537 s - in org.eclipse.emf.workspace.tests.AllTests
test_read_readWriteTransaction(org.eclipse.emf.workspace.tests.BasicWorkbenchTest)  Time elapsed: 0.008 s
test_resourceContentsChanges_write(org.eclipse.emf.workspace.tests.BasicWorkbenchTest)  Time elapsed: 0.007 s
test_read(org.eclipse.emf.workspace.tests.BasicWorkbenchTest)  Time elapsed: 0.008 s
test_newResourceContentsChanges_write(org.eclipse.emf.workspace.tests.BasicWorkbenchTest)  Time elapsed: 0.01 s
test_write_readOnlytransaction(org.eclipse.emf.workspace.tests.BasicWorkbenchTest)  Time elapsed: 0.04 s
test_loadUnloadDuringRead(org.eclipse.emf.workspace.tests.BasicWorkbenchTest)  Time elapsed: 0.011 s
test_newResourceContentsChanges_read(org.eclipse.emf.workspace.tests.BasicWorkbenchTest)  Time elapsed: 0.008 s
test_write_wrongThread(org.eclipse.emf.workspace.tests.BasicWorkbenchTest)  Time elapsed: 0.01 s
test_write_command(org.eclipse.emf.workspace.tests.BasicWorkbenchTest)  Time elapsed: 0.009 s
test_resourceContentsChanges_read(org.eclipse.emf.workspace.tests.BasicWorkbenchTest)  Time elapsed: 0.009 s
test_read_exclusive(org.eclipse.emf.workspace.tests.BasicWorkbenchTest)  Time elapsed: 0.007 s
test_write_readWritetransaction(org.eclipse.emf.workspace.tests.BasicWorkbenchTest)  Time elapsed: 0.04 s
test_read_readOnlyTransaction(org.eclipse.emf.workspace.tests.BasicWorkbenchTest)  Time elapsed: 0.006 s
test_write(org.eclipse.emf.workspace.tests.BasicWorkbenchTest)  Time elapsed: 0.008 s
test_DoNothing(org.eclipse.emf.workspace.tests.BasicWorkbenchTest)  Time elapsed: 0.007 s
test_triggerCommands_cascading(org.eclipse.emf.workspace.tests.AbstractEMFOperationTest)  Time elapsed: 0.008 s
test_options_124741(org.eclipse.emf.workspace.tests.AbstractEMFOperationTest)  Time elapsed: 0.007 s
test_validation(org.eclipse.emf.workspace.tests.AbstractEMFOperationTest)  Time elapsed: 0.006 s
test_inheritValidateEditOption_247691(org.eclipse.emf.workspace.tests.AbstractEMFOperationTest)  Time elapsed: 0.006 s
test_rollbackNestingTransactionOnException_135673(org.eclipse.emf.workspace.tests.AbstractEMFOperationTest)  Time elapsed: 0.007 s
test_undoWithRecordingCommandTrigger_218276(org.eclipse.emf.workspace.tests.AbstractEMFOperationTest)  Time elapsed: 0.008 s
test_executeInActiveTransaction_245393(org.eclipse.emf.workspace.tests.AbstractEMFOperationTest)  Time elapsed: 0.04 s
test_setOptions_245419(org.eclipse.emf.workspace.tests.AbstractEMFOperationTest)  Time elapsed: 0.007 s
test_nullProgressMonitors_bug150033(org.eclipse.emf.workspace.tests.AbstractEMFOperationTest)  Time elapsed: 0.007 s
test_triggerCommands(org.eclipse.emf.workspace.tests.AbstractEMFOperationTest)  Time elapsed: 0.008 s
test_triggerCommands_nonEMF(org.eclipse.emf.workspace.tests.AbstractEMFOperationTest)  Time elapsed: 0.007 s
test_rollbackOnError_250253(org.eclipse.emf.workspace.tests.AbstractEMFOperationTest)  Time elapsed: 0.007 s
test_execute_undo_redo(org.eclipse.emf.workspace.tests.AbstractEMFOperationTest)  Time elapsed: 0.011 s
test_undoRedoNonEMFOperationWithEMFChanges_155268(org.eclipse.emf.workspace.tests.AbstractEMFOperationTest)  Time elapsed: 0.053 s
test_DoNothing(org.eclipse.emf.workspace.tests.AbstractEMFOperationTest)  Time elapsed: 0.007 s
test_triggerCommands_cascading(org.eclipse.emf.workspace.tests.EMFCommandOperationTest)  Time elapsed: 0.009 s
test_validation(org.eclipse.emf.workspace.tests.EMFCommandOperationTest)  Time elapsed: 0.007 s
test_RecordingCommand_triggerCommands(org.eclipse.emf.workspace.tests.EMFCommandOperationTest)  Time elapsed: 0.009 s
test_undoRecordingCommandWithRecordingCommandTrigger_218276(org.eclipse.emf.workspace.tests.EMFCommandOperationTest)  Time elapsed: 0.009 s
test_nonredoableCommand_138287(org.eclipse.emf.workspace.tests.EMFCommandOperationTest)  Time elapsed: 0.059 s
test_nonredoableTriggerCommand_138287(org.eclipse.emf.workspace.tests.EMFCommandOperationTest)  Time elapsed: 0.01 s
test_undoNestedRecordingCommandWithRecordingCommandTrigger_218276(org.eclipse.emf.workspace.tests.EMFCommandOperationTest)  Time elapsed: 0.01 s
test_triggerCommands(org.eclipse.emf.workspace.tests.EMFCommandOperationTest)  Time elapsed: 0.007 s
test_RecordingCommand_execute_undo_redo(org.eclipse.emf.workspace.tests.EMFCommandOperationTest)  Time elapsed: 0.008 s
test_execute_undo_redo(org.eclipse.emf.workspace.tests.EMFCommandOperationTest)  Time elapsed: 0.007 s
test_DoNothing(org.eclipse.emf.workspace.tests.EMFCommandOperationTest)  Time elapsed: 0.006 s
test_triggerCommands_aggregate(org.eclipse.emf.workspace.tests.CompositeEMFOperationTest)  Time elapsed: 0.008 s
test_contexts(org.eclipse.emf.workspace.tests.CompositeEMFOperationTest)  Time elapsed: 0.042 s
test_execute_cancel_123614(org.eclipse.emf.workspace.tests.CompositeEMFOperationTest)  Time elapsed: 0.006 s
test_noTransactionNesting_mixed_135545(org.eclipse.emf.workspace.tests.CompositeEMFOperationTest)  Time elapsed: 0.007 s
test_validation(org.eclipse.emf.workspace.tests.CompositeEMFOperationTest)  Time elapsed: 0.007 s
test_errorInNestedAEO_transactionNesting_250253(org.eclipse.emf.workspace.tests.CompositeEMFOperationTest)  Time elapsed: 0.006 s
test_redo_cancelMonitor_123614(org.eclipse.emf.workspace.tests.CompositeEMFOperationTest)  Time elapsed: 0.007 s
test_redo_cancel_123614(org.eclipse.emf.workspace.tests.CompositeEMFOperationTest)  Time elapsed: 0.006 s
test_canRedo(org.eclipse.emf.workspace.tests.CompositeEMFOperationTest)  Time elapsed: 0.006 s
test_canUndo(org.eclipse.emf.workspace.tests.CompositeEMFOperationTest)  Time elapsed: 0.006 s
test_execute_error_123614(org.eclipse.emf.workspace.tests.CompositeEMFOperationTest)  Time elapsed: 0.006 s
test_undo_cancel_123614(org.eclipse.emf.workspace.tests.CompositeEMFOperationTest)  Time elapsed: 0.046 s
test_noTransactionNesting_pureEMF_135545(org.eclipse.emf.workspace.tests.CompositeEMFOperationTest)  Time elapsed: 0.006 s
test_noTransactionNesting_differentOptions_135545(org.eclipse.emf.workspace.tests.CompositeEMFOperationTest)  Time elapsed: 0.007 s
test_execute_cancelMonitor_123614(org.eclipse.emf.workspace.tests.CompositeEMFOperationTest)  Time elapsed: 0.006 s
test_triggerCommands(org.eclipse.emf.workspace.tests.CompositeEMFOperationTest)  Time elapsed: 0.008 s
test_canExecute(org.eclipse.emf.workspace.tests.CompositeEMFOperationTest)  Time elapsed: 0.005 s
test_undo_error_123614(org.eclipse.emf.workspace.tests.CompositeEMFOperationTest)  Time elapsed: 0.006 s
test_undo_cancelMonitor_123614(org.eclipse.emf.workspace.tests.CompositeEMFOperationTest)  Time elapsed: 0.006 s
test_errorInNestedAEO_noTransactionNesting_250253(org.eclipse.emf.workspace.tests.CompositeEMFOperationTest)  Time elapsed: 0.006 s
test_rollback_nested(org.eclipse.emf.workspace.tests.CompositeEMFOperationTest)  Time elapsed: 0.007 s
test_contexts_listIterator_125151(org.eclipse.emf.workspace.tests.CompositeEMFOperationTest)  Time elapsed: 0.041 s
test_execute_undo_redo(org.eclipse.emf.workspace.tests.CompositeEMFOperationTest)  Time elapsed: 0.007 s
test_redo_error_123614(org.eclipse.emf.workspace.tests.CompositeEMFOperationTest)  Time elapsed: 0.006 s
test_execute_undo_redo_nested(org.eclipse.emf.workspace.tests.CompositeEMFOperationTest)  Time elapsed: 0.006 s
test_DoNothing(org.eclipse.emf.workspace.tests.CompositeEMFOperationTest)  Time elapsed: 0.006 s
test_multipleDisposableOperation_209491(org.eclipse.emf.workspace.tests.EMFOperationCommandTest)  Time elapsed: 0.006 s
test_operationTriggerErrorStatus_234868(org.eclipse.emf.workspace.tests.EMFOperationCommandTest)  Time elapsed: 0.006 s
test_execute_undo_redo_trigger_recordingCommand(org.eclipse.emf.workspace.tests.EMFOperationCommandTest)  Time elapsed: 0.006 s
test_operationTriggerErrorStatus_nonEMF_undo_234868(org.eclipse.emf.workspace.tests.EMFOperationCommandTest)  Time elapsed: 0.007 s
test_rollback_trigger(org.eclipse.emf.workspace.tests.EMFOperationCommandTest)  Time elapsed: 0.006 s
test_nonredoableOperation_138287(org.eclipse.emf.workspace.tests.EMFOperationCommandTest)  Time elapsed: 0.006 s
test_operationTriggerErrorStatus_nonEMF_234868(org.eclipse.emf.workspace.tests.EMFOperationCommandTest)  Time elapsed: 0.037 s
test_execute_undo_redo(org.eclipse.emf.workspace.tests.EMFOperationCommandTest)  Time elapsed: 0.006 s
test_execute_undo_redo_trigger(org.eclipse.emf.workspace.tests.EMFOperationCommandTest)  Time elapsed: 0.007 s
test_operationTriggerFails_234868(org.eclipse.emf.workspace.tests.EMFOperationCommandTest)  Time elapsed: 0.007 s
test_operationTriggerErrorStatus_nonEMF_redo_234868(org.eclipse.emf.workspace.tests.EMFOperationCommandTest)  Time elapsed: 0.007 s
test_DoNothing(org.eclipse.emf.workspace.tests.EMFOperationCommandTest)  Time elapsed: 0.005 s
test_getAffectedResources_localRef(org.eclipse.emf.workspace.util.tests.ResourceUndoContextTest)  Time elapsed: 0.004 s
test_getAffectedResources_attribute(org.eclipse.emf.workspace.util.tests.ResourceUndoContextTest)  Time elapsed: 0 s
test_matches(org.eclipse.emf.workspace.util.tests.ResourceUndoContextTest)  Time elapsed: 0 s
test_getAffectedResources_deletedElement_126113(org.eclipse.emf.workspace.util.tests.ResourceUndoContextTest)  Time elapsed: 0.001 s
test_unsettableManyReference_264220(org.eclipse.emf.workspace.util.tests.ResourceUndoContextTest)  Time elapsed: 0.006 s
test_getAffectedResources_remoteRef_bidirectional(org.eclipse.emf.workspace.util.tests.ResourceUndoContextTest)  Time elapsed: 0.001 s
test_getAffectedResources_remoteRef_unidirectional(org.eclipse.emf.workspace.util.tests.ResourceUndoContextTest)  Time elapsed: 0 s
test_canApply(org.eclipse.emf.workspace.util.tests.OperationChangeDescriptionTest)  Time elapsed: 0 s
test_emfChanges(org.eclipse.emf.workspace.util.tests.OperationChangeDescriptionTest)  Time elapsed: 0 s
test_applyAndReverse(org.eclipse.emf.workspace.util.tests.OperationChangeDescriptionTest)  Time elapsed: 0 s
test_apply(org.eclipse.emf.workspace.util.tests.OperationChangeDescriptionTest)  Time elapsed: 0 s
test_defaultMoveBehaviour(org.eclipse.emf.workspace.util.tests.WorkspaceSynchronizerTest)  Time elapsed: 0.015 s
test_synchMovedResourceWithUnencodedURI_197291(org.eclipse.emf.workspace.util.tests.WorkspaceSynchronizerTest)  Time elapsed: 0.047 s
test_getFile(org.eclipse.emf.workspace.util.tests.WorkspaceSynchronizerTest)  Time elapsed: 0.007 s
test_move(org.eclipse.emf.workspace.util.tests.WorkspaceSynchronizerTest)  Time elapsed: 0.009 s
test_getUnderlyingFile_163291(org.eclipse.emf.workspace.util.tests.WorkspaceSynchronizerTest)  Time elapsed: 0.008 s
test_change(org.eclipse.emf.workspace.util.tests.WorkspaceSynchronizerTest)  Time elapsed: 0.009 s
test_synchMoveResourceWithEncodedURI_197291(org.eclipse.emf.workspace.util.tests.WorkspaceSynchronizerTest)  Time elapsed: 0.01 s
test_deletion(org.eclipse.emf.workspace.util.tests.WorkspaceSynchronizerTest)  Time elapsed: 0.007 s
test_deleteProjectAndDisposeSynchronizer_233004(org.eclipse.emf.workspace.util.tests.WorkspaceSynchronizerTest)  Time elapsed: 1.008 s
test_getFile_fileURI_156772(org.eclipse.emf.workspace.util.tests.WorkspaceSynchronizerTest)  Time elapsed: 0.007 s
test_defaultChangeBehaviour(org.eclipse.emf.workspace.util.tests.WorkspaceSynchronizerTest)  Time elapsed: 0.009 s
test_getFileWithEncodedURI_128315(org.eclipse.emf.workspace.util.tests.WorkspaceSynchronizerTest)  Time elapsed: 0.006 s
test_resourceDeletedThatHadMarkers_207306(org.eclipse.emf.workspace.util.tests.WorkspaceSynchronizerTest)  Time elapsed: 0.011 s
test_multipleChanges(org.eclipse.emf.workspace.util.tests.WorkspaceSynchronizerTest)  Time elapsed: 0.02 s
test_synchResourceWithUnencodedURI_197291(org.eclipse.emf.workspace.util.tests.WorkspaceSynchronizerTest)  Time elapsed: 0.015 s
test_synchResourceWithEncodedURI_197291(org.eclipse.emf.workspace.util.tests.WorkspaceSynchronizerTest)  Time elapsed: 0.011 s
test_getFile_normalization_156772(org.eclipse.emf.workspace.util.tests.WorkspaceSynchronizerTest)  Time elapsed: 0.007 s
test_defaultDeleteBehaviour(org.eclipse.emf.workspace.util.tests.WorkspaceSynchronizerTest)  Time elapsed: 0.007 s
test_DoNothing(org.eclipse.emf.workspace.util.tests.WorkspaceSynchronizerTest)  Time elapsed: 0.006 s
test_noValidateEditRequired(org.eclipse.emf.workspace.util.tests.ValidateEditTest)  Time elapsed: 0.033 s
test_DoNothing(org.eclipse.emf.workspace.util.tests.ValidateEditTest)  Time elapsed: 0.006 s
test_localChanges(org.eclipse.emf.workspace.tests.UndoContextTest)  Time elapsed: 0.007 s
test_remoteChanges(org.eclipse.emf.workspace.tests.UndoContextTest)  Time elapsed: 0.01 s
test_DoNothing(org.eclipse.emf.workspace.tests.UndoContextTest)  Time elapsed: 0.007 s
test_nestedExecutionInOpenComposite_203352(org.eclipse.emf.workspace.tests.WorkbenchCommandStackTest)  Time elapsed: 0.007 s
test_flushingOnResourceUnload(org.eclipse.emf.workspace.tests.WorkbenchCommandStackTest)  Time elapsed: 0.012 s
test_undoRedoNotifyListeners_173839(org.eclipse.emf.workspace.tests.WorkbenchCommandStackTest)  Time elapsed: 0.009 s
test_mostRecentCommand(org.eclipse.emf.workspace.tests.WorkbenchCommandStackTest)  Time elapsed: 0.052 s
test_rollbackNotifiesCommandStackListeners_175725(org.eclipse.emf.workspace.tests.WorkbenchCommandStackTest)  Time elapsed: 0.008 s
test_undo_redo(org.eclipse.emf.workspace.tests.WorkbenchCommandStackTest)  Time elapsed: 0.009 s
testUndoContextPropagationFromTriggerListeners(org.eclipse.emf.workspace.tests.WorkbenchCommandStackTest)  Time elapsed: 0.008 s
test_triggerRollback_operation_cancel_146853(org.eclipse.emf.workspace.tests.WorkbenchCommandStackTest)  Time elapsed: 0.01 s
test_isSaveNeeded_214325(org.eclipse.emf.workspace.tests.WorkbenchCommandStackTest)  Time elapsed: 0.007 s
test_nestedExecutionInAbstractOperation_244654(org.eclipse.emf.workspace.tests.WorkbenchCommandStackTest)  Time elapsed: 0.008 s
test_triggerRollback_146853(org.eclipse.emf.workspace.tests.WorkbenchCommandStackTest)  Time elapsed: 0.045 s
testSaveIsDoneAPIs(org.eclipse.emf.workspace.tests.WorkbenchCommandStackTest)  Time elapsed: 0.008 s
test_execute(org.eclipse.emf.workspace.tests.WorkbenchCommandStackTest)  Time elapsed: 0.006 s
test_recordingCommandsAsTriggers_bug157103(org.eclipse.emf.workspace.tests.WorkbenchCommandStackTest)  Time elapsed: 0.011 s
test_triggerRollback_operation_146853(org.eclipse.emf.workspace.tests.WorkbenchCommandStackTest)  Time elapsed: 0.007 s
test_triggerRollback_cancel_146853(org.eclipse.emf.workspace.tests.WorkbenchCommandStackTest)  Time elapsed: 0.008 s
test_flush(org.eclipse.emf.workspace.tests.WorkbenchCommandStackTest)  Time elapsed: 0.007 s
test_DoNothing(org.eclipse.emf.workspace.tests.WorkbenchCommandStackTest)  Time elapsed: 0.006 s
test_crossReferenceAdapter_undoredo_operations(org.eclipse.emf.workspace.tests.MemoryLeakTest)  Time elapsed: 0.007 s
test_crossReferenceAdapter_undoredo_recordingTriggerCommands(org.eclipse.emf.workspace.tests.MemoryLeakTest)  Time elapsed: 0.038 s
test_crossReferenceAdapter_undoredo_operationTriggerOperations(org.eclipse.emf.workspace.tests.MemoryLeakTest)  Time elapsed: 0.012 s
test_crossReferenceAdapter_undoredo_normalTriggerCommands(org.eclipse.emf.workspace.tests.MemoryLeakTest)  Time elapsed: 0.007 s
test_crossReferenceAdapter_undoredo_recordingCommands(org.eclipse.emf.workspace.tests.MemoryLeakTest)  Time elapsed: 0.008 s
test_crossReferenceAdapter_undoredo_operationTriggerCommands(org.eclipse.emf.workspace.tests.MemoryLeakTest)  Time elapsed: 0.008 s
test_crossReferenceAdapter_undoredo_normalCommands(org.eclipse.emf.workspace.tests.MemoryLeakTest)  Time elapsed: 0.007 s
test_DoNothing(org.eclipse.emf.workspace.tests.MemoryLeakTest)  Time elapsed: 0.007 s
Running org.eclipse.emf.workspace.tests.WorkbenchCommandStackTest
Tests run: 18, Failures: 0, Errors: 0, Skipped: 0, Time elapsed: 0.162 s - in org.eclipse.emf.workspace.tests.WorkbenchCommandStackTest
test_nestedExecutionInOpenComposite_203352(org.eclipse.emf.workspace.tests.WorkbenchCommandStackTest)  Time elapsed: 0.007 s
test_flushingOnResourceUnload(org.eclipse.emf.workspace.tests.WorkbenchCommandStackTest)  Time elapsed: 0.006 s
test_undoRedoNotifyListeners_173839(org.eclipse.emf.workspace.tests.WorkbenchCommandStackTest)  Time elapsed: 0.009 s
test_mostRecentCommand(org.eclipse.emf.workspace.tests.WorkbenchCommandStackTest)  Time elapsed: 0.006 s
test_rollbackNotifiesCommandStackListeners_175725(org.eclipse.emf.workspace.tests.WorkbenchCommandStackTest)  Time elapsed: 0.006 s
test_undo_redo(org.eclipse.emf.workspace.tests.WorkbenchCommandStackTest)  Time elapsed: 0.007 s
testUndoContextPropagationFromTriggerListeners(org.eclipse.emf.workspace.tests.WorkbenchCommandStackTest)  Time elapsed: 0.008 s
test_triggerRollback_operation_cancel_146853(org.eclipse.emf.workspace.tests.WorkbenchCommandStackTest)  Time elapsed: 0.006 s
test_isSaveNeeded_214325(org.eclipse.emf.workspace.tests.WorkbenchCommandStackTest)  Time elapsed: 0.007 s
test_nestedExecutionInAbstractOperation_244654(org.eclipse.emf.workspace.tests.WorkbenchCommandStackTest)  Time elapsed: 0.041 s
test_triggerRollback_146853(org.eclipse.emf.workspace.tests.WorkbenchCommandStackTest)  Time elapsed: 0.008 s
testSaveIsDoneAPIs(org.eclipse.emf.workspace.tests.WorkbenchCommandStackTest)  Time elapsed: 0.007 s
test_execute(org.eclipse.emf.workspace.tests.WorkbenchCommandStackTest)  Time elapsed: 0.006 s
test_recordingCommandsAsTriggers_bug157103(org.eclipse.emf.workspace.tests.WorkbenchCommandStackTest)  Time elapsed: 0.008 s
test_triggerRollback_operation_146853(org.eclipse.emf.workspace.tests.WorkbenchCommandStackTest)  Time elapsed: 0.006 s
test_triggerRollback_cancel_146853(org.eclipse.emf.workspace.tests.WorkbenchCommandStackTest)  Time elapsed: 0.007 s
test_flush(org.eclipse.emf.workspace.tests.WorkbenchCommandStackTest)  Time elapsed: 0.006 s
test_DoNothing(org.eclipse.emf.workspace.tests.WorkbenchCommandStackTest)  Time elapsed: 0.008 s
Running org.eclipse.emf.workspace.tests.BasicWorkbenchTest
Tests run: 15, Failures: 0, Errors: 0, Skipped: 0, Time elapsed: 0.155 s - in org.eclipse.emf.workspace.tests.BasicWorkbenchTest
test_read_readWriteTransaction(org.eclipse.emf.workspace.tests.BasicWorkbenchTest)  Time elapsed: 0.035 s
test_resourceContentsChanges_write(org.eclipse.emf.workspace.tests.BasicWorkbenchTest)  Time elapsed: 0.006 s
test_read(org.eclipse.emf.workspace.tests.BasicWorkbenchTest)  Time elapsed: 0.005 s
test_newResourceContentsChanges_write(org.eclipse.emf.workspace.tests.BasicWorkbenchTest)  Time elapsed: 0.006 s
test_write_readOnlytransaction(org.eclipse.emf.workspace.tests.BasicWorkbenchTest)  Time elapsed: 0.012 s
test_loadUnloadDuringRead(org.eclipse.emf.workspace.tests.BasicWorkbenchTest)  Time elapsed: 0.006 s
test_newResourceContentsChanges_read(org.eclipse.emf.workspace.tests.BasicWorkbenchTest)  Time elapsed: 0.008 s
test_write_wrongThread(org.eclipse.emf.workspace.tests.BasicWorkbenchTest)  Time elapsed: 0.007 s
test_write_command(org.eclipse.emf.workspace.tests.BasicWorkbenchTest)  Time elapsed: 0.006 s
test_resourceContentsChanges_read(org.eclipse.emf.workspace.tests.BasicWorkbenchTest)  Time elapsed: 0.005 s
test_read_exclusive(org.eclipse.emf.workspace.tests.BasicWorkbenchTest)  Time elapsed: 0.006 s
test_write_readWritetransaction(org.eclipse.emf.workspace.tests.BasicWorkbenchTest)  Time elapsed: 0.033 s
test_read_readOnlyTransaction(org.eclipse.emf.workspace.tests.BasicWorkbenchTest)  Time elapsed: 0.006 s
test_write(org.eclipse.emf.workspace.tests.BasicWorkbenchTest)  Time elapsed: 0.005 s
test_DoNothing(org.eclipse.emf.workspace.tests.BasicWorkbenchTest)  Time elapsed: 0.008 s
Running org.eclipse.emf.workspace.tests.EMFCommandOperationTest
Tests run: 11, Failures: 0, Errors: 0, Skipped: 0, Time elapsed: 0.099 s - in org.eclipse.emf.workspace.tests.EMFCommandOperationTest
test_triggerCommands_cascading(org.eclipse.emf.workspace.tests.EMFCommandOperationTest)  Time elapsed: 0.006 s
test_validation(org.eclipse.emf.workspace.tests.EMFCommandOperationTest)  Time elapsed: 0.006 s
test_RecordingCommand_triggerCommands(org.eclipse.emf.workspace.tests.EMFCommandOperationTest)  Time elapsed: 0.006 s
test_undoRecordingCommandWithRecordingCommandTrigger_218276(org.eclipse.emf.workspace.tests.EMFCommandOperationTest)  Time elapsed: 0.007 s
test_nonredoableCommand_138287(org.eclipse.emf.workspace.tests.EMFCommandOperationTest)  Time elapsed: 0.006 s
test_nonredoableTriggerCommand_138287(org.eclipse.emf.workspace.tests.EMFCommandOperationTest)  Time elapsed: 0.006 s
test_undoNestedRecordingCommandWithRecordingCommandTrigger_218276(org.eclipse.emf.workspace.tests.EMFCommandOperationTest)  Time elapsed: 0.009 s
test_triggerCommands(org.eclipse.emf.workspace.tests.EMFCommandOperationTest)  Time elapsed: 0.034 s
test_RecordingCommand_execute_undo_redo(org.eclipse.emf.workspace.tests.EMFCommandOperationTest)  Time elapsed: 0.006 s
test_execute_undo_redo(org.eclipse.emf.workspace.tests.EMFCommandOperationTest)  Time elapsed: 0.006 s
test_DoNothing(org.eclipse.emf.workspace.tests.EMFCommandOperationTest)  Time elapsed: 0.006 s
Running org.eclipse.emf.workspace.util.tests.ResourceUndoContextTest
Tests run: 7, Failures: 0, Errors: 0, Skipped: 0, Time elapsed: 0.002 s - in org.eclipse.emf.workspace.util.tests.ResourceUndoContextTest
test_getAffectedResources_localRef(org.eclipse.emf.workspace.util.tests.ResourceUndoContextTest)  Time elapsed: 0 s
test_getAffectedResources_attribute(org.eclipse.emf.workspace.util.tests.ResourceUndoContextTest)  Time elapsed: 0 s
test_matches(org.eclipse.emf.workspace.util.tests.ResourceUndoContextTest)  Time elapsed: 0 s
test_getAffectedResources_deletedElement_126113(org.eclipse.emf.workspace.util.tests.ResourceUndoContextTest)  Time elapsed: 0 s
test_unsettableManyReference_264220(org.eclipse.emf.workspace.util.tests.ResourceUndoContextTest)  Time elapsed: 0.001 s
test_getAffectedResources_remoteRef_bidirectional(org.eclipse.emf.workspace.util.tests.ResourceUndoContextTest)  Time elapsed: 0 s
test_getAffectedResources_remoteRef_unidirectional(org.eclipse.emf.workspace.util.tests.ResourceUndoContextTest)  Time elapsed: 0 s
Running org.eclipse.emf.workspace.util.tests.WorkspaceSynchronizerTest
Tests run: 19, Failures: 0, Errors: 0, Skipped: 0, Time elapsed: 1.192 s - in org.eclipse.emf.workspace.util.tests.WorkspaceSynchronizerTest
test_defaultMoveBehaviour(org.eclipse.emf.workspace.util.tests.WorkspaceSynchronizerTest)  Time elapsed: 0.008 s
test_synchMovedResourceWithUnencodedURI_197291(org.eclipse.emf.workspace.util.tests.WorkspaceSynchronizerTest)  Time elapsed: 0.01 s
test_getFile(org.eclipse.emf.workspace.util.tests.WorkspaceSynchronizerTest)  Time elapsed: 0.006 s
test_move(org.eclipse.emf.workspace.util.tests.WorkspaceSynchronizerTest)  Time elapsed: 0.009 s
test_getUnderlyingFile_163291(org.eclipse.emf.workspace.util.tests.WorkspaceSynchronizerTest)  Time elapsed: 0.035 s
test_change(org.eclipse.emf.workspace.util.tests.WorkspaceSynchronizerTest)  Time elapsed: 0.007 s
test_synchMoveResourceWithEncodedURI_197291(org.eclipse.emf.workspace.util.tests.WorkspaceSynchronizerTest)  Time elapsed: 0.01 s
test_deletion(org.eclipse.emf.workspace.util.tests.WorkspaceSynchronizerTest)  Time elapsed: 0.008 s
test_deleteProjectAndDisposeSynchronizer_233004(org.eclipse.emf.workspace.util.tests.WorkspaceSynchronizerTest)  Time elapsed: 1.005 s
test_getFile_fileURI_156772(org.eclipse.emf.workspace.util.tests.WorkspaceSynchronizerTest)  Time elapsed: 0.006 s
test_defaultChangeBehaviour(org.eclipse.emf.workspace.util.tests.WorkspaceSynchronizerTest)  Time elapsed: 0.009 s
test_getFileWithEncodedURI_128315(org.eclipse.emf.workspace.util.tests.WorkspaceSynchronizerTest)  Time elapsed: 0.006 s
test_resourceDeletedThatHadMarkers_207306(org.eclipse.emf.workspace.util.tests.WorkspaceSynchronizerTest)  Time elapsed: 0.007 s
test_multipleChanges(org.eclipse.emf.workspace.util.tests.WorkspaceSynchronizerTest)  Time elapsed: 0.016 s
test_synchResourceWithUnencodedURI_197291(org.eclipse.emf.workspace.util.tests.WorkspaceSynchronizerTest)  Time elapsed: 0.011 s
test_synchResourceWithEncodedURI_197291(org.eclipse.emf.workspace.util.tests.WorkspaceSynchronizerTest)  Time elapsed: 0.016 s
test_getFile_normalization_156772(org.eclipse.emf.workspace.util.tests.WorkspaceSynchronizerTest)  Time elapsed: 0.006 s
test_defaultDeleteBehaviour(org.eclipse.emf.workspace.util.tests.WorkspaceSynchronizerTest)  Time elapsed: 0.008 s
test_DoNothing(org.eclipse.emf.workspace.util.tests.WorkspaceSynchronizerTest)  Time elapsed: 0.005 s
Running org.eclipse.emf.workspace.util.tests.OperationChangeDescriptionTest
Tests run: 4, Failures: 0, Errors: 0, Skipped: 0, Time elapsed: 0.001 s - in org.eclipse.emf.workspace.util.tests.OperationChangeDescriptionTest
test_canApply(org.eclipse.emf.workspace.util.tests.OperationChangeDescriptionTest)  Time elapsed: 0 s
test_emfChanges(org.eclipse.emf.workspace.util.tests.OperationChangeDescriptionTest)  Time elapsed: 0 s
test_applyAndReverse(org.eclipse.emf.workspace.util.tests.OperationChangeDescriptionTest)  Time elapsed: 0 s
test_apply(org.eclipse.emf.workspace.util.tests.OperationChangeDescriptionTest)  Time elapsed: 0 s
Running org.eclipse.emf.workspace.util.tests.AllTests
Tests run: 32, Failures: 0, Errors: 0, Skipped: 0, Time elapsed: 1.195 s - in org.eclipse.emf.workspace.util.tests.AllTests
test_getAffectedResources_localRef(org.eclipse.emf.workspace.util.tests.ResourceUndoContextTest)  Time elapsed: 0.001 s
test_getAffectedResources_attribute(org.eclipse.emf.workspace.util.tests.ResourceUndoContextTest)  Time elapsed: 0 s
test_matches(org.eclipse.emf.workspace.util.tests.ResourceUndoContextTest)  Time elapsed: 0 s
test_getAffectedResources_deletedElement_126113(org.eclipse.emf.workspace.util.tests.ResourceUndoContextTest)  Time elapsed: 0 s
test_unsettableManyReference_264220(org.eclipse.emf.workspace.util.tests.ResourceUndoContextTest)  Time elapsed: 0 s
test_getAffectedResources_remoteRef_bidirectional(org.eclipse.emf.workspace.util.tests.ResourceUndoContextTest)  Time elapsed: 0 s
test_getAffectedResources_remoteRef_unidirectional(org.eclipse.emf.workspace.util.tests.ResourceUndoContextTest)  Time elapsed: 0 s
test_canApply(org.eclipse.emf.workspace.util.tests.OperationChangeDescriptionTest)  Time elapsed: 0 s
test_emfChanges(org.eclipse.emf.workspace.util.tests.OperationChangeDescriptionTest)  Time elapsed: 0 s
test_applyAndReverse(org.eclipse.emf.workspace.util.tests.OperationChangeDescriptionTest)  Time elapsed: 0 s
test_apply(org.eclipse.emf.workspace.util.tests.OperationChangeDescriptionTest)  Time elapsed: 0 s
test_defaultMoveBehaviour(org.eclipse.emf.workspace.util.tests.WorkspaceSynchronizerTest)  Time elapsed: 0.008 s
test_synchMovedResourceWithUnencodedURI_197291(org.eclipse.emf.workspace.util.tests.WorkspaceSynchronizerTest)  Time elapsed: 0.011 s
test_getFile(org.eclipse.emf.workspace.util.tests.WorkspaceSynchronizerTest)  Time elapsed: 0.005 s
test_move(org.eclipse.emf.workspace.util.tests.WorkspaceSynchronizerTest)  Time elapsed: 0.044 s
test_getUnderlyingFile_163291(org.eclipse.emf.workspace.util.tests.WorkspaceSynchronizerTest)  Time elapsed: 0.006 s
test_change(org.eclipse.emf.workspace.util.tests.WorkspaceSynchronizerTest)  Time elapsed: 0.007 s
test_synchMoveResourceWithEncodedURI_197291(org.eclipse.emf.workspace.util.tests.WorkspaceSynchronizerTest)  Time elapsed: 0.009 s
test_deletion(org.eclipse.emf.workspace.util.tests.WorkspaceSynchronizerTest)  Time elapsed: 0.006 s
test_deleteProjectAndDisposeSynchronizer_233004(org.eclipse.emf.workspace.util.tests.WorkspaceSynchronizerTest)  Time elapsed: 1.005 s
test_getFile_fileURI_156772(org.eclipse.emf.workspace.util.tests.WorkspaceSynchronizerTest)  Time elapsed: 0.005 s
test_defaultChangeBehaviour(org.eclipse.emf.workspace.util.tests.WorkspaceSynchronizerTest)  Time elapsed: 0.008 s
test_getFileWithEncodedURI_128315(org.eclipse.emf.workspace.util.tests.WorkspaceSynchronizerTest)  Time elapsed: 0.005 s
test_resourceDeletedThatHadMarkers_207306(org.eclipse.emf.workspace.util.tests.WorkspaceSynchronizerTest)  Time elapsed: 0.007 s
test_multipleChanges(org.eclipse.emf.workspace.util.tests.WorkspaceSynchronizerTest)  Time elapsed: 0.016 s
test_synchResourceWithUnencodedURI_197291(org.eclipse.emf.workspace.util.tests.WorkspaceSynchronizerTest)  Time elapsed: 0.01 s
test_synchResourceWithEncodedURI_197291(org.eclipse.emf.workspace.util.tests.WorkspaceSynchronizerTest)  Time elapsed: 0.008 s
test_getFile_normalization_156772(org.eclipse.emf.workspace.util.tests.WorkspaceSynchronizerTest)  Time elapsed: 0.006 s
test_defaultDeleteBehaviour(org.eclipse.emf.workspace.util.tests.WorkspaceSynchronizerTest)  Time elapsed: 0.008 s
test_DoNothing(org.eclipse.emf.workspace.util.tests.WorkspaceSynchronizerTest)  Time elapsed: 0.005 s
test_noValidateEditRequired(org.eclipse.emf.workspace.util.tests.ValidateEditTest)  Time elapsed: 0.005 s
test_DoNothing(org.eclipse.emf.workspace.util.tests.ValidateEditTest)  Time elapsed: 0.006 s
Running org.eclipse.emf.workspace.util.tests.ValidateEditTest
Tests run: 2, Failures: 0, Errors: 0, Skipped: 0, Time elapsed: 0.014 s - in org.eclipse.emf.workspace.util.tests.ValidateEditTest
test_noValidateEditRequired(org.eclipse.emf.workspace.util.tests.ValidateEditTest)  Time elapsed: 0.009 s
test_DoNothing(org.eclipse.emf.workspace.util.tests.ValidateEditTest)  Time elapsed: 0.005 s

Results:

Tests run: 313, Failures: 0, Errors: 0, Skipped: 0

[INFO] All tests passed!
[INFO] 
[INFO] --- eclipse-jarsigner-plugin:1.3.2:sign (sign) @ org.eclipse.emf.workspace.tests ---
[INFO] Signing jar: /home/jenkins/agent/workspace/emf-transaction-master/PLATFORM/2020-06/jdk/openjdk-jdk11-latest/label/migration/org.eclipse.emf.workspace.tests/target/org.eclipse.emf.workspace.tests-1.10.0-SNAPSHOT.jar
[INFO] Signing jar: /home/jenkins/agent/workspace/emf-transaction-master/PLATFORM/2020-06/jdk/openjdk-jdk11-latest/label/migration/org.eclipse.emf.workspace.tests/target/org.eclipse.emf.workspace.tests-1.10.0-SNAPSHOT-sources.jar
[INFO] 
[INFO] --< org.eclipse.emf.transaction.features:org.eclipse.emf.transaction >--
[INFO] Building org.eclipse.emf.transaction 1.12.0-SNAPSHOT             [14/27]
[INFO] --------------------------[ eclipse-feature ]---------------------------
[INFO] 
[INFO] --- maven-clean-plugin:2.5:clean (default-clean) @ org.eclipse.emf.transaction ---
[INFO] 
[INFO] --- tycho-packaging-plugin:2.5.0:build-qualifier-aggregator (default-build-qualifier-aggregator) @ org.eclipse.emf.transaction ---
[INFO] The project's OSGi version is 1.12.0.202206220708
[INFO] 
[INFO] --- tycho-packaging-plugin:2.5.0:validate-id (default-validate-id) @ org.eclipse.emf.transaction ---
[INFO] 
[INFO] --- tycho-packaging-plugin:2.5.0:validate-version (default-validate-version) @ org.eclipse.emf.transaction ---
[INFO] 
[INFO] --- target-platform-configuration:2.5.0:target-platform (default-target-platform) @ org.eclipse.emf.transaction ---
[INFO] 
[INFO] --- maven-antrun-plugin:3.0.0:run (replace-build-token) @ org.eclipse.emf.transaction ---
[INFO] Executing tasks
[INFO] Executed tasks
[INFO] 
[INFO] --- tycho-source-plugin:2.5.0:plugin-source (plugin-source) @ org.eclipse.emf.transaction ---
[INFO] 
[INFO] --- tycho-packaging-plugin:2.5.0:package-feature (default-package-feature) @ org.eclipse.emf.transaction ---
[INFO] Fetching org.eclipse.license_2.0.2.v20181016-2210.jar from https://download.eclipse.org/cbi/updates/license/2.0.2.v20181016-2210/features/ (13.05kB)
[INFO] Building jar: /home/jenkins/agent/workspace/emf-transaction-master/PLATFORM/2020-06/jdk/openjdk-jdk11-latest/label/migration/org.eclipse.emf.transaction-feature/target/org.eclipse.emf.transaction-1.12.0-SNAPSHOT.jar
[INFO] 
[INFO] --- tycho-p2-plugin:2.5.0:p2-metadata-default (default-p2-metadata-default) @ org.eclipse.emf.transaction ---
[INFO] 
[INFO] --- tycho-p2-plugin:2.5.0:feature-p2-metadata (default-feature-p2-metadata) @ org.eclipse.emf.transaction ---
[INFO] 
[INFO] --- eclipse-jarsigner-plugin:1.3.2:sign (sign) @ org.eclipse.emf.transaction ---
[INFO] Signing jar: /home/jenkins/agent/workspace/emf-transaction-master/PLATFORM/2020-06/jdk/openjdk-jdk11-latest/label/migration/org.eclipse.emf.transaction-feature/target/org.eclipse.emf.transaction-1.12.0-SNAPSHOT.jar
[INFO] 
[INFO] --< org.eclipse.emf.transaction.features:org.eclipse.emf.transaction.source >--
[INFO] Building org.eclipse.emf.transaction.source 1.12.0-SNAPSHOT      [15/27]
[INFO] --------------------------[ eclipse-feature ]---------------------------
[INFO] 
[INFO] --- maven-clean-plugin:2.5:clean (default-clean) @ org.eclipse.emf.transaction.source ---
[INFO] 
[INFO] --- tycho-packaging-plugin:2.5.0:build-qualifier-aggregator (default-build-qualifier-aggregator) @ org.eclipse.emf.transaction.source ---
[INFO] The project's OSGi version is 1.12.0.202206220708
[INFO] 
[INFO] --- tycho-packaging-plugin:2.5.0:validate-id (default-validate-id) @ org.eclipse.emf.transaction.source ---
[INFO] 
[INFO] --- tycho-packaging-plugin:2.5.0:validate-version (default-validate-version) @ org.eclipse.emf.transaction.source ---
[INFO] 
[INFO] --- target-platform-configuration:2.5.0:target-platform (default-target-platform) @ org.eclipse.emf.transaction.source ---
[INFO] 
[INFO] --- maven-antrun-plugin:3.0.0:run (replace-build-token) @ org.eclipse.emf.transaction.source ---
[INFO] Executing tasks
[INFO] Executed tasks
[INFO] 
[INFO] --- tycho-source-plugin:2.5.0:plugin-source (plugin-source) @ org.eclipse.emf.transaction.source ---
[INFO] 
[INFO] --- tycho-packaging-plugin:2.5.0:package-feature (default-package-feature) @ org.eclipse.emf.transaction.source ---
[INFO] Building jar: /home/jenkins/agent/workspace/emf-transaction-master/PLATFORM/2020-06/jdk/openjdk-jdk11-latest/label/migration/org.eclipse.emf.transaction.source-feature/target/org.eclipse.emf.transaction.source-1.12.0-SNAPSHOT.jar
[INFO] 
[INFO] --- tycho-p2-plugin:2.5.0:p2-metadata-default (default-p2-metadata-default) @ org.eclipse.emf.transaction.source ---
[INFO] 
[INFO] --- tycho-p2-plugin:2.5.0:feature-p2-metadata (default-feature-p2-metadata) @ org.eclipse.emf.transaction.source ---
[INFO] 
[INFO] --- eclipse-jarsigner-plugin:1.3.2:sign (sign) @ org.eclipse.emf.transaction.source ---
[INFO] Signing jar: /home/jenkins/agent/workspace/emf-transaction-master/PLATFORM/2020-06/jdk/openjdk-jdk11-latest/label/migration/org.eclipse.emf.transaction.source-feature/target/org.eclipse.emf.transaction.source-1.12.0-SNAPSHOT.jar
[INFO] 
[INFO] ---< org.eclipse.emf.transaction.features:org.eclipse.emf.workspace >---
[INFO] Building org.eclipse.emf.workspace 1.12.0-SNAPSHOT               [16/27]
[INFO] --------------------------[ eclipse-feature ]---------------------------
[INFO] 
[INFO] --- maven-clean-plugin:2.5:clean (default-clean) @ org.eclipse.emf.workspace ---
[INFO] 
[INFO] --- tycho-packaging-plugin:2.5.0:build-qualifier-aggregator (default-build-qualifier-aggregator) @ org.eclipse.emf.workspace ---
[INFO] The project's OSGi version is 1.12.0.202206220708
[INFO] 
[INFO] --- tycho-packaging-plugin:2.5.0:validate-id (default-validate-id) @ org.eclipse.emf.workspace ---
[INFO] 
[INFO] --- tycho-packaging-plugin:2.5.0:validate-version (default-validate-version) @ org.eclipse.emf.workspace ---
[INFO] 
[INFO] --- target-platform-configuration:2.5.0:target-platform (default-target-platform) @ org.eclipse.emf.workspace ---
[INFO] 
[INFO] --- maven-antrun-plugin:3.0.0:run (replace-build-token) @ org.eclipse.emf.workspace ---
[INFO] Executing tasks
[INFO] Executed tasks
[INFO] 
[INFO] --- tycho-source-plugin:2.5.0:plugin-source (plugin-source) @ org.eclipse.emf.workspace ---
[INFO] 
[INFO] --- tycho-packaging-plugin:2.5.0:package-feature (default-package-feature) @ org.eclipse.emf.workspace ---
[INFO] Building jar: /home/jenkins/agent/workspace/emf-transaction-master/PLATFORM/2020-06/jdk/openjdk-jdk11-latest/label/migration/org.eclipse.emf.workspace-feature/target/org.eclipse.emf.workspace-1.12.0-SNAPSHOT.jar
[INFO] 
[INFO] --- tycho-p2-plugin:2.5.0:p2-metadata-default (default-p2-metadata-default) @ org.eclipse.emf.workspace ---
[INFO] 
[INFO] --- tycho-p2-plugin:2.5.0:feature-p2-metadata (default-feature-p2-metadata) @ org.eclipse.emf.workspace ---
[INFO] 
[INFO] --- eclipse-jarsigner-plugin:1.3.2:sign (sign) @ org.eclipse.emf.workspace ---
[INFO] Signing jar: /home/jenkins/agent/workspace/emf-transaction-master/PLATFORM/2020-06/jdk/openjdk-jdk11-latest/label/migration/org.eclipse.emf.workspace-feature/target/org.eclipse.emf.workspace-1.12.0-SNAPSHOT.jar
[INFO] 
[INFO] --< org.eclipse.emf.transaction.features:org.eclipse.emf.workspace.source >--
[INFO] Building org.eclipse.emf.workspace.source 1.12.0-SNAPSHOT        [17/27]
[INFO] --------------------------[ eclipse-feature ]---------------------------
[INFO] 
[INFO] --- maven-clean-plugin:2.5:clean (default-clean) @ org.eclipse.emf.workspace.source ---
[INFO] 
[INFO] --- tycho-packaging-plugin:2.5.0:build-qualifier-aggregator (default-build-qualifier-aggregator) @ org.eclipse.emf.workspace.source ---
[INFO] The project's OSGi version is 1.12.0.202206220708
[INFO] 
[INFO] --- tycho-packaging-plugin:2.5.0:validate-id (default-validate-id) @ org.eclipse.emf.workspace.source ---
[INFO] 
[INFO] --- tycho-packaging-plugin:2.5.0:validate-version (default-validate-version) @ org.eclipse.emf.workspace.source ---
[INFO] 
[INFO] --- target-platform-configuration:2.5.0:target-platform (default-target-platform) @ org.eclipse.emf.workspace.source ---
[INFO] 
[INFO] --- maven-antrun-plugin:3.0.0:run (replace-build-token) @ org.eclipse.emf.workspace.source ---
[INFO] Executing tasks
[INFO] Executed tasks
[INFO] 
[INFO] --- tycho-source-plugin:2.5.0:plugin-source (plugin-source) @ org.eclipse.emf.workspace.source ---
[INFO] 
[INFO] --- tycho-packaging-plugin:2.5.0:package-feature (default-package-feature) @ org.eclipse.emf.workspace.source ---
[INFO] Building jar: /home/jenkins/agent/workspace/emf-transaction-master/PLATFORM/2020-06/jdk/openjdk-jdk11-latest/label/migration/org.eclipse.emf.workspace.source-feature/target/org.eclipse.emf.workspace.source-1.12.0-SNAPSHOT.jar
[INFO] 
[INFO] --- tycho-p2-plugin:2.5.0:p2-metadata-default (default-p2-metadata-default) @ org.eclipse.emf.workspace.source ---
[INFO] 
[INFO] --- tycho-p2-plugin:2.5.0:feature-p2-metadata (default-feature-p2-metadata) @ org.eclipse.emf.workspace.source ---
[INFO] 
[INFO] --- eclipse-jarsigner-plugin:1.3.2:sign (sign) @ org.eclipse.emf.workspace.source ---
[INFO] Signing jar: /home/jenkins/agent/workspace/emf-transaction-master/PLATFORM/2020-06/jdk/openjdk-jdk11-latest/label/migration/org.eclipse.emf.workspace.source-feature/target/org.eclipse.emf.workspace.source-1.12.0-SNAPSHOT.jar
[INFO] 
[INFO] --< org.eclipse.emf.transaction.features:org.eclipse.emf.workspace.examples >--
[INFO] Building org.eclipse.emf.workspace.examples 1.12.0-SNAPSHOT      [18/27]
[INFO] --------------------------[ eclipse-feature ]---------------------------
[INFO] 
[INFO] --- maven-clean-plugin:2.5:clean (default-clean) @ org.eclipse.emf.workspace.examples ---
[INFO] 
[INFO] --- tycho-packaging-plugin:2.5.0:build-qualifier-aggregator (default-build-qualifier-aggregator) @ org.eclipse.emf.workspace.examples ---
[INFO] The project's OSGi version is 1.12.0.202206220708
[INFO] 
[INFO] --- tycho-packaging-plugin:2.5.0:validate-id (default-validate-id) @ org.eclipse.emf.workspace.examples ---
[INFO] 
[INFO] --- tycho-packaging-plugin:2.5.0:validate-version (default-validate-version) @ org.eclipse.emf.workspace.examples ---
[INFO] 
[INFO] --- target-platform-configuration:2.5.0:target-platform (default-target-platform) @ org.eclipse.emf.workspace.examples ---
[INFO] 
[INFO] --- maven-antrun-plugin:3.0.0:run (replace-build-token) @ org.eclipse.emf.workspace.examples ---
[INFO] Executing tasks
[INFO] Executed tasks
[INFO] 
[INFO] --- tycho-source-plugin:2.5.0:plugin-source (plugin-source) @ org.eclipse.emf.workspace.examples ---
[INFO] 
[INFO] --- tycho-packaging-plugin:2.5.0:package-feature (default-package-feature) @ org.eclipse.emf.workspace.examples ---
[INFO] Building jar: /home/jenkins/agent/workspace/emf-transaction-master/PLATFORM/2020-06/jdk/openjdk-jdk11-latest/label/migration/org.eclipse.emf.workspace.examples-feature/target/org.eclipse.emf.workspace.examples-1.12.0-SNAPSHOT.jar
[INFO] 
[INFO] --- tycho-p2-plugin:2.5.0:p2-metadata-default (default-p2-metadata-default) @ org.eclipse.emf.workspace.examples ---
[INFO] 
[INFO] --- tycho-p2-plugin:2.5.0:feature-p2-metadata (default-feature-p2-metadata) @ org.eclipse.emf.workspace.examples ---
[INFO] 
[INFO] --- eclipse-jarsigner-plugin:1.3.2:sign (sign) @ org.eclipse.emf.workspace.examples ---
[INFO] Signing jar: /home/jenkins/agent/workspace/emf-transaction-master/PLATFORM/2020-06/jdk/openjdk-jdk11-latest/label/migration/org.eclipse.emf.workspace.examples-feature/target/org.eclipse.emf.workspace.examples-1.12.0-SNAPSHOT.jar
[INFO] 
[INFO] --< org.eclipse.emf.transaction.features:org.eclipse.emf.transaction.examples >--
[INFO] Building org.eclipse.emf.transaction.examples 1.12.0-SNAPSHOT    [19/27]
[INFO] --------------------------[ eclipse-feature ]---------------------------
[INFO] 
[INFO] --- maven-clean-plugin:2.5:clean (default-clean) @ org.eclipse.emf.transaction.examples ---
[INFO] 
[INFO] --- tycho-packaging-plugin:2.5.0:build-qualifier-aggregator (default-build-qualifier-aggregator) @ org.eclipse.emf.transaction.examples ---
[INFO] The project's OSGi version is 1.12.0.202206220708
[INFO] 
[INFO] --- tycho-packaging-plugin:2.5.0:validate-id (default-validate-id) @ org.eclipse.emf.transaction.examples ---
[INFO] 
[INFO] --- tycho-packaging-plugin:2.5.0:validate-version (default-validate-version) @ org.eclipse.emf.transaction.examples ---
[INFO] 
[INFO] --- target-platform-configuration:2.5.0:target-platform (default-target-platform) @ org.eclipse.emf.transaction.examples ---
[INFO] 
[INFO] --- maven-antrun-plugin:3.0.0:run (replace-build-token) @ org.eclipse.emf.transaction.examples ---
[INFO] Executing tasks
[INFO] Executed tasks
[INFO] 
[INFO] --- tycho-source-plugin:2.5.0:plugin-source (plugin-source) @ org.eclipse.emf.transaction.examples ---
[INFO] 
[INFO] --- tycho-packaging-plugin:2.5.0:package-feature (default-package-feature) @ org.eclipse.emf.transaction.examples ---
[INFO] Building jar: /home/jenkins/agent/workspace/emf-transaction-master/PLATFORM/2020-06/jdk/openjdk-jdk11-latest/label/migration/org.eclipse.emf.transaction.examples-feature/target/org.eclipse.emf.transaction.examples-1.12.0-SNAPSHOT.jar
[INFO] 
[INFO] --- tycho-p2-plugin:2.5.0:p2-metadata-default (default-p2-metadata-default) @ org.eclipse.emf.transaction.examples ---
[INFO] 
[INFO] --- tycho-p2-plugin:2.5.0:feature-p2-metadata (default-feature-p2-metadata) @ org.eclipse.emf.transaction.examples ---
[INFO] 
[INFO] --- eclipse-jarsigner-plugin:1.3.2:sign (sign) @ org.eclipse.emf.transaction.examples ---
[INFO] Signing jar: /home/jenkins/agent/workspace/emf-transaction-master/PLATFORM/2020-06/jdk/openjdk-jdk11-latest/label/migration/org.eclipse.emf.transaction.examples-feature/target/org.eclipse.emf.transaction.examples-1.12.0-SNAPSHOT.jar
[INFO] 
[INFO] --< org.eclipse.emf.transaction.features:org.eclipse.emf.transaction.examples.source >--
[INFO] Building org.eclipse.emf.transaction.examples.source 1.12.0-SNAPSHOT [20/27]
[INFO] --------------------------[ eclipse-feature ]---------------------------
[INFO] 
[INFO] --- maven-clean-plugin:2.5:clean (default-clean) @ org.eclipse.emf.transaction.examples.source ---
[INFO] 
[INFO] --- tycho-packaging-plugin:2.5.0:build-qualifier-aggregator (default-build-qualifier-aggregator) @ org.eclipse.emf.transaction.examples.source ---
[INFO] The project's OSGi version is 1.12.0.202206220708
[INFO] 
[INFO] --- tycho-packaging-plugin:2.5.0:validate-id (default-validate-id) @ org.eclipse.emf.transaction.examples.source ---
[INFO] 
[INFO] --- tycho-packaging-plugin:2.5.0:validate-version (default-validate-version) @ org.eclipse.emf.transaction.examples.source ---
[INFO] 
[INFO] --- target-platform-configuration:2.5.0:target-platform (default-target-platform) @ org.eclipse.emf.transaction.examples.source ---
[INFO] 
[INFO] --- maven-antrun-plugin:3.0.0:run (replace-build-token) @ org.eclipse.emf.transaction.examples.source ---
[INFO] Executing tasks
[INFO] Executed tasks
[INFO] 
[INFO] --- tycho-source-plugin:2.5.0:plugin-source (plugin-source) @ org.eclipse.emf.transaction.examples.source ---
[INFO] 
[INFO] --- tycho-packaging-plugin:2.5.0:package-feature (default-package-feature) @ org.eclipse.emf.transaction.examples.source ---
[INFO] Building jar: /home/jenkins/agent/workspace/emf-transaction-master/PLATFORM/2020-06/jdk/openjdk-jdk11-latest/label/migration/org.eclipse.emf.transaction.examples.source-feature/target/org.eclipse.emf.transaction.examples.source-1.12.0-SNAPSHOT.jar
[INFO] 
[INFO] --- tycho-p2-plugin:2.5.0:p2-metadata-default (default-p2-metadata-default) @ org.eclipse.emf.transaction.examples.source ---
[INFO] 
[INFO] --- tycho-p2-plugin:2.5.0:feature-p2-metadata (default-feature-p2-metadata) @ org.eclipse.emf.transaction.examples.source ---
[INFO] 
[INFO] --- eclipse-jarsigner-plugin:1.3.2:sign (sign) @ org.eclipse.emf.transaction.examples.source ---
[INFO] Signing jar: /home/jenkins/agent/workspace/emf-transaction-master/PLATFORM/2020-06/jdk/openjdk-jdk11-latest/label/migration/org.eclipse.emf.transaction.examples.source-feature/target/org.eclipse.emf.transaction.examples.source-1.12.0-SNAPSHOT.jar
[INFO] 
[INFO] --< org.eclipse.emf.transaction.features:org.eclipse.emf.workspace.doc >--
[INFO] Building org.eclipse.emf.workspace.doc 1.12.0-SNAPSHOT           [21/27]
[INFO] --------------------------[ eclipse-feature ]---------------------------
[INFO] 
[INFO] --- maven-clean-plugin:2.5:clean (default-clean) @ org.eclipse.emf.workspace.doc ---
[INFO] 
[INFO] --- tycho-packaging-plugin:2.5.0:build-qualifier-aggregator (default-build-qualifier-aggregator) @ org.eclipse.emf.workspace.doc ---
[INFO] The project's OSGi version is 1.12.0.202206220708
[INFO] 
[INFO] --- tycho-packaging-plugin:2.5.0:validate-id (default-validate-id) @ org.eclipse.emf.workspace.doc ---
[INFO] 
[INFO] --- tycho-packaging-plugin:2.5.0:validate-version (default-validate-version) @ org.eclipse.emf.workspace.doc ---
[INFO] 
[INFO] --- target-platform-configuration:2.5.0:target-platform (default-target-platform) @ org.eclipse.emf.workspace.doc ---
[INFO] 
[INFO] --- maven-antrun-plugin:3.0.0:run (replace-build-token) @ org.eclipse.emf.workspace.doc ---
[INFO] Executing tasks
[INFO] Executed tasks
[INFO] 
[INFO] --- tycho-source-plugin:2.5.0:plugin-source (plugin-source) @ org.eclipse.emf.workspace.doc ---
[INFO] 
[INFO] --- tycho-packaging-plugin:2.5.0:package-feature (default-package-feature) @ org.eclipse.emf.workspace.doc ---
[INFO] Building jar: /home/jenkins/agent/workspace/emf-transaction-master/PLATFORM/2020-06/jdk/openjdk-jdk11-latest/label/migration/org.eclipse.emf.workspace.doc-feature/target/org.eclipse.emf.workspace.doc-1.12.0-SNAPSHOT.jar
[INFO] 
[INFO] --- tycho-p2-plugin:2.5.0:p2-metadata-default (default-p2-metadata-default) @ org.eclipse.emf.workspace.doc ---
[INFO] 
[INFO] --- tycho-p2-plugin:2.5.0:feature-p2-metadata (default-feature-p2-metadata) @ org.eclipse.emf.workspace.doc ---
[INFO] 
[INFO] --- eclipse-jarsigner-plugin:1.3.2:sign (sign) @ org.eclipse.emf.workspace.doc ---
[INFO] Signing jar: /home/jenkins/agent/workspace/emf-transaction-master/PLATFORM/2020-06/jdk/openjdk-jdk11-latest/label/migration/org.eclipse.emf.workspace.doc-feature/target/org.eclipse.emf.workspace.doc-1.12.0-SNAPSHOT.jar
[INFO] 
[INFO] --< org.eclipse.emf.transaction.features:org.eclipse.emf.transaction.doc >--
[INFO] Building org.eclipse.emf.transaction.doc 1.12.0-SNAPSHOT         [22/27]
[INFO] --------------------------[ eclipse-feature ]---------------------------
[INFO] 
[INFO] --- maven-clean-plugin:2.5:clean (default-clean) @ org.eclipse.emf.transaction.doc ---
[INFO] 
[INFO] --- tycho-packaging-plugin:2.5.0:build-qualifier-aggregator (default-build-qualifier-aggregator) @ org.eclipse.emf.transaction.doc ---
[INFO] The project's OSGi version is 1.12.0.202206220708
[INFO] 
[INFO] --- tycho-packaging-plugin:2.5.0:validate-id (default-validate-id) @ org.eclipse.emf.transaction.doc ---
[INFO] 
[INFO] --- tycho-packaging-plugin:2.5.0:validate-version (default-validate-version) @ org.eclipse.emf.transaction.doc ---
[INFO] 
[INFO] --- target-platform-configuration:2.5.0:target-platform (default-target-platform) @ org.eclipse.emf.transaction.doc ---
[INFO] 
[INFO] --- maven-antrun-plugin:3.0.0:run (replace-build-token) @ org.eclipse.emf.transaction.doc ---
[INFO] Executing tasks
[INFO] Executed tasks
[INFO] 
[INFO] --- tycho-source-plugin:2.5.0:plugin-source (plugin-source) @ org.eclipse.emf.transaction.doc ---
[INFO] 
[INFO] --- tycho-packaging-plugin:2.5.0:package-feature (default-package-feature) @ org.eclipse.emf.transaction.doc ---
[INFO] Building jar: /home/jenkins/agent/workspace/emf-transaction-master/PLATFORM/2020-06/jdk/openjdk-jdk11-latest/label/migration/org.eclipse.emf.transaction.doc-feature/target/org.eclipse.emf.transaction.doc-1.12.0-SNAPSHOT.jar
[INFO] 
[INFO] --- tycho-p2-plugin:2.5.0:p2-metadata-default (default-p2-metadata-default) @ org.eclipse.emf.transaction.doc ---
[INFO] 
[INFO] --- tycho-p2-plugin:2.5.0:feature-p2-metadata (default-feature-p2-metadata) @ org.eclipse.emf.transaction.doc ---
[INFO] 
[INFO] --- eclipse-jarsigner-plugin:1.3.2:sign (sign) @ org.eclipse.emf.transaction.doc ---
[INFO] Signing jar: /home/jenkins/agent/workspace/emf-transaction-master/PLATFORM/2020-06/jdk/openjdk-jdk11-latest/label/migration/org.eclipse.emf.transaction.doc-feature/target/org.eclipse.emf.transaction.doc-1.12.0-SNAPSHOT.jar
[INFO] 
[INFO] --< org.eclipse.emf.transaction.features:org.eclipse.emf.workspace.examples.source >--
[INFO] Building org.eclipse.emf.workspace.examples.source 1.12.0-SNAPSHOT [23/27]
[INFO] --------------------------[ eclipse-feature ]---------------------------
[INFO] 
[INFO] --- maven-clean-plugin:2.5:clean (default-clean) @ org.eclipse.emf.workspace.examples.source ---
[INFO] 
[INFO] --- tycho-packaging-plugin:2.5.0:build-qualifier-aggregator (default-build-qualifier-aggregator) @ org.eclipse.emf.workspace.examples.source ---
[INFO] The project's OSGi version is 1.12.0.202206220708
[INFO] 
[INFO] --- tycho-packaging-plugin:2.5.0:validate-id (default-validate-id) @ org.eclipse.emf.workspace.examples.source ---
[INFO] 
[INFO] --- tycho-packaging-plugin:2.5.0:validate-version (default-validate-version) @ org.eclipse.emf.workspace.examples.source ---
[INFO] 
[INFO] --- target-platform-configuration:2.5.0:target-platform (default-target-platform) @ org.eclipse.emf.workspace.examples.source ---
[INFO] 
[INFO] --- maven-antrun-plugin:3.0.0:run (replace-build-token) @ org.eclipse.emf.workspace.examples.source ---
[INFO] Executing tasks
[INFO] Executed tasks
[INFO] 
[INFO] --- tycho-source-plugin:2.5.0:plugin-source (plugin-source) @ org.eclipse.emf.workspace.examples.source ---
[INFO] 
[INFO] --- tycho-packaging-plugin:2.5.0:package-feature (default-package-feature) @ org.eclipse.emf.workspace.examples.source ---
[INFO] Building jar: /home/jenkins/agent/workspace/emf-transaction-master/PLATFORM/2020-06/jdk/openjdk-jdk11-latest/label/migration/org.eclipse.emf.workspace.examples.source-feature/target/org.eclipse.emf.workspace.examples.source-1.12.0-SNAPSHOT.jar
[INFO] 
[INFO] --- tycho-p2-plugin:2.5.0:p2-metadata-default (default-p2-metadata-default) @ org.eclipse.emf.workspace.examples.source ---
[INFO] 
[INFO] --- tycho-p2-plugin:2.5.0:feature-p2-metadata (default-feature-p2-metadata) @ org.eclipse.emf.workspace.examples.source ---
[INFO] 
[INFO] --- eclipse-jarsigner-plugin:1.3.2:sign (sign) @ org.eclipse.emf.workspace.examples.source ---
[INFO] Signing jar: /home/jenkins/agent/workspace/emf-transaction-master/PLATFORM/2020-06/jdk/openjdk-jdk11-latest/label/migration/org.eclipse.emf.workspace.examples.source-feature/target/org.eclipse.emf.workspace.examples.source-1.12.0-SNAPSHOT.jar
[INFO] 
[INFO] --< org.eclipse.emf.transaction.features:org.eclipse.emf.transaction.tests >--
[INFO] Building org.eclipse.emf.transaction.tests 1.12.0-SNAPSHOT       [24/27]
[INFO] --------------------------[ eclipse-feature ]---------------------------
[INFO] 
[INFO] --- maven-clean-plugin:2.5:clean (default-clean) @ org.eclipse.emf.transaction.tests ---
[INFO] 
[INFO] --- tycho-packaging-plugin:2.5.0:build-qualifier-aggregator (default-build-qualifier-aggregator) @ org.eclipse.emf.transaction.tests ---
[INFO] The project's OSGi version is 1.12.0.202206220708
[INFO] 
[INFO] --- tycho-packaging-plugin:2.5.0:validate-id (default-validate-id) @ org.eclipse.emf.transaction.tests ---
[INFO] 
[INFO] --- tycho-packaging-plugin:2.5.0:validate-version (default-validate-version) @ org.eclipse.emf.transaction.tests ---
[INFO] 
[INFO] --- target-platform-configuration:2.5.0:target-platform (default-target-platform) @ org.eclipse.emf.transaction.tests ---
[INFO] 
[INFO] --- maven-antrun-plugin:3.0.0:run (replace-build-token) @ org.eclipse.emf.transaction.tests ---
[INFO] Executing tasks
[INFO] Executed tasks
[INFO] 
[INFO] --- tycho-source-plugin:2.5.0:plugin-source (plugin-source) @ org.eclipse.emf.transaction.tests ---
[INFO] 
[INFO] --- tycho-packaging-plugin:2.5.0:package-feature (default-package-feature) @ org.eclipse.emf.transaction.tests ---
[INFO] Fetching org.eclipse.test_3.4.500.v20200422-1752.jar.pack.gz from https://download.eclipse.org/eclipse/updates/4.16/R-4.16-202006040540/plugins/ (21.76kB)
[INFO] Fetching org.eclipse.ant.optional.junit_3.3.300.v20180822-0818.jar.pack.gz from https://download.eclipse.org/eclipse/updates/4.16/R-4.16-202006040540/plugins/ (6.78kB)
[INFO] Building jar: /home/jenkins/agent/workspace/emf-transaction-master/PLATFORM/2020-06/jdk/openjdk-jdk11-latest/label/migration/org.eclipse.emf.transaction.tests-feature/target/org.eclipse.emf.transaction.tests-1.12.0-SNAPSHOT.jar
[INFO] 
[INFO] --- tycho-p2-plugin:2.5.0:p2-metadata-default (default-p2-metadata-default) @ org.eclipse.emf.transaction.tests ---
[INFO] 
[INFO] --- tycho-p2-plugin:2.5.0:feature-p2-metadata (default-feature-p2-metadata) @ org.eclipse.emf.transaction.tests ---
[INFO] 
[INFO] --- eclipse-jarsigner-plugin:1.3.2:sign (sign) @ org.eclipse.emf.transaction.tests ---
[INFO] Signing jar: /home/jenkins/agent/workspace/emf-transaction-master/PLATFORM/2020-06/jdk/openjdk-jdk11-latest/label/migration/org.eclipse.emf.transaction.tests-feature/target/org.eclipse.emf.transaction.tests-1.12.0-SNAPSHOT.jar
[INFO] 
[INFO] --< org.eclipse.emf.transaction.features:org.eclipse.emf.transaction.sdk >--
[INFO] Building org.eclipse.emf.transaction.sdk 1.12.0-SNAPSHOT         [25/27]
[INFO] --------------------------[ eclipse-feature ]---------------------------
[INFO] 
[INFO] --- maven-clean-plugin:2.5:clean (default-clean) @ org.eclipse.emf.transaction.sdk ---
[INFO] 
[INFO] --- tycho-packaging-plugin:2.5.0:build-qualifier-aggregator (default-build-qualifier-aggregator) @ org.eclipse.emf.transaction.sdk ---
[INFO] The project's OSGi version is 1.12.0.202206220708
[INFO] 
[INFO] --- tycho-packaging-plugin:2.5.0:validate-id (default-validate-id) @ org.eclipse.emf.transaction.sdk ---
[INFO] 
[INFO] --- tycho-packaging-plugin:2.5.0:validate-version (default-validate-version) @ org.eclipse.emf.transaction.sdk ---
[INFO] 
[INFO] --- target-platform-configuration:2.5.0:target-platform (default-target-platform) @ org.eclipse.emf.transaction.sdk ---
[INFO] 
[INFO] --- maven-antrun-plugin:3.0.0:run (replace-build-token) @ org.eclipse.emf.transaction.sdk ---
[INFO] Executing tasks
[INFO] Executed tasks
[INFO] 
[INFO] --- tycho-source-plugin:2.5.0:plugin-source (plugin-source) @ org.eclipse.emf.transaction.sdk ---
[INFO] 
[INFO] --- tycho-packaging-plugin:2.5.0:package-feature (default-package-feature) @ org.eclipse.emf.transaction.sdk ---
[INFO] Building jar: /home/jenkins/agent/workspace/emf-transaction-master/PLATFORM/2020-06/jdk/openjdk-jdk11-latest/label/migration/org.eclipse.emf.transaction.sdk-feature/target/org.eclipse.emf.transaction.sdk-1.12.0-SNAPSHOT.jar
[INFO] 
[INFO] --- tycho-p2-plugin:2.5.0:p2-metadata-default (default-p2-metadata-default) @ org.eclipse.emf.transaction.sdk ---
[INFO] 
[INFO] --- tycho-p2-plugin:2.5.0:feature-p2-metadata (default-feature-p2-metadata) @ org.eclipse.emf.transaction.sdk ---
[INFO] 
[INFO] --- eclipse-jarsigner-plugin:1.3.2:sign (sign) @ org.eclipse.emf.transaction.sdk ---
[INFO] Signing jar: /home/jenkins/agent/workspace/emf-transaction-master/PLATFORM/2020-06/jdk/openjdk-jdk11-latest/label/migration/org.eclipse.emf.transaction.sdk-feature/target/org.eclipse.emf.transaction.sdk-1.12.0-SNAPSHOT.jar
[INFO] 
[INFO] --< org.eclipse.emf.transaction.features:org.eclipse.emf.transaction.master >--
[INFO] Building org.eclipse.emf.transaction.master 1.12.0-SNAPSHOT      [26/27]
[INFO] --------------------------[ eclipse-feature ]---------------------------
[INFO] 
[INFO] --- maven-clean-plugin:2.5:clean (default-clean) @ org.eclipse.emf.transaction.master ---
[INFO] 
[INFO] --- tycho-packaging-plugin:2.5.0:build-qualifier-aggregator (default-build-qualifier-aggregator) @ org.eclipse.emf.transaction.master ---
[INFO] The project's OSGi version is 1.12.0.202206220708
[INFO] 
[INFO] --- tycho-packaging-plugin:2.5.0:validate-id (default-validate-id) @ org.eclipse.emf.transaction.master ---
[INFO] 
[INFO] --- tycho-packaging-plugin:2.5.0:validate-version (default-validate-version) @ org.eclipse.emf.transaction.master ---
[INFO] 
[INFO] --- target-platform-configuration:2.5.0:target-platform (default-target-platform) @ org.eclipse.emf.transaction.master ---
[INFO] 
[INFO] --- maven-antrun-plugin:3.0.0:run (replace-build-token) @ org.eclipse.emf.transaction.master ---
[INFO] Executing tasks
[INFO] Executed tasks
[INFO] 
[INFO] --- tycho-source-plugin:2.5.0:plugin-source (plugin-source) @ org.eclipse.emf.transaction.master ---
[INFO] 
[INFO] --- tycho-packaging-plugin:2.5.0:package-feature (default-package-feature) @ org.eclipse.emf.transaction.master ---
[INFO] Building jar: /home/jenkins/agent/workspace/emf-transaction-master/PLATFORM/2020-06/jdk/openjdk-jdk11-latest/label/migration/org.eclipse.emf.transaction.master-feature/target/org.eclipse.emf.transaction.master-1.12.0-SNAPSHOT.jar
[INFO] 
[INFO] --- tycho-p2-plugin:2.5.0:p2-metadata-default (default-p2-metadata-default) @ org.eclipse.emf.transaction.master ---
[INFO] 
[INFO] --- tycho-p2-plugin:2.5.0:feature-p2-metadata (default-feature-p2-metadata) @ org.eclipse.emf.transaction.master ---
[INFO] 
[INFO] --- eclipse-jarsigner-plugin:1.3.2:sign (sign) @ org.eclipse.emf.transaction.master ---
[INFO] Signing jar: /home/jenkins/agent/workspace/emf-transaction-master/PLATFORM/2020-06/jdk/openjdk-jdk11-latest/label/migration/org.eclipse.emf.transaction.master-feature/target/org.eclipse.emf.transaction.master-1.12.0-SNAPSHOT.jar
[INFO] 
[INFO] --< org.eclipse.emf.transaction:org.eclipse.emf.transaction.repository >--
[INFO] Building org.eclipse.emf.transaction.repository 1.12.0-SNAPSHOT  [27/27]
[INFO] -------------------------[ eclipse-repository ]-------------------------
[INFO] 
[INFO] --- maven-clean-plugin:2.5:clean (default-clean) @ org.eclipse.emf.transaction.repository ---
[INFO] 
[INFO] --- tycho-packaging-plugin:2.5.0:build-qualifier-aggregator (default-build-qualifier-aggregator) @ org.eclipse.emf.transaction.repository ---
[INFO] The project's OSGi version is 1.12.0.202206220708
[INFO] 
[INFO] --- maven-clean-plugin:2.5:clean (default-clean-1) @ org.eclipse.emf.transaction.repository ---
[INFO] 
[INFO] --- target-platform-configuration:2.5.0:target-platform (default-target-platform) @ org.eclipse.emf.transaction.repository ---
[INFO] 
[INFO] --- maven-antrun-plugin:3.0.0:run (replace-build-token) @ org.eclipse.emf.transaction.repository ---
[INFO] Executing tasks
[INFO] Executed tasks
[INFO] 
[INFO] --- maven-resources-plugin:2.4.3:resources (default-resources) @ org.eclipse.emf.transaction.repository ---
[INFO] Using 'UTF-8' encoding to copy filtered resources.
[INFO] skip non existing resourceDirectory /home/jenkins/agent/workspace/emf-transaction-master/PLATFORM/2020-06/jdk/openjdk-jdk11-latest/label/migration/org.eclipse.emf.transaction.repository/src/main/resources
[INFO] 
[INFO] --- tycho-p2-publisher-plugin:2.5.0:publish-osgi-ee (default-publish-osgi-ee) @ org.eclipse.emf.transaction.repository ---
[INFO] Published profile IUs: [a.jre.javase 11.0.0]
[INFO] Published profile IUs: [a.jre.javase 16.0.0]
[INFO] Published profile IUs: [a.jre.javase 17.0.0]
[INFO] 
[INFO] --- tycho-p2-publisher-plugin:2.5.0:publish-products (default-publish-products) @ org.eclipse.emf.transaction.repository ---
[INFO] 
[INFO] --- tycho-p2-publisher-plugin:2.5.0:publish-categories (default-publish-categories) @ org.eclipse.emf.transaction.repository ---
[INFO] 
[INFO] --- tycho-p2-publisher-plugin:2.5.0:attach-artifacts (default-attach-artifacts) @ org.eclipse.emf.transaction.repository ---
[INFO] 
[INFO] --- tycho-p2-repository-plugin:2.5.0:assemble-repository (default-assemble-repository) @ org.eclipse.emf.transaction.repository ---
[INFO] Fetching org.apache.ant_1.10.8.v20200515-1239.jar.pack.gz from https://download.eclipse.org/eclipse/updates/4.16/R-4.16-202006040540/plugins/ (2.86MB)
[INFO] Fetching org.apiguardian_1.1.0.v20190826-0900.jar.pack.gz from https://download.eclipse.org/eclipse/updates/4.16/R-4.16-202006040540/plugins/ (12.57kB)
[INFO] Fetching org.eclipse.debug.core_3.15.100.v20200514-0816.jar.pack.gz from https://download.eclipse.org/eclipse/updates/4.16/R-4.16-202006040540/plugins/ (124.57kB)
[INFO] Fetching org.eclipse.debug.ui_3.14.500.v20200520-0842.jar.pack.gz from https://download.eclipse.org/eclipse/updates/4.16/R-4.16-202006040540/plugins/ (1MB)
[INFO] Fetching 509109261ca5001a13d8d4af19f0778a from https://download.eclipse.org/modeling/emf/emf/builds/release/2.22/.blobstore/22/ (126.91kB)
[INFO] Fetching org.eclipse.jdt.core_3.22.0.v20200530-2032.jar from https://download.eclipse.org/eclipse/updates/4.16/R-4.16-202006040540/plugins/ (6.83MB)
[INFO] Fetching org.eclipse.jdt.launching_3.17.100.v20200526-1503.jar.pack.gz from https://download.eclipse.org/eclipse/updates/4.16/R-4.16-202006040540/plugins/ (281.75kB)
[INFO] Fetching 90d72f291ca5001a13d8d4af19f0778a from https://download.eclipse.org/modeling/emf/emf/builds/release/2.22/.blobstore/78/ (417.98kB)
[INFO] Fetching a0eda6271ca5001a13d8d4af19f0778a from https://download.eclipse.org/modeling/emf/emf/builds/release/2.22/.blobstore/40/ (37.46kB)
[INFO] Fetching f0cd40261ca5001a13d8d4af19f0778a from https://download.eclipse.org/modeling/emf/emf/builds/release/2.22/.blobstore/2a/ (30.42kB)
[INFO] Fetching 908082281ca5001a13d8d4af19f0778a from https://download.eclipse.org/modeling/emf/emf/builds/release/2.22/.blobstore/24/ (20.51kB)
[INFO] Fetching 90fd762a1ca5001a13d8d4af19f0778a from https://download.eclipse.org/modeling/emf/emf/builds/release/2.22/.blobstore/6a/ (11.89kB)
[INFO] Fetching 90af062a1ca5001a13d8d4af19f0778a from https://download.eclipse.org/modeling/emf/emf/builds/release/2.22/.blobstore/7a/ (19.44kB)
[INFO] Fetching b0ff592a1ca5001a13d8d4af19f0778a from https://download.eclipse.org/modeling/emf/emf/builds/release/2.22/.blobstore/27/ (36.3kB)
[INFO] Fetching 1066ed2a1ca5001a13d8d4af19f0778a from https://download.eclipse.org/modeling/emf/emf/builds/release/2.22/.blobstore/36/ (10.48kB)
[INFO] Fetching 303ee3281ca5001a13d8d4af19f0778a from https://download.eclipse.org/modeling/emf/emf/builds/release/2.22/.blobstore/41/ (45.49kB)
[INFO] Fetching a07205261ca5001a13d8d4af19f0778a from https://download.eclipse.org/modeling/emf/emf/builds/release/2.22/.blobstore/3b/ (19.75kB)
[INFO] Fetching 60c9032a1ca5001a13d8d4af19f0778a from https://download.eclipse.org/modeling/emf/emf/builds/release/2.22/.blobstore/8/ (24.2kB)
[INFO] Fetching d08448281ca5001a13d8d4af19f0778a from https://download.eclipse.org/modeling/emf/emf/builds/release/2.22/.blobstore/20/ (8.29kB)
[INFO] Fetching c03dfa271ca5001a13d8d4af19f0778a from https://download.eclipse.org/modeling/emf/emf/builds/release/2.22/.blobstore/21/ (31.48kB)
[INFO] Fetching 901cf2261ca5001a13d8d4af19f0778a from https://download.eclipse.org/modeling/emf/emf/builds/release/2.22/.blobstore/4b/ (19.73kB)
[INFO] Fetching 40e104271ca5001a13d8d4af19f0778a from https://download.eclipse.org/modeling/emf/emf/builds/release/2.22/.blobstore/8/ (14.43kB)
[INFO] Fetching 9069e22a1ca5001a13d8d4af19f0778a from https://download.eclipse.org/modeling/emf/emf/builds/release/2.22/.blobstore/d/ (32.53kB)
[INFO] Fetching org.eclipse.emf.examples_2.18.0.v20200518-1440.jar from https://download.eclipse.org/modeling/emf/emf/builds/release/2.22/features/ (19.25kB)
[INFO] Fetching org.eclipse.jdt.ui_3.21.100.v20200602-0959.jar.pack.gz from https://download.eclipse.org/eclipse/updates/4.16/R-4.16-202006040540/plugins/ (3.94MB)
[INFO] Fetching d01528261ca5001a13d8d4af19f0778a from https://download.eclipse.org/modeling/emf/emf/builds/release/2.22/.blobstore/e/ (30.21kB)
[INFO] Fetching org.eclipse.emf.validation.doc_1.3.0.201812070911.jar from https://download.eclipse.org/modeling/emf/validation/updates/releases/R201812070911/plugins/ (14.19kB)
[INFO] Fetching org.eclipse.emf.validation.examples_1.3.0.201812070911.jar from https://download.eclipse.org/modeling/emf/validation/updates/releases/R201812070911/plugins/ (179.92kB)
[INFO] Fetching org.eclipse.emf.validation.doc_1.12.1.201812070911.jar from https://download.eclipse.org/modeling/emf/validation/updates/releases/R201812070911/features/ (21.33kB)
[INFO] Fetching org.eclipse.emf.validation.ui_1.7.0.201812070911.jar from https://download.eclipse.org/modeling/emf/validation/updates/releases/R201812070911/plugins/ (74.26kB)
[INFO] Fetching org.eclipse.emf.validation.ui.ide_1.3.0.201812070911.jar from https://download.eclipse.org/modeling/emf/validation/updates/releases/R201812070911/plugins/ (22.4kB)
[INFO] Fetching org.eclipse.emf.validation_1.12.1.201812070911.jar from https://download.eclipse.org/modeling/emf/validation/updates/releases/R201812070911/features/ (21.67kB)
[INFO] Fetching org.eclipse.emf.validation.ocl_1.4.0.201812070911.jar from https://download.eclipse.org/modeling/emf/validation/updates/releases/R201812070911/plugins/ (20.89kB)
[INFO] Fetching 6.12.0&format=xml&countryCode=us&timeZone=0&format=xml from http://www.eclipse.org/downloads/download.php?file=/modeling/mdt/ocl/updates/releases/ (63B)
[INFO] Fetching org.eclipse.ocl_3.15.0.v20200608-1555.jar from https://download.eclipse.org/modeling/mdt/ocl/updates/releases/6.12.0/plugins/ (1.14MB)
[INFO] Fetching org.eclipse.ocl.ecore_3.15.0.v20200608-1555.jar.pack.gz from https://download.eclipse.org/modeling/mdt/ocl/updates/releases/6.12.0/plugins/ (111.44kB)
[INFO] Fetching org.eclipse.emf.validation.ocl_1.12.1.201812070911.jar from https://download.eclipse.org/modeling/emf/validation/updates/releases/R201812070911/features/ (21.59kB)
[INFO] Fetching org.eclipse.emf.validation.ocl.source_1.4.0.201812070911.jar from https://download.eclipse.org/modeling/emf/validation/updates/releases/R201812070911/plugins/ (13.41kB)
[INFO] Fetching org.eclipse.emf.validation.ocl.source_1.12.1.201812070911.jar from https://download.eclipse.org/modeling/emf/validation/updates/releases/R201812070911/features/ (21.24kB)
[INFO] Fetching org.eclipse.emf.validation.sdk_1.12.1.201812070911.jar from https://download.eclipse.org/modeling/emf/validation/updates/releases/R201812070911/features/ (21.24kB)
[INFO] Fetching org.eclipse.emf.validation.source_1.8.0.201812070911.jar from https://download.eclipse.org/modeling/emf/validation/updates/releases/R201812070911/plugins/ (324.23kB)
[INFO] Fetching org.eclipse.emf.validation.ui.source_1.7.0.201812070911.jar from https://download.eclipse.org/modeling/emf/validation/updates/releases/R201812070911/plugins/ (54.07kB)
[INFO] Fetching org.eclipse.emf.validation.ui.ide.source_1.3.0.201812070911.jar from https://download.eclipse.org/modeling/emf/validation/updates/releases/R201812070911/plugins/ (19.07kB)
[INFO] Fetching org.eclipse.emf.validation.source_1.12.1.201812070911.jar from https://download.eclipse.org/modeling/emf/validation/updates/releases/R201812070911/features/ (21.29kB)
[INFO] Fetching org.eclipse.jdt.core.manipulation_1.14.0.v20200526-0740.jar.pack.gz from https://download.eclipse.org/eclipse/updates/4.16/R-4.16-202006040540/plugins/ (493.48kB)
[INFO] Fetching org.eclipse.jdt.debug_3.15.100.v20200525-2012.jar.pack.gz from https://download.eclipse.org/eclipse/updates/4.16/R-4.16-202006040540/plugins/ (966.69kB)
[INFO] Fetching org.eclipse.search_3.11.1000.v20200410-1852.jar.pack.gz from https://download.eclipse.org/eclipse/updates/4.16/R-4.16-202006040540/plugins/ (215.04kB)
[INFO] Fetching lpg.runtime.java_2.0.17.v201004271640.jar.pack.gz from https://download.eclipse.org/modeling/mdt/ocl/updates/releases/6.12.0/plugins/ (48.92kB)
[INFO] Fetching org.eclipse.ocl.common_1.8.400.v20200608-1555.jar.pack.gz from https://download.eclipse.org/modeling/mdt/ocl/updates/releases/6.12.0/plugins/ (14.75kB)
[INFO] Fetching org.junit.jupiter.api_5.6.0.v20200203-2009.jar.pack.gz from https://download.eclipse.org/eclipse/updates/4.16/R-4.16-202006040540/plugins/ (56.99kB)
[INFO] Fetching org.junit.jupiter.engine_5.6.0.v20200203-2009.jar.pack.gz from https://download.eclipse.org/eclipse/updates/4.16/R-4.16-202006040540/plugins/ (72.22kB)
[INFO] Fetching org.junit.platform.commons_1.6.0.v20200203-2009.jar.pack.gz from https://download.eclipse.org/eclipse/updates/4.16/R-4.16-202006040540/plugins/ (50.23kB)
[INFO] Fetching org.junit.platform.engine_1.6.0.v20200203-2009.jar.pack.gz from https://download.eclipse.org/eclipse/updates/4.16/R-4.16-202006040540/plugins/ (58.76kB)
[INFO] Fetching org.junit.platform.launcher_1.6.0.v20200203-2009.jar.pack.gz from https://download.eclipse.org/eclipse/updates/4.16/R-4.16-202006040540/plugins/ (50.12kB)
[INFO] Fetching org.junit.vintage.engine_5.6.0.v20200203-2009.jar.pack.gz from https://download.eclipse.org/eclipse/updates/4.16/R-4.16-202006040540/plugins/ (33.61kB)
[INFO] Fetching org.opentest4j_1.2.0.v20190826-0900.jar.pack.gz from https://download.eclipse.org/eclipse/updates/4.16/R-4.16-202006040540/plugins/ (14.79kB)
[INFO] 
[INFO] --- tycho-source-plugin:2.5.0:plugin-source (plugin-source) @ org.eclipse.emf.transaction.repository ---
[INFO] 
[INFO] --- tycho-p2-repository-plugin:2.5.0:archive-repository (default-archive-repository) @ org.eclipse.emf.transaction.repository ---
[INFO] Building zip: /home/jenkins/agent/workspace/emf-transaction-master/PLATFORM/2020-06/jdk/openjdk-jdk11-latest/label/migration/org.eclipse.emf.transaction.repository/target/org.eclipse.emf.transaction.repository-1.12.0-SNAPSHOT.zip
[INFO] 
[INFO] --- eclipse-jarsigner-plugin:1.3.2:sign (sign) @ org.eclipse.emf.transaction.repository ---
[INFO] ------------------------------------------------------------------------
[INFO] Reactor Summary:
[INFO] 
[INFO] org.eclipse.emf.transaction.releng 1.12.0-SNAPSHOT . SUCCESS [  6.580 s]
[INFO] org.eclipse.emf.transaction.target 1.12.0-SNAPSHOT . SUCCESS [  0.943 s]
[INFO] org.eclipse.emf.transaction 1.9.1-SNAPSHOT ......... SUCCESS [ 12.564 s]
[INFO] org.eclipse.emf.transaction.ui 1.4.0-SNAPSHOT ...... SUCCESS [  2.759 s]
[INFO] org.eclipse.emf.workspace 1.5.1-SNAPSHOT ........... SUCCESS [  2.835 s]
[INFO] org.eclipse.emf.workspace.ui 1.3.0-SNAPSHOT ........ SUCCESS [  2.318 s]
[INFO] org.eclipse.emf.transaction.doc 1.4.0-SNAPSHOT ..... SUCCESS [  1.991 s]
[INFO] org.eclipse.emf.workspace.doc 1.3.0-SNAPSHOT ....... SUCCESS [  1.892 s]
[INFO] org.eclipse.emf.transaction.examples 1.2.100-SNAPSHOT SUCCESS [  5.189 s]
[INFO] org.eclipse.emf.workspace.examples 1.2.0-SNAPSHOT .. SUCCESS [  1.920 s]
[INFO] org.eclipse.emf.workspace.examples.library.editor 1.2.0-SNAPSHOT SUCCESS [  2.473 s]
[INFO] org.eclipse.emf.transaction.tests 1.10.1-SNAPSHOT .. SUCCESS [01:53 min]
[INFO] org.eclipse.emf.workspace.tests 1.10.0-SNAPSHOT .... SUCCESS [ 12.919 s]
[INFO] org.eclipse.emf.transaction 1.12.0-SNAPSHOT ........ SUCCESS [  1.289 s]
[INFO] org.eclipse.emf.transaction.source 1.12.0-SNAPSHOT . SUCCESS [  0.944 s]
[INFO] org.eclipse.emf.workspace 1.12.0-SNAPSHOT .......... SUCCESS [  1.244 s]
[INFO] org.eclipse.emf.workspace.source 1.12.0-SNAPSHOT ... SUCCESS [  1.270 s]
[INFO] org.eclipse.emf.workspace.examples 1.12.0-SNAPSHOT . SUCCESS [  1.008 s]
[INFO] org.eclipse.emf.transaction.examples 1.12.0-SNAPSHOT SUCCESS [  1.049 s]
[INFO] org.eclipse.emf.transaction.examples.source 1.12.0-SNAPSHOT SUCCESS [  0.991 s]
[INFO] org.eclipse.emf.workspace.doc 1.12.0-SNAPSHOT ...... SUCCESS [  1.078 s]
[INFO] org.eclipse.emf.transaction.doc 1.12.0-SNAPSHOT .... SUCCESS [  1.192 s]
[INFO] org.eclipse.emf.workspace.examples.source 1.12.0-SNAPSHOT SUCCESS [  0.905 s]
[INFO] org.eclipse.emf.transaction.tests 1.12.0-SNAPSHOT .. SUCCESS [  1.289 s]
[INFO] org.eclipse.emf.transaction.sdk 1.12.0-SNAPSHOT .... SUCCESS [  1.310 s]
[INFO] org.eclipse.emf.transaction.master 1.12.0-SNAPSHOT . SUCCESS [  1.024 s]
[INFO] org.eclipse.emf.transaction.repository 1.12.0-SNAPSHOT SUCCESS [ 10.625 s]
[INFO] ------------------------------------------------------------------------
[INFO] BUILD SUCCESS
[INFO] ------------------------------------------------------------------------
[INFO] Total time:  03:46 min
[INFO] Finished at: 2022-06-22T07:12:28Z
[INFO] ------------------------------------------------------------------------
[migration] $ /bin/sh -xe /tmp/jenkins8504352455051789060.sh
+ '[' 2020-06 = oxygen ']'
Terminating xvnc.
$ ssh-agent -k
unset SSH_AUTH_SOCK;
unset SSH_AGENT_PID;
echo Agent pid 65 killed;
[ssh-agent] Stopped.
Archiving artifacts
‘update-site/**’ doesn’t match anything, but ‘**’ does. Perhaps that’s what you mean?
No artifacts found that match the file pattern "update-site/**". Configuration error?
Recording test results
[Checks API] No suitable checks publisher found.
Build step 'Publish JUnit test result report' changed build result to UNSTABLE
Sending e-mails to: pierre-charles.david@obeo.fr
Finished: UNSTABLE