UnstableConsole Output

Started by upstream job "master-rcptt-nightly" build number 493
Checkout:collaborative-modeling-luna / /home/hudson/genie.emfcompare/.hudson/jobs/master-rcptt-nightly/workspace/PLATFORM/collaborative-modeling-luna - hudson.remoting.LocalChannel@224b16f5
Using strategy: Default
Git Exe: git
Last Built Revision: Revision 85571f4a0b0ce4ea1edea21d0c817f44a694816a (origin/master)
Checkout:collaborative-modeling-luna / /home/hudson/genie.emfcompare/.hudson/jobs/master-rcptt-nightly/workspace/PLATFORM/collaborative-modeling-luna - hudson.remoting.LocalChannel@224b16f5
Fetching changes from the remote Git repository
Fetching upstream changes from /gitroot/emfcompare/org.eclipse.emf.compare.git
Commencing build of Revision d8af5faeb2bff1a0658af54957deb7012c7e4b0c (origin/master)
Checking out Revision d8af5faeb2bff1a0658af54957deb7012c7e4b0c (origin/master)
Starting xvnc
[collaborative-modeling-luna] $ Xvnc :643 -geometry 1024x768 -depth 24 -ac
[collaborative-modeling-luna] $ /bin/sh -xe /tmp/genie.emfcompare/hudson9174345615442699737.sh
+ wget -m http://download.eclipse.org/rcptt/release/2.0.0/runner/rcptt.runner-2.0.0.zip
--2016-10-17 20:21:26--  http://download.eclipse.org/rcptt/release/2.0.0/runner/rcptt.runner-2.0.0.zip
Resolving download.eclipse.org... 17/10/2016 20:21:26 Xvnc version X.org/xf4vnc custom version
17/10/2016 20:21:26 Copyright (C) 2001-2004 Alan Hourihane.
17/10/2016 20:21:26 Copyright (C) 2000-2004 Constantin Kaplinsky
17/10/2016 20:21:26 Copyright (C) 1999 AT&T Laboratories Cambridge
17/10/2016 20:21:26 All Rights Reserved.
17/10/2016 20:21:26 See http://www.tightvnc.com/ for information on TightVNC
17/10/2016 20:21:26 See http://xf4vnc.sf.net for xf4vnc-specific information
17/10/2016 20:21:26 Desktop name 'x11' (hipp6:643)
17/10/2016 20:21:26 Protocol versions supported: 3.7, 3.3
17/10/2016 20:21:26 RGB format 8 8 8
17/10/2016 20:21:26 Listening for VNC connections on TCP port 6543
172.30.206.10
Connecting to download.eclipse.org|172.30.206.10|:80... connected.
HTTP request sent, awaiting response... 200 OK
Length: 167708087 (160M) [application/zip]
Server file no newer than local file `download.eclipse.org/rcptt/release/2.0.0/runner/rcptt.runner-2.0.0.zip' -- not retrieving.

[dix] Could not init font path element /usr/share/fonts/TTF/, removing from list!
[dix] Could not init font path element /usr/share/fonts/OTF, removing from list!
[INFO] Using Maven 3 installation: Maven 3.2.1
[INFO] Checking Maven 3 installation environment
[collaborative-modeling-luna] $ /shared/common/apache-maven-3.2.1/bin/mvn --help
(EE) config/hal: NewInputDeviceRequest failed (2)
(EE) config/hal: NewInputDeviceRequest failed (2)
[INFO] Checking Maven 3 installation version
[INFO] Detected Maven 3 installation version: 3.2.1
[collaborative-modeling-luna] $ /shared/common/apache-maven-3.2.1/bin/mvn clean verify -V -B -e -DPLATFORM=collaborative-modeling-luna -Drcpttrunner=/home/hudson/genie.emfcompare/.hudson/jobs/master-rcptt-nightly/workspace/PLATFORM/collaborative-modeling-luna/download.eclipse.org/rcptt/release/2.0.0/runner/rcptt.runner-2.0.0.zip -Dmaven.ext.class.path=/home/hudson/genie.emfcompare/.hudson/maven/slavebundle/resources:/home/hudson/genie.emfcompare/.hudson/maven/slavebundle/lib/maven3-eventspy-3.1.jar:/home/hudson/genie.emfcompare/.hudson/war/webapp/WEB-INF/lib/hudson-remoting-3.0.3.jar -Dhudson.eventspy.port=40931 -Dmaven.repo.local=/home/hudson/genie.emfcompare/.hudson/jobs/master-rcptt-nightly/workspace/PLATFORM/collaborative-modeling-luna/.maven/repo -f plugins/org.eclipse.emf.compare.rcptt.tests/pom.xml -P collaborative-modeling-luna -fae
[DEBUG] Waiting for connection on port: 40931
Apache Maven 3.2.1 (ea8b2b07643dbb1b84b6d16e1f08391b666bc1e9; 2014-02-14T12:37:52-05:00)
Maven home: /shared/common/apache-maven-3.2.1
Java version: 1.7.0_80, vendor: Oracle Corporation
Java home: /opt/public/common/jdk1.7.0_80/jre
Default locale: en_US, platform encoding: UTF-8
OS name: "linux", version: "3.0.101-0.47.71-default", arch: "amd64", family: "unix"
SLF4J: Class path contains multiple SLF4J bindings.
SLF4J: Found binding in [jar:file:/home/hudson/genie.emfcompare/.hudson/maven/slavebundle/lib/maven3-eventspy-runtime.jar!/org/slf4j/impl/StaticLoggerBinder.class]
SLF4J: Found binding in [jar:file:/shared/common/apache-maven-3.2.1/lib/slf4j-simple-1.7.5.jar!/org/slf4j/impl/StaticLoggerBinder.class]
SLF4J: See http://www.slf4j.org/codes.html#multiple_bindings for an explanation.
[DEBUG] Connected to remote
[INFO] Error stacktraces are turned on.
[INFO] Scanning for projects...
[INFO] 
[INFO] Using the builder org.apache.maven.lifecycle.internal.builder.singlethreaded.SingleThreadedBuilder with a thread count of 1
[INFO]                                                                         
[INFO] ------------------------------------------------------------------------
[INFO] Building org.eclipse.emf.compare.rcptt.test 4.0.0-SNAPSHOT
[INFO] ------------------------------------------------------------------------
Downloading: https://repo.eclipse.org/content/repositories/rcptt-releases/org/apache/maven/plugins/maven-install-plugin/maven-metadata.xml
Downloading: https://repo.eclipse.org/content/repositories/rcptt-releases/org/apache/maven/plugins/maven-deploy-plugin/maven-metadata.xml
[INFO] 
[INFO] --- maven-clean-plugin:2.5:clean (default-clean) @ org.eclipse.emf.compare.rcptt.test ---
[INFO] Deleting /jobs/genie.emfcompare/master-rcptt-nightly/workspace/PLATFORM/collaborative-modeling-luna/plugins/org.eclipse.emf.compare.rcptt.tests/target
[INFO] 
[INFO] --- exec-maven-plugin:1.2.1:exec (AUT Generation) @ org.eclipse.emf.compare.rcptt.test ---
Downloading http://download.eclipse.org/modeling/emf/compare/collaborative-modeling-luna-package/nightly/Collaborative-Modeling-Luna-linux-gtk-x86_64.tar.gz
Unzipping Collaborative-Modeling-Luna-linux-gtk-x86_64.tar.gz
Renaming Collaborative-Modeling-Luna-linux-gtk-x86_64 to eclipse
[INFO] 
[INFO] --- rcptt-maven-plugin:2.0.0:resources (default-resources) @ org.eclipse.emf.compare.rcptt.test ---
[INFO] Using AUT from /jobs/genie.emfcompare/master-rcptt-nightly/workspace/PLATFORM/collaborative-modeling-luna/plugins/org.eclipse.emf.compare.rcptt.tests/target/collaborative-modeling-luna/eclipse
[INFO] Extracting RCPTT runner to /jobs/genie.emfcompare/master-rcptt-nightly/workspace/PLATFORM/collaborative-modeling-luna/plugins/org.eclipse.emf.compare.rcptt.tests/target/runner
[INFO] Copying project contents to target directory...
[INFO] 
[INFO] --- rcptt-maven-plugin:2.0.0:execute (default-execute) @ org.eclipse.emf.compare.rcptt.test ---
[INFO] Runner command line is /bin/sh -c cd /jobs/genie.emfcompare/master-rcptt-nightly/workspace/PLATFORM/collaborative-modeling-luna/plugins/org.eclipse.emf.compare.rcptt.tests/target/runner/eclipse && /opt/public/common/jdk1.7.0_80/jre/bin/java -Xms128m -Xmx256m -Dorg.eclipse.rcptt.runner.returnTestFailure=true -XX:MaxPermSize=256m -jar /jobs/genie.emfcompare/master-rcptt-nightly/workspace/PLATFORM/collaborative-modeling-luna/plugins/org.eclipse.emf.compare.rcptt.tests/target/runner/eclipse/plugins/org.eclipse.equinox.launcher_1.3.100.v20150511-1540.jar -application org.eclipse.rcptt.runner.headless -data /jobs/genie.emfcompare/master-rcptt-nightly/workspace/PLATFORM/collaborative-modeling-luna/plugins/org.eclipse.emf.compare.rcptt.tests/target/runner-workspace -aut /jobs/genie.emfcompare/master-rcptt-nightly/workspace/PLATFORM/collaborative-modeling-luna/plugins/org.eclipse.emf.compare.rcptt.tests/target/collaborative-modeling-luna/eclipse -autWsPrefix /jobs/genie.emfcompare/master-rcptt-nightly/workspace/PLATFORM/collaborative-modeling-luna/plugins/org.eclipse.emf.compare.rcptt.tests/target/aut-ws- -autConsolePrefix /jobs/genie.emfcompare/master-rcptt-nightly/workspace/PLATFORM/collaborative-modeling-luna/plugins/org.eclipse.emf.compare.rcptt.tests/target/results/aut-console- -autVMArgs '-Xmx2048m;-XX:MaxPermSize=512m' -q7report /jobs/genie.emfcompare/master-rcptt-nightly/workspace/PLATFORM/collaborative-modeling-luna/plugins/org.eclipse.emf.compare.rcptt.tests/target/results/org.eclipse.emf.compare.rcptt.test.report -htmlReport /jobs/genie.emfcompare/master-rcptt-nightly/workspace/PLATFORM/collaborative-modeling-luna/plugins/org.eclipse.emf.compare.rcptt.tests/target/results/org.eclipse.emf.compare.rcptt.test.html -junitReport /jobs/genie.emfcompare/master-rcptt-nightly/workspace/PLATFORM/collaborative-modeling-luna/plugins/org.eclipse.emf.compare.rcptt.tests/target/surefire-reports/TEST-org.eclipse.emf.compare.rcptt.test.xml -import /jobs/genie.emfcompare/master-rcptt-nightly/workspace/PLATFORM/collaborative-modeling-luna/plugins/org.eclipse.emf.compare.rcptt.tests/target/projects/org.eclipse.emf.compare.rcptt.test -testOptions 'execTimeout=3600;testExecTimeout=300' -shutdownListenerPort 8128 -suites TestSuite.Full
[INFO] The execution timeout is set to 3600 seconds
[INFO] Started at Mon Oct 17 20:23:21 EDT 2016
[INFO] RCPTT Runner version: 2.0.0
[INFO] Initializing target platform...
[ERROR] Xlib:  extension "RANDR" missing on display ":643.0".
[INFO] Target platform is valid.
[INFO] Looking for tests...
[INFO] Existing projects in workspace:
[INFO]     <none>
[INFO] Importing projects to workspace:
[INFO] Refreshing projects:
[INFO]     /jobs/genie.emfcompare/master-rcptt-nightly/workspace/PLATFORM/collaborative-modeling-luna/plugins/org.eclipse.emf.compare.rcptt.tests/target/projects/org.eclipse.emf.compare.rcptt.test... OK
[INFO] Refreshing projects:
[INFO]     org.eclipse.emf.compare.rcptt.tests... OK
[INFO] Searching for tests in projects:
[INFO]     org.eclipse.emf.compare.rcptt.tests... 
[INFO] Complete OK
[INFO] Testcase Artifacts:164
[INFO] AUT-0:Launching
[INFO] AUT-0:Product: org.eclipse.sdk.ide
[INFO] AUT-0:Application: org.eclipse.ui.ide.workbench
[INFO] AUT-0:Architecture: x86_64
[INFO] 64bit arch is selected because AUT uses launcher library
[INFO] 	"plugins/org.eclipse.equinox.launcher.gtk.linux.x86_64_1.1.200.v20150204-1316" specified in config file: eclipse.ini
[INFO] /jobs/genie.emfcompare/master-rcptt-nightly/workspace/PLATFORM/collaborative-modeling-luna/plugins/org.eclipse.emf.compare.rcptt.tests/target/aut-ws-0: AUT arguments: -os ${target.os} -arch ${target.arch} -consoleLog
[INFO] /jobs/genie.emfcompare/master-rcptt-nightly/workspace/PLATFORM/collaborative-modeling-luna/plugins/org.eclipse.emf.compare.rcptt.tests/target/aut-ws-0: AUT VM arguments: -Xms40m -Xmx512m -Xmx2048m -XX:MaxPermSize=512m
[INFO] Pass 1 (164) processed. 0 failed. spent: 0:11, 9:54 mins remaining. ts001_tc001_2-way_comparison. time: 11152ms 
[INFO] Fail 2 (164) processed. 1 failed. spent: 0:17, 11:24 mins remaining. ts001_tc002_2-way_synchro_smv_cmv. time: 5759ms  Cause: Failed to set selection: [[> extlibrary, > Book -> CirculatingItem, title : EString \[eStructuralFeatures add\]]].
[INFO] Pass 3 (164) processed. 1 failed. spent: 0:25, 13:20 mins remaining. ts001_tc003_2-way_textual_attribute_comparison. time: 6938ms 
[INFO] Fail 4 (164) processed. 2 failed. spent: 0:31, 13:41 mins remaining. ts001_tc004_2-way_next_difference. time: 5701ms  Cause: Failed to set selection: [[> extlibrary, > BookCategory, Manhwa = 5 \[eLiterals delete\]]].
[INFO] Pass 5 (164) processed. 2 failed. spent: 0:40, 15:02 mins remaining. ts001_tc005_2-way_compare_with_eobject_in_dialog. time: 9223ms 
[INFO] Pass 6 (164) processed. 2 failed. spent: 0:46, 15:02 mins remaining. ts001_tc006_2-way_compare_with_eobject_in_editor. time: 5172ms 
[INFO] Fail 7 (164) processed. 3 failed. spent: 0:54, 15:36 mins remaining. ts001_tc007_2-way_resource_attachment_change_uml. time: 7158ms  Cause: Assertion of itemCount failed: expected:<1> but was:<2>.
[INFO] Fail 8 (164) processed. 4 failed. spent: 1:00, 15:30 mins remaining. ts001_tc008_2-way_resource_attachment_change_multiple_uml. time: 5918ms  Cause: Assertion of itemCount failed: expected:<1> but was:<4>.
[INFO] Pass 9 (164) processed. 4 failed. spent: 1:11, 16:33 mins remaining. ts001_tc009_2-way_save_comparison_model. time: 10305ms 
[INFO] Pass 10 (164) processed. 4 failed. spent: 1:18, 16:34 mins remaining. ts001_tc010_2-way_opaque_action_body_change. time: 6981ms 
[INFO] Pass 11 (164) processed. 4 failed. spent: 1:29, 17:20 mins remaining. ts001_tc011_2-way_opaque_action_body_change_and_move. time: 9981ms 
[INFO] Pass 12 (164) processed. 4 failed. spent: 1:35, 17:04 mins remaining. ts002_tc001_3-way_comparison. time: 5510ms 
[INFO] Fail 13 (164) processed. 5 failed. spent: 1:41, 16:50 mins remaining. ts002_tc002_3-way_resource_attachment_change_multiple_uml. time: 6338ms  Cause: Assertion of childCount failed: expected:<1> but was:<3>.
[INFO] Fail 14 (164) processed. 6 failed. spent: 1:48, 16:45 mins remaining. ts002_tc003_3-way_show_ancestor_pane. time: 6786ms  Cause: Failed to set selection: [[> extlibrary, > Book -> CirculatingItem, title : EString \[eStructuralFeatures delete\]]].
[INFO] Pass 15 (164) processed. 6 failed. spent: 1:58, 18:18 mins remaining. ts002_tc004_3-way_save_comparison_model. time: 9005ms 
[INFO] Fail 16 (164) processed. 7 failed. spent: 2:05, 17:00 mins remaining. ts002_tc005_3-way_real_add_conflict. time: 6379ms  Cause: Assertion of getItems().length failed: expected:<3> but was:<2>.
[INFO] Fail 17 (164) processed. 8 failed. spent: 2:11, 16:46 mins remaining. ts002_tc006_3-way_real_add_conflict_2. time: 6205ms  Cause: Assertion of getItems().length failed: expected:<3> but was:<2>.
[INFO] Fail 18 (164) processed. 9 failed. spent: 2:17, 17:32 mins remaining. ts002_tc007_3-way_real_add_conflict_3. time: 5155ms  Cause: Assertion of getItems().TreeItem[0].getItems().length failed: expected:<3> but was:<1>.
[INFO] Fail 19 (164) processed. 10 failed. spent: 2:24, 16:27 mins remaining. ts002_tc008_3-way_opaque_action_body_change_conflict. time: 6020ms  Cause: Assertion of childCount failed: expected:<2> but was:<1>.
[INFO] Fail 20 (164) processed. 11 failed. spent: 2:29, 16:08 mins remaining. ts003_tc001_filter_identical_elements_cmv. time: 5087ms  Cause: Failed to set selection: [[> extlibrary, > Book -> CirculatingItem, title : EString \[eStructuralFeatures add\]]].
[INFO] Fail 21 (164) processed. 12 failed. spent: 2:35, 15:56 mins remaining. ts003_tc002_filter_pseudo_elements_cmv. time: 5107ms  Cause: Failed to set selection: [[> extlibrary, Author \[eClassifiers delete\]]].
[INFO] Fail 22 (164) processed. 13 failed. spent: 2:41, 15:45 mins remaining. ts003_tc003_filter_cascading_differences_cmv. time: 5817ms  Cause: Failed to set selection: [[> extlibrary, > Book -> CirculatingItem, title : EString \[eStructuralFeatures add\]]].
[INFO] Fail 23 (164) processed. 14 failed. spent: 2:46, 15:29 mins remaining. ts003_tc004_filter_uml_refined_elements_cmv. time: 4699ms  Cause: Failed to set selection: [[> <Package> library, <Association> booksToLibrarys \[packagedElement add\]]].
[INFO] Fail 24 (164) processed. 15 failed. spent: 2:51, 15:14 mins remaining. ts003_tc005_filter_empty_resource_mappings. time: 4660ms  Cause: Assertion of itemCount failed: expected:<1> but was:<2>.
[INFO] Fail 25 (164) processed. 16 failed. spent: 2:56, 14:59 mins remaining. ts003_tc006_filter_identical_elements. time: 5139ms  Cause: The Menu "[Identical elements]" could not be found.
[INFO] Fail 26 (164) processed. 17 failed. spent: 3:02, 14:50 mins remaining. ts003_tc007_filter_pseudo_elements. time: 5263ms  Cause: The Menu "[Pseudo conflicts differences]" could not be found.
[INFO] Fail 27 (164) processed. 18 failed. spent: 3:09, 14:46 mins remaining. ts003_tc009_filter_cascading_differences. time: 6476ms  Cause: The Item "[> extlibrary, Magazine -> CirculatingItem \[eClassifiers add\]]" could not be found.
[INFO] Fail 28 (164) processed. 19 failed. spent: 3:15, 14:37 mins remaining. ts003_tc010_filter_uml_refined_elements. time: 5875ms  Cause: Assertion of getItems().TreeItem[0].getItems().TreeItem[0].getText() failed: expected:<<Association> booksToLibrarys [packagedElement add]> but was:<> <Association> booksToLibrarys>.
[INFO] Fail 29 (164) processed. 20 failed. spent: 3:22, 14:33 mins remaining. ts003_tc011_filter_uml_refined_elements_check_order. time: 6442ms  Cause: Assertion of getItems().TreeItem[0].getText() failed: expected:<<Comment>   [ownedComment add]> but was:<> <Comment>>.
[INFO] Fail 30 (164) processed. 21 failed. spent: 3:38, 15:06 mins remaining. ts003_tc012_not_reseting_filter_after_save. time: 7480ms  Cause: The Menu "[Empty resource mappings]" could not be found.
[INFO] Fail 31 (164) processed. 22 failed. spent: 3:43, 14:52 mins remaining. ts003_tc013_filter_cascading_differences_move. time: 4775ms  Cause: Assertion of getItems().TreeItem[0].getItems().TreeItem[0].getItems().length failed: expected:<1> but was:<2>.
[INFO] Pass 32 (164) processed. 22 failed. spent: 3:52, 14:53 mins remaining. ts004_tc001_group_3-way_comparison. time: 8118ms 
[INFO] Pass 33 (164) processed. 22 failed. spent: 3:58, 14:44 mins remaining. ts004_tc002_group_by_kind. time: 6130ms 
[INFO] Pass 34 (164) processed. 22 failed. spent: 4:04, 14:34 mins remaining. ts004_tc003_group_by_kind_categories_order. time: 5119ms 
[INFO] Fail 35 (164) processed. 23 failed. spent: 4:10, 14:24 mins remaining. ts004_tc004_trees_under_groups. time: 5445ms  Cause: Assertion of getItems().TreeItem[0].getItems().TreeItem[0].getText() failed: expected:<length [name changed]> but was:<> length : EInt>.
[INFO] Fail 36 (164) processed. 24 failed. spent: 4:16, 14:15 mins remaining. ts004_tc005_by_side_conflicts. time: 5780ms  Cause: Assertion of getItems().TreeItem[0].getItems().TreeItem[0].getItemCount() failed: expected:<0> but was:<2>.
[INFO] Pass 37 (164) processed. 24 failed. spent: 4:23, 14:09 mins remaining. ts004_tc006_not_reseting_group_after_save. time: 6562ms 
[INFO] Fail 38 (164) processed. 25 failed. spent: 4:29, 14:00 mins remaining. ts004_tc007_group_item_double_click. time: 5374ms  Cause: The Item "[> Conflicts, > Conflict [2 out of 2 differences unresolved], length \[name changed\]]" could not be found.
[INFO] Fail 39 (164) processed. 26 failed. spent: 4:33, 13:45 mins remaining. ts005_tc001_compare_with_commit. time: 4032ms  Cause: Failed to set selection: [[Git]].
[INFO] Fail 40 (164) processed. 27 failed. spent: 4:36, 13:28 mins remaining. ts005_tc002_compare_with_previous_revision. time: 2808ms  Cause: Failed to set selection: [[Git]].
[INFO] Fail 41 (164) processed. 28 failed. spent: 4:39, 13:11 mins remaining. ts005_tc003_git_repositories_compare_with_head. time: 2817ms  Cause: Failed to set selection: [[Git]].
[INFO] Fail 42 (164) processed. 29 failed. spent: 4:43, 12:58 mins remaining. ts005_tc004_compare_with_version_in_ancestor. time: 3091ms  Cause: Failed to set selection: [[Git]].
[INFO] Fail 43 (164) processed. 30 failed. spent: 4:47, 12:45 mins remaining. ts005_tc005_commit_viewer_compare_with_version_in_ancestor. time: 3740ms  Cause: Failed to set selection: [[Git]].
[INFO] Fail 44 (164) processed. 31 failed. spent: 4:50, 12:30 mins remaining. ts005_tc006_compare_with_head_revision. time: 2849ms  Cause: Failed to set selection: [[Git]].
[INFO] Fail 45 (164) processed. 32 failed. spent: 4:54, 12:18 mins remaining. ts005_tc007_compare_with_branch_master. time: 3837ms  Cause: Failed to set selection: [[Git]].
[INFO] Fail 46 (164) processed. 33 failed. spent: 4:57, 12:03 mins remaining. ts005_tc008_compare_with_reference. time: 2969ms  Cause: Failed to set selection: [[Git]].
[INFO] Fail 47 (164) processed. 34 failed. spent: 5:00, 11:50 mins remaining. ts005_tc009_compare_with_git_index. time: 2603ms  Cause: Failed to set selection: [[Git]].
[INFO] Fail 48 (164) processed. 35 failed. spent: 5:04, 11:39 mins remaining. ts005_tc010_replace_with_local_history. time: 2677ms  Cause: Failed to set selection: [[Git]].
[INFO] Fail 49 (164) processed. 36 failed. spent: 5:07, 11:26 mins remaining. ts005_tc011_compare_with_working_tree. time: 2762ms  Cause: Failed to set selection: [[Git]].
[INFO] Fail 50 (164) processed. 37 failed. spent: 5:10, 11:32 mins remaining. ts005_tc012_compare_with_working_directory. time: 2893ms  Cause: Failed to set selection: [[Git]].
[INFO] Fail 51 (164) processed. 38 failed. spent: 5:13, 11:01 mins remaining. ts005_tc013_save_emfdiff_disable. time: 3017ms  Cause: Failed to set selection: [[Git]].
[INFO] Fail 52 (164) processed. 39 failed. spent: 5:16, 10:49 mins remaining. ts005_tc014_compare_with_commit_from_editor. time: 2850ms  Cause: Failed to set selection: [[Git]].
[INFO] Fail 53 (164) processed. 40 failed. spent: 5:20, 10:40 mins remaining. ts005_tc015_compare_with_previous_revision_from_editor. time: 3689ms  Cause: Failed to set selection: [[Git]].
[INFO] Fail 54 (164) processed. 41 failed. spent: 5:23, 10:28 mins remaining. ts005_tc016_compare_with_head_revision_from_editor. time: 2778ms  Cause: Failed to set selection: [[Git]].
[INFO] Fail 55 (164) processed. 42 failed. spent: 5:26, 10:17 mins remaining. ts005_tc017_compare_with_git_index_from_editor. time: 2832ms  Cause: Failed to set selection: [[Git]].
[INFO] Fail 56 (164) processed. 43 failed. spent: 5:30, 10:08 mins remaining. ts005_tc018_compare_with_branch_master_from_editor. time: 3739ms  Cause: Failed to set selection: [[Git]].
[INFO] Fail 57 (164) processed. 44 failed. spent: 5:34, 10:00 mins remaining. ts005_tc019_commit_viewer_compare_with_workspace. time: 3664ms  Cause: Failed to set selection: [[Git]].
[INFO] Fail 58 (164) processed. 45 failed. spent: 5:38, 9:51 mins remaining. ts005_tc020_merge_branch1_into_master. time: 3707ms  Cause: Failed to set selection: [[Git]].
[INFO] Fail 59 (164) processed. 46 failed. spent: 5:42, 9:43 mins remaining. ts005_tc021_open_conflict_with_merge_tool. time: 3049ms  Cause: Failed to set selection: [[Git]].
[INFO] Fail 60 (164) processed. 47 failed. spent: 5:43, 9:29 mins remaining. ts005_tc022_CMV_titles_from_egit_history. time: 1237ms  Cause: Failed to execute context: EGitWorkbenchContext Cause: Unable to create perspective 'org.eclipse.egit.ui.GitRepositoryExploring'.  There is no corresponding perspective extension.
[INFO] Fail 61 (164) processed. 48 failed. spent: 5:50, 9:26 mins remaining. ts006_tc001_change_in_fragment_only. time: 5627ms  Cause: Assertion of getItems().TreeItem[0].getText() failed: expected:<> [ ... ]> but was:<> fragmentedLeft>.
[INFO] Fail 62 (164) processed. 49 failed. spent: 5:55, 9:20 mins remaining. ts006_tc002_change_in_fragment_only_2. time: 4975ms  Cause: Assertion of getItems().TreeItem[0].getText() failed: expected:<> [ ... ]> but was:<> fragmentedLeft>.
[INFO] Fail 63 (164) processed. 50 failed. spent: 6:01, 9:15 mins remaining. ts006_tc003_controlled_resource_attachment_change_uml. time: 4975ms  Cause: Assertion of itemCount failed: expected:<1> but was:<2>.
[INFO] Pass 64 (164) processed. 50 failed. spent: 6:09, 9:13 mins remaining. ts007_tc001_merge_attribute_name_changed. time: 8273ms 
[INFO] Fail 65 (164) processed. 51 failed. spent: 6:15, 9:08 mins remaining. ts007_tc002_merge_reference_add. time: 5053ms  Cause: Failed to set selection: [[> extlibrary, > BookCategory, Dictionary = 4 \[eLiterals add\]]].
[INFO] Fail 66 (164) processed. 52 failed. spent: 6:20, 9:02 mins remaining. ts007_tc003_merge_reference_add_select_next_diff. time: 4991ms  Cause: Failed to set selection: [[> extlibrary, > BookCategory, Dictionary = 4 \[eLiterals add\]]].
[INFO] Fail 67 (164) processed. 53 failed. spent: 6:26, 8:57 mins remaining. ts007_tc004_merge_required. time: 5938ms  Cause: Failed to set selection: [[> extlibrary, > AudioVisualItem -> CirculatingItem, title : EString \[eStructuralFeatures add\]]].
[INFO] Fail 68 (164) processed. 54 failed. spent: 6:32, 8:52 mins remaining. ts007_tc005_merge_opposite_subdiff_filter. time: 5372ms  Cause: Failed to set selection: [[> <Model> model, <Association> class1_class0_0 \[packagedElement add\]]].
[INFO] Fail 69 (164) processed. 55 failed. spent: 6:37, 8:45 mins remaining. ts007_tc006_merge_from_contextual_menu. time: 5143ms  Cause: Failed to set selection: [[> extlibrary, > Book -> CirculatingItem, title : EString \[eStructuralFeatures add\]]].
[INFO] Fail 70 (164) processed. 56 failed. spent: 6:46, 8:44 mins remaining. ts008_tc001_move_under_rac. time: 7422ms  Cause: Assertion of getItems().TreeItem[0].getItems().TreeItem[0].getText() failed: expected:<<Package> package3 [packagedElement move]> but was:<<Model> root2 [controlled in platform:/resource/TreeViewerResourceAttachmentChange/move/left.uml]>.
[INFO] Fail 71 (164) processed. 57 failed. spent: 6:52, 8:39 mins remaining. ts008_tc002_rac. time: 5985ms  Cause: The Menu "[Pseudo conflicts differences]" could not be found.
[INFO] Fail 72 (164) processed. 58 failed. spent: 6:57, 8:32 mins remaining. ts008_tc003_rac_left_fragment. time: 4613ms  Cause: Failed to set selection: [[> <Model> root2, <Package> package4 \[packagedElement move\]]].
[INFO] Fail 73 (164) processed. 59 failed. spent: 7:07, 8:32 mins remaining. ts008_tc004_rac_right_fragment. time: 9527ms  Cause: Failed to set selection: [[> <Model> root, <Package> package3 \[packagedElement delete\]]].
[INFO] Fail 74 (164) processed. 60 failed. spent: 7:13, 8:27 mins remaining. ts008_tc005_move_with_different_containers. time: 5544ms  Cause: Failed to set selection: [[> extlibrary, > Book -> CirculatingItem, title : EString [eStructuralFeatures add]]].
[INFO] Fail 75 (164) processed. 61 failed. spent: 7:18, 8:20 mins remaining. ts009_tc001_logicalmodel_with_fragments. time: 4775ms  Cause: The Menu "[Empty resource mappings]" could not be found.
[INFO] Pass 76 (164) processed. 61 failed. spent: 7:22, 8:13 mins remaining. ts009_tc003_logicalmodel_view. time: 3313ms 
[INFO] Pass 77 (164) processed. 61 failed. spent: 7:27, 8:06 mins remaining. ts009_tc004_logicalmodel_view_synchro_selection. time: 5382ms 
[INFO] Pass 78 (164) processed. 61 failed. spent: 7:43, 8:11 mins remaining. ts009_tc005_logicalmodel_view_synchro_editor. time: 15668ms 
[INFO] Fail 79 (164) processed. 62 failed. spent: 7:47, 8:04 mins remaining. ts009_tc006_logicalmodel_view_tree_presentation. time: 3048ms  Cause: Failed to set selection: [[EMF Compare, Resolution strategy]].
[INFO] Fail 80 (164) processed. 63 failed. spent: 7:54, 7:59 mins remaining. ts010_tc100_3-way_conflicts. time: 6636ms  Cause: Failed to set selection: [[> Diagram NewDiagram <Model> model, Shape <Package> D \[children delete\], Shape <Class> E \[children add\]]].
[INFO] Fail 81 (164) processed. 64 failed. spent: 8:02, 7:56 mins remaining. ts010_tc101_3-way_conflicts. time: 7611ms  Cause: Failed to set selection: [[> Diagram NewDiagram <Model> model, Connector <Dependency> Dependency1 \[edges add\]]].
[INFO] Fail 82 (164) processed. 65 failed. spent: 8:09, 7:51 mins remaining. ts010_tc102_3-way_conflicts. time: 6360ms  Cause: Failed to set selection: [[> Diagram NewDiagram <Model> model, Shape <Class> D \[children delete\], Shape <Class> E \[children add\]]].
[INFO] Fail 83 (164) processed. 66 failed. spent: 8:19, 7:49 mins remaining. ts010_tc103_3-way_localAndRemoteChanges. time: 8361ms  Cause: Failed to set selection: [[> Diagram NewDiagram <Model> model, Shape <Class> A \[children add\]]].
[INFO] Fail 84 (164) processed. 67 failed. spent: 8:29, 7:47 mins remaining. ts010_tc104_3-way_localAndRemoteChanges. time: 8122ms  Cause: Failed to set selection: [[> Diagram NewDiagram <Model> model, Connector <Dependency> Dependency1 \[edges delete\]]].
[ERROR] Exception in thread "pool-2-thread-1" java.lang.OutOfMemoryError: GC overhead limit exceeded
[ERROR] 	at org.eclipse.rcptt.ecl.core.util.ECLBinaryResourceImpl$BinaryIO.<init>(ECLBinaryResourceImpl.java:183)
[ERROR] 	at org.eclipse.rcptt.ecl.core.util.ECLBinaryResourceImpl$EObjectOutputStream.<init>(ECLBinaryResourceImpl.java:341)
[ERROR] 	at org.eclipse.rcptt.ecl.core.util.ECLBinaryResourceImpl$EObjectOutputStream.<init>(ECLBinaryResourceImpl.java:338)
[ERROR] 	at org.eclipse.rcptt.ecl.core.util.ECLBinaryResourceImpl.doSave(ECLBinaryResourceImpl.java:105)
[ERROR] 	at org.eclipse.emf.ecore.resource.impl.ResourceImpl.save(ResourceImpl.java:1430)
[ERROR] 	at org.eclipse.rcptt.ecl.internal.core.EMFStreamPipe.write(EMFStreamPipe.java:144)
[ERROR] 	at org.eclipse.rcptt.ecl.server.tcp.SessionRequestHandler.writeOutput(SessionRequestHandler.java:130)
[ERROR] 	at org.eclipse.rcptt.ecl.server.tcp.SessionRequestHandler.run(SessionRequestHandler.java:59)
[ERROR] 	at java.util.concurrent.ThreadPoolExecutor.runWorker(ThreadPoolExecutor.java:1145)
[ERROR] 	at java.util.concurrent.ThreadPoolExecutor$Worker.run(ThreadPoolExecutor.java:615)
[ERROR] 	at java.lang.Thread.run(Thread.java:745)
[INFO] AUT-0:Restarting (restartId=1)
[INFO] AUT-0:Product: org.eclipse.sdk.ide
[INFO] AUT-0:Application: org.eclipse.ui.ide.workbench
[INFO] AUT-0:Architecture: x86_64
[INFO] 64bit arch is selected because AUT uses launcher library
[INFO] 	"plugins/org.eclipse.equinox.launcher.gtk.linux.x86_64_1.1.200.v20150204-1316" specified in config file: eclipse.ini
[INFO] /jobs/genie.emfcompare/master-rcptt-nightly/workspace/PLATFORM/collaborative-modeling-luna/plugins/org.eclipse.emf.compare.rcptt.tests/target/aut-ws-0_restarted_1: AUT arguments: -os ${target.os} -arch ${target.arch} -consoleLog
[INFO] /jobs/genie.emfcompare/master-rcptt-nightly/workspace/PLATFORM/collaborative-modeling-luna/plugins/org.eclipse.emf.compare.rcptt.tests/target/aut-ws-0_restarted_1: AUT VM arguments: -Xms40m -Xmx512m -Xmx2048m -XX:MaxPermSize=512m
[INFO] Fail 85 (164) processed. 68 failed. spent: 8:45, 8:02 mins remaining. ts010_tc105_3-way_positionPhantomsForLists. time: 0ms  Cause: java.lang.OutOfMemoryError: GC overhead limit exceeded
[INFO] 	at org.eclipse.rcptt.sherlock.core.model.sherlock.impl.SherlockFactoryImpl.createJavaStackTraceEntry(SherlockFactoryImpl.java:169)
[INFO] 	at org.eclipse.rcptt.sherlock.core.model.sherlock.impl.SherlockFactoryImpl.create(SherlockFactoryImpl.java:75)
[INFO] 	at org.eclipse.rcptt.sherlock.core.streams.SherlockBinaryResourceImpl$EObjectInputStream.loadEObject(SherlockBinaryResourceImpl.java:1223)
[INFO] 	at org.eclipse.rcptt.sherlock.core.streams.SherlockBinaryResourceImpl$EObjectInputStream.loadEObjects(SherlockBinaryResourceImpl.java:1034)
[INFO] 	at org.eclipse.rcptt.sherlock.core.streams.SherlockBinaryResourceImpl$EObjectInputStream.loadFeatureValue(SherlockBinaryResourceImpl.java:1267)
[INFO] 	at org.eclipse.rcptt.sherlock.core.streams.SherlockBinaryResourceImpl$EObjectInputStream.loadEObject(SherlockBinaryResourceImpl.java:1235)
[INFO] 	at org.eclipse.rcptt.sherlock.core.streams.SherlockBinaryResourceImpl$EObjectInputStream.loadFeatureValue(SherlockBinaryResourceImpl.java:1257)
[INFO] 	at org.eclipse.rcptt.sherlock.core.streams.SherlockBinaryResourceImpl$EObjectInputStream.loadEObject(SherlockBinaryResourceImpl.java:1235)
[INFO] 	at org.eclipse.rcptt.sherlock.core.streams.SherlockBinaryResourceImpl$EObjectInputStream.loadFeatureValue(SherlockBinaryResourceImpl.java:1257)
[INFO] 	at org.eclipse.rcptt.sherlock.core.streams.SherlockBinaryResourceImpl$EObjectInputStream.loadEObject(SherlockBinaryResourceImpl.java:1235)
[INFO] 	at org.eclipse.rcptt.sherlock.core.streams.SherlockBinaryResourceImpl$EObjectInputStream.loadEObjects(SherlockBinaryResourceImpl.java:1034)
[INFO] 	at org.eclipse.rcptt.sherlock.core.streams.SherlockBinaryResourceImpl$EObjectInputStream.loadFeatureValue(SherlockBinaryResourceImpl.java:1267)
[INFO] 	at org.eclipse.rcptt.sherlock.core.streams.SherlockBinaryResourceImpl$EObjectInputStream.loadEObject(SherlockBinaryResourceImpl.java:1235)
[INFO] 	at org.eclipse.rcptt.sherlock.core.streams.SherlockBinaryResourceImpl$EObjectInputStream.loadEObjects(SherlockBinaryResourceImpl.java:1034)
[INFO] 	at org.eclipse.rcptt.sherlock.core.streams.SherlockBinaryResourceImpl$EObjectInputStream.loadFeatureValue(SherlockBinaryResourceImpl.java:1267)
[INFO] 	at org.eclipse.rcptt.sherlock.core.streams.SherlockBinaryResourceImpl$EObjectInputStream.loadEObject(SherlockBinaryResourceImpl.java:1235)
[INFO] 	at org.eclipse.rcptt.sherlock.core.streams.SherlockBinaryResourceImpl$EObjectInputStream.loadEObjects(SherlockBinaryResourceImpl.java:1034)
[INFO] 	at org.eclipse.rcptt.sherlock.core.streams.SherlockBinaryResourceImpl$EObjectInputStream.loadFeatureValue(SherlockBinaryResourceImpl.java:1267)
[INFO] 	at org.eclipse.rcptt.sherlock.core.streams.SherlockBinaryResourceImpl$EObjectInputStream.loadEObject(SherlockBinaryResourceImpl.java:1235)
[INFO] 	at org.eclipse.rcptt.sherlock.core.streams.SherlockBinaryResourceImpl$EObjectInputStream.loadFeatureValue(SherlockBinaryResourceImpl.java:1257)
[INFO] 	at org.eclipse.rcptt.sherlock.core.streams.SherlockBinaryResourceImpl$EObjectInputStream.loadEObject(SherlockBinaryResourceImpl.java:1235)
[INFO] 	at org.eclipse.rcptt.sherlock.core.streams.SherlockBinaryResourceImpl$EObjectInputStream.loadResource(SherlockBinaryResourceImpl.java:1017)
[INFO] 	at org.eclipse.rcptt.sherlock.core.streams.SherlockBinaryResourceImpl.doLoad(SherlockBinaryResourceImpl.java:128)
[INFO] 	at org.eclipse.emf.ecore.resource.impl.ResourceImpl.load(ResourceImpl.java:1518)
[INFO] 	at org.eclipse.rcptt.sherlock.core.streams.SherlockReportFormat.loadReport(SherlockReportFormat.java:71)
[INFO] 	at org.eclipse.rcptt.sherlock.core.streams.SherlockReportSession.getReport(SherlockReportSession.java:63)
[INFO] 	at org.eclipse.rcptt.internal.launching.PrepareExecutionWrapper.getResultReport(PrepareExecutionWrapper.java:108)
[INFO] 	at org.eclipse.rcptt.runner.ScenarioRunnable.makeReport(ScenarioRunnable.java:112)
[INFO] 	at org.eclipse.rcptt.runner.ScenarioRunnable.run(ScenarioRunnable.java:74)
[INFO] 	at org.eclipse.rcptt.runner.util.AutThread.run(AutThread.java:137)
[INFO] 
[ERROR] Exception in thread "AUT-Worker-0" java.lang.OutOfMemoryError: GC overhead limit exceeded
[ERROR] 	at java.io.BufferedReader.<init>(BufferedReader.java:98)
[ERROR] 	at java.io.BufferedReader.<init>(BufferedReader.java:109)
[ERROR] 	at org.eclipse.osgi.util.ManifestElement.parseBundleManifest(ManifestElement.java:506)
[ERROR] 	at org.eclipse.pde.internal.core.util.ManifestUtils.loadManifest(ManifestUtils.java:94)
[ERROR] 	at org.eclipse.pde.internal.core.MinimalState.addBundle(MinimalState.java:105)
[ERROR] 	at org.eclipse.pde.internal.core.PDEState.createNewTargetState(PDEState.java:68)
[ERROR] 	at org.eclipse.pde.internal.core.PDEState.<init>(PDEState.java:44)
[ERROR] 	at org.eclipse.rcptt.launching.internal.target.TargetPlatformHelper.sumBundles(TargetPlatformHelper.java:399)
[ERROR] 	at org.eclipse.rcptt.launching.internal.target.TargetPlatformHelper.calcModels(TargetPlatformHelper.java:378)
[ERROR] 	at org.eclipse.rcptt.launching.internal.target.TargetPlatformHelper.getTargetModels(TargetPlatformHelper.java:366)
[ERROR] 	at org.eclipse.rcptt.launching.internal.target.TargetPlatformHelper.access$0(TargetPlatformHelper.java:365)
[ERROR] 	at org.eclipse.rcptt.launching.internal.target.TargetPlatformHelper$1.getModels(TargetPlatformHelper.java:444)
[ERROR] 	at org.eclipse.pde.internal.launching.launcher.LaunchValidationOperation.run(LaunchValidationOperation.java:42)
[ERROR] 	at org.eclipse.rcptt.launching.internal.target.TargetPlatformHelper.validateBundles(TargetPlatformHelper.java:459)
[ERROR] 	at org.eclipse.rcptt.launching.internal.target.TargetPlatformHelper.resolve(TargetPlatformHelper.java:541)
[ERROR] 	at org.eclipse.rcptt.launching.target.TargetPlatformManager.findTarget(TargetPlatformManager.java:129)
[ERROR] 	at org.eclipse.rcptt.internal.launching.ext.Q7TargetPlatformManager.getTarget(Q7TargetPlatformManager.java:82)
[ERROR] 	at org.eclipse.rcptt.launching.ext.Q7ExternalLaunchDelegate.preLaunchCheck(Q7ExternalLaunchDelegate.java:193)
[ERROR] 	at org.eclipse.debug.internal.core.LaunchConfiguration.launch(LaunchConfiguration.java:840)
[ERROR] 	at org.eclipse.debug.internal.core.LaunchConfiguration.launch(LaunchConfiguration.java:739)
[ERROR] 	at org.eclipse.debug.internal.core.LaunchConfiguration.launch(LaunchConfiguration.java:731)
[ERROR] 	at org.eclipse.rcptt.internal.launching.ext.ExternalLaunchExecutor.launch(ExternalLaunchExecutor.java:30)
[ERROR] 	at org.eclipse.rcptt.internal.launching.aut.BaseAut.launch(BaseAut.java:47)
[ERROR] 	at org.eclipse.rcptt.runner.util.AutThread.launchAut(AutThread.java:434)
[ERROR] 	at org.eclipse.rcptt.runner.util.AutThread.restart(AutThread.java:479)
[ERROR] 	at org.eclipse.rcptt.runner.util.AutThread.checkAut(AutThread.java:104)
[ERROR] 	at org.eclipse.rcptt.runner.util.AutThread.run(AutThread.java:130)
[INFO] Skip remaining: AUT is not available
[INFO] Failed Tests:
[INFO] ts001_tc002_2-way_synchro_smv_cmv
[INFO] ts009_tc001_logicalmodel_with_fragments
[INFO] ts006_tc001_change_in_fragment_only
[INFO] ts005_tc007_compare_with_branch_master
[INFO] ts005_tc022_CMV_titles_from_egit_history
[INFO] ts005_tc008_compare_with_reference
[INFO] ts005_tc021_open_conflict_with_merge_tool
[INFO] ts001_tc007_2-way_resource_attachment_change_uml
[INFO] ts010_tc104_3-way_localAndRemoteChanges
[INFO] ts002_tc007_3-way_real_add_conflict_3
[INFO] ts008_tc005_move_with_different_containers
[INFO] ts001_tc008_2-way_resource_attachment_change_multiple_uml
[INFO] ts006_tc003_controlled_resource_attachment_change_uml
[INFO] ts005_tc004_compare_with_version_in_ancestor
[INFO] ts003_tc001_filter_identical_elements_cmv
[INFO] ts005_tc009_compare_with_git_index
[INFO] ts001_tc004_2-way_next_difference
[INFO] ts002_tc008_3-way_opaque_action_body_change_conflict
[INFO] ts005_tc019_commit_viewer_compare_with_workspace
[INFO] ts010_tc101_3-way_conflicts
[INFO] ts003_tc002_filter_pseudo_elements_cmv
[INFO] ts005_tc011_compare_with_working_tree
[INFO] ts002_tc002_3-way_resource_attachment_change_multiple_uml
[INFO] ts007_tc004_merge_required
[INFO] ts003_tc006_filter_identical_elements
[INFO] ts005_tc012_compare_with_working_directory
[INFO] ts007_tc002_merge_reference_add
[INFO] ts007_tc003_merge_reference_add_select_next_diff
[INFO] ts003_tc012_not_reseting_filter_after_save
[INFO] ts005_tc002_compare_with_previous_revision
[INFO] ts008_tc002_rac
[INFO] ts005_tc005_commit_viewer_compare_with_version_in_ancestor
[INFO] ts006_tc002_change_in_fragment_only_2
[INFO] ts007_tc005_merge_opposite_subdiff_filter
[INFO] ts005_tc001_compare_with_commit
[INFO] ts005_tc014_compare_with_commit_from_editor
[INFO] ts003_tc011_filter_uml_refined_elements_check_order
[INFO] ts005_tc003_git_repositories_compare_with_head
[INFO] ts004_tc004_trees_under_groups
[INFO] ts004_tc007_group_item_double_click
[INFO] ts005_tc013_save_emfdiff_disable
[INFO] ts010_tc102_3-way_conflicts
[INFO] ts005_tc006_compare_with_head_revision
[INFO] ts008_tc004_rac_right_fragment
[INFO] ts002_tc003_3-way_show_ancestor_pane
[INFO] ts003_tc007_filter_pseudo_elements
[INFO] ts010_tc103_3-way_localAndRemoteChanges
[INFO] ts003_tc004_filter_uml_refined_elements_cmv
[INFO] ts003_tc009_filter_cascading_differences
[INFO] ts002_tc006_3-way_real_add_conflict_2
[INFO] ts005_tc018_compare_with_branch_master_from_editor
[INFO] ts002_tc005_3-way_real_add_conflict
[INFO] ts003_tc003_filter_cascading_differences_cmv
[INFO] ts005_tc010_replace_with_local_history
[INFO] ts008_tc003_rac_left_fragment
[INFO] ts003_tc010_filter_uml_refined_elements
[INFO] ts008_tc001_move_under_rac
[INFO] ts004_tc005_by_side_conflicts
[INFO] ts005_tc016_compare_with_head_revision_from_editor
[INFO] ts005_tc020_merge_branch1_into_master
[INFO] ts005_tc015_compare_with_previous_revision_from_editor
[INFO] ts010_tc105_3-way_positionPhantomsForLists
[INFO] ts003_tc013_filter_cascading_differences_move
[INFO] ts009_tc006_logicalmodel_view_tree_presentation
[INFO] ts010_tc100_3-way_conflicts
[INFO] ts003_tc005_filter_empty_resource_mappings
[INFO] ts005_tc017_compare_with_git_index_from_editor
[INFO] ts007_tc006_merge_from_contextual_menu
[INFO] Process terminated. Shut down AUTs
[INFO] Runner exit code is: 56
[ERROR] There are test failures
[INFO] 
[INFO] --- rcptt-maven-plugin:2.0.0:package (default-package) @ org.eclipse.emf.compare.rcptt.test ---
[INFO] Building zip: /jobs/genie.emfcompare/master-rcptt-nightly/workspace/PLATFORM/collaborative-modeling-luna/plugins/org.eclipse.emf.compare.rcptt.tests/target/projects/org.eclipse.emf.compare.rcptt.test-4.0.0-SNAPSHOT.zip
[INFO] Building zip: /jobs/genie.emfcompare/master-rcptt-nightly/workspace/PLATFORM/collaborative-modeling-luna/plugins/org.eclipse.emf.compare.rcptt.tests/target/org.eclipse.emf.compare-org.eclipse.emf.compare.rcptt.test-4.0.0-SNAPSHOT-result.zip
[INFO] aut1/out.txt already added, skipping
[INFO] aut1/out.txt already added, skipping
[INFO] ------------------------------------------------------------------------
[INFO] BUILD SUCCESS
[INFO] ------------------------------------------------------------------------
[INFO] Total time: 12:03 min
[INFO] Finished at: 2016-10-17T20:33:32-05:00
[INFO] Final Memory: 17M/2437M
[INFO] ------------------------------------------------------------------------
[DEBUG] Closing connection to remote
[DEBUG] Waiting for process to finish
[DEBUG] Result: 0
Terminating xvnc.
Recording test results
Sending e-mails to: emfcompare-build@eclipse.org mathieu.cartaud@obeo.fr axel.richard@obeo.fr laurent.delaigue@obeo.fr mfleck@eclipsesource.com abuzila@eclipsesource.com anma-e@gmx.de planger@eclipsesource.com tmayerhofer@eclipsesource.com laurent.goubet@obeo.fr
Finished: UNSTABLE