FailedConsole Output

Skipping 1,216 KB.. Full Log
 kB | 152 kB | 319/894 kB | 95 kB
Progress (5): 1.4 MB | 369 kB | 152 kB | 327/894 kB | 95 kB
                                                           
Downloaded from sonatype-releases: https://oss.sonatype.org/content/repositories/releases/org/antlr/antlr-runtime/3.2/antlr-runtime-3.2.jar (152 kB at 93 kB/s)
Downloading from sonatype-releases: https://oss.sonatype.org/content/repositories/releases/org/eclipse/jdt/org.eclipse.jdt.launching/3.17.0/org.eclipse.jdt.launching-3.17.0.jar
Progress (4): 1.4 MB | 369 kB | 335/894 kB | 95 kB
Progress (4): 1.4 MB | 369 kB | 344/894 kB | 95 kB
Progress (4): 1.4 MB | 369 kB | 352/894 kB | 95 kB
Progress (4): 1.4 MB | 369 kB | 360/894 kB | 95 kB
                                                  
Downloaded from sonatype-releases: https://oss.sonatype.org/content/repositories/releases/org/eclipse/emf/org.eclipse.emf.ecore/2.20.0/org.eclipse.emf.ecore-2.20.0.jar (1.4 MB at 860 kB/s)
Downloading from sonatype-releases: https://oss.sonatype.org/content/repositories/releases/org/eclipse/jdt/org.eclipse.jdt.debug/3.15.0/org.eclipse.jdt.debug-3.15.0.jar
Progress (3): 369 kB | 368/894 kB | 95 kB
Progress (3): 369 kB | 376/894 kB | 95 kB
Progress (3): 369 kB | 384/894 kB | 95 kB
Progress (3): 369 kB | 393/894 kB | 95 kB
Progress (3): 369 kB | 401/894 kB | 95 kB
Progress (3): 369 kB | 409/894 kB | 95 kB
Progress (3): 369 kB | 417/894 kB | 95 kB
Progress (3): 369 kB | 425/894 kB | 95 kB
Progress (3): 369 kB | 434/894 kB | 95 kB
Progress (3): 369 kB | 442/894 kB | 95 kB
Progress (3): 369 kB | 450/894 kB | 95 kB
Progress (3): 369 kB | 458/894 kB | 95 kB
Progress (3): 369 kB | 466/894 kB | 95 kB
Progress (3): 369 kB | 475/894 kB | 95 kB
Progress (3): 369 kB | 483/894 kB | 95 kB
Progress (3): 369 kB | 491/894 kB | 95 kB
Progress (3): 369 kB | 499/894 kB | 95 kB
Progress (3): 369 kB | 507/894 kB | 95 kB
Progress (3): 369 kB | 516/894 kB | 95 kB
Progress (3): 369 kB | 524/894 kB | 95 kB
Progress (3): 369 kB | 532/894 kB | 95 kB
Progress (3): 369 kB | 540/894 kB | 95 kB
Progress (3): 369 kB | 548/894 kB | 95 kB
Progress (3): 369 kB | 557/894 kB | 95 kB
Progress (3): 369 kB | 565/894 kB | 95 kB
Progress (3): 369 kB | 573/894 kB | 95 kB
Progress (3): 369 kB | 581/894 kB | 95 kB
Progress (3): 369 kB | 589/894 kB | 95 kB
Progress (3): 369 kB | 597/894 kB | 95 kB
Progress (3): 369 kB | 606/894 kB | 95 kB
Progress (3): 369 kB | 614/894 kB | 95 kB
Progress (3): 369 kB | 622/894 kB | 95 kB
Progress (3): 369 kB | 630/894 kB | 95 kB
Progress (3): 369 kB | 638/894 kB | 95 kB
Progress (3): 369 kB | 647/894 kB | 95 kB
Progress (3): 369 kB | 655/894 kB | 95 kB
Progress (3): 369 kB | 663/894 kB | 95 kB
Progress (4): 369 kB | 663/894 kB | 95 kB | 2.2/554 kB
Progress (4): 369 kB | 671/894 kB | 95 kB | 2.2/554 kB
Progress (4): 369 kB | 671/894 kB | 95 kB | 5.0/554 kB
Progress (4): 369 kB | 671/894 kB | 95 kB | 7.7/554 kB
Progress (4): 369 kB | 671/894 kB | 95 kB | 10/554 kB 
Progress (4): 369 kB | 671/894 kB | 95 kB | 13/554 kB
Progress (4): 369 kB | 671/894 kB | 95 kB | 16/554 kB
Progress (4): 369 kB | 671/894 kB | 95 kB | 19/554 kB
Progress (4): 369 kB | 671/894 kB | 95 kB | 21/554 kB
Progress (4): 369 kB | 671/894 kB | 95 kB | 24/554 kB
Progress (4): 369 kB | 671/894 kB | 95 kB | 27/554 kB
Progress (4): 369 kB | 671/894 kB | 95 kB | 30/554 kB
Progress (4): 369 kB | 671/894 kB | 95 kB | 32/554 kB
Progress (4): 369 kB | 671/894 kB | 95 kB | 36/554 kB
Progress (4): 369 kB | 671/894 kB | 95 kB | 40/554 kB
Progress (4): 369 kB | 671/894 kB | 95 kB | 45/554 kB
Progress (4): 369 kB | 671/894 kB | 95 kB | 49/554 kB
Progress (4): 369 kB | 671/894 kB | 95 kB | 53/554 kB
Progress (4): 369 kB | 671/894 kB | 95 kB | 57/554 kB
Progress (4): 369 kB | 671/894 kB | 95 kB | 61/554 kB
Progress (4): 369 kB | 671/894 kB | 95 kB | 65/554 kB
Progress (5): 369 kB | 671/894 kB | 95 kB | 65/554 kB | 5.0/994 kB
Progress (5): 369 kB | 671/894 kB | 95 kB | 69/554 kB | 5.0/994 kB
Progress (5): 369 kB | 671/894 kB | 95 kB | 73/554 kB | 5.0/994 kB
Progress (5): 369 kB | 671/894 kB | 95 kB | 73/554 kB | 10/994 kB 
Progress (5): 369 kB | 671/894 kB | 95 kB | 77/554 kB | 10/994 kB
Progress (5): 369 kB | 671/894 kB | 95 kB | 81/554 kB | 10/994 kB
Progress (5): 369 kB | 671/894 kB | 95 kB | 81/554 kB | 16/994 kB
Progress (5): 369 kB | 671/894 kB | 95 kB | 81/554 kB | 21/994 kB
Progress (5): 369 kB | 671/894 kB | 95 kB | 85/554 kB | 21/994 kB
Progress (5): 369 kB | 671/894 kB | 95 kB | 90/554 kB | 21/994 kB
Progress (5): 369 kB | 671/894 kB | 95 kB | 94/554 kB | 21/994 kB
Progress (5): 369 kB | 671/894 kB | 95 kB | 98/554 kB | 21/994 kB
Progress (5): 369 kB | 671/894 kB | 95 kB | 98/554 kB | 27/994 kB
Progress (5): 369 kB | 671/894 kB | 95 kB | 98/554 kB | 32/994 kB
Progress (5): 369 kB | 671/894 kB | 95 kB | 98/554 kB | 40/994 kB
Progress (5): 369 kB | 671/894 kB | 95 kB | 98/554 kB | 49/994 kB
Progress (5): 369 kB | 671/894 kB | 95 kB | 102/554 kB | 49/994 kB
Progress (5): 369 kB | 671/894 kB | 95 kB | 106/554 kB | 49/994 kB
Progress (5): 369 kB | 671/894 kB | 95 kB | 110/554 kB | 49/994 kB
Progress (5): 369 kB | 671/894 kB | 95 kB | 114/554 kB | 49/994 kB
Progress (5): 369 kB | 671/894 kB | 95 kB | 118/554 kB | 49/994 kB
Progress (5): 369 kB | 671/894 kB | 95 kB | 118/554 kB | 57/994 kB
Progress (5): 369 kB | 671/894 kB | 95 kB | 122/554 kB | 57/994 kB
Progress (5): 369 kB | 671/894 kB | 95 kB | 122/554 kB | 65/994 kB
Progress (5): 369 kB | 671/894 kB | 95 kB | 126/554 kB | 65/994 kB
Progress (5): 369 kB | 671/894 kB | 95 kB | 131/554 kB | 65/994 kB
Progress (5): 369 kB | 671/894 kB | 95 kB | 135/554 kB | 65/994 kB
Progress (5): 369 kB | 671/894 kB | 95 kB | 139/554 kB | 65/994 kB
Progress (5): 369 kB | 679/894 kB | 95 kB | 139/554 kB | 65/994 kB
Progress (5): 369 kB | 688/894 kB | 95 kB | 139/554 kB | 65/994 kB
Progress (5): 369 kB | 696/894 kB | 95 kB | 139/554 kB | 65/994 kB
Progress (5): 369 kB | 696/894 kB | 95 kB | 143/554 kB | 65/994 kB
Progress (5): 369 kB | 704/894 kB | 95 kB | 143/554 kB | 65/994 kB
Progress (5): 369 kB | 704/894 kB | 95 kB | 143/554 kB | 73/994 kB
Progress (5): 369 kB | 704/894 kB | 95 kB | 147/554 kB | 73/994 kB
Progress (5): 369 kB | 704/894 kB | 95 kB | 147/554 kB | 81/994 kB
Progress (5): 369 kB | 712/894 kB | 95 kB | 147/554 kB | 81/994 kB
Progress (5): 369 kB | 720/894 kB | 95 kB | 147/554 kB | 81/994 kB
Progress (5): 369 kB | 720/894 kB | 95 kB | 151/554 kB | 81/994 kB
Progress (5): 369 kB | 720/894 kB | 95 kB | 155/554 kB | 81/994 kB
Progress (5): 369 kB | 720/894 kB | 95 kB | 159/554 kB | 81/994 kB
Progress (5): 369 kB | 729/894 kB | 95 kB | 159/554 kB | 81/994 kB
Progress (5): 369 kB | 729/894 kB | 95 kB | 163/554 kB | 81/994 kB
Progress (5): 369 kB | 737/894 kB | 95 kB | 163/554 kB | 81/994 kB
Progress (5): 369 kB | 737/894 kB | 95 kB | 163/554 kB | 90/994 kB
Progress (5): 369 kB | 737/894 kB | 95 kB | 163/554 kB | 98/994 kB
Progress (5): 369 kB | 737/894 kB | 95 kB | 167/554 kB | 98/994 kB
Progress (5): 369 kB | 745/894 kB | 95 kB | 167/554 kB | 98/994 kB
Progress (5): 369 kB | 745/894 kB | 95 kB | 171/554 kB | 98/994 kB
Progress (5): 369 kB | 753/894 kB | 95 kB | 171/554 kB | 98/994 kB
Progress (5): 369 kB | 753/894 kB | 95 kB | 176/554 kB | 98/994 kB
Progress (5): 369 kB | 753/894 kB | 95 kB | 180/554 kB | 98/994 kB
Progress (5): 369 kB | 753/894 kB | 95 kB | 180/554 kB | 106/994 kB
Progress (5): 369 kB | 753/894 kB | 95 kB | 184/554 kB | 106/994 kB
Progress (5): 369 kB | 753/894 kB | 95 kB | 184/554 kB | 114/994 kB
Progress (5): 369 kB | 753/894 kB | 95 kB | 188/554 kB | 114/994 kB
Progress (5): 369 kB | 753/894 kB | 95 kB | 192/554 kB | 114/994 kB
Progress (5): 369 kB | 753/894 kB | 95 kB | 196/554 kB | 114/994 kB
Progress (5): 369 kB | 753/894 kB | 95 kB | 196/554 kB | 122/994 kB
Progress (5): 369 kB | 753/894 kB | 95 kB | 196/554 kB | 131/994 kB
Progress (5): 369 kB | 761/894 kB | 95 kB | 196/554 kB | 131/994 kB
Progress (5): 369 kB | 770/894 kB | 95 kB | 196/554 kB | 131/994 kB
Progress (5): 369 kB | 770/894 kB | 95 kB | 196/554 kB | 139/994 kB
Progress (5): 369 kB | 770/894 kB | 95 kB | 196/554 kB | 147/994 kB
Progress (5): 369 kB | 770/894 kB | 95 kB | 200/554 kB | 147/994 kB
Progress (5): 369 kB | 770/894 kB | 95 kB | 204/554 kB | 147/994 kB
Progress (5): 369 kB | 770/894 kB | 95 kB | 208/554 kB | 147/994 kB
Progress (5): 369 kB | 770/894 kB | 95 kB | 212/554 kB | 147/994 kB
Progress (5): 369 kB | 770/894 kB | 95 kB | 217/554 kB | 147/994 kB
Progress (5): 369 kB | 770/894 kB | 95 kB | 221/554 kB | 147/994 kB
Progress (5): 369 kB | 770/894 kB | 95 kB | 225/554 kB | 147/994 kB
Progress (5): 369 kB | 770/894 kB | 95 kB | 229/554 kB | 147/994 kB
Progress (5): 369 kB | 770/894 kB | 95 kB | 229/554 kB | 155/994 kB
Progress (5): 369 kB | 770/894 kB | 95 kB | 229/554 kB | 163/994 kB
Progress (5): 369 kB | 770/894 kB | 95 kB | 233/554 kB | 163/994 kB
Progress (5): 369 kB | 770/894 kB | 95 kB | 237/554 kB | 163/994 kB
Progress (5): 369 kB | 770/894 kB | 95 kB | 241/554 kB | 163/994 kB
Progress (5): 369 kB | 770/894 kB | 95 kB | 245/554 kB | 163/994 kB
Progress (5): 369 kB | 770/894 kB | 95 kB | 249/554 kB | 163/994 kB
Progress (5): 369 kB | 770/894 kB | 95 kB | 253/554 kB | 163/994 kB
Progress (5): 369 kB | 770/894 kB | 95 kB | 258/554 kB | 163/994 kB
Progress (5): 369 kB | 770/894 kB | 95 kB | 262/554 kB | 163/994 kB
Progress (5): 369 kB | 770/894 kB | 95 kB | 266/554 kB | 163/994 kB
Progress (5): 369 kB | 770/894 kB | 95 kB | 270/554 kB | 163/994 kB
Progress (5): 369 kB | 770/894 kB | 95 kB | 274/554 kB | 163/994 kB
Progress (5): 369 kB | 778/894 kB | 95 kB | 274/554 kB | 163/994 kB
Progress (5): 369 kB | 778/894 kB | 95 kB | 278/554 kB | 163/994 kB
Progress (5): 369 kB | 786/894 kB | 95 kB | 278/554 kB | 163/994 kB
Progress (5): 369 kB | 786/894 kB | 95 kB | 278/554 kB | 171/994 kB
Progress (5): 369 kB | 786/894 kB | 95 kB | 278/554 kB | 180/994 kB
Progress (5): 369 kB | 786/894 kB | 95 kB | 282/554 kB | 180/994 kB
Progress (5): 369 kB | 786/894 kB | 95 kB | 286/554 kB | 180/994 kB
Progress (5): 369 kB | 786/894 kB | 95 kB | 290/554 kB | 180/994 kB
Progress (5): 369 kB | 786/894 kB | 95 kB | 294/554 kB | 180/994 kB
Progress (5): 369 kB | 786/894 kB | 95 kB | 294/554 kB | 188/994 kB
Progress (5): 369 kB | 786/894 kB | 95 kB | 294/554 kB | 196/994 kB
Progress (5): 369 kB | 786/894 kB | 95 kB | 298/554 kB | 196/994 kB
Progress (5): 369 kB | 786/894 kB | 95 kB | 303/554 kB | 196/994 kB
Progress (5): 369 kB | 786/894 kB | 95 kB | 307/554 kB | 196/994 kB
Progress (5): 369 kB | 786/894 kB | 95 kB | 311/554 kB | 196/994 kB
Progress (5): 369 kB | 786/894 kB | 95 kB | 311/554 kB | 204/994 kB
Progress (5): 369 kB | 786/894 kB | 95 kB | 311/554 kB | 212/994 kB
Progress (5): 369 kB | 794/894 kB | 95 kB | 311/554 kB | 212/994 kB
Progress (5): 369 kB | 802/894 kB | 95 kB | 311/554 kB | 212/994 kB
Progress (5): 369 kB | 802/894 kB | 95 kB | 311/554 kB | 221/994 kB
Progress (5): 369 kB | 802/894 kB | 95 kB | 311/554 kB | 229/994 kB
Progress (5): 369 kB | 802/894 kB | 95 kB | 315/554 kB | 229/994 kB
Progress (5): 369 kB | 802/894 kB | 95 kB | 319/554 kB | 229/994 kB
Progress (5): 369 kB | 802/894 kB | 95 kB | 323/554 kB | 229/994 kB
Progress (5): 369 kB | 802/894 kB | 95 kB | 327/554 kB | 229/994 kB
Progress (5): 369 kB | 802/894 kB | 95 kB | 327/554 kB | 237/994 kB
Progress (5): 369 kB | 802/894 kB | 95 kB | 327/554 kB | 245/994 kB
Progress (5): 369 kB | 810/894 kB | 95 kB | 327/554 kB | 245/994 kB
Progress (5): 369 kB | 819/894 kB | 95 kB | 327/554 kB | 245/994 kB
Progress (5): 369 kB | 819/894 kB | 95 kB | 331/554 kB | 245/994 kB
Progress (5): 369 kB | 819/894 kB | 95 kB | 335/554 kB | 245/994 kB
Progress (5): 369 kB | 819/894 kB | 95 kB | 339/554 kB | 245/994 kB
Progress (5): 369 kB | 819/894 kB | 95 kB | 344/554 kB | 245/994 kB
Progress (5): 369 kB | 819/894 kB | 95 kB | 348/554 kB | 245/994 kB
Progress (5): 369 kB | 819/894 kB | 95 kB | 352/554 kB | 245/994 kB
Progress (5): 369 kB | 819/894 kB | 95 kB | 356/554 kB | 245/994 kB
Progress (5): 369 kB | 819/894 kB | 95 kB | 360/554 kB | 245/994 kB
Progress (5): 369 kB | 819/894 kB | 95 kB | 360/554 kB | 253/994 kB
Progress (5): 369 kB | 819/894 kB | 95 kB | 360/554 kB | 262/994 kB
Progress (5): 369 kB | 819/894 kB | 95 kB | 364/554 kB | 262/994 kB
Progress (5): 369 kB | 819/894 kB | 95 kB | 368/554 kB | 262/994 kB
Progress (5): 369 kB | 819/894 kB | 95 kB | 372/554 kB | 262/994 kB
Progress (5): 369 kB | 819/894 kB | 95 kB | 376/554 kB | 262/994 kB
Progress (5): 369 kB | 819/894 kB | 95 kB | 380/554 kB | 262/994 kB
Progress (5): 369 kB | 819/894 kB | 95 kB | 384/554 kB | 262/994 kB
Progress (5): 369 kB | 827/894 kB | 95 kB | 384/554 kB | 262/994 kB
Progress (5): 369 kB | 827/894 kB | 95 kB | 389/554 kB | 262/994 kB
Progress (5): 369 kB | 835/894 kB | 95 kB | 389/554 kB | 262/994 kB
Progress (5): 369 kB | 835/894 kB | 95 kB | 393/554 kB | 262/994 kB
Progress (5): 369 kB | 835/894 kB | 95 kB | 393/554 kB | 270/994 kB
Progress (5): 369 kB | 835/894 kB | 95 kB | 393/554 kB | 278/994 kB
Progress (5): 369 kB | 835/894 kB | 95 kB | 397/554 kB | 278/994 kB
Progress (5): 369 kB | 835/894 kB | 95 kB | 401/554 kB | 278/994 kB
Progress (5): 369 kB | 835/894 kB | 95 kB | 405/554 kB | 278/994 kB
Progress (5): 369 kB | 835/894 kB | 95 kB | 405/554 kB | 286/994 kB
Progress (5): 369 kB | 835/894 kB | 95 kB | 409/554 kB | 286/994 kB
Progress (5): 369 kB | 835/894 kB | 95 kB | 409/554 kB | 294/994 kB
Progress (5): 369 kB | 843/894 kB | 95 kB | 409/554 kB | 294/994 kB
Progress (5): 369 kB | 851/894 kB | 95 kB | 409/554 kB | 294/994 kB
Progress (5): 369 kB | 851/894 kB | 95 kB | 409/554 kB | 303/994 kB
Progress (5): 369 kB | 851/894 kB | 95 kB | 409/554 kB | 311/994 kB
Progress (5): 369 kB | 851/894 kB | 95 kB | 409/554 kB | 319/994 kB
Progress (5): 369 kB | 851/894 kB | 95 kB | 409/554 kB | 327/994 kB
Progress (5): 369 kB | 851/894 kB | 95 kB | 413/554 kB | 327/994 kB
Progress (5): 369 kB | 851/894 kB | 95 kB | 417/554 kB | 327/994 kB
Progress (5): 369 kB | 851/894 kB | 95 kB | 421/554 kB | 327/994 kB
Progress (5): 369 kB | 851/894 kB | 95 kB | 425/554 kB | 327/994 kB
Progress (5): 369 kB | 860/894 kB | 95 kB | 425/554 kB | 327/994 kB
Progress (5): 369 kB | 868/894 kB | 95 kB | 425/554 kB | 327/994 kB
Progress (5): 369 kB | 868/894 kB | 95 kB | 430/554 kB | 327/994 kB
Progress (5): 369 kB | 868/894 kB | 95 kB | 434/554 kB | 327/994 kB
Progress (5): 369 kB | 868/894 kB | 95 kB | 438/554 kB | 327/994 kB
Progress (5): 369 kB | 868/894 kB | 95 kB | 442/554 kB | 327/994 kB
Progress (5): 369 kB | 868/894 kB | 95 kB | 442/554 kB | 335/994 kB
Progress (5): 369 kB | 868/894 kB | 95 kB | 446/554 kB | 335/994 kB
Progress (5): 369 kB | 868/894 kB | 95 kB | 446/554 kB | 344/994 kB
Progress (5): 369 kB | 868/894 kB | 95 kB | 450/554 kB | 344/994 kB
Progress (5): 369 kB | 868/894 kB | 95 kB | 454/554 kB | 344/994 kB
Progress (5): 369 kB | 868/894 kB | 95 kB | 458/554 kB | 344/994 kB
Progress (5): 369 kB | 868/894 kB | 95 kB | 462/554 kB | 344/994 kB
Progress (5): 369 kB | 868/894 kB | 95 kB | 466/554 kB | 344/994 kB
Progress (5): 369 kB | 868/894 kB | 95 kB | 470/554 kB | 344/994 kB
Progress (5): 369 kB | 868/894 kB | 95 kB | 475/554 kB | 344/994 kB
Progress (5): 369 kB | 876/894 kB | 95 kB | 475/554 kB | 344/994 kB
Progress (5): 369 kB | 876/894 kB | 95 kB | 475/554 kB | 352/994 kB
Progress (5): 369 kB | 884/894 kB | 95 kB | 475/554 kB | 352/994 kB
Progress (5): 369 kB | 884/894 kB | 95 kB | 475/554 kB | 360/994 kB
Progress (5): 369 kB | 884/894 kB | 95 kB | 479/554 kB | 360/994 kB
Progress (5): 369 kB | 884/894 kB | 95 kB | 483/554 kB | 360/994 kB
Progress (5): 369 kB | 884/894 kB | 95 kB | 487/554 kB | 360/994 kB
Progress (5): 369 kB | 884/894 kB | 95 kB | 491/554 kB | 360/994 kB
Progress (5): 369 kB | 884/894 kB | 95 kB | 491/554 kB | 368/994 kB
Progress (5): 369 kB | 884/894 kB | 95 kB | 491/554 kB | 376/994 kB
Progress (5): 369 kB | 892/894 kB | 95 kB | 491/554 kB | 376/994 kB
Progress (5): 369 kB | 894 kB | 95 kB | 491/554 kB | 376/994 kB    
Progress (5): 369 kB | 894 kB | 95 kB | 495/554 kB | 376/994 kB
Progress (5): 369 kB | 894 kB | 95 kB | 499/554 kB | 376/994 kB
Progress (5): 369 kB | 894 kB | 95 kB | 503/554 kB | 376/994 kB
Progress (5): 369 kB | 894 kB | 95 kB | 507/554 kB | 376/994 kB
Progress (5): 369 kB | 894 kB | 95 kB | 507/554 kB | 384/994 kB
Progress (5): 369 kB | 894 kB | 95 kB | 507/554 kB | 393/994 kB
Progress (5): 369 kB | 894 kB | 95 kB | 511/554 kB | 393/994 kB
Progress (5): 369 kB | 894 kB | 95 kB | 516/554 kB | 393/994 kB
Progress (5): 369 kB | 894 kB | 95 kB | 520/554 kB | 393/994 kB
Progress (5): 369 kB | 894 kB | 95 kB | 524/554 kB | 393/994 kB
Progress (5): 369 kB | 894 kB | 95 kB | 524/554 kB | 401/994 kB
Progress (5): 369 kB | 894 kB | 95 kB | 524/554 kB | 409/994 kB
Progress (5): 369 kB | 894 kB | 95 kB | 524/554 kB | 417/994 kB
Progress (5): 369 kB | 894 kB | 95 kB | 524/554 kB | 425/994 kB
Progress (5): 369 kB | 894 kB | 95 kB | 528/554 kB | 425/994 kB
Progress (5): 369 kB | 894 kB | 95 kB | 532/554 kB | 425/994 kB
Progress (5): 369 kB | 894 kB | 95 kB | 536/554 kB | 425/994 kB
Progress (5): 369 kB | 894 kB | 95 kB | 540/554 kB | 425/994 kB
Progress (5): 369 kB | 894 kB | 95 kB | 544/554 kB | 425/994 kB
Progress (5): 369 kB | 894 kB | 95 kB | 548/554 kB | 425/994 kB
Progress (5): 369 kB | 894 kB | 95 kB | 552/554 kB | 425/994 kB
Progress (5): 369 kB | 894 kB | 95 kB | 554 kB | 425/994 kB    
Progress (5): 369 kB | 894 kB | 95 kB | 554 kB | 434/994 kB
Progress (5): 369 kB | 894 kB | 95 kB | 554 kB | 442/994 kB
Progress (5): 369 kB | 894 kB | 95 kB | 554 kB | 450/994 kB
Progress (5): 369 kB | 894 kB | 95 kB | 554 kB | 458/994 kB
Progress (5): 369 kB | 894 kB | 95 kB | 554 kB | 466/994 kB
Progress (5): 369 kB | 894 kB | 95 kB | 554 kB | 475/994 kB
Progress (5): 369 kB | 894 kB | 95 kB | 554 kB | 483/994 kB
Progress (5): 369 kB | 894 kB | 95 kB | 554 kB | 491/994 kB
Progress (5): 369 kB | 894 kB | 95 kB | 554 kB | 499/994 kB
Progress (5): 369 kB | 894 kB | 95 kB | 554 kB | 507/994 kB
Progress (5): 369 kB | 894 kB | 95 kB | 554 kB | 516/994 kB
Progress (5): 369 kB | 894 kB | 95 kB | 554 kB | 524/994 kB
Progress (5): 369 kB | 894 kB | 95 kB | 554 kB | 532/994 kB
Progress (5): 369 kB | 894 kB | 95 kB | 554 kB | 540/994 kB
Progress (5): 369 kB | 894 kB | 95 kB | 554 kB | 548/994 kB
Progress (5): 369 kB | 894 kB | 95 kB | 554 kB | 557/994 kB
Progress (5): 369 kB | 894 kB | 95 kB | 554 kB | 565/994 kB
Progress (5): 369 kB | 894 kB | 95 kB | 554 kB | 573/994 kB
Progress (5): 369 kB | 894 kB | 95 kB | 554 kB | 581/994 kB
Progress (5): 369 kB | 894 kB | 95 kB | 554 kB | 589/994 kB
Progress (5): 369 kB | 894 kB | 95 kB | 554 kB | 597/994 kB
Progress (5): 369 kB | 894 kB | 95 kB | 554 kB | 606/994 kB
Progress (5): 369 kB | 894 kB | 95 kB | 554 kB | 614/994 kB
Progress (5): 369 kB | 894 kB | 95 kB | 554 kB | 622/994 kB
Progress (5): 369 kB | 894 kB | 95 kB | 554 kB | 630/994 kB
Progress (5): 369 kB | 894 kB | 95 kB | 554 kB | 638/994 kB
Progress (5): 369 kB | 894 kB | 95 kB | 554 kB | 647/994 kB
Progress (5): 369 kB | 894 kB | 95 kB | 554 kB | 655/994 kB
Progress (5): 369 kB | 894 kB | 95 kB | 554 kB | 663/994 kB
Progress (5): 369 kB | 894 kB | 95 kB | 554 kB | 671/994 kB
Progress (5): 369 kB | 894 kB | 95 kB | 554 kB | 679/994 kB
Progress (5): 369 kB | 894 kB | 95 kB | 554 kB | 688/994 kB
Progress (5): 369 kB | 894 kB | 95 kB | 554 kB | 696/994 kB
Progress (5): 369 kB | 894 kB | 95 kB | 554 kB | 704/994 kB
Progress (5): 369 kB | 894 kB | 95 kB | 554 kB | 712/994 kB
Progress (5): 369 kB | 894 kB | 95 kB | 554 kB | 720/994 kB
Progress (5): 369 kB | 894 kB | 95 kB | 554 kB | 729/994 kB
Progress (5): 369 kB | 894 kB | 95 kB | 554 kB | 737/994 kB
Progress (5): 369 kB | 894 kB | 95 kB | 554 kB | 745/994 kB
Progress (5): 369 kB | 894 kB | 95 kB | 554 kB | 753/994 kB
Progress (5): 369 kB | 894 kB | 95 kB | 554 kB | 761/994 kB
Progress (5): 369 kB | 894 kB | 95 kB | 554 kB | 770/994 kB
Progress (5): 369 kB | 894 kB | 95 kB | 554 kB | 778/994 kB
Progress (5): 369 kB | 894 kB | 95 kB | 554 kB | 786/994 kB
Progress (5): 369 kB | 894 kB | 95 kB | 554 kB | 794/994 kB
Progress (5): 369 kB | 894 kB | 95 kB | 554 kB | 802/994 kB
Progress (5): 369 kB | 894 kB | 95 kB | 554 kB | 810/994 kB
Progress (5): 369 kB | 894 kB | 95 kB | 554 kB | 819/994 kB
Progress (5): 369 kB | 894 kB | 95 kB | 554 kB | 827/994 kB
Progress (5): 369 kB | 894 kB | 95 kB | 554 kB | 835/994 kB
Progress (5): 369 kB | 894 kB | 95 kB | 554 kB | 843/994 kB
Progress (5): 369 kB | 894 kB | 95 kB | 554 kB | 851/994 kB
Progress (5): 369 kB | 894 kB | 95 kB | 554 kB | 860/994 kB
Progress (5): 369 kB | 894 kB | 95 kB | 554 kB | 868/994 kB
Progress (5): 369 kB | 894 kB | 95 kB | 554 kB | 876/994 kB
Progress (5): 369 kB | 894 kB | 95 kB | 554 kB | 884/994 kB
Progress (5): 369 kB | 894 kB | 95 kB | 554 kB | 892/994 kB
Progress (5): 369 kB | 894 kB | 95 kB | 554 kB | 901/994 kB
Progress (5): 369 kB | 894 kB | 95 kB | 554 kB | 909/994 kB
Progress (5): 369 kB | 894 kB | 95 kB | 554 kB | 917/994 kB
Progress (5): 369 kB | 894 kB | 95 kB | 554 kB | 925/994 kB
Progress (5): 369 kB | 894 kB | 95 kB | 554 kB | 933/994 kB
Progress (5): 369 kB | 894 kB | 95 kB | 554 kB | 942/994 kB
Progress (5): 369 kB | 894 kB | 95 kB | 554 kB | 950/994 kB
Progress (5): 369 kB | 894 kB | 95 kB | 554 kB | 958/994 kB
Progress (5): 369 kB | 894 kB | 95 kB | 554 kB | 966/994 kB
Progress (5): 369 kB | 894 kB | 95 kB | 554 kB | 974/994 kB
Progress (5): 369 kB | 894 kB | 95 kB | 554 kB | 983/994 kB
Progress (5): 369 kB | 894 kB | 95 kB | 554 kB | 991/994 kB
Progress (5): 369 kB | 894 kB | 95 kB | 554 kB | 994 kB    
                                                       
Downloaded from sonatype-releases: https://oss.sonatype.org/content/repositories/releases/org/eclipse/emf/org.eclipse.emf.codegen/2.19.0/org.eclipse.emf.codegen-2.19.0.jar (369 kB at 205 kB/s)
Downloading from sonatype-releases: https://oss.sonatype.org/content/repositories/releases/org/eclipse/platform/org.eclipse.core.variables/3.4.800/org.eclipse.core.variables-3.4.800.jar
Downloaded from sonatype-releases: https://oss.sonatype.org/content/repositories/releases/org/eclipse/platform/org.eclipse.core.expressions/3.6.600/org.eclipse.core.expressions-3.6.600.jar (95 kB at 52 kB/s)
Downloading from sonatype-releases: https://oss.sonatype.org/content/repositories/releases/org/eclipse/platform/org.eclipse.debug.core/3.15.0/org.eclipse.debug.core-3.15.0.jar
Downloaded from sonatype-releases: https://oss.sonatype.org/content/repositories/releases/org/eclipse/platform/org.eclipse.core.resources/3.13.600/org.eclipse.core.resources-3.13.600.jar (894 kB at 486 kB/s)
Downloading from sonatype-releases: https://oss.sonatype.org/content/repositories/releases/org/eclipse/platform/org.eclipse.text/3.10.0/org.eclipse.text-3.10.0.jar
Downloaded from sonatype-releases: https://oss.sonatype.org/content/repositories/releases/org/eclipse/jdt/org.eclipse.jdt.launching/3.17.0/org.eclipse.jdt.launching-3.17.0.jar (554 kB at 301 kB/s)
Downloading from sonatype-releases: https://oss.sonatype.org/content/repositories/releases/org/eclipse/platform/org.eclipse.core.commands/3.9.600/org.eclipse.core.commands-3.9.600.jar
Downloaded from sonatype-releases: https://oss.sonatype.org/content/repositories/releases/org/eclipse/jdt/org.eclipse.jdt.debug/3.15.0/org.eclipse.jdt.debug-3.15.0.jar (994 kB at 538 kB/s)
Downloading from sonatype-releases: https://oss.sonatype.org/content/repositories/releases/org/codehaus/plexus/plexus-utils/1.1/plexus-utils-1.1.jar
Progress (1): 2.2/36 kB
Progress (1): 5.0/36 kB
Progress (1): 7.7/36 kB
Progress (1): 10/36 kB 
Progress (1): 13/36 kB
Progress (1): 16/36 kB
Progress (1): 19/36 kB
Progress (1): 21/36 kB
Progress (1): 24/36 kB
Progress (1): 27/36 kB
Progress (1): 30/36 kB
Progress (1): 32/36 kB
Progress (1): 35/36 kB
Progress (1): 36 kB   
Progress (2): 36 kB | 2.2/400 kB
Progress (2): 36 kB | 5.0/400 kB
Progress (2): 36 kB | 7.7/400 kB
Progress (2): 36 kB | 10/400 kB 
Progress (2): 36 kB | 13/400 kB
Progress (2): 36 kB | 16/400 kB
Progress (2): 36 kB | 19/400 kB
Progress (2): 36 kB | 21/400 kB
Progress (2): 36 kB | 24/400 kB
Progress (2): 36 kB | 27/400 kB
Progress (2): 36 kB | 30/400 kB
Progress (2): 36 kB | 32/400 kB
Progress (3): 36 kB | 32/400 kB | 2.2/115 kB
Progress (4): 36 kB | 32/400 kB | 2.2/115 kB | 2.2/297 kB
Progress (4): 36 kB | 32/400 kB | 5.0/115 kB | 2.2/297 kB
Progress (4): 36 kB | 32/400 kB | 5.0/115 kB | 5.0/297 kB
Progress (4): 36 kB | 32/400 kB | 7.7/115 kB | 5.0/297 kB
Progress (4): 36 kB | 32/400 kB | 7.7/115 kB | 7.7/297 kB
Progress (4): 36 kB | 32/400 kB | 10/115 kB | 7.7/297 kB 
Progress (4): 36 kB | 32/400 kB | 10/115 kB | 10/297 kB 
Progress (4): 36 kB | 36/400 kB | 10/115 kB | 10/297 kB
Progress (4): 36 kB | 36/400 kB | 13/115 kB | 10/297 kB
Progress (4): 36 kB | 36/400 kB | 13/115 kB | 13/297 kB
Progress (4): 36 kB | 40/400 kB | 13/115 kB | 13/297 kB
Progress (4): 36 kB | 40/400 kB | 16/115 kB | 13/297 kB
Progress (4): 36 kB | 40/400 kB | 16/115 kB | 16/297 kB
Progress (4): 36 kB | 45/400 kB | 16/115 kB | 16/297 kB
Progress (4): 36 kB | 45/400 kB | 19/115 kB | 16/297 kB
Progress (4): 36 kB | 49/400 kB | 19/115 kB | 16/297 kB
Progress (4): 36 kB | 49/400 kB | 19/115 kB | 19/297 kB
Progress (4): 36 kB | 49/400 kB | 21/115 kB | 19/297 kB
Progress (4): 36 kB | 49/400 kB | 21/115 kB | 21/297 kB
Progress (4): 36 kB | 49/400 kB | 24/115 kB | 21/297 kB
Progress (4): 36 kB | 49/400 kB | 24/115 kB | 24/297 kB
Progress (4): 36 kB | 49/400 kB | 27/115 kB | 24/297 kB
Progress (4): 36 kB | 53/400 kB | 27/115 kB | 24/297 kB
Progress (4): 36 kB | 53/400 kB | 27/115 kB | 27/297 kB
Progress (4): 36 kB | 57/400 kB | 27/115 kB | 27/297 kB
Progress (4): 36 kB | 57/400 kB | 30/115 kB | 27/297 kB
Progress (4): 36 kB | 57/400 kB | 30/115 kB | 30/297 kB
Progress (4): 36 kB | 61/400 kB | 30/115 kB | 30/297 kB
Progress (4): 36 kB | 61/400 kB | 32/115 kB | 30/297 kB
Progress (4): 36 kB | 65/400 kB | 32/115 kB | 30/297 kB
Progress (4): 36 kB | 65/400 kB | 32/115 kB | 32/297 kB
Progress (4): 36 kB | 65/400 kB | 36/115 kB | 32/297 kB
Progress (4): 36 kB | 65/400 kB | 40/115 kB | 32/297 kB
Progress (4): 36 kB | 69/400 kB | 40/115 kB | 32/297 kB
Progress (4): 36 kB | 69/400 kB | 45/115 kB | 32/297 kB
Progress (4): 36 kB | 73/400 kB | 45/115 kB | 32/297 kB
Progress (4): 36 kB | 73/400 kB | 45/115 kB | 36/297 kB
Progress (4): 36 kB | 77/400 kB | 45/115 kB | 36/297 kB
Progress (4): 36 kB | 77/400 kB | 49/115 kB | 36/297 kB
Progress (4): 36 kB | 81/400 kB | 49/115 kB | 36/297 kB
Progress (4): 36 kB | 81/400 kB | 49/115 kB | 40/297 kB
Progress (4): 36 kB | 81/400 kB | 49/115 kB | 45/297 kB
Progress (4): 36 kB | 81/400 kB | 49/115 kB | 49/297 kB
Progress (4): 36 kB | 81/400 kB | 53/115 kB | 49/297 kB
Progress (4): 36 kB | 81/400 kB | 57/115 kB | 49/297 kB
Progress (4): 36 kB | 81/400 kB | 61/115 kB | 49/297 kB
Progress (4): 36 kB | 81/400 kB | 65/115 kB | 49/297 kB
Progress (4): 36 kB | 81/400 kB | 65/115 kB | 53/297 kB
Progress (4): 36 kB | 81/400 kB | 65/115 kB | 57/297 kB
Progress (4): 36 kB | 81/400 kB | 65/115 kB | 61/297 kB
Progress (4): 36 kB | 81/400 kB | 65/115 kB | 65/297 kB
Progress (4): 36 kB | 81/400 kB | 69/115 kB | 65/297 kB
Progress (4): 36 kB | 81/400 kB | 73/115 kB | 65/297 kB
Progress (4): 36 kB | 81/400 kB | 77/115 kB | 65/297 kB
Progress (4): 36 kB | 81/400 kB | 81/115 kB | 65/297 kB
Progress (4): 36 kB | 81/400 kB | 81/115 kB | 69/297 kB
Progress (4): 36 kB | 81/400 kB | 81/115 kB | 73/297 kB
Progress (4): 36 kB | 81/400 kB | 85/115 kB | 73/297 kB
Progress (4): 36 kB | 81/400 kB | 85/115 kB | 77/297 kB
Progress (4): 36 kB | 81/400 kB | 90/115 kB | 77/297 kB
Progress (4): 36 kB | 81/400 kB | 90/115 kB | 81/297 kB
Progress (4): 36 kB | 81/400 kB | 94/115 kB | 81/297 kB
Progress (4): 36 kB | 81/400 kB | 98/115 kB | 81/297 kB
Progress (4): 36 kB | 85/400 kB | 98/115 kB | 81/297 kB
Progress (4): 36 kB | 90/400 kB | 98/115 kB | 81/297 kB
Progress (4): 36 kB | 94/400 kB | 98/115 kB | 81/297 kB
Progress (4): 36 kB | 98/400 kB | 98/115 kB | 81/297 kB
Progress (4): 36 kB | 98/400 kB | 98/115 kB | 85/297 kB
Progress (4): 36 kB | 98/400 kB | 102/115 kB | 85/297 kB
Progress (4): 36 kB | 98/400 kB | 102/115 kB | 90/297 kB
Progress (4): 36 kB | 98/400 kB | 106/115 kB | 90/297 kB
Progress (4): 36 kB | 98/400 kB | 106/115 kB | 94/297 kB
Progress (4): 36 kB | 98/400 kB | 110/115 kB | 94/297 kB
Progress (4): 36 kB | 98/400 kB | 110/115 kB | 98/297 kB
Progress (4): 36 kB | 98/400 kB | 114/115 kB | 98/297 kB
Progress (4): 36 kB | 102/400 kB | 114/115 kB | 98/297 kB
Progress (4): 36 kB | 102/400 kB | 115 kB | 98/297 kB    
Progress (4): 36 kB | 106/400 kB | 115 kB | 98/297 kB
Progress (4): 36 kB | 110/400 kB | 115 kB | 98/297 kB
Progress (4): 36 kB | 114/400 kB | 115 kB | 98/297 kB
Progress (4): 36 kB | 114/400 kB | 115 kB | 102/297 kB
Progress (4): 36 kB | 114/400 kB | 115 kB | 106/297 kB
Progress (4): 36 kB | 114/400 kB | 115 kB | 110/297 kB
Progress (4): 36 kB | 114/400 kB | 115 kB | 114/297 kB
Progress (4): 36 kB | 114/400 kB | 115 kB | 118/297 kB
Progress (4): 36 kB | 118/400 kB | 115 kB | 118/297 kB
Progress (4): 36 kB | 118/400 kB | 115 kB | 122/297 kB
Progress (4): 36 kB | 122/400 kB | 115 kB | 122/297 kB
Progress (4): 36 kB | 122/400 kB | 115 kB | 126/297 kB
Progress (4): 36 kB | 126/400 kB | 115 kB | 126/297 kB
Progress (4): 36 kB | 126/400 kB | 115 kB | 131/297 kB
Progress (4): 36 kB | 131/400 kB | 115 kB | 131/297 kB
Progress (4): 36 kB | 131/400 kB | 115 kB | 135/297 kB
Progress (4): 36 kB | 131/400 kB | 115 kB | 139/297 kB
Progress (4): 36 kB | 131/400 kB | 115 kB | 143/297 kB
Progress (4): 36 kB | 131/400 kB | 115 kB | 147/297 kB
Progress (4): 36 kB | 135/400 kB | 115 kB | 147/297 kB
Progress (4): 36 kB | 139/400 kB | 115 kB | 147/297 kB
Progress (4): 36 kB | 143/400 kB | 115 kB | 147/297 kB
Progress (4): 36 kB | 143/400 kB | 115 kB | 151/297 kB
Progress (4): 36 kB | 147/400 kB | 115 kB | 151/297 kB
Progress (4): 36 kB | 147/400 kB | 115 kB | 155/297 kB
Progress (4): 36 kB | 147/400 kB | 115 kB | 159/297 kB
Progress (4): 36 kB | 147/400 kB | 115 kB | 163/297 kB
Progress (4): 36 kB | 151/400 kB | 115 kB | 163/297 kB
Progress (4): 36 kB | 155/400 kB | 115 kB | 163/297 kB
Progress (4): 36 kB | 159/400 kB | 115 kB | 163/297 kB
Progress (4): 36 kB | 163/400 kB | 115 kB | 163/297 kB
Progress (4): 36 kB | 163/400 kB | 115 kB | 167/297 kB
Progress (4): 36 kB | 163/400 kB | 115 kB | 171/297 kB
Progress (4): 36 kB | 163/400 kB | 115 kB | 176/297 kB
Progress (4): 36 kB | 163/400 kB | 115 kB | 180/297 kB
Progress (5): 36 kB | 163/400 kB | 115 kB | 180/297 kB | 2.2/169 kB
Progress (5): 36 kB | 163/400 kB | 115 kB | 184/297 kB | 2.2/169 kB
Progress (5): 36 kB | 163/400 kB | 115 kB | 184/297 kB | 5.0/169 kB
Progress (5): 36 kB | 163/400 kB | 115 kB | 188/297 kB | 5.0/169 kB
Progress (5): 36 kB | 163/400 kB | 115 kB | 192/297 kB | 5.0/169 kB
Progress (5): 36 kB | 163/400 kB | 115 kB | 192/297 kB | 7.7/169 kB
Progress (5): 36 kB | 163/400 kB | 115 kB | 196/297 kB | 7.7/169 kB
Progress (5): 36 kB | 163/400 kB | 115 kB | 196/297 kB | 10/169 kB 
Progress (5): 36 kB | 163/400 kB | 115 kB | 196/297 kB | 13/169 kB
Progress (5): 36 kB | 163/400 kB | 115 kB | 196/297 kB | 16/169 kB
Progress (5): 36 kB | 163/400 kB | 115 kB | 200/297 kB | 16/169 kB
Progress (5): 36 kB | 163/400 kB | 115 kB | 200/297 kB | 19/169 kB
Progress (5): 36 kB | 163/400 kB | 115 kB | 204/297 kB | 19/169 kB
Progress (5): 36 kB | 163/400 kB | 115 kB | 204/297 kB | 21/169 kB
Progress (5): 36 kB | 163/400 kB | 115 kB | 208/297 kB | 21/169 kB
Progress (5): 36 kB | 163/400 kB | 115 kB | 208/297 kB | 24/169 kB
Progress (5): 36 kB | 163/400 kB | 115 kB | 212/297 kB | 24/169 kB
Progress (5): 36 kB | 163/400 kB | 115 kB | 212/297 kB | 27/169 kB
Progress (5): 36 kB | 163/400 kB | 115 kB | 212/297 kB | 30/169 kB
Progress (5): 36 kB | 163/400 kB | 115 kB | 212/297 kB | 32/169 kB
Progress (5): 36 kB | 163/400 kB | 115 kB | 217/297 kB | 32/169 kB
Progress (5): 36 kB | 163/400 kB | 115 kB | 221/297 kB | 32/169 kB
Progress (5): 36 kB | 163/400 kB | 115 kB | 225/297 kB | 32/169 kB
Progress (5): 36 kB | 163/400 kB | 115 kB | 225/297 kB | 36/169 kB
Progress (5): 36 kB | 163/400 kB | 115 kB | 229/297 kB | 36/169 kB
Progress (5): 36 kB | 163/400 kB | 115 kB | 229/297 kB | 40/169 kB
Progress (5): 36 kB | 163/400 kB | 115 kB | 229/297 kB | 45/169 kB
Progress (5): 36 kB | 163/400 kB | 115 kB | 229/297 kB | 49/169 kB
Progress (5): 36 kB | 163/400 kB | 115 kB | 233/297 kB | 49/169 kB
Progress (5): 36 kB | 163/400 kB | 115 kB | 237/297 kB | 49/169 kB
Progress (5): 36 kB | 163/400 kB | 115 kB | 237/297 kB | 53/169 kB
Progress (5): 36 kB | 163/400 kB | 115 kB | 241/297 kB | 53/169 kB
                                                                  
Downloaded from sonatype-releases: https://oss.sonatype.org/content/repositories/releases/org/eclipse/platform/org.eclipse.core.variables/3.4.800/org.eclipse.core.variables-3.4.800.jar (36 kB at 19 kB/s)
Progress (4): 163/400 kB | 115 kB | 245/297 kB | 53/169 kB
Progress (4): 163/400 kB | 115 kB | 245/297 kB | 57/169 kB
Progress (4): 163/400 kB | 115 kB | 245/297 kB | 61/169 kB
Progress (4): 163/400 kB | 115 kB | 245/297 kB | 65/169 kB
Progress (4): 163/400 kB | 115 kB | 249/297 kB | 65/169 kB
Progress (4): 163/400 kB | 115 kB | 249/297 kB | 69/169 kB
Progress (4): 163/400 kB | 115 kB | 253/297 kB | 69/169 kB
Progress (4): 163/400 kB | 115 kB | 253/297 kB | 73/169 kB
Progress (4): 163/400 kB | 115 kB | 258/297 kB | 73/169 kB
Progress (4): 163/400 kB | 115 kB | 258/297 kB | 77/169 kB
Progress (4): 163/400 kB | 115 kB | 262/297 kB | 77/169 kB
Progress (4): 163/400 kB | 115 kB | 262/297 kB | 81/169 kB
Progress (4): 163/400 kB | 115 kB | 266/297 kB | 81/169 kB
Progress (4): 163/400 kB | 115 kB | 270/297 kB | 81/169 kB
Progress (4): 167/400 kB | 115 kB | 270/297 kB | 81/169 kB
Progress (4): 167/400 kB | 115 kB | 274/297 kB | 81/169 kB
Progress (4): 171/400 kB | 115 kB | 274/297 kB | 81/169 kB
Progress (4): 171/400 kB | 115 kB | 278/297 kB | 81/169 kB
Progress (4): 176/400 kB | 115 kB | 278/297 kB | 81/169 kB
Progress (4): 180/400 kB | 115 kB | 278/297 kB | 81/169 kB
Progress (4): 180/400 kB | 115 kB | 282/297 kB | 81/169 kB
Progress (4): 184/400 kB | 115 kB | 282/297 kB | 81/169 kB
Progress (4): 184/400 kB | 115 kB | 286/297 kB | 81/169 kB
Progress (4): 188/400 kB | 115 kB | 286/297 kB | 81/169 kB
Progress (4): 188/400 kB | 115 kB | 290/297 kB | 81/169 kB
Progress (4): 192/400 kB | 115 kB | 290/297 kB | 81/169 kB
Progress (4): 192/400 kB | 115 kB | 294/297 kB | 81/169 kB
Progress (4): 196/400 kB | 115 kB | 294/297 kB | 81/169 kB
Progress (4): 196/400 kB | 115 kB | 297 kB | 81/169 kB    
Progress (4): 200/400 kB | 115 kB | 297 kB | 81/169 kB
Progress (4): 204/400 kB | 115 kB | 297 kB | 81/169 kB
Progress (4): 208/400 kB | 115 kB | 297 kB | 81/169 kB
Progress (4): 212/400 kB | 115 kB | 297 kB | 81/169 kB
Progress (4): 217/400 kB | 115 kB | 297 kB | 81/169 kB
Progress (4): 221/400 kB | 115 kB | 297 kB | 81/169 kB
Progress (4): 225/400 kB | 115 kB | 297 kB | 81/169 kB
Progress (4): 225/400 kB | 115 kB | 297 kB | 85/169 kB
Progress (4): 229/400 kB | 115 kB | 297 kB | 85/169 kB
Progress (4): 229/400 kB | 115 kB | 297 kB | 90/169 kB
Progress (4): 229/400 kB | 115 kB | 297 kB | 94/169 kB
Progress (4): 229/400 kB | 115 kB | 297 kB | 98/169 kB
Progress (4): 229/400 kB | 115 kB | 297 kB | 102/169 kB
Progress (4): 229/400 kB | 115 kB | 297 kB | 106/169 kB
Progress (4): 229/400 kB | 115 kB | 297 kB | 110/169 kB
Progress (4): 229/400 kB | 115 kB | 297 kB | 114/169 kB
Progress (4): 229/400 kB | 115 kB | 297 kB | 118/169 kB
Progress (4): 229/400 kB | 115 kB | 297 kB | 122/169 kB
Progress (4): 229/400 kB | 115 kB | 297 kB | 126/169 kB
Progress (4): 229/400 kB | 115 kB | 297 kB | 131/169 kB
Progress (4): 229/400 kB | 115 kB | 297 kB | 135/169 kB
Progress (4): 229/400 kB | 115 kB | 297 kB | 139/169 kB
Progress (4): 229/400 kB | 115 kB | 297 kB | 143/169 kB
Progress (4): 229/400 kB | 115 kB | 297 kB | 147/169 kB
Progress (4): 233/400 kB | 115 kB | 297 kB | 147/169 kB
Progress (4): 237/400 kB | 115 kB | 297 kB | 147/169 kB
Progress (4): 241/400 kB | 115 kB | 297 kB | 147/169 kB
Progress (4): 245/400 kB | 115 kB | 297 kB | 147/169 kB
Progress (4): 245/400 kB | 115 kB | 297 kB | 151/169 kB
Progress (4): 245/400 kB | 115 kB | 297 kB | 155/169 kB
Progress (4): 245/400 kB | 115 kB | 297 kB | 159/169 kB
Progress (4): 245/400 kB | 115 kB | 297 kB | 163/169 kB
Progress (4): 249/400 kB | 115 kB | 297 kB | 163/169 kB
Progress (4): 249/400 kB | 115 kB | 297 kB | 167/169 kB
Progress (4): 253/400 kB | 115 kB | 297 kB | 167/169 kB
Progress (4): 253/400 kB | 115 kB | 297 kB | 169 kB    
Progress (4): 258/400 kB | 115 kB | 297 kB | 169 kB
Progress (4): 262/400 kB | 115 kB | 297 kB | 169 kB
Progress (4): 266/400 kB | 115 kB | 297 kB | 169 kB
Progress (4): 270/400 kB | 115 kB | 297 kB | 169 kB
Progress (4): 274/400 kB | 115 kB | 297 kB | 169 kB
Progress (4): 278/400 kB | 115 kB | 297 kB | 169 kB
Progress (4): 282/400 kB | 115 kB | 297 kB | 169 kB
Progress (4): 286/400 kB | 115 kB | 297 kB | 169 kB
Progress (4): 290/400 kB | 115 kB | 297 kB | 169 kB
Progress (4): 294/400 kB | 115 kB | 297 kB | 169 kB
Progress (4): 298/400 kB | 115 kB | 297 kB | 169 kB
Progress (4): 303/400 kB | 115 kB | 297 kB | 169 kB
Progress (4): 307/400 kB | 115 kB | 297 kB | 169 kB
Progress (4): 311/400 kB | 115 kB | 297 kB | 169 kB
Progress (4): 315/400 kB | 115 kB | 297 kB | 169 kB
Progress (4): 319/400 kB | 115 kB | 297 kB | 169 kB
Progress (4): 323/400 kB | 115 kB | 297 kB | 169 kB
Progress (4): 327/400 kB | 115 kB | 297 kB | 169 kB
Progress (4): 331/400 kB | 115 kB | 297 kB | 169 kB
Progress (4): 335/400 kB | 115 kB | 297 kB | 169 kB
Progress (4): 339/400 kB | 115 kB | 297 kB | 169 kB
Progress (4): 344/400 kB | 115 kB | 297 kB | 169 kB
Progress (4): 348/400 kB | 115 kB | 297 kB | 169 kB
Progress (4): 352/400 kB | 115 kB | 297 kB | 169 kB
Progress (4): 356/400 kB | 115 kB | 297 kB | 169 kB
                                                   
Downloaded from sonatype-releases: https://oss.sonatype.org/content/repositories/releases/org/eclipse/platform/org.eclipse.core.commands/3.9.600/org.eclipse.core.commands-3.9.600.jar (115 kB at 58 kB/s)
Progress (3): 360/400 kB | 297 kB | 169 kB
Progress (3): 364/400 kB | 297 kB | 169 kB
Progress (3): 368/400 kB | 297 kB | 169 kB
Progress (3): 372/400 kB | 297 kB | 169 kB
Progress (3): 376/400 kB | 297 kB | 169 kB
Progress (3): 380/400 kB | 297 kB | 169 kB
Progress (3): 384/400 kB | 297 kB | 169 kB
Progress (3): 389/400 kB | 297 kB | 169 kB
Progress (3): 393/400 kB | 297 kB | 169 kB
                                          
Downloaded from sonatype-releases: https://oss.sonatype.org/content/repositories/releases/org/eclipse/platform/org.eclipse.text/3.10.0/org.eclipse.text-3.10.0.jar (297 kB at 150 kB/s)
Progress (2): 397/400 kB | 169 kB
Progress (2): 400 kB | 169 kB    
                             
Downloaded from sonatype-releases: https://oss.sonatype.org/content/repositories/releases/org/codehaus/plexus/plexus-utils/1.1/plexus-utils-1.1.jar (169 kB at 84 kB/s)
Downloaded from sonatype-releases: https://oss.sonatype.org/content/repositories/releases/org/eclipse/platform/org.eclipse.debug.core/3.15.0/org.eclipse.debug.core-3.15.0.jar (400 kB at 195 kB/s)
[INFO] 
[INFO] --- maven-resources-plugin:2.4.3:resources (default-resources) @ org.eclipse.emf.parsley.generator.common ---
[INFO] Using 'UTF-8' encoding to copy filtered resources.
[INFO] skip non existing resourceDirectory /jobs/genie.emf-parsley/emf-parsley-tycho-gerrit/workspace/plugins/org.eclipse.emf.parsley.generator.common/src/main/resources
[INFO] 
[INFO] --- tycho-compiler-plugin:1.6.0:compile (default-compile) @ org.eclipse.emf.parsley.generator.common ---
[INFO] Compiling 2 source files to /jobs/genie.emf-parsley/emf-parsley-tycho-gerrit/workspace/plugins/org.eclipse.emf.parsley.generator.common/target/classes
[INFO] 
[INFO] --- xtend-maven-plugin:2.21.0:xtend-install-debug-info (default) @ org.eclipse.emf.parsley.generator.common ---
[WARNING] Directory /jobs/genie.emf-parsley/emf-parsley-tycho-gerrit/workspace/plugins/org.eclipse.emf.parsley.generator.common/src/main/java is empty. Can't process.
[INFO] Installing Xtend files into 2 class files as secondary (via SMAP) debug sources in: /jobs/genie.emf-parsley/emf-parsley-tycho-gerrit/workspace/plugins/org.eclipse.emf.parsley.generator.common/target/classes
[INFO] 
[INFO] --- xtend-maven-plugin:2.21.0:testCompile (default) @ org.eclipse.emf.parsley.generator.common ---
[INFO] Can't find Xtend properties under /jobs/genie.emf-parsley/emf-parsley-tycho-gerrit/workspace/plugins/org.eclipse.emf.parsley.generator.common/.settings/org.eclipse.xtend.core.Xtend.prefs, maven defaults are used.
[INFO] skip compiling sources because the configured directory '[/jobs/genie.emf-parsley/emf-parsley-tycho-gerrit/workspace/plugins/org.eclipse.emf.parsley.generator.common/src/test/java]' does not exist.
[INFO] 
[INFO] --- maven-resources-plugin:2.4.3:testResources (default-testResources) @ org.eclipse.emf.parsley.generator.common ---
[INFO] Using 'UTF-8' encoding to copy filtered resources.
[INFO] skip non existing resourceDirectory /jobs/genie.emf-parsley/emf-parsley-tycho-gerrit/workspace/plugins/org.eclipse.emf.parsley.generator.common/src/test/resources
[INFO] 
[INFO] --- xtend-maven-plugin:2.21.0:xtend-test-install-debug-info (default) @ org.eclipse.emf.parsley.generator.common ---
[WARNING] Directory /jobs/genie.emf-parsley/emf-parsley-tycho-gerrit/workspace/plugins/org.eclipse.emf.parsley.generator.common/src/test/java is empty. Can't process.
[WARNING] Directory /jobs/genie.emf-parsley/emf-parsley-tycho-gerrit/workspace/plugins/org.eclipse.emf.parsley.generator.common/src/test/generated-sources/xtend is empty. Can't process.
[INFO] Installing Xtend files into 0 class files as secondary (via SMAP) debug sources in: /jobs/genie.emf-parsley/emf-parsley-tycho-gerrit/workspace/plugins/org.eclipse.emf.parsley.generator.common/target/test-classes
[INFO] 
[INFO] --- tycho-source-plugin:1.6.0:plugin-source (plugin-source) @ org.eclipse.emf.parsley.generator.common ---
[INFO] Building jar: /jobs/genie.emf-parsley/emf-parsley-tycho-gerrit/workspace/plugins/org.eclipse.emf.parsley.generator.common/target/org.eclipse.emf.parsley.generator.common-1.10.0-SNAPSHOT-sources.jar
[INFO] 
[INFO] --- target-platform-configuration:1.6.0:target-platform (default-target-platform) @ org.eclipse.emf.parsley.generator.common ---
[INFO] 
[INFO] --- tycho-packaging-plugin:1.6.0:package-plugin (default-package-plugin) @ org.eclipse.emf.parsley.generator.common ---
[INFO] Building jar: /jobs/genie.emf-parsley/emf-parsley-tycho-gerrit/workspace/plugins/org.eclipse.emf.parsley.generator.common/target/org.eclipse.emf.parsley.generator.common-1.10.0-SNAPSHOT.jar
[INFO] 
[INFO] --- tycho-p2-plugin:1.6.0:p2-metadata-default (default-p2-metadata-default) @ org.eclipse.emf.parsley.generator.common ---
[INFO] 
[INFO] --- tycho-source-feature-plugin:1.6.0:source-feature (source-feature) @ org.eclipse.emf.parsley.generator.common ---
[INFO] 
[INFO] --- tycho-p2-plugin:1.6.0:p2-metadata (attach-p2-metadata) @ org.eclipse.emf.parsley.generator.common ---
[INFO] 
[INFO] >>> findbugs-maven-plugin:3.0.5:check (default) > :findbugs @ org.eclipse.emf.parsley.generator.common >>>
[INFO] 
[INFO] --- findbugs-maven-plugin:3.0.5:findbugs (findbugs) @ org.eclipse.emf.parsley.generator.common ---
[INFO] Fork Value is true
     [java] Picked up JAVA_TOOL_OPTIONS: -Xmx2G -Djava.io.tmpdir=/tmp/genie.emf-parsley -DforkCount=1
[INFO] Done FindBugs Analysis....
[INFO] 
[INFO] <<< findbugs-maven-plugin:3.0.5:check (default) < :findbugs @ org.eclipse.emf.parsley.generator.common <<<
[INFO] 
[INFO] 
[INFO] --- findbugs-maven-plugin:3.0.5:check (default) @ org.eclipse.emf.parsley.generator.common ---
[INFO] BugInstance size is 0
[INFO] Error size is 0
[INFO] No errors/warnings found
[INFO] 
[INFO] --------< org.eclipse.emf.parsley:org.eclipse.emf.parsley.dsl >---------
[INFO] Building org.eclipse.emf.parsley.dsl 1.10.0-SNAPSHOT             [13/62]
[INFO] ---------------------------[ eclipse-plugin ]---------------------------
[INFO] 
[INFO] --- maven-clean-plugin:2.5:clean (default-clean) @ org.eclipse.emf.parsley.dsl ---
[INFO] Deleting /jobs/genie.emf-parsley/emf-parsley-tycho-gerrit/workspace/dsl/org.eclipse.emf.parsley.dsl/xtend-gen (includes = [], excludes = [.gitignore])
[INFO] 
[INFO] --- tycho-packaging-plugin:1.6.0:build-qualifier (default-build-qualifier) @ org.eclipse.emf.parsley.dsl ---
[INFO] The project's OSGi version is 1.10.0.v20200415-1301
[INFO] 
[INFO] --- tycho-packaging-plugin:1.6.0:validate-id (default-validate-id) @ org.eclipse.emf.parsley.dsl ---
[INFO] 
[INFO] --- tycho-packaging-plugin:1.6.0:validate-version (default-validate-version) @ org.eclipse.emf.parsley.dsl ---
[INFO] 
[INFO] --- exec-maven-plugin:1.4.0:java (mwe2Launcher) @ org.eclipse.emf.parsley.dsl ---
Downloading from sonatype-releases: https://oss.sonatype.org/content/repositories/releases/org/eclipse/emf/org.eclipse.emf.mwe2.launch/2.11.1/org.eclipse.emf.mwe2.launch-2.11.1.pom
Progress (1): 1.4 kB
                    
Downloaded from sonatype-releases: https://oss.sonatype.org/content/repositories/releases/org/eclipse/emf/org.eclipse.emf.mwe2.launch/2.11.1/org.eclipse.emf.mwe2.launch-2.11.1.pom (1.4 kB at 9.3 kB/s)
Downloading from sonatype-releases: https://oss.sonatype.org/content/repositories/releases/org/eclipse/emf/org.eclipse.emf.mwe2.plugins-parent/2.11.1/org.eclipse.emf.mwe2.plugins-parent-2.11.1.pom
Progress (1): 2.2/3.9 kB
Progress (1): 3.9 kB    
                    
Downloaded from sonatype-releases: https://oss.sonatype.org/content/repositories/releases/org/eclipse/emf/org.eclipse.emf.mwe2.plugins-parent/2.11.1/org.eclipse.emf.mwe2.plugins-parent-2.11.1.pom (3.9 kB at 23 kB/s)
Downloading from sonatype-releases: https://oss.sonatype.org/content/repositories/releases/org/eclipse/emf/org.eclipse.emf.mwe2.parent/2.11.1/org.eclipse.emf.mwe2.parent-2.11.1.pom
Progress (1): 2.2/9.6 kB
Progress (1): 5.0/9.6 kB
Progress (1): 7.8/9.6 kB
Progress (1): 9.6 kB    
                    
Downloaded from sonatype-releases: https://oss.sonatype.org/content/repositories/releases/org/eclipse/emf/org.eclipse.emf.mwe2.parent/2.11.1/org.eclipse.emf.mwe2.parent-2.11.1.pom (9.6 kB at 66 kB/s)
Downloading from sonatype-snapshots: https://oss.sonatype.org/content/repositories/snapshots/org/eclipse/emf/org.eclipse.emf.mwe2.runtime/maven-metadata.xml
Downloading from sonatype-releases: https://oss.sonatype.org/content/repositories/releases/org/eclipse/emf/org.eclipse.emf.mwe2.runtime/maven-metadata.xml
Downloading from cbi-release: https://repo.eclipse.org/content/repositories/cbi-releases/org/eclipse/emf/org.eclipse.emf.mwe2.runtime/maven-metadata.xml
Downloading from repo.eclipse.org: https://repo.eclipse.org/content/repositories/maven_central/org/eclipse/emf/org.eclipse.emf.mwe2.runtime/maven-metadata.xml
Progress (1): 689 B
Progress (2): 689 B | 797 B
Progress (3): 689 B | 797 B | 797 B
                                   
Downloaded from repo.eclipse.org: https://repo.eclipse.org/content/repositories/maven_central/org/eclipse/emf/org.eclipse.emf.mwe2.runtime/maven-metadata.xml (797 B at 15 kB/s)
Downloaded from sonatype-snapshots: https://oss.sonatype.org/content/repositories/snapshots/org/eclipse/emf/org.eclipse.emf.mwe2.runtime/maven-metadata.xml (689 B at 8.9 kB/s)
Downloaded from sonatype-releases: https://oss.sonatype.org/content/repositories/releases/org/eclipse/emf/org.eclipse.emf.mwe2.runtime/maven-metadata.xml (797 B at 8.0 kB/s)
Downloading from sonatype-releases: https://oss.sonatype.org/content/repositories/releases/org/eclipse/emf/org.eclipse.emf.mwe2.runtime/2.11.1/org.eclipse.emf.mwe2.runtime-2.11.1.pom
Progress (1): 837 B
                   
Downloaded from sonatype-releases: https://oss.sonatype.org/content/repositories/releases/org/eclipse/emf/org.eclipse.emf.mwe2.runtime/2.11.1/org.eclipse.emf.mwe2.runtime-2.11.1.pom (837 B at 5.3 kB/s)
Downloading from sonatype-snapshots: https://oss.sonatype.org/content/repositories/snapshots/org/eclipse/emf/org.eclipse.emf.mwe2.language/maven-metadata.xml
Downloading from sonatype-releases: https://oss.sonatype.org/content/repositories/releases/org/eclipse/emf/org.eclipse.emf.mwe2.language/maven-metadata.xml
Downloading from repo.eclipse.org: https://repo.eclipse.org/content/repositories/maven_central/org/eclipse/emf/org.eclipse.emf.mwe2.language/maven-metadata.xml
Downloading from cbi-release: https://repo.eclipse.org/content/repositories/cbi-releases/org/eclipse/emf/org.eclipse.emf.mwe2.language/maven-metadata.xml
Progress (1): 798 B
                   
Downloaded from repo.eclipse.org: https://repo.eclipse.org/content/repositories/maven_central/org/eclipse/emf/org.eclipse.emf.mwe2.language/maven-metadata.xml (798 B at 36 kB/s)
Progress (1): 690 B
Progress (2): 690 B | 798 B
                           
Downloaded from sonatype-snapshots: https://oss.sonatype.org/content/repositories/snapshots/org/eclipse/emf/org.eclipse.emf.mwe2.language/maven-metadata.xml (690 B at 9.6 kB/s)
Downloaded from sonatype-releases: https://oss.sonatype.org/content/repositories/releases/org/eclipse/emf/org.eclipse.emf.mwe2.language/maven-metadata.xml (798 B at 7.6 kB/s)
Downloading from sonatype-releases: https://oss.sonatype.org/content/repositories/releases/org/eclipse/emf/org.eclipse.emf.mwe2.language/2.11.1/org.eclipse.emf.mwe2.language-2.11.1.pom
Progress (1): 856 B
                   
Downloaded from sonatype-releases: https://oss.sonatype.org/content/repositories/releases/org/eclipse/emf/org.eclipse.emf.mwe2.language/2.11.1/org.eclipse.emf.mwe2.language-2.11.1.pom (856 B at 5.6 kB/s)
Downloading from sonatype-releases: https://oss.sonatype.org/content/repositories/releases/commons-cli/commons-cli/1.2/commons-cli-1.2.pom
Progress (1): 2.2/8.0 kB
Progress (1): 5.0/8.0 kB
Progress (1): 7.8/8.0 kB
Progress (1): 8.0 kB    
                    
Downloaded from sonatype-releases: https://oss.sonatype.org/content/repositories/releases/commons-cli/commons-cli/1.2/commons-cli-1.2.pom (8.0 kB at 75 kB/s)
Downloading from sonatype-releases: https://oss.sonatype.org/content/repositories/releases/org/apache/commons/commons-parent/11/commons-parent-11.pom
Progress (1): 2.2/25 kB
Progress (1): 5.0/25 kB
Progress (1): 7.8/25 kB
Progress (1): 11/25 kB 
Progress (1): 13/25 kB
Progress (1): 16/25 kB
Progress (1): 19/25 kB
Progress (1): 21/25 kB
Progress (1): 24/25 kB
Progress (1): 25 kB   
                   
Downloaded from sonatype-releases: https://oss.sonatype.org/content/repositories/releases/org/apache/commons/commons-parent/11/commons-parent-11.pom (25 kB at 237 kB/s)
Downloading from cbi-release: https://repo.eclipse.org/content/repositories/cbi-releases/org/eclipse/emf/org.eclipse.emf.common/maven-metadata.xml
Downloading from cbi-release: https://repo.eclipse.org/content/repositories/cbi-releases/org/eclipse/emf/org.eclipse.emf.ecore/maven-metadata.xml
Downloading from sonatype-releases: https://oss.sonatype.org/content/repositories/releases/org/eclipse/xtext/org.eclipse.xtext.xtext.generator/2.21.0/org.eclipse.xtext.xtext.generator-2.21.0.pom
Progress (1): 2.3/9.0 kB
Progress (1): 5.0/9.0 kB
Progress (1): 7.8/9.0 kB
Progress (1): 9.0 kB    
                    
Downloaded from sonatype-releases: https://oss.sonatype.org/content/repositories/releases/org/eclipse/xtext/org.eclipse.xtext.xtext.generator/2.21.0/org.eclipse.xtext.xtext.generator-2.21.0.pom (9.0 kB at 90 kB/s)
Downloading from sonatype-releases: https://oss.sonatype.org/content/repositories/releases/org/eclipse/platform/org.eclipse.core.runtime/maven-metadata.xml
Downloading from sonatype-snapshots: https://oss.sonatype.org/content/repositories/snapshots/org/eclipse/platform/org.eclipse.core.runtime/maven-metadata.xml
Downloading from cbi-release: https://repo.eclipse.org/content/repositories/cbi-releases/org/eclipse/platform/org.eclipse.core.runtime/maven-metadata.xml
Downloading from repo.eclipse.org: https://repo.eclipse.org/content/repositories/maven_central/org/eclipse/platform/org.eclipse.core.runtime/maven-metadata.xml
Progress (1): 654 B
Progress (2): 654 B | 654 B
                           
Downloaded from repo.eclipse.org: https://repo.eclipse.org/content/repositories/maven_central/org/eclipse/platform/org.eclipse.core.runtime/maven-metadata.xml (654 B at 3.9 kB/s)
Downloaded from sonatype-releases: https://oss.sonatype.org/content/repositories/releases/org/eclipse/platform/org.eclipse.core.runtime/maven-metadata.xml (654 B at 2.9 kB/s)
Downloading from sonatype-releases: https://oss.sonatype.org/content/repositories/releases/org/eclipse/platform/org.eclipse.core.runtime/3.12.0/org.eclipse.core.runtime-3.12.0.pom
Progress (1): 2.2/3.2 kB
Progress (1): 3.2 kB    
                    
Downloaded from sonatype-releases: https://oss.sonatype.org/content/repositories/releases/org/eclipse/platform/org.eclipse.core.runtime/3.12.0/org.eclipse.core.runtime-3.12.0.pom (3.2 kB at 23 kB/s)
Downloading from cbi-release: https://repo.eclipse.org/content/repositories/cbi-releases/org/eclipse/platform/org.eclipse.osgi/maven-metadata.xml
Downloading from sonatype-releases: https://oss.sonatype.org/content/repositories/releases/org/eclipse/platform/org.eclipse.osgi/maven-metadata.xml
Downloading from sonatype-snapshots: https://oss.sonatype.org/content/repositories/snapshots/org/eclipse/platform/org.eclipse.osgi/maven-metadata.xml
Downloading from repo.eclipse.org: https://repo.eclipse.org/content/repositories/maven_central/org/eclipse/platform/org.eclipse.osgi/maven-metadata.xml
Progress (1): 747 B
                   
Downloaded from repo.eclipse.org: https://repo.eclipse.org/content/repositories/maven_central/org/eclipse/platform/org.eclipse.osgi/maven-metadata.xml (747 B at 23 kB/s)
Progress (1): 747 B
                   
Downloaded from sonatype-releases: https://oss.sonatype.org/content/repositories/releases/org/eclipse/platform/org.eclipse.osgi/maven-metadata.xml (747 B at 6.0 kB/s)
Downloading from sonatype-releases: https://oss.sonatype.org/content/repositories/releases/org/eclipse/platform/org.eclipse.osgi/3.11.2/org.eclipse.osgi-3.11.2.pom
Progress (1): 1.7 kB
                    
Downloaded from sonatype-releases: https://oss.sonatype.org/content/repositories/releases/org/eclipse/platform/org.eclipse.osgi/3.11.2/org.eclipse.osgi-3.11.2.pom (1.7 kB at 12 kB/s)
Downloading from sonatype-releases: https://oss.sonatype.org/content/repositories/releases/org/eclipse/platform/org.eclipse.osgi/3.11.3/org.eclipse.osgi-3.11.3.pom
Progress (1): 1.7 kB
                    
Downloaded from sonatype-releases: https://oss.sonatype.org/content/repositories/releases/org/eclipse/platform/org.eclipse.osgi/3.11.3/org.eclipse.osgi-3.11.3.pom (1.7 kB at 12 kB/s)
Downloading from sonatype-releases: https://oss.sonatype.org/content/repositories/releases/org/eclipse/platform/org.eclipse.osgi/3.12.0/org.eclipse.osgi-3.12.0.pom
Progress (1): 1.7 kB
                    
Downloaded from sonatype-releases: https://oss.sonatype.org/content/repositories/releases/org/eclipse/platform/org.eclipse.osgi/3.12.0/org.eclipse.osgi-3.12.0.pom (1.7 kB at 12 kB/s)
Downloading from sonatype-releases: https://oss.sonatype.org/content/repositories/releases/org/eclipse/platform/org.eclipse.osgi/3.12.50/org.eclipse.osgi-3.12.50.pom
Progress (1): 1.7 kB
                    
Downloaded from sonatype-releases: https://oss.sonatype.org/content/repositories/releases/org/eclipse/platform/org.eclipse.osgi/3.12.50/org.eclipse.osgi-3.12.50.pom (1.7 kB at 12 kB/s)
Downloading from sonatype-releases: https://oss.sonatype.org/content/repositories/releases/org/eclipse/platform/org.eclipse.osgi/3.12.100/org.eclipse.osgi-3.12.100.pom
Progress (1): 1.7 kB
                    
Downloaded from sonatype-releases: https://oss.sonatype.org/content/repositories/releases/org/eclipse/platform/org.eclipse.osgi/3.12.100/org.eclipse.osgi-3.12.100.pom (1.7 kB at 12 kB/s)
Downloading from sonatype-releases: https://oss.sonatype.org/content/repositories/releases/org/eclipse/platform/org.eclipse.osgi/3.13.0/org.eclipse.osgi-3.13.0.pom
Progress (1): 1.7 kB
                    
Downloaded from sonatype-releases: https://oss.sonatype.org/content/repositories/releases/org/eclipse/platform/org.eclipse.osgi/3.13.0/org.eclipse.osgi-3.13.0.pom (1.7 kB at 12 kB/s)
Downloading from sonatype-releases: https://oss.sonatype.org/content/repositories/releases/org/eclipse/platform/org.eclipse.osgi/3.13.100/org.eclipse.osgi-3.13.100.pom
Progress (1): 1.7 kB
                    
Downloaded from sonatype-releases: https://oss.sonatype.org/content/repositories/releases/org/eclipse/platform/org.eclipse.osgi/3.13.100/org.eclipse.osgi-3.13.100.pom (1.7 kB at 10 kB/s)
Downloading from sonatype-releases: https://oss.sonatype.org/content/repositories/releases/org/eclipse/platform/org.eclipse.osgi/3.13.200/org.eclipse.osgi-3.13.200.pom
Progress (1): 1.7 kB
                    
Downloaded from sonatype-releases: https://oss.sonatype.org/content/repositories/releases/org/eclipse/platform/org.eclipse.osgi/3.13.200/org.eclipse.osgi-3.13.200.pom (1.7 kB at 12 kB/s)
Downloading from sonatype-releases: https://oss.sonatype.org/content/repositories/releases/org/eclipse/platform/org.eclipse.osgi/3.13.300/org.eclipse.osgi-3.13.300.pom
Progress (1): 1.7 kB
                    
Downloaded from sonatype-releases: https://oss.sonatype.org/content/repositories/releases/org/eclipse/platform/org.eclipse.osgi/3.13.300/org.eclipse.osgi-3.13.300.pom (1.7 kB at 12 kB/s)
Downloading from sonatype-releases: https://oss.sonatype.org/content/repositories/releases/org/eclipse/platform/org.eclipse.osgi/3.14.0/org.eclipse.osgi-3.14.0.pom
Progress (1): 1.7 kB
                    
Downloaded from sonatype-releases: https://oss.sonatype.org/content/repositories/releases/org/eclipse/platform/org.eclipse.osgi/3.14.0/org.eclipse.osgi-3.14.0.pom (1.7 kB at 13 kB/s)
Downloading from sonatype-releases: https://oss.sonatype.org/content/repositories/releases/org/eclipse/platform/org.eclipse.osgi/3.15.0/org.eclipse.osgi-3.15.0.pom
Progress (1): 1.7 kB
                    
Downloaded from sonatype-releases: https://oss.sonatype.org/content/repositories/releases/org/eclipse/platform/org.eclipse.osgi/3.15.0/org.eclipse.osgi-3.15.0.pom (1.7 kB at 12 kB/s)
Downloading from sonatype-releases: https://oss.sonatype.org/content/repositories/releases/org/eclipse/platform/org.eclipse.osgi/3.15.200/org.eclipse.osgi-3.15.200.pom
Progress (1): 1.7 kB
                    
Downloaded from sonatype-releases: https://oss.sonatype.org/content/repositories/releases/org/eclipse/platform/org.eclipse.osgi/3.15.200/org.eclipse.osgi-3.15.200.pom (1.7 kB at 17 kB/s)
Downloading from cbi-release: https://repo.eclipse.org/content/repositories/cbi-releases/org/eclipse/platform/org.eclipse.equinox.common/maven-metadata.xml
Downloading from repo.eclipse.org: https://repo.eclipse.org/content/repositories/maven_central/org/eclipse/platform/org.eclipse.equinox.common/maven-metadata.xml
Downloading from sonatype-snapshots: https://oss.sonatype.org/content/repositories/snapshots/org/eclipse/platform/org.eclipse.equinox.common/maven-metadata.xml
Downloading from sonatype-releases: https://oss.sonatype.org/content/repositories/releases/org/eclipse/platform/org.eclipse.equinox.common/maven-metadata.xml
Progress (1): 654 B
                   
Progress (2): 654 B | 654 B
                           
Downloaded from repo.eclipse.org: https://repo.eclipse.org/content/repositories/maven_central/org/eclipse/platform/org.eclipse.equinox.common/maven-metadata.xml (654 B at 11 kB/s)
Downloaded from sonatype-releases: https://oss.sonatype.org/content/repositories/releases/org/eclipse/platform/org.eclipse.equinox.common/maven-metadata.xml (654 B at 2.2 kB/s)
Downloading from sonatype-releases: https://oss.sonatype.org/content/repositories/releases/org/eclipse/platform/org.eclipse.equinox.common/3.8.0/org.eclipse.equinox.common-3.8.0.pom
Progress (1): 1.7 kB
                    
Downloaded from sonatype-releases: https://oss.sonatype.org/content/repositories/releases/org/eclipse/platform/org.eclipse.equinox.common/3.8.0/org.eclipse.equinox.common-3.8.0.pom (1.7 kB at 12 kB/s)
Downloading from sonatype-releases: https://oss.sonatype.org/content/repositories/releases/org/eclipse/platform/org.eclipse.equinox.common/3.9.0/org.eclipse.equinox.common-3.9.0.pom
Progress (1): 1.7 kB
                    
Downloaded from sonatype-releases: https://oss.sonatype.org/content/repositories/releases/org/eclipse/platform/org.eclipse.equinox.common/3.9.0/org.eclipse.equinox.common-3.9.0.pom (1.7 kB at 12 kB/s)
Downloading from sonatype-releases: https://oss.sonatype.org/content/repositories/releases/org/eclipse/platform/org.eclipse.equinox.common/3.10.0/org.eclipse.equinox.common-3.10.0.pom
Progress (1): 1.7 kB
                    
Downloaded from sonatype-releases: https://oss.sonatype.org/content/repositories/releases/org/eclipse/platform/org.eclipse.equinox.common/3.10.0/org.eclipse.equinox.common-3.10.0.pom (1.7 kB at 13 kB/s)
Downloading from sonatype-releases: https://oss.sonatype.org/content/repositories/releases/org/eclipse/platform/org.eclipse.equinox.common/3.10.100/org.eclipse.equinox.common-3.10.100.pom
Progress (1): 1.7 kB
                    
Downloaded from sonatype-releases: https://oss.sonatype.org/content/repositories/releases/org/eclipse/platform/org.eclipse.equinox.common/3.10.100/org.eclipse.equinox.common-3.10.100.pom (1.7 kB at 17 kB/s)
Downloading from sonatype-releases: https://oss.sonatype.org/content/repositories/releases/org/eclipse/platform/org.eclipse.equinox.common/3.10.200/org.eclipse.equinox.common-3.10.200.pom
Progress (1): 1.7 kB
                    
Downloaded from sonatype-releases: https://oss.sonatype.org/content/repositories/releases/org/eclipse/platform/org.eclipse.equinox.common/3.10.200/org.eclipse.equinox.common-3.10.200.pom (1.7 kB at 12 kB/s)
Downloading from sonatype-releases: https://oss.sonatype.org/content/repositories/releases/org/eclipse/platform/org.eclipse.equinox.common/3.10.300/org.eclipse.equinox.common-3.10.300.pom
Progress (1): 1.7 kB
                    
Downloaded from sonatype-releases: https://oss.sonatype.org/content/repositories/releases/org/eclipse/platform/org.eclipse.equinox.common/3.10.300/org.eclipse.equinox.common-3.10.300.pom (1.7 kB at 17 kB/s)
Downloading from sonatype-releases: https://oss.sonatype.org/content/repositories/releases/org/eclipse/platform/org.eclipse.equinox.common/3.10.400/org.eclipse.equinox.common-3.10.400.pom
Progress (1): 1.7 kB
                    
Downloaded from sonatype-releases: https://oss.sonatype.org/content/repositories/releases/org/eclipse/platform/org.eclipse.equinox.common/3.10.400/org.eclipse.equinox.common-3.10.400.pom (1.7 kB at 11 kB/s)
Downloading from sonatype-releases: https://oss.sonatype.org/content/repositories/releases/org/eclipse/platform/org.eclipse.equinox.common/3.10.500/org.eclipse.equinox.common-3.10.500.pom
Progress (1): 1.7 kB
                    
Downloaded from sonatype-releases: https://oss.sonatype.org/content/repositories/releases/org/eclipse/platform/org.eclipse.equinox.common/3.10.500/org.eclipse.equinox.common-3.10.500.pom (1.7 kB at 5.0 kB/s)
Downloading from sonatype-releases: https://oss.sonatype.org/content/repositories/releases/org/eclipse/platform/org.eclipse.equinox.common/3.11.0/org.eclipse.equinox.common-3.11.0.pom
Progress (1): 1.7 kB
                    
Downloaded from sonatype-releases: https://oss.sonatype.org/content/repositories/releases/org/eclipse/platform/org.eclipse.equinox.common/3.11.0/org.eclipse.equinox.common-3.11.0.pom (1.7 kB at 17 kB/s)
Downloading from sonatype-snapshots: https://oss.sonatype.org/content/repositories/snapshots/org/eclipse/platform/org.eclipse.core.jobs/maven-metadata.xml
Downloading from repo.eclipse.org: https://repo.eclipse.org/content/repositories/maven_central/org/eclipse/platform/org.eclipse.core.jobs/maven-metadata.xml
Downloading from cbi-release: https://repo.eclipse.org/content/repositories/cbi-releases/org/eclipse/platform/org.eclipse.core.jobs/maven-metadata.xml
Downloading from sonatype-releases: https://oss.sonatype.org/content/repositories/releases/org/eclipse/platform/org.eclipse.core.jobs/maven-metadata.xml
Progress (1): 748 B
                   
Downloaded from repo.eclipse.org: https://repo.eclipse.org/content/repositories/maven_central/org/eclipse/platform/org.eclipse.core.jobs/maven-metadata.xml (748 B at 24 kB/s)
Progress (1): 748 B
                   
Downloaded from sonatype-releases: https://oss.sonatype.org/content/repositories/releases/org/eclipse/platform/org.eclipse.core.jobs/maven-metadata.xml (748 B at 5.3 kB/s)
Downloading from sonatype-releases: https://oss.sonatype.org/content/repositories/releases/org/eclipse/platform/org.eclipse.core.jobs/3.8.0/org.eclipse.core.jobs-3.8.0.pom
Progress (1): 1.9 kB
                    
Downloaded from sonatype-releases: https://oss.sonatype.org/content/repositories/releases/org/eclipse/platform/org.eclipse.core.jobs/3.8.0/org.eclipse.core.jobs-3.8.0.pom (1.9 kB at 14 kB/s)
Downloading from sonatype-releases: https://oss.sonatype.org/content/repositories/releases/org/eclipse/platform/org.eclipse.core.jobs/3.9.0/org.eclipse.core.jobs-3.9.0.pom
Progress (1): 1.9 kB
                    
Downloaded from sonatype-releases: https://oss.sonatype.org/content/repositories/releases/org/eclipse/platform/org.eclipse.core.jobs/3.9.0/org.eclipse.core.jobs-3.9.0.pom (1.9 kB at 12 kB/s)
Downloading from sonatype-releases: https://oss.sonatype.org/content/repositories/releases/org/eclipse/platform/org.eclipse.core.jobs/3.9.1/org.eclipse.core.jobs-3.9.1.pom
Progress (1): 1.9 kB
                    
Downloaded from sonatype-releases: https://oss.sonatype.org/content/repositories/releases/org/eclipse/platform/org.eclipse.core.jobs/3.9.1/org.eclipse.core.jobs-3.9.1.pom (1.9 kB at 11 kB/s)
Downloading from sonatype-releases: https://oss.sonatype.org/content/repositories/releases/org/eclipse/platform/org.eclipse.core.jobs/3.9.2/org.eclipse.core.jobs-3.9.2.pom
Progress (1): 1.9 kB
                    
Downloaded from sonatype-releases: https://oss.sonatype.org/content/repositories/releases/org/eclipse/platform/org.eclipse.core.jobs/3.9.2/org.eclipse.core.jobs-3.9.2.pom (1.9 kB at 14 kB/s)
Downloading from sonatype-releases: https://oss.sonatype.org/content/repositories/releases/org/eclipse/platform/org.eclipse.core.jobs/3.9.3/org.eclipse.core.jobs-3.9.3.pom
Progress (1): 1.9 kB
                    
Downloaded from sonatype-releases: https://oss.sonatype.org/content/repositories/releases/org/eclipse/platform/org.eclipse.core.jobs/3.9.3/org.eclipse.core.jobs-3.9.3.pom (1.9 kB at 14 kB/s)
Downloading from sonatype-releases: https://oss.sonatype.org/content/repositories/releases/org/eclipse/platform/org.eclipse.core.jobs/3.10.0/org.eclipse.core.jobs-3.10.0.pom
Progress (1): 1.9 kB
                    
Downloaded from sonatype-releases: https://oss.sonatype.org/content/repositories/releases/org/eclipse/platform/org.eclipse.core.jobs/3.10.0/org.eclipse.core.jobs-3.10.0.pom (1.9 kB at 5.5 kB/s)
Downloading from sonatype-releases: https://oss.sonatype.org/content/repositories/releases/org/eclipse/platform/org.eclipse.core.jobs/3.10.100/org.eclipse.core.jobs-3.10.100.pom
Progress (1): 1.9 kB
                    
Downloaded from sonatype-releases: https://oss.sonatype.org/content/repositories/releases/org/eclipse/platform/org.eclipse.core.jobs/3.10.100/org.eclipse.core.jobs-3.10.100.pom (1.9 kB at 12 kB/s)
Downloading from sonatype-releases: https://oss.sonatype.org/content/repositories/releases/org/eclipse/platform/org.eclipse.core.jobs/3.10.200/org.eclipse.core.jobs-3.10.200.pom
Progress (1): 2.0 kB
                    
Downloaded from sonatype-releases: https://oss.sonatype.org/content/repositories/releases/org/eclipse/platform/org.eclipse.core.jobs/3.10.200/org.eclipse.core.jobs-3.10.200.pom (2.0 kB at 13 kB/s)
Downloading from sonatype-releases: https://oss.sonatype.org/content/repositories/releases/org/eclipse/platform/org.eclipse.core.jobs/3.10.300/org.eclipse.core.jobs-3.10.300.pom
Progress (1): 2.0 kB
                    
Downloaded from sonatype-releases: https://oss.sonatype.org/content/repositories/releases/org/eclipse/platform/org.eclipse.core.jobs/3.10.300/org.eclipse.core.jobs-3.10.300.pom (2.0 kB at 19 kB/s)
Downloading from sonatype-releases: https://oss.sonatype.org/content/repositories/releases/org/eclipse/platform/org.eclipse.core.jobs/3.10.400/org.eclipse.core.jobs-3.10.400.pom
Progress (1): 2.0 kB
                    
Downloaded from sonatype-releases: https://oss.sonatype.org/content/repositories/releases/org/eclipse/platform/org.eclipse.core.jobs/3.10.400/org.eclipse.core.jobs-3.10.400.pom (2.0 kB at 14 kB/s)
Downloading from sonatype-releases: https://oss.sonatype.org/content/repositories/releases/org/eclipse/platform/org.eclipse.core.jobs/3.10.500/org.eclipse.core.jobs-3.10.500.pom
Progress (1): 2.0 kB
                    
Downloaded from sonatype-releases: https://oss.sonatype.org/content/repositories/releases/org/eclipse/platform/org.eclipse.core.jobs/3.10.500/org.eclipse.core.jobs-3.10.500.pom (2.0 kB at 14 kB/s)
Downloading from sonatype-releases: https://oss.sonatype.org/content/repositories/releases/org/eclipse/platform/org.eclipse.core.jobs/3.10.700/org.eclipse.core.jobs-3.10.700.pom
Progress (1): 2.0 kB
                    
Downloaded from sonatype-releases: https://oss.sonatype.org/content/repositories/releases/org/eclipse/platform/org.eclipse.core.jobs/3.10.700/org.eclipse.core.jobs-3.10.700.pom (2.0 kB at 19 kB/s)
Downloading from sonatype-releases: https://oss.sonatype.org/content/repositories/releases/org/eclipse/platform/org.eclipse.equinox.registry/maven-metadata.xml
Downloading from repo.eclipse.org: https://repo.eclipse.org/content/repositories/maven_central/org/eclipse/platform/org.eclipse.equinox.registry/maven-metadata.xml
Downloading from cbi-release: https://repo.eclipse.org/content/repositories/cbi-releases/org/eclipse/platform/org.eclipse.equinox.registry/maven-metadata.xml
Downloading from sonatype-snapshots: https://oss.sonatype.org/content/repositories/snapshots/org/eclipse/platform/org.eclipse.equinox.registry/maven-metadata.xml
Progress (1): 654 B
                   
Downloaded from repo.eclipse.org: https://repo.eclipse.org/content/repositories/maven_central/org/eclipse/platform/org.eclipse.equinox.registry/maven-metadata.xml (654 B at 18 kB/s)
Progress (1): 654 B
                   
Downloaded from sonatype-releases: https://oss.sonatype.org/content/repositories/releases/org/eclipse/platform/org.eclipse.equinox.registry/maven-metadata.xml (654 B at 6.4 kB/s)
Downloading from sonatype-releases: https://oss.sonatype.org/content/repositories/releases/org/eclipse/platform/org.eclipse.equinox.registry/3.6.100/org.eclipse.equinox.registry-3.6.100.pom
Progress (1): 1.9 kB
                    
Downloaded from sonatype-releases: https://oss.sonatype.org/content/repositories/releases/org/eclipse/platform/org.eclipse.equinox.registry/3.6.100/org.eclipse.equinox.registry-3.6.100.pom (1.9 kB at 13 kB/s)
Downloading from sonatype-releases: https://oss.sonatype.org/content/repositories/releases/org/eclipse/platform/org.eclipse.equinox.registry/3.7.0/org.eclipse.equinox.registry-3.7.0.pom
Progress (1): 1.9 kB
                    
Downloaded from sonatype-releases: https://oss.sonatype.org/content/repositories/releases/org/eclipse/platform/org.eclipse.equinox.registry/3.7.0/org.eclipse.equinox.registry-3.7.0.pom (1.9 kB at 14 kB/s)
Downloading from sonatype-releases: https://oss.sonatype.org/content/repositories/releases/org/eclipse/platform/org.eclipse.equinox.registry/3.8.0/org.eclipse.equinox.registry-3.8.0.pom
Progress (1): 1.9 kB
                    
Downloaded from sonatype-releases: https://oss.sonatype.org/content/repositories/releases/org/eclipse/platform/org.eclipse.equinox.registry/3.8.0/org.eclipse.equinox.registry-3.8.0.pom (1.9 kB at 13 kB/s)
Downloading from sonatype-releases: https://oss.sonatype.org/content/repositories/releases/org/eclipse/platform/org.eclipse.equinox.registry/3.8.100/org.eclipse.equinox.registry-3.8.100.pom
Progress (1): 1.9 kB
                    
Downloaded from sonatype-releases: https://oss.sonatype.org/content/repositories/releases/org/eclipse/platform/org.eclipse.equinox.registry/3.8.100/org.eclipse.equinox.registry-3.8.100.pom (1.9 kB at 14 kB/s)
Downloading from sonatype-releases: https://oss.sonatype.org/content/repositories/releases/org/eclipse/platform/org.eclipse.equinox.registry/3.8.200/org.eclipse.equinox.registry-3.8.200.pom
Progress (1): 2.0 kB
                    
Downloaded from sonatype-releases: https://oss.sonatype.org/content/repositories/releases/org/eclipse/platform/org.eclipse.equinox.registry/3.8.200/org.eclipse.equinox.registry-3.8.200.pom (2.0 kB at 12 kB/s)
Downloading from sonatype-releases: https://oss.sonatype.org/content/repositories/releases/org/eclipse/platform/org.eclipse.equinox.registry/3.8.300/org.eclipse.equinox.registry-3.8.300.pom
Progress (1): 2.0 kB
                    
Downloaded from sonatype-releases: https://oss.sonatype.org/content/repositories/releases/org/eclipse/platform/org.eclipse.equinox.registry/3.8.300/org.eclipse.equinox.registry-3.8.300.pom (2.0 kB at 19 kB/s)
Downloading from sonatype-releases: https://oss.sonatype.org/content/repositories/releases/org/eclipse/platform/org.eclipse.equinox.registry/3.8.400/org.eclipse.equinox.registry-3.8.400.pom
Progress (1): 2.0 kB
                    
Downloaded from sonatype-releases: https://oss.sonatype.org/content/repositories/releases/org/eclipse/platform/org.eclipse.equinox.registry/3.8.400/org.eclipse.equinox.registry-3.8.400.pom (2.0 kB at 13 kB/s)
Downloading from sonatype-releases: https://oss.sonatype.org/content/repositories/releases/org/eclipse/platform/org.eclipse.equinox.registry/3.8.500/org.eclipse.equinox.registry-3.8.500.pom
Progress (1): 2.0 kB
                    
Downloaded from sonatype-releases: https://oss.sonatype.org/content/repositories/releases/org/eclipse/platform/org.eclipse.equinox.registry/3.8.500/org.eclipse.equinox.registry-3.8.500.pom (2.0 kB at 14 kB/s)
Downloading from sonatype-releases: https://oss.sonatype.org/content/repositories/releases/org/eclipse/platform/org.eclipse.equinox.registry/3.8.700/org.eclipse.equinox.registry-3.8.700.pom
Progress (1): 2.0 kB
                    
Downloaded from sonatype-releases: https://oss.sonatype.org/content/repositories/releases/org/eclipse/platform/org.eclipse.equinox.registry/3.8.700/org.eclipse.equinox.registry-3.8.700.pom (2.0 kB at 19 kB/s)
Downloading from cbi-release: https://repo.eclipse.org/content/repositories/cbi-releases/org/eclipse/platform/org.eclipse.equinox.preferences/maven-metadata.xml
Downloading from sonatype-releases: https://oss.sonatype.org/content/repositories/releases/org/eclipse/platform/org.eclipse.equinox.preferences/maven-metadata.xml
Downloading from repo.eclipse.org: https://repo.eclipse.org/content/repositories/maven_central/org/eclipse/platform/org.eclipse.equinox.preferences/maven-metadata.xml
Downloading from sonatype-snapshots: https://oss.sonatype.org/content/repositories/snapshots/org/eclipse/platform/org.eclipse.equinox.preferences/maven-metadata.xml
Progress (1): 624 B
Progress (2): 624 B | 624 B
                           
Downloaded from repo.eclipse.org: https://repo.eclipse.org/content/repositories/maven_central/org/eclipse/platform/org.eclipse.equinox.preferences/maven-metadata.xml (624 B at 9.9 kB/s)
Downloaded from sonatype-releases: https://oss.sonatype.org/content/repositories/releases/org/eclipse/platform/org.eclipse.equinox.preferences/maven-metadata.xml (624 B at 5.4 kB/s)
Downloading from sonatype-releases: https://oss.sonatype.org/content/repositories/releases/org/eclipse/platform/org.eclipse.equinox.preferences/3.6.1/org.eclipse.equinox.preferences-3.6.1.pom
Progress (1): 2.2 kB
                    
Downloaded from sonatype-releases: https://oss.sonatype.org/content/repositories/releases/org/eclipse/platform/org.eclipse.equinox.preferences/3.6.1/org.eclipse.equinox.preferences-3.6.1.pom (2.2 kB at 15 kB/s)
Downloading from sonatype-releases: https://oss.sonatype.org/content/repositories/releases/org/eclipse/platform/org.eclipse.equinox.preferences/3.7.0/org.eclipse.equinox.preferences-3.7.0.pom
Progress (1): 2.2 kB
                    
Downloaded from sonatype-releases: https://oss.sonatype.org/content/repositories/releases/org/eclipse/platform/org.eclipse.equinox.preferences/3.7.0/org.eclipse.equinox.preferences-3.7.0.pom (2.2 kB at 16 kB/s)
Downloading from sonatype-releases: https://oss.sonatype.org/content/repositories/releases/org/eclipse/platform/org.eclipse.equinox.preferences/3.7.100/org.eclipse.equinox.preferences-3.7.100.pom
Progress (1): 2.2 kB
                    
Downloaded from sonatype-releases: https://oss.sonatype.org/content/repositories/releases/org/eclipse/platform/org.eclipse.equinox.preferences/3.7.100/org.eclipse.equinox.preferences-3.7.100.pom (2.2 kB at 14 kB/s)
Downloading from sonatype-releases: https://oss.sonatype.org/content/repositories/releases/org/eclipse/platform/org.eclipse.equinox.preferences/3.7.200/org.eclipse.equinox.preferences-3.7.200.pom
Progress (1): 2.2 kB
                    
Downloaded from sonatype-releases: https://oss.sonatype.org/content/repositories/releases/org/eclipse/platform/org.eclipse.equinox.preferences/3.7.200/org.eclipse.equinox.preferences-3.7.200.pom (2.2 kB at 14 kB/s)
Downloading from sonatype-releases: https://oss.sonatype.org/content/repositories/releases/org/eclipse/platform/org.eclipse.equinox.preferences/3.7.300/org.eclipse.equinox.preferences-3.7.300.pom
Progress (1): 2.2 kB
                    
Downloaded from sonatype-releases: https://oss.sonatype.org/content/repositories/releases/org/eclipse/platform/org.eclipse.equinox.preferences/3.7.300/org.eclipse.equinox.preferences-3.7.300.pom (2.2 kB at 22 kB/s)
Downloading from sonatype-releases: https://oss.sonatype.org/content/repositories/releases/org/eclipse/platform/org.eclipse.equinox.preferences/3.7.400/org.eclipse.equinox.preferences-3.7.400.pom
Progress (1): 2.2 kB
                    
Downloaded from sonatype-releases: https://oss.sonatype.org/content/repositories/releases/org/eclipse/platform/org.eclipse.equinox.preferences/3.7.400/org.eclipse.equinox.preferences-3.7.400.pom (2.2 kB at 16 kB/s)
Downloading from sonatype-releases: https://oss.sonatype.org/content/repositories/releases/org/eclipse/platform/org.eclipse.equinox.preferences/3.7.500/org.eclipse.equinox.preferences-3.7.500.pom
Progress (1): 2.2 kB
                    
Downloaded from sonatype-releases: https://oss.sonatype.org/content/repositories/releases/org/eclipse/platform/org.eclipse.equinox.preferences/3.7.500/org.eclipse.equinox.preferences-3.7.500.pom (2.2 kB at 14 kB/s)
Downloading from sonatype-releases: https://oss.sonatype.org/content/repositories/releases/org/eclipse/platform/org.eclipse.equinox.preferences/3.7.700/org.eclipse.equinox.preferences-3.7.700.pom
Progress (1): 2.2 kB
                    
Downloaded from sonatype-releases: https://oss.sonatype.org/content/repositories/releases/org/eclipse/platform/org.eclipse.equinox.preferences/3.7.700/org.eclipse.equinox.preferences-3.7.700.pom (2.2 kB at 21 kB/s)
Downloading from sonatype-releases: https://oss.sonatype.org/content/repositories/releases/org/eclipse/platform/org.eclipse.core.contenttype/maven-metadata.xml
Downloading from repo.eclipse.org: https://repo.eclipse.org/content/repositories/maven_central/org/eclipse/platform/org.eclipse.core.contenttype/maven-metadata.xml
Downloading from cbi-release: https://repo.eclipse.org/content/repositories/cbi-releases/org/eclipse/platform/org.eclipse.core.contenttype/maven-metadata.xml
Downloading from sonatype-snapshots: https://oss.sonatype.org/content/repositories/snapshots/org/eclipse/platform/org.eclipse.core.contenttype/maven-metadata.xml
Progress (1): 621 B
                   
Downloaded from repo.eclipse.org: https://repo.eclipse.org/content/repositories/maven_central/org/eclipse/platform/org.eclipse.core.contenttype/maven-metadata.xml (621 B at 21 kB/s)
Progress (1): 621 B
                   
Downloaded from sonatype-releases: https://oss.sonatype.org/content/repositories/releases/org/eclipse/platform/org.eclipse.core.contenttype/maven-metadata.xml (621 B at 6.1 kB/s)
Downloading from sonatype-releases: https://oss.sonatype.org/content/repositories/releases/org/eclipse/platform/org.eclipse.core.contenttype/3.5.100/org.eclipse.core.contenttype-3.5.100.pom
Progress (1): 2.2/2.3 kB
Progress (1): 2.3 kB    
                    
Downloaded from sonatype-releases: https://oss.sonatype.org/content/repositories/releases/org/eclipse/platform/org.eclipse.core.contenttype/3.5.100/org.eclipse.core.contenttype-3.5.100.pom (2.3 kB at 16 kB/s)
Downloading from sonatype-releases: https://oss.sonatype.org/content/repositories/releases/org/eclipse/platform/org.eclipse.core.contenttype/3.6.0/org.eclipse.core.contenttype-3.6.0.pom
Progress (1): 2.3 kB
                    
Downloaded from sonatype-releases: https://oss.sonatype.org/content/repositories/releases/org/eclipse/platform/org.eclipse.core.contenttype/3.6.0/org.eclipse.core.contenttype-3.6.0.pom (2.3 kB at 15 kB/s)
Downloading from sonatype-releases: https://oss.sonatype.org/content/repositories/releases/org/eclipse/platform/org.eclipse.core.contenttype/3.7.0/org.eclipse.core.contenttype-3.7.0.pom
Progress (1): 2.2/2.3 kB
Progress (1): 2.3 kB    
                    
Downloaded from sonatype-releases: https://oss.sonatype.org/content/repositories/releases/org/eclipse/platform/org.eclipse.core.contenttype/3.7.0/org.eclipse.core.contenttype-3.7.0.pom (2.3 kB at 17 kB/s)
Downloading from sonatype-releases: https://oss.sonatype.org/content/repositories/releases/org/eclipse/platform/org.eclipse.core.contenttype/3.7.100/org.eclipse.core.contenttype-3.7.100.pom
Progress (1): 2.2/2.3 kB
Progress (1): 2.3 kB    
                    
Downloaded from sonatype-releases: https://oss.sonatype.org/content/repositories/releases/org/eclipse/platform/org.eclipse.core.contenttype/3.7.100/org.eclipse.core.contenttype-3.7.100.pom (2.3 kB at 17 kB/s)
Downloading from sonatype-releases: https://oss.sonatype.org/content/repositories/releases/org/eclipse/platform/org.eclipse.core.contenttype/3.7.200/org.eclipse.core.contenttype-3.7.200.pom
Progress (1): 2.2/2.3 kB
Progress (1): 2.3 kB    
                    
Downloaded from sonatype-releases: https://oss.sonatype.org/content/repositories/releases/org/eclipse/platform/org.eclipse.core.contenttype/3.7.200/org.eclipse.core.contenttype-3.7.200.pom (2.3 kB at 17 kB/s)
Downloading from sonatype-releases: https://oss.sonatype.org/content/repositories/releases/org/eclipse/platform/org.eclipse.core.contenttype/3.7.300/org.eclipse.core.contenttype-3.7.300.pom
Progress (1): 2.2/2.3 kB
Progress (1): 2.3 kB    
                    
Downloaded from sonatype-releases: https://oss.sonatype.org/content/repositories/releases/org/eclipse/platform/org.eclipse.core.contenttype/3.7.300/org.eclipse.core.contenttype-3.7.300.pom (2.3 kB at 16 kB/s)
Downloading from sonatype-releases: https://oss.sonatype.org/content/repositories/releases/org/eclipse/platform/org.eclipse.core.contenttype/3.7.400/org.eclipse.core.contenttype-3.7.400.pom
Progress (1): 2.2/2.3 kB
Progress (1): 2.3 kB    
                    
Downloaded from sonatype-releases: https://oss.sonatype.org/content/repositories/releases/org/eclipse/platform/org.eclipse.core.contenttype/3.7.400/org.eclipse.core.contenttype-3.7.400.pom (2.3 kB at 15 kB/s)
Downloading from sonatype-releases: https://oss.sonatype.org/content/repositories/releases/org/eclipse/platform/org.eclipse.core.contenttype/3.7.600/org.eclipse.core.contenttype-3.7.600.pom
Progress (1): 2.2/2.3 kB
Progress (1): 2.3 kB    
                    
Downloaded from sonatype-releases: https://oss.sonatype.org/content/repositories/releases/org/eclipse/platform/org.eclipse.core.contenttype/3.7.600/org.eclipse.core.contenttype-3.7.600.pom (2.3 kB at 23 kB/s)
Downloading from sonatype-releases: https://oss.sonatype.org/content/repositories/releases/org/eclipse/platform/org.eclipse.equinox.app/maven-metadata.xml
Downloading from repo.eclipse.org: https://repo.eclipse.org/content/repositories/maven_central/org/eclipse/platform/org.eclipse.equinox.app/maven-metadata.xml
Downloading from sonatype-snapshots: https://oss.sonatype.org/content/repositories/snapshots/org/eclipse/platform/org.eclipse.equinox.app/maven-metadata.xml
Downloading from cbi-release: https://repo.eclipse.org/content/repositories/cbi-releases/org/eclipse/platform/org.eclipse.equinox.app/maven-metadata.xml
Progress (1): 585 B
                   
Downloaded from repo.eclipse.org: https://repo.eclipse.org/content/repositories/maven_central/org/eclipse/platform/org.eclipse.equinox.app/maven-metadata.xml (585 B at 28 kB/s)
Progress (1): 585 B
                   
Downloaded from sonatype-releases: https://oss.sonatype.org/content/repositories/releases/org/eclipse/platform/org.eclipse.equinox.app/maven-metadata.xml (585 B at 5.7 kB/s)
Downloading from sonatype-releases: https://oss.sonatype.org/content/repositories/releases/org/eclipse/platform/org.eclipse.equinox.app/1.3.400/org.eclipse.equinox.app-1.3.400.pom
Progress (1): 2.1 kB
                    
Downloaded from sonatype-releases: https://oss.sonatype.org/content/repositories/releases/org/eclipse/platform/org.eclipse.equinox.app/1.3.400/org.eclipse.equinox.app-1.3.400.pom (2.1 kB at 14 kB/s)
Downloading from sonatype-releases: https://oss.sonatype.org/content/repositories/releases/org/eclipse/platform/org.eclipse.equinox.app/1.3.500/org.eclipse.equinox.app-1.3.500.pom
Progress (1): 2.1 kB
                    
Downloaded from sonatype-releases: https://oss.sonatype.org/content/repositories/releases/org/eclipse/platform/org.eclipse.equinox.app/1.3.500/org.eclipse.equinox.app-1.3.500.pom (2.1 kB at 15 kB/s)
Downloading from sonatype-releases: https://oss.sonatype.org/content/repositories/releases/org/eclipse/platform/org.eclipse.equinox.app/1.3.600/org.eclipse.equinox.app-1.3.600.pom
Progress (1): 2.1 kB
                    
Downloaded from sonatype-releases: https://oss.sonatype.org/content/repositories/releases/org/eclipse/platform/org.eclipse.equinox.app/1.3.600/org.eclipse.equinox.app-1.3.600.pom (2.1 kB at 13 kB/s)
Downloading from sonatype-releases: https://oss.sonatype.org/content/repositories/releases/org/eclipse/platform/org.eclipse.equinox.app/1.4.0/org.eclipse.equinox.app-1.4.0.pom
Progress (1): 2.1 kB
                    
Downloaded from sonatype-releases: https://oss.sonatype.org/content/repositories/releases/org/eclipse/platform/org.eclipse.equinox.app/1.4.0/org.eclipse.equinox.app-1.4.0.pom (2.1 kB at 15 kB/s)
Downloading from sonatype-releases: https://oss.sonatype.org/content/repositories/releases/org/eclipse/platform/org.eclipse.equinox.app/1.4.100/org.eclipse.equinox.app-1.4.100.pom
Progress (1): 2.1 kB
                    
Downloaded from sonatype-releases: https://oss.sonatype.org/content/repositories/releases/org/eclipse/platform/org.eclipse.equinox.app/1.4.100/org.eclipse.equinox.app-1.4.100.pom (2.1 kB at 21 kB/s)
Downloading from sonatype-releases: https://oss.sonatype.org/content/repositories/releases/org/eclipse/platform/org.eclipse.equinox.app/1.4.200/org.eclipse.equinox.app-1.4.200.pom
Progress (1): 2.1 kB
                    
Downloaded from sonatype-releases: https://oss.sonatype.org/content/repositories/releases/org/eclipse/platform/org.eclipse.equinox.app/1.4.200/org.eclipse.equinox.app-1.4.200.pom (2.1 kB at 15 kB/s)
Downloading from sonatype-releases: https://oss.sonatype.org/content/repositories/releases/org/eclipse/platform/org.eclipse.equinox.app/1.4.400/org.eclipse.equinox.app-1.4.400.pom
Progress (1): 2.1 kB
                    
Downloaded from sonatype-releases: https://oss.sonatype.org/content/repositories/releases/org/eclipse/platform/org.eclipse.equinox.app/1.4.400/org.eclipse.equinox.app-1.4.400.pom (2.1 kB at 18 kB/s)
Downloading from sonatype-releases: https://oss.sonatype.org/content/repositories/releases/org/eclipse/platform/org.eclipse.core.runtime/3.13.0/org.eclipse.core.runtime-3.13.0.pom
Progress (1): 2.2/3.2 kB
Progress (1): 3.2 kB    
                    
Downloaded from sonatype-releases: https://oss.sonatype.org/content/repositories/releases/org/eclipse/platform/org.eclipse.core.runtime/3.13.0/org.eclipse.core.runtime-3.13.0.pom (3.2 kB at 23 kB/s)
Downloading from sonatype-releases: https://oss.sonatype.org/content/repositories/releases/org/eclipse/platform/org.eclipse.core.runtime/3.14.0/org.eclipse.core.runtime-3.14.0.pom
Progress (1): 2.2/3.2 kB
Progress (1): 3.2 kB    
                    
Downloaded from sonatype-releases: https://oss.sonatype.org/content/repositories/releases/org/eclipse/platform/org.eclipse.core.runtime/3.14.0/org.eclipse.core.runtime-3.14.0.pom (3.2 kB at 23 kB/s)
Downloading from sonatype-releases: https://oss.sonatype.org/content/repositories/releases/org/eclipse/platform/org.eclipse.core.runtime/3.15.0/org.eclipse.core.runtime-3.15.0.pom
Progress (1): 2.2/3.2 kB
Progress (1): 3.2 kB    
                    
Downloaded from sonatype-releases: https://oss.sonatype.org/content/repositories/releases/org/eclipse/platform/org.eclipse.core.runtime/3.15.0/org.eclipse.core.runtime-3.15.0.pom (3.2 kB at 31 kB/s)
Downloading from sonatype-releases: https://oss.sonatype.org/content/repositories/releases/org/eclipse/platform/org.eclipse.core.runtime/3.15.100/org.eclipse.core.runtime-3.15.100.pom
Progress (1): 2.2/3.2 kB
Progress (1): 3.2 kB    
                    
Downloaded from sonatype-releases: https://oss.sonatype.org/content/repositories/releases/org/eclipse/platform/org.eclipse.core.runtime/3.15.100/org.eclipse.core.runtime-3.15.100.pom (3.2 kB at 22 kB/s)
Downloading from sonatype-releases: https://oss.sonatype.org/content/repositories/releases/org/eclipse/platform/org.eclipse.core.runtime/3.15.200/org.eclipse.core.runtime-3.15.200.pom
Progress (1): 2.2/3.2 kB
Progress (1): 3.2 kB    
                    
Downloaded from sonatype-releases: https://oss.sonatype.org/content/repositories/releases/org/eclipse/platform/org.eclipse.core.runtime/3.15.200/org.eclipse.core.runtime-3.15.200.pom (3.2 kB at 30 kB/s)
Downloading from sonatype-releases: https://oss.sonatype.org/content/repositories/releases/org/eclipse/platform/org.eclipse.core.runtime/3.15.300/org.eclipse.core.runtime-3.15.300.pom
Progress (1): 2.2/3.2 kB
Progress (1): 3.2 kB    
                    
Downloaded from sonatype-releases: https://oss.sonatype.org/content/repositories/releases/org/eclipse/platform/org.eclipse.core.runtime/3.15.300/org.eclipse.core.runtime-3.15.300.pom (3.2 kB at 22 kB/s)
Downloading from sonatype-releases: https://oss.sonatype.org/content/repositories/releases/org/eclipse/platform/org.eclipse.core.runtime/3.16.0/org.eclipse.core.runtime-3.16.0.pom
Progress (1): 2.2/3.0 kB
Progress (1): 3.0 kB    
                    
Downloaded from sonatype-releases: https://oss.sonatype.org/content/repositories/releases/org/eclipse/platform/org.eclipse.core.runtime/3.16.0/org.eclipse.core.runtime-3.16.0.pom (3.0 kB at 20 kB/s)
Downloading from sonatype-releases: https://oss.sonatype.org/content/repositories/releases/org/eclipse/platform/org.eclipse.core.runtime/3.17.100/org.eclipse.core.runtime-3.17.100.pom
Progress (1): 2.2/3.0 kB
Progress (1): 3.0 kB    
                    
Downloaded from sonatype-releases: https://oss.sonatype.org/content/repositories/releases/org/eclipse/platform/org.eclipse.core.runtime/3.17.100/org.eclipse.core.runtime-3.17.100.pom (3.0 kB at 29 kB/s)
Downloading from sonatype-releases: https://oss.sonatype.org/content/repositories/releases/org/eclipse/platform/org.eclipse.core.resources/maven-metadata.xml
Downloading from repo.eclipse.org: https://repo.eclipse.org/content/repositories/maven_central/org/eclipse/platform/org.eclipse.core.resources/maven-metadata.xml
Downloading from cbi-release: https://repo.eclipse.org/content/repositories/cbi-releases/org/eclipse/platform/org.eclipse.core.resources/maven-metadata.xml
Downloading from sonatype-snapshots: https://oss.sonatype.org/content/repositories/snapshots/org/eclipse/platform/org.eclipse.core.resources/maven-metadata.xml
Progress (1): 662 B
                   
Downloaded from repo.eclipse.org: https://repo.eclipse.org/content/repositories/maven_central/org/eclipse/platform/org.eclipse.core.resources/maven-metadata.xml (662 B at 18 kB/s)
Progress (1): 662 B
                   
Downloaded from sonatype-releases: https://oss.sonatype.org/content/repositories/releases/org/eclipse/platform/org.eclipse.core.resources/maven-metadata.xml (662 B at 6.4 kB/s)
Downloading from sonatype-releases: https://oss.sonatype.org/content/repositories/releases/org/eclipse/platform/org.eclipse.core.resources/3.11.1/org.eclipse.core.resources-3.11.1.pom
Progress (1): 2.2/2.5 kB
Progress (1): 2.5 kB    
                    
Downloaded from sonatype-releases: https://oss.sonatype.org/content/repositories/releases/org/eclipse/platform/org.eclipse.core.resources/3.11.1/org.eclipse.core.resources-3.11.1.pom (2.5 kB at 16 kB/s)
Downloading from sonatype-snapshots: https://oss.sonatype.org/content/repositories/snapshots/org/eclipse/platform/org.eclipse.core.expressions/maven-metadata.xml
Downloading from cbi-release: https://repo.eclipse.org/content/repositories/cbi-releases/org/eclipse/platform/org.eclipse.core.expressions/maven-metadata.xml
Downloading from repo.eclipse.org: https://repo.eclipse.org/content/repositories/maven_central/org/eclipse/platform/org.eclipse.core.expressions/maven-metadata.xml
Downloading from sonatype-releases: https://oss.sonatype.org/content/repositories/releases/org/eclipse/platform/org.eclipse.core.expressions/maven-metadata.xml
Progress (1): 623 B
                   
Downloaded from repo.eclipse.org: https://repo.eclipse.org/content/repositories/maven_central/org/eclipse/platform/org.eclipse.core.expressions/maven-metadata.xml (623 B at 9.6 kB/s)
Progress (1): 623 B
                   
Downloaded from sonatype-releases: https://oss.sonatype.org/content/repositories/releases/org/eclipse/platform/org.eclipse.core.expressions/maven-metadata.xml (623 B at 2.2 kB/s)
Downloading from sonatype-releases: https://oss.sonatype.org/content/repositories/releases/org/eclipse/platform/org.eclipse.core.expressions/3.5.100/org.eclipse.core.expressions-3.5.100.pom
Progress (1): 1.9 kB
                    
Downloaded from sonatype-releases: https://oss.sonatype.org/content/repositories/releases/org/eclipse/platform/org.eclipse.core.expressions/3.5.100/org.eclipse.core.expressions-3.5.100.pom (1.9 kB at 14 kB/s)
Downloading from sonatype-releases: https://oss.sonatype.org/content/repositories/releases/org/eclipse/platform/org.eclipse.core.expressions/3.6.0/org.eclipse.core.expressions-3.6.0.pom
Progress (1): 1.9 kB
                    
Downloaded from sonatype-releases: https://oss.sonatype.org/content/repositories/releases/org/eclipse/platform/org.eclipse.core.expressions/3.6.0/org.eclipse.core.expressions-3.6.0.pom (1.9 kB at 15 kB/s)
Downloading from sonatype-releases: https://oss.sonatype.org/content/repositories/releases/org/eclipse/platform/org.eclipse.core.expressions/3.6.100/org.eclipse.core.expressions-3.6.100.pom
Progress (1): 1.9 kB
                    
Downloaded from sonatype-releases: https://oss.sonatype.org/content/repositories/releases/org/eclipse/platform/org.eclipse.core.expressions/3.6.100/org.eclipse.core.expressions-3.6.100.pom (1.9 kB at 15 kB/s)
Downloading from sonatype-releases: https://oss.sonatype.org/content/repositories/releases/org/eclipse/platform/org.eclipse.core.expressions/3.6.200/org.eclipse.core.expressions-3.6.200.pom
Progress (1): 1.9 kB
                    
Downloaded from sonatype-releases: https://oss.sonatype.org/content/repositories/releases/org/eclipse/platform/org.eclipse.core.expressions/3.6.200/org.eclipse.core.expressions-3.6.200.pom (1.9 kB at 14 kB/s)
Downloading from sonatype-releases: https://oss.sonatype.org/content/repositories/releases/org/eclipse/platform/org.eclipse.core.expressions/3.6.300/org.eclipse.core.expressions-3.6.300.pom
Progress (1): 2.0 kB
                    
Downloaded from sonatype-releases: https://oss.sonatype.org/content/repositories/releases/org/eclipse/platform/org.eclipse.core.expressions/3.6.300/org.eclipse.core.expressions-3.6.300.pom (2.0 kB at 20 kB/s)
Downloading from sonatype-releases: https://oss.sonatype.org/content/repositories/releases/org/eclipse/platform/org.eclipse.core.expressions/3.6.400/org.eclipse.core.expressions-3.6.400.pom
Progress (1): 2.0 kB
                    
Downloaded from sonatype-releases: https://oss.sonatype.org/content/repositories/releases/org/eclipse/platform/org.eclipse.core.expressions/3.6.400/org.eclipse.core.expressions-3.6.400.pom (2.0 kB at 14 kB/s)
Downloading from sonatype-releases: https://oss.sonatype.org/content/repositories/releases/org/eclipse/platform/org.eclipse.core.expressions/3.6.500/org.eclipse.core.expressions-3.6.500.pom
Progress (1): 2.0 kB
                    
Downloaded from sonatype-releases: https://oss.sonatype.org/content/repositories/releases/org/eclipse/platform/org.eclipse.core.expressions/3.6.500/org.eclipse.core.expressions-3.6.500.pom (2.0 kB at 12 kB/s)
Downloading from sonatype-releases: https://oss.sonatype.org/content/repositories/releases/org/eclipse/platform/org.eclipse.core.expressions/3.6.700/org.eclipse.core.expressions-3.6.700.pom
Progress (1): 2.0 kB
                    
Downloaded from sonatype-releases: https://oss.sonatype.org/content/repositories/releases/org/eclipse/platform/org.eclipse.core.expressions/3.6.700/org.eclipse.core.expressions-3.6.700.pom (2.0 kB at 20 kB/s)
Downloading from sonatype-snapshots: https://oss.sonatype.org/content/repositories/snapshots/org/eclipse/platform/org.eclipse.core.filesystem/maven-metadata.xml
Downloading from repo.eclipse.org: https://repo.eclipse.org/content/repositories/maven_central/org/eclipse/platform/org.eclipse.core.filesystem/maven-metadata.xml
Downloading from cbi-release: https://repo.eclipse.org/content/repositories/cbi-releases/org/eclipse/platform/org.eclipse.core.filesystem/maven-metadata.xml
Downloading from sonatype-releases: https://oss.sonatype.org/content/repositories/releases/org/eclipse/platform/org.eclipse.core.filesystem/maven-metadata.xml
Progress (1): 620 B
                   
Downloaded from repo.eclipse.org: https://repo.eclipse.org/content/repositories/maven_central/org/eclipse/platform/org.eclipse.core.filesystem/maven-metadata.xml (620 B at 15 kB/s)
Progress (1): 620 B
                   
Downloaded from sonatype-releases: https://oss.sonatype.org/content/repositories/releases/org/eclipse/platform/org.eclipse.core.filesystem/maven-metadata.xml (620 B at 2.6 kB/s)
Downloading from sonatype-releases: https://oss.sonatype.org/content/repositories/releases/org/eclipse/platform/org.eclipse.core.filesystem/1.6.1/org.eclipse.core.filesystem-1.6.1.pom
Progress (1): 2.2/2.3 kB
Progress (1): 2.3 kB    
                    
Downloaded from sonatype-releases: https://oss.sonatype.org/content/repositories/releases/org/eclipse/platform/org.eclipse.core.filesystem/1.6.1/org.eclipse.core.filesystem-1.6.1.pom (2.3 kB at 17 kB/s)
Downloading from sonatype-releases: https://oss.sonatype.org/content/repositories/releases/org/eclipse/platform/org.eclipse.core.filesystem/1.7.0/org.eclipse.core.filesystem-1.7.0.pom
Progress (1): 2.3 kB
                    
Downloaded from sonatype-releases: https://oss.sonatype.org/content/repositories/releases/org/eclipse/platform/org.eclipse.core.filesystem/1.7.0/org.eclipse.core.filesystem-1.7.0.pom (2.3 kB at 13 kB/s)
Downloading from sonatype-releases: https://oss.sonatype.org/content/repositories/releases/org/eclipse/platform/org.eclipse.core.filesystem/1.7.100/org.eclipse.core.filesystem-1.7.100.pom
Progress (1): 2.3 kB
                    
Downloaded from sonatype-releases: https://oss.sonatype.org/content/repositories/releases/org/eclipse/platform/org.eclipse.core.filesystem/1.7.100/org.eclipse.core.filesystem-1.7.100.pom (2.3 kB at 17 kB/s)
Downloading from sonatype-releases: https://oss.sonatype.org/content/repositories/releases/org/eclipse/platform/org.eclipse.core.filesystem/1.7.200/org.eclipse.core.filesystem-1.7.200.pom
Progress (1): 2.2/2.3 kB
Progress (1): 2.3 kB    
                    
Downloaded from sonatype-releases: https://oss.sonatype.org/content/repositories/releases/org/eclipse/platform/org.eclipse.core.filesystem/1.7.200/org.eclipse.core.filesystem-1.7.200.pom (2.3 kB at 17 kB/s)
Downloading from sonatype-releases: https://oss.sonatype.org/content/repositories/releases/org/eclipse/platform/org.eclipse.core.filesystem/1.7.300/org.eclipse.core.filesystem-1.7.300.pom
Progress (1): 2.2/2.3 kB
Progress (1): 2.3 kB    
                    
Downloaded from sonatype-releases: https://oss.sonatype.org/content/repositories/releases/org/eclipse/platform/org.eclipse.core.filesystem/1.7.300/org.eclipse.core.filesystem-1.7.300.pom (2.3 kB at 23 kB/s)
Downloading from sonatype-releases: https://oss.sonatype.org/content/repositories/releases/org/eclipse/platform/org.eclipse.core.filesystem/1.7.400/org.eclipse.core.filesystem-1.7.400.pom
Progress (1): 2.2/2.3 kB
Progress (1): 2.3 kB    
                    
Downloaded from sonatype-releases: https://oss.sonatype.org/content/repositories/releases/org/eclipse/platform/org.eclipse.core.filesystem/1.7.400/org.eclipse.core.filesystem-1.7.400.pom (2.3 kB at 17 kB/s)
Downloading from sonatype-releases: https://oss.sonatype.org/content/repositories/releases/org/eclipse/platform/org.eclipse.core.filesystem/1.7.500/org.eclipse.core.filesystem-1.7.500.pom
Progress (1): 2.2/2.3 kB
Progress (1): 2.3 kB    
                    
Downloaded from sonatype-releases: https://oss.sonatype.org/content/repositories/releases/org/eclipse/platform/org.eclipse.core.filesystem/1.7.500/org.eclipse.core.filesystem-1.7.500.pom (2.3 kB at 15 kB/s)
Downloading from sonatype-releases: https://oss.sonatype.org/content/repositories/releases/org/eclipse/platform/org.eclipse.core.filesystem/1.7.700/org.eclipse.core.filesystem-1.7.700.pom
Progress (1): 2.2/2.3 kB
Progress (1): 2.3 kB    
                    
Downloaded from sonatype-releases: https://oss.sonatype.org/content/repositories/releases/org/eclipse/platform/org.eclipse.core.filesystem/1.7.700/org.eclipse.core.filesystem-1.7.700.pom (2.3 kB at 23 kB/s)
Downloading from sonatype-releases: https://oss.sonatype.org/content/repositories/releases/org/eclipse/platform/org.eclipse.core.resources/3.12.0/org.eclipse.core.resources-3.12.0.pom
Progress (1): 2.2/2.5 kB
Progress (1): 2.5 kB    
                    
Downloaded from sonatype-releases: https://oss.sonatype.org/content/repositories/releases/org/eclipse/platform/org.eclipse.core.resources/3.12.0/org.eclipse.core.resources-3.12.0.pom (2.5 kB at 19 kB/s)
Downloading from sonatype-releases: https://oss.sonatype.org/content/repositories/releases/org/eclipse/platform/org.eclipse.core.resources/3.13.0/org.eclipse.core.resources-3.13.0.pom
Progress (1): 2.2/2.5 kB
Progress (1): 2.5 kB    
                    
Downloaded from sonatype-releases: https://oss.sonatype.org/content/repositories/releases/org/eclipse/platform/org.eclipse.core.resources/3.13.0/org.eclipse.core.resources-3.13.0.pom (2.5 kB at 1.5 kB/s)
Downloading from sonatype-releases: https://oss.sonatype.org/content/repositories/releases/org/eclipse/platform/org.eclipse.core.resources/3.13.100/org.eclipse.core.resources-3.13.100.pom
Progress (1): 2.2/2.5 kB
Progress (1): 2.5 kB    
                    
Downloaded from sonatype-releases: https://oss.sonatype.org/content/repositories/releases/org/eclipse/platform/org.eclipse.core.resources/3.13.100/org.eclipse.core.resources-3.13.100.pom (2.5 kB at 18 kB/s)
Downloading from sonatype-releases: https://oss.sonatype.org/content/repositories/releases/org/eclipse/platform/org.eclipse.core.resources/3.13.200/org.eclipse.core.resources-3.13.200.pom
Progress (1): 2.3/2.5 kB
Progress (1): 2.5 kB    
                    
Downloaded from sonatype-releases: https://oss.sonatype.org/content/repositories/releases/org/eclipse/platform/org.eclipse.core.resources/3.13.200/org.eclipse.core.resources-3.13.200.pom (2.5 kB at 19 kB/s)
Downloading from sonatype-releases: https://oss.sonatype.org/content/repositories/releases/org/eclipse/platform/org.eclipse.core.resources/3.13.300/org.eclipse.core.resources-3.13.300.pom
Progress (1): 2.2/2.5 kB
Progress (1): 2.5 kB    
                    
Downloaded from sonatype-releases: https://oss.sonatype.org/content/repositories/releases/org/eclipse/platform/org.eclipse.core.resources/3.13.300/org.eclipse.core.resources-3.13.300.pom (2.5 kB at 26 kB/s)
Downloading from sonatype-releases: https://oss.sonatype.org/content/repositories/releases/org/eclipse/platform/org.eclipse.core.resources/3.13.400/org.eclipse.core.resources-3.13.400.pom
Progress (1): 2.2/2.5 kB
Progress (1): 2.5 kB    
                    
Downloaded from sonatype-releases: https://oss.sonatype.org/content/repositories/releases/org/eclipse/platform/org.eclipse.core.resources/3.13.400/org.eclipse.core.resources-3.13.400.pom (2.5 kB at 19 kB/s)
Downloading from sonatype-releases: https://oss.sonatype.org/content/repositories/releases/org/eclipse/platform/org.eclipse.core.resources/3.13.500/org.eclipse.core.resources-3.13.500.pom
Progress (1): 2.2/2.5 kB
Progress (1): 2.5 kB    
                    
Downloaded from sonatype-releases: https://oss.sonatype.org/content/repositories/releases/org/eclipse/platform/org.eclipse.core.resources/3.13.500/org.eclipse.core.resources-3.13.500.pom (2.5 kB at 19 kB/s)
Downloading from sonatype-releases: https://oss.sonatype.org/content/repositories/releases/org/eclipse/platform/org.eclipse.core.resources/3.13.700/org.eclipse.core.resources-3.13.700.pom
Progress (1): 2.2/2.5 kB
Progress (1): 2.5 kB    
                    
Downloaded from sonatype-releases: https://oss.sonatype.org/content/repositories/releases/org/eclipse/platform/org.eclipse.core.resources/3.13.700/org.eclipse.core.resources-3.13.700.pom (2.5 kB at 26 kB/s)
Downloading from sonatype-snapshots: https://oss.sonatype.org/content/repositories/snapshots/org/eclipse/jdt/org.eclipse.jdt.core/maven-metadata.xml
Downloading from repo.eclipse.org: https://repo.eclipse.org/content/repositories/maven_central/org/eclipse/jdt/org.eclipse.jdt.core/maven-metadata.xml
Downloading from sonatype-releases: https://oss.sonatype.org/content/repositories/releases/org/eclipse/jdt/org.eclipse.jdt.core/maven-metadata.xml
Downloading from cbi-release: https://repo.eclipse.org/content/repositories/cbi-releases/org/eclipse/jdt/org.eclipse.jdt.core/maven-metadata.xml
Progress (1): 800 B
                   
Downloaded from repo.eclipse.org: https://repo.eclipse.org/content/repositories/maven_central/org/eclipse/jdt/org.eclipse.jdt.core/maven-metadata.xml (800 B at 11 kB/s)
Progress (1): 800 B
                   
Downloaded from sonatype-releases: https://oss.sonatype.org/content/repositories/releases/org/eclipse/jdt/org.eclipse.jdt.core/maven-metadata.xml (800 B at 2.9 kB/s)
Downloading from sonatype-releases: https://oss.sonatype.org/content/repositories/releases/org/eclipse/jdt/org.eclipse.jdt.core/3.12.2/org.eclipse.jdt.core-3.12.2.pom
Progress (1): 2.6 kB
                    
Downloaded from sonatype-releases: https://oss.sonatype.org/content/repositories/releases/org/eclipse/jdt/org.eclipse.jdt.core/3.12.2/org.eclipse.jdt.core-3.12.2.pom (2.6 kB at 15 kB/s)
Downloading from sonatype-snapshots: https://oss.sonatype.org/content/repositories/snapshots/org/eclipse/platform/org.eclipse.text/maven-metadata.xml
Downloading from sonatype-releases: https://oss.sonatype.org/content/repositories/releases/org/eclipse/platform/org.eclipse.text/maven-metadata.xml
Downloading from repo.eclipse.org: https://repo.eclipse.org/content/repositories/maven_central/org/eclipse/platform/org.eclipse.text/maven-metadata.xml
Downloading from cbi-release: https://repo.eclipse.org/content/repositories/cbi-releases/org/eclipse/platform/org.eclipse.text/maven-metadata.xml
Progress (1): 640 B
                   
Downloaded from repo.eclipse.org: https://repo.eclipse.org/content/repositories/maven_central/org/eclipse/platform/org.eclipse.text/maven-metadata.xml (640 B at 7.0 kB/s)
Progress (1): 640 B
                   
Downloaded from sonatype-releases: https://oss.sonatype.org/content/repositories/releases/org/eclipse/platform/org.eclipse.text/maven-metadata.xml (640 B at 2.1 kB/s)
Downloading from sonatype-releases: https://oss.sonatype.org/content/repositories/releases/org/eclipse/platform/org.eclipse.text/3.6.0/org.eclipse.text-3.6.0.pom
Progress (1): 2.1 kB
                    
Downloaded from sonatype-releases: https://oss.sonatype.org/content/repositories/releases/org/eclipse/platform/org.eclipse.text/3.6.0/org.eclipse.text-3.6.0.pom (2.1 kB at 14 kB/s)
Downloading from sonatype-snapshots: https://oss.sonatype.org/content/repositories/snapshots/org/eclipse/platform/org.eclipse.core.commands/maven-metadata.xml
Downloading from sonatype-releases: https://oss.sonatype.org/content/repositories/releases/org/eclipse/platform/org.eclipse.core.commands/maven-metadata.xml
Downloading from repo.eclipse.org: https://repo.eclipse.org/content/repositories/maven_central/org/eclipse/platform/org.eclipse.core.commands/maven-metadata.xml
Downloading from cbi-release: https://repo.eclipse.org/content/repositories/cbi-releases/org/eclipse/platform/org.eclipse.core.commands/maven-metadata.xml
Progress (1): 649 B
                   
Downloaded from repo.eclipse.org: https://repo.eclipse.org/content/repositories/maven_central/org/eclipse/platform/org.eclipse.core.commands/maven-metadata.xml (649 B at 17 kB/s)
Progress (1): 649 B
                   
Downloaded from sonatype-releases: https://oss.sonatype.org/content/repositories/releases/org/eclipse/platform/org.eclipse.core.commands/maven-metadata.xml (649 B at 2.3 kB/s)
Downloading from sonatype-releases: https://oss.sonatype.org/content/repositories/releases/org/eclipse/platform/org.eclipse.core.commands/3.8.0/org.eclipse.core.commands-3.8.0.pom
Progress (1): 1.9 kB
                    
Downloaded from sonatype-releases: https://oss.sonatype.org/content/repositories/releases/org/eclipse/platform/org.eclipse.core.commands/3.8.0/org.eclipse.core.commands-3.8.0.pom (1.9 kB at 14 kB/s)
Downloading from sonatype-releases: https://oss.sonatype.org/content/repositories/releases/org/eclipse/platform/org.eclipse.core.commands/3.8.1/org.eclipse.core.commands-3.8.1.pom
Progress (1): 1.9 kB
                    
Downloaded from sonatype-releases: https://oss.sonatype.org/content/repositories/releases/org/eclipse/platform/org.eclipse.core.commands/3.8.1/org.eclipse.core.commands-3.8.1.pom (1.9 kB at 14 kB/s)
Downloading from sonatype-releases: https://oss.sonatype.org/content/repositories/releases/org/eclipse/platform/org.eclipse.core.commands/3.9.0/org.eclipse.core.commands-3.9.0.pom
Progress (1): 1.9 kB
                    
Downloaded from sonatype-releases: https://oss.sonatype.org/content/repositories/releases/org/eclipse/platform/org.eclipse.core.commands/3.9.0/org.eclipse.core.commands-3.9.0.pom (1.9 kB at 13 kB/s)
Downloading from sonatype-releases: https://oss.sonatype.org/content/repositories/releases/org/eclipse/platform/org.eclipse.core.commands/3.9.100/org.eclipse.core.commands-3.9.100.pom
Progress (1): 1.9 kB
                    
Downloaded from sonatype-releases: https://oss.sonatype.org/content/repositories/releases/org/eclipse/platform/org.eclipse.core.commands/3.9.100/org.eclipse.core.commands-3.9.100.pom (1.9 kB at 14 kB/s)
Downloading from sonatype-releases: https://oss.sonatype.org/content/repositories/releases/org/eclipse/platform/org.eclipse.core.commands/3.9.200/org.eclipse.core.commands-3.9.200.pom
Progress (1): 1.9 kB
                    
Downloaded from sonatype-releases: https://oss.sonatype.org/content/repositories/releases/org/eclipse/platform/org.eclipse.core.commands/3.9.200/org.eclipse.core.commands-3.9.200.pom (1.9 kB at 13 kB/s)
Downloading from sonatype-releases: https://oss.sonatype.org/content/repositories/releases/org/eclipse/platform/org.eclipse.core.commands/3.9.300/org.eclipse.core.commands-3.9.300.pom
Progress (1): 1.9 kB
                    
Downloaded from sonatype-releases: https://oss.sonatype.org/content/repositories/releases/org/eclipse/platform/org.eclipse.core.commands/3.9.300/org.eclipse.core.commands-3.9.300.pom (1.9 kB at 17 kB/s)
Downloading from sonatype-releases: https://oss.sonatype.org/content/repositories/releases/org/eclipse/platform/org.eclipse.core.commands/3.9.400/org.eclipse.core.commands-3.9.400.pom
Progress (1): 1.9 kB
                    
Downloaded from sonatype-releases: https://oss.sonatype.org/content/repositories/releases/org/eclipse/platform/org.eclipse.core.commands/3.9.400/org.eclipse.core.commands-3.9.400.pom (1.9 kB at 13 kB/s)
Downloading from sonatype-releases: https://oss.sonatype.org/content/repositories/releases/org/eclipse/platform/org.eclipse.core.commands/3.9.500/org.eclipse.core.commands-3.9.500.pom
Progress (1): 1.9 kB
                    
Downloaded from sonatype-releases: https://oss.sonatype.org/content/repositories/releases/org/eclipse/platform/org.eclipse.core.commands/3.9.500/org.eclipse.core.commands-3.9.500.pom (1.9 kB at 14 kB/s)
Downloading from sonatype-releases: https://oss.sonatype.org/content/repositories/releases/org/eclipse/platform/org.eclipse.core.commands/3.9.700/org.eclipse.core.commands-3.9.700.pom
Progress (1): 1.9 kB
                    
Downloaded from sonatype-releases: https://oss.sonatype.org/content/repositories/releases/org/eclipse/platform/org.eclipse.core.commands/3.9.700/org.eclipse.core.commands-3.9.700.pom (1.9 kB at 19 kB/s)
Downloading from sonatype-releases: https://oss.sonatype.org/content/repositories/releases/org/eclipse/platform/org.eclipse.text/3.6.100/org.eclipse.text-3.6.100.pom
Progress (1): 2.1 kB
                    
Downloaded from sonatype-releases: https://oss.sonatype.org/content/repositories/releases/org/eclipse/platform/org.eclipse.text/3.6.100/org.eclipse.text-3.6.100.pom (2.1 kB at 15 kB/s)
Downloading from sonatype-releases: https://oss.sonatype.org/content/repositories/releases/org/eclipse/platform/org.eclipse.text/3.6.300/org.eclipse.text-3.6.300.pom
Progress (1): 2.1 kB
                    
Downloaded from sonatype-releases: https://oss.sonatype.org/content/repositories/releases/org/eclipse/platform/org.eclipse.text/3.6.300/org.eclipse.text-3.6.300.pom (2.1 kB at 15 kB/s)
Downloading from sonatype-releases: https://oss.sonatype.org/content/repositories/releases/org/eclipse/platform/org.eclipse.text/3.7.0/org.eclipse.text-3.7.0.pom
Progress (1): 2.2/2.4 kB
Progress (1): 2.4 kB    
                    
Downloaded from sonatype-releases: https://oss.sonatype.org/content/repositories/releases/org/eclipse/platform/org.eclipse.text/3.7.0/org.eclipse.text-3.7.0.pom (2.4 kB at 17 kB/s)
Downloading from sonatype-releases: https://oss.sonatype.org/content/repositories/releases/org/eclipse/platform/org.eclipse.text/3.8.0/org.eclipse.text-3.8.0.pom
Progress (1): 2.2/2.4 kB
Progress (1): 2.4 kB    
                    
Downloaded from sonatype-releases: https://oss.sonatype.org/content/repositories/releases/org/eclipse/platform/org.eclipse.text/3.8.0/org.eclipse.text-3.8.0.pom (2.4 kB at 17 kB/s)
Downloading from sonatype-releases: https://oss.sonatype.org/content/repositories/releases/org/eclipse/platform/org.eclipse.text/3.8.100/org.eclipse.text-3.8.100.pom
Progress (1): 2.2/2.4 kB
Progress (1): 2.4 kB    
                    
Downloaded from sonatype-releases: https://oss.sonatype.org/content/repositories/releases/org/eclipse/platform/org.eclipse.text/3.8.100/org.eclipse.text-3.8.100.pom (2.4 kB at 24 kB/s)
Downloading from sonatype-releases: https://oss.sonatype.org/content/repositories/releases/org/eclipse/platform/org.eclipse.text/3.8.200/org.eclipse.text-3.8.200.pom
Progress (1): 2.2/2.4 kB
Progress (1): 2.4 kB    
                    
Downloaded from sonatype-releases: https://oss.sonatype.org/content/repositories/releases/org/eclipse/platform/org.eclipse.text/3.8.200/org.eclipse.text-3.8.200.pom (2.4 kB at 18 kB/s)
Downloading from sonatype-releases: https://oss.sonatype.org/content/repositories/releases/org/eclipse/platform/org.eclipse.text/3.9.0/org.eclipse.text-3.9.0.pom
Progress (1): 2.2/2.4 kB
Progress (1): 2.4 kB    
                    
Downloaded from sonatype-releases: https://oss.sonatype.org/content/repositories/releases/org/eclipse/platform/org.eclipse.text/3.9.0/org.eclipse.text-3.9.0.pom (2.4 kB at 16 kB/s)
Downloading from sonatype-releases: https://oss.sonatype.org/content/repositories/releases/org/eclipse/platform/org.eclipse.text/3.10.100/org.eclipse.text-3.10.100.pom
Progress (1): 2.2/2.4 kB
Progress (1): 2.4 kB    
                    
Downloaded from sonatype-releases: https://oss.sonatype.org/content/repositories/releases/org/eclipse/platform/org.eclipse.text/3.10.100/org.eclipse.text-3.10.100.pom (2.4 kB at 24 kB/s)
Downloading from sonatype-releases: https://oss.sonatype.org/content/repositories/releases/org/eclipse/jdt/org.eclipse.jdt.core/3.12.3/org.eclipse.jdt.core-3.12.3.pom
Progress (1): 2.2/2.6 kB
Progress (1): 2.6 kB    
                    
Downloaded from sonatype-releases: https://oss.sonatype.org/content/repositories/releases/org/eclipse/jdt/org.eclipse.jdt.core/3.12.3/org.eclipse.jdt.core-3.12.3.pom (2.6 kB at 20 kB/s)
Downloading from sonatype-releases: https://oss.sonatype.org/content/repositories/releases/org/eclipse/jdt/org.eclipse.jdt.core/3.13.0/org.eclipse.jdt.core-3.13.0.pom
Progress (1): 2.2/2.6 kB
Progress (1): 2.6 kB    
                    
Downloaded from sonatype-releases: https://oss.sonatype.org/content/repositories/releases/org/eclipse/jdt/org.eclipse.jdt.core/3.13.0/org.eclipse.jdt.core-3.13.0.pom (2.6 kB at 19 kB/s)
Downloading from sonatype-releases: https://oss.sonatype.org/content/repositories/releases/org/eclipse/jdt/org.eclipse.jdt.core/3.13.50/org.eclipse.jdt.core-3.13.50.pom
Progress (1): 2.2/2.6 kB
Progress (1): 2.6 kB    
                    
Downloaded from sonatype-releases: https://oss.sonatype.org/content/repositories/releases/org/eclipse/jdt/org.eclipse.jdt.core/3.13.50/org.eclipse.jdt.core-3.13.50.pom (2.6 kB at 19 kB/s)
Downloading from sonatype-releases: https://oss.sonatype.org/content/repositories/releases/org/eclipse/jdt/org.eclipse.jdt.core/3.13.100/org.eclipse.jdt.core-3.13.100.pom
Progress (1): 2.2/2.6 kB
Progress (1): 2.6 kB    
                    
Downloaded from sonatype-releases: https://oss.sonatype.org/content/repositories/releases/org/eclipse/jdt/org.eclipse.jdt.core/3.13.100/org.eclipse.jdt.core-3.13.100.pom (2.6 kB at 17 kB/s)
Downloading from sonatype-releases: https://oss.sonatype.org/content/repositories/releases/org/eclipse/jdt/org.eclipse.jdt.core/3.13.101/org.eclipse.jdt.core-3.13.101.pom
Progress (1): 2.6 kB
                    
Downloaded from sonatype-releases: https://oss.sonatype.org/content/repositories/releases/org/eclipse/jdt/org.eclipse.jdt.core/3.13.101/org.eclipse.jdt.core-3.13.101.pom (2.6 kB at 19 kB/s)
Downloading from sonatype-releases: https://oss.sonatype.org/content/repositories/releases/org/eclipse/jdt/org.eclipse.jdt.core/3.13.102/org.eclipse.jdt.core-3.13.102.pom
Progress (1): 2.2/2.6 kB
Progress (1): 2.6 kB    
                    
Downloaded from sonatype-releases: https://oss.sonatype.org/content/repositories/releases/org/eclipse/jdt/org.eclipse.jdt.core/3.13.102/org.eclipse.jdt.core-3.13.102.pom (2.6 kB at 18 kB/s)
Downloading from sonatype-releases: https://oss.sonatype.org/content/repositories/releases/org/eclipse/jdt/org.eclipse.jdt.core/3.14.0/org.eclipse.jdt.core-3.14.0.pom
Progress (1): 2.6 kB
                    
Downloaded from sonatype-releases: https://oss.sonatype.org/content/repositories/releases/org/eclipse/jdt/org.eclipse.jdt.core/3.14.0/org.eclipse.jdt.core-3.14.0.pom (2.6 kB at 19 kB/s)
Downloading from sonatype-releases: https://oss.sonatype.org/content/repositories/releases/org/eclipse/jdt/org.eclipse.jdt.core/3.15.0/org.eclipse.jdt.core-3.15.0.pom
Progress (1): 2.2/2.6 kB
Progress (1): 2.6 kB    
                    
Downloaded from sonatype-releases: https://oss.sonatype.org/content/repositories/releases/org/eclipse/jdt/org.eclipse.jdt.core/3.15.0/org.eclipse.jdt.core-3.15.0.pom (2.6 kB at 26 kB/s)
Downloading from sonatype-releases: https://oss.sonatype.org/content/repositories/releases/org/eclipse/jdt/org.eclipse.jdt.core/3.16.0/org.eclipse.jdt.core-3.16.0.pom
Progress (1): 2.2/2.7 kB
Progress (1): 2.7 kB    
                    
Downloaded from sonatype-releases: https://oss.sonatype.org/content/repositories/releases/org/eclipse/jdt/org.eclipse.jdt.core/3.16.0/org.eclipse.jdt.core-3.16.0.pom (2.7 kB at 19 kB/s)
Downloading from sonatype-releases: https://oss.sonatype.org/content/repositories/releases/org/eclipse/jdt/org.eclipse.jdt.core/3.17.0/org.eclipse.jdt.core-3.17.0.pom
Progress (1): 2.2/2.7 kB
Progress (1): 2.7 kB    
                    
Downloaded from sonatype-releases: https://oss.sonatype.org/content/repositories/releases/org/eclipse/jdt/org.eclipse.jdt.core/3.17.0/org.eclipse.jdt.core-3.17.0.pom (2.7 kB at 26 kB/s)
Downloading from sonatype-releases: https://oss.sonatype.org/content/repositories/releases/org/eclipse/jdt/org.eclipse.jdt.core/3.18.0/org.eclipse.jdt.core-3.18.0.pom
Progress (1): 2.7 kB
                    
Downloaded from sonatype-releases: https://oss.sonatype.org/content/repositories/releases/org/eclipse/jdt/org.eclipse.jdt.core/3.18.0/org.eclipse.jdt.core-3.18.0.pom (2.7 kB at 18 kB/s)
Downloading from sonatype-releases: https://oss.sonatype.org/content/repositories/releases/org/eclipse/jdt/org.eclipse.jdt.core/3.19.0/org.eclipse.jdt.core-3.19.0.pom
Progress (1): 2.2/2.7 kB
Progress (1): 2.7 kB    
                    
Downloaded from sonatype-releases: https://oss.sonatype.org/content/repositories/releases/org/eclipse/jdt/org.eclipse.jdt.core/3.19.0/org.eclipse.jdt.core-3.19.0.pom (2.7 kB at 20 kB/s)
Downloading from sonatype-releases: https://oss.sonatype.org/content/repositories/releases/org/eclipse/jdt/org.eclipse.jdt.core/3.21.0/org.eclipse.jdt.core-3.21.0.pom
Progress (1): 2.2/2.7 kB
Progress (1): 2.7 kB    
                    
Downloaded from sonatype-releases: https://oss.sonatype.org/content/repositories/releases/org/eclipse/jdt/org.eclipse.jdt.core/3.21.0/org.eclipse.jdt.core-3.21.0.pom (2.7 kB at 26 kB/s)
Downloading from sonatype-releases: https://oss.sonatype.org/content/repositories/releases/org/eclipse/emf/org.eclipse.emf.codegen.ecore/2.20.0/org.eclipse.emf.codegen.ecore-2.20.0.pom
Progress (1): 2.2/2.5 kB
Progress (1): 2.5 kB    
                    
Downloaded from sonatype-releases: https://oss.sonatype.org/content/repositories/releases/org/eclipse/emf/org.eclipse.emf.codegen.ecore/2.20.0/org.eclipse.emf.codegen.ecore-2.20.0.pom (2.5 kB at 7.5 kB/s)
Downloading from cbi-release: https://repo.eclipse.org/content/repositories/cbi-releases/org/eclipse/emf/org.eclipse.emf.codegen/maven-metadata.xml
Downloading from sonatype-snapshots: https://oss.sonatype.org/content/repositories/snapshots/org/eclipse/emf/org.eclipse.emf.codegen/maven-metadata.xml
Downloading from repo.eclipse.org: https://repo.eclipse.org/content/repositories/maven_central/org/eclipse/emf/org.eclipse.emf.codegen/maven-metadata.xml
Downloading from sonatype-releases: https://oss.sonatype.org/content/repositories/releases/org/eclipse/emf/org.eclipse.emf.codegen/maven-metadata.xml
Progress (1): 502 B
Progress (2): 502 B | 803 B
                           
Downloaded from repo.eclipse.org: https://repo.eclipse.org/content/repositories/maven_central/org/eclipse/emf/org.eclipse.emf.codegen/maven-metadata.xml (803 B at 13 kB/s)
Downloaded from sonatype-snapshots: https://oss.sonatype.org/content/repositories/snapshots/org/eclipse/emf/org.eclipse.emf.codegen/maven-metadata.xml (502 B at 6.4 kB/s)
Progress (1): 803 B
                   
Downloaded from sonatype-releases: https://oss.sonatype.org/content/repositories/releases/org/eclipse/emf/org.eclipse.emf.codegen/maven-metadata.xml (803 B at 3.8 kB/s)
Downloading from sonatype-snapshots: https://oss.sonatype.org/content/repositories/snapshots/org/eclipse/emf/org.eclipse.emf.ecore.xmi/maven-metadata.xml
Downloading from repo.eclipse.org: https://repo.eclipse.org/content/repositories/maven_central/org/eclipse/emf/org.eclipse.emf.ecore.xmi/maven-metadata.xml
Downloading from cbi-release: https://repo.eclipse.org/content/repositories/cbi-releases/org/eclipse/emf/org.eclipse.emf.ecore.xmi/maven-metadata.xml
Downloading from sonatype-releases: https://oss.sonatype.org/content/repositories/releases/org/eclipse/emf/org.eclipse.emf.ecore.xmi/maven-metadata.xml
Progress (1): 943 B
                   
Downloaded from repo.eclipse.org: https://repo.eclipse.org/content/repositories/maven_central/org/eclipse/emf/org.eclipse.emf.ecore.xmi/maven-metadata.xml (943 B at 28 kB/s)
Progress (1): 505 B
Progress (2): 505 B | 943 B
                           
Downloaded from sonatype-releases: https://oss.sonatype.org/content/repositories/releases/org/eclipse/emf/org.eclipse.emf.ecore.xmi/maven-metadata.xml (943 B at 8.9 kB/s)
Downloaded from sonatype-snapshots: https://oss.sonatype.org/content/repositories/snapshots/org/eclipse/emf/org.eclipse.emf.ecore.xmi/maven-metadata.xml (505 B at 2.1 kB/s)
Downloading from sonatype-releases: https://oss.sonatype.org/content/repositories/releases/org/eclipse/emf/org.eclipse.emf.mwe.utils/1.5.2/org.eclipse.emf.mwe.utils-1.5.2.pom
Progress (1): 870 B
                   
Downloaded from sonatype-releases: https://oss.sonatype.org/content/repositories/releases/org/eclipse/emf/org.eclipse.emf.mwe.utils/1.5.2/org.eclipse.emf.mwe.utils-1.5.2.pom (870 B at 8.4 kB/s)
Downloading from sonatype-releases: https://oss.sonatype.org/content/repositories/releases/org/eclipse/emf/org.eclipse.emf.mwe2.plugins-parent/2.11.2/org.eclipse.emf.mwe2.plugins-parent-2.11.2.pom
Progress (1): 2.2/3.9 kB
Progress (1): 3.9 kB    
                    
Downloaded from sonatype-releases: https://oss.sonatype.org/content/repositories/releases/org/eclipse/emf/org.eclipse.emf.mwe2.plugins-parent/2.11.2/org.eclipse.emf.mwe2.plugins-parent-2.11.2.pom (3.9 kB at 38 kB/s)
Downloading from sonatype-releases: https://oss.sonatype.org/content/repositories/releases/org/eclipse/emf/org.eclipse.emf.mwe2.parent/2.11.2/org.eclipse.emf.mwe2.parent-2.11.2.pom
Progress (1): 2.3/9.6 kB
Progress (1): 5.0/9.6 kB
Progress (1): 7.8/9.6 kB
Progress (1): 9.6 kB    
                    
Downloaded from sonatype-releases: https://oss.sonatype.org/content/repositories/releases/org/eclipse/emf/org.eclipse.emf.mwe2.parent/2.11.2/org.eclipse.emf.mwe2.parent-2.11.2.pom (9.6 kB at 94 kB/s)
Downloading from sonatype-snapshots: https://oss.sonatype.org/content/repositories/snapshots/org/eclipse/emf/org.eclipse.emf.mwe.core/maven-metadata.xml
Downloading from repo.eclipse.org: https://repo.eclipse.org/content/repositories/maven_central/org/eclipse/emf/org.eclipse.emf.mwe.core/maven-metadata.xml
Downloading from cbi-release: https://repo.eclipse.org/content/repositories/cbi-releases/org/eclipse/emf/org.eclipse.emf.mwe.core/maven-metadata.xml
Downloading from sonatype-releases: https://oss.sonatype.org/content/repositories/releases/org/eclipse/emf/org.eclipse.emf.mwe.core/maven-metadata.xml
Progress (1): 758 B
                   
Downloaded from repo.eclipse.org: https://repo.eclipse.org/content/repositories/maven_central/org/eclipse/emf/org.eclipse.emf.mwe.core/maven-metadata.xml (758 B at 21 kB/s)
Progress (1): 724 B
Progress (2): 724 B | 758 B
                           
Downloaded from sonatype-snapshots: https://oss.sonatype.org/content/repositories/snapshots/org/eclipse/emf/org.eclipse.emf.mwe.core/maven-metadata.xml (724 B at 8.7 kB/s)
Downloaded from sonatype-releases: https://oss.sonatype.org/content/repositories/releases/org/eclipse/emf/org.eclipse.emf.mwe.core/maven-metadata.xml (758 B at 7.3 kB/s)
Downloading from sonatype-releases: https://oss.sonatype.org/content/repositories/releases/org/eclipse/emf/org.eclipse.emf.mwe.core/1.5.2/org.eclipse.emf.mwe.core-1.5.2.pom
Progress (1): 1.2 kB
                    
Downloaded from sonatype-releases: https://oss.sonatype.org/content/repositories/releases/org/eclipse/emf/org.eclipse.emf.mwe.core/1.5.2/org.eclipse.emf.mwe.core-1.5.2.pom (1.2 kB at 12 kB/s)
Downloading from sonatype-releases: https://oss.sonatype.org/content/repositories/releases/org/eclipse/emf/org.eclipse.emf.mwe2.runtime/2.11.2/org.eclipse.emf.mwe2.runtime-2.11.2.pom
Progress (1): 837 B
                   
Downloaded from sonatype-releases: https://oss.sonatype.org/content/repositories/releases/org/eclipse/emf/org.eclipse.emf.mwe2.runtime/2.11.2/org.eclipse.emf.mwe2.runtime-2.11.2.pom (837 B at 8.3 kB/s)
Downloading from sonatype-releases: https://oss.sonatype.org/content/repositories/releases/commons-logging/commons-logging/1.1.3/commons-logging-1.1.3.pom
Progress (1): 2.2/18 kB
Progress (1): 5.0/18 kB
Progress (1): 7.8/18 kB
Progress (1): 11/18 kB 
Progress (1): 13/18 kB
Progress (1): 16/18 kB
Progress (1): 18 kB   
                   
Downloaded from sonatype-releases: https://oss.sonatype.org/content/repositories/releases/commons-logging/commons-logging/1.1.3/commons-logging-1.1.3.pom (18 kB at 133 kB/s)
Downloading from sonatype-releases: https://oss.sonatype.org/content/repositories/releases/org/apache/commons/commons-parent/28/commons-parent-28.pom
Progress (1): 2.2/50 kB
Progress (1): 5.0/50 kB
Progress (1): 7.8/50 kB
Progress (1): 11/50 kB 
Progress (1): 13/50 kB
Progress (1): 16/50 kB
Progress (1): 19/50 kB
Progress (1): 21/50 kB
Progress (1): 24/50 kB
Progress (1): 27/50 kB
Progress (1): 30/50 kB
Progress (1): 32/50 kB
Progress (1): 36/50 kB
Progress (1): 40/50 kB
Progress (1): 45/50 kB
Progress (1): 49/50 kB
Progress (1): 50 kB   
                   
Downloaded from sonatype-releases: https://oss.sonatype.org/content/repositories/releases/org/apache/commons/commons-parent/28/commons-parent-28.pom (50 kB at 337 kB/s)
Downloading from sonatype-releases: https://oss.sonatype.org/content/repositories/releases/org/eclipse/emf/org.eclipse.emf.mwe2.lib/2.11.2/org.eclipse.emf.mwe2.lib-2.11.2.pom
Progress (1): 846 B
                   
Downloaded from sonatype-releases: https://oss.sonatype.org/content/repositories/releases/org/eclipse/emf/org.eclipse.emf.mwe2.lib/2.11.2/org.eclipse.emf.mwe2.lib-2.11.2.pom (846 B at 8.3 kB/s)
Downloading from sonatype-releases: https://oss.sonatype.org/content/repositories/releases/com/ibm/icu/icu4j/52.1/icu4j-52.1.pom
Progress (1): 2.2/4.8 kB
Progress (1): 4.8 kB    
                    
Downloaded from sonatype-releases: https://oss.sonatype.org/content/repositories/releases/com/ibm/icu/icu4j/52.1/icu4j-52.1.pom (4.8 kB at 33 kB/s)
Downloading from sonatype-releases: https://oss.sonatype.org/content/repositories/releases/org/eclipse/xtext/xtext-antlr-generator/2.1.1/xtext-antlr-generator-2.1.1.pom
Progress (1): 2.2/5.1 kB
Progress (1): 5.0/5.1 kB
Progress (1): 5.1 kB    
                    
Downloaded from sonatype-releases: https://oss.sonatype.org/content/repositories/releases/org/eclipse/xtext/xtext-antlr-generator/2.1.1/xtext-antlr-generator-2.1.1.pom (5.1 kB at 36 kB/s)
Downloading from sonatype-releases: https://oss.sonatype.org/content/repositories/releases/org/xtext/antlr-generator/3.2.1/antlr-generator-3.2.1.pom
Progress (1): 2.2/4.3 kB
Progress (1): 4.3 kB    
                    
Downloaded from sonatype-releases: https://oss.sonatype.org/content/repositories/releases/org/xtext/antlr-generator/3.2.1/antlr-generator-3.2.1.pom (4.3 kB at 28 kB/s)
Downloading from cbi-release: https://repo.eclipse.org/content/repositories/cbi-releases/org/antlr/antlr-runtime/maven-metadata.xml
Downloading from repo.eclipse.org: https://repo.eclipse.org/content/repositories/maven_central/org/antlr/antlr-runtime/maven-metadata.xml
Downloading from sonatype-snapshots: https://oss.sonatype.org/content/repositories/snapshots/org/antlr/antlr-runtime/maven-metadata.xml
Downloading from sonatype-releases: https://oss.sonatype.org/content/repositories/releases/org/antlr/antlr-runtime/maven-metadata.xml
Downloading from sonatype-nexus-snapshots: https://oss.sonatype.org/content/repositories/snapshots/org/antlr/antlr-runtime/maven-metadata.xml
Progress (1): 850 B
Progress (2): 850 B | 850 B
                           
Downloaded from repo.eclipse.org: https://repo.eclipse.org/content/repositories/maven_central/org/antlr/antlr-runtime/maven-metadata.xml (850 B at 9.4 kB/s)
Downloaded from sonatype-releases: https://oss.sonatype.org/content/repositories/releases/org/antlr/antlr-runtime/maven-metadata.xml (850 B at 2.4 kB/s)
Downloading from sonatype-releases: https://oss.sonatype.org/content/repositories/releases/org/antlr/stringtemplate/3.2/stringtemplate-3.2.pom
Progress (1): 2.0 kB
                    
Downloaded from sonatype-releases: https://oss.sonatype.org/content/repositories/releases/org/antlr/stringtemplate/3.2/stringtemplate-3.2.pom (2.0 kB at 14 kB/s)
Downloading from sonatype-releases: https://oss.sonatype.org/content/repositories/releases/antlr/antlr/2.7.7/antlr-2.7.7.pom
Progress (1): 632 B
                   
Downloaded from sonatype-releases: https://oss.sonatype.org/content/repositories/releases/antlr/antlr/2.7.7/antlr-2.7.7.pom (632 B at 6.3 kB/s)
Downloading from sonatype-releases: https://oss.sonatype.org/content/repositories/releases/org/apache/maven/maven-toolchain/1.0/maven-toolchain-1.0.pom
Progress (1): 2.2/3.4 kB
Progress (1): 3.4 kB    
                    
Downloaded from sonatype-releases: https://oss.sonatype.org/content/repositories/releases/org/apache/maven/maven-toolchain/1.0/maven-toolchain-1.0.pom (3.4 kB at 33 kB/s)
Downloading from sonatype-releases: https://oss.sonatype.org/content/repositories/releases/junit/junit/4.11/junit-4.11.pom
Progress (1): 2.2/2.3 kB
Progress (1): 2.3 kB    
                    
Downloaded from sonatype-releases: https://oss.sonatype.org/content/repositories/releases/junit/junit/4.11/junit-4.11.pom (2.3 kB at 20 kB/s)
Downloading from sonatype-releases: https://oss.sonatype.org/content/repositories/releases/org/apache/maven/maven-plugin-api/2.2.1/maven-plugin-api-2.2.1.pom
Progress (1): 1.5 kB
                    
Downloaded from sonatype-releases: https://oss.sonatype.org/content/repositories/releases/org/apache/maven/maven-plugin-api/2.2.1/maven-plugin-api-2.2.1.pom (1.5 kB at 14 kB/s)
Downloading from sonatype-releases: https://oss.sonatype.org/content/repositories/releases/org/apache/maven/maven-core/2.2.1/maven-core-2.2.1.pom
Progress (1): 2.2/12 kB
Progress (1): 5.0/12 kB
Progress (1): 7.8/12 kB
Progress (1): 11/12 kB 
Progress (1): 12 kB   
                   
Downloaded from sonatype-releases: https://oss.sonatype.org/content/repositories/releases/org/apache/maven/maven-core/2.2.1/maven-core-2.2.1.pom (12 kB at 110 kB/s)
Downloading from sonatype-releases: https://oss.sonatype.org/content/repositories/releases/org/apache/maven/maven-plugin-parameter-documenter/2.2.1/maven-plugin-parameter-documenter-2.2.1.pom
Progress (1): 2.0 kB
                    
Downloaded from sonatype-releases: https://oss.sonatype.org/content/repositories/releases/org/apache/maven/maven-plugin-parameter-documenter/2.2.1/maven-plugin-parameter-documenter-2.2.1.pom (2.0 kB at 18 kB/s)
Downloading from sonatype-releases: https://oss.sonatype.org/content/repositories/releases/org/slf4j/slf4j-jdk14/1.5.6/slf4j-jdk14-1.5.6.pom
Progress (1): 1.9 kB
                    
Downloaded from sonatype-releases: https://oss.sonatype.org/content/repositories/releases/org/slf4j/slf4j-jdk14/1.5.6/slf4j-jdk14-1.5.6.pom (1.9 kB at 18 kB/s)
Downloading from sonatype-releases: https://oss.sonatype.org/content/repositories/releases/org/slf4j/slf4j-parent/1.5.6/slf4j-parent-1.5.6.pom
Progress (1): 2.2/7.9 kB
Progress (1): 5.0/7.9 kB
Progress (1): 7.8/7.9 kB
Progress (1): 7.9 kB    
                    
Downloaded from sonatype-releases: https://oss.sonatype.org/content/repositories/releases/org/slf4j/slf4j-parent/1.5.6/slf4j-parent-1.5.6.pom (7.9 kB at 25 kB/s)
Downloading from sonatype-releases: https://oss.sonatype.org/content/repositories/releases/org/slf4j/slf4j-api/1.5.6/slf4j-api-1.5.6.pom
Progress (1): 2.2/3.0 kB
Progress (1): 3.0 kB    
                    
Downloaded from sonatype-releases: https://oss.sonatype.org/content/repositories/releases/org/slf4j/slf4j-api/1.5.6/slf4j-api-1.5.6.pom (3.0 kB at 24 kB/s)
Downloading from sonatype-releases: https://oss.sonatype.org/content/repositories/releases/org/slf4j/jcl-over-slf4j/1.5.6/jcl-over-slf4j-1.5.6.pom
Progress (1): 2.2 kB
                    
Downloaded from sonatype-releases: https://oss.sonatype.org/content/repositories/releases/org/slf4j/jcl-over-slf4j/1.5.6/jcl-over-slf4j-1.5.6.pom (2.2 kB at 21 kB/s)
Downloading from sonatype-releases: https://oss.sonatype.org/content/repositories/releases/org/apache/maven/reporting/maven-reporting-api/2.2.1/maven-reporting-api-2.2.1.pom
Progress (1): 1.9 kB
                    
Downloaded from sonatype-releases: https://oss.sonatype.org/content/repositories/releases/org/apache/maven/reporting/maven-reporting-api/2.2.1/maven-reporting-api-2.2.1.pom (1.9 kB at 18 kB/s)
Downloading from sonatype-releases: https://oss.sonatype.org/content/repositories/releases/org/apache/maven/reporting/maven-reporting/2.2.1/maven-reporting-2.2.1.pom
Progress (1): 1.4 kB
                    
Downloaded from sonatype-releases: https://oss.sonatype.org/content/repositories/releases/org/apache/maven/reporting/maven-reporting/2.2.1/maven-reporting-2.2.1.pom (1.4 kB at 10 kB/s)
Downloading from sonatype-releases: https://oss.sonatype.org/content/repositories/releases/org/apache/maven/doxia/doxia-sink-api/1.1/doxia-sink-api-1.1.pom
Progress (1): 2.0 kB
                    
Downloaded from sonatype-releases: https://oss.sonatype.org/content/repositories/releases/org/apache/maven/doxia/doxia-sink-api/1.1/doxia-sink-api-1.1.pom (2.0 kB at 17 kB/s)
Downloading from sonatype-releases: https://oss.sonatype.org/content/repositories/releases/org/apache/maven/doxia/doxia/1.1/doxia-1.1.pom
Progress (1): 2.2/15 kB
Progress (1): 5.0/15 kB
Progress (1): 7.8/15 kB
Progress (1): 11/15 kB 
Progress (1): 13/15 kB
Progress (1): 15 kB   
                   
Downloaded from sonatype-releases: https://oss.sonatype.org/content/repositories/releases/org/apache/maven/doxia/doxia/1.1/doxia-1.1.pom (15 kB at 120 kB/s)
Downloading from sonatype-releases: https://oss.sonatype.org/content/repositories/releases/org/apache/maven/doxia/doxia-logging-api/1.1/doxia-logging-api-1.1.pom
Progress (1): 1.6 kB
                    
Downloaded from sonatype-releases: https://oss.sonatype.org/content/repositories/releases/org/apache/maven/doxia/doxia-logging-api/1.1/doxia-logging-api-1.1.pom (1.6 kB at 15 kB/s)
Downloading from sonatype-releases: https://oss.sonatype.org/content/repositories/releases/org/apache/maven/maven-error-diagnostics/2.2.1/maven-error-diagnostics-2.2.1.pom
Progress (1): 1.7 kB
                    
Downloaded from sonatype-releases: https://oss.sonatype.org/content/repositories/releases/org/apache/maven/maven-error-diagnostics/2.2.1/maven-error-diagnostics-2.2.1.pom (1.7 kB at 14 kB/s)
Downloading from sonatype-releases: https://oss.sonatype.org/content/repositories/releases/org/apache/maven/maven-monitor/2.2.1/maven-monitor-2.2.1.pom
Progress (1): 1.3 kB
                    
Downloaded from sonatype-releases: https://oss.sonatype.org/content/repositories/releases/org/apache/maven/maven-monitor/2.2.1/maven-monitor-2.2.1.pom (1.3 kB at 11 kB/s)
[INFO] ------------------------------------------------------------------------
[INFO] Reactor Summary for EMF Parsley 1.10.0-SNAPSHOT:
[INFO] 
[INFO] EMF Parsley ........................................ SUCCESS [  1.473 s]
[INFO] org.eclipse.emf.tests.coverage ..................... SUCCESS [  0.005 s]
[INFO] org.eclipse.emf.parsley.targetplatform ............. SUCCESS [  8.819 s]
[INFO] org.eclipse.emf.parsley.runtime.common ............. SUCCESS [02:09 min]
[INFO] org.eclipse.emf.parsley.common ..................... SUCCESS [ 18.798 s]
[INFO] org.eclipse.emf.parsley.views.common ............... SUCCESS [  5.661 s]
[INFO] org.eclipse.emf.parsley.cdo.common ................. SUCCESS [  3.798 s]
[INFO] org.eclipse.emf.parsley.runtime .................... SUCCESS [  0.065 s]
[INFO] org.eclipse.emf.parsley ............................ SUCCESS [  0.082 s]
[INFO] org.eclipse.emf.parsley.junit4 ..................... SUCCESS [  0.308 s]
[INFO] org.eclipse.emf.parsley.web.servlets ............... SUCCESS [  0.441 s]
[INFO] org.eclipse.emf.parsley.generator.common ........... SUCCESS [ 29.455 s]
[INFO] org.eclipse.emf.parsley.dsl ........................ FAILURE [09:41 min]
[INFO] org.eclipse.emf.parsley.dsl.additional.builder ..... SKIPPED
[INFO] org.eclipse.emf.parsley.wizards .................... SKIPPED
[INFO] org.eclipse.emf.parsley.web.tools .................. SKIPPED
[INFO] org.eclipse.emf.parsley.tests.models ............... SKIPPED
[INFO] org.eclipse.emf.parsley.tests.libraries ............ SKIPPED
[INFO] org.eclipse.emf.parsley.examples.library ........... SKIPPED
[INFO] org.eclipse.emf.parsley.tests ...................... SKIPPED
[INFO] org.eclipse.emf.parsley.views ...................... SKIPPED
[INFO] org.eclipse.emf.parsley.tests.views ................ SKIPPED
[INFO] org.eclipse.emf.parsley.cdo ........................ SKIPPED
[INFO] org.eclipse.emf.parsley.editors.common ............. SKIPPED
[INFO] org.eclipse.emf.parsley.editors .................... SKIPPED
[INFO] org.eclipse.emf.parsley.cdo.tests .................. SKIPPED
[INFO] org.eclipse.emf.parsley.ui.examples ................ SKIPPED
[INFO] org.eclipse.emf.parsley.doc ........................ SKIPPED
[INFO] org.eclipse.emf.parsley.feature .................... SKIPPED
[INFO] org.eclipse.emf.parsley.cdo.feature ................ SKIPPED
[INFO] org.eclipse.emf.parsley.dsl.ide .................... SKIPPED
[INFO] org.eclipse.emf.parsley.dsl.ui ..................... SKIPPED
[INFO] org.eclipse.emf.parsley.dsl.feature ................ SKIPPED
[INFO] org.eclipse.emf.parsley.examples.feature ........... SKIPPED
[INFO] org.eclipse.emf.parsley.dsl.tests .................. SKIPPED
[INFO] org.eclipse.emf.parsley.dsl.ui.tests ............... SKIPPED
[INFO] org.eclipse.emf.parsley.junit4.feature ............. SKIPPED
[INFO] org.eclipse.emf.parsley.sdk ........................ SKIPPED
[INFO] org.eclipse.emf.parsley.web.feature ................ SKIPPED
[INFO] org.eclipse.emf.parsley.examples.library.edit ...... SKIPPED
[INFO] org.eclipse.emf.parsley.examples.library.editor .... SKIPPED
[INFO] org.eclipse.emf.parsley.examples.views ............. SKIPPED
[INFO] org.eclipse.emf.parsley.examples.editors ........... SKIPPED
[INFO] org.eclipse.emf.parsley.tests.swtbot.feature ....... SKIPPED
[INFO] org.eclipse.emf.parsley.tests.swtbot ............... SKIPPED
[INFO] org.eclipse.emf.parsley.examples.cdo.server ........ SKIPPED
[INFO] org.eclipse.emf.parsley.examples.cdo.model ......... SKIPPED
[INFO] org.eclipse.emf.parsley.examples.cdo.treeform ...... SKIPPED
[INFO] org.eclipse.emf.parsley.tests.swtbot.cdo.feature ... SKIPPED
[INFO] org.eclipse.emf.parsley.tests.swtbot.cdo ........... SKIPPED
[INFO] org.eclipse.emf.parsley.examples.mail.model ........ SKIPPED
[INFO] org.eclipse.emf.parsley.examples.mail.accountsview . SKIPPED
[INFO] org.eclipse.emf.parsley.examples.mail.mailsview .... SKIPPED
[INFO] org.eclipse.emf.parsley.examples.mail.messageview .. SKIPPED
[INFO] org.eclipse.emf.parsley.examples.mail.rcp .......... SKIPPED
[INFO] org.eclipse.emf.parsley.examples.mail.product.feature SKIPPED
[INFO] org.eclipse.emf.parsley.tests.swtbot.examples ...... SKIPPED
[INFO] org.eclipse.emf.parsley.repository ................. SKIPPED
[INFO] org.eclipse.emf.parsley.examples.eclipse4 .......... SKIPPED
[INFO] org.eclipse.emf.parsley.examples.eclipse4.parsleypart SKIPPED
[INFO] org.eclipse.emf.parsley.examples.eclipse4.product.feature SKIPPED
[INFO] org.eclipse.emf.parsley.tests.swtbot.e4 ............ SKIPPED
[INFO] ------------------------------------------------------------------------
[INFO] BUILD FAILURE
[INFO] ------------------------------------------------------------------------
[INFO] Total time:  16:35 min
[INFO] Finished at: 2020-04-15T09:45:47-04:00
[INFO] ------------------------------------------------------------------------
[ERROR] Failed to execute goal org.codehaus.mojo:exec-maven-plugin:1.4.0:java (mwe2Launcher) on project org.eclipse.emf.parsley.dsl: Execution mwe2Launcher of goal org.codehaus.mojo:exec-maven-plugin:1.4.0:java failed: Plugin org.codehaus.mojo:exec-maven-plugin:1.4.0 or one of its dependencies could not be resolved: Failed to collect dependencies for org.codehaus.mojo:exec-maven-plugin:jar:1.4.0 (): Could not resolve version conflict among [org.codehaus.mojo:exec-maven-plugin:jar:1.4.0 -> org.eclipse.emf:org.eclipse.emf.mwe2.launch:jar:2.11.1 -> org.eclipse.emf:org.eclipse.emf.mwe2.runtime:jar:[2.11.1,2.11.1], org.codehaus.mojo:exec-maven-plugin:jar:1.4.0 -> org.eclipse.emf:org.eclipse.emf.mwe2.launch:jar:2.11.1 -> org.eclipse.emf:org.eclipse.emf.mwe2.language:jar:[2.11.1,2.11.1] -> org.eclipse.emf:org.eclipse.emf.mwe2.runtime:jar:[2.11.1,2.11.1], org.codehaus.mojo:exec-maven-plugin:jar:1.4.0 -> org.eclipse.xtext:org.eclipse.xtext.xtext.generator:jar:2.21.0 -> org.eclipse.emf:org.eclipse.emf.mwe.utils:jar:1.5.2 -> org.eclipse.emf:org.eclipse.emf.mwe.core:jar:[1.5.2,1.5.2] -> org.eclipse.emf:org.eclipse.emf.mwe2.runtime:jar:[2.11.2,2.11.2], org.codehaus.mojo:exec-maven-plugin:jar:1.4.0 -> org.eclipse.xtext:org.eclipse.xtext.xtext.generator:jar:2.21.0 -> org.eclipse.emf:org.eclipse.emf.mwe2.lib:jar:2.11.2 -> org.eclipse.emf:org.eclipse.emf.mwe2.runtime:jar:[2.11.2,2.11.2]] -> [Help 1]
[ERROR] 
[ERROR] To see the full stack trace of the errors, re-run Maven with the -e switch.
[ERROR] Re-run Maven using the -X switch to enable full debug logging.
[ERROR] 
[ERROR] For more information about the errors and possible solutions, please read the following articles:
[ERROR] [Help 1] http://cwiki.apache.org/confluence/display/MAVEN/PluginResolutionException
[ERROR] 
[ERROR] After correcting the problems, you can resume the build with the command
[ERROR]   mvn <args> -rf :org.eclipse.emf.parsley.dsl
Build step 'Invoke top-level Maven targets' marked build as failure
Terminating xvnc.
[FINDBUGS] Skipping publisher since build result is FAILURE
Recording test results
ERROR: Step ‘Publish JUnit test result report’ failed: No test report files were found. Configuration error?
Archiving artifacts
Started calculate disk usage of build
Finished Calculation of disk usage of build in 0 seconds
Started calculate disk usage of workspace
Finished Calculation of disk usage of workspace in 0 seconds
Finished: FAILURE