FailedConsole Output

Skipping 364 KB.. Full Log
ache/maven/maven/2.0/maven-2.0.pom
Downloading: https://repo.eclipse.org/content/repositories/cbi-releases/org/apache/maven/maven/2.0/maven-2.0.pom
Downloading: https://repo.maven.apache.org/maven2/org/apache/maven/maven/2.0/maven-2.0.pom
Downloaded: https://repo.maven.apache.org/maven2/org/apache/maven/maven/2.0/maven-2.0.pom (9 KB at 87.4 KB/sec)
Downloading: https://oss.sonatype.org/content/repositories/releases/org/apache/maven/maven-plugin-descriptor/2.0.2/maven-plugin-descriptor-2.0.2.pom
Downloading: https://repo.eclipse.org/content/repositories/cbi-releases/org/apache/maven/maven-plugin-descriptor/2.0.2/maven-plugin-descriptor-2.0.2.pom
Downloading: https://repo.maven.apache.org/maven2/org/apache/maven/maven-plugin-descriptor/2.0.2/maven-plugin-descriptor-2.0.2.pom
Downloaded: https://repo.maven.apache.org/maven2/org/apache/maven/maven-plugin-descriptor/2.0.2/maven-plugin-descriptor-2.0.2.pom (2 KB at 14.9 KB/sec)
Downloading: https://oss.sonatype.org/content/repositories/releases/org/apache/maven/maven-monitor/2.0.2/maven-monitor-2.0.2.pom
Downloading: https://repo.eclipse.org/content/repositories/cbi-releases/org/apache/maven/maven-monitor/2.0.2/maven-monitor-2.0.2.pom
Downloading: https://repo.maven.apache.org/maven2/org/apache/maven/maven-monitor/2.0.2/maven-monitor-2.0.2.pom
Downloaded: https://repo.maven.apache.org/maven2/org/apache/maven/maven-monitor/2.0.2/maven-monitor-2.0.2.pom (442 B at 4.4 KB/sec)
Downloading: https://oss.sonatype.org/content/repositories/releases/org/apache/maven/maven-artifact/2.0/maven-artifact-2.0.pom
Downloading: https://repo.eclipse.org/content/repositories/cbi-releases/org/apache/maven/maven-artifact/2.0/maven-artifact-2.0.pom
Downloading: https://repo.maven.apache.org/maven2/org/apache/maven/maven-artifact/2.0/maven-artifact-2.0.pom
Downloaded: https://repo.maven.apache.org/maven2/org/apache/maven/maven-artifact/2.0/maven-artifact-2.0.pom (723 B at 7.1 KB/sec)
Downloading: https://oss.sonatype.org/content/repositories/releases/org/codehaus/plexus/plexus-utils/1.5.8/plexus-utils-1.5.8.pom
Downloading: https://repo.eclipse.org/content/repositories/cbi-releases/org/codehaus/plexus/plexus-utils/1.5.8/plexus-utils-1.5.8.pom
Downloading: https://repo.maven.apache.org/maven2/org/codehaus/plexus/plexus-utils/1.5.8/plexus-utils-1.5.8.pom
Downloaded: https://repo.maven.apache.org/maven2/org/codehaus/plexus/plexus-utils/1.5.8/plexus-utils-1.5.8.pom (8 KB at 80.3 KB/sec)
Downloading: https://oss.sonatype.org/content/repositories/releases/org/codehaus/plexus/plexus/2.0.2/plexus-2.0.2.pom
Downloading: https://repo.eclipse.org/content/repositories/cbi-releases/org/codehaus/plexus/plexus/2.0.2/plexus-2.0.2.pom
Downloading: https://repo.maven.apache.org/maven2/org/codehaus/plexus/plexus/2.0.2/plexus-2.0.2.pom
Downloaded: https://repo.maven.apache.org/maven2/org/codehaus/plexus/plexus/2.0.2/plexus-2.0.2.pom (12 KB at 112.3 KB/sec)
Downloading: https://oss.sonatype.org/content/repositories/releases/org/apache/maven/maven-model/2.0.2/maven-model-2.0.2.jar
Downloading: https://oss.sonatype.org/content/repositories/releases/org/apache/maven/maven-project/2.0.2/maven-project-2.0.2.jar
Downloading: https://oss.sonatype.org/content/repositories/releases/org/apache/maven/maven-profile/2.0.2/maven-profile-2.0.2.jar
Downloading: https://oss.sonatype.org/content/repositories/releases/org/apache/maven/maven-artifact-manager/2.0.2/maven-artifact-manager-2.0.2.jar
Downloading: https://oss.sonatype.org/content/repositories/releases/org/codehaus/plexus/plexus-container-default/1.0-alpha-9/plexus-container-default-1.0-alpha-9.jar
Downloading: https://oss.sonatype.org/content/repositories/releases/org/apache/maven/maven-core/2.0.2/maven-core-2.0.2.jar
Downloading: https://oss.sonatype.org/content/repositories/releases/org/apache/maven/maven-settings/2.0.2/maven-settings-2.0.2.jar
Downloading: https://oss.sonatype.org/content/repositories/releases/org/apache/maven/maven-plugin-parameter-documenter/2.0.2/maven-plugin-parameter-documenter-2.0.2.jar
Downloading: https://oss.sonatype.org/content/repositories/releases/org/apache/maven/reporting/maven-reporting-api/2.0.2/maven-reporting-api-2.0.2.jar
Downloading: https://oss.sonatype.org/content/repositories/releases/org/apache/maven/doxia/doxia-sink-api/1.0-alpha-7/doxia-sink-api-1.0-alpha-7.jar
Downloading: https://oss.sonatype.org/content/repositories/releases/org/apache/maven/maven-repository-metadata/2.0.2/maven-repository-metadata-2.0.2.jar
Downloading: https://oss.sonatype.org/content/repositories/releases/org/apache/maven/maven-error-diagnostics/2.0.2/maven-error-diagnostics-2.0.2.jar
Downloading: https://oss.sonatype.org/content/repositories/releases/org/apache/maven/maven-plugin-registry/2.0.2/maven-plugin-registry-2.0.2.jar
Downloading: https://oss.sonatype.org/content/repositories/releases/commons-cli/commons-cli/1.0/commons-cli-1.0.jar
Downloading: https://oss.sonatype.org/content/repositories/releases/org/apache/maven/maven-plugin-descriptor/2.0.2/maven-plugin-descriptor-2.0.2.jar
Downloading: https://oss.sonatype.org/content/repositories/releases/org/codehaus/plexus/plexus-interactivity-api/1.0-alpha-4/plexus-interactivity-api-1.0-alpha-4.jar
Downloading: https://oss.sonatype.org/content/repositories/releases/org/apache/maven/maven-monitor/2.0.2/maven-monitor-2.0.2.jar
Downloading: https://oss.sonatype.org/content/repositories/releases/classworlds/classworlds/1.1/classworlds-1.1.jar
Downloading: https://oss.sonatype.org/content/repositories/releases/org/apache/maven/maven-plugin-api/2.0/maven-plugin-api-2.0.jar
Downloading: https://oss.sonatype.org/content/repositories/releases/org/apache/maven/maven-artifact/2.0/maven-artifact-2.0.jar
Downloading: https://oss.sonatype.org/content/repositories/releases/org/codehaus/plexus/plexus-utils/1.5.8/plexus-utils-1.5.8.jar
Downloading: https://repo.eclipse.org/content/repositories/cbi-releases/org/apache/maven/maven-model/2.0.2/maven-model-2.0.2.jar
Downloading: https://repo.eclipse.org/content/repositories/cbi-releases/org/apache/maven/maven-project/2.0.2/maven-project-2.0.2.jar
Downloading: https://repo.eclipse.org/content/repositories/cbi-releases/org/apache/maven/maven-profile/2.0.2/maven-profile-2.0.2.jar
Downloading: https://repo.eclipse.org/content/repositories/cbi-releases/org/apache/maven/maven-artifact-manager/2.0.2/maven-artifact-manager-2.0.2.jar
Downloading: https://repo.eclipse.org/content/repositories/cbi-releases/org/codehaus/plexus/plexus-container-default/1.0-alpha-9/plexus-container-default-1.0-alpha-9.jar
Downloading: https://repo.eclipse.org/content/repositories/cbi-releases/org/apache/maven/maven-core/2.0.2/maven-core-2.0.2.jar
Downloading: https://repo.eclipse.org/content/repositories/cbi-releases/org/apache/maven/maven-settings/2.0.2/maven-settings-2.0.2.jar
Downloading: https://repo.eclipse.org/content/repositories/cbi-releases/org/apache/maven/maven-plugin-parameter-documenter/2.0.2/maven-plugin-parameter-documenter-2.0.2.jar
Downloading: https://repo.eclipse.org/content/repositories/cbi-releases/org/apache/maven/reporting/maven-reporting-api/2.0.2/maven-reporting-api-2.0.2.jar
Downloading: https://repo.eclipse.org/content/repositories/cbi-releases/org/apache/maven/doxia/doxia-sink-api/1.0-alpha-7/doxia-sink-api-1.0-alpha-7.jar
Downloading: https://repo.eclipse.org/content/repositories/cbi-releases/org/apache/maven/maven-repository-metadata/2.0.2/maven-repository-metadata-2.0.2.jar
Downloading: https://repo.eclipse.org/content/repositories/cbi-releases/org/apache/maven/maven-error-diagnostics/2.0.2/maven-error-diagnostics-2.0.2.jar
Downloading: https://repo.eclipse.org/content/repositories/cbi-releases/org/apache/maven/maven-plugin-registry/2.0.2/maven-plugin-registry-2.0.2.jar
Downloading: https://repo.eclipse.org/content/repositories/cbi-releases/commons-cli/commons-cli/1.0/commons-cli-1.0.jar
Downloading: https://repo.eclipse.org/content/repositories/cbi-releases/org/apache/maven/maven-plugin-descriptor/2.0.2/maven-plugin-descriptor-2.0.2.jar
Downloading: https://repo.eclipse.org/content/repositories/cbi-releases/org/codehaus/plexus/plexus-interactivity-api/1.0-alpha-4/plexus-interactivity-api-1.0-alpha-4.jar
Downloading: https://repo.eclipse.org/content/repositories/cbi-releases/org/apache/maven/maven-monitor/2.0.2/maven-monitor-2.0.2.jar
Downloading: https://repo.eclipse.org/content/repositories/cbi-releases/classworlds/classworlds/1.1/classworlds-1.1.jar
Downloading: https://repo.eclipse.org/content/repositories/cbi-releases/org/apache/maven/maven-plugin-api/2.0/maven-plugin-api-2.0.jar
Downloading: https://repo.eclipse.org/content/repositories/cbi-releases/org/apache/maven/maven-artifact/2.0/maven-artifact-2.0.jar
Downloading: https://repo.eclipse.org/content/repositories/cbi-releases/org/codehaus/plexus/plexus-utils/1.5.8/plexus-utils-1.5.8.jar
Downloading: https://repo.maven.apache.org/maven2/org/apache/maven/maven-model/2.0.2/maven-model-2.0.2.jar
Downloading: https://repo.maven.apache.org/maven2/org/apache/maven/maven-project/2.0.2/maven-project-2.0.2.jar
Downloading: https://repo.maven.apache.org/maven2/org/apache/maven/maven-profile/2.0.2/maven-profile-2.0.2.jar
Downloading: https://repo.maven.apache.org/maven2/org/apache/maven/maven-artifact-manager/2.0.2/maven-artifact-manager-2.0.2.jar
Downloading: https://repo.maven.apache.org/maven2/org/codehaus/plexus/plexus-container-default/1.0-alpha-9/plexus-container-default-1.0-alpha-9.jar
Downloaded: https://repo.maven.apache.org/maven2/org/apache/maven/maven-profile/2.0.2/maven-profile-2.0.2.jar (30 KB at 351.8 KB/sec)
Downloaded: https://repo.maven.apache.org/maven2/org/apache/maven/maven-project/2.0.2/maven-project-2.0.2.jar (105 KB at 1243.6 KB/sec)
Downloading: https://repo.maven.apache.org/maven2/org/apache/maven/maven-core/2.0.2/maven-core-2.0.2.jar
Downloading: https://repo.maven.apache.org/maven2/org/apache/maven/maven-settings/2.0.2/maven-settings-2.0.2.jar
Downloaded: https://repo.maven.apache.org/maven2/org/codehaus/plexus/plexus-container-default/1.0-alpha-9/plexus-container-default-1.0-alpha-9.jar (191 KB at 2074.1 KB/sec)
Downloading: https://repo.maven.apache.org/maven2/org/apache/maven/maven-plugin-parameter-documenter/2.0.2/maven-plugin-parameter-documenter-2.0.2.jar
Downloaded: https://repo.maven.apache.org/maven2/org/apache/maven/maven-artifact-manager/2.0.2/maven-artifact-manager-2.0.2.jar (49 KB at 432.5 KB/sec)
Downloading: https://repo.maven.apache.org/maven2/org/apache/maven/reporting/maven-reporting-api/2.0.2/maven-reporting-api-2.0.2.jar
Downloaded: https://repo.maven.apache.org/maven2/org/apache/maven/maven-model/2.0.2/maven-model-2.0.2.jar (79 KB at 677.7 KB/sec)
Downloading: https://repo.maven.apache.org/maven2/org/apache/maven/doxia/doxia-sink-api/1.0-alpha-7/doxia-sink-api-1.0-alpha-7.jar
Downloaded: https://repo.maven.apache.org/maven2/org/apache/maven/maven-settings/2.0.2/maven-settings-2.0.2.jar (43 KB at 265.7 KB/sec)
Downloading: https://repo.maven.apache.org/maven2/org/apache/maven/maven-repository-metadata/2.0.2/maven-repository-metadata-2.0.2.jar
Downloaded: https://repo.maven.apache.org/maven2/org/apache/maven/maven-plugin-parameter-documenter/2.0.2/maven-plugin-parameter-documenter-2.0.2.jar (16 KB at 95.3 KB/sec)
Downloading: https://repo.maven.apache.org/maven2/org/apache/maven/maven-error-diagnostics/2.0.2/maven-error-diagnostics-2.0.2.jar
Downloaded: https://repo.maven.apache.org/maven2/org/apache/maven/maven-core/2.0.2/maven-core-2.0.2.jar (133 KB at 697.8 KB/sec)
Downloading: https://repo.maven.apache.org/maven2/org/apache/maven/maven-plugin-registry/2.0.2/maven-plugin-registry-2.0.2.jar
Downloaded: https://repo.maven.apache.org/maven2/org/apache/maven/reporting/maven-reporting-api/2.0.2/maven-reporting-api-2.0.2.jar (5 KB at 23.3 KB/sec)
Downloading: https://repo.maven.apache.org/maven2/commons-cli/commons-cli/1.0/commons-cli-1.0.jar
Downloaded: https://repo.maven.apache.org/maven2/org/apache/maven/doxia/doxia-sink-api/1.0-alpha-7/doxia-sink-api-1.0-alpha-7.jar (6 KB at 27.3 KB/sec)
Downloading: https://repo.maven.apache.org/maven2/org/apache/maven/maven-plugin-descriptor/2.0.2/maven-plugin-descriptor-2.0.2.jar
Downloaded: https://repo.maven.apache.org/maven2/org/apache/maven/maven-repository-metadata/2.0.2/maven-repository-metadata-2.0.2.jar (20 KB at 80.5 KB/sec)
Downloading: https://repo.maven.apache.org/maven2/org/codehaus/plexus/plexus-interactivity-api/1.0-alpha-4/plexus-interactivity-api-1.0-alpha-4.jar
Downloaded: https://repo.maven.apache.org/maven2/org/apache/maven/maven-error-diagnostics/2.0.2/maven-error-diagnostics-2.0.2.jar (9 KB at 34.8 KB/sec)
Downloading: https://repo.maven.apache.org/maven2/org/apache/maven/maven-monitor/2.0.2/maven-monitor-2.0.2.jar
Downloaded: https://repo.maven.apache.org/maven2/org/apache/maven/maven-plugin-registry/2.0.2/maven-plugin-registry-2.0.2.jar (24 KB at 87.0 KB/sec)
Downloading: https://repo.maven.apache.org/maven2/classworlds/classworlds/1.1/classworlds-1.1.jar
Downloaded: https://repo.maven.apache.org/maven2/org/codehaus/plexus/plexus-interactivity-api/1.0-alpha-4/plexus-interactivity-api-1.0-alpha-4.jar (14 KB at 41.8 KB/sec)
Downloading: https://repo.maven.apache.org/maven2/org/apache/maven/maven-plugin-api/2.0/maven-plugin-api-2.0.jar
Downloaded: https://repo.maven.apache.org/maven2/commons-cli/commons-cli/1.0/commons-cli-1.0.jar (30 KB at 94.0 KB/sec)
Downloading: https://repo.maven.apache.org/maven2/org/apache/maven/maven-artifact/2.0/maven-artifact-2.0.jar
Downloaded: https://repo.maven.apache.org/maven2/org/apache/maven/maven-monitor/2.0.2/maven-monitor-2.0.2.jar (6 KB at 17.9 KB/sec)
Downloading: https://repo.maven.apache.org/maven2/org/codehaus/plexus/plexus-utils/1.5.8/plexus-utils-1.5.8.jar
Downloaded: https://repo.maven.apache.org/maven2/org/apache/maven/maven-plugin-descriptor/2.0.2/maven-plugin-descriptor-2.0.2.jar (32 KB at 99.7 KB/sec)
Downloaded: https://repo.maven.apache.org/maven2/classworlds/classworlds/1.1/classworlds-1.1.jar (37 KB at 104.7 KB/sec)
Downloaded: https://repo.maven.apache.org/maven2/org/apache/maven/maven-artifact/2.0/maven-artifact-2.0.jar (77 KB at 195.2 KB/sec)
Downloaded: https://repo.maven.apache.org/maven2/org/apache/maven/maven-plugin-api/2.0/maven-plugin-api-2.0.jar (10 KB at 23.9 KB/sec)
Downloaded: https://repo.maven.apache.org/maven2/org/codehaus/plexus/plexus-utils/1.5.8/plexus-utils-1.5.8.jar (262 KB at 556.5 KB/sec)
[INFO]                                                                         
[INFO] ------------------------------------------------------------------------
[INFO] Building org.eclipse.emf.parsley.runtime.common 1.0.2-SNAPSHOT
[INFO] ------------------------------------------------------------------------
Downloading: https://repo.maven.apache.org/maven2/com/google/guava/guava/maven-metadata.xml
Downloaded: https://repo.maven.apache.org/maven2/com/google/guava/guava/maven-metadata.xml (2 KB at 17.3 KB/sec)
Downloading: https://repo.maven.apache.org/maven2/com/google/guava/guava/10.0.1/guava-10.0.1.pom
Downloaded: https://repo.maven.apache.org/maven2/com/google/guava/guava/10.0.1/guava-10.0.1.pom (6 KB at 53.7 KB/sec)
Downloading: https://repo.maven.apache.org/maven2/com/google/guava/guava-parent/10.0.1/guava-parent-10.0.1.pom
Downloaded: https://repo.maven.apache.org/maven2/com/google/guava/guava-parent/10.0.1/guava-parent-10.0.1.pom (2 KB at 19.7 KB/sec)
Downloading: https://repo.maven.apache.org/maven2/com/google/code/findbugs/jsr305/1.3.9/jsr305-1.3.9.pom
Downloaded: https://repo.maven.apache.org/maven2/com/google/code/findbugs/jsr305/1.3.9/jsr305-1.3.9.pom (965 B at 9.6 KB/sec)
Downloading: https://repo.maven.apache.org/maven2/com/google/guava/guava/11.0-rc1/guava-11.0-rc1.pom
Downloaded: https://repo.maven.apache.org/maven2/com/google/guava/guava/11.0-rc1/guava-11.0-rc1.pom (6 KB at 51.4 KB/sec)
Downloading: https://repo.maven.apache.org/maven2/com/google/guava/guava-parent/11.0-rc1/guava-parent-11.0-rc1.pom
Downloaded: https://repo.maven.apache.org/maven2/com/google/guava/guava-parent/11.0-rc1/guava-parent-11.0-rc1.pom (2 KB at 19.7 KB/sec)
Downloading: https://repo.maven.apache.org/maven2/com/google/guava/guava/11.0/guava-11.0.pom
Downloaded: https://repo.maven.apache.org/maven2/com/google/guava/guava/11.0/guava-11.0.pom (6 KB at 55.0 KB/sec)
Downloading: https://repo.maven.apache.org/maven2/com/google/guava/guava-parent/11.0/guava-parent-11.0.pom
Downloaded: https://repo.maven.apache.org/maven2/com/google/guava/guava-parent/11.0/guava-parent-11.0.pom (2 KB at 19.5 KB/sec)
Downloading: https://repo.maven.apache.org/maven2/com/google/guava/guava/11.0.1/guava-11.0.1.pom
Downloaded: https://repo.maven.apache.org/maven2/com/google/guava/guava/11.0.1/guava-11.0.1.pom (6 KB at 53.4 KB/sec)
Downloading: https://repo.maven.apache.org/maven2/com/google/guava/guava-parent/11.0.1/guava-parent-11.0.1.pom
Downloaded: https://repo.maven.apache.org/maven2/com/google/guava/guava-parent/11.0.1/guava-parent-11.0.1.pom (2 KB at 19.3 KB/sec)
Downloading: https://repo.maven.apache.org/maven2/com/google/guava/guava/11.0.2/guava-11.0.2.pom
Downloaded: https://repo.maven.apache.org/maven2/com/google/guava/guava/11.0.2/guava-11.0.2.pom (6 KB at 52.9 KB/sec)
Downloading: https://repo.maven.apache.org/maven2/com/google/guava/guava-parent/11.0.2/guava-parent-11.0.2.pom
Downloaded: https://repo.maven.apache.org/maven2/com/google/guava/guava-parent/11.0.2/guava-parent-11.0.2.pom (2 KB at 19.5 KB/sec)
Downloading: https://repo.maven.apache.org/maven2/com/google/guava/guava/12.0-rc1/guava-12.0-rc1.pom
Downloaded: https://repo.maven.apache.org/maven2/com/google/guava/guava/12.0-rc1/guava-12.0-rc1.pom (6 KB at 54.0 KB/sec)
Downloading: https://repo.maven.apache.org/maven2/com/google/guava/guava-parent/12.0-rc1/guava-parent-12.0-rc1.pom
Downloaded: https://repo.maven.apache.org/maven2/com/google/guava/guava-parent/12.0-rc1/guava-parent-12.0-rc1.pom (2 KB at 19.2 KB/sec)
Downloading: https://repo.maven.apache.org/maven2/com/google/guava/guava/12.0-rc2/guava-12.0-rc2.pom
Downloaded: https://repo.maven.apache.org/maven2/com/google/guava/guava/12.0-rc2/guava-12.0-rc2.pom (6 KB at 53.0 KB/sec)
Downloading: https://repo.maven.apache.org/maven2/com/google/guava/guava-parent/12.0-rc2/guava-parent-12.0-rc2.pom
Downloaded: https://repo.maven.apache.org/maven2/com/google/guava/guava-parent/12.0-rc2/guava-parent-12.0-rc2.pom (3 KB at 24.9 KB/sec)
Downloading: https://repo.maven.apache.org/maven2/com/google/guava/guava/12.0/guava-12.0.pom
Downloaded: https://repo.maven.apache.org/maven2/com/google/guava/guava/12.0/guava-12.0.pom (6 KB at 53.5 KB/sec)
Downloading: https://repo.maven.apache.org/maven2/com/google/guava/guava-parent/12.0/guava-parent-12.0.pom
Downloaded: https://repo.maven.apache.org/maven2/com/google/guava/guava-parent/12.0/guava-parent-12.0.pom (3 KB at 27.5 KB/sec)
Downloading: https://repo.maven.apache.org/maven2/com/google/guava/guava/12.0.1/guava-12.0.1.pom
Downloaded: https://repo.maven.apache.org/maven2/com/google/guava/guava/12.0.1/guava-12.0.1.pom (6 KB at 52.4 KB/sec)
Downloading: https://repo.maven.apache.org/maven2/com/google/guava/guava-parent/12.0.1/guava-parent-12.0.1.pom
Downloaded: https://repo.maven.apache.org/maven2/com/google/guava/guava-parent/12.0.1/guava-parent-12.0.1.pom (3 KB at 24.9 KB/sec)
Downloading: https://repo.maven.apache.org/maven2/com/google/guava/guava/13.0-rc1/guava-13.0-rc1.pom
Downloaded: https://repo.maven.apache.org/maven2/com/google/guava/guava/13.0-rc1/guava-13.0-rc1.pom (6 KB at 51.7 KB/sec)
Downloading: https://repo.maven.apache.org/maven2/com/google/guava/guava-parent/13.0-rc1/guava-parent-13.0-rc1.pom
Downloaded: https://repo.maven.apache.org/maven2/com/google/guava/guava-parent/13.0-rc1/guava-parent-13.0-rc1.pom (3 KB at 23.8 KB/sec)
Downloading: https://repo.maven.apache.org/maven2/com/google/guava/guava/13.0-rc2/guava-13.0-rc2.pom
Downloaded: https://repo.maven.apache.org/maven2/com/google/guava/guava/13.0-rc2/guava-13.0-rc2.pom (6 KB at 51.7 KB/sec)
Downloading: https://repo.maven.apache.org/maven2/com/google/guava/guava-parent/13.0-rc2/guava-parent-13.0-rc2.pom
Downloaded: https://repo.maven.apache.org/maven2/com/google/guava/guava-parent/13.0-rc2/guava-parent-13.0-rc2.pom (3 KB at 25.5 KB/sec)
Downloading: https://repo.maven.apache.org/maven2/com/google/guava/guava/13.0/guava-13.0.pom
Downloaded: https://repo.maven.apache.org/maven2/com/google/guava/guava/13.0/guava-13.0.pom (6 KB at 51.2 KB/sec)
Downloading: https://repo.maven.apache.org/maven2/com/google/guava/guava-parent/13.0/guava-parent-13.0.pom
Downloaded: https://repo.maven.apache.org/maven2/com/google/guava/guava-parent/13.0/guava-parent-13.0.pom (3 KB at 24.9 KB/sec)
Downloading: https://repo.maven.apache.org/maven2/com/google/guava/guava/13.0.1/guava-13.0.1.pom
Downloaded: https://repo.maven.apache.org/maven2/com/google/guava/guava/13.0.1/guava-13.0.1.pom (6 KB at 52.2 KB/sec)
Downloading: https://repo.maven.apache.org/maven2/com/google/guava/guava-parent/13.0.1/guava-parent-13.0.1.pom
Downloaded: https://repo.maven.apache.org/maven2/com/google/guava/guava-parent/13.0.1/guava-parent-13.0.1.pom (3 KB at 24.7 KB/sec)
Downloading: https://repo.maven.apache.org/maven2/com/google/guava/guava/14.0-rc1/guava-14.0-rc1.pom
Downloaded: https://repo.maven.apache.org/maven2/com/google/guava/guava/14.0-rc1/guava-14.0-rc1.pom (6 KB at 50.8 KB/sec)
Downloading: https://repo.maven.apache.org/maven2/com/google/guava/guava-parent/14.0-rc1/guava-parent-14.0-rc1.pom
Downloaded: https://repo.maven.apache.org/maven2/com/google/guava/guava-parent/14.0-rc1/guava-parent-14.0-rc1.pom (3 KB at 22.9 KB/sec)
Downloading: https://repo.maven.apache.org/maven2/com/google/guava/guava/14.0-rc2/guava-14.0-rc2.pom
Downloaded: https://repo.maven.apache.org/maven2/com/google/guava/guava/14.0-rc2/guava-14.0-rc2.pom (6 KB at 52.0 KB/sec)
Downloading: https://repo.maven.apache.org/maven2/com/google/guava/guava-parent/14.0-rc2/guava-parent-14.0-rc2.pom
Downloaded: https://repo.maven.apache.org/maven2/com/google/guava/guava-parent/14.0-rc2/guava-parent-14.0-rc2.pom (3 KB at 25.5 KB/sec)
Downloading: https://repo.maven.apache.org/maven2/com/google/guava/guava/14.0-rc3/guava-14.0-rc3.pom
Downloaded: https://repo.maven.apache.org/maven2/com/google/guava/guava/14.0-rc3/guava-14.0-rc3.pom (6 KB at 53.6 KB/sec)
Downloading: https://repo.maven.apache.org/maven2/com/google/guava/guava-parent/14.0-rc3/guava-parent-14.0-rc3.pom
Downloaded: https://repo.maven.apache.org/maven2/com/google/guava/guava-parent/14.0-rc3/guava-parent-14.0-rc3.pom (3 KB at 25.2 KB/sec)
Downloading: https://repo.maven.apache.org/maven2/com/google/guava/guava/14.0/guava-14.0.pom
Downloaded: https://repo.maven.apache.org/maven2/com/google/guava/guava/14.0/guava-14.0.pom (6 KB at 17.4 KB/sec)
Downloading: https://repo.maven.apache.org/maven2/com/google/guava/guava-parent/14.0/guava-parent-14.0.pom
Downloaded: https://repo.maven.apache.org/maven2/com/google/guava/guava-parent/14.0/guava-parent-14.0.pom (3 KB at 25.2 KB/sec)
Downloading: https://repo.maven.apache.org/maven2/com/google/guava/guava/14.0.1/guava-14.0.1.pom
Downloaded: https://repo.maven.apache.org/maven2/com/google/guava/guava/14.0.1/guava-14.0.1.pom (6 KB at 53.0 KB/sec)
Downloading: https://repo.maven.apache.org/maven2/com/google/guava/guava-parent/14.0.1/guava-parent-14.0.1.pom
Downloaded: https://repo.maven.apache.org/maven2/com/google/guava/guava-parent/14.0.1/guava-parent-14.0.1.pom (3 KB at 25.2 KB/sec)
Downloading: https://repo.maven.apache.org/maven2/com/google/inject/guice/3.0/guice-3.0.pom
Downloaded: https://repo.maven.apache.org/maven2/com/google/inject/guice/3.0/guice-3.0.pom (8 KB at 71.1 KB/sec)
Downloading: https://repo.maven.apache.org/maven2/com/google/inject/guice-parent/3.0/guice-parent-3.0.pom
Downloaded: https://repo.maven.apache.org/maven2/com/google/inject/guice-parent/3.0/guice-parent-3.0.pom (13 KB at 126.7 KB/sec)
Downloading: https://repo.maven.apache.org/maven2/com/google/google/5/google-5.pom
Downloaded: https://repo.maven.apache.org/maven2/com/google/google/5/google-5.pom (3 KB at 24.7 KB/sec)
Downloading: https://repo.maven.apache.org/maven2/log4j/log4j/1.2.16/log4j-1.2.16.pom
Downloaded: https://repo.maven.apache.org/maven2/log4j/log4j/1.2.16/log4j-1.2.16.pom (20 KB at 191.0 KB/sec)
Downloading: https://repo.maven.apache.org/maven2/com/google/guava/guava/14.0.1/guava-14.0.1.jar
Downloading: https://repo.maven.apache.org/maven2/com/google/inject/guice/3.0/guice-3.0.jar
Downloading: https://repo.maven.apache.org/maven2/log4j/log4j/1.2.16/log4j-1.2.16.jar
Downloaded: https://repo.maven.apache.org/maven2/log4j/log4j/1.2.16/log4j-1.2.16.jar (471 KB at 4394.9 KB/sec)
Downloaded: https://repo.maven.apache.org/maven2/com/google/inject/guice/3.0/guice-3.0.jar (694 KB at 3168.2 KB/sec)
Downloaded: https://repo.maven.apache.org/maven2/com/google/guava/guava/14.0.1/guava-14.0.1.jar (2138 KB at 4310.1 KB/sec)
[INFO] 
[INFO] --- maven-clean-plugin:2.5:clean (default-clean) @ org.eclipse.emf.parsley.runtime.common ---
[INFO] 
[INFO] --- tycho-packaging-plugin:0.25.0:build-qualifier (default-build-qualifier) @ org.eclipse.emf.parsley.runtime.common ---
[INFO] The project's OSGi version is 1.0.2.v20161118-1214
[INFO] 
[INFO] --- tycho-packaging-plugin:0.25.0:validate-id (default-validate-id) @ org.eclipse.emf.parsley.runtime.common ---
[INFO] 
[INFO] --- tycho-packaging-plugin:0.25.0:validate-version (default-validate-version) @ org.eclipse.emf.parsley.runtime.common ---
[INFO] 
[INFO] --- maven-resources-plugin:2.4.3:resources (default-resources) @ org.eclipse.emf.parsley.runtime.common ---
Downloading: https://oss.sonatype.org/content/repositories/releases/org/apache/maven/maven-project/2.0.6/maven-project-2.0.6.pom
Downloading: https://repo.eclipse.org/content/repositories/cbi-releases/org/apache/maven/maven-project/2.0.6/maven-project-2.0.6.pom
Downloading: https://repo.maven.apache.org/maven2/org/apache/maven/maven-project/2.0.6/maven-project-2.0.6.pom
Downloaded: https://repo.maven.apache.org/maven2/org/apache/maven/maven-project/2.0.6/maven-project-2.0.6.pom (3 KB at 26.5 KB/sec)
Downloading: https://oss.sonatype.org/content/repositories/releases/org/apache/maven/maven-model/2.0.6/maven-model-2.0.6.pom
Downloading: https://repo.eclipse.org/content/repositories/cbi-releases/org/apache/maven/maven-model/2.0.6/maven-model-2.0.6.pom
Downloading: https://repo.maven.apache.org/maven2/org/apache/maven/maven-model/2.0.6/maven-model-2.0.6.pom
Downloaded: https://repo.maven.apache.org/maven2/org/apache/maven/maven-model/2.0.6/maven-model-2.0.6.pom (3 KB at 30.4 KB/sec)
Downloading: https://oss.sonatype.org/content/repositories/releases/org/codehaus/plexus/plexus-utils/1.4.1/plexus-utils-1.4.1.pom
Downloading: https://repo.eclipse.org/content/repositories/cbi-releases/org/codehaus/plexus/plexus-utils/1.4.1/plexus-utils-1.4.1.pom
Downloading: https://repo.maven.apache.org/maven2/org/codehaus/plexus/plexus-utils/1.4.1/plexus-utils-1.4.1.pom
Downloaded: https://repo.maven.apache.org/maven2/org/codehaus/plexus/plexus-utils/1.4.1/plexus-utils-1.4.1.pom (2 KB at 18.6 KB/sec)
Downloading: https://oss.sonatype.org/content/repositories/releases/junit/junit/3.8.1/junit-3.8.1.pom
Downloaded: https://oss.sonatype.org/content/repositories/releases/junit/junit/3.8.1/junit-3.8.1.pom (998 B at 4.6 KB/sec)
Downloading: https://oss.sonatype.org/content/repositories/releases/org/apache/maven/maven-plugin-registry/2.0.6/maven-plugin-registry-2.0.6.pom
Downloading: https://repo.eclipse.org/content/repositories/cbi-releases/org/apache/maven/maven-plugin-registry/2.0.6/maven-plugin-registry-2.0.6.pom
Downloading: https://repo.maven.apache.org/maven2/org/apache/maven/maven-plugin-registry/2.0.6/maven-plugin-registry-2.0.6.pom
Downloaded: https://repo.maven.apache.org/maven2/org/apache/maven/maven-plugin-registry/2.0.6/maven-plugin-registry-2.0.6.pom (2 KB at 19.2 KB/sec)
Downloading: https://oss.sonatype.org/content/repositories/releases/org/codehaus/plexus/plexus-utils/2.0.5/plexus-utils-2.0.5.pom
Downloading: https://repo.eclipse.org/content/repositories/cbi-releases/org/codehaus/plexus/plexus-utils/2.0.5/plexus-utils-2.0.5.pom
Downloading: https://repo.maven.apache.org/maven2/org/codehaus/plexus/plexus-utils/2.0.5/plexus-utils-2.0.5.pom
Downloaded: https://repo.maven.apache.org/maven2/org/codehaus/plexus/plexus-utils/2.0.5/plexus-utils-2.0.5.pom (4 KB at 32.6 KB/sec)
Downloading: https://oss.sonatype.org/content/repositories/releases/org/apache/maven/shared/maven-filtering/1.0-beta-4/maven-filtering-1.0-beta-4.pom
Downloading: https://repo.eclipse.org/content/repositories/cbi-releases/org/apache/maven/shared/maven-filtering/1.0-beta-4/maven-filtering-1.0-beta-4.pom
Downloading: https://repo.maven.apache.org/maven2/org/apache/maven/shared/maven-filtering/1.0-beta-4/maven-filtering-1.0-beta-4.pom
Downloaded: https://repo.maven.apache.org/maven2/org/apache/maven/shared/maven-filtering/1.0-beta-4/maven-filtering-1.0-beta-4.pom (5 KB at 41.3 KB/sec)
Downloading: https://oss.sonatype.org/content/repositories/releases/org/apache/maven/shared/maven-shared-components/15/maven-shared-components-15.pom
Downloading: https://repo.eclipse.org/content/repositories/cbi-releases/org/apache/maven/shared/maven-shared-components/15/maven-shared-components-15.pom
Downloading: https://repo.maven.apache.org/maven2/org/apache/maven/shared/maven-shared-components/15/maven-shared-components-15.pom
Downloaded: https://repo.maven.apache.org/maven2/org/apache/maven/shared/maven-shared-components/15/maven-shared-components-15.pom (10 KB at 92.1 KB/sec)
Downloading: https://oss.sonatype.org/content/repositories/releases/org/codehaus/plexus/plexus-utils/1.5.15/plexus-utils-1.5.15.pom
Downloading: https://repo.eclipse.org/content/repositories/cbi-releases/org/codehaus/plexus/plexus-utils/1.5.15/plexus-utils-1.5.15.pom
Downloading: https://repo.maven.apache.org/maven2/org/codehaus/plexus/plexus-utils/1.5.15/plexus-utils-1.5.15.pom
Downloaded: https://repo.maven.apache.org/maven2/org/codehaus/plexus/plexus-utils/1.5.15/plexus-utils-1.5.15.pom (7 KB at 66.2 KB/sec)
Downloading: https://oss.sonatype.org/content/repositories/releases/org/codehaus/plexus/plexus-interpolation/1.12/plexus-interpolation-1.12.pom
Downloading: https://repo.eclipse.org/content/repositories/cbi-releases/org/codehaus/plexus/plexus-interpolation/1.12/plexus-interpolation-1.12.pom
Downloading: https://repo.maven.apache.org/maven2/org/codehaus/plexus/plexus-interpolation/1.12/plexus-interpolation-1.12.pom
Downloaded: https://repo.maven.apache.org/maven2/org/codehaus/plexus/plexus-interpolation/1.12/plexus-interpolation-1.12.pom (889 B at 9.0 KB/sec)
Downloading: https://oss.sonatype.org/content/repositories/releases/org/codehaus/plexus/plexus-components/1.1.14/plexus-components-1.1.14.pom
Downloading: https://repo.eclipse.org/content/repositories/cbi-releases/org/codehaus/plexus/plexus-components/1.1.14/plexus-components-1.1.14.pom
Downloading: https://repo.maven.apache.org/maven2/org/codehaus/plexus/plexus-components/1.1.14/plexus-components-1.1.14.pom
Downloaded: https://repo.maven.apache.org/maven2/org/codehaus/plexus/plexus-components/1.1.14/plexus-components-1.1.14.pom (6 KB at 58.8 KB/sec)
Downloading: https://oss.sonatype.org/content/repositories/releases/org/sonatype/plexus/plexus-build-api/0.0.4/plexus-build-api-0.0.4.pom
Downloading: https://repo.eclipse.org/content/repositories/cbi-releases/org/sonatype/plexus/plexus-build-api/0.0.4/plexus-build-api-0.0.4.pom
Downloading: https://repo.maven.apache.org/maven2/org/sonatype/plexus/plexus-build-api/0.0.4/plexus-build-api-0.0.4.pom
Downloaded: https://repo.maven.apache.org/maven2/org/sonatype/plexus/plexus-build-api/0.0.4/plexus-build-api-0.0.4.pom (3 KB at 29.1 KB/sec)
Downloading: https://oss.sonatype.org/content/repositories/releases/org/sonatype/spice/spice-parent/10/spice-parent-10.pom
Downloading: https://repo.eclipse.org/content/repositories/cbi-releases/org/sonatype/spice/spice-parent/10/spice-parent-10.pom
Downloading: https://repo.maven.apache.org/maven2/org/sonatype/spice/spice-parent/10/spice-parent-10.pom
Downloaded: https://repo.maven.apache.org/maven2/org/sonatype/spice/spice-parent/10/spice-parent-10.pom (3 KB at 29.7 KB/sec)
Downloading: https://oss.sonatype.org/content/repositories/releases/org/sonatype/forge/forge-parent/3/forge-parent-3.pom
Downloading: https://repo.eclipse.org/content/repositories/cbi-releases/org/sonatype/forge/forge-parent/3/forge-parent-3.pom
Downloading: https://repo.maven.apache.org/maven2/org/sonatype/forge/forge-parent/3/forge-parent-3.pom
Downloaded: https://repo.maven.apache.org/maven2/org/sonatype/forge/forge-parent/3/forge-parent-3.pom (5 KB at 50.7 KB/sec)
Downloading: https://oss.sonatype.org/content/repositories/releases/org/apache/maven/maven-project/2.0.6/maven-project-2.0.6.jar
Downloading: https://oss.sonatype.org/content/repositories/releases/org/apache/maven/maven-profile/2.0.6/maven-profile-2.0.6.jar
Downloading: https://oss.sonatype.org/content/repositories/releases/org/apache/maven/maven-plugin-registry/2.0.6/maven-plugin-registry-2.0.6.jar
Downloading: https://oss.sonatype.org/content/repositories/releases/org/apache/maven/maven-artifact-manager/2.0.6/maven-artifact-manager-2.0.6.jar
Downloading: https://oss.sonatype.org/content/repositories/releases/org/apache/maven/maven-core/2.0.6/maven-core-2.0.6.jar
Downloading: https://oss.sonatype.org/content/repositories/releases/org/apache/maven/maven-plugin-parameter-documenter/2.0.6/maven-plugin-parameter-documenter-2.0.6.jar
Downloading: https://oss.sonatype.org/content/repositories/releases/org/apache/maven/reporting/maven-reporting-api/2.0.6/maven-reporting-api-2.0.6.jar
Downloading: https://oss.sonatype.org/content/repositories/releases/org/apache/maven/maven-repository-metadata/2.0.6/maven-repository-metadata-2.0.6.jar
Downloading: https://oss.sonatype.org/content/repositories/releases/org/apache/maven/maven-error-diagnostics/2.0.6/maven-error-diagnostics-2.0.6.jar
Downloading: https://oss.sonatype.org/content/repositories/releases/org/apache/maven/maven-plugin-descriptor/2.0.6/maven-plugin-descriptor-2.0.6.jar
Downloading: https://oss.sonatype.org/content/repositories/releases/org/apache/maven/maven-artifact/2.0.6/maven-artifact-2.0.6.jar
Downloading: https://oss.sonatype.org/content/repositories/releases/org/apache/maven/maven-settings/2.0.6/maven-settings-2.0.6.jar
Downloading: https://oss.sonatype.org/content/repositories/releases/org/apache/maven/maven-model/2.0.6/maven-model-2.0.6.jar
Downloading: https://oss.sonatype.org/content/repositories/releases/org/apache/maven/maven-monitor/2.0.6/maven-monitor-2.0.6.jar
Downloading: https://oss.sonatype.org/content/repositories/releases/org/codehaus/plexus/plexus-container-default/1.0-alpha-9-stable-1/plexus-container-default-1.0-alpha-9-stable-1.jar
Downloading: https://oss.sonatype.org/content/repositories/releases/junit/junit/3.8.1/junit-3.8.1.jar
Downloading: https://oss.sonatype.org/content/repositories/releases/org/codehaus/plexus/plexus-utils/2.0.5/plexus-utils-2.0.5.jar
Downloading: https://oss.sonatype.org/content/repositories/releases/org/apache/maven/shared/maven-filtering/1.0-beta-4/maven-filtering-1.0-beta-4.jar
Downloading: https://oss.sonatype.org/content/repositories/releases/org/sonatype/plexus/plexus-build-api/0.0.4/plexus-build-api-0.0.4.jar
Downloaded: https://oss.sonatype.org/content/repositories/releases/junit/junit/3.8.1/junit-3.8.1.jar (119 KB at 116.1 KB/sec)
Downloading: https://repo.eclipse.org/content/repositories/cbi-releases/org/apache/maven/maven-project/2.0.6/maven-project-2.0.6.jar
Downloading: https://repo.eclipse.org/content/repositories/cbi-releases/org/apache/maven/maven-profile/2.0.6/maven-profile-2.0.6.jar
Downloading: https://repo.eclipse.org/content/repositories/cbi-releases/org/apache/maven/maven-artifact-manager/2.0.6/maven-artifact-manager-2.0.6.jar
Downloading: https://repo.eclipse.org/content/repositories/cbi-releases/org/apache/maven/maven-plugin-registry/2.0.6/maven-plugin-registry-2.0.6.jar
Downloading: https://repo.eclipse.org/content/repositories/cbi-releases/org/apache/maven/maven-core/2.0.6/maven-core-2.0.6.jar
Downloading: https://repo.eclipse.org/content/repositories/cbi-releases/org/apache/maven/maven-plugin-parameter-documenter/2.0.6/maven-plugin-parameter-documenter-2.0.6.jar
Downloading: https://repo.eclipse.org/content/repositories/cbi-releases/org/apache/maven/reporting/maven-reporting-api/2.0.6/maven-reporting-api-2.0.6.jar
Downloading: https://repo.eclipse.org/content/repositories/cbi-releases/org/apache/maven/maven-repository-metadata/2.0.6/maven-repository-metadata-2.0.6.jar
Downloading: https://repo.eclipse.org/content/repositories/cbi-releases/org/apache/maven/maven-error-diagnostics/2.0.6/maven-error-diagnostics-2.0.6.jar
Downloading: https://repo.eclipse.org/content/repositories/cbi-releases/org/apache/maven/maven-plugin-descriptor/2.0.6/maven-plugin-descriptor-2.0.6.jar
Downloading: https://repo.eclipse.org/content/repositories/cbi-releases/org/apache/maven/maven-artifact/2.0.6/maven-artifact-2.0.6.jar
Downloading: https://repo.eclipse.org/content/repositories/cbi-releases/org/apache/maven/maven-settings/2.0.6/maven-settings-2.0.6.jar
Downloading: https://repo.eclipse.org/content/repositories/cbi-releases/org/apache/maven/maven-model/2.0.6/maven-model-2.0.6.jar
Downloading: https://repo.eclipse.org/content/repositories/cbi-releases/org/apache/maven/maven-monitor/2.0.6/maven-monitor-2.0.6.jar
Downloading: https://repo.eclipse.org/content/repositories/cbi-releases/org/codehaus/plexus/plexus-container-default/1.0-alpha-9-stable-1/plexus-container-default-1.0-alpha-9-stable-1.jar
Downloading: https://repo.eclipse.org/content/repositories/cbi-releases/org/codehaus/plexus/plexus-utils/2.0.5/plexus-utils-2.0.5.jar
Downloading: https://repo.eclipse.org/content/repositories/cbi-releases/org/apache/maven/shared/maven-filtering/1.0-beta-4/maven-filtering-1.0-beta-4.jar
Downloading: https://repo.eclipse.org/content/repositories/cbi-releases/org/sonatype/plexus/plexus-build-api/0.0.4/plexus-build-api-0.0.4.jar
Downloading: https://repo.maven.apache.org/maven2/org/apache/maven/maven-project/2.0.6/maven-project-2.0.6.jar
Downloading: https://repo.maven.apache.org/maven2/org/apache/maven/maven-profile/2.0.6/maven-profile-2.0.6.jar
Downloading: https://repo.maven.apache.org/maven2/org/apache/maven/maven-artifact-manager/2.0.6/maven-artifact-manager-2.0.6.jar
Downloading: https://repo.maven.apache.org/maven2/org/apache/maven/maven-plugin-registry/2.0.6/maven-plugin-registry-2.0.6.jar
Downloading: https://repo.maven.apache.org/maven2/org/apache/maven/maven-core/2.0.6/maven-core-2.0.6.jar
Downloaded: https://repo.maven.apache.org/maven2/org/apache/maven/maven-artifact-manager/2.0.6/maven-artifact-manager-2.0.6.jar (56 KB at 689.8 KB/sec)
Downloading: https://repo.maven.apache.org/maven2/org/apache/maven/maven-plugin-parameter-documenter/2.0.6/maven-plugin-parameter-documenter-2.0.6.jar
Downloaded: https://repo.maven.apache.org/maven2/org/apache/maven/maven-plugin-registry/2.0.6/maven-plugin-registry-2.0.6.jar (29 KB at 344.4 KB/sec)
Downloading: https://repo.maven.apache.org/maven2/org/apache/maven/reporting/maven-reporting-api/2.0.6/maven-reporting-api-2.0.6.jar
Downloaded: https://repo.maven.apache.org/maven2/org/apache/maven/maven-core/2.0.6/maven-core-2.0.6.jar (149 KB at 1682.5 KB/sec)
Downloading: https://repo.maven.apache.org/maven2/org/apache/maven/maven-repository-metadata/2.0.6/maven-repository-metadata-2.0.6.jar
Downloaded: https://repo.maven.apache.org/maven2/org/apache/maven/maven-profile/2.0.6/maven-profile-2.0.6.jar (35 KB at 327.8 KB/sec)
Downloading: https://repo.maven.apache.org/maven2/org/apache/maven/maven-error-diagnostics/2.0.6/maven-error-diagnostics-2.0.6.jar
Downloaded: https://repo.maven.apache.org/maven2/org/apache/maven/maven-project/2.0.6/maven-project-2.0.6.jar (114 KB at 961.5 KB/sec)
Downloading: https://repo.maven.apache.org/maven2/org/apache/maven/maven-plugin-descriptor/2.0.6/maven-plugin-descriptor-2.0.6.jar
Downloaded: https://repo.maven.apache.org/maven2/org/apache/maven/maven-plugin-parameter-documenter/2.0.6/maven-plugin-parameter-documenter-2.0.6.jar (21 KB at 131.6 KB/sec)
Downloaded: https://repo.maven.apache.org/maven2/org/apache/maven/reporting/maven-reporting-api/2.0.6/maven-reporting-api-2.0.6.jar (10 KB at 63.0 KB/sec)
Downloading: https://repo.maven.apache.org/maven2/org/apache/maven/maven-artifact/2.0.6/maven-artifact-2.0.6.jar
Downloading: https://repo.maven.apache.org/maven2/org/apache/maven/maven-settings/2.0.6/maven-settings-2.0.6.jar
Downloaded: https://repo.maven.apache.org/maven2/org/apache/maven/maven-repository-metadata/2.0.6/maven-repository-metadata-2.0.6.jar (24 KB at 144.0 KB/sec)
Downloading: https://repo.maven.apache.org/maven2/org/apache/maven/maven-model/2.0.6/maven-model-2.0.6.jar
Downloaded: https://repo.maven.apache.org/maven2/org/apache/maven/maven-error-diagnostics/2.0.6/maven-error-diagnostics-2.0.6.jar (14 KB at 66.1 KB/sec)
Downloading: https://repo.maven.apache.org/maven2/org/apache/maven/maven-monitor/2.0.6/maven-monitor-2.0.6.jar
Downloaded: https://repo.maven.apache.org/maven2/org/apache/maven/maven-plugin-descriptor/2.0.6/maven-plugin-descriptor-2.0.6.jar (37 KB at 155.9 KB/sec)
Downloading: https://repo.maven.apache.org/maven2/org/codehaus/plexus/plexus-container-default/1.0-alpha-9-stable-1/plexus-container-default-1.0-alpha-9-stable-1.jar
Downloaded: https://repo.maven.apache.org/maven2/org/apache/maven/maven-artifact/2.0.6/maven-artifact-2.0.6.jar (86 KB at 369.3 KB/sec)
Downloading: https://repo.maven.apache.org/maven2/org/codehaus/plexus/plexus-utils/2.0.5/plexus-utils-2.0.5.jar
Downloaded: https://repo.maven.apache.org/maven2/org/apache/maven/maven-settings/2.0.6/maven-settings-2.0.6.jar (48 KB at 203.2 KB/sec)
Downloading: https://repo.maven.apache.org/maven2/org/apache/maven/shared/maven-filtering/1.0-beta-4/maven-filtering-1.0-beta-4.jar
Downloaded: https://repo.maven.apache.org/maven2/org/apache/maven/maven-model/2.0.6/maven-model-2.0.6.jar (85 KB at 332.1 KB/sec)
Downloading: https://repo.maven.apache.org/maven2/org/sonatype/plexus/plexus-build-api/0.0.4/plexus-build-api-0.0.4.jar
Downloaded: https://repo.maven.apache.org/maven2/org/apache/maven/maven-monitor/2.0.6/maven-monitor-2.0.6.jar (11 KB at 33.2 KB/sec)
Downloaded: https://repo.maven.apache.org/maven2/org/codehaus/plexus/plexus-utils/2.0.5/plexus-utils-2.0.5.jar (218 KB at 687.5 KB/sec)
Downloaded: https://repo.maven.apache.org/maven2/org/apache/maven/shared/maven-filtering/1.0-beta-4/maven-filtering-1.0-beta-4.jar (34 KB at 106.3 KB/sec)
Downloaded: https://repo.maven.apache.org/maven2/org/sonatype/plexus/plexus-build-api/0.0.4/plexus-build-api-0.0.4.jar (7 KB at 20.1 KB/sec)
Downloaded: https://repo.maven.apache.org/maven2/org/codehaus/plexus/plexus-container-default/1.0-alpha-9-stable-1/plexus-container-default-1.0-alpha-9-stable-1.jar (190 KB at 532.7 KB/sec)
[INFO] Using 'UTF-8' encoding to copy filtered resources.
[INFO] skip non existing resourceDirectory /jobs/genie.emf-parsley/emf-parsley-bugfix-release/workspace/plugins/org.eclipse.emf.parsley.runtime.common/src/main/resources
[INFO] 
[INFO] --- tycho-compiler-plugin:0.25.0:compile (default-compile) @ org.eclipse.emf.parsley.runtime.common ---
Downloading: https://oss.sonatype.org/content/repositories/releases/org/apache/maven/maven-compat/3.0/maven-compat-3.0.pom
Downloading: https://repo.eclipse.org/content/repositories/cbi-releases/org/apache/maven/maven-compat/3.0/maven-compat-3.0.pom
Downloading: https://repo.maven.apache.org/maven2/org/apache/maven/maven-compat/3.0/maven-compat-3.0.pom
Downloaded: https://repo.maven.apache.org/maven2/org/apache/maven/maven-compat/3.0/maven-compat-3.0.pom (4 KB at 39.3 KB/sec)
Downloading: https://oss.sonatype.org/content/repositories/releases/org/apache/maven/wagon/wagon-provider-api/1.0-beta-6/wagon-provider-api-1.0-beta-6.pom
Downloading: https://repo.eclipse.org/content/repositories/cbi-releases/org/apache/maven/wagon/wagon-provider-api/1.0-beta-6/wagon-provider-api-1.0-beta-6.pom
Downloading: https://repo.maven.apache.org/maven2/org/apache/maven/wagon/wagon-provider-api/1.0-beta-6/wagon-provider-api-1.0-beta-6.pom
Downloaded: https://repo.maven.apache.org/maven2/org/apache/maven/wagon/wagon-provider-api/1.0-beta-6/wagon-provider-api-1.0-beta-6.pom (2 KB at 17.7 KB/sec)
Downloading: https://oss.sonatype.org/content/repositories/releases/org/apache/maven/wagon/wagon/1.0-beta-6/wagon-1.0-beta-6.pom
Downloading: https://repo.eclipse.org/content/repositories/cbi-releases/org/apache/maven/wagon/wagon/1.0-beta-6/wagon-1.0-beta-6.pom
Downloading: https://repo.maven.apache.org/maven2/org/apache/maven/wagon/wagon/1.0-beta-6/wagon-1.0-beta-6.pom
Downloaded: https://repo.maven.apache.org/maven2/org/apache/maven/wagon/wagon/1.0-beta-6/wagon-1.0-beta-6.pom (13 KB at 122.2 KB/sec)
Downloading: https://oss.sonatype.org/content/repositories/releases/org/codehaus/plexus/plexus-compiler-manager/2.2/plexus-compiler-manager-2.2.pom
Downloading: https://repo.eclipse.org/content/repositories/cbi-releases/org/codehaus/plexus/plexus-compiler-manager/2.2/plexus-compiler-manager-2.2.pom
Downloading: https://repo.maven.apache.org/maven2/org/codehaus/plexus/plexus-compiler-manager/2.2/plexus-compiler-manager-2.2.pom
Downloaded: https://repo.maven.apache.org/maven2/org/codehaus/plexus/plexus-compiler-manager/2.2/plexus-compiler-manager-2.2.pom (690 B at 6.9 KB/sec)
Downloading: https://oss.sonatype.org/content/repositories/releases/org/codehaus/plexus/plexus-compiler/2.2/plexus-compiler-2.2.pom
Downloading: https://repo.eclipse.org/content/repositories/cbi-releases/org/codehaus/plexus/plexus-compiler/2.2/plexus-compiler-2.2.pom
Downloading: https://repo.maven.apache.org/maven2/org/codehaus/plexus/plexus-compiler/2.2/plexus-compiler-2.2.pom
Downloaded: https://repo.maven.apache.org/maven2/org/codehaus/plexus/plexus-compiler/2.2/plexus-compiler-2.2.pom (4 KB at 36.4 KB/sec)
Downloading: https://oss.sonatype.org/content/repositories/releases/org/codehaus/plexus/plexus-compiler-api/2.2/plexus-compiler-api-2.2.pom
Downloading: https://repo.eclipse.org/content/repositories/cbi-releases/org/codehaus/plexus/plexus-compiler-api/2.2/plexus-compiler-api-2.2.pom
Downloading: https://repo.maven.apache.org/maven2/org/codehaus/plexus/plexus-compiler-api/2.2/plexus-compiler-api-2.2.pom
Downloaded: https://repo.maven.apache.org/maven2/org/codehaus/plexus/plexus-compiler-api/2.2/plexus-compiler-api-2.2.pom (865 B at 8.7 KB/sec)
Downloading: https://oss.sonatype.org/content/repositories/releases/org/eclipse/tycho/tycho-compiler-jdt/0.25.0/tycho-compiler-jdt-0.25.0.pom
Downloaded: https://oss.sonatype.org/content/repositories/releases/org/eclipse/tycho/tycho-compiler-jdt/0.25.0/tycho-compiler-jdt-0.25.0.pom (2 KB at 0.7 KB/sec)
Downloading: https://oss.sonatype.org/content/repositories/releases/org/eclipse/tycho/org.eclipse.jdt.core/3.11.1.v20150902-1521/org.eclipse.jdt.core-3.11.1.v20150902-1521.pom
Downloaded: https://oss.sonatype.org/content/repositories/releases/org/eclipse/tycho/org.eclipse.jdt.core/3.11.1.v20150902-1521/org.eclipse.jdt.core-3.11.1.v20150902-1521.pom (2 KB at 8.7 KB/sec)
Downloading: https://oss.sonatype.org/content/repositories/releases/org/eclipse/tycho/org.eclipse.jdt.compiler.apt/1.2.0.v20150514-0146/org.eclipse.jdt.compiler.apt-1.2.0.v20150514-0146.pom
Downloaded: https://oss.sonatype.org/content/repositories/releases/org/eclipse/tycho/org.eclipse.jdt.compiler.apt/1.2.0.v20150514-0146/org.eclipse.jdt.compiler.apt-1.2.0.v20150514-0146.pom (2 KB at 9.3 KB/sec)
Downloading: https://oss.sonatype.org/content/repositories/releases/org/apache/maven/maven-compat/3.0/maven-compat-3.0.jar
Downloading: https://oss.sonatype.org/content/repositories/releases/org/apache/maven/wagon/wagon-provider-api/1.0-beta-6/wagon-provider-api-1.0-beta-6.jar
Downloading: https://oss.sonatype.org/content/repositories/releases/org/codehaus/plexus/plexus-compiler-manager/2.2/plexus-compiler-manager-2.2.jar
Downloading: https://oss.sonatype.org/content/repositories/releases/org/eclipse/tycho/tycho-compiler-jdt/0.25.0/tycho-compiler-jdt-0.25.0.jar
Downloading: https://oss.sonatype.org/content/repositories/releases/org/codehaus/plexus/plexus-compiler-api/2.2/plexus-compiler-api-2.2.jar
Downloading: https://oss.sonatype.org/content/repositories/releases/org/eclipse/tycho/org.eclipse.jdt.core/3.11.1.v20150902-1521/org.eclipse.jdt.core-3.11.1.v20150902-1521.jar
Downloading: https://oss.sonatype.org/content/repositories/releases/org/eclipse/tycho/org.eclipse.jdt.compiler.apt/1.2.0.v20150514-0146/org.eclipse.jdt.compiler.apt-1.2.0.v20150514-0146.jar
Downloaded: https://oss.sonatype.org/content/repositories/releases/org/eclipse/tycho/tycho-compiler-jdt/0.25.0/tycho-compiler-jdt-0.25.0.jar (16 KB at 6.1 KB/sec)
Downloaded: https://oss.sonatype.org/content/repositories/releases/org/eclipse/tycho/org.eclipse.jdt.compiler.apt/1.2.0.v20150514-0146/org.eclipse.jdt.compiler.apt-1.2.0.v20150514-0146.jar (164 KB at 56.8 KB/sec)
Downloaded: https://oss.sonatype.org/content/repositories/releases/org/eclipse/tycho/org.eclipse.jdt.core/3.11.1.v20150902-1521/org.eclipse.jdt.core-3.11.1.v20150902-1521.jar (5584 KB at 1178.8 KB/sec)
Downloading: https://repo.eclipse.org/content/repositories/cbi-releases/org/apache/maven/maven-compat/3.0/maven-compat-3.0.jar
Downloading: https://repo.eclipse.org/content/repositories/cbi-releases/org/apache/maven/wagon/wagon-provider-api/1.0-beta-6/wagon-provider-api-1.0-beta-6.jar
Downloading: https://repo.eclipse.org/content/repositories/cbi-releases/org/codehaus/plexus/plexus-compiler-manager/2.2/plexus-compiler-manager-2.2.jar
Downloading: https://repo.eclipse.org/content/repositories/cbi-releases/org/codehaus/plexus/plexus-compiler-api/2.2/plexus-compiler-api-2.2.jar
Downloading: https://repo.maven.apache.org/maven2/org/apache/maven/maven-compat/3.0/maven-compat-3.0.jar
Downloading: https://repo.maven.apache.org/maven2/org/apache/maven/wagon/wagon-provider-api/1.0-beta-6/wagon-provider-api-1.0-beta-6.jar
Downloading: https://repo.maven.apache.org/maven2/org/codehaus/plexus/plexus-compiler-manager/2.2/plexus-compiler-manager-2.2.jar
Downloading: https://repo.maven.apache.org/maven2/org/codehaus/plexus/plexus-compiler-api/2.2/plexus-compiler-api-2.2.jar
Downloaded: https://repo.maven.apache.org/maven2/org/codehaus/plexus/plexus-compiler-manager/2.2/plexus-compiler-manager-2.2.jar (5 KB at 57.8 KB/sec)
Downloaded: https://repo.maven.apache.org/maven2/org/apache/maven/wagon/wagon-provider-api/1.0-beta-6/wagon-provider-api-1.0-beta-6.jar (52 KB at 649.2 KB/sec)
Downloaded: https://repo.maven.apache.org/maven2/org/codehaus/plexus/plexus-compiler-api/2.2/plexus-compiler-api-2.2.jar (25 KB at 301.3 KB/sec)
Downloaded: https://repo.maven.apache.org/maven2/org/apache/maven/maven-compat/3.0/maven-compat-3.0.jar (279 KB at 1818.4 KB/sec)
[INFO] Compiling 23 source files to /jobs/genie.emf-parsley/emf-parsley-bugfix-release/workspace/plugins/org.eclipse.emf.parsley.runtime.common/target/classes
[INFO] 
[INFO] --- maven-resources-plugin:2.4.3:testResources (default-testResources) @ org.eclipse.emf.parsley.runtime.common ---
[INFO] Using 'UTF-8' encoding to copy filtered resources.
[INFO] skip non existing resourceDirectory /jobs/genie.emf-parsley/emf-parsley-bugfix-release/workspace/plugins/org.eclipse.emf.parsley.runtime.common/src/test/resources
[INFO] 
[INFO] --- tycho-source-plugin:0.25.0:plugin-source (plugin-source) @ org.eclipse.emf.parsley.runtime.common ---
[WARNING] bundle localization file /jobs/genie.emf-parsley/emf-parsley-bugfix-release/workspace/plugins/org.eclipse.emf.parsley.runtime.common/plugin.properties not found
[INFO] Building jar: /jobs/genie.emf-parsley/emf-parsley-bugfix-release/workspace/plugins/org.eclipse.emf.parsley.runtime.common/target/org.eclipse.emf.parsley.runtime.common-1.0.2-SNAPSHOT-sources.jar
[INFO] 
[INFO] --- target-platform-configuration:0.25.0:target-platform (default-target-platform) @ org.eclipse.emf.parsley.runtime.common ---
[INFO] 
[INFO] --- tycho-packaging-plugin:0.25.0:package-plugin (default-package-plugin) @ org.eclipse.emf.parsley.runtime.common ---
[INFO] Building jar: /jobs/genie.emf-parsley/emf-parsley-bugfix-release/workspace/plugins/org.eclipse.emf.parsley.runtime.common/target/org.eclipse.emf.parsley.runtime.common-1.0.2-SNAPSHOT.jar
[INFO] 
[INFO] --- tycho-p2-plugin:0.25.0:p2-metadata-default (default-p2-metadata-default) @ org.eclipse.emf.parsley.runtime.common ---
[INFO] 
[INFO] --- tycho-source-feature-plugin:0.25.0:source-feature (source-feature) @ org.eclipse.emf.parsley.runtime.common ---
[INFO] 
[INFO] --- tycho-pack200a-plugin:0.25.0:normalize (pack200-normalize) @ org.eclipse.emf.parsley.runtime.common ---
[INFO] Pack200 normalizing jar /jobs/genie.emf-parsley/emf-parsley-bugfix-release/workspace/plugins/org.eclipse.emf.parsley.runtime.common/target/org.eclipse.emf.parsley.runtime.common-1.0.2-SNAPSHOT.jar
[INFO] 
[INFO] --- eclipse-jarsigner-plugin:1.1.3:sign (sign) @ org.eclipse.emf.parsley.runtime.common ---
[INFO] Signing jar: /jobs/genie.emf-parsley/emf-parsley-bugfix-release/workspace/plugins/org.eclipse.emf.parsley.runtime.common/target/org.eclipse.emf.parsley.runtime.common-1.0.2-SNAPSHOT.jar
[INFO] Signing jar: /jobs/genie.emf-parsley/emf-parsley-bugfix-release/workspace/plugins/org.eclipse.emf.parsley.runtime.common/target/org.eclipse.emf.parsley.runtime.common-1.0.2-SNAPSHOT-sources.jar
[INFO] 
[INFO] --- tycho-pack200b-plugin:0.25.0:pack (pack200-pack) @ org.eclipse.emf.parsley.runtime.common ---
[INFO] Pack200 packing jar /jobs/genie.emf-parsley/emf-parsley-bugfix-release/workspace/plugins/org.eclipse.emf.parsley.runtime.common/target/org.eclipse.emf.parsley.runtime.common-1.0.2-SNAPSHOT.jar
[INFO] 
[INFO] --- tycho-p2-plugin:0.25.0:p2-metadata (attach-p2-metadata) @ org.eclipse.emf.parsley.runtime.common ---
[INFO] 
[INFO] --- tycho-p2-plugin:0.25.0:p2-metadata (p2-metadata) @ org.eclipse.emf.parsley.runtime.common ---
[INFO] 
[INFO] >>> findbugs-maven-plugin:3.0.1:check (default) > :findbugs @ org.eclipse.emf.parsley.runtime.common >>>
[INFO] 
[INFO] --- findbugs-maven-plugin:3.0.1:findbugs (findbugs) @ org.eclipse.emf.parsley.runtime.common ---
Downloading: https://oss.sonatype.org/content/repositories/releases/com/google/code/findbugs/findbugs/3.0.1/findbugs-3.0.1.pom
Downloaded: https://oss.sonatype.org/content/repositories/releases/com/google/code/findbugs/findbugs/3.0.1/findbugs-3.0.1.pom (11 KB at 101.1 KB/sec)
Downloading: https://oss.sonatype.org/content/repositories/releases/net/jcip/jcip-annotations/1.0/jcip-annotations-1.0.pom
Downloading: https://repo.eclipse.org/content/repositories/cbi-releases/net/jcip/jcip-annotations/1.0/jcip-annotations-1.0.pom
Downloading: https://repo.maven.apache.org/maven2/net/jcip/jcip-annotations/1.0/jcip-annotations-1.0.pom
Downloaded: https://repo.maven.apache.org/maven2/net/jcip/jcip-annotations/1.0/jcip-annotations-1.0.pom (491 B at 4.8 KB/sec)
Downloading: https://oss.sonatype.org/content/repositories/releases/com/google/code/findbugs/jsr305/2.0.1/jsr305-2.0.1.pom
Downloading: https://repo.eclipse.org/content/repositories/cbi-releases/com/google/code/findbugs/jsr305/2.0.1/jsr305-2.0.1.pom
Downloading: https://repo.maven.apache.org/maven2/com/google/code/findbugs/jsr305/2.0.1/jsr305-2.0.1.pom
Downloaded: https://repo.maven.apache.org/maven2/com/google/code/findbugs/jsr305/2.0.1/jsr305-2.0.1.pom (965 B at 9.8 KB/sec)
Downloading: https://oss.sonatype.org/content/repositories/releases/com/google/code/findbugs/bcel-findbugs/6.0/bcel-findbugs-6.0.pom
Downloaded: https://oss.sonatype.org/content/repositories/releases/com/google/code/findbugs/bcel-findbugs/6.0/bcel-findbugs-6.0.pom (4 KB at 37.6 KB/sec)
Downloading: https://oss.sonatype.org/content/repositories/releases/com/google/code/findbugs/jFormatString/2.0.1/jFormatString-2.0.1.pom
Downloading: https://repo.eclipse.org/content/repositories/cbi-releases/com/google/code/findbugs/jFormatString/2.0.1/jFormatString-2.0.1.pom
Downloading: https://repo.maven.apache.org/maven2/com/google/code/findbugs/jFormatString/2.0.1/jFormatString-2.0.1.pom
Downloaded: https://repo.maven.apache.org/maven2/com/google/code/findbugs/jFormatString/2.0.1/jFormatString-2.0.1.pom (950 B at 8.8 KB/sec)
Downloading: https://oss.sonatype.org/content/repositories/releases/dom4j/dom4j/1.6.1/dom4j-1.6.1.pom
Downloading: https://repo.eclipse.org/content/repositories/cbi-releases/dom4j/dom4j/1.6.1/dom4j-1.6.1.pom
Downloading: https://repo.maven.apache.org/maven2/dom4j/dom4j/1.6.1/dom4j-1.6.1.pom
Downloaded: https://repo.maven.apache.org/maven2/dom4j/dom4j/1.6.1/dom4j-1.6.1.pom (7 KB at 66.1 KB/sec)
Downloading: https://oss.sonatype.org/content/repositories/releases/xml-apis/xml-apis/1.0.b2/xml-apis-1.0.b2.pom
Downloading: https://repo.eclipse.org/content/repositories/cbi-releases/xml-apis/xml-apis/1.0.b2/xml-apis-1.0.b2.pom
Downloading: https://repo.maven.apache.org/maven2/xml-apis/xml-apis/1.0.b2/xml-apis-1.0.b2.pom
Downloaded: https://repo.maven.apache.org/maven2/xml-apis/xml-apis/1.0.b2/xml-apis-1.0.b2.pom (3 KB at 22.4 KB/sec)
Downloading: https://oss.sonatype.org/content/repositories/releases/org/ow2/asm/asm-debug-all/5.0.2/asm-debug-all-5.0.2.pom
Downloading: https://repo.eclipse.org/content/repositories/cbi-releases/org/ow2/asm/asm-debug-all/5.0.2/asm-debug-all-5.0.2.pom
Downloading: https://repo.maven.apache.org/maven2/org/ow2/asm/asm-debug-all/5.0.2/asm-debug-all-5.0.2.pom
Downloaded: https://repo.maven.apache.org/maven2/org/ow2/asm/asm-debug-all/5.0.2/asm-debug-all-5.0.2.pom (2 KB at 19.4 KB/sec)
Downloading: https://oss.sonatype.org/content/repositories/releases/org/ow2/asm/asm-parent/5.0.2/asm-parent-5.0.2.pom
Downloading: https://repo.eclipse.org/content/repositories/cbi-releases/org/ow2/asm/asm-parent/5.0.2/asm-parent-5.0.2.pom
Downloading: https://repo.maven.apache.org/maven2/org/ow2/asm/asm-parent/5.0.2/asm-parent-5.0.2.pom
Downloaded: https://repo.maven.apache.org/maven2/org/ow2/asm/asm-parent/5.0.2/asm-parent-5.0.2.pom (6 KB at 54.8 KB/sec)
Downloading: https://oss.sonatype.org/content/repositories/releases/org/ow2/asm/asm-commons/5.0.2/asm-commons-5.0.2.pom
Downloading: https://repo.eclipse.org/content/repositories/cbi-releases/org/ow2/asm/asm-commons/5.0.2/asm-commons-5.0.2.pom
Downloading: https://repo.maven.apache.org/maven2/org/ow2/asm/asm-commons/5.0.2/asm-commons-5.0.2.pom
Downloaded: https://repo.maven.apache.org/maven2/org/ow2/asm/asm-commons/5.0.2/asm-commons-5.0.2.pom (3 KB at 20.4 KB/sec)
Downloading: https://oss.sonatype.org/content/repositories/releases/org/ow2/asm/asm-tree/5.0.2/asm-tree-5.0.2.pom
Downloading: https://repo.eclipse.org/content/repositories/cbi-releases/org/ow2/asm/asm-tree/5.0.2/asm-tree-5.0.2.pom
Downloading: https://repo.maven.apache.org/maven2/org/ow2/asm/asm-tree/5.0.2/asm-tree-5.0.2.pom
Downloaded: https://repo.maven.apache.org/maven2/org/ow2/asm/asm-tree/5.0.2/asm-tree-5.0.2.pom (3 KB at 19.2 KB/sec)
Downloading: https://oss.sonatype.org/content/repositories/releases/org/ow2/asm/asm/5.0.2/asm-5.0.2.pom
Downloading: https://repo.eclipse.org/content/repositories/cbi-releases/org/ow2/asm/asm/5.0.2/asm-5.0.2.pom
Downloading: https://repo.maven.apache.org/maven2/org/ow2/asm/asm/5.0.2/asm-5.0.2.pom
Downloaded: https://repo.maven.apache.org/maven2/org/ow2/asm/asm/5.0.2/asm-5.0.2.pom (2 KB at 19.3 KB/sec)
Downloading: https://oss.sonatype.org/content/repositories/releases/commons-lang/commons-lang/2.6/commons-lang-2.6.pom
Downloading: https://repo.eclipse.org/content/repositories/cbi-releases/commons-lang/commons-lang/2.6/commons-lang-2.6.pom
Downloading: https://repo.maven.apache.org/maven2/commons-lang/commons-lang/2.6/commons-lang-2.6.pom
Downloaded: https://repo.maven.apache.org/maven2/commons-lang/commons-lang/2.6/commons-lang-2.6.pom (18 KB at 169.1 KB/sec)
Downloading: https://oss.sonatype.org/content/repositories/releases/org/apache/commons/commons-parent/17/commons-parent-17.pom
Downloading: https://repo.eclipse.org/content/repositories/cbi-releases/org/apache/commons/commons-parent/17/commons-parent-17.pom
Downloading: https://repo.maven.apache.org/maven2/org/apache/commons/commons-parent/17/commons-parent-17.pom
Downloaded: https://repo.maven.apache.org/maven2/org/apache/commons/commons-parent/17/commons-parent-17.pom (31 KB at 284.6 KB/sec)
Downloading: https://oss.sonatype.org/content/repositories/releases/com/apple/AppleJavaExtensions/1.4/AppleJavaExtensions-1.4.pom
Downloading: https://repo.eclipse.org/content/repositories/cbi-releases/com/apple/AppleJavaExtensions/1.4/AppleJavaExtensions-1.4.pom
Downloading: https://repo.maven.apache.org/maven2/com/apple/AppleJavaExtensions/1.4/AppleJavaExtensions-1.4.pom
Downloaded: https://repo.maven.apache.org/maven2/com/apple/AppleJavaExtensions/1.4/AppleJavaExtensions-1.4.pom (6 KB at 58.7 KB/sec)
Downloading: https://oss.sonatype.org/content/repositories/releases/jaxen/jaxen/1.1.6/jaxen-1.1.6.pom
Downloaded: https://oss.sonatype.org/content/repositories/releases/jaxen/jaxen/1.1.6/jaxen-1.1.6.pom (14 KB at 77.2 KB/sec)
Downloading: https://oss.sonatype.org/content/repositories/releases/org/codehaus/gmavenplus/gmavenplus-plugin/1.3/gmavenplus-plugin-1.3.pom
Downloaded: https://oss.sonatype.org/content/repositories/releases/org/codehaus/gmavenplus/gmavenplus-plugin/1.3/gmavenplus-plugin-1.3.pom (23 KB at 138.1 KB/sec)
Downloading: https://oss.sonatype.org/content/repositories/releases/org/apache/maven/maven-plugin-api/2.2.1/maven-plugin-api-2.2.1.pom
Downloading: https://repo.eclipse.org/content/repositories/cbi-releases/org/apache/maven/maven-plugin-api/2.2.1/maven-plugin-api-2.2.1.pom
Downloading: https://repo.maven.apache.org/maven2/org/apache/maven/maven-plugin-api/2.2.1/maven-plugin-api-2.2.1.pom
Downloaded: https://repo.maven.apache.org/maven2/org/apache/maven/maven-plugin-api/2.2.1/maven-plugin-api-2.2.1.pom (2 KB at 14.1 KB/sec)
Downloading: https://oss.sonatype.org/content/repositories/releases/org/apache/maven/maven/2.2.1/maven-2.2.1.pom
Downloading: https://repo.eclipse.org/content/repositories/cbi-releases/org/apache/maven/maven/2.2.1/maven-2.2.1.pom
Downloading: https://repo.maven.apache.org/maven2/org/apache/maven/maven/2.2.1/maven-2.2.1.pom
Downloaded: https://repo.maven.apache.org/maven2/org/apache/maven/maven/2.2.1/maven-2.2.1.pom (22 KB at 218.8 KB/sec)
Downloading: https://oss.sonatype.org/content/repositories/releases/org/apache/maven/maven-project/2.2.1/maven-project-2.2.1.pom
Downloading: https://repo.eclipse.org/content/repositories/cbi-releases/org/apache/maven/maven-project/2.2.1/maven-project-2.2.1.pom
Downloading: https://repo.maven.apache.org/maven2/org/apache/maven/maven-project/2.2.1/maven-project-2.2.1.pom
Downloaded: https://repo.maven.apache.org/maven2/org/apache/maven/maven-project/2.2.1/maven-project-2.2.1.pom (3 KB at 27.9 KB/sec)
Downloading: https://oss.sonatype.org/content/repositories/releases/org/apache/maven/maven-settings/2.2.1/maven-settings-2.2.1.pom
Downloading: https://repo.eclipse.org/content/repositories/cbi-releases/org/apache/maven/maven-settings/2.2.1/maven-settings-2.2.1.pom
Downloading: https://repo.maven.apache.org/maven2/org/apache/maven/maven-settings/2.2.1/maven-settings-2.2.1.pom
Downloaded: https://repo.maven.apache.org/maven2/org/apache/maven/maven-settings/2.2.1/maven-settings-2.2.1.pom (3 KB at 20.5 KB/sec)
Downloading: https://oss.sonatype.org/content/repositories/releases/org/apache/maven/maven-model/2.2.1/maven-model-2.2.1.pom
Downloading: https://repo.eclipse.org/content/repositories/cbi-releases/org/apache/maven/maven-model/2.2.1/maven-model-2.2.1.pom
Downloading: https://repo.maven.apache.org/maven2/org/apache/maven/maven-model/2.2.1/maven-model-2.2.1.pom
Downloaded: https://repo.maven.apache.org/maven2/org/apache/maven/maven-model/2.2.1/maven-model-2.2.1.pom (4 KB at 32.3 KB/sec)
Downloading: https://oss.sonatype.org/content/repositories/releases/org/codehaus/plexus/plexus-interpolation/1.11/plexus-interpolation-1.11.pom
Downloading: https://repo.eclipse.org/content/repositories/cbi-releases/org/codehaus/plexus/plexus-interpolation/1.11/plexus-interpolation-1.11.pom
Downloading: https://repo.maven.apache.org/maven2/org/codehaus/plexus/plexus-interpolation/1.11/plexus-interpolation-1.11.pom
Downloaded: https://repo.maven.apache.org/maven2/org/codehaus/plexus/plexus-interpolation/1.11/plexus-interpolation-1.11.pom (889 B at 8.8 KB/sec)
Downloading: https://oss.sonatype.org/content/repositories/releases/org/apache/maven/maven-profile/2.2.1/maven-profile-2.2.1.pom
Downloading: https://repo.eclipse.org/content/repositories/cbi-releases/org/apache/maven/maven-profile/2.2.1/maven-profile-2.2.1.pom
Downloading: https://repo.maven.apache.org/maven2/org/apache/maven/maven-profile/2.2.1/maven-profile-2.2.1.pom
Downloaded: https://repo.maven.apache.org/maven2/org/apache/maven/maven-profile/2.2.1/maven-profile-2.2.1.pom (3 KB at 21.4 KB/sec)
Downloading: https://oss.sonatype.org/content/repositories/releases/org/apache/maven/maven-artifact-manager/2.2.1/maven-artifact-manager-2.2.1.pom
Downloading: https://repo.eclipse.org/content/repositories/cbi-releases/org/apache/maven/maven-artifact-manager/2.2.1/maven-artifact-manager-2.2.1.pom
Downloading: https://repo.maven.apache.org/maven2/org/apache/maven/maven-artifact-manager/2.2.1/maven-artifact-manager-2.2.1.pom
Downloaded: https://repo.maven.apache.org/maven2/org/apache/maven/maven-artifact-manager/2.2.1/maven-artifact-manager-2.2.1.pom (4 KB at 30.6 KB/sec)
Downloading: https://oss.sonatype.org/content/repositories/releases/org/apache/maven/maven-repository-metadata/2.2.1/maven-repository-metadata-2.2.1.pom
Downloading: https://repo.eclipse.org/content/repositories/cbi-releases/org/apache/maven/maven-repository-metadata/2.2.1/maven-repository-metadata-2.2.1.pom
Downloading: https://repo.maven.apache.org/maven2/org/apache/maven/maven-repository-metadata/2.2.1/maven-repository-metadata-2.2.1.pom
Downloaded: https://repo.maven.apache.org/maven2/org/apache/maven/maven-repository-metadata/2.2.1/maven-repository-metadata-2.2.1.pom (2 KB at 18.6 KB/sec)
Downloading: https://oss.sonatype.org/content/repositories/releases/org/apache/maven/maven-artifact/2.2.1/maven-artifact-2.2.1.pom
Downloading: https://repo.eclipse.org/content/repositories/cbi-releases/org/apache/maven/maven-artifact/2.2.1/maven-artifact-2.2.1.pom
Downloading: https://repo.maven.apache.org/maven2/org/apache/maven/maven-artifact/2.2.1/maven-artifact-2.2.1.pom
Downloaded: https://repo.maven.apache.org/maven2/org/apache/maven/maven-artifact/2.2.1/maven-artifact-2.2.1.pom (2 KB at 15.8 KB/sec)
Downloading: https://oss.sonatype.org/content/repositories/releases/backport-util-concurrent/backport-util-concurrent/3.1/backport-util-concurrent-3.1.pom
Downloading: https://repo.eclipse.org/content/repositories/cbi-releases/backport-util-concurrent/backport-util-concurrent/3.1/backport-util-concurrent-3.1.pom
Downloading: https://repo.maven.apache.org/maven2/backport-util-concurrent/backport-util-concurrent/3.1/backport-util-concurrent-3.1.pom
Downloaded: https://repo.maven.apache.org/maven2/backport-util-concurrent/backport-util-concurrent/3.1/backport-util-concurrent-3.1.pom (880 B at 8.8 KB/sec)
Downloading: https://oss.sonatype.org/content/repositories/releases/org/apache/maven/maven-plugin-registry/2.2.1/maven-plugin-registry-2.2.1.pom
Downloading: https://repo.eclipse.org/content/repositories/cbi-releases/org/apache/maven/maven-plugin-registry/2.2.1/maven-plugin-registry-2.2.1.pom
Downloading: https://repo.maven.apache.org/maven2/org/apache/maven/maven-plugin-registry/2.2.1/maven-plugin-registry-2.2.1.pom
Downloaded: https://repo.maven.apache.org/maven2/org/apache/maven/maven-plugin-registry/2.2.1/maven-plugin-registry-2.2.1.pom (2 KB at 19.2 KB/sec)
Downloading: https://oss.sonatype.org/content/repositories/releases/org/apache/maven/maven-core/2.2.1/maven-core-2.2.1.pom
Downloading: https://repo.eclipse.org/content/repositories/cbi-releases/org/apache/maven/maven-core/2.2.1/maven-core-2.2.1.pom
Downloading: https://repo.maven.apache.org/maven2/org/apache/maven/maven-core/2.2.1/maven-core-2.2.1.pom
Downloaded: https://repo.maven.apache.org/maven2/org/apache/maven/maven-core/2.2.1/maven-core-2.2.1.pom (12 KB at 117.1 KB/sec)
Downloading: https://oss.sonatype.org/content/repositories/releases/org/apache/maven/maven-plugin-parameter-documenter/2.2.1/maven-plugin-parameter-documenter-2.2.1.pom
Downloading: https://repo.eclipse.org/content/repositories/cbi-releases/org/apache/maven/maven-plugin-parameter-documenter/2.2.1/maven-plugin-parameter-documenter-2.2.1.pom
Downloading: https://repo.maven.apache.org/maven2/org/apache/maven/maven-plugin-parameter-documenter/2.2.1/maven-plugin-parameter-documenter-2.2.1.pom
Downloaded: https://repo.maven.apache.org/maven2/org/apache/maven/maven-plugin-parameter-documenter/2.2.1/maven-plugin-parameter-documenter-2.2.1.pom (2 KB at 19.1 KB/sec)
Downloading: https://oss.sonatype.org/content/repositories/releases/org/slf4j/slf4j-jdk14/1.5.6/slf4j-jdk14-1.5.6.pom
Downloaded: https://oss.sonatype.org/content/repositories/releases/org/slf4j/slf4j-jdk14/1.5.6/slf4j-jdk14-1.5.6.pom (2 KB at 8.3 KB/sec)
Downloading: https://oss.sonatype.org/content/repositories/releases/org/slf4j/slf4j-parent/1.5.6/slf4j-parent-1.5.6.pom
Downloaded: https://oss.sonatype.org/content/repositories/releases/org/slf4j/slf4j-parent/1.5.6/slf4j-parent-1.5.6.pom (8 KB at 69.1 KB/sec)
Downloading: https://oss.sonatype.org/content/repositories/releases/org/slf4j/slf4j-api/1.5.6/slf4j-api-1.5.6.pom
Downloaded: https://oss.sonatype.org/content/repositories/releases/org/slf4j/slf4j-api/1.5.6/slf4j-api-1.5.6.pom (3 KB at 24.7 KB/sec)
Downloading: https://oss.sonatype.org/content/repositories/releases/org/slf4j/jcl-over-slf4j/1.5.6/jcl-over-slf4j-1.5.6.pom
Downloaded: https://oss.sonatype.org/content/repositories/releases/org/slf4j/jcl-over-slf4j/1.5.6/jcl-over-slf4j-1.5.6.pom (3 KB at 19.3 KB/sec)
Downloading: https://oss.sonatype.org/content/repositories/releases/org/apache/maven/reporting/maven-reporting-api/2.2.1/maven-reporting-api-2.2.1.pom
Downloading: https://repo.eclipse.org/content/repositories/cbi-releases/org/apache/maven/reporting/maven-reporting-api/2.2.1/maven-reporting-api-2.2.1.pom
Downloading: https://repo.maven.apache.org/maven2/org/apache/maven/reporting/maven-reporting-api/2.2.1/maven-reporting-api-2.2.1.pom
Downloaded: https://repo.maven.apache.org/maven2/org/apache/maven/reporting/maven-reporting-api/2.2.1/maven-reporting-api-2.2.1.pom (2 KB at 18.5 KB/sec)
Downloading: https://oss.sonatype.org/content/repositories/releases/org/apache/maven/reporting/maven-reporting/2.2.1/maven-reporting-2.2.1.pom
Downloading: https://repo.eclipse.org/content/repositories/cbi-releases/org/apache/maven/reporting/maven-reporting/2.2.1/maven-reporting-2.2.1.pom
Downloading: https://repo.maven.apache.org/maven2/org/apache/maven/reporting/maven-reporting/2.2.1/maven-reporting-2.2.1.pom
Downloaded: https://repo.maven.apache.org/maven2/org/apache/maven/reporting/maven-reporting/2.2.1/maven-reporting-2.2.1.pom (2 KB at 13.3 KB/sec)
Downloading: https://oss.sonatype.org/content/repositories/releases/org/apache/maven/doxia/doxia-sink-api/1.1/doxia-sink-api-1.1.pom
Downloading: https://repo.eclipse.org/content/repositories/cbi-releases/org/apache/maven/doxia/doxia-sink-api/1.1/doxia-sink-api-1.1.pom
Downloading: https://repo.maven.apache.org/maven2/org/apache/maven/doxia/doxia-sink-api/1.1/doxia-sink-api-1.1.pom
Downloaded: https://repo.maven.apache.org/maven2/org/apache/maven/doxia/doxia-sink-api/1.1/doxia-sink-api-1.1.pom (2 KB at 19.9 KB/sec)
Downloading: https://oss.sonatype.org/content/repositories/releases/org/apache/maven/doxia/doxia/1.1/doxia-1.1.pom
Downloading: https://repo.eclipse.org/content/repositories/cbi-releases/org/apache/maven/doxia/doxia/1.1/doxia-1.1.pom
Downloading: https://repo.maven.apache.org/maven2/org/apache/maven/doxia/doxia/1.1/doxia-1.1.pom
Downloaded: https://repo.maven.apache.org/maven2/org/apache/maven/doxia/doxia/1.1/doxia-1.1.pom (15 KB at 148.2 KB/sec)
Downloading: https://oss.sonatype.org/content/repositories/releases/org/apache/maven/doxia/doxia-logging-api/1.1/doxia-logging-api-1.1.pom
Downloading: https://repo.eclipse.org/content/repositories/cbi-releases/org/apache/maven/doxia/doxia-logging-api/1.1/doxia-logging-api-1.1.pom
Downloading: https://repo.maven.apache.org/maven2/org/apache/maven/doxia/doxia-logging-api/1.1/doxia-logging-api-1.1.pom
Downloaded: https://repo.maven.apache.org/maven2/org/apache/maven/doxia/doxia-logging-api/1.1/doxia-logging-api-1.1.pom (2 KB at 15.7 KB/sec)
Downloading: https://oss.sonatype.org/content/repositories/releases/org/codehaus/plexus/plexus-container-default/1.0-alpha-30/plexus-container-default-1.0-alpha-30.pom
Downloading: https://repo.eclipse.org/content/repositories/cbi-releases/org/codehaus/plexus/plexus-container-default/1.0-alpha-30/plexus-container-default-1.0-alpha-30.pom
Downloading: https://repo.maven.apache.org/maven2/org/codehaus/plexus/plexus-container-default/1.0-alpha-30/plexus-container-default-1.0-alpha-30.pom
Downloaded: https://repo.maven.apache.org/maven2/org/codehaus/plexus/plexus-container-default/1.0-alpha-30/plexus-container-default-1.0-alpha-30.pom (4 KB at 34.6 KB/sec)
Downloading: https://oss.sonatype.org/content/repositories/releases/org/codehaus/plexus/plexus-containers/1.0-alpha-30/plexus-containers-1.0-alpha-30.pom
Downloading: https://repo.eclipse.org/content/repositories/cbi-releases/org/codehaus/plexus/plexus-containers/1.0-alpha-30/plexus-containers-1.0-alpha-30.pom
Downloading: https://repo.maven.apache.org/maven2/org/codehaus/plexus/plexus-containers/1.0-alpha-30/plexus-containers-1.0-alpha-30.pom
Downloaded: https://repo.maven.apache.org/maven2/org/codehaus/plexus/plexus-containers/1.0-alpha-30/plexus-containers-1.0-alpha-30.pom (2 KB at 18.7 KB/sec)
Downloading: https://oss.sonatype.org/content/repositories/releases/org/codehaus/plexus/plexus-utils/1.4.5/plexus-utils-1.4.5.pom
Downloading: https://repo.eclipse.org/content/repositories/cbi-releases/org/codehaus/plexus/plexus-utils/1.4.5/plexus-utils-1.4.5.pom
Downloading: https://repo.maven.apache.org/maven2/org/codehaus/plexus/plexus-utils/1.4.5/plexus-utils-1.4.5.pom
Downloaded: https://repo.maven.apache.org/maven2/org/codehaus/plexus/plexus-utils/1.4.5/plexus-utils-1.4.5.pom (3 KB at 22.6 KB/sec)
Downloading: https://oss.sonatype.org/content/repositories/releases/org/codehaus/plexus/plexus-classworlds/1.2-alpha-9/plexus-classworlds-1.2-alpha-9.pom
Downloading: https://repo.eclipse.org/content/repositories/cbi-releases/org/codehaus/plexus/plexus-classworlds/1.2-alpha-9/plexus-classworlds-1.2-alpha-9.pom
Downloading: https://repo.maven.apache.org/maven2/org/codehaus/plexus/plexus-classworlds/1.2-alpha-9/plexus-classworlds-1.2-alpha-9.pom
Downloaded: https://repo.maven.apache.org/maven2/org/codehaus/plexus/plexus-classworlds/1.2-alpha-9/plexus-classworlds-1.2-alpha-9.pom (4 KB at 31.8 KB/sec)
Downloading: https://oss.sonatype.org/content/repositories/releases/org/codehaus/plexus/plexus/1.0.10/plexus-1.0.10.pom
Downloading: https://repo.eclipse.org/content/repositories/cbi-releases/org/codehaus/plexus/plexus/1.0.10/plexus-1.0.10.pom
Downloading: https://repo.maven.apache.org/maven2/org/codehaus/plexus/plexus/1.0.10/plexus-1.0.10.pom
Downloaded: https://repo.maven.apache.org/maven2/org/codehaus/plexus/plexus/1.0.10/plexus-1.0.10.pom (9 KB at 80.6 KB/sec)
Downloading: https://oss.sonatype.org/content/repositories/releases/org/apache/maven/maven-error-diagnostics/2.2.1/maven-error-diagnostics-2.2.1.pom
Downloading: https://repo.eclipse.org/content/repositories/cbi-releases/org/apache/maven/maven-error-diagnostics/2.2.1/maven-error-diagnostics-2.2.1.pom
Downloading: https://repo.maven.apache.org/maven2/org/apache/maven/maven-error-diagnostics/2.2.1/maven-error-diagnostics-2.2.1.pom
Downloaded: https://repo.maven.apache.org/maven2/org/apache/maven/maven-error-diagnostics/2.2.1/maven-error-diagnostics-2.2.1.pom (2 KB at 17.0 KB/sec)
Downloading: https://oss.sonatype.org/content/repositories/releases/commons-cli/commons-cli/1.2/commons-cli-1.2.pom
Downloading: https://repo.eclipse.org/content/repositories/cbi-releases/commons-cli/commons-cli/1.2/commons-cli-1.2.pom
Downloading: https://repo.maven.apache.org/maven2/commons-cli/commons-cli/1.2/commons-cli-1.2.pom
Downloaded: https://repo.maven.apache.org/maven2/commons-cli/commons-cli/1.2/commons-cli-1.2.pom (8 KB at 76.4 KB/sec)
Downloading: https://oss.sonatype.org/content/repositories/releases/org/apache/commons/commons-parent/11/commons-parent-11.pom
Downloading: https://repo.eclipse.org/content/repositories/cbi-releases/org/apache/commons/commons-parent/11/commons-parent-11.pom
Downloading: https://repo.maven.apache.org/maven2/org/apache/commons/commons-parent/11/commons-parent-11.pom
Downloaded: https://repo.maven.apache.org/maven2/org/apache/commons/commons-parent/11/commons-parent-11.pom (25 KB at 236.0 KB/sec)
Downloading: https://oss.sonatype.org/content/repositories/releases/org/apache/maven/maven-plugin-descriptor/2.2.1/maven-plugin-descriptor-2.2.1.pom
Downloading: https://repo.eclipse.org/content/repositories/cbi-releases/org/apache/maven/maven-plugin-descriptor/2.2.1/maven-plugin-descriptor-2.2.1.pom
Downloading: https://repo.maven.apache.org/maven2/org/apache/maven/maven-plugin-descriptor/2.2.1/maven-plugin-descriptor-2.2.1.pom
Downloaded: https://repo.maven.apache.org/maven2/org/apache/maven/maven-plugin-descriptor/2.2.1/maven-plugin-descriptor-2.2.1.pom (3 KB at 20.2 KB/sec)
Downloading: https://oss.sonatype.org/content/repositories/releases/org/apache/maven/maven-monitor/2.2.1/maven-monitor-2.2.1.pom
Downloading: https://repo.eclipse.org/content/repositories/cbi-releases/org/apache/maven/maven-monitor/2.2.1/maven-monitor-2.2.1.pom
Downloading: https://repo.maven.apache.org/maven2/org/apache/maven/maven-monitor/2.2.1/maven-monitor-2.2.1.pom
Downloaded: https://repo.maven.apache.org/maven2/org/apache/maven/maven-monitor/2.2.1/maven-monitor-2.2.1.pom (2 KB at 12.5 KB/sec)
Downloading: https://oss.sonatype.org/content/repositories/releases/org/apache/maven/shared/file-management/1.2.1/file-management-1.2.1.pom
Downloading: https://repo.eclipse.org/content/repositories/cbi-releases/org/apache/maven/shared/file-management/1.2.1/file-management-1.2.1.pom
Downloading: https://repo.maven.apache.org/maven2/org/apache/maven/shared/file-management/1.2.1/file-management-1.2.1.pom
Downloaded: https://repo.maven.apache.org/maven2/org/apache/maven/shared/file-management/1.2.1/file-management-1.2.1.pom (4 KB at 38.7 KB/sec)
Downloading: https://oss.sonatype.org/content/repositories/releases/org/apache/maven/shared/maven-shared-components/10/maven-shared-components-10.pom
Downloading: https://repo.eclipse.org/content/repositories/cbi-releases/org/apache/maven/shared/maven-shared-components/10/maven-shared-components-10.pom
Downloading: https://repo.maven.apache.org/maven2/org/apache/maven/shared/maven-shared-components/10/maven-shared-components-10.pom
Downloaded: https://repo.maven.apache.org/maven2/org/apache/maven/shared/maven-shared-components/10/maven-shared-components-10.pom (9 KB at 83.2 KB/sec)
Downloading: https://oss.sonatype.org/content/repositories/releases/org/apache/maven/maven-parent/9/maven-parent-9.pom
Downloading: https://repo.eclipse.org/content/repositories/cbi-releases/org/apache/maven/maven-parent/9/maven-parent-9.pom
Downloading: https://repo.maven.apache.org/maven2/org/apache/maven/maven-parent/9/maven-parent-9.pom
Downloaded: https://repo.maven.apache.org/maven2/org/apache/maven/maven-parent/9/maven-parent-9.pom (33 KB at 288.9 KB/sec)
Downloading: https://oss.sonatype.org/content/repositories/releases/org/apache/maven/shared/maven-shared-io/1.1/maven-shared-io-1.1.pom
Downloading: https://repo.eclipse.org/content/repositories/cbi-releases/org/apache/maven/shared/maven-shared-io/1.1/maven-shared-io-1.1.pom
Downloading: https://repo.maven.apache.org/maven2/org/apache/maven/shared/maven-shared-io/1.1/maven-shared-io-1.1.pom
Downloaded: https://repo.maven.apache.org/maven2/org/apache/maven/shared/maven-shared-io/1.1/maven-shared-io-1.1.pom (4 KB at 40.0 KB/sec)
Downloading: https://oss.sonatype.org/content/repositories/releases/org/apache/maven/shared/maven-shared-components/8/maven-shared-components-8.pom
Downloading: https://repo.eclipse.org/content/repositories/cbi-releases/org/apache/maven/shared/maven-shared-components/8/maven-shared-components-8.pom
Downloading: https://repo.maven.apache.org/maven2/org/apache/maven/shared/maven-shared-components/8/maven-shared-components-8.pom
Downloaded: https://repo.maven.apache.org/maven2/org/apache/maven/shared/maven-shared-components/8/maven-shared-components-8.pom (3 KB at 26.9 KB/sec)
Downloading: https://oss.sonatype.org/content/repositories/releases/org/apache/maven/maven-parent/7/maven-parent-7.pom
Downloading: https://repo.eclipse.org/content/repositories/cbi-releases/org/apache/maven/maven-parent/7/maven-parent-7.pom
Downloading: https://repo.maven.apache.org/maven2/org/apache/maven/maven-parent/7/maven-parent-7.pom
Downloaded: https://repo.maven.apache.org/maven2/org/apache/maven/maven-parent/7/maven-parent-7.pom (21 KB at 201.4 KB/sec)
Downloading: https://oss.sonatype.org/content/repositories/releases/org/apache/maven/wagon/wagon-provider-api/1.0-alpha-6/wagon-provider-api-1.0-alpha-6.pom
Downloading: https://repo.eclipse.org/content/repositories/cbi-releases/org/apache/maven/wagon/wagon-provider-api/1.0-alpha-6/wagon-provider-api-1.0-alpha-6.pom
Downloading: https://repo.maven.apache.org/maven2/org/apache/maven/wagon/wagon-provider-api/1.0-alpha-6/wagon-provider-api-1.0-alpha-6.pom
Downloaded: https://repo.maven.apache.org/maven2/org/apache/maven/wagon/wagon-provider-api/1.0-alpha-6/wagon-provider-api-1.0-alpha-6.pom (588 B at 5.9 KB/sec)
Downloading: https://oss.sonatype.org/content/repositories/releases/org/apache/maven/wagon/wagon/1.0-alpha-6/wagon-1.0-alpha-6.pom
Downloading: https://repo.eclipse.org/content/repositories/cbi-releases/org/apache/maven/wagon/wagon/1.0-alpha-6/wagon-1.0-alpha-6.pom
Downloading: https://repo.maven.apache.org/maven2/org/apache/maven/wagon/wagon/1.0-alpha-6/wagon-1.0-alpha-6.pom
Downloaded: https://repo.maven.apache.org/maven2/org/apache/maven/wagon/wagon/1.0-alpha-6/wagon-1.0-alpha-6.pom (7 KB at 63.2 KB/sec)
Downloading: https://oss.sonatype.org/content/repositories/releases/org/codehaus/plexus/plexus-utils/1.4.6/plexus-utils-1.4.6.pom
Downloading: https://repo.eclipse.org/content/repositories/cbi-releases/org/codehaus/plexus/plexus-utils/1.4.6/plexus-utils-1.4.6.pom
Downloading: https://repo.maven.apache.org/maven2/org/codehaus/plexus/plexus-utils/1.4.6/plexus-utils-1.4.6.pom
Downloaded: https://repo.maven.apache.org/maven2/org/codehaus/plexus/plexus-utils/1.4.6/plexus-utils-1.4.6.pom (3 KB at 22.3 KB/sec)
Downloading: https://oss.sonatype.org/content/repositories/releases/org/codehaus/plexus/plexus-utils/1.5.6/plexus-utils-1.5.6.pom
Downloading: https://repo.eclipse.org/content/repositories/cbi-releases/org/codehaus/plexus/plexus-utils/1.5.6/plexus-utils-1.5.6.pom
Downloading: https://repo.maven.apache.org/maven2/org/codehaus/plexus/plexus-utils/1.5.6/plexus-utils-1.5.6.pom
Downloaded: https://repo.maven.apache.org/maven2/org/codehaus/plexus/plexus-utils/1.5.6/plexus-utils-1.5.6.pom (6 KB at 53.4 KB/sec)
Downloading: https://oss.sonatype.org/content/repositories/releases/org/codehaus/plexus/plexus/1.0.12/plexus-1.0.12.pom
Downloading: https://repo.eclipse.org/content/repositories/cbi-releases/org/codehaus/plexus/plexus/1.0.12/plexus-1.0.12.pom
Downloading: https://repo.maven.apache.org/maven2/org/codehaus/plexus/plexus/1.0.12/plexus-1.0.12.pom
Downloaded: https://repo.maven.apache.org/maven2/org/codehaus/plexus/plexus/1.0.12/plexus-1.0.12.pom (10 KB at 94.8 KB/sec)
Downloading: https://oss.sonatype.org/content/repositories/releases/org/codehaus/plexus/plexus-container-default/1.6/plexus-container-default-1.6.pom
Downloading: https://repo.eclipse.org/content/repositories/cbi-releases/org/codehaus/plexus/plexus-container-default/1.6/plexus-container-default-1.6.pom
Downloading: https://repo.maven.apache.org/maven2/org/codehaus/plexus/plexus-container-default/1.6/plexus-container-default-1.6.pom
Downloaded: https://repo.maven.apache.org/maven2/org/codehaus/plexus/plexus-container-default/1.6/plexus-container-default-1.6.pom (3 KB at 26.6 KB/sec)
Downloading: https://oss.sonatype.org/content/repositories/releases/org/codehaus/plexus/plexus-containers/1.6/plexus-containers-1.6.pom
Downloading: https://repo.eclipse.org/content/repositories/cbi-releases/org/codehaus/plexus/plexus-containers/1.6/plexus-containers-1.6.pom
Downloading: https://repo.maven.apache.org/maven2/org/codehaus/plexus/plexus-containers/1.6/plexus-containers-1.6.pom
Downloaded: https://repo.maven.apache.org/maven2/org/codehaus/plexus/plexus-containers/1.6/plexus-containers-1.6.pom (4 KB at 36.4 KB/sec)
Downloading: https://oss.sonatype.org/content/repositories/releases/org/codehaus/plexus/plexus/3.3.2/plexus-3.3.2.pom
Downloading: https://repo.eclipse.org/content/repositories/cbi-releases/org/codehaus/plexus/plexus/3.3.2/plexus-3.3.2.pom
Downloading: https://repo.maven.apache.org/maven2/org/codehaus/plexus/plexus/3.3.2/plexus-3.3.2.pom
Downloaded: https://repo.maven.apache.org/maven2/org/codehaus/plexus/plexus/3.3.2/plexus-3.3.2.pom (22 KB at 206.1 KB/sec)
Downloading: https://oss.sonatype.org/content/repositories/releases/org/codehaus/plexus/plexus-utils/3.0.20/plexus-utils-3.0.20.pom
Downloading: https://repo.eclipse.org/content/repositories/cbi-releases/org/codehaus/plexus/plexus-utils/3.0.20/plexus-utils-3.0.20.pom
Downloading: https://repo.maven.apache.org/maven2/org/codehaus/plexus/plexus-utils/3.0.20/plexus-utils-3.0.20.pom
Downloaded: https://repo.maven.apache.org/maven2/org/codehaus/plexus/plexus-utils/3.0.20/plexus-utils-3.0.20.pom (4 KB at 38.0 KB/sec)
Downloading: https://oss.sonatype.org/content/repositories/releases/org/apache/xbean/xbean-reflect/3.7/xbean-reflect-3.7.pom
Downloading: https://repo.eclipse.org/content/repositories/cbi-releases/org/apache/xbean/xbean-reflect/3.7/xbean-reflect-3.7.pom
Downloading: https://repo.maven.apache.org/maven2/org/apache/xbean/xbean-reflect/3.7/xbean-reflect-3.7.pom
Downloaded: https://repo.maven.apache.org/maven2/org/apache/xbean/xbean-reflect/3.7/xbean-reflect-3.7.pom (5 KB at 49.2 KB/sec)
Downloading: https://oss.sonatype.org/content/repositories/releases/org/apache/xbean/xbean/3.7/xbean-3.7.pom
Downloading: https://repo.eclipse.org/content/repositories/cbi-releases/org/apache/xbean/xbean/3.7/xbean-3.7.pom
Downloading: https://repo.maven.apache.org/maven2/org/apache/xbean/xbean/3.7/xbean-3.7.pom
Downloaded: https://repo.maven.apache.org/maven2/org/apache/xbean/xbean/3.7/xbean-3.7.pom (16 KB at 152.3 KB/sec)
Downloading: https://oss.sonatype.org/content/repositories/releases/org/apache/geronimo/genesis/genesis-java5-flava/2.0/genesis-java5-flava-2.0.pom
Downloading: https://repo.eclipse.org/content/repositories/cbi-releases/org/apache/geronimo/genesis/genesis-java5-flava/2.0/genesis-java5-flava-2.0.pom
Downloading: https://repo.maven.apache.org/maven2/org/apache/geronimo/genesis/genesis-java5-flava/2.0/genesis-java5-flava-2.0.pom
Downloaded: https://repo.maven.apache.org/maven2/org/apache/geronimo/genesis/genesis-java5-flava/2.0/genesis-java5-flava-2.0.pom (6 KB at 54.1 KB/sec)
Downloading: https://oss.sonatype.org/content/repositories/releases/org/apache/geronimo/genesis/genesis-default-flava/2.0/genesis-default-flava-2.0.pom
Downloading: https://repo.eclipse.org/content/repositories/cbi-releases/org/apache/geronimo/genesis/genesis-default-flava/2.0/genesis-default-flava-2.0.pom
Downloading: https://repo.maven.apache.org/maven2/org/apache/geronimo/genesis/genesis-default-flava/2.0/genesis-default-flava-2.0.pom
Downloaded: https://repo.maven.apache.org/maven2/org/apache/geronimo/genesis/genesis-default-flava/2.0/genesis-default-flava-2.0.pom (18 KB at 162.5 KB/sec)
Downloading: https://oss.sonatype.org/content/repositories/releases/org/apache/geronimo/genesis/genesis/2.0/genesis-2.0.pom
Downloading: https://repo.eclipse.org/content/repositories/cbi-releases/org/apache/geronimo/genesis/genesis/2.0/genesis-2.0.pom
Downloading: https://repo.maven.apache.org/maven2/org/apache/geronimo/genesis/genesis/2.0/genesis-2.0.pom
Downloaded: https://repo.maven.apache.org/maven2/org/apache/geronimo/genesis/genesis/2.0/genesis-2.0.pom (18 KB at 176.3 KB/sec)
Downloading: https://oss.sonatype.org/content/repositories/releases/org/codehaus/plexus/plexus-classworlds/2.5.2/plexus-classworlds-2.5.2.pom
Downloading: https://repo.eclipse.org/content/repositories/cbi-releases/org/codehaus/plexus/plexus-classworlds/2.5.2/plexus-classworlds-2.5.2.pom
Downloading: https://repo.maven.apache.org/maven2/org/codehaus/plexus/plexus-classworlds/2.5.2/plexus-classworlds-2.5.2.pom
Downloaded: https://repo.maven.apache.org/maven2/org/codehaus/plexus/plexus-classworlds/2.5.2/plexus-classworlds-2.5.2.pom (8 KB at 71.3 KB/sec)
Downloading: https://oss.sonatype.org/content/repositories/releases/org/fusesource/jansi/jansi/1.11/jansi-1.11.pom
Downloading: https://repo.eclipse.org/content/repositories/cbi-releases/org/fusesource/jansi/jansi/1.11/jansi-1.11.pom
Downloading: https://repo.maven.apache.org/maven2/org/fusesource/jansi/jansi/1.11/jansi-1.11.pom
Downloaded: https://repo.maven.apache.org/maven2/org/fusesource/jansi/jansi/1.11/jansi-1.11.pom (4 KB at 35.9 KB/sec)
Downloading: https://oss.sonatype.org/content/repositories/releases/org/fusesource/jansi/jansi-project/1.11/jansi-project-1.11.pom
Downloading: https://repo.eclipse.org/content/repositories/cbi-releases/org/fusesource/jansi/jansi-project/1.11/jansi-project-1.11.pom
Downloading: https://repo.maven.apache.org/maven2/org/fusesource/jansi/jansi-project/1.11/jansi-project-1.11.pom
Nov 18, 2016 7:15:19 AM org.apache.maven.wagon.providers.http.httpclient.impl.execchain.RetryExec execute
INFO: I/O exception (org.apache.maven.wagon.providers.http.httpclient.NoHttpResponseException) caught when processing request to {tls}->http://proxy.eclipse.org:9898->https://repo.maven.apache.org:443: The target server failed to respond
Nov 18, 2016 7:15:19 AM org.apache.maven.wagon.providers.http.httpclient.impl.execchain.RetryExec execute
INFO: Retrying request to {tls}->http://proxy.eclipse.org:9898->https://repo.maven.apache.org:443
Nov 18, 2016 7:15:19 AM org.apache.maven.wagon.providers.http.httpclient.impl.execchain.RetryExec execute
INFO: I/O exception (org.apache.maven.wagon.providers.http.httpclient.NoHttpResponseException) caught when processing request to {tls}->http://proxy.eclipse.org:9898->https://repo.maven.apache.org:443: The target server failed to respond
Nov 18, 2016 7:15:19 AM org.apache.maven.wagon.providers.http.httpclient.impl.execchain.RetryExec execute
INFO: Retrying request to {tls}->http://proxy.eclipse.org:9898->https://repo.maven.apache.org:443
Nov 18, 2016 7:15:19 AM org.apache.maven.wagon.providers.http.httpclient.impl.execchain.RetryExec execute
INFO: I/O exception (org.apache.maven.wagon.providers.http.httpclient.NoHttpResponseException) caught when processing request to {tls}->http://proxy.eclipse.org:9898->https://repo.maven.apache.org:443: The target server failed to respond
Nov 18, 2016 7:15:19 AM org.apache.maven.wagon.providers.http.httpclient.impl.execchain.RetryExec execute
INFO: Retrying request to {tls}->http://proxy.eclipse.org:9898->https://repo.maven.apache.org:443
Downloading: https://oss.sonatype.org/content/repositories/releases/jline/jline/2.12/jline-2.12.pom
Downloaded: https://oss.sonatype.org/content/repositories/releases/jline/jline/2.12/jline-2.12.pom (17 KB at 91.4 KB/sec)
Downloading: https://oss.sonatype.org/content/repositories/releases/org/apache/ant/ant/1.9.4/ant-1.9.4.pom
Downloading: https://repo.eclipse.org/content/repositories/cbi-releases/org/apache/ant/ant/1.9.4/ant-1.9.4.pom
Downloading: https://repo.maven.apache.org/maven2/org/apache/ant/ant/1.9.4/ant-1.9.4.pom
Nov 18, 2016 7:15:19 AM org.apache.maven.wagon.providers.http.httpclient.impl.execchain.RetryExec execute
INFO: I/O exception (org.apache.maven.wagon.providers.http.httpclient.NoHttpResponseException) caught when processing request to {tls}->http://proxy.eclipse.org:9898->https://repo.maven.apache.org:443: The target server failed to respond
Nov 18, 2016 7:15:19 AM org.apache.maven.wagon.providers.http.httpclient.impl.execchain.RetryExec execute
INFO: Retrying request to {tls}->http://proxy.eclipse.org:9898->https://repo.maven.apache.org:443
Downloaded: https://repo.maven.apache.org/maven2/org/apache/ant/ant/1.9.4/ant-1.9.4.pom (10 KB at 14.8 KB/sec)
Downloading: https://oss.sonatype.org/content/repositories/releases/org/apache/ant/ant-parent/1.9.4/ant-parent-1.9.4.pom
Downloading: https://repo.eclipse.org/content/repositories/cbi-releases/org/apache/ant/ant-parent/1.9.4/ant-parent-1.9.4.pom
Downloading: https://repo.maven.apache.org/maven2/org/apache/ant/ant-parent/1.9.4/ant-parent-1.9.4.pom
Downloaded: https://repo.maven.apache.org/maven2/org/apache/ant/ant-parent/1.9.4/ant-parent-1.9.4.pom (6 KB at 54.7 KB/sec)
Downloading: https://oss.sonatype.org/content/repositories/releases/org/apache/ant/ant-launcher/1.9.4/ant-launcher-1.9.4.pom
Downloading: https://repo.eclipse.org/content/repositories/cbi-releases/org/apache/ant/ant-launcher/1.9.4/ant-launcher-1.9.4.pom
Downloading: https://repo.maven.apache.org/maven2/org/apache/ant/ant-launcher/1.9.4/ant-launcher-1.9.4.pom
Downloaded: https://repo.maven.apache.org/maven2/org/apache/ant/ant-launcher/1.9.4/ant-launcher-1.9.4.pom (3 KB at 23.8 KB/sec)
Downloading: https://oss.sonatype.org/content/repositories/releases/org/apache/ivy/ivy/2.4.0/ivy-2.4.0.pom
Downloading: https://repo.eclipse.org/content/repositories/cbi-releases/org/apache/ivy/ivy/2.4.0/ivy-2.4.0.pom
Downloading: https://repo.maven.apache.org/maven2/org/apache/ivy/ivy/2.4.0/ivy-2.4.0.pom
Downloaded: https://repo.maven.apache.org/maven2/org/apache/ivy/ivy/2.4.0/ivy-2.4.0.pom (7 KB at 61.3 KB/sec)
Downloading: https://oss.sonatype.org/content/repositories/releases/org/codehaus/groovy/groovy-all/2.4.0/groovy-all-2.4.0.pom
Downloaded: https://oss.sonatype.org/content/repositories/releases/org/codehaus/groovy/groovy-all/2.4.0/groovy-all-2.4.0.pom (18 KB at 87.2 KB/sec)
Downloading: https://oss.sonatype.org/content/repositories/releases/org/apache/maven/reporting/maven-reporting-impl/2.1/maven-reporting-impl-2.1.pom
Downloading: https://repo.eclipse.org/content/repositories/cbi-releases/org/apache/maven/reporting/maven-reporting-impl/2.1/maven-reporting-impl-2.1.pom
Downloading: https://repo.maven.apache.org/maven2/org/apache/maven/reporting/maven-reporting-impl/2.1/maven-reporting-impl-2.1.pom
Downloaded: https://repo.maven.apache.org/maven2/org/apache/maven/reporting/maven-reporting-impl/2.1/maven-reporting-impl-2.1.pom (5 KB at 46.0 KB/sec)
Downloading: https://oss.sonatype.org/content/repositories/releases/org/apache/maven/reporting/maven-reporting-api/3.0/maven-reporting-api-3.0.pom
Downloading: https://repo.eclipse.org/content/repositories/cbi-releases/org/apache/maven/reporting/maven-reporting-api/3.0/maven-reporting-api-3.0.pom
Downloading: https://repo.maven.apache.org/maven2/org/apache/maven/reporting/maven-reporting-api/3.0/maven-reporting-api-3.0.pom
Downloaded: https://repo.maven.apache.org/maven2/org/apache/maven/reporting/maven-reporting-api/3.0/maven-reporting-api-3.0.pom (3 KB at 24.4 KB/sec)
Downloading: https://oss.sonatype.org/content/repositories/releases/org/apache/maven/doxia/doxia-sink-api/1.0/doxia-sink-api-1.0.pom
Downloading: https://repo.eclipse.org/content/repositories/cbi-releases/org/apache/maven/doxia/doxia-sink-api/1.0/doxia-sink-api-1.0.pom
Downloading: https://repo.maven.apache.org/maven2/org/apache/maven/doxia/doxia-sink-api/1.0/doxia-sink-api-1.0.pom
Downloaded: https://repo.maven.apache.org/maven2/org/apache/maven/doxia/doxia-sink-api/1.0/doxia-sink-api-1.0.pom (2 KB at 14.4 KB/sec)
Downloading: https://oss.sonatype.org/content/repositories/releases/org/apache/maven/doxia/doxia/1.0/doxia-1.0.pom
Downloading: https://repo.eclipse.org/content/repositories/cbi-releases/org/apache/maven/doxia/doxia/1.0/doxia-1.0.pom
Downloading: https://repo.maven.apache.org/maven2/org/apache/maven/doxia/doxia/1.0/doxia-1.0.pom
Downloaded: https://repo.maven.apache.org/maven2/org/apache/maven/doxia/doxia/1.0/doxia-1.0.pom (10 KB at 94.2 KB/sec)
Downloading: https://oss.sonatype.org/content/repositories/releases/org/apache/maven/maven-parent/10/maven-parent-10.pom
Downloading: https://repo.eclipse.org/content/repositories/cbi-releases/org/apache/maven/maven-parent/10/maven-parent-10.pom
Downloading: https://repo.maven.apache.org/maven2/org/apache/maven/maven-parent/10/maven-parent-10.pom
Downloaded: https://repo.maven.apache.org/maven2/org/apache/maven/maven-parent/10/maven-parent-10.pom (31 KB at 217.6 KB/sec)
Downloading: https://oss.sonatype.org/content/repositories/releases/org/apache/maven/maven-project/2.0.10/maven-project-2.0.10.pom
Downloading: https://repo.eclipse.org/content/repositories/cbi-releases/org/apache/maven/maven-project/2.0.10/maven-project-2.0.10.pom
Downloading: https://repo.maven.apache.org/maven2/org/apache/maven/maven-project/2.0.10/maven-project-2.0.10.pom
Downloaded: https://repo.maven.apache.org/maven2/org/apache/maven/maven-project/2.0.10/maven-project-2.0.10.pom (3 KB at 29.3 KB/sec)
Downloading: https://oss.sonatype.org/content/repositories/releases/org/apache/maven/maven/2.0.10/maven-2.0.10.pom
Downloading: https://repo.eclipse.org/content/repositories/cbi-releases/org/apache/maven/maven/2.0.10/maven-2.0.10.pom
Downloading: https://repo.maven.apache.org/maven2/org/apache/maven/maven/2.0.10/maven-2.0.10.pom
Downloaded: https://repo.maven.apache.org/maven2/org/apache/maven/maven/2.0.10/maven-2.0.10.pom (24 KB at 225.8 KB/sec)
Downloading: https://oss.sonatype.org/content/repositories/releases/org/apache/maven/maven-settings/2.0.10/maven-settings-2.0.10.pom
Downloading: https://repo.eclipse.org/content/repositories/cbi-releases/org/apache/maven/maven-settings/2.0.10/maven-settings-2.0.10.pom
Downloading: https://repo.maven.apache.org/maven2/org/apache/maven/maven-settings/2.0.10/maven-settings-2.0.10.pom
Downloaded: https://repo.maven.apache.org/maven2/org/apache/maven/maven-settings/2.0.10/maven-settings-2.0.10.pom (3 KB at 23.0 KB/sec)
Downloading: https://oss.sonatype.org/content/repositories/releases/org/apache/maven/maven-model/2.0.10/maven-model-2.0.10.pom
Downloading: https://repo.eclipse.org/content/repositories/cbi-releases/org/apache/maven/maven-model/2.0.10/maven-model-2.0.10.pom
Downloading: https://repo.maven.apache.org/maven2/org/apache/maven/maven-model/2.0.10/maven-model-2.0.10.pom
Downloaded: https://repo.maven.apache.org/maven2/org/apache/maven/maven-model/2.0.10/maven-model-2.0.10.pom (4 KB at 34.3 KB/sec)
Downloading: https://oss.sonatype.org/content/repositories/releases/org/codehaus/plexus/plexus-interpolation/1.1/plexus-interpolation-1.1.pom
Downloading: https://repo.eclipse.org/content/repositories/cbi-releases/org/codehaus/plexus/plexus-interpolation/1.1/plexus-interpolation-1.1.pom
Downloading: https://repo.maven.apache.org/maven2/org/codehaus/plexus/plexus-interpolation/1.1/plexus-interpolation-1.1.pom
Downloaded: https://repo.maven.apache.org/maven2/org/codehaus/plexus/plexus-interpolation/1.1/plexus-interpolation-1.1.pom (2 KB at 14.5 KB/sec)
Downloading: https://oss.sonatype.org/content/repositories/releases/org/apache/maven/maven-profile/2.0.10/maven-profile-2.0.10.pom
Downloading: https://repo.eclipse.org/content/repositories/cbi-releases/org/apache/maven/maven-profile/2.0.10/maven-profile-2.0.10.pom
Downloading: https://repo.maven.apache.org/maven2/org/apache/maven/maven-profile/2.0.10/maven-profile-2.0.10.pom
Downloaded: https://repo.maven.apache.org/maven2/org/apache/maven/maven-profile/2.0.10/maven-profile-2.0.10.pom (3 KB at 21.8 KB/sec)
Downloading: https://oss.sonatype.org/content/repositories/releases/org/apache/maven/maven-artifact-manager/2.0.10/maven-artifact-manager-2.0.10.pom
Downloading: https://repo.eclipse.org/content/repositories/cbi-releases/org/apache/maven/maven-artifact-manager/2.0.10/maven-artifact-manager-2.0.10.pom
Downloading: https://repo.maven.apache.org/maven2/org/apache/maven/maven-artifact-manager/2.0.10/maven-artifact-manager-2.0.10.pom
Downloaded: https://repo.maven.apache.org/maven2/org/apache/maven/maven-artifact-manager/2.0.10/maven-artifact-manager-2.0.10.pom (3 KB at 27.5 KB/sec)
Downloading: https://oss.sonatype.org/content/repositories/releases/org/apache/maven/maven-repository-metadata/2.0.10/maven-repository-metadata-2.0.10.pom
Downloading: https://repo.eclipse.org/content/repositories/cbi-releases/org/apache/maven/maven-repository-metadata/2.0.10/maven-repository-metadata-2.0.10.pom
Downloading: https://repo.maven.apache.org/maven2/org/apache/maven/maven-repository-metadata/2.0.10/maven-repository-metadata-2.0.10.pom
Downloaded: https://repo.maven.apache.org/maven2/org/apache/maven/maven-repository-metadata/2.0.10/maven-repository-metadata-2.0.10.pom (3 KB at 23.5 KB/sec)
Downloading: https://oss.sonatype.org/content/repositories/releases/org/apache/maven/maven-artifact/2.0.10/maven-artifact-2.0.10.pom
Downloading: https://repo.eclipse.org/content/repositories/cbi-releases/org/apache/maven/maven-artifact/2.0.10/maven-artifact-2.0.10.pom
Downloading: https://repo.maven.apache.org/maven2/org/apache/maven/maven-artifact/2.0.10/maven-artifact-2.0.10.pom
Downloaded: https://repo.maven.apache.org/maven2/org/apache/maven/maven-artifact/2.0.10/maven-artifact-2.0.10.pom (2 KB at 16.7 KB/sec)
Downloading: https://oss.sonatype.org/content/repositories/releases/org/apache/maven/maven-plugin-registry/2.0.10/maven-plugin-registry-2.0.10.pom
Downloading: https://repo.eclipse.org/content/repositories/cbi-releases/org/apache/maven/maven-plugin-registry/2.0.10/maven-plugin-registry-2.0.10.pom
Downloading: https://repo.maven.apache.org/maven2/org/apache/maven/maven-plugin-registry/2.0.10/maven-plugin-registry-2.0.10.pom
Downloaded: https://repo.maven.apache.org/maven2/org/apache/maven/maven-plugin-registry/2.0.10/maven-plugin-registry-2.0.10.pom (2 KB at 20.7 KB/sec)
Downloading: https://oss.sonatype.org/content/repositories/releases/org/apache/maven/doxia/doxia-sink-api/1.1.2/doxia-sink-api-1.1.2.pom
Downloading: https://repo.eclipse.org/content/repositories/cbi-releases/org/apache/maven/doxia/doxia-sink-api/1.1.2/doxia-sink-api-1.1.2.pom
Downloading: https://repo.maven.apache.org/maven2/org/apache/maven/doxia/doxia-sink-api/1.1.2/doxia-sink-api-1.1.2.pom
Downloaded: https://repo.maven.apache.org/maven2/org/apache/maven/doxia/doxia-sink-api/1.1.2/doxia-sink-api-1.1.2.pom (2 KB at 16.4 KB/sec)
Downloading: https://oss.sonatype.org/content/repositories/releases/org/apache/maven/doxia/doxia/1.1.2/doxia-1.1.2.pom
Downloading: https://repo.eclipse.org/content/repositories/cbi-releases/org/apache/maven/doxia/doxia/1.1.2/doxia-1.1.2.pom
Downloading: https://repo.maven.apache.org/maven2/org/apache/maven/doxia/doxia/1.1.2/doxia-1.1.2.pom
Downloaded: https://repo.maven.apache.org/maven2/org/apache/maven/doxia/doxia/1.1.2/doxia-1.1.2.pom (18 KB at 170.5 KB/sec)
Downloading: https://oss.sonatype.org/content/repositories/releases/org/apache/maven/doxia/doxia-logging-api/1.1.2/doxia-logging-api-1.1.2.pom
Downloading: https://repo.eclipse.org/content/repositories/cbi-releases/org/apache/maven/doxia/doxia-logging-api/1.1.2/doxia-logging-api-1.1.2.pom
Downloading: https://repo.maven.apache.org/maven2/org/apache/maven/doxia/doxia-logging-api/1.1.2/doxia-logging-api-1.1.2.pom
Downloaded: https://repo.maven.apache.org/maven2/org/apache/maven/doxia/doxia-logging-api/1.1.2/doxia-logging-api-1.1.2.pom (2 KB at 16.1 KB/sec)
Downloading: https://oss.sonatype.org/content/repositories/releases/org/apache/maven/doxia/doxia-core/1.1.2/doxia-core-1.1.2.pom
Downloading: https://repo.eclipse.org/content/repositories/cbi-releases/org/apache/maven/doxia/doxia-core/1.1.2/doxia-core-1.1.2.pom
Downloading: https://repo.maven.apache.org/maven2/org/apache/maven/doxia/doxia-core/1.1.2/doxia-core-1.1.2.pom
Downloaded: https://repo.maven.apache.org/maven2/org/apache/maven/doxia/doxia-core/1.1.2/doxia-core-1.1.2.pom (4 KB at 38.2 KB/sec)
Downloading: https://oss.sonatype.org/content/repositories/releases/org/codehaus/plexus/plexus-utils/1.5.12/plexus-utils-1.5.12.pom
Downloading: https://repo.eclipse.org/content/repositories/cbi-releases/org/codehaus/plexus/plexus-utils/1.5.12/plexus-utils-1.5.12.pom
Downloading: https://repo.maven.apache.org/maven2/org/codehaus/plexus/plexus-utils/1.5.12/plexus-utils-1.5.12.pom
Downloaded: https://repo.maven.apache.org/maven2/org/codehaus/plexus/plexus-utils/1.5.12/plexus-utils-1.5.12.pom (6 KB at 56.7 KB/sec)
Downloading: https://oss.sonatype.org/content/repositories/releases/xerces/xercesImpl/2.8.1/xercesImpl-2.8.1.pom
Downloading: https://repo.eclipse.org/content/repositories/cbi-releases/xerces/xercesImpl/2.8.1/xercesImpl-2.8.1.pom
Downloading: https://repo.maven.apache.org/maven2/xerces/xercesImpl/2.8.1/xercesImpl-2.8.1.pom
Downloaded: https://repo.maven.apache.org/maven2/xerces/xercesImpl/2.8.1/xercesImpl-2.8.1.pom (3 KB at 22.5 KB/sec)
Downloading: https://oss.sonatype.org/content/repositories/releases/xml-apis/xml-apis/1.3.03/xml-apis-1.3.03.pom
Downloading: https://repo.eclipse.org/content/repositories/cbi-releases/xml-apis/xml-apis/1.3.03/xml-apis-1.3.03.pom
Downloading: https://repo.maven.apache.org/maven2/xml-apis/xml-apis/1.3.03/xml-apis-1.3.03.pom
Downloaded: https://repo.maven.apache.org/maven2/xml-apis/xml-apis/1.3.03/xml-apis-1.3.03.pom (738 B at 7.6 KB/sec)
Downloading: https://oss.sonatype.org/content/repositories/releases/org/apache/apache/1/apache-1.pom
Downloading: https://repo.eclipse.org/content/repositories/cbi-releases/org/apache/apache/1/apache-1.pom
Downloading: https://repo.maven.apache.org/maven2/org/apache/apache/1/apache-1.pom
Downloaded: https://repo.maven.apache.org/maven2/org/apache/apache/1/apache-1.pom (4 KB at 34.0 KB/sec)
Downloading: https://oss.sonatype.org/content/repositories/releases/commons-lang/commons-lang/2.4/commons-lang-2.4.pom
Downloading: https://repo.eclipse.org/content/repositories/cbi-releases/commons-lang/commons-lang/2.4/commons-lang-2.4.pom
Downloading: https://repo.maven.apache.org/maven2/commons-lang/commons-lang/2.4/commons-lang-2.4.pom
Downloaded: https://repo.maven.apache.org/maven2/commons-lang/commons-lang/2.4/commons-lang-2.4.pom (14 KB at 136.5 KB/sec)
Downloading: https://oss.sonatype.org/content/repositories/releases/org/apache/commons/commons-parent/9/commons-parent-9.pom
Downloading: https://repo.eclipse.org/content/repositories/cbi-releases/org/apache/commons/commons-parent/9/commons-parent-9.pom
Downloading: https://repo.maven.apache.org/maven2/org/apache/commons/commons-parent/9/commons-parent-9.pom
Downloaded: https://repo.maven.apache.org/maven2/org/apache/commons/commons-parent/9/commons-parent-9.pom (22 KB at 204.0 KB/sec)
Downloading: https://oss.sonatype.org/content/repositories/releases/commons-httpclient/commons-httpclient/3.1/commons-httpclient-3.1.pom
Downloading: https://repo.eclipse.org/content/repositories/cbi-releases/commons-httpclient/commons-httpclient/3.1/commons-httpclient-3.1.pom
Downloading: https://repo.maven.apache.org/maven2/commons-httpclient/commons-httpclient/3.1/commons-httpclient-3.1.pom
Downloaded: https://repo.maven.apache.org/maven2/commons-httpclient/commons-httpclient/3.1/commons-httpclient-3.1.pom (8 KB at 63.7 KB/sec)
Downloading: https://oss.sonatype.org/content/repositories/releases/commons-logging/commons-logging/1.0.4/commons-logging-1.0.4.pom
Downloading: https://repo.eclipse.org/content/repositories/cbi-releases/commons-logging/commons-logging/1.0.4/commons-logging-1.0.4.pom
Downloading: https://repo.maven.apache.org/maven2/commons-logging/commons-logging/1.0.4/commons-logging-1.0.4.pom
Downloaded: https://repo.maven.apache.org/maven2/commons-logging/commons-logging/1.0.4/commons-logging-1.0.4.pom (6 KB at 53.5 KB/sec)
Downloading: https://oss.sonatype.org/content/repositories/releases/commons-codec/commons-codec/1.2/commons-codec-1.2.pom
Downloading: https://repo.eclipse.org/content/repositories/cbi-releases/commons-codec/commons-codec/1.2/commons-codec-1.2.pom
Downloading: https://repo.maven.apache.org/maven2/commons-codec/commons-codec/1.2/commons-codec-1.2.pom
Downloaded: https://repo.maven.apache.org/maven2/commons-codec/commons-codec/1.2/commons-codec-1.2.pom (4 KB at 39.3 KB/sec)
Downloading: https://oss.sonatype.org/content/repositories/releases/org/apache/maven/doxia/doxia-site-renderer/1.1.2/doxia-site-renderer-1.1.2.pom
Downloading: https://repo.eclipse.org/content/repositories/cbi-releases/org/apache/maven/doxia/doxia-site-renderer/1.1.2/doxia-site-renderer-1.1.2.pom
Downloading: https://repo.maven.apache.org/maven2/org/apache/maven/doxia/doxia-site-renderer/1.1.2/doxia-site-renderer-1.1.2.pom
Downloaded: https://repo.maven.apache.org/maven2/org/apache/maven/doxia/doxia-site-renderer/1.1.2/doxia-site-renderer-1.1.2.pom (6 KB at 61.0 KB/sec)
Downloading: https://oss.sonatype.org/content/repositories/releases/org/apache/maven/doxia/doxia-sitetools/1.1.2/doxia-sitetools-1.1.2.pom
Downloading: https://repo.eclipse.org/content/repositories/cbi-releases/org/apache/maven/doxia/doxia-sitetools/1.1.2/doxia-sitetools-1.1.2.pom
Downloading: https://repo.maven.apache.org/maven2/org/apache/maven/doxia/doxia-sitetools/1.1.2/doxia-sitetools-1.1.2.pom
Downloaded: https://repo.maven.apache.org/maven2/org/apache/maven/doxia/doxia-sitetools/1.1.2/doxia-sitetools-1.1.2.pom (15 KB at 149.3 KB/sec)
Downloading: https://oss.sonatype.org/content/repositories/releases/org/apache/maven/doxia/doxia-decoration-model/1.1.2/doxia-decoration-model-1.1.2.pom
Downloading: https://repo.eclipse.org/content/repositories/cbi-releases/org/apache/maven/doxia/doxia-decoration-model/1.1.2/doxia-decoration-model-1.1.2.pom
Downloading: https://repo.maven.apache.org/maven2/org/apache/maven/doxia/doxia-decoration-model/1.1.2/doxia-decoration-model-1.1.2.pom
Downloaded: https://repo.maven.apache.org/maven2/org/apache/maven/doxia/doxia-decoration-model/1.1.2/doxia-decoration-model-1.1.2.pom (3 KB at 30.3 KB/sec)
Downloading: https://oss.sonatype.org/content/repositories/releases/org/apache/maven/doxia/doxia-module-xhtml/1.1.2/doxia-module-xhtml-1.1.2.pom
Downloading: https://repo.eclipse.org/content/repositories/cbi-releases/org/apache/maven/doxia/doxia-module-xhtml/1.1.2/doxia-module-xhtml-1.1.2.pom
Downloading: https://repo.maven.apache.org/maven2/org/apache/maven/doxia/doxia-module-xhtml/1.1.2/doxia-module-xhtml-1.1.2.pom
Downloaded: https://repo.maven.apache.org/maven2/org/apache/maven/doxia/doxia-module-xhtml/1.1.2/doxia-module-xhtml-1.1.2.pom (2 KB at 16.6 KB/sec)
Downloading: https://oss.sonatype.org/content/repositories/releases/org/apache/maven/doxia/doxia-modules/1.1.2/doxia-modules-1.1.2.pom
Downloading: https://repo.eclipse.org/content/repositories/cbi-releases/org/apache/maven/doxia/doxia-modules/1.1.2/doxia-modules-1.1.2.pom
Downloading: https://repo.maven.apache.org/maven2/org/apache/maven/doxia/doxia-modules/1.1.2/doxia-modules-1.1.2.pom
Downloaded: https://repo.maven.apache.org/maven2/org/apache/maven/doxia/doxia-modules/1.1.2/doxia-modules-1.1.2.pom (3 KB at 25.1 KB/sec)
Downloading: https://oss.sonatype.org/content/repositories/releases/org/apache/maven/doxia/doxia-module-fml/1.1.2/doxia-module-fml-1.1.2.pom
Downloading: https://repo.eclipse.org/content/repositories/cbi-releases/org/apache/maven/doxia/doxia-module-fml/1.1.2/doxia-module-fml-1.1.2.pom
Downloading: https://repo.maven.apache.org/maven2/org/apache/maven/doxia/doxia-module-fml/1.1.2/doxia-module-fml-1.1.2.pom
Downloaded: https://repo.maven.apache.org/maven2/org/apache/maven/doxia/doxia-module-fml/1.1.2/doxia-module-fml-1.1.2.pom (6 KB at 55.3 KB/sec)
Downloading: https://oss.sonatype.org/content/repositories/releases/org/codehaus/plexus/plexus-i18n/1.0-beta-7/plexus-i18n-1.0-beta-7.pom
Downloading: https://repo.eclipse.org/content/repositories/cbi-releases/org/codehaus/plexus/plexus-i18n/1.0-beta-7/plexus-i18n-1.0-beta-7.pom
Downloading: https://repo.maven.apache.org/maven2/org/codehaus/plexus/plexus-i18n/1.0-beta-7/plexus-i18n-1.0-beta-7.pom
Downloaded: https://repo.maven.apache.org/maven2/org/codehaus/plexus/plexus-i18n/1.0-beta-7/plexus-i18n-1.0-beta-7.pom (2 KB at 11.0 KB/sec)
Downloading: https://oss.sonatype.org/content/repositories/releases/org/codehaus/plexus/plexus-components/1.1.12/plexus-components-1.1.12.pom
Downloading: https://repo.eclipse.org/content/repositories/cbi-releases/org/codehaus/plexus/plexus-components/1.1.12/plexus-components-1.1.12.pom
Downloading: https://repo.maven.apache.org/maven2/org/codehaus/plexus/plexus-components/1.1.12/plexus-components-1.1.12.pom
Downloaded: https://repo.maven.apache.org/maven2/org/codehaus/plexus/plexus-components/1.1.12/plexus-components-1.1.12.pom (3 KB at 31.2 KB/sec)
Downloading: https://oss.sonatype.org/content/repositories/releases/org/codehaus/plexus/plexus-velocity/1.1.7/plexus-velocity-1.1.7.pom
Downloading: https://repo.eclipse.org/content/repositories/cbi-releases/org/codehaus/plexus/plexus-velocity/1.1.7/plexus-velocity-1.1.7.pom
Downloading: https://repo.maven.apache.org/maven2/org/codehaus/plexus/plexus-velocity/1.1.7/plexus-velocity-1.1.7.pom
Downloaded: https://repo.maven.apache.org/maven2/org/codehaus/plexus/plexus-velocity/1.1.7/plexus-velocity-1.1.7.pom (2 KB at 20.1 KB/sec)
Downloading: https://oss.sonatype.org/content/repositories/releases/org/apache/velocity/velocity/1.5/velocity-1.5.pom
Downloading: https://repo.eclipse.org/content/repositories/cbi-releases/org/apache/velocity/velocity/1.5/velocity-1.5.pom
Downloading: https://repo.maven.apache.org/maven2/org/apache/velocity/velocity/1.5/velocity-1.5.pom
Downloaded: https://repo.maven.apache.org/maven2/org/apache/velocity/velocity/1.5/velocity-1.5.pom (8 KB at 77.4 KB/sec)
Downloading: https://oss.sonatype.org/content/repositories/releases/commons-collections/commons-collections/3.1/commons-collections-3.1.pom
Downloading: https://repo.eclipse.org/content/repositories/cbi-releases/commons-collections/commons-collections/3.1/commons-collections-3.1.pom
Downloading: https://repo.maven.apache.org/maven2/commons-collections/commons-collections/3.1/commons-collections-3.1.pom
Downloaded: https://repo.maven.apache.org/maven2/commons-collections/commons-collections/3.1/commons-collections-3.1.pom (6 KB at 62.5 KB/sec)
Downloading: https://oss.sonatype.org/content/repositories/releases/commons-lang/commons-lang/2.1/commons-lang-2.1.pom
Downloading: https://repo.eclipse.org/content/repositories/cbi-releases/commons-lang/commons-lang/2.1/commons-lang-2.1.pom
Downloading: https://repo.maven.apache.org/maven2/commons-lang/commons-lang/2.1/commons-lang-2.1.pom
Downloaded: https://repo.maven.apache.org/maven2/commons-lang/commons-lang/2.1/commons-lang-2.1.pom (10 KB at 100.0 KB/sec)
Downloading: https://oss.sonatype.org/content/repositories/releases/oro/oro/2.0.8/oro-2.0.8.pom
Downloading: https://repo.eclipse.org/content/repositories/cbi-releases/oro/oro/2.0.8/oro-2.0.8.pom
Downloading: https://repo.maven.apache.org/maven2/oro/oro/2.0.8/oro-2.0.8.pom
Downloaded: https://repo.maven.apache.org/maven2/oro/oro/2.0.8/oro-2.0.8.pom (140 B at 1.5 KB/sec)
Downloading: https://oss.sonatype.org/content/repositories/releases/commons-collections/commons-collections/3.2/commons-collections-3.2.pom
Downloading: https://repo.eclipse.org/content/repositories/cbi-releases/commons-collections/commons-collections/3.2/commons-collections-3.2.pom
Downloading: https://repo.maven.apache.org/maven2/commons-collections/commons-collections/3.2/commons-collections-3.2.pom
Downloaded: https://repo.maven.apache.org/maven2/commons-collections/commons-collections/3.2/commons-collections-3.2.pom (11 KB at 110.0 KB/sec)
Downloading: https://oss.sonatype.org/content/repositories/releases/commons-validator/commons-validator/1.2.0/commons-validator-1.2.0.pom
Downloading: https://repo.eclipse.org/content/repositories/cbi-releases/commons-validator/commons-validator/1.2.0/commons-validator-1.2.0.pom
Downloading: https://repo.maven.apache.org/maven2/commons-validator/commons-validator/1.2.0/commons-validator-1.2.0.pom
Downloaded: https://repo.maven.apache.org/maven2/commons-validator/commons-validator/1.2.0/commons-validator-1.2.0.pom (9 KB at 90.5 KB/sec)
Downloading: https://oss.sonatype.org/content/repositories/releases/commons-beanutils/commons-beanutils/1.7.0/commons-beanutils-1.7.0.pom
Downloading: https://repo.eclipse.org/content/repositories/cbi-releases/commons-beanutils/commons-beanutils/1.7.0/commons-beanutils-1.7.0.pom
Downloading: https://repo.maven.apache.org/maven2/commons-beanutils/commons-beanutils/1.7.0/commons-beanutils-1.7.0.pom
Downloaded: https://repo.maven.apache.org/maven2/commons-beanutils/commons-beanutils/1.7.0/commons-beanutils-1.7.0.pom (357 B at 3.7 KB/sec)
Downloading: https://oss.sonatype.org/content/repositories/releases/commons-logging/commons-logging/1.0.3/commons-logging-1.0.3.pom
Downloading: https://repo.eclipse.org/content/repositories/cbi-releases/commons-logging/commons-logging/1.0.3/commons-logging-1.0.3.pom
Downloading: https://repo.maven.apache.org/maven2/commons-logging/commons-logging/1.0.3/commons-logging-1.0.3.pom
Downloaded: https://repo.maven.apache.org/maven2/commons-logging/commons-logging/1.0.3/commons-logging-1.0.3.pom (866 B at 8.7 KB/sec)
Downloading: https://oss.sonatype.org/content/repositories/releases/commons-digester/commons-digester/1.6/commons-digester-1.6.pom
Downloading: https://repo.eclipse.org/content/repositories/cbi-releases/commons-digester/commons-digester/1.6/commons-digester-1.6.pom
Downloading: https://repo.maven.apache.org/maven2/commons-digester/commons-digester/1.6/commons-digester-1.6.pom
Downloaded: https://repo.maven.apache.org/maven2/commons-digester/commons-digester/1.6/commons-digester-1.6.pom (974 B at 10.1 KB/sec)
Downloading: https://oss.sonatype.org/content/repositories/releases/commons-beanutils/commons-beanutils/1.6/commons-beanutils-1.6.pom
Downloading: https://repo.eclipse.org/content/repositories/cbi-releases/commons-beanutils/commons-beanutils/1.6/commons-beanutils-1.6.pom
Downloading: https://repo.maven.apache.org/maven2/commons-beanutils/commons-beanutils/1.6/commons-beanutils-1.6.pom
Downloaded: https://repo.maven.apache.org/maven2/commons-beanutils/commons-beanutils/1.6/commons-beanutils-1.6.pom (3 KB at 23.7 KB/sec)
Downloading: https://oss.sonatype.org/content/repositories/releases/commons-logging/commons-logging/1.0/commons-logging-1.0.pom
Downloading: https://repo.eclipse.org/content/repositories/cbi-releases/commons-logging/commons-logging/1.0/commons-logging-1.0.pom
Downloading: https://repo.maven.apache.org/maven2/commons-logging/commons-logging/1.0/commons-logging-1.0.pom
Downloaded: https://repo.maven.apache.org/maven2/commons-logging/commons-logging/1.0/commons-logging-1.0.pom (163 B at 1.7 KB/sec)
Downloading: https://oss.sonatype.org/content/repositories/releases/commons-collections/commons-collections/2.0/commons-collections-2.0.pom
Downloading: https://repo.eclipse.org/content/repositories/cbi-releases/commons-collections/commons-collections/2.0/commons-collections-2.0.pom
Downloading: https://repo.maven.apache.org/maven2/commons-collections/commons-collections/2.0/commons-collections-2.0.pom
Downloaded: https://repo.maven.apache.org/maven2/commons-collections/commons-collections/2.0/commons-collections-2.0.pom (171 B at 1.7 KB/sec)
Downloading: https://oss.sonatype.org/content/repositories/releases/commons-collections/commons-collections/2.1/commons-collections-2.1.pom
Downloading: https://repo.eclipse.org/content/repositories/cbi-releases/commons-collections/commons-collections/2.1/commons-collections-2.1.pom
Downloading: https://repo.maven.apache.org/maven2/commons-collections/commons-collections/2.1/commons-collections-2.1.pom
Downloaded: https://repo.maven.apache.org/maven2/commons-collections/commons-collections/2.1/commons-collections-2.1.pom (4 KB at 34.3 KB/sec)
Downloading: https://oss.sonatype.org/content/repositories/releases/xml-apis/xml-apis/2.0.2/xml-apis-2.0.2.pom
Downloading: https://repo.eclipse.org/content/repositories/cbi-releases/xml-apis/xml-apis/2.0.2/xml-apis-2.0.2.pom
Downloading: https://repo.maven.apache.org/maven2/xml-apis/xml-apis/2.0.2/xml-apis-2.0.2.pom
Downloaded: https://repo.maven.apache.org/maven2/xml-apis/xml-apis/2.0.2/xml-apis-2.0.2.pom (346 B at 3.5 KB/sec)
Downloading: https://oss.sonatype.org/content/repositories/releases/org/apache/maven/doxia/doxia-core/1.4/doxia-core-1.4.pom
Downloading: https://repo.eclipse.org/content/repositories/cbi-releases/org/apache/maven/doxia/doxia-core/1.4/doxia-core-1.4.pom
Downloading: https://repo.maven.apache.org/maven2/org/apache/maven/doxia/doxia-core/1.4/doxia-core-1.4.pom
Downloaded: https://repo.maven.apache.org/maven2/org/apache/maven/doxia/doxia-core/1.4/doxia-core-1.4.pom (4 KB at 42.2 KB/sec)
Downloading: https://oss.sonatype.org/content/repositories/releases/org/apache/maven/doxia/doxia/1.4/doxia-1.4.pom
Downloading: https://repo.eclipse.org/content/repositories/cbi-releases/org/apache/maven/doxia/doxia/1.4/doxia-1.4.pom
Downloading: https://repo.maven.apache.org/maven2/org/apache/maven/doxia/doxia/1.4/doxia-1.4.pom
Downloaded: https://repo.maven.apache.org/maven2/org/apache/maven/doxia/doxia/1.4/doxia-1.4.pom (18 KB at 171.9 KB/sec)
Downloading: https://oss.sonatype.org/content/repositories/releases/org/apache/maven/doxia/doxia-sink-api/1.4/doxia-sink-api-1.4.pom
Downloading: https://repo.eclipse.org/content/repositories/cbi-releases/org/apache/maven/doxia/doxia-sink-api/1.4/doxia-sink-api-1.4.pom
Downloading: https://repo.maven.apache.org/maven2/org/apache/maven/doxia/doxia-sink-api/1.4/doxia-sink-api-1.4.pom
Downloaded: https://repo.maven.apache.org/maven2/org/apache/maven/doxia/doxia-sink-api/1.4/doxia-sink-api-1.4.pom (2 KB at 15.9 KB/sec)
Downloading: https://oss.sonatype.org/content/repositories/releases/org/apache/maven/doxia/doxia-logging-api/1.4/doxia-logging-api-1.4.pom
Downloading: https://repo.eclipse.org/content/repositories/cbi-releases/org/apache/maven/doxia/doxia-logging-api/1.4/doxia-logging-api-1.4.pom
Downloading: https://repo.maven.apache.org/maven2/org/apache/maven/doxia/doxia-logging-api/1.4/doxia-logging-api-1.4.pom
Downloaded: https://repo.maven.apache.org/maven2/org/apache/maven/doxia/doxia-logging-api/1.4/doxia-logging-api-1.4.pom (2 KB at 16.0 KB/sec)
Downloading: https://oss.sonatype.org/content/repositories/releases/org/codehaus/plexus/plexus-utils/3.0.10/plexus-utils-3.0.10.pom
Downloading: https://repo.eclipse.org/content/repositories/cbi-releases/org/codehaus/plexus/plexus-utils/3.0.10/plexus-utils-3.0.10.pom
Downloading: https://repo.maven.apache.org/maven2/org/codehaus/plexus/plexus-utils/3.0.10/plexus-utils-3.0.10.pom
Downloaded: https://repo.maven.apache.org/maven2/org/codehaus/plexus/plexus-utils/3.0.10/plexus-utils-3.0.10.pom (4 KB at 32.3 KB/sec)
Downloading: https://oss.sonatype.org/content/repositories/releases/xerces/xercesImpl/2.9.1/xercesImpl-2.9.1.pom
Downloading: https://repo.eclipse.org/content/repositories/cbi-releases/xerces/xercesImpl/2.9.1/xercesImpl-2.9.1.pom
Downloading: https://repo.maven.apache.org/maven2/xerces/xercesImpl/2.9.1/xercesImpl-2.9.1.pom
Downloaded: https://repo.maven.apache.org/maven2/xerces/xercesImpl/2.9.1/xercesImpl-2.9.1.pom (2 KB at 14.0 KB/sec)
Downloading: https://oss.sonatype.org/content/repositories/releases/xml-apis/xml-apis/1.3.04/xml-apis-1.3.04.pom
Downloading: https://repo.eclipse.org/content/repositories/cbi-releases/xml-apis/xml-apis/1.3.04/xml-apis-1.3.04.pom
Downloading: https://repo.maven.apache.org/maven2/xml-apis/xml-apis/1.3.04/xml-apis-1.3.04.pom
Downloaded: https://repo.maven.apache.org/maven2/xml-apis/xml-apis/1.3.04/xml-apis-1.3.04.pom (2 KB at 18.9 KB/sec)
Downloading: https://oss.sonatype.org/content/repositories/releases/org/apache/httpcomponents/httpclient/4.0.2/httpclient-4.0.2.pom
Downloading: https://repo.eclipse.org/content/repositories/cbi-releases/org/apache/httpcomponents/httpclient/4.0.2/httpclient-4.0.2.pom
Downloading: https://repo.maven.apache.org/maven2/org/apache/httpcomponents/httpclient/4.0.2/httpclient-4.0.2.pom
Downloaded: https://repo.maven.apache.org/maven2/org/apache/httpcomponents/httpclient/4.0.2/httpclient-4.0.2.pom (8 KB at 76.2 KB/sec)
Downloading: https://oss.sonatype.org/content/repositories/releases/org/apache/httpcomponents/httpcomponents-client/4.0.2/httpcomponents-client-4.0.2.pom
Downloading: https://repo.eclipse.org/content/repositories/cbi-releases/org/apache/httpcomponents/httpcomponents-client/4.0.2/httpcomponents-client-4.0.2.pom
Downloading: https://repo.maven.apache.org/maven2/org/apache/httpcomponents/httpcomponents-client/4.0.2/httpcomponents-client-4.0.2.pom
Downloaded: https://repo.maven.apache.org/maven2/org/apache/httpcomponents/httpcomponents-client/4.0.2/httpcomponents-client-4.0.2.pom (9 KB at 89.3 KB/sec)
Downloading: https://oss.sonatype.org/content/repositories/releases/org/apache/httpcomponents/project/4.1/project-4.1.pom
Downloading: https://repo.eclipse.org/content/repositories/cbi-releases/org/apache/httpcomponents/project/4.1/project-4.1.pom
Downloading: https://repo.maven.apache.org/maven2/org/apache/httpcomponents/project/4.1/project-4.1.pom
Downloaded: https://repo.maven.apache.org/maven2/org/apache/httpcomponents/project/4.1/project-4.1.pom (16 KB at 156.9 KB/sec)
Downloading: https://oss.sonatype.org/content/repositories/releases/org/apache/httpcomponents/httpcore/4.0.1/httpcore-4.0.1.pom
Downloading: https://repo.eclipse.org/content/repositories/cbi-releases/org/apache/httpcomponents/httpcore/4.0.1/httpcore-4.0.1.pom
Downloading: https://repo.maven.apache.org/maven2/org/apache/httpcomponents/httpcore/4.0.1/httpcore-4.0.1.pom
Downloaded: https://repo.maven.apache.org/maven2/org/apache/httpcomponents/httpcore/4.0.1/httpcore-4.0.1.pom (5 KB at 50.8 KB/sec)
Downloading: https://oss.sonatype.org/content/repositories/releases/org/apache/httpcomponents/httpcomponents-core/4.0.1/httpcomponents-core-4.0.1.pom
Downloading: https://repo.eclipse.org/content/repositories/cbi-releases/org/apache/httpcomponents/httpcomponents-core/4.0.1/httpcomponents-core-4.0.1.pom
Downloading: https://repo.maven.apache.org/maven2/org/apache/httpcomponents/httpcomponents-core/4.0.1/httpcomponents-core-4.0.1.pom
Downloaded: https://repo.maven.apache.org/maven2/org/apache/httpcomponents/httpcomponents-core/4.0.1/httpcomponents-core-4.0.1.pom (10 KB at 94.2 KB/sec)
Downloading: https://oss.sonatype.org/content/repositories/releases/org/apache/httpcomponents/project/4.0/project-4.0.pom
Downloading: https://repo.eclipse.org/content/repositories/cbi-releases/org/apache/httpcomponents/project/4.0/project-4.0.pom
Downloading: https://repo.maven.apache.org/maven2/org/apache/httpcomponents/project/4.0/project-4.0.pom
Downloaded: https://repo.maven.apache.org/maven2/org/apache/httpcomponents/project/4.0/project-4.0.pom (13 KB at 130.7 KB/sec)
Downloading: https://oss.sonatype.org/content/repositories/releases/commons-logging/commons-logging/1.1.1/commons-logging-1.1.1.pom
Downloading: https://repo.eclipse.org/content/repositories/cbi-releases/commons-logging/commons-logging/1.1.1/commons-logging-1.1.1.pom
Downloading: https://repo.maven.apache.org/maven2/commons-logging/commons-logging/1.1.1/commons-logging-1.1.1.pom
Downloaded: https://repo.maven.apache.org/maven2/commons-logging/commons-logging/1.1.1/commons-logging-1.1.1.pom (18 KB at 175.8 KB/sec)
Downloading: https://oss.sonatype.org/content/repositories/releases/org/apache/commons/commons-parent/5/commons-parent-5.pom
Downloading: https://repo.eclipse.org/content/repositories/cbi-releases/org/apache/commons/commons-parent/5/commons-parent-5.pom
Downloading: https://repo.maven.apache.org/maven2/org/apache/commons/commons-parent/5/commons-parent-5.pom
Downloaded: https://repo.maven.apache.org/maven2/org/apache/commons/commons-parent/5/commons-parent-5.pom (16 KB at 155.1 KB/sec)
Downloading: https://oss.sonatype.org/content/repositories/releases/commons-codec/commons-codec/1.3/commons-codec-1.3.pom
Downloading: https://repo.eclipse.org/content/repositories/cbi-releases/commons-codec/commons-codec/1.3/commons-codec-1.3.pom
Downloading: https://repo.maven.apache.org/maven2/commons-codec/commons-codec/1.3/commons-codec-1.3.pom
Downloaded: https://repo.maven.apache.org/maven2/commons-codec/commons-codec/1.3/commons-codec-1.3.pom (6 KB at 63.4 KB/sec)
Downloading: https://oss.sonatype.org/content/repositories/releases/org/apache/maven/doxia/doxia-decoration-model/1.4/doxia-decoration-model-1.4.pom
Downloading: https://repo.eclipse.org/content/repositories/cbi-releases/org/apache/maven/doxia/doxia-decoration-model/1.4/doxia-decoration-model-1.4.pom
Downloading: https://repo.maven.apache.org/maven2/org/apache/maven/doxia/doxia-decoration-model/1.4/doxia-decoration-model-1.4.pom
Downloaded: https://repo.maven.apache.org/maven2/org/apache/maven/doxia/doxia-decoration-model/1.4/doxia-decoration-model-1.4.pom (3 KB at 27.5 KB/sec)
Downloading: https://oss.sonatype.org/content/repositories/releases/org/apache/maven/doxia/doxia-sitetools/1.4/doxia-sitetools-1.4.pom
Downloading: https://repo.eclipse.org/content/repositories/cbi-releases/org/apache/maven/doxia/doxia-sitetools/1.4/doxia-sitetools-1.4.pom
Downloading: https://repo.maven.apache.org/maven2/org/apache/maven/doxia/doxia-sitetools/1.4/doxia-sitetools-1.4.pom
Downloaded: https://repo.maven.apache.org/maven2/org/apache/maven/doxia/doxia-sitetools/1.4/doxia-sitetools-1.4.pom (17 KB at 166.0 KB/sec)
Downloading: https://oss.sonatype.org/content/repositories/releases/org/apache/maven/doxia/doxia-site-renderer/1.4/doxia-site-renderer-1.4.pom
Downloading: https://repo.eclipse.org/content/repositories/cbi-releases/org/apache/maven/doxia/doxia-site-renderer/1.4/doxia-site-renderer-1.4.pom
Downloading: https://repo.maven.apache.org/maven2/org/apache/maven/doxia/doxia-site-renderer/1.4/doxia-site-renderer-1.4.pom
Downloaded: https://repo.maven.apache.org/maven2/org/apache/maven/doxia/doxia-site-renderer/1.4/doxia-site-renderer-1.4.pom (6 KB at 61.5 KB/sec)
Downloading: https://oss.sonatype.org/content/repositories/releases/org/apache/maven/doxia/doxia-module-xhtml/1.4/doxia-module-xhtml-1.4.pom
Downloading: https://repo.eclipse.org/content/repositories/cbi-releases/org/apache/maven/doxia/doxia-module-xhtml/1.4/doxia-module-xhtml-1.4.pom
Downloading: https://repo.maven.apache.org/maven2/org/apache/maven/doxia/doxia-module-xhtml/1.4/doxia-module-xhtml-1.4.pom
Downloaded: https://repo.maven.apache.org/maven2/org/apache/maven/doxia/doxia-module-xhtml/1.4/doxia-module-xhtml-1.4.pom (2 KB at 17.1 KB/sec)
Downloading: https://oss.sonatype.org/content/repositories/releases/org/apache/maven/doxia/doxia-modules/1.4/doxia-modules-1.4.pom
Downloading: https://repo.eclipse.org/content/repositories/cbi-releases/org/apache/maven/doxia/doxia-modules/1.4/doxia-modules-1.4.pom
Downloading: https://repo.maven.apache.org/maven2/org/apache/maven/doxia/doxia-modules/1.4/doxia-modules-1.4.pom
Downloaded: https://repo.maven.apache.org/maven2/org/apache/maven/doxia/doxia-modules/1.4/doxia-modules-1.4.pom (3 KB at 27.5 KB/sec)
Downloading: https://oss.sonatype.org/content/repositories/releases/org/apache/maven/doxia/doxia-module-fml/1.4/doxia-module-fml-1.4.pom
Downloading: https://repo.eclipse.org/content/repositories/cbi-releases/org/apache/maven/doxia/doxia-module-fml/1.4/doxia-module-fml-1.4.pom
Downloading: https://repo.maven.apache.org/maven2/org/apache/maven/doxia/doxia-module-fml/1.4/doxia-module-fml-1.4.pom
Downloaded: https://repo.maven.apache.org/maven2/org/apache/maven/doxia/doxia-module-fml/1.4/doxia-module-fml-1.4.pom (5 KB at 49.9 KB/sec)
Downloading: https://oss.sonatype.org/content/repositories/releases/org/apache/velocity/velocity-tools/2.0/velocity-tools-2.0.pom
Downloading: https://repo.eclipse.org/content/repositories/cbi-releases/org/apache/velocity/velocity-tools/2.0/velocity-tools-2.0.pom
Downloading: https://repo.maven.apache.org/maven2/org/apache/velocity/velocity-tools/2.0/velocity-tools-2.0.pom
Downloaded: https://repo.maven.apache.org/maven2/org/apache/velocity/velocity-tools/2.0/velocity-tools-2.0.pom (18 KB at 174.2 KB/sec)
Downloading: https://oss.sonatype.org/content/repositories/releases/commons-digester/commons-digester/1.8/commons-digester-1.8.pom
Downloading: https://repo.eclipse.org/content/repositories/cbi-releases/commons-digester/commons-digester/1.8/commons-digester-1.8.pom
Downloading: https://repo.maven.apache.org/maven2/commons-digester/commons-digester/1.8/commons-digester-1.8.pom
Downloaded: https://repo.maven.apache.org/maven2/commons-digester/commons-digester/1.8/commons-digester-1.8.pom (7 KB at 71.2 KB/sec)
Downloading: https://oss.sonatype.org/content/repositories/releases/commons-logging/commons-logging/1.1/commons-logging-1.1.pom
Downloading: https://repo.eclipse.org/content/repositories/cbi-releases/commons-logging/commons-logging/1.1/commons-logging-1.1.pom
Downloading: https://repo.maven.apache.org/maven2/commons-logging/commons-logging/1.1/commons-logging-1.1.pom
Downloaded: https://repo.maven.apache.org/maven2/commons-logging/commons-logging/1.1/commons-logging-1.1.pom (7 KB at 62.2 KB/sec)
Downloading: https://oss.sonatype.org/content/repositories/releases/logkit/logkit/1.0.1/logkit-1.0.1.pom
Downloading: https://repo.eclipse.org/content/repositories/cbi-releases/logkit/logkit/1.0.1/logkit-1.0.1.pom
Downloading: https://repo.maven.apache.org/maven2/logkit/logkit/1.0.1/logkit-1.0.1.pom
Downloaded: https://repo.maven.apache.org/maven2/logkit/logkit/1.0.1/logkit-1.0.1.pom (147 B at 1.5 KB/sec)
Downloading: https://oss.sonatype.org/content/repositories/releases/avalon-framework/avalon-framework/4.1.3/avalon-framework-4.1.3.pom
Downloading: https://repo.eclipse.org/content/repositories/cbi-releases/avalon-framework/avalon-framework/4.1.3/avalon-framework-4.1.3.pom
Downloading: https://repo.maven.apache.org/maven2/avalon-framework/avalon-framework/4.1.3/avalon-framework-4.1.3.pom
Downloaded: https://repo.maven.apache.org/maven2/avalon-framework/avalon-framework/4.1.3/avalon-framework-4.1.3.pom (167 B at 1.7 KB/sec)
Downloading: https://oss.sonatype.org/content/repositories/releases/javax/servlet/servlet-api/2.3/servlet-api-2.3.pom
Downloading: https://repo.eclipse.org/content/repositories/cbi-releases/javax/servlet/servlet-api/2.3/servlet-api-2.3.pom
Downloading: https://repo.maven.apache.org/maven2/javax/servlet/servlet-api/2.3/servlet-api-2.3.pom
Downloaded: https://repo.maven.apache.org/maven2/javax/servlet/servlet-api/2.3/servlet-api-2.3.pom (156 B at 1.6 KB/sec)
Downloading: https://oss.sonatype.org/content/repositories/releases/commons-chain/commons-chain/1.1/commons-chain-1.1.pom
Downloading: https://repo.eclipse.org/content/repositories/cbi-releases/commons-chain/commons-chain/1.1/commons-chain-1.1.pom
Downloading: https://repo.maven.apache.org/maven2/commons-chain/commons-chain/1.1/commons-chain-1.1.pom
Downloaded: https://repo.maven.apache.org/maven2/commons-chain/commons-chain/1.1/commons-chain-1.1.pom (6 KB at 61.2 KB/sec)
Downloading: https://oss.sonatype.org/content/repositories/releases/commons-validator/commons-validator/1.3.1/commons-validator-1.3.1.pom
Downloading: https://repo.eclipse.org/content/repositories/cbi-releases/commons-validator/commons-validator/1.3.1/commons-validator-1.3.1.pom
Downloading: https://repo.maven.apache.org/maven2/commons-validator/commons-validator/1.3.1/commons-validator-1.3.1.pom
Downloaded: https://repo.maven.apache.org/maven2/commons-validator/commons-validator/1.3.1/commons-validator-1.3.1.pom (9 KB at 89.9 KB/sec)
Downloading: https://oss.sonatype.org/content/repositories/releases/dom4j/dom4j/1.1/dom4j-1.1.pom
Downloading: https://repo.eclipse.org/content/repositories/cbi-releases/dom4j/dom4j/1.1/dom4j-1.1.pom
Downloading: https://repo.maven.apache.org/maven2/dom4j/dom4j/1.1/dom4j-1.1.pom
Downloaded: https://repo.maven.apache.org/maven2/dom4j/dom4j/1.1/dom4j-1.1.pom (142 B at 1.5 KB/sec)
Downloading: https://oss.sonatype.org/content/repositories/releases/sslext/sslext/1.2-0/sslext-1.2-0.pom
Downloading: https://repo.eclipse.org/content/repositories/cbi-releases/sslext/sslext/1.2-0/sslext-1.2-0.pom
Downloading: https://repo.maven.apache.org/maven2/sslext/sslext/1.2-0/sslext-1.2-0.pom
Downloaded: https://repo.maven.apache.org/maven2/sslext/sslext/1.2-0/sslext-1.2-0.pom (653 B at 6.6 KB/sec)
Downloading: https://oss.sonatype.org/content/repositories/releases/org/apache/struts/struts-core/1.3.8/struts-core-1.3.8.pom
Downloading: https://repo.eclipse.org/content/repositories/cbi-releases/org/apache/struts/struts-core/1.3.8/struts-core-1.3.8.pom
Downloading: https://repo.maven.apache.org/maven2/org/apache/struts/struts-core/1.3.8/struts-core-1.3.8.pom
Downloaded: https://repo.maven.apache.org/maven2/org/apache/struts/struts-core/1.3.8/struts-core-1.3.8.pom (5 KB at 44.3 KB/sec)
Downloading: https://oss.sonatype.org/content/repositories/releases/org/apache/struts/struts-parent/1.3.8/struts-parent-1.3.8.pom
Downloading: https://repo.eclipse.org/content/repositories/cbi-releases/org/apache/struts/struts-parent/1.3.8/struts-parent-1.3.8.pom
Downloading: https://repo.maven.apache.org/maven2/org/apache/struts/struts-parent/1.3.8/struts-parent-1.3.8.pom
Downloaded: https://repo.maven.apache.org/maven2/org/apache/struts/struts-parent/1.3.8/struts-parent-1.3.8.pom (10 KB at 97.1 KB/sec)
Downloading: https://oss.sonatype.org/content/repositories/releases/org/apache/struts/struts-master/4/struts-master-4.pom
Downloading: https://repo.eclipse.org/content/repositories/cbi-releases/org/apache/struts/struts-master/4/struts-master-4.pom
Downloading: https://repo.maven.apache.org/maven2/org/apache/struts/struts-master/4/struts-master-4.pom
Downloaded: https://repo.maven.apache.org/maven2/org/apache/struts/struts-master/4/struts-master-4.pom (12 KB at 115.5 KB/sec)
Downloading: https://oss.sonatype.org/content/repositories/releases/org/apache/apache/2/apache-2.pom
Downloading: https://repo.eclipse.org/content/repositories/cbi-releases/org/apache/apache/2/apache-2.pom
Downloading: https://repo.maven.apache.org/maven2/org/apache/apache/2/apache-2.pom
Downloaded: https://repo.maven.apache.org/maven2/org/apache/apache/2/apache-2.pom (4 KB at 35.0 KB/sec)
Downloading: https://oss.sonatype.org/content/repositories/releases/antlr/antlr/2.7.2/antlr-2.7.2.pom
Downloading: https://repo.eclipse.org/content/repositories/cbi-releases/antlr/antlr/2.7.2/antlr-2.7.2.pom
Downloading: https://repo.maven.apache.org/maven2/antlr/antlr/2.7.2/antlr-2.7.2.pom
Downloaded: https://repo.maven.apache.org/maven2/antlr/antlr/2.7.2/antlr-2.7.2.pom (145 B at 1.5 KB/sec)
Downloading: https://oss.sonatype.org/content/repositories/releases/org/apache/struts/struts-taglib/1.3.8/struts-taglib-1.3.8.pom
Downloading: https://repo.eclipse.org/content/repositories/cbi-releases/org/apache/struts/struts-taglib/1.3.8/struts-taglib-1.3.8.pom
Downloading: https://repo.maven.apache.org/maven2/org/apache/struts/struts-taglib/1.3.8/struts-taglib-1.3.8.pom
Downloaded: https://repo.maven.apache.org/maven2/org/apache/struts/struts-taglib/1.3.8/struts-taglib-1.3.8.pom (4 KB at 31.3 KB/sec)
Downloading: https://oss.sonatype.org/content/repositories/releases/org/apache/struts/struts-tiles/1.3.8/struts-tiles-1.3.8.pom
Downloading: https://repo.eclipse.org/content/repositories/cbi-releases/org/apache/struts/struts-tiles/1.3.8/struts-tiles-1.3.8.pom
Downloading: https://repo.maven.apache.org/maven2/org/apache/struts/struts-tiles/1.3.8/struts-tiles-1.3.8.pom
Downloaded: https://repo.maven.apache.org/maven2/org/apache/struts/struts-tiles/1.3.8/struts-tiles-1.3.8.pom (3 KB at 29.6 KB/sec)
Downloading: https://oss.sonatype.org/content/repositories/releases/org/apache/velocity/velocity/1.6.2/velocity-1.6.2.pom
Downloading: https://repo.eclipse.org/content/repositories/cbi-releases/org/apache/velocity/velocity/1.6.2/velocity-1.6.2.pom
Downloading: https://repo.maven.apache.org/maven2/org/apache/velocity/velocity/1.6.2/velocity-1.6.2.pom
Downloaded: https://repo.maven.apache.org/maven2/org/apache/velocity/velocity/1.6.2/velocity-1.6.2.pom (11 KB at 105.8 KB/sec)
Downloading: https://oss.sonatype.org/content/repositories/releases/commons-collections/commons-collections/3.2.1/commons-collections-3.2.1.pom
Downloading: https://repo.eclipse.org/content/repositories/cbi-releases/commons-collections/commons-collections/3.2.1/commons-collections-3.2.1.pom
Downloading: https://repo.maven.apache.org/maven2/commons-collections/commons-collections/3.2.1/commons-collections-3.2.1.pom
Downloaded: https://repo.maven.apache.org/maven2/commons-collections/commons-collections/3.2.1/commons-collections-3.2.1.pom (13 KB at 123.4 KB/sec)
Downloading: https://oss.sonatype.org/content/repositories/releases/org/apache/maven/shared/maven-doxia-tools/1.2.1/maven-doxia-tools-1.2.1.pom
Downloading: https://repo.eclipse.org/content/repositories/cbi-releases/org/apache/maven/shared/maven-doxia-tools/1.2.1/maven-doxia-tools-1.2.1.pom
Downloading: https://repo.maven.apache.org/maven2/org/apache/maven/shared/maven-doxia-tools/1.2.1/maven-doxia-tools-1.2.1.pom
Downloaded: https://repo.maven.apache.org/maven2/org/apache/maven/shared/maven-doxia-tools/1.2.1/maven-doxia-tools-1.2.1.pom (7 KB at 63.5 KB/sec)
Downloading: https://oss.sonatype.org/content/repositories/releases/commons-io/commons-io/1.4/commons-io-1.4.pom
Downloading: https://repo.eclipse.org/content/repositories/cbi-releases/commons-io/commons-io/1.4/commons-io-1.4.pom
Downloading: https://repo.maven.apache.org/maven2/commons-io/commons-io/1.4/commons-io-1.4.pom
Downloaded: https://repo.maven.apache.org/maven2/commons-io/commons-io/1.4/commons-io-1.4.pom (13 KB at 129.9 KB/sec)
Downloading: https://oss.sonatype.org/content/repositories/releases/org/apache/commons/commons-parent/7/commons-parent-7.pom
Downloading: https://repo.eclipse.org/content/repositories/cbi-releases/org/apache/commons/commons-parent/7/commons-parent-7.pom
Downloading: https://repo.maven.apache.org/maven2/org/apache/commons/commons-parent/7/commons-parent-7.pom
Downloaded: https://repo.maven.apache.org/maven2/org/apache/commons/commons-parent/7/commons-parent-7.pom (18 KB at 169.2 KB/sec)
Downloading: https://oss.sonatype.org/content/repositories/releases/org/apache/maven/doxia/doxia-logging-api/1.1.3/doxia-logging-api-1.1.3.pom
Downloading: https://repo.eclipse.org/content/repositories/cbi-releases/org/apache/maven/doxia/doxia-logging-api/1.1.3/doxia-logging-api-1.1.3.pom
Downloading: https://repo.maven.apache.org/maven2/org/apache/maven/doxia/doxia-logging-api/1.1.3/doxia-logging-api-1.1.3.pom
Downloaded: https://repo.maven.apache.org/maven2/org/apache/maven/doxia/doxia-logging-api/1.1.3/doxia-logging-api-1.1.3.pom (2 KB at 16.4 KB/sec)
Downloading: https://oss.sonatype.org/content/repositories/releases/org/apache/maven/doxia/doxia/1.1.3/doxia-1.1.3.pom
Downloading: https://repo.eclipse.org/content/repositories/cbi-releases/org/apache/maven/doxia/doxia/1.1.3/doxia-1.1.3.pom
Downloading: https://repo.maven.apache.org/maven2/org/apache/maven/doxia/doxia/1.1.3/doxia-1.1.3.pom
Downloaded: https://repo.maven.apache.org/maven2/org/apache/maven/doxia/doxia/1.1.3/doxia-1.1.3.pom (19 KB at 173.0 KB/sec)
Downloading: https://oss.sonatype.org/content/repositories/releases/org/apache/maven/doxia/doxia-decoration-model/1.1.3/doxia-decoration-model-1.1.3.pom
Downloading: https://repo.eclipse.org/content/repositories/cbi-releases/org/apache/maven/doxia/doxia-decoration-model/1.1.3/doxia-decoration-model-1.1.3.pom
Downloading: https://repo.maven.apache.org/maven2/org/apache/maven/doxia/doxia-decoration-model/1.1.3/doxia-decoration-model-1.1.3.pom
Downloaded: https://repo.maven.apache.org/maven2/org/apache/maven/doxia/doxia-decoration-model/1.1.3/doxia-decoration-model-1.1.3.pom (3 KB at 30.9 KB/sec)
Downloading: https://oss.sonatype.org/content/repositories/releases/org/apache/maven/doxia/doxia-sitetools/1.1.3/doxia-sitetools-1.1.3.pom
Downloading: https://repo.eclipse.org/content/repositories/cbi-releases/org/apache/maven/doxia/doxia-sitetools/1.1.3/doxia-sitetools-1.1.3.pom
Downloading: https://repo.maven.apache.org/maven2/org/apache/maven/doxia/doxia-sitetools/1.1.3/doxia-sitetools-1.1.3.pom
Downloaded: https://repo.maven.apache.org/maven2/org/apache/maven/doxia/doxia-sitetools/1.1.3/doxia-sitetools-1.1.3.pom (16 KB at 152.2 KB/sec)
Downloading: https://oss.sonatype.org/content/repositories/releases/org/codehaus/plexus/plexus-resources/1.0-alpha-7/plexus-resources-1.0-alpha-7.pom
Downloading: https://repo.eclipse.org/content/repositories/cbi-releases/org/codehaus/plexus/plexus-resources/1.0-alpha-7/plexus-resources-1.0-alpha-7.pom
Downloading: https://repo.maven.apache.org/maven2/org/codehaus/plexus/plexus-resources/1.0-alpha-7/plexus-resources-1.0-alpha-7.pom
Downloaded: https://repo.maven.apache.org/maven2/org/codehaus/plexus/plexus-resources/1.0-alpha-7/plexus-resources-1.0-alpha-7.pom (2 KB at 14.0 KB/sec)
Downloading: https://oss.sonatype.org/content/repositories/releases/org/codehaus/plexus/plexus-components/1.1.17/plexus-components-1.1.17.pom
Downloading: https://repo.eclipse.org/content/repositories/cbi-releases/org/codehaus/plexus/plexus-components/1.1.17/plexus-components-1.1.17.pom
Downloading: https://repo.maven.apache.org/maven2/org/codehaus/plexus/plexus-components/1.1.17/plexus-components-1.1.17.pom
Downloaded: https://repo.maven.apache.org/maven2/org/codehaus/plexus/plexus-components/1.1.17/plexus-components-1.1.17.pom (6 KB at 53.6 KB/sec)
Downloading: https://oss.sonatype.org/content/repositories/releases/org/sonatype/plexus/plexus-build-api/0.0.7/plexus-build-api-0.0.7.pom
Downloading: https://repo.eclipse.org/content/repositories/cbi-releases/org/sonatype/plexus/plexus-build-api/0.0.7/plexus-build-api-0.0.7.pom
Downloading: https://repo.maven.apache.org/maven2/org/sonatype/plexus/plexus-build-api/0.0.7/plexus-build-api-0.0.7.pom
Downloaded: https://repo.maven.apache.org/maven2/org/sonatype/plexus/plexus-build-api/0.0.7/plexus-build-api-0.0.7.pom (4 KB at 32.9 KB/sec)
[INFO] ------------------------------------------------------------------------
[INFO] Reactor Summary:
[INFO] 
[INFO] EMF Parsley ........................................ SUCCESS [ 21.946 s]
[INFO] org.eclipse.emf.parsley.targetplatform ............. SUCCESS [ 11.012 s]
[INFO] org.eclipse.emf.parsley.runtime.common ............. FAILURE [01:16 min]
[INFO] org.eclipse.emf.parsley.common ..................... SKIPPED
[INFO] org.eclipse.emf.parsley.views.common ............... SKIPPED
[INFO] org.eclipse.emf.parsley.cdo.common ................. SKIPPED
[INFO] org.eclipse.emf.parsley.runtime .................... SKIPPED
[INFO] org.eclipse.emf.parsley ............................ SKIPPED
[INFO] org.eclipse.emf.parsley.junit4 ..................... SKIPPED
[INFO] org.eclipse.emf.parsley.web.servlets ............... SKIPPED
[INFO] org.eclipse.emf.parsley.generator.common ........... SKIPPED
[INFO] org.eclipse.emf.parsley.dsl ........................ SKIPPED
[INFO] org.eclipse.emf.parsley.dsl.additional.builder ..... SKIPPED
[INFO] org.eclipse.emf.parsley.web.tools .................. SKIPPED
[INFO] org.eclipse.emf.parsley.tests.models ............... SKIPPED
[INFO] org.eclipse.emf.parsley.examples.library ........... SKIPPED
[INFO] org.eclipse.emf.parsley.tests ...................... SKIPPED
[INFO] org.eclipse.emf.parsley.views ...................... SKIPPED
[INFO] org.eclipse.emf.parsley.tests.views ................ SKIPPED
[INFO] org.eclipse.emf.parsley.cdo ........................ SKIPPED
[INFO] org.eclipse.emf.parsley.editors.common ............. SKIPPED
[INFO] org.eclipse.emf.parsley.editors .................... SKIPPED
[INFO] org.eclipse.emf.parsley.cdo.tests .................. SKIPPED
[INFO] org.eclipse.emf.parsley.wizards .................... SKIPPED
[INFO] org.eclipse.emf.parsley.ui.examples ................ SKIPPED
[INFO] org.eclipse.emf.parsley.doc ........................ SKIPPED
[INFO] org.eclipse.emf.parsley.feature .................... SKIPPED
[INFO] org.eclipse.emf.parsley.cdo.feature ................ SKIPPED
[INFO] org.eclipse.emf.parsley.dsl.ide .................... SKIPPED
[INFO] org.eclipse.emf.parsley.dsl.ui ..................... SKIPPED
[INFO] org.eclipse.emf.parsley.dsl.feature ................ SKIPPED
[INFO] org.eclipse.emf.parsley.examples.feature ........... SKIPPED
[INFO] org.eclipse.emf.parsley.dsl.tests .................. SKIPPED
[INFO] org.eclipse.emf.parsley.tests.pde.utils ............ SKIPPED
[INFO] org.eclipse.emf.parsley.dsl.ui.tests ............... SKIPPED
[INFO] org.eclipse.emf.parsley.junit4.feature ............. SKIPPED
[INFO] org.eclipse.emf.parsley.sdk ........................ SKIPPED
[INFO] org.eclipse.emf.parsley.web.feature ................ SKIPPED
[INFO] org.eclipse.emf.parsley.examples.library.edit ...... SKIPPED
[INFO] org.eclipse.emf.parsley.examples.library.editor .... SKIPPED
[INFO] org.eclipse.emf.parsley.examples.views ............. SKIPPED
[INFO] org.eclipse.emf.parsley.examples.editors ........... SKIPPED
[INFO] org.eclipse.emf.parsley.tests.swtbot.feature ....... SKIPPED
[INFO] org.eclipse.emf.parsley.tests.swtbot ............... SKIPPED
[INFO] org.eclipse.emf.parsley.examples.cdo.server ........ SKIPPED
[INFO] org.eclipse.emf.parsley.examples.cdo.model ......... SKIPPED
[INFO] org.eclipse.emf.parsley.examples.cdo.treeform ...... SKIPPED
[INFO] org.eclipse.emf.parsley.tests.swtbot.cdo.feature ... SKIPPED
[INFO] org.eclipse.emf.parsley.tests.swtbot.cdo ........... SKIPPED
[INFO] org.eclipse.emf.parsley.examples.mail.model ........ SKIPPED
[INFO] org.eclipse.emf.parsley.examples.mail.accountsview . SKIPPED
[INFO] org.eclipse.emf.parsley.examples.mail.mailsview .... SKIPPED
[INFO] org.eclipse.emf.parsley.examples.mail.messageview .. SKIPPED
[INFO] org.eclipse.emf.parsley.examples.mail.rcp .......... SKIPPED
[INFO] org.eclipse.emf.parsley.examples.mail.product.feature SKIPPED
[INFO] org.eclipse.emf.parsley.tests.swtbot.examples ...... SKIPPED
[INFO] org.eclipse.emf.parsley.repository ................. SKIPPED
[INFO] org.eclipse.emf.parsley.examples.eclipse4 .......... SKIPPED
[INFO] org.eclipse.emf.parsley.examples.eclipse4.parsleypart SKIPPED
[INFO] org.eclipse.emf.parsley.examples.eclipse4.product.feature SKIPPED
[INFO] org.eclipse.emf.parsley.tests.swtbot.e4 ............ SKIPPED
[INFO] ------------------------------------------------------------------------
[INFO] BUILD FAILURE
[INFO] ------------------------------------------------------------------------
[INFO] Total time: 04:43 min
[INFO] Finished at: 2016-11-18T07:15:53-05:00
[INFO] Final Memory: 130M/489M
[INFO] ------------------------------------------------------------------------
[INFO] o.h.m.e.h.MavenExecutionResultHandler - Build failed with exception(s)
[INFO] o.h.m.e.h.MavenExecutionResultHandler - [1] org.apache.maven.lifecycle.LifecycleExecutionException: Failed to execute goal org.codehaus.mojo:findbugs-maven-plugin:3.0.1:findbugs (findbugs) on project org.eclipse.emf.parsley.runtime.common: Execution findbugs of goal org.codehaus.mojo:findbugs-maven-plugin:3.0.1:findbugs failed: Plugin org.codehaus.mojo:findbugs-maven-plugin:3.0.1 or one of its dependencies could not be resolved: Failed to collect dependencies at org.codehaus.mojo:findbugs-maven-plugin:jar:3.0.1 -> org.codehaus.gmavenplus:gmavenplus-plugin:jar:1.3 -> org.fusesource.jansi:jansi:jar:1.11
[DEBUG] Closing connection to remote
[ERROR] Failed to execute goal org.codehaus.mojo:findbugs-maven-plugin:3.0.1:findbugs (findbugs) on project org.eclipse.emf.parsley.runtime.common: Execution findbugs of goal org.codehaus.mojo:findbugs-maven-plugin:3.0.1:findbugs failed: Plugin org.codehaus.mojo:findbugs-maven-plugin:3.0.1 or one of its dependencies could not be resolved: Failed to collect dependencies at org.codehaus.mojo:findbugs-maven-plugin:jar:3.0.1 -> org.codehaus.gmavenplus:gmavenplus-plugin:jar:1.3 -> org.fusesource.jansi:jansi:jar:1.11: Failed to read artifact descriptor for org.fusesource.jansi:jansi:jar:1.11: Could not transfer artifact org.fusesource.jansi:jansi-project:pom:1.11 from/to central (https://repo.maven.apache.org/maven2): repo.maven.apache.org:443 failed to respond -> [Help 1]
[ERROR] 
[ERROR] To see the full stack trace of the errors, re-run Maven with the -e switch.
[ERROR] Re-run Maven using the -X switch to enable full debug logging.
[ERROR] 
[ERROR] For more information about the errors and possible solutions, please read the following articles:
[ERROR] [Help 1] http://cwiki.apache.org/confluence/display/MAVEN/PluginResolutionException
[ERROR] 
[ERROR] After correcting the problems, you can resume the build with the command
[ERROR]   mvn <goals> -rf :org.eclipse.emf.parsley.runtime.common
[DEBUG] Waiting for process to finish
[DEBUG] Result: 1
Finished: FAILURE