FailedConsole Output

Skipping 231 KB.. Full Log
1.5.1:package-feature (default-package-feature) @ org.eclipse.egit.mylyn ---
[INFO] Building jar: /home/jenkins/agent/workspace/egit-stable/repo/org.eclipse.egit.mylyn-feature/target/org.eclipse.egit.mylyn-5.6.0-SNAPSHOT.jar
[INFO] 
[INFO] --- tycho-p2-plugin:1.5.1:p2-metadata-default (default-p2-metadata-default) @ org.eclipse.egit.mylyn ---
[INFO] 
[INFO] --- tycho-p2-plugin:1.5.1:feature-p2-metadata (default-feature-p2-metadata) @ org.eclipse.egit.mylyn ---
[INFO] 
[INFO] >>> spotbugs-maven-plugin:3.1.11:check (default) > :spotbugs @ org.eclipse.egit.mylyn >>>
[INFO] 
[INFO] --- spotbugs-maven-plugin:3.1.11:spotbugs (spotbugs) @ org.eclipse.egit.mylyn ---
[INFO] 
[INFO] <<< spotbugs-maven-plugin:3.1.11:check (default) < :spotbugs @ org.eclipse.egit.mylyn <<<
[INFO] 
[INFO] 
[INFO] --- spotbugs-maven-plugin:3.1.11:check (default) @ org.eclipse.egit.mylyn ---
[INFO] 
[INFO] >>> maven-pmd-plugin:3.11.0:cpd-check (default) > :cpd @ org.eclipse.egit.mylyn >>>
[INFO] 
[INFO] --- maven-pmd-plugin:3.11.0:cpd (cpd) @ org.eclipse.egit.mylyn ---
[INFO] 
[INFO] <<< maven-pmd-plugin:3.11.0:cpd-check (default) < :cpd @ org.eclipse.egit.mylyn <<<
[INFO] 
[INFO] 
[INFO] --- maven-pmd-plugin:3.11.0:cpd-check (default) @ org.eclipse.egit.mylyn ---
[INFO] 
[INFO] 
[INFO] --- tycho-pack200a-plugin:1.5.1:normalize (pack200-normalize) @ org.eclipse.egit.mylyn ---
[INFO] 
[INFO] --- eclipse-jarsigner-plugin:1.1.5:sign (sign) @ org.eclipse.egit.mylyn ---
[INFO] Signing jar: /home/jenkins/agent/workspace/egit-stable/repo/org.eclipse.egit.mylyn-feature/target/org.eclipse.egit.mylyn-5.6.0-SNAPSHOT.jar
[INFO] 
[INFO] --- tycho-pack200b-plugin:1.5.1:pack (pack200-pack) @ org.eclipse.egit.mylyn ---
[INFO] 
[INFO] --- tycho-p2-plugin:1.5.1:p2-metadata (p2-metadata) @ org.eclipse.egit.mylyn ---
[INFO] 
[INFO] --- maven-install-plugin:2.3.1:install (default-install) @ org.eclipse.egit.mylyn ---
[INFO] Installing /home/jenkins/agent/workspace/egit-stable/repo/org.eclipse.egit.mylyn-feature/target/org.eclipse.egit.mylyn-5.6.0-SNAPSHOT.jar to /home/jenkins/agent/workspace/egit-stable/.repository/org/eclipse/egit/feature/org.eclipse.egit.mylyn/5.6.0-SNAPSHOT/org.eclipse.egit.mylyn-5.6.0-SNAPSHOT.jar
[INFO] Installing /home/jenkins/agent/workspace/egit-stable/repo/org.eclipse.egit.mylyn-feature/pom.xml to /home/jenkins/agent/workspace/egit-stable/.repository/org/eclipse/egit/feature/org.eclipse.egit.mylyn/5.6.0-SNAPSHOT/org.eclipse.egit.mylyn-5.6.0-SNAPSHOT.pom
[INFO] Installing /home/jenkins/agent/workspace/egit-stable/repo/org.eclipse.egit.mylyn-feature/target/p2content.xml to /home/jenkins/agent/workspace/egit-stable/.repository/org/eclipse/egit/feature/org.eclipse.egit.mylyn/5.6.0-SNAPSHOT/org.eclipse.egit.mylyn-5.6.0-SNAPSHOT-p2metadata.xml
[INFO] Installing /home/jenkins/agent/workspace/egit-stable/repo/org.eclipse.egit.mylyn-feature/target/p2artifacts.xml to /home/jenkins/agent/workspace/egit-stable/.repository/org/eclipse/egit/feature/org.eclipse.egit.mylyn/5.6.0-SNAPSHOT/org.eclipse.egit.mylyn-5.6.0-SNAPSHOT-p2artifacts.xml
[INFO] 
[INFO] --- tycho-p2-plugin:1.5.1:update-local-index (default-update-local-index) @ org.eclipse.egit.mylyn ---
[INFO] 
[INFO] -------------< org.eclipse.egit:org.eclipse.egit.gitflow >--------------
[INFO] Building Git Flow 5.6.0-SNAPSHOT                                 [10/19]
[INFO] ---------------------------[ eclipse-plugin ]---------------------------
[INFO] 
[INFO] --- maven-clean-plugin:2.5:clean (default-clean) @ org.eclipse.egit.gitflow ---
[INFO] 
[INFO] --- tycho-packaging-plugin:1.5.1:build-qualifier (default-build-qualifier) @ org.eclipse.egit.gitflow ---
[INFO] The project's OSGi version is 5.6.0.201911282123
[INFO] 
[INFO] --- tycho-packaging-plugin:1.5.1:validate-id (default-validate-id) @ org.eclipse.egit.gitflow ---
[INFO] 
[INFO] --- tycho-packaging-plugin:1.5.1:validate-version (default-validate-version) @ org.eclipse.egit.gitflow ---
[INFO] 
[INFO] --- maven-enforcer-plugin:3.0.0-M2:enforce (enforce-maven) @ org.eclipse.egit.gitflow ---
[INFO] 
[INFO] --- maven-resources-plugin:2.4.3:resources (default-resources) @ org.eclipse.egit.gitflow ---
[INFO] Using 'UTF-8' encoding to copy filtered resources.
[INFO] skip non existing resourceDirectory /home/jenkins/agent/workspace/egit-stable/repo/org.eclipse.egit.gitflow/src/main/resources
[INFO] 
[INFO] --- tycho-compiler-plugin:1.5.1:compile (default-compile) @ org.eclipse.egit.gitflow ---
[INFO] Compiling 25 source files to /home/jenkins/agent/workspace/egit-stable/repo/org.eclipse.egit.gitflow/target/classes
[INFO] 
[INFO] --- maven-resources-plugin:2.4.3:testResources (default-testResources) @ org.eclipse.egit.gitflow ---
[INFO] Using 'UTF-8' encoding to copy filtered resources.
[INFO] skip non existing resourceDirectory /home/jenkins/agent/workspace/egit-stable/repo/org.eclipse.egit.gitflow/src/test/resources
[INFO] 
[INFO] --- tycho-source-plugin:1.5.1:plugin-source (attach-source) @ org.eclipse.egit.gitflow ---
[INFO] Building jar: /home/jenkins/agent/workspace/egit-stable/repo/org.eclipse.egit.gitflow/target/org.eclipse.egit.gitflow-5.6.0-SNAPSHOT-sources.jar
[INFO] 
[INFO] --- target-platform-configuration:1.5.1:target-platform (default-target-platform) @ org.eclipse.egit.gitflow ---
[INFO] 
[INFO] --- tycho-packaging-plugin:1.5.1:package-plugin (default-package-plugin) @ org.eclipse.egit.gitflow ---
[INFO] Building jar: /home/jenkins/agent/workspace/egit-stable/repo/org.eclipse.egit.gitflow/target/org.eclipse.egit.gitflow-5.6.0-SNAPSHOT.jar
[INFO] 
[INFO] --- tycho-p2-plugin:1.5.1:p2-metadata-default (default-p2-metadata-default) @ org.eclipse.egit.gitflow ---
[INFO] 
[INFO] >>> spotbugs-maven-plugin:3.1.11:check (default) > :spotbugs @ org.eclipse.egit.gitflow >>>
[INFO] 
[INFO] --- spotbugs-maven-plugin:3.1.11:spotbugs (spotbugs) @ org.eclipse.egit.gitflow ---
[INFO] Fork Value is true
     [java] Picked up JAVA_TOOL_OPTIONS: -XX:+IgnoreUnrecognizedVMOptions -XX:+UseContainerSupport -XX:+UnlockExperimentalVMOptions -XX:+UseCGroupMemoryLimitForHeap
     [java] Picked up _JAVA_OPTIONS: -XX:MaxRAMPercentage=64.0
     [java] Warnings generated: 2
[INFO] Done SpotBugs Analysis....
[INFO] 
[INFO] <<< spotbugs-maven-plugin:3.1.11:check (default) < :spotbugs @ org.eclipse.egit.gitflow <<<
[INFO] 
[INFO] 
[INFO] --- spotbugs-maven-plugin:3.1.11:check (default) @ org.eclipse.egit.gitflow ---
[INFO] BugInstance size is 2
[INFO] Error size is 0
[INFO] Total bugs: 2
[ERROR] Write to static field org.eclipse.egit.gitflow.Activator.context from instance method org.eclipse.egit.gitflow.Activator.start(BundleContext) [org.eclipse.egit.gitflow.Activator] At Activator.java:[line 35] ST_WRITE_TO_STATIC_FROM_INSTANCE_METHOD
[ERROR] Write to static field org.eclipse.egit.gitflow.Activator.context from instance method org.eclipse.egit.gitflow.Activator.stop(BundleContext) [org.eclipse.egit.gitflow.Activator] At Activator.java:[line 41] ST_WRITE_TO_STATIC_FROM_INSTANCE_METHOD
[INFO] 


To see bug detail using the Spotbugs GUI, use the following command "mvn spotbugs:gui"



[INFO] 
[INFO] >>> maven-pmd-plugin:3.11.0:cpd-check (default) > :cpd @ org.eclipse.egit.gitflow >>>
[INFO] 
[INFO] --- maven-pmd-plugin:3.11.0:cpd (cpd) @ org.eclipse.egit.gitflow ---
[INFO] 
[INFO] <<< maven-pmd-plugin:3.11.0:cpd-check (default) < :cpd @ org.eclipse.egit.gitflow <<<
[INFO] 
[INFO] 
[INFO] --- maven-pmd-plugin:3.11.0:cpd-check (default) @ org.eclipse.egit.gitflow ---
[INFO] 
[INFO] 
[INFO] --- tycho-pack200a-plugin:1.5.1:normalize (pack200-normalize) @ org.eclipse.egit.gitflow ---
[INFO] Pack200 normalizing jar /home/jenkins/agent/workspace/egit-stable/repo/org.eclipse.egit.gitflow/target/org.eclipse.egit.gitflow-5.6.0-SNAPSHOT.jar
[INFO] 
[INFO] --- eclipse-jarsigner-plugin:1.1.5:sign (sign) @ org.eclipse.egit.gitflow ---
[INFO] Signing jar: /home/jenkins/agent/workspace/egit-stable/repo/org.eclipse.egit.gitflow/target/org.eclipse.egit.gitflow-5.6.0-SNAPSHOT.jar
[INFO] Signing jar: /home/jenkins/agent/workspace/egit-stable/repo/org.eclipse.egit.gitflow/target/org.eclipse.egit.gitflow-5.6.0-SNAPSHOT-sources.jar
[INFO] 
[INFO] --- tycho-pack200b-plugin:1.5.1:pack (pack200-pack) @ org.eclipse.egit.gitflow ---
[INFO] Pack200 packing jar /home/jenkins/agent/workspace/egit-stable/repo/org.eclipse.egit.gitflow/target/org.eclipse.egit.gitflow-5.6.0-SNAPSHOT.jar
[INFO] 
[INFO] --- tycho-p2-plugin:1.5.1:p2-metadata (p2-metadata) @ org.eclipse.egit.gitflow ---
[INFO] 
[INFO] --- maven-install-plugin:2.3.1:install (default-install) @ org.eclipse.egit.gitflow ---
[INFO] Installing /home/jenkins/agent/workspace/egit-stable/repo/org.eclipse.egit.gitflow/target/org.eclipse.egit.gitflow-5.6.0-SNAPSHOT.jar to /home/jenkins/agent/workspace/egit-stable/.repository/org/eclipse/egit/org.eclipse.egit.gitflow/5.6.0-SNAPSHOT/org.eclipse.egit.gitflow-5.6.0-SNAPSHOT.jar
[INFO] Installing /home/jenkins/agent/workspace/egit-stable/repo/org.eclipse.egit.gitflow/pom.xml to /home/jenkins/agent/workspace/egit-stable/.repository/org/eclipse/egit/org.eclipse.egit.gitflow/5.6.0-SNAPSHOT/org.eclipse.egit.gitflow-5.6.0-SNAPSHOT.pom
[INFO] Installing /home/jenkins/agent/workspace/egit-stable/repo/org.eclipse.egit.gitflow/target/org.eclipse.egit.gitflow-5.6.0-SNAPSHOT-sources.jar to /home/jenkins/agent/workspace/egit-stable/.repository/org/eclipse/egit/org.eclipse.egit.gitflow/5.6.0-SNAPSHOT/org.eclipse.egit.gitflow-5.6.0-SNAPSHOT-sources.jar
[INFO] Installing /home/jenkins/agent/workspace/egit-stable/repo/org.eclipse.egit.gitflow/target/org.eclipse.egit.gitflow-5.6.0-SNAPSHOT.jar.pack.gz to /home/jenkins/agent/workspace/egit-stable/.repository/org/eclipse/egit/org.eclipse.egit.gitflow/5.6.0-SNAPSHOT/org.eclipse.egit.gitflow-5.6.0-SNAPSHOT-pack200.jar.pack.gz
[INFO] Installing /home/jenkins/agent/workspace/egit-stable/repo/org.eclipse.egit.gitflow/target/p2content.xml to /home/jenkins/agent/workspace/egit-stable/.repository/org/eclipse/egit/org.eclipse.egit.gitflow/5.6.0-SNAPSHOT/org.eclipse.egit.gitflow-5.6.0-SNAPSHOT-p2metadata.xml
[INFO] Installing /home/jenkins/agent/workspace/egit-stable/repo/org.eclipse.egit.gitflow/target/p2artifacts.xml to /home/jenkins/agent/workspace/egit-stable/.repository/org/eclipse/egit/org.eclipse.egit.gitflow/5.6.0-SNAPSHOT/org.eclipse.egit.gitflow-5.6.0-SNAPSHOT-p2artifacts.xml
[INFO] 
[INFO] --- tycho-p2-plugin:1.5.1:update-local-index (default-update-local-index) @ org.eclipse.egit.gitflow ---
[INFO] 
[INFO] ------------< org.eclipse.egit:org.eclipse.egit.gitflow.ui >------------
[INFO] Building Git Flow UI 5.6.0-SNAPSHOT                              [11/19]
[INFO] ---------------------------[ eclipse-plugin ]---------------------------
[INFO] 
[INFO] --- maven-clean-plugin:2.5:clean (default-clean) @ org.eclipse.egit.gitflow.ui ---
[INFO] 
[INFO] --- tycho-packaging-plugin:1.5.1:build-qualifier (default-build-qualifier) @ org.eclipse.egit.gitflow.ui ---
[INFO] The project's OSGi version is 5.6.0.201911282123
[INFO] 
[INFO] --- tycho-packaging-plugin:1.5.1:validate-id (default-validate-id) @ org.eclipse.egit.gitflow.ui ---
[INFO] 
[INFO] --- tycho-packaging-plugin:1.5.1:validate-version (default-validate-version) @ org.eclipse.egit.gitflow.ui ---
[INFO] 
[INFO] --- maven-enforcer-plugin:3.0.0-M2:enforce (enforce-maven) @ org.eclipse.egit.gitflow.ui ---
[INFO] 
[INFO] --- maven-resources-plugin:2.4.3:resources (default-resources) @ org.eclipse.egit.gitflow.ui ---
[INFO] Using 'UTF-8' encoding to copy filtered resources.
[INFO] skip non existing resourceDirectory /home/jenkins/agent/workspace/egit-stable/repo/org.eclipse.egit.gitflow.ui/src/main/resources
[INFO] 
[INFO] --- tycho-compiler-plugin:1.5.1:compile (default-compile) @ org.eclipse.egit.gitflow.ui ---
[INFO] Compiling 42 source files to /home/jenkins/agent/workspace/egit-stable/repo/org.eclipse.egit.gitflow.ui/target/classes
[INFO] 
[INFO] --- maven-resources-plugin:2.4.3:testResources (default-testResources) @ org.eclipse.egit.gitflow.ui ---
[INFO] Using 'UTF-8' encoding to copy filtered resources.
[INFO] skip non existing resourceDirectory /home/jenkins/agent/workspace/egit-stable/repo/org.eclipse.egit.gitflow.ui/src/test/resources
[INFO] 
[INFO] --- tycho-source-plugin:1.5.1:plugin-source (attach-source) @ org.eclipse.egit.gitflow.ui ---
[INFO] Building jar: /home/jenkins/agent/workspace/egit-stable/repo/org.eclipse.egit.gitflow.ui/target/org.eclipse.egit.gitflow.ui-5.6.0-SNAPSHOT-sources.jar
[INFO] 
[INFO] --- target-platform-configuration:1.5.1:target-platform (default-target-platform) @ org.eclipse.egit.gitflow.ui ---
[INFO] 
[INFO] --- tycho-packaging-plugin:1.5.1:package-plugin (default-package-plugin) @ org.eclipse.egit.gitflow.ui ---
[INFO] Building jar: /home/jenkins/agent/workspace/egit-stable/repo/org.eclipse.egit.gitflow.ui/target/org.eclipse.egit.gitflow.ui-5.6.0-SNAPSHOT.jar
[INFO] 
[INFO] --- tycho-p2-plugin:1.5.1:p2-metadata-default (default-p2-metadata-default) @ org.eclipse.egit.gitflow.ui ---
[INFO] 
[INFO] >>> spotbugs-maven-plugin:3.1.11:check (default) > :spotbugs @ org.eclipse.egit.gitflow.ui >>>
[INFO] 
[INFO] --- spotbugs-maven-plugin:3.1.11:spotbugs (spotbugs) @ org.eclipse.egit.gitflow.ui ---
[INFO] Fork Value is true
     [java] Picked up JAVA_TOOL_OPTIONS: -XX:+IgnoreUnrecognizedVMOptions -XX:+UseContainerSupport -XX:+UnlockExperimentalVMOptions -XX:+UseCGroupMemoryLimitForHeap
     [java] Picked up _JAVA_OPTIONS: -XX:MaxRAMPercentage=64.0
[INFO] Done SpotBugs Analysis....
[INFO] 
[INFO] <<< spotbugs-maven-plugin:3.1.11:check (default) < :spotbugs @ org.eclipse.egit.gitflow.ui <<<
[INFO] 
[INFO] 
[INFO] --- spotbugs-maven-plugin:3.1.11:check (default) @ org.eclipse.egit.gitflow.ui ---
[INFO] BugInstance size is 0
[INFO] Error size is 0
[INFO] No errors/warnings found
[INFO] 
[INFO] >>> maven-pmd-plugin:3.11.0:cpd-check (default) > :cpd @ org.eclipse.egit.gitflow.ui >>>
[INFO] 
[INFO] --- maven-pmd-plugin:3.11.0:cpd (cpd) @ org.eclipse.egit.gitflow.ui ---
[INFO] 
[INFO] <<< maven-pmd-plugin:3.11.0:cpd-check (default) < :cpd @ org.eclipse.egit.gitflow.ui <<<
[INFO] 
[INFO] 
[INFO] --- maven-pmd-plugin:3.11.0:cpd-check (default) @ org.eclipse.egit.gitflow.ui ---
[INFO] 
[INFO] 
[INFO] --- tycho-pack200a-plugin:1.5.1:normalize (pack200-normalize) @ org.eclipse.egit.gitflow.ui ---
[INFO] Pack200 normalizing jar /home/jenkins/agent/workspace/egit-stable/repo/org.eclipse.egit.gitflow.ui/target/org.eclipse.egit.gitflow.ui-5.6.0-SNAPSHOT.jar
[INFO] 
[INFO] --- eclipse-jarsigner-plugin:1.1.5:sign (sign) @ org.eclipse.egit.gitflow.ui ---
[INFO] Signing jar: /home/jenkins/agent/workspace/egit-stable/repo/org.eclipse.egit.gitflow.ui/target/org.eclipse.egit.gitflow.ui-5.6.0-SNAPSHOT.jar
[INFO] Signing jar: /home/jenkins/agent/workspace/egit-stable/repo/org.eclipse.egit.gitflow.ui/target/org.eclipse.egit.gitflow.ui-5.6.0-SNAPSHOT-sources.jar
[INFO] 
[INFO] --- tycho-pack200b-plugin:1.5.1:pack (pack200-pack) @ org.eclipse.egit.gitflow.ui ---
[INFO] Pack200 packing jar /home/jenkins/agent/workspace/egit-stable/repo/org.eclipse.egit.gitflow.ui/target/org.eclipse.egit.gitflow.ui-5.6.0-SNAPSHOT.jar
[INFO] 
[INFO] --- tycho-p2-plugin:1.5.1:p2-metadata (p2-metadata) @ org.eclipse.egit.gitflow.ui ---
[INFO] 
[INFO] --- maven-install-plugin:2.3.1:install (default-install) @ org.eclipse.egit.gitflow.ui ---
[INFO] Installing /home/jenkins/agent/workspace/egit-stable/repo/org.eclipse.egit.gitflow.ui/target/org.eclipse.egit.gitflow.ui-5.6.0-SNAPSHOT.jar to /home/jenkins/agent/workspace/egit-stable/.repository/org/eclipse/egit/org.eclipse.egit.gitflow.ui/5.6.0-SNAPSHOT/org.eclipse.egit.gitflow.ui-5.6.0-SNAPSHOT.jar
[INFO] Installing /home/jenkins/agent/workspace/egit-stable/repo/org.eclipse.egit.gitflow.ui/pom.xml to /home/jenkins/agent/workspace/egit-stable/.repository/org/eclipse/egit/org.eclipse.egit.gitflow.ui/5.6.0-SNAPSHOT/org.eclipse.egit.gitflow.ui-5.6.0-SNAPSHOT.pom
[INFO] Installing /home/jenkins/agent/workspace/egit-stable/repo/org.eclipse.egit.gitflow.ui/target/org.eclipse.egit.gitflow.ui-5.6.0-SNAPSHOT-sources.jar to /home/jenkins/agent/workspace/egit-stable/.repository/org/eclipse/egit/org.eclipse.egit.gitflow.ui/5.6.0-SNAPSHOT/org.eclipse.egit.gitflow.ui-5.6.0-SNAPSHOT-sources.jar
[INFO] Installing /home/jenkins/agent/workspace/egit-stable/repo/org.eclipse.egit.gitflow.ui/target/org.eclipse.egit.gitflow.ui-5.6.0-SNAPSHOT.jar.pack.gz to /home/jenkins/agent/workspace/egit-stable/.repository/org/eclipse/egit/org.eclipse.egit.gitflow.ui/5.6.0-SNAPSHOT/org.eclipse.egit.gitflow.ui-5.6.0-SNAPSHOT-pack200.jar.pack.gz
[INFO] Installing /home/jenkins/agent/workspace/egit-stable/repo/org.eclipse.egit.gitflow.ui/target/p2content.xml to /home/jenkins/agent/workspace/egit-stable/.repository/org/eclipse/egit/org.eclipse.egit.gitflow.ui/5.6.0-SNAPSHOT/org.eclipse.egit.gitflow.ui-5.6.0-SNAPSHOT-p2metadata.xml
[INFO] Installing /home/jenkins/agent/workspace/egit-stable/repo/org.eclipse.egit.gitflow.ui/target/p2artifacts.xml to /home/jenkins/agent/workspace/egit-stable/.repository/org/eclipse/egit/org.eclipse.egit.gitflow.ui/5.6.0-SNAPSHOT/org.eclipse.egit.gitflow.ui-5.6.0-SNAPSHOT-p2artifacts.xml
[INFO] 
[INFO] --- tycho-p2-plugin:1.5.1:update-local-index (default-update-local-index) @ org.eclipse.egit.gitflow.ui ---
[INFO] 
[INFO] -----< org.eclipse.egit.feature:org.eclipse.egit.gitflow.feature >------
[INFO] Building Eclipse EGit Gitflow Feature 5.6.0-SNAPSHOT             [12/19]
[INFO] --------------------------[ eclipse-feature ]---------------------------
[INFO] 
[INFO] --- maven-clean-plugin:2.5:clean (default-clean) @ org.eclipse.egit.gitflow.feature ---
[INFO] 
[INFO] --- tycho-packaging-plugin:1.5.1:build-qualifier-aggregator (default-build-qualifier-aggregator) @ org.eclipse.egit.gitflow.feature ---
[INFO] The project's OSGi version is 5.6.0.201911282123
[INFO] 
[INFO] --- tycho-packaging-plugin:1.5.1:validate-id (default-validate-id) @ org.eclipse.egit.gitflow.feature ---
[INFO] 
[INFO] --- tycho-packaging-plugin:1.5.1:validate-version (default-validate-version) @ org.eclipse.egit.gitflow.feature ---
[INFO] 
[INFO] --- maven-enforcer-plugin:3.0.0-M2:enforce (enforce-maven) @ org.eclipse.egit.gitflow.feature ---
[INFO] 
[INFO] --- target-platform-configuration:1.5.1:target-platform (default-target-platform) @ org.eclipse.egit.gitflow.feature ---
[INFO] 
[INFO] --- tycho-packaging-plugin:1.5.1:package-feature (default-package-feature) @ org.eclipse.egit.gitflow.feature ---
[INFO] Building jar: /home/jenkins/agent/workspace/egit-stable/repo/org.eclipse.egit.gitflow-feature/target/org.eclipse.egit.gitflow.feature-5.6.0-SNAPSHOT.jar
[INFO] 
[INFO] --- tycho-p2-plugin:1.5.1:p2-metadata-default (default-p2-metadata-default) @ org.eclipse.egit.gitflow.feature ---
[INFO] 
[INFO] --- tycho-p2-plugin:1.5.1:feature-p2-metadata (default-feature-p2-metadata) @ org.eclipse.egit.gitflow.feature ---
[INFO] 
[INFO] >>> spotbugs-maven-plugin:3.1.11:check (default) > :spotbugs @ org.eclipse.egit.gitflow.feature >>>
[INFO] 
[INFO] --- spotbugs-maven-plugin:3.1.11:spotbugs (spotbugs) @ org.eclipse.egit.gitflow.feature ---
[INFO] 
[INFO] <<< spotbugs-maven-plugin:3.1.11:check (default) < :spotbugs @ org.eclipse.egit.gitflow.feature <<<
[INFO] 
[INFO] 
[INFO] --- spotbugs-maven-plugin:3.1.11:check (default) @ org.eclipse.egit.gitflow.feature ---
[INFO] 
[INFO] >>> maven-pmd-plugin:3.11.0:cpd-check (default) > :cpd @ org.eclipse.egit.gitflow.feature >>>
[INFO] 
[INFO] --- maven-pmd-plugin:3.11.0:cpd (cpd) @ org.eclipse.egit.gitflow.feature ---
[INFO] 
[INFO] <<< maven-pmd-plugin:3.11.0:cpd-check (default) < :cpd @ org.eclipse.egit.gitflow.feature <<<
[INFO] 
[INFO] 
[INFO] --- maven-pmd-plugin:3.11.0:cpd-check (default) @ org.eclipse.egit.gitflow.feature ---
[INFO] 
[INFO] 
[INFO] --- tycho-pack200a-plugin:1.5.1:normalize (pack200-normalize) @ org.eclipse.egit.gitflow.feature ---
[INFO] 
[INFO] --- eclipse-jarsigner-plugin:1.1.5:sign (sign) @ org.eclipse.egit.gitflow.feature ---
[INFO] Signing jar: /home/jenkins/agent/workspace/egit-stable/repo/org.eclipse.egit.gitflow-feature/target/org.eclipse.egit.gitflow.feature-5.6.0-SNAPSHOT.jar
[INFO] 
[INFO] --- tycho-pack200b-plugin:1.5.1:pack (pack200-pack) @ org.eclipse.egit.gitflow.feature ---
[INFO] 
[INFO] --- tycho-p2-plugin:1.5.1:p2-metadata (p2-metadata) @ org.eclipse.egit.gitflow.feature ---
[INFO] 
[INFO] --- maven-install-plugin:2.3.1:install (default-install) @ org.eclipse.egit.gitflow.feature ---
[INFO] Installing /home/jenkins/agent/workspace/egit-stable/repo/org.eclipse.egit.gitflow-feature/target/org.eclipse.egit.gitflow.feature-5.6.0-SNAPSHOT.jar to /home/jenkins/agent/workspace/egit-stable/.repository/org/eclipse/egit/feature/org.eclipse.egit.gitflow.feature/5.6.0-SNAPSHOT/org.eclipse.egit.gitflow.feature-5.6.0-SNAPSHOT.jar
[INFO] Installing /home/jenkins/agent/workspace/egit-stable/repo/org.eclipse.egit.gitflow-feature/pom.xml to /home/jenkins/agent/workspace/egit-stable/.repository/org/eclipse/egit/feature/org.eclipse.egit.gitflow.feature/5.6.0-SNAPSHOT/org.eclipse.egit.gitflow.feature-5.6.0-SNAPSHOT.pom
[INFO] Installing /home/jenkins/agent/workspace/egit-stable/repo/org.eclipse.egit.gitflow-feature/target/p2content.xml to /home/jenkins/agent/workspace/egit-stable/.repository/org/eclipse/egit/feature/org.eclipse.egit.gitflow.feature/5.6.0-SNAPSHOT/org.eclipse.egit.gitflow.feature-5.6.0-SNAPSHOT-p2metadata.xml
[INFO] Installing /home/jenkins/agent/workspace/egit-stable/repo/org.eclipse.egit.gitflow-feature/target/p2artifacts.xml to /home/jenkins/agent/workspace/egit-stable/.repository/org/eclipse/egit/feature/org.eclipse.egit.gitflow.feature/5.6.0-SNAPSHOT/org.eclipse.egit.gitflow.feature-5.6.0-SNAPSHOT-p2artifacts.xml
[INFO] 
[INFO] --- tycho-p2-plugin:1.5.1:update-local-index (default-update-local-index) @ org.eclipse.egit.gitflow.feature ---
[INFO] 
[INFO] ------------< org.eclipse.egit:org.eclipse.egit.core.junit >------------
[INFO] Building EGit JUnit Support 5.6.0-SNAPSHOT                       [13/19]
[INFO] ---------------------------[ eclipse-plugin ]---------------------------
[INFO] 
[INFO] --- maven-clean-plugin:2.5:clean (default-clean) @ org.eclipse.egit.core.junit ---
[INFO] 
[INFO] --- tycho-packaging-plugin:1.5.1:build-qualifier (default-build-qualifier) @ org.eclipse.egit.core.junit ---
[INFO] The project's OSGi version is 5.6.0.201911282123
[INFO] 
[INFO] --- tycho-packaging-plugin:1.5.1:validate-id (default-validate-id) @ org.eclipse.egit.core.junit ---
[INFO] 
[INFO] --- tycho-packaging-plugin:1.5.1:validate-version (default-validate-version) @ org.eclipse.egit.core.junit ---
[INFO] 
[INFO] --- maven-enforcer-plugin:3.0.0-M2:enforce (enforce-maven) @ org.eclipse.egit.core.junit ---
[INFO] 
[INFO] --- maven-resources-plugin:2.4.3:resources (default-resources) @ org.eclipse.egit.core.junit ---
[INFO] Using 'UTF-8' encoding to copy filtered resources.
[INFO] skip non existing resourceDirectory /home/jenkins/agent/workspace/egit-stable/repo/org.eclipse.egit.core.junit/src/main/resources
[INFO] 
[INFO] --- tycho-compiler-plugin:1.5.1:compile (default-compile) @ org.eclipse.egit.core.junit ---
[INFO] Compiling 5 source files to /home/jenkins/agent/workspace/egit-stable/repo/org.eclipse.egit.core.junit/target/classes
[INFO] 
[INFO] --- maven-resources-plugin:2.4.3:testResources (default-testResources) @ org.eclipse.egit.core.junit ---
[INFO] Using 'UTF-8' encoding to copy filtered resources.
[INFO] skip non existing resourceDirectory /home/jenkins/agent/workspace/egit-stable/repo/org.eclipse.egit.core.junit/src/test/resources
[INFO] 
[INFO] --- tycho-source-plugin:1.5.1:plugin-source (attach-source) @ org.eclipse.egit.core.junit ---
[INFO] Building jar: /home/jenkins/agent/workspace/egit-stable/repo/org.eclipse.egit.core.junit/target/org.eclipse.egit.core.junit-5.6.0-SNAPSHOT-sources.jar
[INFO] 
[INFO] --- target-platform-configuration:1.5.1:target-platform (default-target-platform) @ org.eclipse.egit.core.junit ---
[INFO] 
[INFO] --- tycho-packaging-plugin:1.5.1:package-plugin (default-package-plugin) @ org.eclipse.egit.core.junit ---
[INFO] Building jar: /home/jenkins/agent/workspace/egit-stable/repo/org.eclipse.egit.core.junit/target/org.eclipse.egit.core.junit-5.6.0-SNAPSHOT.jar
[INFO] 
[INFO] --- tycho-p2-plugin:1.5.1:p2-metadata-default (default-p2-metadata-default) @ org.eclipse.egit.core.junit ---
[INFO] 
[INFO] >>> spotbugs-maven-plugin:3.1.11:check (default) > :spotbugs @ org.eclipse.egit.core.junit >>>
[INFO] 
[INFO] --- spotbugs-maven-plugin:3.1.11:spotbugs (spotbugs) @ org.eclipse.egit.core.junit ---
[INFO] Fork Value is true
     [java] Picked up JAVA_TOOL_OPTIONS: -XX:+IgnoreUnrecognizedVMOptions -XX:+UseContainerSupport -XX:+UnlockExperimentalVMOptions -XX:+UseCGroupMemoryLimitForHeap
     [java] Picked up _JAVA_OPTIONS: -XX:MaxRAMPercentage=64.0
     [java] Warnings generated: 4
[INFO] Done SpotBugs Analysis....
[INFO] 
[INFO] <<< spotbugs-maven-plugin:3.1.11:check (default) < :spotbugs @ org.eclipse.egit.core.junit <<<
[INFO] 
[INFO] 
[INFO] --- spotbugs-maven-plugin:3.1.11:check (default) @ org.eclipse.egit.core.junit ---
[INFO] BugInstance size is 4
[INFO] Error size is 0
[INFO] Total bugs: 4
[ERROR] Unwritten public or protected field: org.eclipse.egit.core.test.DualRepositoryTestCase.repository1 [org.eclipse.egit.core.test.DualRepositoryTestCase] At DualRepositoryTestCase.java:[line 44] UWF_UNWRITTEN_PUBLIC_OR_PROTECTED_FIELD
[ERROR] Unwritten public or protected field: org.eclipse.egit.core.test.DualRepositoryTestCase.repository2 [org.eclipse.egit.core.test.DualRepositoryTestCase] At DualRepositoryTestCase.java:[line 46] UWF_UNWRITTEN_PUBLIC_OR_PROTECTED_FIELD
[ERROR] Unwritten public or protected field: org.eclipse.egit.core.test.DualRepositoryTestCase.testProject [org.eclipse.egit.core.test.DualRepositoryTestCase] At DualRepositoryTestCase.java:[line 48] UWF_UNWRITTEN_PUBLIC_OR_PROTECTED_FIELD
[ERROR] Possible null pointer dereference in org.eclipse.egit.core.test.TestProject.findFileInPlugin(String, String) due to return value of called method [org.eclipse.egit.core.test.TestProject, org.eclipse.egit.core.test.TestProject] Dereferenced at TestProject.java:[line 259]Known null at TestProject.java:[line 258] NP_NULL_ON_SOME_PATH_FROM_RETURN_VALUE
[INFO] 


To see bug detail using the Spotbugs GUI, use the following command "mvn spotbugs:gui"



[INFO] 
[INFO] >>> maven-pmd-plugin:3.11.0:cpd-check (default) > :cpd @ org.eclipse.egit.core.junit >>>
[INFO] 
[INFO] --- maven-pmd-plugin:3.11.0:cpd (cpd) @ org.eclipse.egit.core.junit ---
[INFO] 
[INFO] <<< maven-pmd-plugin:3.11.0:cpd-check (default) < :cpd @ org.eclipse.egit.core.junit <<<
[INFO] 
[INFO] 
[INFO] --- maven-pmd-plugin:3.11.0:cpd-check (default) @ org.eclipse.egit.core.junit ---
[INFO] 
[INFO] 
[INFO] --- tycho-pack200a-plugin:1.5.1:normalize (pack200-normalize) @ org.eclipse.egit.core.junit ---
[INFO] Pack200 normalizing jar /home/jenkins/agent/workspace/egit-stable/repo/org.eclipse.egit.core.junit/target/org.eclipse.egit.core.junit-5.6.0-SNAPSHOT.jar
[INFO] 
[INFO] --- eclipse-jarsigner-plugin:1.1.5:sign (sign) @ org.eclipse.egit.core.junit ---
[INFO] Signing jar: /home/jenkins/agent/workspace/egit-stable/repo/org.eclipse.egit.core.junit/target/org.eclipse.egit.core.junit-5.6.0-SNAPSHOT.jar
[INFO] Signing jar: /home/jenkins/agent/workspace/egit-stable/repo/org.eclipse.egit.core.junit/target/org.eclipse.egit.core.junit-5.6.0-SNAPSHOT-sources.jar
[INFO] 
[INFO] --- tycho-pack200b-plugin:1.5.1:pack (pack200-pack) @ org.eclipse.egit.core.junit ---
[INFO] Pack200 packing jar /home/jenkins/agent/workspace/egit-stable/repo/org.eclipse.egit.core.junit/target/org.eclipse.egit.core.junit-5.6.0-SNAPSHOT.jar
[INFO] 
[INFO] --- tycho-p2-plugin:1.5.1:p2-metadata (p2-metadata) @ org.eclipse.egit.core.junit ---
[INFO] 
[INFO] --- maven-install-plugin:2.3.1:install (default-install) @ org.eclipse.egit.core.junit ---
[INFO] Installing /home/jenkins/agent/workspace/egit-stable/repo/org.eclipse.egit.core.junit/target/org.eclipse.egit.core.junit-5.6.0-SNAPSHOT.jar to /home/jenkins/agent/workspace/egit-stable/.repository/org/eclipse/egit/org.eclipse.egit.core.junit/5.6.0-SNAPSHOT/org.eclipse.egit.core.junit-5.6.0-SNAPSHOT.jar
[INFO] Installing /home/jenkins/agent/workspace/egit-stable/repo/org.eclipse.egit.core.junit/pom.xml to /home/jenkins/agent/workspace/egit-stable/.repository/org/eclipse/egit/org.eclipse.egit.core.junit/5.6.0-SNAPSHOT/org.eclipse.egit.core.junit-5.6.0-SNAPSHOT.pom
[INFO] Installing /home/jenkins/agent/workspace/egit-stable/repo/org.eclipse.egit.core.junit/target/org.eclipse.egit.core.junit-5.6.0-SNAPSHOT-sources.jar to /home/jenkins/agent/workspace/egit-stable/.repository/org/eclipse/egit/org.eclipse.egit.core.junit/5.6.0-SNAPSHOT/org.eclipse.egit.core.junit-5.6.0-SNAPSHOT-sources.jar
[INFO] Installing /home/jenkins/agent/workspace/egit-stable/repo/org.eclipse.egit.core.junit/target/org.eclipse.egit.core.junit-5.6.0-SNAPSHOT.jar.pack.gz to /home/jenkins/agent/workspace/egit-stable/.repository/org/eclipse/egit/org.eclipse.egit.core.junit/5.6.0-SNAPSHOT/org.eclipse.egit.core.junit-5.6.0-SNAPSHOT-pack200.jar.pack.gz
[INFO] Installing /home/jenkins/agent/workspace/egit-stable/repo/org.eclipse.egit.core.junit/target/p2content.xml to /home/jenkins/agent/workspace/egit-stable/.repository/org/eclipse/egit/org.eclipse.egit.core.junit/5.6.0-SNAPSHOT/org.eclipse.egit.core.junit-5.6.0-SNAPSHOT-p2metadata.xml
[INFO] Installing /home/jenkins/agent/workspace/egit-stable/repo/org.eclipse.egit.core.junit/target/p2artifacts.xml to /home/jenkins/agent/workspace/egit-stable/.repository/org/eclipse/egit/org.eclipse.egit.core.junit/5.6.0-SNAPSHOT/org.eclipse.egit.core.junit-5.6.0-SNAPSHOT-p2artifacts.xml
[INFO] 
[INFO] --- tycho-p2-plugin:1.5.1:update-local-index (default-update-local-index) @ org.eclipse.egit.core.junit ---
[INFO] 
[INFO] -----------< org.eclipse.egit:org.eclipse.egit.gitflow.test >-----------
[INFO] Building GitFlow Test Plug-in 5.6.0-SNAPSHOT                     [14/19]
[INFO] ------------------------[ eclipse-test-plugin ]-------------------------
[INFO] 
[INFO] --- maven-clean-plugin:2.5:clean (default-clean) @ org.eclipse.egit.gitflow.test ---
[INFO] 
[INFO] --- tycho-packaging-plugin:1.5.1:build-qualifier (default-build-qualifier) @ org.eclipse.egit.gitflow.test ---
[INFO] The project's OSGi version is 5.6.0.201911282123
[INFO] 
[INFO] --- tycho-packaging-plugin:1.5.1:validate-id (default-validate-id) @ org.eclipse.egit.gitflow.test ---
[INFO] 
[INFO] --- tycho-packaging-plugin:1.5.1:validate-version (default-validate-version) @ org.eclipse.egit.gitflow.test ---
[INFO] 
[INFO] --- maven-enforcer-plugin:3.0.0-M2:enforce (enforce-maven) @ org.eclipse.egit.gitflow.test ---
[INFO] 
[INFO] --- maven-resources-plugin:2.4.3:resources (default-resources) @ org.eclipse.egit.gitflow.test ---
[INFO] Using 'UTF-8' encoding to copy filtered resources.
[INFO] skip non existing resourceDirectory /home/jenkins/agent/workspace/egit-stable/repo/org.eclipse.egit.gitflow.test/src/main/resources
[INFO] 
[INFO] --- tycho-compiler-plugin:1.5.1:compile (default-compile) @ org.eclipse.egit.gitflow.test ---
[INFO] Compiling 18 source files to /home/jenkins/agent/workspace/egit-stable/repo/org.eclipse.egit.gitflow.test/target/classes
[INFO] 
[INFO] --- maven-resources-plugin:2.4.3:testResources (default-testResources) @ org.eclipse.egit.gitflow.test ---
[INFO] Using 'UTF-8' encoding to copy filtered resources.
[INFO] skip non existing resourceDirectory /home/jenkins/agent/workspace/egit-stable/repo/org.eclipse.egit.gitflow.test/src/test/resources
[INFO] 
[INFO] --- target-platform-configuration:1.5.1:target-platform (default-target-platform) @ org.eclipse.egit.gitflow.test ---
[INFO] 
[INFO] --- tycho-packaging-plugin:1.5.1:package-plugin (default-package-plugin) @ org.eclipse.egit.gitflow.test ---
[INFO] Building jar: /home/jenkins/agent/workspace/egit-stable/repo/org.eclipse.egit.gitflow.test/target/org.eclipse.egit.gitflow.test-5.6.0-SNAPSHOT.jar
[INFO] 
[INFO] --- tycho-p2-plugin:1.5.1:p2-metadata-default (default-p2-metadata-default) @ org.eclipse.egit.gitflow.test ---
[INFO] 
[INFO] --- tycho-surefire-plugin:1.5.1:test (default-test) @ org.eclipse.egit.gitflow.test ---
[INFO] Expected eclipse log file: /home/jenkins/agent/workspace/egit-stable/repo/org.eclipse.egit.gitflow.test/target/work/data/.metadata/.log
[INFO] Command line:
	[/usr/lib/jvm/java-1.8.0-openjdk-1.8.0.212.b04-0.el7_6.x86_64/jre/bin/java, -Dosgi.noShutdown=false, -Dosgi.os=linux, -Dosgi.ws=gtk, -Dosgi.arch=x86_64, -Declipse.consoleLog=true, -Degit.test.tmpdir=/home/jenkins/agent/workspace/egit-stable/tmp/egit.tmp/, -Dosgi.clean=true, -jar, /home/jenkins/agent/workspace/egit-stable/.repository/p2/osgi/bundle/org.eclipse.equinox.launcher/1.3.201.v20161025-1711/org.eclipse.equinox.launcher-1.3.201.v20161025-1711.jar, -data, /home/jenkins/agent/workspace/egit-stable/repo/org.eclipse.egit.gitflow.test/target/work/data, -install, /home/jenkins/agent/workspace/egit-stable/repo/org.eclipse.egit.gitflow.test/target/work, -configuration, /home/jenkins/agent/workspace/egit-stable/repo/org.eclipse.egit.gitflow.test/target/work/configuration, -application, org.eclipse.tycho.surefire.osgibooter.headlesstest, -testproperties, /home/jenkins/agent/workspace/egit-stable/repo/org.eclipse.egit.gitflow.test/target/surefire.properties]
Picked up JAVA_TOOL_OPTIONS: -XX:+IgnoreUnrecognizedVMOptions -XX:+UseContainerSupport -XX:+UnlockExperimentalVMOptions -XX:+UseCGroupMemoryLimitForHeap
Picked up _JAVA_OPTIONS: -XX:MaxRAMPercentage=64.0
Running org.eclipse.egit.gitflow.op.HotfixFinishOperationTest
egit.test.tmpdir: /home/jenkins/agent/workspace/egit-stable/tmp/egit.tmp
log4j:WARN No appenders could be found for logger (org.eclipse.jgit.util.FS).
log4j:WARN Please initialize the log4j system properly.
Tests run: 2, Failures: 0, Errors: 0, Skipped: 0, Time elapsed: 3.123 s - in org.eclipse.egit.gitflow.op.HotfixFinishOperationTest
testMergeToDevelopFail(org.eclipse.egit.gitflow.op.HotfixFinishOperationTest)  Time elapsed: 2.481 s
testHotfixFinishSingleCommit(org.eclipse.egit.gitflow.op.HotfixFinishOperationTest)  Time elapsed: 0.511 s
Running org.eclipse.egit.gitflow.op.ReleaseFinishOperationTest
Tests run: 5, Failures: 0, Errors: 0, Skipped: 0, Time elapsed: 3.083 s - in org.eclipse.egit.gitflow.op.ReleaseFinishOperationTest
testReleaseFinishFail(org.eclipse.egit.gitflow.op.ReleaseFinishOperationTest)  Time elapsed: 1.508 s
testReleaseFinishSingleCommit(org.eclipse.egit.gitflow.op.ReleaseFinishOperationTest)  Time elapsed: 0.213 s
testReleaseFinish(org.eclipse.egit.gitflow.op.ReleaseFinishOperationTest)  Time elapsed: 0.172 s
testReleaseTagWithWrongReferenceExists(org.eclipse.egit.gitflow.op.ReleaseFinishOperationTest)  Time elapsed: 0.137 s
testReleaseTagWithCorrectReferenceExists(org.eclipse.egit.gitflow.op.ReleaseFinishOperationTest)  Time elapsed: 1.052 s
Running org.eclipse.egit.gitflow.op.InitOperationTest
Tests run: 3, Failures: 0, Errors: 0, Skipped: 0, Time elapsed: 0.383 s - in org.eclipse.egit.gitflow.op.InitOperationTest
testInit(org.eclipse.egit.gitflow.op.InitOperationTest)  Time elapsed: 0.127 s
testInitEmptyRepository(org.eclipse.egit.gitflow.op.InitOperationTest)  Time elapsed: 0.119 s
testInitLocalMasterMissing(org.eclipse.egit.gitflow.op.InitOperationTest)  Time elapsed: 0.136 s
Running org.eclipse.egit.gitflow.op.FeatureFinishOperationTest
Tests run: 5, Failures: 0, Errors: 0, Skipped: 0, Time elapsed: 1.605 s - in org.eclipse.egit.gitflow.op.FeatureFinishOperationTest
testFeatureFinishFastForward(org.eclipse.egit.gitflow.op.FeatureFinishOperationTest)  Time elapsed: 0.107 s
testFeatureFinishKeepBranch(org.eclipse.egit.gitflow.op.FeatureFinishOperationTest)  Time elapsed: 1.114 s
testFeatureFinishFail(org.eclipse.egit.gitflow.op.FeatureFinishOperationTest)  Time elapsed: 0.099 s
testFeatureFinish(org.eclipse.egit.gitflow.op.FeatureFinishOperationTest)  Time elapsed: 0.158 s
testFeatureFinishSquash(org.eclipse.egit.gitflow.op.FeatureFinishOperationTest)  Time elapsed: 0.125 s
Running org.eclipse.egit.gitflow.op.FeatureListOperationTest
Tests run: 1, Failures: 0, Errors: 0, Skipped: 0, Time elapsed: 0.249 s - in org.eclipse.egit.gitflow.op.FeatureListOperationTest
testFeatureList(org.eclipse.egit.gitflow.op.FeatureListOperationTest)  Time elapsed: 0.248 s
Running org.eclipse.egit.gitflow.op.FeatureStartOperationDivergingTest
!SESSION 2019-11-28 21:28:47.776 -----------------------------------------------
eclipse.buildId=unknown
java.version=1.8.0_212
java.vendor=Oracle Corporation
BootLoader constants: OS=linux, ARCH=x86_64, WS=gtk, NL=en_US
Framework arguments:  -application org.eclipse.tycho.surefire.osgibooter.headlesstest -testproperties /home/jenkins/agent/workspace/egit-stable/repo/org.eclipse.egit.gitflow.test/target/surefire.properties
Command-line arguments:  -data /home/jenkins/agent/workspace/egit-stable/repo/org.eclipse.egit.gitflow.test/target/work/data -application org.eclipse.tycho.surefire.osgibooter.headlesstest -testproperties /home/jenkins/agent/workspace/egit-stable/repo/org.eclipse.egit.gitflow.test/target/surefire.properties

!ENTRY org.eclipse.egit.gitflow 1 0 2019-11-28 21:28:58.600
!MESSAGE Branches 'develop' and 'origin/develop' have diverged.
And local branch 'develop' is ahead of 'origin/develop'.
Tests run: 3, Failures: 0, Errors: 0, Skipped: 0, Time elapsed: 1.483 s - in org.eclipse.egit.gitflow.op.FeatureStartOperationDivergingTest
testFeatureStart_localDevelopAhead(org.eclipse.egit.gitflow.op.FeatureStartOperationDivergingTest)  Time elapsed: 1.028 s
testFeatureStart_localDevelopBehind(org.eclipse.egit.gitflow.op.FeatureStartOperationDivergingTest)  Time elapsed: 0.208 s
testFeatureStart_localDevelopBehindWithFetchOnStart(org.eclipse.egit.gitflow.op.FeatureStartOperationDivergingTest)  Time elapsed: 0.245 s
Running org.eclipse.egit.gitflow.op.FeatureCheckoutOperationTest
Tests run: 2, Failures: 0, Errors: 0, Skipped: 0, Time elapsed: 0.346 s - in org.eclipse.egit.gitflow.op.FeatureCheckoutOperationTest
testFeatureCheckoutConflicts(org.eclipse.egit.gitflow.op.FeatureCheckoutOperationTest)  Time elapsed: 0.205 s
testFeatureCheckout(org.eclipse.egit.gitflow.op.FeatureCheckoutOperationTest)  Time elapsed: 0.141 s
Running org.eclipse.egit.gitflow.op.HotfixStartOperationTest
Tests run: 1, Failures: 0, Errors: 0, Skipped: 0, Time elapsed: 0.128 s - in org.eclipse.egit.gitflow.op.HotfixStartOperationTest
testHotfixStart(org.eclipse.egit.gitflow.op.HotfixStartOperationTest)  Time elapsed: 0.127 s
Running org.eclipse.egit.gitflow.op.FeatureStartOperationTest
Tests run: 2, Failures: 0, Errors: 0, Skipped: 0, Time elapsed: 1.144 s - in org.eclipse.egit.gitflow.op.FeatureStartOperationTest
testFeatureStart(org.eclipse.egit.gitflow.op.FeatureStartOperationTest)  Time elapsed: 1.038 s
testFeatureStartOnMaster(org.eclipse.egit.gitflow.op.FeatureStartOperationTest)  Time elapsed: 0.105 s
Running org.eclipse.egit.gitflow.op.ReleaseStartOperationTest
Tests run: 5, Failures: 0, Errors: 0, Skipped: 0, Time elapsed: 1.441 s - in org.eclipse.egit.gitflow.op.ReleaseStartOperationTest
testReleaseBranchCreatedFromCommit(org.eclipse.egit.gitflow.op.ReleaseStartOperationTest)  Time elapsed: 0.088 s
testReleaseStartWithContent(org.eclipse.egit.gitflow.op.ReleaseStartOperationTest)  Time elapsed: 0.145 s
testReleaseBranchCreatedFromHeadCommit(org.eclipse.egit.gitflow.op.ReleaseStartOperationTest)  Time elapsed: 0.087 s
testReleaseBranchCreated(org.eclipse.egit.gitflow.op.ReleaseStartOperationTest)  Time elapsed: 0.086 s
testReleaseStartFailed(org.eclipse.egit.gitflow.op.ReleaseStartOperationTest)  Time elapsed: 1.034 s
Running org.eclipse.egit.gitflow.op.FeatureTrackOperationTest
Tests run: 1, Failures: 0, Errors: 0, Skipped: 0, Time elapsed: 0.304 s - in org.eclipse.egit.gitflow.op.FeatureTrackOperationTest
testFeatureTrack(org.eclipse.egit.gitflow.op.FeatureTrackOperationTest)  Time elapsed: 0.304 s
Running org.eclipse.egit.gitflow.op.CurrentBranchPublishOperationTest
Tests run: 1, Failures: 0, Errors: 0, Skipped: 0, Time elapsed: 0.22 s - in org.eclipse.egit.gitflow.op.CurrentBranchPublishOperationTest
testFeaturePublish(org.eclipse.egit.gitflow.op.CurrentBranchPublishOperationTest)  Time elapsed: 0.219 s
Running org.eclipse.egit.gitflow.op.FeatureRebaseOperationTest
Tests run: 1, Failures: 0, Errors: 0, Skipped: 0, Time elapsed: 0.132 s - in org.eclipse.egit.gitflow.op.FeatureRebaseOperationTest
testFeatureRebase(org.eclipse.egit.gitflow.op.FeatureRebaseOperationTest)  Time elapsed: 0.131 s
Running org.eclipse.egit.gitflow.GitFlowRepositoryTest
Tests run: 7, Failures: 0, Errors: 0, Skipped: 0, Time elapsed: 2.282 s - in org.eclipse.egit.gitflow.GitFlowRepositoryTest
testGetFeatureBranches(org.eclipse.egit.gitflow.GitFlowRepositoryTest)  Time elapsed: 0.193 s
testIsOnDevelop(org.eclipse.egit.gitflow.GitFlowRepositoryTest)  Time elapsed: 0.202 s
testGetReleaseBranches(org.eclipse.egit.gitflow.GitFlowRepositoryTest)  Time elapsed: 1.147 s
testFindHeadFailOnEmptyRepository(org.eclipse.egit.gitflow.GitFlowRepositoryTest)  Time elapsed: 0.166 s
testIsMaster(org.eclipse.egit.gitflow.GitFlowRepositoryTest)  Time elapsed: 0.173 s
testGetHotfixBranches(org.eclipse.egit.gitflow.GitFlowRepositoryTest)  Time elapsed: 0.216 s
testGetFeatureBranchName(org.eclipse.egit.gitflow.GitFlowRepositoryTest)  Time elapsed: 0.185 s
Running org.eclipse.egit.gitflow.GitFlowRepositoryConfigTest
Tests run: 2, Failures: 0, Errors: 0, Skipped: 0, Time elapsed: 0.364 s - in org.eclipse.egit.gitflow.GitFlowRepositoryConfigTest
testHasDefaultRemote(org.eclipse.egit.gitflow.GitFlowRepositoryConfigTest)  Time elapsed: 0.189 s
testIsInitialized(org.eclipse.egit.gitflow.GitFlowRepositoryConfigTest)  Time elapsed: 0.174 s

Results:

Tests run: 41, Failures: 0, Errors: 0, Skipped: 0


!ENTRY org.eclipse.core.resources 2 10035 2019-11-28 21:29:05.990
!MESSAGE The workspace will exit with unsaved changes in this session.
[INFO] All tests passed!
[INFO] 
[INFO] >>> spotbugs-maven-plugin:3.1.11:check (default) > :spotbugs @ org.eclipse.egit.gitflow.test >>>
[INFO] 
[INFO] --- spotbugs-maven-plugin:3.1.11:spotbugs (spotbugs) @ org.eclipse.egit.gitflow.test ---
[INFO] Fork Value is true
     [java] Picked up JAVA_TOOL_OPTIONS: -XX:+IgnoreUnrecognizedVMOptions -XX:+UseContainerSupport -XX:+UnlockExperimentalVMOptions -XX:+UseCGroupMemoryLimitForHeap
     [java] Picked up _JAVA_OPTIONS: -XX:MaxRAMPercentage=64.0
[INFO] Done SpotBugs Analysis....
[INFO] 
[INFO] <<< spotbugs-maven-plugin:3.1.11:check (default) < :spotbugs @ org.eclipse.egit.gitflow.test <<<
[INFO] 
[INFO] 
[INFO] --- spotbugs-maven-plugin:3.1.11:check (default) @ org.eclipse.egit.gitflow.test ---
[INFO] BugInstance size is 0
[INFO] Error size is 0
[INFO] No errors/warnings found
[INFO] 
[INFO] >>> maven-pmd-plugin:3.11.0:cpd-check (default) > :cpd @ org.eclipse.egit.gitflow.test >>>
[INFO] 
[INFO] --- maven-pmd-plugin:3.11.0:cpd (cpd) @ org.eclipse.egit.gitflow.test ---
[INFO] 
[INFO] <<< maven-pmd-plugin:3.11.0:cpd-check (default) < :cpd @ org.eclipse.egit.gitflow.test <<<
[INFO] 
[INFO] 
[INFO] --- maven-pmd-plugin:3.11.0:cpd-check (default) @ org.eclipse.egit.gitflow.test ---
[INFO] 
[INFO] 
[INFO] --- tycho-pack200a-plugin:1.5.1:normalize (pack200-normalize) @ org.eclipse.egit.gitflow.test ---
[INFO] Pack200 normalizing jar /home/jenkins/agent/workspace/egit-stable/repo/org.eclipse.egit.gitflow.test/target/org.eclipse.egit.gitflow.test-5.6.0-SNAPSHOT.jar
[INFO] 
[INFO] --- eclipse-jarsigner-plugin:1.1.5:sign (sign) @ org.eclipse.egit.gitflow.test ---
[INFO] Signing jar: /home/jenkins/agent/workspace/egit-stable/repo/org.eclipse.egit.gitflow.test/target/org.eclipse.egit.gitflow.test-5.6.0-SNAPSHOT.jar
[INFO] 
[INFO] --- tycho-pack200b-plugin:1.5.1:pack (pack200-pack) @ org.eclipse.egit.gitflow.test ---
[INFO] Pack200 packing jar /home/jenkins/agent/workspace/egit-stable/repo/org.eclipse.egit.gitflow.test/target/org.eclipse.egit.gitflow.test-5.6.0-SNAPSHOT.jar
[INFO] 
[INFO] --- tycho-p2-plugin:1.5.1:p2-metadata (p2-metadata) @ org.eclipse.egit.gitflow.test ---
[INFO] 
[INFO] --- maven-install-plugin:2.3.1:install (default-install) @ org.eclipse.egit.gitflow.test ---
[INFO] Installing /home/jenkins/agent/workspace/egit-stable/repo/org.eclipse.egit.gitflow.test/target/org.eclipse.egit.gitflow.test-5.6.0-SNAPSHOT.jar to /home/jenkins/agent/workspace/egit-stable/.repository/org/eclipse/egit/org.eclipse.egit.gitflow.test/5.6.0-SNAPSHOT/org.eclipse.egit.gitflow.test-5.6.0-SNAPSHOT.jar
[INFO] Installing /home/jenkins/agent/workspace/egit-stable/repo/org.eclipse.egit.gitflow.test/pom.xml to /home/jenkins/agent/workspace/egit-stable/.repository/org/eclipse/egit/org.eclipse.egit.gitflow.test/5.6.0-SNAPSHOT/org.eclipse.egit.gitflow.test-5.6.0-SNAPSHOT.pom
[INFO] Installing /home/jenkins/agent/workspace/egit-stable/repo/org.eclipse.egit.gitflow.test/target/org.eclipse.egit.gitflow.test-5.6.0-SNAPSHOT.jar.pack.gz to /home/jenkins/agent/workspace/egit-stable/.repository/org/eclipse/egit/org.eclipse.egit.gitflow.test/5.6.0-SNAPSHOT/org.eclipse.egit.gitflow.test-5.6.0-SNAPSHOT-pack200.jar.pack.gz
[INFO] Installing /home/jenkins/agent/workspace/egit-stable/repo/org.eclipse.egit.gitflow.test/target/p2content.xml to /home/jenkins/agent/workspace/egit-stable/.repository/org/eclipse/egit/org.eclipse.egit.gitflow.test/5.6.0-SNAPSHOT/org.eclipse.egit.gitflow.test-5.6.0-SNAPSHOT-p2metadata.xml
[INFO] Installing /home/jenkins/agent/workspace/egit-stable/repo/org.eclipse.egit.gitflow.test/target/p2artifacts.xml to /home/jenkins/agent/workspace/egit-stable/.repository/org/eclipse/egit/org.eclipse.egit.gitflow.test/5.6.0-SNAPSHOT/org.eclipse.egit.gitflow.test-5.6.0-SNAPSHOT-p2artifacts.xml
[INFO] 
[INFO] --- tycho-p2-plugin:1.5.1:update-local-index (default-update-local-index) @ org.eclipse.egit.gitflow.test ---
[INFO] 
[INFO] ----------< org.eclipse.egit.feature:org.eclipse.egit.source >----------
[INFO] Building Eclipse EGit Source Feature 5.6.0-SNAPSHOT              [15/19]
[INFO] --------------------------[ eclipse-feature ]---------------------------
[INFO] 
[INFO] --- maven-clean-plugin:2.5:clean (default-clean) @ org.eclipse.egit.source ---
[INFO] 
[INFO] --- tycho-packaging-plugin:1.5.1:build-qualifier-aggregator (default-build-qualifier-aggregator) @ org.eclipse.egit.source ---
[INFO] The project's OSGi version is 5.6.0.201911282123
[INFO] 
[INFO] --- tycho-packaging-plugin:1.5.1:validate-id (default-validate-id) @ org.eclipse.egit.source ---
[INFO] 
[INFO] --- tycho-packaging-plugin:1.5.1:validate-version (default-validate-version) @ org.eclipse.egit.source ---
[INFO] 
[INFO] --- maven-enforcer-plugin:3.0.0-M2:enforce (enforce-maven) @ org.eclipse.egit.source ---
[INFO] 
[INFO] --- target-platform-configuration:1.5.1:target-platform (default-target-platform) @ org.eclipse.egit.source ---
[INFO] 
[INFO] --- tycho-packaging-plugin:1.5.1:package-feature (default-package-feature) @ org.eclipse.egit.source ---
[INFO] Building jar: /home/jenkins/agent/workspace/egit-stable/repo/org.eclipse.egit.source-feature/target/org.eclipse.egit.source-5.6.0-SNAPSHOT.jar
[INFO] 
[INFO] --- tycho-p2-plugin:1.5.1:p2-metadata-default (default-p2-metadata-default) @ org.eclipse.egit.source ---
[INFO] 
[INFO] --- tycho-p2-plugin:1.5.1:feature-p2-metadata (default-feature-p2-metadata) @ org.eclipse.egit.source ---
[INFO] 
[INFO] >>> spotbugs-maven-plugin:3.1.11:check (default) > :spotbugs @ org.eclipse.egit.source >>>
[INFO] 
[INFO] --- spotbugs-maven-plugin:3.1.11:spotbugs (spotbugs) @ org.eclipse.egit.source ---
[INFO] 
[INFO] <<< spotbugs-maven-plugin:3.1.11:check (default) < :spotbugs @ org.eclipse.egit.source <<<
[INFO] 
[INFO] 
[INFO] --- spotbugs-maven-plugin:3.1.11:check (default) @ org.eclipse.egit.source ---
[INFO] 
[INFO] >>> maven-pmd-plugin:3.11.0:cpd-check (default) > :cpd @ org.eclipse.egit.source >>>
[INFO] 
[INFO] --- maven-pmd-plugin:3.11.0:cpd (cpd) @ org.eclipse.egit.source ---
[INFO] 
[INFO] <<< maven-pmd-plugin:3.11.0:cpd-check (default) < :cpd @ org.eclipse.egit.source <<<
[INFO] 
[INFO] 
[INFO] --- maven-pmd-plugin:3.11.0:cpd-check (default) @ org.eclipse.egit.source ---
[INFO] 
[INFO] 
[INFO] --- tycho-pack200a-plugin:1.5.1:normalize (pack200-normalize) @ org.eclipse.egit.source ---
[INFO] 
[INFO] --- eclipse-jarsigner-plugin:1.1.5:sign (sign) @ org.eclipse.egit.source ---
[INFO] Signing jar: /home/jenkins/agent/workspace/egit-stable/repo/org.eclipse.egit.source-feature/target/org.eclipse.egit.source-5.6.0-SNAPSHOT.jar
[INFO] 
[INFO] --- tycho-pack200b-plugin:1.5.1:pack (pack200-pack) @ org.eclipse.egit.source ---
[INFO] 
[INFO] --- tycho-p2-plugin:1.5.1:p2-metadata (p2-metadata) @ org.eclipse.egit.source ---
[INFO] 
[INFO] --- maven-install-plugin:2.3.1:install (default-install) @ org.eclipse.egit.source ---
[INFO] Installing /home/jenkins/agent/workspace/egit-stable/repo/org.eclipse.egit.source-feature/target/org.eclipse.egit.source-5.6.0-SNAPSHOT.jar to /home/jenkins/agent/workspace/egit-stable/.repository/org/eclipse/egit/feature/org.eclipse.egit.source/5.6.0-SNAPSHOT/org.eclipse.egit.source-5.6.0-SNAPSHOT.jar
[INFO] Installing /home/jenkins/agent/workspace/egit-stable/repo/org.eclipse.egit.source-feature/pom.xml to /home/jenkins/agent/workspace/egit-stable/.repository/org/eclipse/egit/feature/org.eclipse.egit.source/5.6.0-SNAPSHOT/org.eclipse.egit.source-5.6.0-SNAPSHOT.pom
[INFO] Installing /home/jenkins/agent/workspace/egit-stable/repo/org.eclipse.egit.source-feature/target/p2content.xml to /home/jenkins/agent/workspace/egit-stable/.repository/org/eclipse/egit/feature/org.eclipse.egit.source/5.6.0-SNAPSHOT/org.eclipse.egit.source-5.6.0-SNAPSHOT-p2metadata.xml
[INFO] Installing /home/jenkins/agent/workspace/egit-stable/repo/org.eclipse.egit.source-feature/target/p2artifacts.xml to /home/jenkins/agent/workspace/egit-stable/.repository/org/eclipse/egit/feature/org.eclipse.egit.source/5.6.0-SNAPSHOT/org.eclipse.egit.source-5.6.0-SNAPSHOT-p2artifacts.xml
[INFO] 
[INFO] --- tycho-p2-plugin:1.5.1:update-local-index (default-update-local-index) @ org.eclipse.egit.source ---
[INFO] 
[INFO] ------------< org.eclipse.egit:org.eclipse.egit.repository >------------
[INFO] Building EGit P2 Repository 5.6.0-SNAPSHOT                       [16/19]
[INFO] -------------------------[ eclipse-repository ]-------------------------
[INFO] 
[INFO] --- maven-clean-plugin:2.5:clean (default-clean) @ org.eclipse.egit.repository ---
[INFO] 
[INFO] --- tycho-packaging-plugin:1.5.1:build-qualifier-aggregator (default-build-qualifier-aggregator) @ org.eclipse.egit.repository ---
[INFO] The project's OSGi version is 5.6.0.201911282123
[INFO] 
[INFO] --- maven-enforcer-plugin:3.0.0-M2:enforce (enforce-maven) @ org.eclipse.egit.repository ---
[INFO] 
[INFO] --- maven-clean-plugin:2.5:clean (default-clean-1) @ org.eclipse.egit.repository ---
[INFO] 
[INFO] --- maven-resources-plugin:2.4.3:resources (default-resources) @ org.eclipse.egit.repository ---
[INFO] Using 'UTF-8' encoding to copy filtered resources.
[INFO] skip non existing resourceDirectory /home/jenkins/agent/workspace/egit-stable/repo/org.eclipse.egit.repository/src/main/resources
[INFO] 
[INFO] --- target-platform-configuration:1.5.1:target-platform (default-target-platform) @ org.eclipse.egit.repository ---
[INFO] 
[INFO] --- tycho-p2-publisher-plugin:1.5.1:publish-osgi-ee (default-publish-osgi-ee) @ org.eclipse.egit.repository ---
[INFO] Published profile IUs: [a.jre.javase 10.0.0, config.a.jre.javase 10.0.0]
[INFO] Published profile IUs: [a.jre.javase 11.0.0, config.a.jre.javase 11.0.0]
[INFO] Published profile IUs: [a.jre.javase 12.0.0, config.a.jre.javase 12.0.0]
[INFO] Published profile IUs: [a.jre.javase 13.0.0, config.a.jre.javase 13.0.0]
[INFO] 
[INFO] --- tycho-p2-publisher-plugin:1.5.1:publish-products (default-publish-products) @ org.eclipse.egit.repository ---
[INFO] 
[INFO] --- tycho-p2-publisher-plugin:1.5.1:publish-categories (default-publish-categories) @ org.eclipse.egit.repository ---
[INFO] 
[INFO] --- tycho-p2-publisher-plugin:1.5.1:attach-artifacts (default-attach-artifacts) @ org.eclipse.egit.repository ---
[INFO] 
[INFO] --- tycho-p2-repository-plugin:1.5.1:assemble-repository (default-assemble-repository) @ org.eclipse.egit.repository ---
[INFO] 
[INFO] --- tycho-p2-repository-plugin:1.5.1:archive-repository (default-archive-repository) @ org.eclipse.egit.repository ---
[INFO] Building zip: /home/jenkins/agent/workspace/egit-stable/repo/org.eclipse.egit.repository/target/org.eclipse.egit.repository-5.6.0-SNAPSHOT.zip
[INFO] 
[INFO] --- repository-utils:1.4.0:generate-repository-facade (generate-facade) @ org.eclipse.egit.repository ---
[WARNING] Could not access build info at https://repo.eclipse.org/content/unzip/snapshots.unzip/org/eclipse/jgit/org.eclipse.jgit.repository/5.6.0-SNAPSHOT/org.eclipse.jgit.repository-5.6.0-SNAPSHOT.zip-unzip/latest/all/repo/buildinfo.json or https://repo.eclipse.org/content/unzip/snapshots.unzip/org/eclipse/jgit/org.eclipse.jgit.repository/5.6.0-SNAPSHOT/org.eclipse.jgit.repository-5.6.0-SNAPSHOT.zip-unzip//buildinfo.json
[WARNING] Could not access build info at https://download.eclipse.org/cbi/updates/license/latest/all/repo/buildinfo.json or https://download.eclipse.org/cbi/updates/license//buildinfo.json
[INFO] Building zip: /home/jenkins/agent/workspace/egit-stable/repo/org.eclipse.egit.repository/target/org.eclipse.egit.repository-5.6.0-SNAPSHOT.zip
[INFO] 
[INFO] --- tycho-eclipserun-plugin:1.5.1:eclipse-run (add-repo-properties) @ org.eclipse.egit.repository ---
[INFO] Fetching p2.index from https://download.eclipse.org/webtools/releng/repository/
[INFO] Fetching p2.index from https://download.eclipse.org/webtools/releng/repository/
[INFO] Adding repository https://download.eclipse.org/webtools/releng/repository
[INFO] Fetching compositeContent.xml from https://download.eclipse.org/webtools/releng/repository/
[INFO] Fetching compositeContent.xml from https://download.eclipse.org/webtools/releng/repository/
[INFO] Fetching p2.index from http://download.eclipse.org/webtools/repository/releng/
[INFO] Fetching p2.index from http://download.eclipse.org/webtools/repository/releng/
[INFO] Fetching compositeContent.xml from http://download.eclipse.org/webtools/repository/releng/
[INFO] Fetching p2.index from https://download.eclipse.org/webtools/downloads/drops/R3.15.0/R-3.15.0-20190830034720/repositoryunittests/
[INFO] Fetching content.xml.xz from https://download.eclipse.org/webtools/downloads/drops/R3.15.0/R-3.15.0-20190830034720/repositoryunittests/
[INFO] Fetching content.xml.xz from https://download.eclipse.org/webtools/downloads/drops/R3.15.0/R-3.15.0-20190830034720/repositoryunittests/
[INFO] Fetching p2.index from https://download.eclipse.org/webtools/downloads/drops/R3.14.0/R-3.14.0-20190612230649/repositoryunittests/
[INFO] Fetching p2.index from https://download.eclipse.org/webtools/downloads/drops/R3.14.0/R-3.14.0-20190612230649/repositoryunittests/
[INFO] Fetching content.xml.xz from https://download.eclipse.org/webtools/downloads/drops/R3.14.0/R-3.14.0-20190612230649/repositoryunittests/
[INFO] Fetching content.xml.xz from https://download.eclipse.org/webtools/downloads/drops/R3.14.0/R-3.14.0-20190612230649/repositoryunittests/
[INFO] Fetching p2.index from https://download.eclipse.org/webtools/downloads/drops/R3.13.0/R-3.13.0-20190308131645/repositoryunittests/
[INFO] Fetching p2.index from https://download.eclipse.org/webtools/downloads/drops/R3.13.0/R-3.13.0-20190308131645/repositoryunittests/
[INFO] Fetching content.xml.xz from https://download.eclipse.org/webtools/downloads/drops/R3.13.0/R-3.13.0-20190308131645/repositoryunittests/
[INFO] Fetching content.xml.xz from https://download.eclipse.org/webtools/downloads/drops/R3.13.0/R-3.13.0-20190308131645/repositoryunittests/
[INFO] Fetching p2.index from https://download.eclipse.org/webtools/downloads/drops/R3.12.0/R-3.12.0-20181130055351/repositoryunittests/
[INFO] Fetching p2.index from https://download.eclipse.org/webtools/downloads/drops/R3.12.0/R-3.12.0-20181130055351/repositoryunittests/
[INFO] Fetching content.xml.xz from https://download.eclipse.org/webtools/downloads/drops/R3.12.0/R-3.12.0-20181130055351/repositoryunittests/
[INFO] Fetching content.xml.xz from https://download.eclipse.org/webtools/downloads/drops/R3.12.0/R-3.12.0-20181130055351/repositoryunittests/
[INFO] Fetching p2.index from https://download.eclipse.org/webtools/downloads/drops/R3.11.0/R-3.11.0-20180910170749/repositoryunittests/
[INFO] Fetching p2.index from https://download.eclipse.org/webtools/downloads/drops/R3.11.0/R-3.11.0-20180910170749/repositoryunittests/
[INFO] Fetching content.xml.xz from https://download.eclipse.org/webtools/downloads/drops/R3.11.0/R-3.11.0-20180910170749/repositoryunittests/
[INFO] Fetching content.xml.xz from https://download.eclipse.org/webtools/downloads/drops/R3.11.0/R-3.11.0-20180910170749/repositoryunittests/
[INFO] Fetching p2.index from http://download.eclipse.org/webtools/downloads/drops/R3.10.0/R-3.10.0-20180611164516/repositoryunittests/
[INFO] Fetching p2.index from http://download.eclipse.org/webtools/downloads/drops/R3.10.0/R-3.10.0-20180611164516/repositoryunittests/
[INFO] Fetching content.xml.xz from http://download.eclipse.org/webtools/downloads/drops/R3.10.0/R-3.10.0-20180611164516/repositoryunittests/
[INFO] Fetching content.xml.xz from http://download.eclipse.org/webtools/downloads/drops/R3.10.0/R-3.10.0-20180611164516/repositoryunittests/
[INFO] Fetching content.jar from http://archive.eclipse.org/webtools/downloads/drops/R3.3/T3.3.0/I-3.3.0-20140506204952/repository/ (5.67kB)
[INFO] Fetching content.jar from http://archive.eclipse.org/webtools/downloads/drops/R3.3/T3.3.0/I-3.3.0-20140506204952/repository/ (5.67kB)
[INFO] Fetching compositeContent.jar from http://archive.eclipse.org/webtools/downloads/drops/R3.2/T3.2.0/I-3.2.0-20100530044458/repository/ (427B)
[INFO] Fetching compositeContent.jar from http://archive.eclipse.org/webtools/downloads/drops/R3.2/T3.2.0/I-3.2.0-20100530044458/repository/ (427B)
[INFO] Fetching content.xml from http://archive.eclipse.org/webtools/downloads/drops/R3.2/T3.2.0/I-3.2.0-20100530044458/repository/wtp-buildTools/
[INFO] Fetching content.xml from http://archive.eclipse.org/webtools/downloads/drops/R3.2/T3.2.0/I-3.2.0-20100530044458/repository/wtp-buildTools/
[INFO] Fetching p2.index from https://download.eclipse.org/staging/neon/
[INFO] Fetching p2.index from https://download.eclipse.org/staging/neon/
[INFO] Adding repository https://download.eclipse.org/staging/neon
[INFO] Fetching content.xml.xz from https://download.eclipse.org/staging/neon/
[INFO] Fetching content.xml.xz from https://download.eclipse.org/staging/neon/
[INFO] Fetching org.tukaani.xz_1.3.0.v201308270617.jar.pack.gz from https://download.eclipse.org/staging/neon/plugins/ (36.04kB)
[INFO] Fetching org.tukaani.xz_1.3.0.v201308270617.jar.pack.gz from https://download.eclipse.org/staging/neon/plugins/ (36.04kB)
[INFO] Fetching org.apache.ant_1.9.6.v201510161327.jar.pack.gz from https://download.eclipse.org/staging/neon/plugins/ (2.19MB)
[INFO] Fetching org.apache.ant_1.9.6.v201510161327.jar.pack.gz from https://download.eclipse.org/staging/neon/plugins/ (2.19MB)
[INFO] Fetching org.eclipse.wtp.releng.tools_1.2.1.v201902122017.jar.pack.gz from https://download.eclipse.org/webtools/downloads/drops/R3.15.0/R-3.15.0-20190830034720/repositoryunittests/plugins/ (63.09kB)
[INFO] Fetching org.eclipse.wtp.releng.tools_1.2.1.v201902122017.jar.pack.gz from https://download.eclipse.org/webtools/downloads/drops/R3.15.0/R-3.15.0-20190830034720/repositoryunittests/plugins/ (63.09kB)
[INFO] Fetching org.eclipse.wtp.releng.tools.feature_1.2.0.v201902122017.jar from https://download.eclipse.org/webtools/downloads/drops/R3.15.0/R-3.15.0-20190830034720/repositoryunittests/features/ (17.97kB)
[INFO] Fetching org.eclipse.wtp.releng.tools.feature_1.2.0.v201902122017.jar from https://download.eclipse.org/webtools/downloads/drops/R3.15.0/R-3.15.0-20190830034720/repositoryunittests/features/ (17.97kB)
[INFO] Toolchain in tycho-eclipserun-plugin: JDK[/opt/tools/java/oracle/jdk-8/latest/jre]
[INFO] Expected eclipse log file: /home/jenkins/agent/workspace/egit-stable/repo/org.eclipse.egit.repository/target/eclipserun-work/data/.metadata/.log
[INFO] Command line:
	[/opt/tools/java/oracle/jdk-8/latest/jre/bin/java, -DartifactRepoDirectory=/home/jenkins/agent/workspace/egit-stable/repo/org.eclipse.egit.repository/target/repository, -Dp2MirrorsURL=https://www.eclipse.org/downloads/download.php?file=/egit/updates-stable-nightly&format=xml, -Dp2StatsURI=https://download.eclipse.org/stats/egit/org.eclipse.egit.repository, -DstatsTrackedArtifacts=org.eclipse.jgit.feature,org.eclipse.jgit.source.feature,org.eclipse.jgit.pgm.feature,org.eclipse.jgit.pgm.source.feature,org.eclipse.jgit.http.apache.feature,org.eclipse.jgit.ssh.apache.feature,org.eclipse.egit.feature,org.eclipse.egit.gitflow.feature,org.eclipse.egit.mylyn.feature,org.eclipse.egit.source.feature, -DstatsArtifactsSuffix=-5.6.0-SNAPSHOT, -jar, /home/jenkins/agent/workspace/egit-stable/.repository/p2/osgi/bundle/org.eclipse.equinox.launcher/1.3.201.v20161025-1711/org.eclipse.equinox.launcher-1.3.201.v20161025-1711.jar, -install, /home/jenkins/agent/workspace/egit-stable/repo/org.eclipse.egit.repository/target/eclipserun-work, -configuration, /home/jenkins/agent/workspace/egit-stable/repo/org.eclipse.egit.repository/target/eclipserun-work/configuration, -application, org.eclipse.wtp.releng.tools.addRepoProperties]
Picked up JAVA_TOOL_OPTIONS: -XX:+IgnoreUnrecognizedVMOptions -XX:+UseContainerSupport -XX:+UnlockExperimentalVMOptions -XX:+UseCGroupMemoryLimitForHeap
Picked up _JAVA_OPTIONS: -XX:MaxRAMPercentage=64.0
	INFO: artifact repository directory set from 'artifactRepoDirectory': /home/jenkins/agent/workspace/egit-stable/repo/org.eclipse.egit.repository/target/repository
	INFO: metadata repository directory set from 'metadataRepoDirectory': null
	INFO: No metadata repository was specified. If desired, set the system property 'metadataRepoDirectory'.
	INFO: the artifact repository had existing name: EGit P2 Repository
	INFO: p2ArtifactRepositoryName value set from 'p2ArtifactRepositoryName': null
	INFO: p2ArtifactRepositoryName was not specified. Any existing values not changed.
	INFO: the repository had no existing mirrorURL
	INFO: mirror URL value set from 'p2MirrorsURL': https://www.eclipse.org/downloads/download.php?file=/egit/updates-stable-nightly&format=xml
	INFO: the repository had no existing statsURI
	INFO: stats URI value set from 'p2StatsURI': https://download.eclipse.org/stats/egit/org.eclipse.egit.repository
	INFO: Artifact stats processing: 10 were requested for tagging.
	INFO: org.eclipse.egit.feature		org.eclipse.egit.feature-5.6.0-SNAPSHOT
	INFO: org.eclipse.jgit.ssh.apache.feature		org.eclipse.jgit.ssh.apache.feature-5.6.0-SNAPSHOT
	INFO: org.eclipse.jgit.pgm.source.feature		org.eclipse.jgit.pgm.source.feature-5.6.0-SNAPSHOT
	INFO: org.eclipse.egit.source.feature		org.eclipse.egit.source.feature-5.6.0-SNAPSHOT
	INFO: org.eclipse.jgit.http.apache.feature		org.eclipse.jgit.http.apache.feature-5.6.0-SNAPSHOT
	INFO: org.eclipse.jgit.source.feature		org.eclipse.jgit.source.feature-5.6.0-SNAPSHOT
	INFO: org.eclipse.egit.gitflow.feature		org.eclipse.egit.gitflow.feature-5.6.0-SNAPSHOT
	INFO: org.eclipse.egit.mylyn.feature		org.eclipse.egit.mylyn.feature-5.6.0-SNAPSHOT
	INFO: org.eclipse.jgit.feature		org.eclipse.jgit.feature-5.6.0-SNAPSHOT
	INFO: org.eclipse.jgit.pgm.feature		org.eclipse.jgit.pgm.feature-5.6.0-SNAPSHOT
	INFO: set download.stats property for: canonical: org.eclipse.update.feature,org.eclipse.egit.gitflow.feature,5.6.0.201911282123
	INFO:                              to:  org.eclipse.egit.gitflow.feature-5.6.0-SNAPSHOT
	INFO: repository rewritten
[INFO] 
[INFO] >>> spotbugs-maven-plugin:3.1.11:check (default) > :spotbugs @ org.eclipse.egit.repository >>>
[INFO] 
[INFO] --- spotbugs-maven-plugin:3.1.11:spotbugs (spotbugs) @ org.eclipse.egit.repository ---
[INFO] 
[INFO] <<< spotbugs-maven-plugin:3.1.11:check (default) < :spotbugs @ org.eclipse.egit.repository <<<
[INFO] 
[INFO] 
[INFO] --- spotbugs-maven-plugin:3.1.11:check (default) @ org.eclipse.egit.repository ---
[INFO] 
[INFO] >>> maven-pmd-plugin:3.11.0:cpd-check (default) > :cpd @ org.eclipse.egit.repository >>>
[INFO] 
[INFO] --- maven-pmd-plugin:3.11.0:cpd (cpd) @ org.eclipse.egit.repository ---
[INFO] 
[INFO] <<< maven-pmd-plugin:3.11.0:cpd-check (default) < :cpd @ org.eclipse.egit.repository <<<
[INFO] 
[INFO] 
[INFO] --- maven-pmd-plugin:3.11.0:cpd-check (default) @ org.eclipse.egit.repository ---
[INFO] 
[INFO] 
[INFO] --- tycho-pack200a-plugin:1.5.1:normalize (pack200-normalize) @ org.eclipse.egit.repository ---
[INFO] 
[INFO] --- eclipse-jarsigner-plugin:1.1.5:sign (sign) @ org.eclipse.egit.repository ---
[INFO] 
[INFO] --- tycho-pack200b-plugin:1.5.1:pack (pack200-pack) @ org.eclipse.egit.repository ---
[INFO] 
[INFO] --- tycho-p2-plugin:1.5.1:p2-metadata (p2-metadata) @ org.eclipse.egit.repository ---
[INFO] 
[INFO] --- maven-install-plugin:2.3.1:install (default-install) @ org.eclipse.egit.repository ---
[INFO] Installing /home/jenkins/agent/workspace/egit-stable/repo/org.eclipse.egit.repository/target/org.eclipse.egit.repository-5.6.0-SNAPSHOT.zip to /home/jenkins/agent/workspace/egit-stable/.repository/org/eclipse/egit/org.eclipse.egit.repository/5.6.0-SNAPSHOT/org.eclipse.egit.repository-5.6.0-SNAPSHOT.zip
[INFO] Installing /home/jenkins/agent/workspace/egit-stable/repo/org.eclipse.egit.repository/pom.xml to /home/jenkins/agent/workspace/egit-stable/.repository/org/eclipse/egit/org.eclipse.egit.repository/5.6.0-SNAPSHOT/org.eclipse.egit.repository-5.6.0-SNAPSHOT.pom
[INFO] Installing /home/jenkins/agent/workspace/egit-stable/repo/org.eclipse.egit.repository/target/p2content.xml to /home/jenkins/agent/workspace/egit-stable/.repository/org/eclipse/egit/org.eclipse.egit.repository/5.6.0-SNAPSHOT/org.eclipse.egit.repository-5.6.0-SNAPSHOT-p2metadata.xml
[INFO] Installing /home/jenkins/agent/workspace/egit-stable/repo/org.eclipse.egit.repository/target/p2artifacts.xml to /home/jenkins/agent/workspace/egit-stable/.repository/org/eclipse/egit/org.eclipse.egit.repository/5.6.0-SNAPSHOT/org.eclipse.egit.repository-5.6.0-SNAPSHOT-p2artifacts.xml
[INFO] 
[INFO] --- tycho-p2-plugin:1.5.1:update-local-index (default-update-local-index) @ org.eclipse.egit.repository ---
[INFO] 
[INFO] ------------< org.eclipse.egit:org.eclipse.egit.core.test >-------------
[INFO] Building EGit Core Test Plug-in 5.6.0-SNAPSHOT                   [17/19]
[INFO] ------------------------[ eclipse-test-plugin ]-------------------------
[INFO] 
[INFO] --- maven-clean-plugin:2.5:clean (default-clean) @ org.eclipse.egit.core.test ---
[INFO] 
[INFO] --- tycho-packaging-plugin:1.5.1:build-qualifier (default-build-qualifier) @ org.eclipse.egit.core.test ---
[INFO] The project's OSGi version is 5.6.0.201911282123
[INFO] 
[INFO] --- tycho-packaging-plugin:1.5.1:validate-id (default-validate-id) @ org.eclipse.egit.core.test ---
[INFO] 
[INFO] --- tycho-packaging-plugin:1.5.1:validate-version (default-validate-version) @ org.eclipse.egit.core.test ---
[INFO] 
[INFO] --- maven-enforcer-plugin:3.0.0-M2:enforce (enforce-maven) @ org.eclipse.egit.core.test ---
[INFO] 
[INFO] --- maven-resources-plugin:2.4.3:resources (default-resources) @ org.eclipse.egit.core.test ---
[INFO] Using 'UTF-8' encoding to copy filtered resources.
[INFO] skip non existing resourceDirectory /home/jenkins/agent/workspace/egit-stable/repo/org.eclipse.egit.core.test/src/main/resources
[INFO] 
[INFO] --- tycho-compiler-plugin:1.5.1:compile (default-compile) @ org.eclipse.egit.core.test ---
[INFO] Compiling 74 source files to /home/jenkins/agent/workspace/egit-stable/repo/org.eclipse.egit.core.test/target/classes
[INFO] 
[INFO] --- maven-resources-plugin:2.4.3:testResources (default-testResources) @ org.eclipse.egit.core.test ---
[INFO] Using 'UTF-8' encoding to copy filtered resources.
[INFO] skip non existing resourceDirectory /home/jenkins/agent/workspace/egit-stable/repo/org.eclipse.egit.core.test/src/test/resources
[INFO] 
[INFO] --- target-platform-configuration:1.5.1:target-platform (default-target-platform) @ org.eclipse.egit.core.test ---
[INFO] 
[INFO] --- tycho-packaging-plugin:1.5.1:package-plugin (default-package-plugin) @ org.eclipse.egit.core.test ---
[INFO] Building jar: /home/jenkins/agent/workspace/egit-stable/repo/org.eclipse.egit.core.test/target/org.eclipse.egit.core.test-5.6.0-SNAPSHOT.jar
[INFO] 
[INFO] --- tycho-p2-plugin:1.5.1:p2-metadata-default (default-p2-metadata-default) @ org.eclipse.egit.core.test ---
[INFO] 
[INFO] --- tycho-surefire-plugin:1.5.1:test (default-test) @ org.eclipse.egit.core.test ---
[INFO] Expected eclipse log file: /home/jenkins/agent/workspace/egit-stable/repo/org.eclipse.egit.core.test/target/work/data/.metadata/.log
[INFO] Command line:
	[/usr/lib/jvm/java-1.8.0-openjdk-1.8.0.212.b04-0.el7_6.x86_64/jre/bin/java, -Dosgi.noShutdown=false, -Dosgi.os=linux, -Dosgi.ws=gtk, -Dosgi.arch=x86_64, -Declipse.consoleLog=true, -Degit.test.tmpdir=/home/jenkins/agent/workspace/egit-stable/tmp/egit.tmp/, -Dosgi.clean=true, -jar, /home/jenkins/agent/workspace/egit-stable/.repository/p2/osgi/bundle/org.eclipse.equinox.launcher/1.3.201.v20161025-1711/org.eclipse.equinox.launcher-1.3.201.v20161025-1711.jar, -data, /home/jenkins/agent/workspace/egit-stable/repo/org.eclipse.egit.core.test/target/work/data, -install, /home/jenkins/agent/workspace/egit-stable/repo/org.eclipse.egit.core.test/target/work, -configuration, /home/jenkins/agent/workspace/egit-stable/repo/org.eclipse.egit.core.test/target/work/configuration, -application, org.eclipse.tycho.surefire.osgibooter.headlesstest, -testproperties, /home/jenkins/agent/workspace/egit-stable/repo/org.eclipse.egit.core.test/target/surefire.properties]
Picked up JAVA_TOOL_OPTIONS: -XX:+IgnoreUnrecognizedVMOptions -XX:+UseContainerSupport -XX:+UnlockExperimentalVMOptions -XX:+UseCGroupMemoryLimitForHeap
Picked up _JAVA_OPTIONS: -XX:MaxRAMPercentage=64.0
Running org.eclipse.egit.core.test.op.CloneOperationTest
egit.test.tmpdir: /home/jenkins/agent/workspace/egit-stable/tmp/egit.tmp
log4j:WARN No appenders could be found for logger (org.eclipse.jgit.internal.storage.file.FileSnapshot).
log4j:WARN Please initialize the log4j system properly.
Tests run: 6, Failures: 0, Errors: 1, Skipped: 0, Time elapsed: 2.629 s <<< FAILURE! - in org.eclipse.egit.core.test.op.CloneOperationTest
testClone(org.eclipse.egit.core.test.op.CloneOperationTest)  Time elapsed: 1.729 s  <<< ERROR!
java.io.IOException: Could not delete file /home/jenkins/agent/workspace/egit-stable/tmp/egit.tmp/ac43d9db5ec644de8447a14130a5214c/Repository1
	at org.eclipse.jgit.util.FileUtils.delete(FileUtils.java:247)
	at org.eclipse.jgit.util.FileUtils.delete(FileUtils.java:199)
	at org.eclipse.jgit.util.FileUtils.delete(FileUtils.java:199)
	at org.eclipse.egit.core.test.TestUtils.deleteTempDirs(TestUtils.java:129)
	at org.eclipse.egit.core.test.DualRepositoryTestCase.afterTestCase(DualRepositoryTestCase.java:52)
	at sun.reflect.NativeMethodAccessorImpl.invoke0(Native Method)
	at sun.reflect.NativeMethodAccessorImpl.invoke(NativeMethodAccessorImpl.java:62)
	at sun.reflect.DelegatingMethodAccessorImpl.invoke(DelegatingMethodAccessorImpl.java:43)
	at java.lang.reflect.Method.invoke(Method.java:498)
	at org.junit.runners.model.FrameworkMethod$1.runReflectiveCall(FrameworkMethod.java:50)
	at org.junit.internal.runners.model.ReflectiveCallable.run(ReflectiveCallable.java:12)
	at org.junit.runners.model.FrameworkMethod.invokeExplosively(FrameworkMethod.java:47)
	at org.junit.internal.runners.statements.RunAfters.evaluate(RunAfters.java:33)
	at org.junit.runners.ParentRunner.runLeaf(ParentRunner.java:325)
	at org.junit.runners.BlockJUnit4ClassRunner.runChild(BlockJUnit4ClassRunner.java:78)
	at org.junit.runners.BlockJUnit4ClassRunner.runChild(BlockJUnit4ClassRunner.java:57)
	at org.junit.runners.ParentRunner$3.run(ParentRunner.java:290)
	at org.junit.runners.ParentRunner$1.schedule(ParentRunner.java:71)
	at org.junit.runners.ParentRunner.runChildren(ParentRunner.java:288)
	at org.junit.runners.ParentRunner.access$000(ParentRunner.java:58)
	at org.junit.runners.ParentRunner$2.evaluate(ParentRunner.java:268)
	at org.junit.runners.ParentRunner.run(ParentRunner.java:363)
	at org.apache.maven.surefire.junit4.JUnit4Provider.execute(JUnit4Provider.java:365)
	at org.apache.maven.surefire.junit4.JUnit4Provider.executeWithRerun(JUnit4Provider.java:273)
	at org.apache.maven.surefire.junit4.JUnit4Provider.executeTestSet(JUnit4Provider.java:238)
	at org.apache.maven.surefire.junit4.JUnit4Provider.invoke(JUnit4Provider.java:159)
	at sun.reflect.NativeMethodAccessorImpl.invoke0(Native Method)
	at sun.reflect.NativeMethodAccessorImpl.invoke(NativeMethodAccessorImpl.java:62)
	at sun.reflect.DelegatingMethodAccessorImpl.invoke(DelegatingMethodAccessorImpl.java:43)
	at java.lang.reflect.Method.invoke(Method.java:498)
	at org.apache.maven.surefire.util.ReflectionUtils.invokeMethodWithArray2(ReflectionUtils.java:206)
	at org.apache.maven.surefire.booter.ProviderFactory$ProviderProxy.invoke(ProviderFactory.java:161)
	at org.apache.maven.surefire.booter.ProviderFactory.invokeProvider(ProviderFactory.java:84)
	at org.eclipse.tycho.surefire.osgibooter.OsgiSurefireBooter.run(OsgiSurefireBooter.java:113)
	at org.eclipse.tycho.surefire.osgibooter.HeadlessTestApplication.run(HeadlessTestApplication.java:21)
	at sun.reflect.NativeMethodAccessorImpl.invoke0(Native Method)
	at sun.reflect.NativeMethodAccessorImpl.invoke(NativeMethodAccessorImpl.java:62)
	at sun.reflect.DelegatingMethodAccessorImpl.invoke(DelegatingMethodAccessorImpl.java:43)
	at java.lang.reflect.Method.invoke(Method.java:498)
	at org.eclipse.equinox.internal.app.EclipseAppContainer.callMethodWithException(EclipseAppContainer.java:587)
	at org.eclipse.equinox.internal.app.EclipseAppHandle.run(EclipseAppHandle.java:198)
	at org.eclipse.core.runtime.internal.adaptor.EclipseAppLauncher.runApplication(EclipseAppLauncher.java:134)
	at org.eclipse.core.runtime.internal.adaptor.EclipseAppLauncher.start(EclipseAppLauncher.java:104)
	at org.eclipse.core.runtime.adaptor.EclipseStarter.run(EclipseStarter.java:388)
	at org.eclipse.core.runtime.adaptor.EclipseStarter.run(EclipseStarter.java:243)
	at sun.reflect.NativeMethodAccessorImpl.invoke0(Native Method)
	at sun.reflect.NativeMethodAccessorImpl.invoke(NativeMethodAccessorImpl.java:62)
	at sun.reflect.DelegatingMethodAccessorImpl.invoke(DelegatingMethodAccessorImpl.java:43)
	at java.lang.reflect.Method.invoke(Method.java:498)
	at org.eclipse.equinox.launcher.Main.invokeFramework(Main.java:673)
	at org.eclipse.equinox.launcher.Main.basicRun(Main.java:610)
	at org.eclipse.equinox.launcher.Main.run(Main.java:1519)
	at org.eclipse.equinox.launcher.Main.main(Main.java:1492)
Caused by: java.nio.file.DirectoryNotEmptyException: /home/jenkins/agent/workspace/egit-stable/tmp/egit.tmp/ac43d9db5ec644de8447a14130a5214c/Repository1
	at sun.nio.fs.UnixFileSystemProvider.implDelete(UnixFileSystemProvider.java:242)
	at sun.nio.fs.AbstractFileSystemProvider.deleteIfExists(AbstractFileSystemProvider.java:108)
	at java.nio.file.Files.deleteIfExists(Files.java:1165)
	at org.eclipse.jgit.util.FileUtils.delete(FileUtils.java:239)
	... 52 more

testCloneBranch(org.eclipse.egit.core.test.op.CloneOperationTest)  Time elapsed: 0.331 s
testConfigureFetchAfterCloneTask(org.eclipse.egit.core.test.op.CloneOperationTest)  Time elapsed: 0.213 s
testConfigurePushAfterCloneTask(org.eclipse.egit.core.test.op.CloneOperationTest)  Time elapsed: 0.123 s
testCloneTag(org.eclipse.egit.core.test.op.CloneOperationTest)  Time elapsed: 0.105 s
testSimplePostCloneTask(org.eclipse.egit.core.test.op.CloneOperationTest)  Time elapsed: 0.111 s
Running org.eclipse.egit.core.test.op.ResetOperationTest
Tests run: 3, Failures: 0, Errors: 0, Skipped: 0, Time elapsed: 1.087 s - in org.eclipse.egit.core.test.op.ResetOperationTest
testSoftReset(org.eclipse.egit.core.test.op.ResetOperationTest)  Time elapsed: 0.997 s
testMixedReset(org.eclipse.egit.core.test.op.ResetOperationTest)  Time elapsed: 0.043 s
testHardReset(org.eclipse.egit.core.test.op.ResetOperationTest)  Time elapsed: 0.045 s
Running org.eclipse.egit.core.test.op.DiscardChangesOperationTest
Tests run: 4, Failures: 0, Errors: 0, Skipped: 0, Time elapsed: 1.565 s - in org.eclipse.egit.core.test.op.DiscardChangesOperationTest
testDiscardChanges(org.eclipse.egit.core.test.op.DiscardChangesOperationTest)  Time elapsed: 0.825 s
shouldWorkWhenProjectIsRootOfRepository(org.eclipse.egit.core.test.op.DiscardChangesOperationTest)  Time elapsed: 0.164 s
testDiscardChangesWithStage(org.eclipse.egit.core.test.op.DiscardChangesOperationTest)  Time elapsed: 0.204 s
testDiscardChangesWithPath(org.eclipse.egit.core.test.op.DiscardChangesOperationTest)  Time elapsed: 0.371 s
Running org.eclipse.egit.core.test.op.BranchOperationTest
Tests run: 1, Failures: 0, Errors: 0, Skipped: 0, Time elapsed: 0.068 s - in org.eclipse.egit.core.test.op.BranchOperationTest
testBranchOperation(org.eclipse.egit.core.test.op.BranchOperationTest)  Time elapsed: 0.067 s
Running org.eclipse.egit.core.test.op.RemoveFromIndexOperationTest
Tests run: 7, Failures: 0, Errors: 0, Skipped: 0, Time elapsed: 10.308 s - in org.eclipse.egit.core.test.op.RemoveFromIndexOperationTest
shouldUnstageExistingFile(org.eclipse.egit.core.test.op.RemoveFromIndexOperationTest)  Time elapsed: 1.186 s
shouldUnTrackFilesInFolder(org.eclipse.egit.core.test.op.RemoveFromIndexOperationTest)  Time elapsed: 1.393 s
shouldUnTrackFile(org.eclipse.egit.core.test.op.RemoveFromIndexOperationTest)  Time elapsed: 0.153 s
shouldRemoveFromIndexOnInitialCommit(org.eclipse.egit.core.test.op.RemoveFromIndexOperationTest)  Time elapsed: 0.206 s
shouldUnstageFilesInNestedFolder(org.eclipse.egit.core.test.op.RemoveFromIndexOperationTest)  Time elapsed: 2.183 s
shouldUnstageFilesInFolder(org.eclipse.egit.core.test.op.RemoveFromIndexOperationTest)  Time elapsed: 4.168 s
shouldUnstageFilesFromMultipleRepositories(org.eclipse.egit.core.test.op.RemoveFromIndexOperationTest)  Time elapsed: 1.017 s
Running org.eclipse.egit.core.test.op.RebaseOperationTest
Tests run: 4, Failures: 0, Errors: 0, Skipped: 0, Time elapsed: 0.211 s - in org.eclipse.egit.core.test.op.RebaseOperationTest
testStopAndAbortOnConflict(org.eclipse.egit.core.test.op.RebaseOperationTest)  Time elapsed: 0.067 s
testNoConflict(org.eclipse.egit.core.test.op.RebaseOperationTest)  Time elapsed: 0.054 s
testUpToDate(org.eclipse.egit.core.test.op.RebaseOperationTest)  Time elapsed: 0.039 s
testExceptionWhenRestartingStoppedRebase(org.eclipse.egit.core.test.op.RebaseOperationTest)  Time elapsed: 0.051 s
Running org.eclipse.egit.core.test.op.DeletePathsOperationTest
Tests run: 2, Failures: 0, Errors: 0, Skipped: 0, Time elapsed: 1.334 s - in org.eclipse.egit.core.test.op.DeletePathsOperationTest
testDeleteResourceOutsideOfProject(org.eclipse.egit.core.test.op.DeletePathsOperationTest)  Time elapsed: 0.164 s
testDeleteResourceOfProject(org.eclipse.egit.core.test.op.DeletePathsOperationTest)  Time elapsed: 1.169 s
Running org.eclipse.egit.core.test.op.AddOperationTest
Tests run: 4, Failures: 0, Errors: 0, Skipped: 0, Time elapsed: 3.17 s - in org.eclipse.egit.core.test.op.AddOperationTest
testAddFilesInFolder(org.eclipse.egit.core.test.op.AddOperationTest)  Time elapsed: 1.084 s
testAddFile(org.eclipse.egit.core.test.op.AddOperationTest)  Time elapsed: 1.936 s
testTrackFilesInFolder(org.eclipse.egit.core.test.op.AddOperationTest)  Time elapsed: 0.079 s
testTrackFile(org.eclipse.egit.core.test.op.AddOperationTest)  Time elapsed: 0.071 s
Running org.eclipse.egit.core.test.op.SquashCommitsOperationTest
Tests run: 1, Failures: 0, Errors: 0, Skipped: 0, Time elapsed: 0.117 s - in org.eclipse.egit.core.test.op.SquashCommitsOperationTest
squash(org.eclipse.egit.core.test.op.SquashCommitsOperationTest)  Time elapsed: 0.116 s
Running org.eclipse.egit.core.test.op.ListRemoteOperationTest
Tests run: 3, Failures: 0, Errors: 0, Skipped: 0, Time elapsed: 1.347 s - in org.eclipse.egit.core.test.op.ListRemoteOperationTest
testListRemote(org.eclipse.egit.core.test.op.ListRemoteOperationTest)  Time elapsed: 0.149 s
testIllegalStateException(org.eclipse.egit.core.test.op.ListRemoteOperationTest)  Time elapsed: 0.145 s
testIllegalURI(org.eclipse.egit.core.test.op.ListRemoteOperationTest)  Time elapsed: 1.051 s
Running org.eclipse.egit.core.test.op.PushOperationTest
!SESSION 2019-11-28 21:29:31.909 -----------------------------------------------
eclipse.buildId=unknown
java.version=1.8.0_212
java.vendor=Oracle Corporation
BootLoader constants: OS=linux, ARCH=x86_64, WS=gtk, NL=en_US
Framework arguments:  -application org.eclipse.tycho.surefire.osgibooter.headlesstest -testproperties /home/jenkins/agent/workspace/egit-stable/repo/org.eclipse.egit.core.test/target/surefire.properties
Command-line arguments:  -data /home/jenkins/agent/workspace/egit-stable/repo/org.eclipse.egit.core.test/target/work/data -application org.eclipse.tycho.surefire.osgibooter.headlesstest -testproperties /home/jenkins/agent/workspace/egit-stable/repo/org.eclipse.egit.core.test/target/surefire.properties

!ENTRY org.eclipse.egit.core 4 0 2019-11-28 21:29:55.905
!MESSAGE An exception occurred during push on URI invalid-uri: invalid-uri: not found.
!STACK 0
org.eclipse.jgit.errors.NoRemoteRepositoryException: invalid-uri: not found.
	at org.eclipse.jgit.transport.TransportLocal$1.open(TransportLocal.java:132)
	at org.eclipse.jgit.transport.TransportBundleFile$1.open(TransportBundleFile.java:107)
	at org.eclipse.jgit.transport.Transport.open(Transport.java:553)
	at org.eclipse.jgit.transport.Transport.open(Transport.java:524)
	at org.eclipse.egit.core.op.PushOperation.run(PushOperation.java:184)
	at org.eclipse.egit.core.test.op.PushOperationTest.testInvalidUriDuringPush(PushOperationTest.java:192)
	at sun.reflect.NativeMethodAccessorImpl.invoke0(Native Method)
	at sun.reflect.NativeMethodAccessorImpl.invoke(NativeMethodAccessorImpl.java:62)
	at sun.reflect.DelegatingMethodAccessorImpl.invoke(DelegatingMethodAccessorImpl.java:43)
	at java.lang.reflect.Method.invoke(Method.java:498)
	at org.junit.runners.model.FrameworkMethod$1.runReflectiveCall(FrameworkMethod.java:50)
	at org.junit.internal.runners.model.ReflectiveCallable.run(ReflectiveCallable.java:12)
	at org.junit.runners.model.FrameworkMethod.invokeExplosively(FrameworkMethod.java:47)
	at org.junit.internal.runners.statements.InvokeMethod.evaluate(InvokeMethod.java:17)
	at org.junit.internal.runners.statements.RunBefores.evaluate(RunBefores.java:26)
	at org.junit.internal.runners.statements.RunAfters.evaluate(RunAfters.java:27)
	at org.junit.runners.ParentRunner.runLeaf(ParentRunner.java:325)
	at org.junit.runners.BlockJUnit4ClassRunner.runChild(BlockJUnit4ClassRunner.java:78)
	at org.junit.runners.BlockJUnit4ClassRunner.runChild(BlockJUnit4ClassRunner.java:57)
	at org.junit.runners.ParentRunner$3.run(ParentRunner.java:290)
	at org.junit.runners.ParentRunner$1.schedule(ParentRunner.java:71)
	at org.junit.runners.ParentRunner.runChildren(ParentRunner.java:288)
	at org.junit.runners.ParentRunner.access$000(ParentRunner.java:58)
	at org.junit.runners.ParentRunner$2.evaluate(ParentRunner.java:268)
	at org.junit.runners.ParentRunner.run(ParentRunner.java:363)
	at org.apache.maven.surefire.junit4.JUnit4Provider.execute(JUnit4Provider.java:365)
	at org.apache.maven.surefire.junit4.JUnit4Provider.executeWithRerun(JUnit4Provider.java:273)
	at org.apache.maven.surefire.junit4.JUnit4Provider.executeTestSet(JUnit4Provider.java:238)
	at org.apache.maven.surefire.junit4.JUnit4Provider.invoke(JUnit4Provider.java:159)
	at sun.reflect.NativeMethodAccessorImpl.invoke0(Native Method)
	at sun.reflect.NativeMethodAccessorImpl.invoke(NativeMethodAccessorImpl.java:62)
	at sun.reflect.DelegatingMethodAccessorImpl.invoke(DelegatingMethodAccessorImpl.java:43)
	at java.lang.reflect.Method.invoke(Method.java:498)
	at org.apache.maven.surefire.util.ReflectionUtils.invokeMethodWithArray2(ReflectionUtils.java:206)
	at org.apache.maven.surefire.booter.ProviderFactory$ProviderProxy.invoke(ProviderFactory.java:161)
	at org.apache.maven.surefire.booter.ProviderFactory.invokeProvider(ProviderFactory.java:84)
	at org.eclipse.tycho.surefire.osgibooter.OsgiSurefireBooter.run(OsgiSurefireBooter.java:113)
	at org.eclipse.tycho.surefire.osgibooter.HeadlessTestApplication.run(HeadlessTestApplication.java:21)
	at sun.reflect.NativeMethodAccessorImpl.invoke0(Native Method)
	at sun.reflect.NativeMethodAccessorImpl.invoke(NativeMethodAccessorImpl.java:62)
	at sun.reflect.DelegatingMethodAccessorImpl.invoke(DelegatingMethodAccessorImpl.java:43)
	at java.lang.reflect.Method.invoke(Method.java:498)
	at org.eclipse.equinox.internal.app.EclipseAppContainer.callMethodWithException(EclipseAppContainer.java:587)
	at org.eclipse.equinox.internal.app.EclipseAppHandle.run(EclipseAppHandle.java:198)
	at org.eclipse.core.runtime.internal.adaptor.EclipseAppLauncher.runApplication(EclipseAppLauncher.java:134)
	at org.eclipse.core.runtime.internal.adaptor.EclipseAppLauncher.start(EclipseAppLauncher.java:104)
	at org.eclipse.core.runtime.adaptor.EclipseStarter.run(EclipseStarter.java:388)
	at org.eclipse.core.runtime.adaptor.EclipseStarter.run(EclipseStarter.java:243)
	at sun.reflect.NativeMethodAccessorImpl.invoke0(Native Method)
	at sun.reflect.NativeMethodAccessorImpl.invoke(NativeMethodAccessorImpl.java:62)
	at sun.reflect.DelegatingMethodAccessorImpl.invoke(DelegatingMethodAccessorImpl.java:43)
	at java.lang.reflect.Method.invoke(Method.java:498)
	at org.eclipse.equinox.launcher.Main.invokeFramework(Main.java:673)
	at org.eclipse.equinox.launcher.Main.basicRun(Main.java:610)
	at org.eclipse.equinox.launcher.Main.run(Main.java:1519)
	at org.eclipse.equinox.launcher.Main.main(Main.java:1492)
Tests run: 5, Failures: 0, Errors: 0, Skipped: 0, Time elapsed: 0.869 s - in org.eclipse.egit.core.test.op.PushOperationTest
testPushWithReusedSpec(org.eclipse.egit.core.test.op.PushOperationTest)  Time elapsed: 0.157 s
testPush(org.eclipse.egit.core.test.op.PushOperationTest)  Time elapsed: 0.218 s
testIllegalStateExceptionOnGetResultWithoutRun(org.eclipse.egit.core.test.op.PushOperationTest)  Time elapsed: 0.14 s
testUpdateTrackingBranchIfSpecifiedInRemoteRefUpdate(org.eclipse.egit.core.test.op.PushOperationTest)  Time elapsed: 0.203 s
testInvalidUriDuringPush(org.eclipse.egit.core.test.op.PushOperationTest)  Time elapsed: 0.151 s
Running org.eclipse.egit.core.test.op.MergeOperationTest
Tests run: 5, Failures: 0, Errors: 0, Skipped: 0, Time elapsed: 0.465 s - in org.eclipse.egit.core.test.op.MergeOperationTest
testMergeNoFF(org.eclipse.egit.core.test.op.MergeOperationTest)  Time elapsed: 0.1 s
testMergeoptionsNoFF(org.eclipse.egit.core.test.op.MergeOperationTest)  Time elapsed: 0.092 s
testMergeFFOnly(org.eclipse.egit.core.test.op.MergeOperationTest)  Time elapsed: 0.091 s
testMergeFF(org.eclipse.egit.core.test.op.MergeOperationTest)  Time elapsed: 0.093 s
testMergeoptionsFFOnly(org.eclipse.egit.core.test.op.MergeOperationTest)  Time elapsed: 0.088 s
Running org.eclipse.egit.core.test.op.IgnoreOperationTest
Tests run: 9, Failures: 0, Errors: 0, Skipped: 0, Time elapsed: 2.671 s - in org.eclipse.egit.core.test.op.IgnoreOperationTest
testIgnoreProject(org.eclipse.egit.core.test.op.IgnoreOperationTest)  Time elapsed: 1.076 s
testIgnoreMultiFolders(org.eclipse.egit.core.test.op.IgnoreOperationTest)  Time elapsed: 0.085 s
testWithNestedProjects(org.eclipse.egit.core.test.op.IgnoreOperationTest)  Time elapsed: 0.089 s
testSchedulingRule(org.eclipse.egit.core.test.op.IgnoreOperationTest)  Time elapsed: 0.069 s
testIgnoreWithResource(org.eclipse.egit.core.test.op.IgnoreOperationTest)  Time elapsed: 0.068 s
testIgnoreFileCancel(org.eclipse.egit.core.test.op.IgnoreOperationTest)  Time elapsed: 0.067 s
testIgnoreNoTrailingNewline(org.eclipse.egit.core.test.op.IgnoreOperationTest)  Time elapsed: 0.069 s
testIgnoreFile(org.eclipse.egit.core.test.op.IgnoreOperationTest)  Time elapsed: 1.072 s
testIgnoreFolder(org.eclipse.egit.core.test.op.IgnoreOperationTest)  Time elapsed: 0.076 s
Running org.eclipse.egit.core.test.op.EditCommitOperationTest
Tests run: 1, Failures: 0, Errors: 0, Skipped: 0, Time elapsed: 0.128 s - in org.eclipse.egit.core.test.op.EditCommitOperationTest
edit(org.eclipse.egit.core.test.op.EditCommitOperationTest)  Time elapsed: 0.128 s
Running org.eclipse.egit.core.test.op.RewordCommitsOperationTest
Tests run: 1, Failures: 0, Errors: 0, Skipped: 0, Time elapsed: 0.131 s - in org.eclipse.egit.core.test.op.RewordCommitsOperationTest
reword(org.eclipse.egit.core.test.op.RewordCommitsOperationTest)  Time elapsed: 0.131 s
Running org.eclipse.egit.core.test.op.TagOperationTest
Tests run: 4, Failures: 0, Errors: 0, Skipped: 0, Time elapsed: 1.429 s - in org.eclipse.egit.core.test.op.TagOperationTest
addTag(org.eclipse.egit.core.test.op.TagOperationTest)  Time elapsed: 0.137 s
addNullAnnotatedTag(org.eclipse.egit.core.test.op.TagOperationTest)  Time elapsed: 1.076 s
addEmptyAnnotatedTag(org.eclipse.egit.core.test.op.TagOperationTest)  Time elapsed: 0.11 s
addLightweightTag(org.eclipse.egit.core.test.op.TagOperationTest)  Time elapsed: 0.106 s
Running org.eclipse.egit.core.test.op.StashCreateOperationTest
Tests run: 3, Failures: 0, Errors: 0, Skipped: 0, Time elapsed: 0.368 s - in org.eclipse.egit.core.test.op.StashCreateOperationTest
testCustomMessage(org.eclipse.egit.core.test.op.StashCreateOperationTest)  Time elapsed: 0.136 s
testUntrackedFlag(org.eclipse.egit.core.test.op.StashCreateOperationTest)  Time elapsed: 0.119 s
testDefaultMessage(org.eclipse.egit.core.test.op.StashCreateOperationTest)  Time elapsed: 0.111 s
Running org.eclipse.egit.core.test.op.ConnectProviderOperationTest
Tests run: 6, Failures: 0, Errors: 0, Skipped: 0, Time elapsed: 0.364 s - in org.eclipse.egit.core.test.op.ConnectProviderOperationTest
testNewUnsharedFile(org.eclipse.egit.core.test.op.ConnectProviderOperationTest)  Time elapsed: 0.068 s
testNewRepositoryCaseSensitive(org.eclipse.egit.core.test.op.ConnectProviderOperationTest)  Time elapsed: 0.054 s
testAutoIgnoresDerivedFolder(org.eclipse.egit.core.test.op.ConnectProviderOperationTest)  Time elapsed: 0.063 s
testNoAutoIgnoresDerivedFolder(org.eclipse.egit.core.test.op.ConnectProviderOperationTest)  Time elapsed: 0.055 s
testNoRepository(org.eclipse.egit.core.test.op.ConnectProviderOperationTest)  Time elapsed: 0.054 s
testNewRepository(org.eclipse.egit.core.test.op.ConnectProviderOperationTest)  Time elapsed: 0.066 s
Running org.eclipse.egit.core.test.op.TrackUntrackOperationTest
Tests run: 2, Failures: 0, Errors: 0, Skipped: 0, Time elapsed: 0.842 s - in org.eclipse.egit.core.test.op.TrackUntrackOperationTest
testTrackProject(org.eclipse.egit.core.test.op.TrackUntrackOperationTest)  Time elapsed: 0.718 s
testTrackFiles(org.eclipse.egit.core.test.op.TrackUntrackOperationTest)  Time elapsed: 0.123 s
Running org.eclipse.egit.core.test.op.CreatePatchOperationTest
Tests run: 15, Failures: 0, Errors: 0, Skipped: 0, Time elapsed: 4.735 s - in org.eclipse.egit.core.test.op.CreatePatchOperationTest
testSimplePatch(org.eclipse.egit.core.test.op.CreatePatchOperationTest)  Time elapsed: 0.208 s
testNullMonitor(org.eclipse.egit.core.test.op.CreatePatchOperationTest)  Time elapsed: 0.08 s
testWorkspacePatchForWorkingDir(org.eclipse.egit.core.test.op.CreatePatchOperationTest)  Time elapsed: 0.113 s
testComputeWorkspacePathRepoAboveProject(org.eclipse.egit.core.test.op.CreatePatchOperationTest)  Time elapsed: 1.251 s
testNullRepo(org.eclipse.egit.core.test.op.CreatePatchOperationTest)  Time elapsed: 0.114 s
testWorkspacePatchForCommit(org.eclipse.egit.core.test.op.CreatePatchOperationTest)  Time elapsed: 0.128 s
testUpdateWorkspacePatchPrefixes(org.eclipse.egit.core.test.op.CreatePatchOperationTest)  Time elapsed: 0.141 s
testComputeWorkspacePath(org.eclipse.egit.core.test.op.CreatePatchOperationTest)  Time elapsed: 1.062 s
testExecuteFirst(org.eclipse.egit.core.test.op.CreatePatchOperationTest)  Time elapsed: 0.112 s
testSimplePatchNoNewlineAtEnd(org.eclipse.egit.core.test.op.CreatePatchOperationTest)  Time elapsed: 0.076 s
testNullCommit(org.eclipse.egit.core.test.op.CreatePatchOperationTest)  Time elapsed: 0.073 s
testOnelineHeaderPatch(org.eclipse.egit.core.test.op.CreatePatchOperationTest)  Time elapsed: 0.076 s
testSimpleGitPatch(org.eclipse.egit.core.test.op.CreatePatchOperationTest)  Time elapsed: 0.087 s
testSuggestName(org.eclipse.egit.core.test.op.CreatePatchOperationTest)  Time elapsed: 1.13 s
testFirstCommit(org.eclipse.egit.core.test.op.CreatePatchOperationTest)  Time elapsed: 0.081 s
Running org.eclipse.egit.core.test.op.CommitOperationTest
Tests run: 7, Failures: 0, Errors: 0, Skipped: 0, Time elapsed: 1.572 s - in org.eclipse.egit.core.test.op.CommitOperationTest
testCommitAddedToIndexDeletedInWorkspace(org.eclipse.egit.core.test.op.CommitOperationTest)  Time elapsed: 0.076 s
testCommitEmptiedTree(org.eclipse.egit.core.test.op.CommitOperationTest)  Time elapsed: 0.078 s
testCommitAll(org.eclipse.egit.core.test.op.CommitOperationTest)  Time elapsed: 0.081 s
testCommitUntracked(org.eclipse.egit.core.test.op.CommitOperationTest)  Time elapsed: 0.074 s
testCommitIndexSubset(org.eclipse.egit.core.test.op.CommitOperationTest)  Time elapsed: 0.079 s
testCommitStaged(org.eclipse.egit.core.test.op.CommitOperationTest)  Time elapsed: 1.086 s
testCommitWithStaging(org.eclipse.egit.core.test.op.CommitOperationTest)  Time elapsed: 0.094 s
Running org.eclipse.egit.core.test.RepositoryCacheTest
Tests run: 4, Failures: 0, Errors: 0, Skipped: 0, Time elapsed: 0.159 s - in org.eclipse.egit.core.test.RepositoryCacheTest
findsRepositoryForOpenProject(org.eclipse.egit.core.test.RepositoryCacheTest)  Time elapsed: 0.017 s
shouldNotContainDeletedRepository(org.eclipse.egit.core.test.RepositoryCacheTest)  Time elapsed: 0.051 s
findsRepositoryForClosedProject(org.eclipse.egit.core.test.RepositoryCacheTest)  Time elapsed: 0.015 s
findsNestedRepositoryForClosedProject(org.eclipse.egit.core.test.RepositoryCacheTest)  Time elapsed: 0.075 s
Running org.eclipse.egit.core.test.rebase.RebaseInteractivePlanTest
Tests run: 8, Failures: 0, Errors: 0, Skipped: 0, Time elapsed: 1.669 s - in org.eclipse.egit.core.test.rebase.RebaseInteractivePlanTest
moveDownTestOneElement(org.eclipse.egit.core.test.rebase.RebaseInteractivePlanTest)  Time elapsed: 0.271 s
moveUpTestTwoElements(org.eclipse.egit.core.test.rebase.RebaseInteractivePlanTest)  Time elapsed: 0.991 s
parseTest(org.eclipse.egit.core.test.rebase.RebaseInteractivePlanTest)  Time elapsed: 0.075 s
moveUpTestOneElement(org.eclipse.egit.core.test.rebase.RebaseInteractivePlanTest)  Time elapsed: 0.067 s
persistTest(org.eclipse.egit.core.test.rebase.RebaseInteractivePlanTest)  Time elapsed: 0.066 s
moveDownTestThreeElementsWithOneComment(org.eclipse.egit.core.test.rebase.RebaseInteractivePlanTest)  Time elapsed: 0.066 s
moveUpTestThreeElementsWithOneComment(org.eclipse.egit.core.test.rebase.RebaseInteractivePlanTest)  Time elapsed: 0.066 s
moveDownTestTwoElements(org.eclipse.egit.core.test.rebase.RebaseInteractivePlanTest)  Time elapsed: 0.066 s
Running org.eclipse.egit.core.test.rebase.RebaseInteractivePlanTest$JoinedListTest
Tests run: 20, Failures: 0, Errors: 0, Skipped: 0, Time elapsed: 0.003 s - in org.eclipse.egit.core.test.rebase.RebaseInteractivePlanTest$JoinedListTest
containsTest(org.eclipse.egit.core.test.rebase.RebaseInteractivePlanTest$JoinedListTest)  Time elapsed: 0.001 s
addAllToIndexInFirstListTest(org.eclipse.egit.core.test.rebase.RebaseInteractivePlanTest$JoinedListTest)  Time elapsed: 0 s
toArrayTest(org.eclipse.egit.core.test.rebase.RebaseInteractivePlanTest$JoinedListTest)  Time elapsed: 0 s
subListTest(org.eclipse.egit.core.test.rebase.RebaseInteractivePlanTest$JoinedListTest)  Time elapsed: 0 s
removeElementTest(org.eclipse.egit.core.test.rebase.RebaseInteractivePlanTest$JoinedListTest)  Time elapsed: 0 s
clearTest(org.eclipse.egit.core.test.rebase.RebaseInteractivePlanTest$JoinedListTest)  Time elapsed: 0 s
listIteratorTest(org.eclipse.egit.core.test.rebase.RebaseInteractivePlanTest$JoinedListTest)  Time elapsed: 0.001 s
addTest(org.eclipse.egit.core.test.rebase.RebaseInteractivePlanTest$JoinedListTest)  Time elapsed: 0 s
lastIndexOfTest(org.eclipse.egit.core.test.rebase.RebaseInteractivePlanTest$JoinedListTest)  Time elapsed: 0 s
addToIndexTest(org.eclipse.egit.core.test.rebase.RebaseInteractivePlanTest$JoinedListTest)  Time elapsed: 0 s
containsAllTest(org.eclipse.egit.core.test.rebase.RebaseInteractivePlanTest$JoinedListTest)  Time elapsed: 0 s
addAllToIndexInSecondeListTest(org.eclipse.egit.core.test.rebase.RebaseInteractivePlanTest$JoinedListTest)  Time elapsed: 0 s
isEmptyTest(org.eclipse.egit.core.test.rebase.RebaseInteractivePlanTest$JoinedListTest)  Time elapsed: 0 s
getTest(org.eclipse.egit.core.test.rebase.RebaseInteractivePlanTest$JoinedListTest)  Time elapsed: 0 s
removeAllTest(org.eclipse.egit.core.test.rebase.RebaseInteractivePlanTest$JoinedListTest)  Time elapsed: 0 s
sizeTest(org.eclipse.egit.core.test.rebase.RebaseInteractivePlanTest$JoinedListTest)  Time elapsed: 0.001 s
addAllTest(org.eclipse.egit.core.test.rebase.RebaseInteractivePlanTest$JoinedListTest)  Time elapsed: 0 s
indexOfTest(org.eclipse.egit.core.test.rebase.RebaseInteractivePlanTest$JoinedListTest)  Time elapsed: 0 s
removeIndexTest(org.eclipse.egit.core.test.rebase.RebaseInteractivePlanTest$JoinedListTest)  Time elapsed: 0 s
setTest(org.eclipse.egit.core.test.rebase.RebaseInteractivePlanTest$JoinedListTest)  Time elapsed: 0 s
Running org.eclipse.egit.core.test.GitProjectSetCapabilityTest
Tests run: 6, Failures: 0, Errors: 0, Skipped: 0, Time elapsed: 0.706 s - in org.eclipse.egit.core.test.GitProjectSetCapabilityTest
testImportWithMultipleCallsForSameDestinationRepo(org.eclipse.egit.core.test.GitProjectSetCapabilityTest)  Time elapsed: 0.137 s
testImportFromRepoWithUrlOnlyDifferingInUserName(org.eclipse.egit.core.test.GitProjectSetCapabilityTest)  Time elapsed: 0.022 s
testExport(org.eclipse.egit.core.test.GitProjectSetCapabilityTest)  Time elapsed: 0.054 s
testImport(org.eclipse.egit.core.test.GitProjectSetCapabilityTest)  Time elapsed: 0.28 s
testImportWithDifferentBranchesOfSameRepo(org.eclipse.egit.core.test.GitProjectSetCapabilityTest)  Time elapsed: 0.182 s
testImportWhereRepoAlreadyExistsAtDifferentLocation(org.eclipse.egit.core.test.GitProjectSetCapabilityTest)  Time elapsed: 0.03 s
Running org.eclipse.egit.core.test.SubmoduleAndContainerTreeIteratorTest
Tests run: 2, Failures: 0, Errors: 0, Skipped: 0, Time elapsed: 0.812 s - in org.eclipse.egit.core.test.SubmoduleAndContainerTreeIteratorTest
testCleanStateAfterInit(org.eclipse.egit.core.test.SubmoduleAndContainerTreeIteratorTest)  Time elapsed: 0.586 s
testCleanStateFirstCommit(org.eclipse.egit.core.test.SubmoduleAndContainerTreeIteratorTest)  Time elapsed: 0.226 s
Running org.eclipse.egit.core.test.HistoryTest
Tests run: 8, Failures: 0, Errors: 0, Skipped: 0, Time elapsed: 1.781 s - in org.eclipse.egit.core.test.HistoryTest
queryFile2Targets(org.eclipse.egit.core.test.HistoryTest)  Time elapsed: 0.116 s
queryFile2Contributors(org.eclipse.egit.core.test.HistoryTest)  Time elapsed: 0.099 s
queryFile1Contributors(org.eclipse.egit.core.test.HistoryTest)  Time elapsed: 0.098 s
queryHistoryThroughTeam(org.eclipse.egit.core.test.HistoryTest)  Time elapsed: 0.117 s
queryFile1FullHistory(org.eclipse.egit.core.test.HistoryTest)  Time elapsed: 0.112 s
queryFile2FullHistory(org.eclipse.egit.core.test.HistoryTest)  Time elapsed: 1.016 s
queryFile1Targets(org.eclipse.egit.core.test.HistoryTest)  Time elapsed: 0.102 s
querySingleRevisions(org.eclipse.egit.core.test.HistoryTest)  Time elapsed: 0.121 s
Running org.eclipse.egit.core.test.FileDeleteHookTest
Tests run: 1, Failures: 0, Errors: 0, Skipped: 0, Time elapsed: 0.218 s - in org.eclipse.egit.core.test.FileDeleteHookTest
deleteTest(org.eclipse.egit.core.test.FileDeleteHookTest)  Time elapsed: 0.218 s
Running org.eclipse.egit.core.test.EclipseGitProgressTransformerTest
Tests run: 3, Failures: 0, Errors: 0, Skipped: 0, Time elapsed: 2.024 s - in org.eclipse.egit.core.test.EclipseGitProgressTransformerTest
testUnboundedMonitor(org.eclipse.egit.core.test.EclipseGitProgressTransformerTest)  Time elapsed: 1.005 s
testBoundedMonitor(org.eclipse.egit.core.test.EclipseGitProgressTransformerTest)  Time elapsed: 0.001 s
testUnboundedMonitorFastUpdate(org.eclipse.egit.core.test.EclipseGitProgressTransformerTest)  Time elapsed: 1.001 s
Running org.eclipse.egit.core.test.ProjectReferenceTest
Tests run: 3, Failures: 0, Errors: 0, Skipped: 0, Time elapsed: 0 s - in org.eclipse.egit.core.test.ProjectReferenceTest
checkProject(org.eclipse.egit.core.test.ProjectReferenceTest)  Time elapsed: 0 s
checkBranch(org.eclipse.egit.core.test.ProjectReferenceTest)  Time elapsed: 0 s
checkUrl(org.eclipse.egit.core.test.ProjectReferenceTest)  Time elapsed: 0 s
Running org.eclipse.egit.core.test.CommitUtilTest
Tests run: 1, Failures: 0, Errors: 0, Skipped: 0, Time elapsed: 0.198 s - in org.eclipse.egit.core.test.CommitUtilTest
sortCommits(org.eclipse.egit.core.test.CommitUtilTest)  Time elapsed: 0.198 s
Running org.eclipse.egit.core.test.MergeWithPreferredStrategyTest
Tests run: 3, Failures: 0, Errors: 0, Skipped: 0, Time elapsed: 0.284 s - in org.eclipse.egit.core.test.MergeWithPreferredStrategyTest
testStrategyCanBeOverridden(org.eclipse.egit.core.test.MergeWithPreferredStrategyTest)  Time elapsed: 0.099 s
testMergeUsesPreferredStrategy(org.eclipse.egit.core.test.MergeWithPreferredStrategyTest)  Time elapsed: 0.09 s
testMergeUsesPreferredStrategyRegisteredWithExplicitName(org.eclipse.egit.core.test.MergeWithPreferredStrategyTest)  Time elapsed: 0.095 s
Running org.eclipse.egit.core.test.GitURITest
Tests run: 6, Failures: 0, Errors: 0, Skipped: 0, Time elapsed: 0.002 s - in org.eclipse.egit.core.test.GitURITest
testScmUriWithPath(org.eclipse.egit.core.test.GitURITest)  Time elapsed: 0.001 s
testInvalidScmUriForCVS(org.eclipse.egit.core.test.GitURITest)  Time elapsed: 0 s
testInvalidScmUriWithoutPath(org.eclipse.egit.core.test.GitURITest)  Time elapsed: 0 s
testScmUriWithPathAndTag(org.eclipse.egit.core.test.GitURITest)  Time elapsed: 0 s
testScmUriWithPathProjectAndTag(org.eclipse.egit.core.test.GitURITest)  Time elapsed: 0 s
testInvalidScmUriWithQuotationMarks(org.eclipse.egit.core.test.GitURITest)  Time elapsed: 0.001 s
Running org.eclipse.egit.core.test.RevUtilsTest
Tests run: 1, Failures: 0, Errors: 0, Skipped: 0, Time elapsed: 0.028 s - in org.eclipse.egit.core.test.RevUtilsTest
isContainedInAnyRef(org.eclipse.egit.core.test.RevUtilsTest)  Time elapsed: 0.028 s
Running org.eclipse.egit.core.test.LinkedResourcesTest
Tests run: 5, Failures: 0, Errors: 0, Skipped: 0, Time elapsed: 1.798 s - in org.eclipse.egit.core.test.LinkedResourcesTest
testLinkedResourcesIgnoredByContainerTreeIterator(org.eclipse.egit.core.test.LinkedResourcesTest)  Time elapsed: 1.098 s
testLinkedResourcesIgnoredByGitResourceDeltaVisitor(org.eclipse.egit.core.test.LinkedResourcesTest)  Time elapsed: 0.149 s
testLinkTargetsInSameRepositoryNotIgnoredByGitResourceDeltaVisitor(org.eclipse.egit.core.test.LinkedResourcesTest)  Time elapsed: 0.143 s
testLinkedResourcesIgnoredByIteratorService(org.eclipse.egit.core.test.LinkedResourcesTest)  Time elapsed: 0.267 s
testGitProviderCanHandleLinkedResources(org.eclipse.egit.core.test.LinkedResourcesTest)  Time elapsed: 0.139 s
Running org.eclipse.egit.core.test.internal.mapping.HistoryTest
Tests run: 8, Failures: 0, Errors: 0, Skipped: 0, Time elapsed: 0.209 s - in org.eclipse.egit.core.test.internal.mapping.HistoryTest
testIndexRevision(org.eclipse.egit.core.test.internal.mapping.HistoryTest)  Time elapsed: 0.037 s
testIndexRevisionSecondCommit(org.eclipse.egit.core.test.internal.mapping.HistoryTest)  Time elapsed: 0.025 s
testShallowHistory(org.eclipse.egit.core.test.internal.mapping.HistoryTest)  Time elapsed: 0.025 s
testSingleRevision_1(org.eclipse.egit.core.test.internal.mapping.HistoryTest)  Time elapsed: 0.024 s
testSingleRevision_2(org.eclipse.egit.core.test.internal.mapping.HistoryTest)  Time elapsed: 0.025 s
testSingleRevision_3(org.eclipse.egit.core.test.internal.mapping.HistoryTest)  Time elapsed: 0.025 s
testDeepHistory_A(org.eclipse.egit.core.test.internal.mapping.HistoryTest)  Time elapsed: 0.024 s
testDeepHistory_B(org.eclipse.egit.core.test.internal.mapping.HistoryTest)  Time elapsed: 0.023 s
Running org.eclipse.egit.core.test.UtilsTest
Tests run: 1, Failures: 0, Errors: 0, Skipped: 0, Time elapsed: 0 s - in org.eclipse.egit.core.test.UtilsTest
testLineEndingNormalization(org.eclipse.egit.core.test.UtilsTest)  Time elapsed: 0 s
Running org.eclipse.egit.core.test.PreferredMergeStrategyTest

!ENTRY org.eclipse.egit.core 4 0 2019-11-28 21:30:18.611
!MESSAGE The configuration of the preferred merge strategy is invalid. It refers to a merge strategy called "invalid value" which is not registered. The default recursive strategy will be used instead.
Tests run: 4, Failures: 0, Errors: 0, Skipped: 0, Time elapsed: 0.001 s - in org.eclipse.egit.core.test.PreferredMergeStrategyTest
testGetPreferredMergeStrategyWhenInvalidPreference(org.eclipse.egit.core.test.PreferredMergeStrategyTest)  Time elapsed: 0 s
testGetPreferredMergeStrategyWhenValidPreference(org.eclipse.egit.core.test.PreferredMergeStrategyTest)  Time elapsed: 0 s
testGetPreferredMergeStrategyWhenNoPref(org.eclipse.egit.core.test.PreferredMergeStrategyTest)  Time elapsed: 0 s
testGetDefaultPreferredMergeStrategy(org.eclipse.egit.core.test.PreferredMergeStrategyTest)  Time elapsed: 0 s
Running org.eclipse.egit.core.synchronize.ThreeWayDiffEntryTest
Tests run: 9, Failures: 0, Errors: 0, Skipped: 0, Time elapsed: 0.08 s - in org.eclipse.egit.core.synchronize.ThreeWayDiffEntryTest
shouldListIncomingDelete(org.eclipse.egit.core.synchronize.ThreeWayDiffEntryTest)  Time elapsed: 0.01 s
shouldListIncomingModify(org.eclipse.egit.core.synchronize.ThreeWayDiffEntryTest)  Time elapsed: 0.01 s
shouldListIncomingAddition(org.eclipse.egit.core.synchronize.ThreeWayDiffEntryTest)  Time elapsed: 0.008 s
shouldListConflictingChange(org.eclipse.egit.core.synchronize.ThreeWayDiffEntryTest)  Time elapsed: 0.007 s
shouldListConflictingModify(org.eclipse.egit.core.synchronize.ThreeWayDiffEntryTest)  Time elapsed: 0.01 s
shouldListOutgoingAddition(org.eclipse.egit.core.synchronize.ThreeWayDiffEntryTest)  Time elapsed: 0.007 s
shouldListOutgoingDelete(org.eclipse.egit.core.synchronize.ThreeWayDiffEntryTest)  Time elapsed: 0.008 s
shouldListOutgoingModify(org.eclipse.egit.core.synchronize.ThreeWayDiffEntryTest)  Time elapsed: 0.01 s
shouldListConflictingChange2(org.eclipse.egit.core.synchronize.ThreeWayDiffEntryTest)  Time elapsed: 0.008 s
Running org.eclipse.egit.core.synchronize.dto.GitSynchronizeDataTest
Tests run: 1, Failures: 0, Errors: 0, Skipped: 0, Time elapsed: 0.074 s - in org.eclipse.egit.core.synchronize.dto.GitSynchronizeDataTest
shouldReturnDstMergeForRemoteBranch(org.eclipse.egit.core.synchronize.dto.GitSynchronizeDataTest)  Time elapsed: 0.073 s
Running org.eclipse.egit.core.synchronize.GitSubscriberResourceMappingContextTest
Tests run: 11, Failures: 0, Errors: 0, Skipped: 0, Time elapsed: 3.096 s - in org.eclipse.egit.core.synchronize.GitSubscriberResourceMappingContextTest
hasRemoteChanges(org.eclipse.egit.core.synchronize.GitSubscriberResourceMappingContextTest)  Time elapsed: 0.099 s
hasRemoteChangeInNewFile(org.eclipse.egit.core.synchronize.GitSubscriberResourceMappingContextTest)  Time elapsed: 1.091 s
hasLocalChangeWithFileRemoval(org.eclipse.egit.core.synchronize.GitSubscriberResourceMappingContextTest)  Time elapsed: 0.079 s
hasDeletion(org.eclipse.egit.core.synchronize.GitSubscriberResourceMappingContextTest)  Time elapsed: 0.084 s
hasLocalChangeInNewFolder(org.eclipse.egit.core.synchronize.GitSubscriberResourceMappingContextTest)  Time elapsed: 0.072 s
hasRemoteChangeInNewFolder(org.eclipse.egit.core.synchronize.GitSubscriberResourceMappingContextTest)  Time elapsed: 0.107 s
hasNestedDeletion(org.eclipse.egit.core.synchronize.GitSubscriberResourceMappingContextTest)  Time elapsed: 0.104 s
hasLocalChange(org.eclipse.egit.core.synchronize.GitSubscriberResourceMappingContextTest)  Time elapsed: 1.084 s
hasLocalChangeWhenRefreshingParentFolder(org.eclipse.egit.core.synchronize.GitSubscriberResourceMappingContextTest)  Time elapsed: 0.138 s
hasLocalAndRemoteChangeInSubFolder(org.eclipse.egit.core.synchronize.GitSubscriberResourceMappingContextTest)  Time elapsed: 0.119 s
hasLocalAndRemoteChange(org.eclipse.egit.core.synchronize.GitSubscriberResourceMappingContextTest)  Time elapsed: 0.118 s
Running org.eclipse.egit.core.synchronize.GitResourceVariantTreeTest
Tests run: 7, Failures: 0, Errors: 0, Skipped: 0, Time elapsed: 4.206 s - in org.eclipse.egit.core.synchronize.GitResourceVariantTreeTest
shouldReturnNullResourceVariant2(org.eclipse.egit.core.synchronize.GitResourceVariantTreeTest)  Time elapsed: 1.162 s
shouldReturnOneRoot(org.eclipse.egit.core.synchronize.GitResourceVariantTreeTest)  Time elapsed: 0.179 s
shouldReturnTwoRoots(org.eclipse.egit.core.synchronize.GitResourceVariantTreeTest)  Time elapsed: 0.185 s
shoulReturnSameResourceVariant(org.eclipse.egit.core.synchronize.GitResourceVariantTreeTest)  Time elapsed: 1.177 s
shouldReturnNullResourceVariant(org.eclipse.egit.core.synchronize.GitResourceVariantTreeTest)  Time elapsed: 0.176 s
shouldNotReturnNullOnSameResouceVariant(org.eclipse.egit.core.synchronize.GitResourceVariantTreeTest)  Time elapsed: 0.191 s
shouldReturnDifferentResourceVariant(org.eclipse.egit.core.synchronize.GitResourceVariantTreeTest)  Time elapsed: 1.135 s
Running org.eclipse.egit.core.synchronize.GitCommitsModelCacheTest
Tests run: 14, Failures: 0, Errors: 0, Skipped: 0, Time elapsed: 0.193 s - in org.eclipse.egit.core.synchronize.GitCommitsModelCacheTest
shouldListAllTypeOfChangesInsideSeparateFoldersInOneCommit(org.eclipse.egit.core.synchronize.GitCommitsModelCacheTest)  Time elapsed: 0.018 s
shouldListAdditionOrDeletionInsideFolderInCommit(org.eclipse.egit.core.synchronize.GitCommitsModelCacheTest)  Time elapsed: 0.013 s
shouldListAdditionsOrDeletionsInsideFolderInCommit(org.eclipse.egit.core.synchronize.GitCommitsModelCacheTest)  Time elapsed: 0.013 s
shouldListChangeInsideFolderInCommit(org.eclipse.egit.core.synchronize.GitCommitsModelCacheTest)  Time elapsed: 0.014 s
shouldListChangesInsideFolderInCommit(org.eclipse.egit.core.synchronize.GitCommitsModelCacheTest)  Time elapsed: 0.015 s
shouldListAllTypeOfChangesInOneCommit(org.eclipse.egit.core.synchronize.GitCommitsModelCacheTest)  Time elapsed: 0.015 s
shouldApplyPathFilter(org.eclipse.egit.core.synchronize.GitCommitsModelCacheTest)  Time elapsed: 0.014 s
shouldListAllTypeOfChangesInsideFolderInOneCommit(org.eclipse.egit.core.synchronize.GitCommitsModelCacheTest)  Time elapsed: 0.015 s
shouldListChangesInsideSeparateFoldersInCommit(org.eclipse.egit.core.synchronize.GitCommitsModelCacheTest)  Time elapsed: 0.016 s
shouldListAdditionOrDeletionInCommit(org.eclipse.egit.core.synchronize.GitCommitsModelCacheTest)  Time elapsed: 0.013 s
shouldListAdditionsOrDeletionsInsideSeparateFoldersInCommit(org.eclipse.egit.core.synchronize.GitCommitsModelCacheTest)  Time elapsed: 0.013 s
shouldNotListEmptyCommits(org.eclipse.egit.core.synchronize.GitCommitsModelCacheTest)  Time elapsed: 0.01 s
shouldReturnEmptyListForSameSrcAndDstCommit(org.eclipse.egit.core.synchronize.GitCommitsModelCacheTest)  Time elapsed: 0.01 s
shouldListChangeInCommit(org.eclipse.egit.core.synchronize.GitCommitsModelCacheTest)  Time elapsed: 0.013 s
Running org.eclipse.egit.core.synchronize.GitResourceVariantComparatorTest
Tests run: 19, Failures: 0, Errors: 0, Skipped: 0, Time elapsed: 9.33 s - in org.eclipse.egit.core.synchronize.GitResourceVariantComparatorTest
shouldReturnFalseWhenRemoteDoesNotExist2(org.eclipse.egit.core.synchronize.GitResourceVariantComparatorTest)  Time elapsed: 0.221 s
shouldReturnFalseWhenComparingContainerAndContainer(org.eclipse.egit.core.synchronize.GitResourceVariantComparatorTest)  Time elapsed: 1.084 s
shouldReturnFalseWhenComparingRemoteVariantContainerWithFile(org.eclipse.egit.core.synchronize.GitResourceVariantComparatorTest)  Time elapsed: 0.186 s
shouldReturnFalseWhenShortContentIsDifferent(org.eclipse.egit.core.synchronize.GitResourceVariantComparatorTest)  Time elapsed: 0.22 s
shouldReturnFalseWhenLongContentLengthIsDifferent(org.eclipse.egit.core.synchronize.GitResourceVariantComparatorTest)  Time elapsed: 1.126 s
shouldReturnFalseWhenComparingFileAndContainer(org.eclipse.egit.core.synchronize.GitResourceVariantComparatorTest)  Time elapsed: 0.181 s
shouldReturnFalseWhenContentLengthIsDifferent(org.eclipse.egit.core.synchronize.GitResourceVariantComparatorTest)  Time elapsed: 0.174 s
shouldReturnFalseWhenRemoteDoesNotExist(org.eclipse.egit.core.synchronize.GitResourceVariantComparatorTest)  Time elapsed: 1.176 s
shouldReturnFalseWhenComparingRemoteVariantFileWithContainer(org.eclipse.egit.core.synchronize.GitResourceVariantComparatorTest)  Time elapsed: 0.183 s
shouldReturnTrueWhenComparingContainerAndContainer(org.eclipse.egit.core.synchronize.GitResourceVariantComparatorTest)  Time elapsed: 0.176 s
shouldReturnTrueWhenComparingRemoteVariantContainerWithContainer(org.eclipse.egit.core.synchronize.GitResourceVariantComparatorTest)  Time elapsed: 1.145 s
shouldReturnFalseWhenComparingRemoteVariantWithDifferentObjectId(org.eclipse.egit.core.synchronize.GitResourceVariantComparatorTest)  Time elapsed: 0.191 s
shouldReturnTrueWhenShortContentIsDifferent(org.eclipse.egit.core.synchronize.GitResourceVariantComparatorTest)  Time elapsed: 0.174 s
shouldReturnFalseWhenRemoteVariantDoesntExist(org.eclipse.egit.core.synchronize.GitResourceVariantComparatorTest)  Time elapsed: 1.176 s
shouldReturnTrueWhenLongContentLengthIsDifferent(org.eclipse.egit.core.synchronize.GitResourceVariantComparatorTest)  Time elapsed: 0.184 s
shouldReturnFalseWhenComparingRemoteVariantContainerWithContainer(org.eclipse.egit.core.synchronize.GitResourceVariantComparatorTest)  Time elapsed: 0.198 s
shouldReturnTrueWhenComparingRemoteVariant(org.eclipse.egit.core.synchronize.GitResourceVariantComparatorTest)  Time elapsed: 1.149 s
shouldReturnFalseWhenLongContentIsDifferent(org.eclipse.egit.core.synchronize.GitResourceVariantComparatorTest)  Time elapsed: 0.187 s
shouldReturnFalseWhenBaseDoesntExist(org.eclipse.egit.core.synchronize.GitResourceVariantComparatorTest)  Time elapsed: 0.196 s
Running org.eclipse.egit.core.synchronize.ChangeTest
Tests run: 8, Failures: 0, Errors: 0, Skipped: 0, Time elapsed: 0.001 s - in org.eclipse.egit.core.synchronize.ChangeTest
shouldNotBeEqualWhenObjectIdsAreDifferent(org.eclipse.egit.core.synchronize.ChangeTest)  Time elapsed: 0 s
shouldNotBeEqualWithDifferentType(org.eclipse.egit.core.synchronize.ChangeTest)  Time elapsed: 0 s
shouldNotBeEqualWhenOneRemoteObjectIsNull(org.eclipse.egit.core.synchronize.ChangeTest)  Time elapsed: 0 s
shouldBeEqualWhenBothIdsAreNull(org.eclipse.egit.core.synchronize.ChangeTest)  Time elapsed: 0 s
shouldBeEqualWhenBothObjectIdsAreTheSame(org.eclipse.egit.core.synchronize.ChangeTest)  Time elapsed: 0 s
shouldBeEqualWhenBothObjectIdsAndRemoteIdsAreSame(org.eclipse.egit.core.synchronize.ChangeTest)  Time elapsed: 0 s
shouldNotBeEqualWithNullReference(org.eclipse.egit.core.synchronize.ChangeTest)  Time elapsed: 0 s
shouldNotBeEqualWhenOneObjectIdIsNull(org.eclipse.egit.core.synchronize.ChangeTest)  Time elapsed: 0 s
Running org.eclipse.egit.core.synchronize.WorkingTreeChangeCacheTest
Tests run: 13, Failures: 0, Errors: 0, Skipped: 0, Time elapsed: 0.166 s - in org.eclipse.egit.core.synchronize.WorkingTreeChangeCacheTest
shouldListSingleWorkspaceChangeInFolder(org.eclipse.egit.core.synchronize.WorkingTreeChangeCacheTest)  Time elapsed: 0.011 s
shouldListTwoWorkspaceAdditionsInFolder(org.eclipse.egit.core.synchronize.WorkingTreeChangeCacheTest)  Time elapsed: 0.009 s
shouldListTwoWorkspaceDeletionsInFolder(org.eclipse.egit.core.synchronize.WorkingTreeChangeCacheTest)  Time elapsed: 0.01 s
shouldListTwoWorkspaceChanges(org.eclipse.egit.core.synchronize.WorkingTreeChangeCacheTest)  Time elapsed: 0.009 s
shouldListSingleWorkspaceDeletion(org.eclipse.egit.core.synchronize.WorkingTreeChangeCacheTest)  Time elapsed: 0.032 s
shouldListSingleWorkspaceAdditionInFolder(org.eclipse.egit.core.synchronize.WorkingTreeChangeCacheTest)  Time elapsed: 0.008 s
shouldNotListIgnoredFile(org.eclipse.egit.core.synchronize.WorkingTreeChangeCacheTest)  Time elapsed: 0.01 s
shouldListTwoWorkspaceDeletions(org.eclipse.egit.core.synchronize.WorkingTreeChangeCacheTest)  Time elapsed: 0.009 s
shouldListSingleWorkspaceDeletionInFolder(org.eclipse.egit.core.synchronize.WorkingTreeChangeCacheTest)  Time elapsed: 0.009 s
shouldListSingleWorkspaceChange(org.eclipse.egit.core.synchronize.WorkingTreeChangeCacheTest)  Time elapsed: 0.009 s
shouldListTwoWorkspaceChangesInFolder(org.eclipse.egit.core.synchronize.WorkingTreeChangeCacheTest)  Time elapsed: 0.03 s
shouldListSingleWorkspaceAddition(org.eclipse.egit.core.synchronize.WorkingTreeChangeCacheTest)  Time elapsed: 0.009 s
shouldListTwoWorkspaceAdditions(org.eclipse.egit.core.synchronize.WorkingTreeChangeCacheTest)  Time elapsed: 0.009 s
Running org.eclipse.egit.core.synchronize.GitResourceVariantTreeSubscriberTest
Tests run: 3, Failures: 0, Errors: 0, Skipped: 0, Time elapsed: 1.201 s - in org.eclipse.egit.core.synchronize.GitResourceVariantTreeSubscriberTest
testSyncBranchAndMaster(org.eclipse.egit.core.synchronize.GitResourceVariantTreeSubscriberTest)  Time elapsed: 0.982 s
testSyncMasterAndBranch(org.eclipse.egit.core.synchronize.GitResourceVariantTreeSubscriberTest)  Time elapsed: 0.113 s
testSyncLocalAndBranch(org.eclipse.egit.core.synchronize.GitResourceVariantTreeSubscriberTest)  Time elapsed: 0.106 s
Running org.eclipse.egit.core.synchronize.StagedChangeCacheTest
Tests run: 12, Failures: 0, Errors: 0, Skipped: 0, Time elapsed: 0.326 s - in org.eclipse.egit.core.synchronize.StagedChangeCacheTest
shouldListSingleWorkspaceChangeInFolder(org.eclipse.egit.core.synchronize.StagedChangeCacheTest)  Time elapsed: 0.051 s
shouldListTwoWorkspaceAdditionsInFolder(org.eclipse.egit.core.synchronize.StagedChangeCacheTest)  Time elapsed: 0.009 s
shouldListTwoWorkspaceDeletionsInFolder(org.eclipse.egit.core.synchronize.StagedChangeCacheTest)  Time elapsed: 0.056 s
shouldListTwoWorkspaceChanges(org.eclipse.egit.core.synchronize.StagedChangeCacheTest)  Time elapsed: 0.026 s
shouldListSingleWorkspaceDeletion(org.eclipse.egit.core.synchronize.StagedChangeCacheTest)  Time elapsed: 0.031 s
shouldListSingleWorkspaceAdditionInFolder(org.eclipse.egit.core.synchronize.StagedChangeCacheTest)  Time elapsed: 0.024 s
shouldListTwoWorkspaceDeletions(org.eclipse.egit.core.synchronize.StagedChangeCacheTest)  Time elapsed: 0.02 s
shouldListSingleWorkspaceDeletionInFolder(org.eclipse.egit.core.synchronize.StagedChangeCacheTest)  Time elapsed: 0.017 s
shouldListSingleWorkspaceChange(org.eclipse.egit.core.synchronize.StagedChangeCacheTest)  Time elapsed: 0.024 s
shouldListTwoWorkspaceChangesInFolder(org.eclipse.egit.core.synchronize.StagedChangeCacheTest)  Time elapsed: 0.012 s
shouldListSingleWorkspaceAddition(org.eclipse.egit.core.synchronize.StagedChangeCacheTest)  Time elapsed: 0.036 s
shouldListTwoWorkspaceAdditions(org.eclipse.egit.core.synchronize.StagedChangeCacheTest)  Time elapsed: 0.018 s
Running org.eclipse.egit.core.synchronize.GitSubscriberMergeContextTest
Tests run: 6, Failures: 0, Errors: 0, Skipped: 0, Time elapsed: 9.314 s - in org.eclipse.egit.core.synchronize.GitSubscriberMergeContextTest
mergeWithConflict(org.eclipse.egit.core.synchronize.GitSubscriberMergeContextTest)  Time elapsed: 1.363 s
mergeModelWithDeletedFileNoConflict(org.eclipse.egit.core.synchronize.GitSubscriberMergeContextTest)  Time elapsed: 2.877 s
mergeNoConflict(org.eclipse.egit.core.synchronize.GitSubscriberMergeContextTest)  Time elapsed: 1.516 s
mergeModelWithConflict(org.eclipse.egit.core.synchronize.GitSubscriberMergeContextTest)  Time elapsed: 1.512 s
markAsMerged(org.eclipse.egit.core.synchronize.GitSubscriberMergeContextTest)  Time elapsed: 0.492 s
mergeModelNoConflict(org.eclipse.egit.core.synchronize.GitSubscriberMergeContextTest)  Time elapsed: 1.553 s
Running org.eclipse.egit.core.internal.indexdiff.IndexDiffCacheEntryTest
Tests run: 3, Failures: 0, Errors: 0, Skipped: 0, Time elapsed: 2.485 s - in org.eclipse.egit.core.internal.indexdiff.IndexDiffCacheEntryTest
basicTest(org.eclipse.egit.core.internal.indexdiff.IndexDiffCacheEntryTest)  Time elapsed: 0.525 s
testProjectDeletion(org.eclipse.egit.core.internal.indexdiff.IndexDiffCacheEntryTest)  Time elapsed: 1.176 s
testReloadAndUpdate(org.eclipse.egit.core.internal.indexdiff.IndexDiffCacheEntryTest)  Time elapsed: 0.784 s
Running org.eclipse.egit.core.internal.indexdiff.IndexDiffCacheTest
Tests run: 7, Failures: 0, Errors: 0, Skipped: 0, Time elapsed: 9.892 s - in org.eclipse.egit.core.internal.indexdiff.IndexDiffCacheTest
testAddFileFromUntrackedFolder(org.eclipse.egit.core.internal.indexdiff.IndexDiffCacheTest)  Time elapsed: 1.331 s
testAddingAFile(org.eclipse.egit.core.internal.indexdiff.IndexDiffCacheTest)  Time elapsed: 0.33 s
testAddIgnoredFolder(org.eclipse.egit.core.internal.indexdiff.IndexDiffCacheTest)  Time elapsed: 0.428 s
testAddAndRemoveGitIgnoreFileToIgnoredDir(org.eclipse.egit.core.internal.indexdiff.IndexDiffCacheTest)  Time elapsed: 1.684 s
testModifyFileInIgnoredDir(org.eclipse.egit.core.internal.indexdiff.IndexDiffCacheTest)  Time elapsed: 1.237 s
testAddAndRemoveFileToIgnoredDir(org.eclipse.egit.core.internal.indexdiff.IndexDiffCacheTest)  Time elapsed: 3.395 s
testRemoveIgnoredFile(org.eclipse.egit.core.internal.indexdiff.IndexDiffCacheTest)  Time elapsed: 1.486 s
Running org.eclipse.egit.core.internal.indexdiff.IndexDiffDataTest
Tests run: 2, Failures: 0, Errors: 0, Skipped: 0, Time elapsed: 0.029 s - in org.eclipse.egit.core.internal.indexdiff.IndexDiffDataTest
testIsAnyPrefixOf(org.eclipse.egit.core.internal.indexdiff.IndexDiffDataTest)  Time elapsed: 0.016 s
testMergeIgnored(org.eclipse.egit.core.internal.indexdiff.IndexDiffDataTest)  Time elapsed: 0.012 s
Running org.eclipse.egit.core.internal.ProjectReferenceImporterTest
Tests run: 5, Failures: 0, Errors: 0, Skipped: 0, Time elapsed: 0.079 s - in org.eclipse.egit.core.internal.ProjectReferenceImporterTest
findRepository_MultipleRemotes(org.eclipse.egit.core.internal.ProjectReferenceImporterTest)  Time elapsed: 0.016 s
findRepository_SameURLs(org.eclipse.egit.core.internal.ProjectReferenceImporterTest)  Time elapsed: 0.015 s
findRepository_DifferentUsersAndRepoSuffixes(org.eclipse.egit.core.internal.ProjectReferenceImporterTest)  Time elapsed: 0.016 s
findRepository_DifferentRepos(org.eclipse.egit.core.internal.ProjectReferenceImporterTest)  Time elapsed: 0.015 s
findRepository_DifferentUsers(org.eclipse.egit.core.internal.ProjectReferenceImporterTest)  Time elapsed: 0.017 s
Running org.eclipse.egit.core.internal.SshPreferencesMirrorTest
Tests run: 1, Failures: 0, Errors: 0, Skipped: 0, Time elapsed: 0.004 s - in org.eclipse.egit.core.internal.SshPreferencesMirrorTest
testAbsoluteKeyPath(org.eclipse.egit.core.internal.SshPreferencesMirrorTest)  Time elapsed: 0.001 s
Running org.eclipse.egit.core.internal.util.RepositoryPathCheckerTest
Tests run: 7, Failures: 0, Errors: 0, Skipped: 1, Time elapsed: 0.002 s - in org.eclipse.egit.core.internal.util.RepositoryPathCheckerTest
testSSH(org.eclipse.egit.core.internal.util.RepositoryPathCheckerTest)  Time elapsed: 0 s
testLocalAbsoluteFileUnix(org.eclipse.egit.core.internal.util.RepositoryPathCheckerTest)  Time elapsed: 0 s
testFile(org.eclipse.egit.core.internal.util.RepositoryPathCheckerTest)  Time elapsed: 0.001 s
testHTTP(org.eclipse.egit.core.internal.util.RepositoryPathCheckerTest)  Time elapsed: 0 s
testLocalAbsoluteFileWindows(org.eclipse.egit.core.internal.util.RepositoryPathCheckerTest) skipped
testLocalRelativePath(org.eclipse.egit.core.internal.util.RepositoryPathCheckerTest)  Time elapsed: 0 s
testFooBar(org.eclipse.egit.core.internal.util.RepositoryPathCheckerTest)  Time elapsed: 0 s
Running org.eclipse.egit.core.internal.util.ProjectUtilTest
Tests run: 14, Failures: 0, Errors: 0, Skipped: 0, Time elapsed: 0.579 s - in org.eclipse.egit.core.internal.util.ProjectUtilTest
testFindProjectFilesNested(org.eclipse.egit.core.internal.util.ProjectUtilTest)  Time elapsed: 0.026 s
testFindProjectFilesEmptyDir(org.eclipse.egit.core.internal.util.ProjectUtilTest)  Time elapsed: 0.015 s
testGetValidOpenProjects(org.eclipse.egit.core.internal.util.ProjectUtilTest)  Time elapsed: 0.016 s
testGetProjectsUnconnected(org.eclipse.egit.core.internal.util.ProjectUtilTest)  Time elapsed: 0.014 s
testGetValidOpenProjectsClosedProject(org.eclipse.egit.core.internal.util.ProjectUtilTest)  Time elapsed: 0.015 s
testCloseMissingProject(org.eclipse.egit.core.internal.util.ProjectUtilTest)  Time elapsed: 0.095 s
testFindProjectFiles(org.eclipse.egit.core.internal.util.ProjectUtilTest)  Time elapsed: 0.016 s
testFindProjectFilesNullDir(org.eclipse.egit.core.internal.util.ProjectUtilTest)  Time elapsed: 0.016 s
testGetProjects(org.eclipse.egit.core.internal.util.ProjectUtilTest)  Time elapsed: 0.062 s
testRefreshResource(org.eclipse.egit.core.internal.util.ProjectUtilTest)  Time elapsed: 0.06 s
testGetNestedProjectsContains(org.eclipse.egit.core.internal.util.ProjectUtilTest)  Time elapsed: 0.064 s
testFindContainer(org.eclipse.egit.core.internal.util.ProjectUtilTest)  Time elapsed: 0.061 s
testGetProjectsContains(org.eclipse.egit.core.internal.util.ProjectUtilTest)  Time elapsed: 0.07 s
testRefreshRepositoryResources(org.eclipse.egit.core.internal.util.ProjectUtilTest)  Time elapsed: 0.033 s
Running org.eclipse.egit.core.internal.util.ResourceUtilTest
Tests run: 6, Failures: 0, Errors: 0, Skipped: 0, Time elapsed: 0.379 s - in org.eclipse.egit.core.internal.util.ResourceUtilTest
getFileForLocationShouldReturnExistingFileInCaseOfNestedNotClosedProject(org.eclipse.egit.core.internal.util.ResourceUtilTest)  Time elapsed: 0.072 s
getFileForLocationShouldNotUseFilesWithoutRepositoryMapping(org.eclipse.egit.core.internal.util.ResourceUtilTest)  Time elapsed: 0.034 s
getFileForLocationShouldReturnExistingFileInCaseOfNestedProject(org.eclipse.egit.core.internal.util.ResourceUtilTest)  Time elapsed: 0.193 s
getResourceForLocationShouldReturnNullForInexistentFile(org.eclipse.egit.core.internal.util.ResourceUtilTest)  Time elapsed: 0.018 s
getResourceForLocationShouldReturnFile(org.eclipse.egit.core.internal.util.ResourceUtilTest)  Time elapsed: 0.044 s
getResourceForLocationShouldReturnFolder(org.eclipse.egit.core.internal.util.ResourceUtilTest)  Time elapsed: 0.018 s
Running org.eclipse.egit.core.internal.storage.IndexFileRevisionTest
Tests run: 6, Failures: 0, Errors: 0, Skipped: 0, Time elapsed: 0.1 s - in org.eclipse.egit.core.internal.storage.IndexFileRevisionTest
shouldUseFirstWhenNotSpecified(org.eclipse.egit.core.internal.storage.IndexFileRevisionTest)  Time elapsed: 0.015 s
stage3With2Missing(org.eclipse.egit.core.internal.storage.IndexFileRevisionTest)  Time elapsed: 0.016 s
missingEntry(org.eclipse.egit.core.internal.storage.IndexFileRevisionTest)  Time elapsed: 0.022 s
missingStage(org.eclipse.egit.core.internal.storage.IndexFileRevisionTest)  Time elapsed: 0.015 s
stage0WithoutOtherStages(org.eclipse.egit.core.internal.storage.IndexFileRevisionTest)  Time elapsed: 0.016 s
stage1WithOtherStages(org.eclipse.egit.core.internal.storage.IndexFileRevisionTest)  Time elapsed: 0.015 s
Running org.eclipse.egit.core.internal.storage.CommitFileRevisionTest
Tests run: 4, Failures: 0, Errors: 0, Skipped: 0, Time elapsed: 0.114 s - in org.eclipse.egit.core.internal.storage.CommitFileRevisionTest
testWithAttributesCheckedIn(org.eclipse.egit.core.internal.storage.CommitFileRevisionTest)  Time elapsed: 0.031 s
testWithAttributesCheckedInAndWithGlobalAttributes(org.eclipse.egit.core.internal.storage.CommitFileRevisionTest)  Time elapsed: 0.03 s
testWithAttributesNotCheckedIn(org.eclipse.egit.core.internal.storage.CommitFileRevisionTest)  Time elapsed: 0.026 s
testWithAttributesNotCheckedInButWithGlobalAttributes(org.eclipse.egit.core.internal.storage.CommitFileRevisionTest)  Time elapsed: 0.027 s
Running org.eclipse.egit.core.GitMoveDeleteHookTest
Tests run: 21, Failures: 0, Errors: 0, Skipped: 0, Time elapsed: 16.966 s - in org.eclipse.egit.core.GitMoveDeleteHookTest
testRenameProjectOutsideWorkspaceContainingGitRepo(org.eclipse.egit.core.GitMoveDeleteHookTest)  Time elapsed: 1.246 s
testDeleteFolder(org.eclipse.egit.core.GitMoveDeleteHookTest)  Time elapsed: 0.124 s
testDeleteProject(org.eclipse.egit.core.GitMoveDeleteHookTest)  Time elapsed: 0.124 s
testMoveAndRenameProjectContainingGitRepo(org.eclipse.egit.core.GitMoveDeleteHookTest)  Time elapsed: 0.126 s
testMoveButDoNotRenameProjectOutsideWorkspaceContainingGitRepo(org.eclipse.egit.core.GitMoveDeleteHookTest)  Time elapsed: 1.131 s
testMoveProjectWithinGitRepoMoveFromOneLevelDownOutsideTheRepo(org.eclipse.egit.core.GitMoveDeleteHookTest)  Time elapsed: 0.266 s
testMoveProjectWithinGitOutsideWorkspaceRepoMoveFromOneLevelDownToSameDepth(org.eclipse.egit.core.GitMoveDeleteHookTest)  Time elapsed: 1.273 s
testMoveProjectWithinGitOutsideWorkspaceRepoMoveFromOneLevelDownOutsideTheRepo(org.eclipse.egit.core.GitMoveDeleteHookTest)  Time elapsed: 0.254 s
testMoveProjectWithinGitRepoMoveFromTopOneLevelDown(org.eclipse.egit.core.GitMoveDeleteHookTest)  Time elapsed: 1.267 s
testMoveProjectWithinGitOutsideWorkspaceRepoMoveFromTopOneLevelDown(org.eclipse.egit.core.GitMoveDeleteHookTest)  Time elapsed: 0.257 s
testMoveProjectWithinGitRepoMoveFromLevelZeroDownOne(org.eclipse.egit.core.GitMoveDeleteHookTest)  Time elapsed: 1.245 s
testMoveProjectWithinGitRepoMoveFromOneLevelDownToTop(org.eclipse.egit.core.GitMoveDeleteHookTest)  Time elapsed: 0.259 s
testMoveProjectWithinGitOutsideWorkspaceRepoMoveFromOneLevelDownToTop(org.eclipse.egit.core.GitMoveDeleteHookTest)  Time elapsed: 1.273 s
testMoveFile(org.eclipse.egit.core.GitMoveDeleteHookTest)  Time elapsed: 0.24 s
testMoveFileWithConflictsShouldBeCanceled(org.eclipse.egit.core.GitMoveDeleteHookTest)  Time elapsed: 0.239 s
testMoveProjectWithinGitRepoMoveFromOneLevelDownToSameDepth(org.eclipse.egit.core.GitMoveDeleteHookTest)  Time elapsed: 1.169 s
testDeleteFile(org.eclipse.egit.core.GitMoveDeleteHookTest)  Time elapsed: 3.403 s
testMoveFolder(org.eclipse.egit.core.GitMoveDeleteHookTest)  Time elapsed: 0.254 s
testMoveFolderWithFileWithConflictsShouldBeCanceled(org.eclipse.egit.core.GitMoveDeleteHookTest)  Time elapsed: 1.289 s
testMoveProjectWithinGitRepoMoveAtSameTopLevel(org.eclipse.egit.core.GitMoveDeleteHookTest)  Time elapsed: 0.259 s
testMoveProjectWithinGitOutsideWorkspaceRepoMoveAtSameTopLevel(org.eclipse.egit.core.GitMoveDeleteHookTest)  Time elapsed: 1.264 s
Running org.eclipse.egit.core.project.RepositoryMappingTest
Tests run: 8, Failures: 0, Errors: 0, Skipped: 0, Time elapsed: 1.866 s - in org.eclipse.egit.core.project.RepositoryMappingTest
shouldReturnMappingForResourceInProject(org.eclipse.egit.core.project.RepositoryMappingTest)  Time elapsed: 0.119 s
shouldResolveRelativePathRelativeToContainer(org.eclipse.egit.core.project.RepositoryMappingTest)  Time elapsed: 0.118 s
shouldResolveAsRelativePath(org.eclipse.egit.core.project.RepositoryMappingTest)  Time elapsed: 0.118 s
shouldFindRepositoryMappingForRepository(org.eclipse.egit.core.project.RepositoryMappingTest)  Time elapsed: 0.121 s
shouldNotReturnMappingForResourceOutsideOfProject(org.eclipse.egit.core.project.RepositoryMappingTest)  Time elapsed: 1.025 s
shouldReturnMappingWhenPathIsRepository(org.eclipse.egit.core.project.RepositoryMappingTest)  Time elapsed: 0.127 s
shouldNotReturnMappingWhenPathIsOutsideRepository(org.eclipse.egit.core.project.RepositoryMappingTest)  Time elapsed: 0.12 s
shouldReturnMappingForPathOutsideOfProject(org.eclipse.egit.core.project.RepositoryMappingTest)  Time elapsed: 0.117 s
Running org.eclipse.egit.core.op.ConfigureGerritAfterCloneMatcherTest
Tests run: 1, Failures: 0, Errors: 0, Skipped: 0, Time elapsed: 0.001 s - in org.eclipse.egit.core.op.ConfigureGerritAfterCloneMatcherTest
testMatches(org.eclipse.egit.core.op.ConfigureGerritAfterCloneMatcherTest)  Time elapsed: 0.001 s
Running org.eclipse.egit.core.storage.GitBlobStorageTest
Tests run: 6, Failures: 0, Errors: 0, Skipped: 0, Time elapsed: 0.131 s - in org.eclipse.egit.core.storage.GitBlobStorageTest
testGitFileHistorySingleProjectOk(org.eclipse.egit.core.storage.GitBlobStorageTest)  Time elapsed: 0.04 s
testOk(org.eclipse.egit.core.storage.GitBlobStorageTest)  Time elapsed: 0.018 s
testFailNotFound(org.eclipse.egit.core.storage.GitBlobStorageTest)  Time elapsed: 0.016 s
testFailWrongType(org.eclipse.egit.core.storage.GitBlobStorageTest)  Time elapsed: 0.015 s
testFailCorrupt(org.eclipse.egit.core.storage.GitBlobStorageTest)  Time elapsed: 0.025 s
testFailCorrupt2(org.eclipse.egit.core.storage.GitBlobStorageTest)  Time elapsed: 0.017 s
Running org.eclipse.egit.core.securestorage.EGitSecureStoreTest
Tests run: 13, Failures: 0, Errors: 0, Skipped: 0, Time elapsed: 0.022 s - in org.eclipse.egit.core.securestorage.EGitSecureStoreTest
testGetUserAndPassword(org.eclipse.egit.core.securestorage.EGitSecureStoreTest)  Time elapsed: 0.014 s
testGetUserAndPasswordURIContainingUserAndPass(org.eclipse.egit.core.securestorage.EGitSecureStoreTest)  Time elapsed: 0.001 s
testEnsureDefaultPortFtp(org.eclipse.egit.core.securestorage.EGitSecureStoreTest)  Time elapsed: 0 s
testEnsureDefaultPortSsh(org.eclipse.egit.core.securestorage.EGitSecureStoreTest)  Time elapsed: 0.001 s
testPutUserAndPasswordURIContainingUserAndPass(org.eclipse.egit.core.securestorage.EGitSecureStoreTest)  Time elapsed: 0.001 s
testGetUserAndPasswordUnknownURI(org.eclipse.egit.core.securestorage.EGitSecureStoreTest)  Time elapsed: 0 s
testGetUserAndPasswordURIContainingOtherUserAndPass(org.eclipse.egit.core.securestorage.EGitSecureStoreTest)  Time elapsed: 0.001 s
testEnsureDefaultPortHttp(org.eclipse.egit.core.securestorage.EGitSecureStoreTest)  Time elapsed: 0.001 s
testEnsureDefaultPortSftp(org.eclipse.egit.core.securestorage.EGitSecureStoreTest)  Time elapsed: 0 s
testClearCredentials(org.eclipse.egit.core.securestorage.EGitSecureStoreTest)  Time elapsed: 0.001 s
testEnsureDefaultPortHttps(org.eclipse.egit.core.securestorage.EGitSecureStoreTest)  Time elapsed: 0.001 s
testClearCredentialsTwice(org.eclipse.egit.core.securestorage.EGitSecureStoreTest)  Time elapsed: 0 s
testPutUserAndPassword(org.eclipse.egit.core.securestorage.EGitSecureStoreTest)  Time elapsed: 0.001 s

Results:

Errors: 
  CloneOperationTest>DualRepositoryTestCase.afterTestCase:52 » IO Could not dele...

Tests run: 384, Failures: 0, Errors: 1, Skipped: 1


!ENTRY org.eclipse.core.resources 2 10035 2019-11-28 21:31:19.768
!MESSAGE The workspace will exit with unsaved changes in this session.
[INFO] ------------------------------------------------------------------------
[INFO] Reactor Summary:
[INFO] 
[INFO] EGit Parent 5.6.0-SNAPSHOT ......................... SUCCESS [ 21.906 s]
[INFO] EGit Target Platform Definition .................... SUCCESS [  0.913 s]
[INFO] Eclipse EGit ....................................... SUCCESS [ 12.950 s]
[INFO] Git Team Provider (Core) ........................... SUCCESS [ 17.431 s]
[INFO] Git Team Provider (UI) ............................. SUCCESS [ 48.830 s]
[INFO] EGit Mylyn UI ...................................... SUCCESS [  6.966 s]
[INFO] Git Team Provider (Documentation) .................. SUCCESS [  6.457 s]
[INFO] Eclipse EGit Feature ............................... SUCCESS [  1.323 s]
[INFO] EGit Mylyn Feature ................................. SUCCESS [  1.425 s]
[INFO] Git Flow ........................................... SUCCESS [  6.188 s]
[INFO] Git Flow UI ........................................ SUCCESS [ 13.413 s]
[INFO] Eclipse EGit Gitflow Feature ....................... SUCCESS [  1.277 s]
[INFO] EGit JUnit Support ................................. SUCCESS [  6.558 s]
[INFO] GitFlow Test Plug-in ............................... SUCCESS [ 28.875 s]
[INFO] Eclipse EGit Source Feature ........................ SUCCESS [  1.197 s]
[INFO] EGit P2 Repository ................................. SUCCESS [ 13.944 s]
[INFO] EGit Core Test Plug-in ............................. FAILURE [01:48 min]
[INFO] EGit UI Test Plug-in ............................... SKIPPED
[INFO] EGit Mylyn UI Test Plug-in 5.6.0-SNAPSHOT .......... SKIPPED
[INFO] ------------------------------------------------------------------------
[INFO] BUILD FAILURE
[INFO] ------------------------------------------------------------------------
[INFO] Total time: 08:05 min
[INFO] Finished at: 2019-11-28T21:31:20Z
[INFO] ------------------------------------------------------------------------
[ERROR] Failed to execute goal org.eclipse.tycho:tycho-surefire-plugin:1.5.1:test (default-test) on project org.eclipse.egit.core.test: There are test failures.
[ERROR] 
[ERROR] Please refer to /home/jenkins/agent/workspace/egit-stable/repo/org.eclipse.egit.core.test/target/surefire-reports for the individual test results.
[ERROR] -> [Help 1]
org.apache.maven.lifecycle.LifecycleExecutionException: Failed to execute goal org.eclipse.tycho:tycho-surefire-plugin:1.5.1:test (default-test) on project org.eclipse.egit.core.test: There are test failures.

Please refer to /home/jenkins/agent/workspace/egit-stable/repo/org.eclipse.egit.core.test/target/surefire-reports for the individual test results.
    at org.apache.maven.lifecycle.internal.MojoExecutor.execute (MojoExecutor.java:213)
    at org.apache.maven.lifecycle.internal.MojoExecutor.execute (MojoExecutor.java:154)
    at org.apache.maven.lifecycle.internal.MojoExecutor.execute (MojoExecutor.java:146)
    at org.apache.maven.lifecycle.internal.LifecycleModuleBuilder.buildProject (LifecycleModuleBuilder.java:117)
    at org.apache.maven.lifecycle.internal.LifecycleModuleBuilder.buildProject (LifecycleModuleBuilder.java:81)
    at org.apache.maven.lifecycle.internal.builder.singlethreaded.SingleThreadedBuilder.build (SingleThreadedBuilder.java:56)
    at org.apache.maven.lifecycle.internal.LifecycleStarter.execute (LifecycleStarter.java:128)
    at org.apache.maven.DefaultMaven.doExecute (DefaultMaven.java:305)
    at org.apache.maven.DefaultMaven.doExecute (DefaultMaven.java:192)
    at org.apache.maven.DefaultMaven.execute (DefaultMaven.java:105)
    at org.apache.maven.cli.MavenCli.execute (MavenCli.java:954)
    at org.apache.maven.cli.MavenCli.doMain (MavenCli.java:288)
    at org.apache.maven.cli.MavenCli.main (MavenCli.java:192)
    at sun.reflect.NativeMethodAccessorImpl.invoke0 (Native Method)
    at sun.reflect.NativeMethodAccessorImpl.invoke (NativeMethodAccessorImpl.java:62)
    at sun.reflect.DelegatingMethodAccessorImpl.invoke (DelegatingMethodAccessorImpl.java:43)
    at java.lang.reflect.Method.invoke (Method.java:498)
    at org.codehaus.plexus.classworlds.launcher.Launcher.launchEnhanced (Launcher.java:289)
    at org.codehaus.plexus.classworlds.launcher.Launcher.launch (Launcher.java:229)
    at org.codehaus.plexus.classworlds.launcher.Launcher.mainWithExitCode (Launcher.java:415)
    at org.codehaus.plexus.classworlds.launcher.Launcher.main (Launcher.java:356)
Caused by: org.apache.maven.plugin.MojoFailureException: There are test failures.

Please refer to /home/jenkins/agent/workspace/egit-stable/repo/org.eclipse.egit.core.test/target/surefire-reports for the individual test results.
    at org.eclipse.tycho.surefire.TestMojo.runTest (TestMojo.java:1050)
    at org.eclipse.tycho.surefire.TestMojo.execute (TestMojo.java:702)
    at org.apache.maven.plugin.DefaultBuildPluginManager.executeMojo (DefaultBuildPluginManager.java:137)
    at org.apache.maven.lifecycle.internal.MojoExecutor.execute (MojoExecutor.java:208)
    at org.apache.maven.lifecycle.internal.MojoExecutor.execute (MojoExecutor.java:154)
    at org.apache.maven.lifecycle.internal.MojoExecutor.execute (MojoExecutor.java:146)
    at org.apache.maven.lifecycle.internal.LifecycleModuleBuilder.buildProject (LifecycleModuleBuilder.java:117)
    at org.apache.maven.lifecycle.internal.LifecycleModuleBuilder.buildProject (LifecycleModuleBuilder.java:81)
    at org.apache.maven.lifecycle.internal.builder.singlethreaded.SingleThreadedBuilder.build (SingleThreadedBuilder.java:56)
    at org.apache.maven.lifecycle.internal.LifecycleStarter.execute (LifecycleStarter.java:128)
    at org.apache.maven.DefaultMaven.doExecute (DefaultMaven.java:305)
    at org.apache.maven.DefaultMaven.doExecute (DefaultMaven.java:192)
    at org.apache.maven.DefaultMaven.execute (DefaultMaven.java:105)
    at org.apache.maven.cli.MavenCli.execute (MavenCli.java:954)
    at org.apache.maven.cli.MavenCli.doMain (MavenCli.java:288)
    at org.apache.maven.cli.MavenCli.main (MavenCli.java:192)
    at sun.reflect.NativeMethodAccessorImpl.invoke0 (Native Method)
    at sun.reflect.NativeMethodAccessorImpl.invoke (NativeMethodAccessorImpl.java:62)
    at sun.reflect.DelegatingMethodAccessorImpl.invoke (DelegatingMethodAccessorImpl.java:43)
    at java.lang.reflect.Method.invoke (Method.java:498)
    at org.codehaus.plexus.classworlds.launcher.Launcher.launchEnhanced (Launcher.java:289)
    at org.codehaus.plexus.classworlds.launcher.Launcher.launch (Launcher.java:229)
    at org.codehaus.plexus.classworlds.launcher.Launcher.mainWithExitCode (Launcher.java:415)
    at org.codehaus.plexus.classworlds.launcher.Launcher.main (Launcher.java:356)
[ERROR] 
[ERROR] Re-run Maven using the -X switch to enable full debug logging.
[ERROR] 
[ERROR] For more information about the errors and possible solutions, please read the following articles:
[ERROR] [Help 1] http://cwiki.apache.org/confluence/display/MAVEN/MojoFailureException
[ERROR] 
[ERROR] After correcting the problems, you can resume the build with the command
[ERROR]   mvn <goals> -rf :org.eclipse.egit.core.test
[Pipeline] }
[Pipeline] // stage
[Pipeline] stage
[Pipeline] { (Results)
[Pipeline] junit
Recording test results
[Pipeline] archiveArtifacts
Archiving artifacts
[Pipeline] findbugs
[FINDBUGS] Collecting findbugs analysis files...
[FINDBUGS] Searching for all files in /home/jenkins/agent/workspace/egit-stable/repo that match the pattern */target/*bugsXml.xml
[FINDBUGS] Parsing 7 files in /home/jenkins/agent/workspace/egit-stable/repo
[FINDBUGS] Successfully parsed file /home/jenkins/agent/workspace/egit-stable/repo/org.eclipse.egit.core.junit/target/spotbugsXml.xml with 4 unique warnings and 0 duplicates.
[FINDBUGS] Successfully parsed file /home/jenkins/agent/workspace/egit-stable/repo/org.eclipse.egit.core/target/spotbugsXml.xml with 15 unique warnings and 0 duplicates.
[FINDBUGS] Successfully parsed file /home/jenkins/agent/workspace/egit-stable/repo/org.eclipse.egit.gitflow.test/target/spotbugsXml.xml with 15 unique warnings and 0 duplicates.
[FINDBUGS] Successfully parsed file /home/jenkins/agent/workspace/egit-stable/repo/org.eclipse.egit.gitflow.ui/target/spotbugsXml.xml with 15 unique warnings and 0 duplicates.
[FINDBUGS] Successfully parsed file /home/jenkins/agent/workspace/egit-stable/repo/org.eclipse.egit.gitflow/target/spotbugsXml.xml with 17 unique warnings and 0 duplicates.
[FINDBUGS] Successfully parsed file /home/jenkins/agent/workspace/egit-stable/repo/org.eclipse.egit.mylyn.ui/target/spotbugsXml.xml with 17 unique warnings and 0 duplicates.
[FINDBUGS] Successfully parsed file /home/jenkins/agent/workspace/egit-stable/repo/org.eclipse.egit.ui/target/spotbugsXml.xml with 54 unique warnings and 0 duplicates.
Skipping warnings blame since pipelines do not have an SCM link.%n
[FINDBUGS] Computing warning deltas based on reference build #68
[Pipeline] dry
[DRY] Collecting duplicate code analysis files...
[DRY] Searching for all files in /home/jenkins/agent/workspace/egit-stable/repo that match the pattern **/cpd.xml
[DRY] Parsing 14 files in /home/jenkins/agent/workspace/egit-stable/repo
[DRY] Successfully parsed file /home/jenkins/agent/workspace/egit-stable/repo/org.eclipse.egit-feature/target/cpd.xml with 0 unique warnings and 0 duplicates.
[DRY] Successfully parsed file /home/jenkins/agent/workspace/egit-stable/repo/org.eclipse.egit.core.junit/target/cpd.xml with 0 unique warnings and 0 duplicates.
[DRY] Successfully parsed file /home/jenkins/agent/workspace/egit-stable/repo/org.eclipse.egit.core/target/cpd.xml with 4 unique warnings and 0 duplicates.
[DRY] Successfully parsed file /home/jenkins/agent/workspace/egit-stable/repo/org.eclipse.egit.doc/target/cpd.xml with 4 unique warnings and 0 duplicates.
[DRY] Successfully parsed file /home/jenkins/agent/workspace/egit-stable/repo/org.eclipse.egit.gitflow-feature/target/cpd.xml with 4 unique warnings and 0 duplicates.
[DRY] Successfully parsed file /home/jenkins/agent/workspace/egit-stable/repo/org.eclipse.egit.gitflow.test/target/cpd.xml with 4 unique warnings and 0 duplicates.
[DRY] Successfully parsed file /home/jenkins/agent/workspace/egit-stable/repo/org.eclipse.egit.gitflow.ui/target/cpd.xml with 4 unique warnings and 0 duplicates.
[DRY] Successfully parsed file /home/jenkins/agent/workspace/egit-stable/repo/org.eclipse.egit.gitflow/target/cpd.xml with 4 unique warnings and 0 duplicates.
[DRY] Successfully parsed file /home/jenkins/agent/workspace/egit-stable/repo/org.eclipse.egit.mylyn-feature/target/cpd.xml with 4 unique warnings and 0 duplicates.
[DRY] Successfully parsed file /home/jenkins/agent/workspace/egit-stable/repo/org.eclipse.egit.mylyn.ui/target/cpd.xml with 4 unique warnings and 0 duplicates.
[DRY] Successfully parsed file /home/jenkins/agent/workspace/egit-stable/repo/org.eclipse.egit.repository/target/cpd.xml with 4 unique warnings and 0 duplicates.
[DRY] Successfully parsed file /home/jenkins/agent/workspace/egit-stable/repo/org.eclipse.egit.source-feature/target/cpd.xml with 4 unique warnings and 0 duplicates.
[DRY] Successfully parsed file /home/jenkins/agent/workspace/egit-stable/repo/org.eclipse.egit.ui/target/cpd.xml with 37 unique warnings and 0 duplicates.
[DRY] Successfully parsed file /home/jenkins/agent/workspace/egit-stable/repo/org.eclipse.egit/target/cpd.xml with 37 unique warnings and 0 duplicates.
Skipping warnings blame since pipelines do not have an SCM link.%n
[DRY] Computing warning deltas based on reference build #68
[Pipeline] }
[Pipeline] // stage
[Pipeline] step
Sending e-mails to: egit-build@eclipse.org
[Pipeline] }
[Pipeline] // dir
[Pipeline] }
Terminating xvnc.
[Pipeline] // wrap
[Pipeline] }
[Pipeline] // timeout
[Pipeline] }
[Pipeline] // node
[Pipeline] }
[Pipeline] // timestamps
[Pipeline] End of Pipeline
ERROR: script returned exit code 1
Finished: FAILURE