FailedConsole Output

Skipping 936 KB.. Full Log
e: assertion 'size >= 0' failed in GtkScrollbar
16:31:19 [2020-09-21T20:31:19.636Z] 
16:31:19 [2020-09-21T20:31:19.636Z] (SWT:1616): Gtk-CRITICAL **: 20:31:19.472: gtk_box_gadget_distribute: assertion 'size >= 0' failed in GtkScrollbar
16:31:19 [2020-09-21T20:31:19.636Z] 
16:31:19 [2020-09-21T20:31:19.636Z] (SWT:1616): Gtk-CRITICAL **: 20:31:19.479: gtk_box_gadget_distribute: assertion 'size >= 0' failed in GtkScrollbar
16:31:19 [2020-09-21T20:31:19.636Z] 
16:31:19 [2020-09-21T20:31:19.636Z] (SWT:1616): Gtk-CRITICAL **: 20:31:19.496: gtk_box_gadget_distribute: assertion 'size >= 0' failed in GtkScrollbar
16:31:19 [2020-09-21T20:31:19.636Z] 
16:31:19 [2020-09-21T20:31:19.636Z] (SWT:1616): Gtk-CRITICAL **: 20:31:19.496: gtk_box_gadget_distribute: assertion 'size >= 0' failed in GtkScrollbar
16:31:19 [2020-09-21T20:31:19.636Z] 
16:31:19 [2020-09-21T20:31:19.636Z] (SWT:1616): Gtk-CRITICAL **: 20:31:19.542: gtk_box_gadget_distribute: assertion 'size >= 0' failed in GtkScrollbar
16:31:19 [2020-09-21T20:31:19.636Z] 
16:31:19 [2020-09-21T20:31:19.636Z] (SWT:1616): Gtk-CRITICAL **: 20:31:19.546: gtk_box_gadget_distribute: assertion 'size >= 0' failed in GtkScrollbar
16:31:19 [2020-09-21T20:31:19.636Z] 
16:31:19 [2020-09-21T20:31:19.636Z] (SWT:1616): Gtk-CRITICAL **: 20:31:19.546: gtk_box_gadget_distribute: assertion 'size >= 0' failed in GtkScrollbar
16:31:19 [2020-09-21T20:31:19.636Z] 
16:31:19 [2020-09-21T20:31:19.636Z] (SWT:1616): Gtk-CRITICAL **: 20:31:19.558: gtk_box_gadget_distribute: assertion 'size >= 0' failed in GtkScrollbar
16:31:19 [2020-09-21T20:31:19.636Z] 
16:31:19 [2020-09-21T20:31:19.636Z] (SWT:1616): Gtk-CRITICAL **: 20:31:19.559: gtk_box_gadget_distribute: assertion 'size >= 0' failed in GtkScrollbar
16:31:19 [2020-09-21T20:31:19.636Z] 
16:31:19 [2020-09-21T20:31:19.636Z] (SWT:1616): Gtk-CRITICAL **: 20:31:19.559: gtk_box_gadget_distribute: assertion 'size >= 0' failed in GtkScrollbar
16:31:19 [2020-09-21T20:31:19.636Z] 
16:31:19 [2020-09-21T20:31:19.636Z] (SWT:1616): Gtk-CRITICAL **: 20:31:19.571: gtk_box_gadget_distribute: assertion 'size >= 0' failed in GtkScrollbar
16:31:19 [2020-09-21T20:31:19.636Z] 
16:31:19 [2020-09-21T20:31:19.636Z] (SWT:1616): Gtk-WARNING **: 20:31:19.624: Negative content width -6 (allocation 1, extents 4x3) while allocating gadget (node toolbar, owner GtkToolbar)
16:31:20 [2020-09-21T20:31:20.221Z] 
16:31:20 [2020-09-21T20:31:20.221Z] (SWT:1616): Gtk-WARNING **: 20:31:19.995: Negative content width -6 (allocation 1, extents 4x3) while allocating gadget (node toolbar, owner GtkToolbar)
16:31:20 [2020-09-21T20:31:20.221Z] 
16:31:20 [2020-09-21T20:31:20.221Z] (SWT:1616): Gtk-WARNING **: 20:31:20.005: Negative content width -6 (allocation 1, extents 4x3) while allocating gadget (node toolbar, owner GtkToolbar)
16:31:20 [2020-09-21T20:31:20.813Z] 
16:31:20 [2020-09-21T20:31:20.813Z] (SWT:1616): Gtk-WARNING **: 20:31:20.640: Negative content width -6 (allocation 1, extents 4x3) while allocating gadget (node toolbar, owner GtkToolbar)
16:31:21 [2020-09-21T20:31:21.377Z] 
16:31:21 [2020-09-21T20:31:21.377Z] (SWT:1616): Gtk-CRITICAL **: 20:31:21.108: gtk_box_gadget_distribute: assertion 'size >= 0' failed in GtkScrollbar
16:31:21 [2020-09-21T20:31:21.377Z] 
16:31:21 [2020-09-21T20:31:21.377Z] (SWT:1616): Gtk-CRITICAL **: 20:31:21.115: gtk_box_gadget_distribute: assertion 'size >= 0' failed in GtkScrollbar
16:31:21 [2020-09-21T20:31:21.377Z] 
16:31:21 [2020-09-21T20:31:21.377Z] (SWT:1616): Gtk-WARNING **: 20:31:21.118: Negative content width -6 (allocation 1, extents 4x3) while allocating gadget (node toolbar, owner GtkToolbar)
16:31:21 [2020-09-21T20:31:21.377Z] 
16:31:21 [2020-09-21T20:31:21.377Z] (SWT:1616): Gtk-CRITICAL **: 20:31:21.123: gtk_box_gadget_distribute: assertion 'size >= 0' failed in GtkScrollbar
16:31:21 [2020-09-21T20:31:21.377Z] 
16:31:21 [2020-09-21T20:31:21.377Z] (SWT:1616): Gtk-CRITICAL **: 20:31:21.128: gtk_box_gadget_distribute: assertion 'size >= 0' failed in GtkScrollbar
16:31:21 [2020-09-21T20:31:21.377Z] 
16:31:21 [2020-09-21T20:31:21.377Z] (SWT:1616): Gtk-CRITICAL **: 20:31:21.129: gtk_box_gadget_distribute: assertion 'size >= 0' failed in GtkScrollbar
16:31:21 [2020-09-21T20:31:21.377Z] 
16:31:21 [2020-09-21T20:31:21.377Z] (SWT:1616): Gtk-CRITICAL **: 20:31:21.130: gtk_box_gadget_distribute: assertion 'size >= 0' failed in GtkScrollbar
16:31:21 [2020-09-21T20:31:21.377Z] 
16:31:21 [2020-09-21T20:31:21.377Z] (SWT:1616): Gtk-CRITICAL **: 20:31:21.137: gtk_box_gadget_distribute: assertion 'size >= 0' failed in GtkScrollbar
16:31:21 [2020-09-21T20:31:21.377Z] 
16:31:21 [2020-09-21T20:31:21.377Z] (SWT:1616): Gtk-CRITICAL **: 20:31:21.137: gtk_box_gadget_distribute: assertion 'size >= 0' failed in GtkScrollbar
16:31:21 [2020-09-21T20:31:21.377Z] 
16:31:21 [2020-09-21T20:31:21.377Z] (SWT:1616): Gtk-CRITICAL **: 20:31:21.144: gtk_box_gadget_distribute: assertion 'size >= 0' failed in GtkScrollbar
16:31:21 [2020-09-21T20:31:21.377Z] 
16:31:21 [2020-09-21T20:31:21.377Z] (SWT:1616): Gtk-CRITICAL **: 20:31:21.161: gtk_box_gadget_distribute: assertion 'size >= 0' failed in GtkScrollbar
16:31:21 [2020-09-21T20:31:21.377Z] 
16:31:21 [2020-09-21T20:31:21.377Z] (SWT:1616): Gtk-CRITICAL **: 20:31:21.161: gtk_box_gadget_distribute: assertion 'size >= 0' failed in GtkScrollbar
16:31:21 [2020-09-21T20:31:21.377Z] 
16:31:21 [2020-09-21T20:31:21.377Z] (SWT:1616): Gtk-CRITICAL **: 20:31:21.178: gtk_box_gadget_distribute: assertion 'size >= 0' failed in GtkScrollbar
16:31:21 [2020-09-21T20:31:21.377Z] 
16:31:21 [2020-09-21T20:31:21.377Z] (SWT:1616): Gtk-CRITICAL **: 20:31:21.178: gtk_box_gadget_distribute: assertion 'size >= 0' failed in GtkScrollbar
16:31:21 [2020-09-21T20:31:21.377Z] 
16:31:21 [2020-09-21T20:31:21.377Z] (SWT:1616): Gtk-CRITICAL **: 20:31:21.194: gtk_box_gadget_distribute: assertion 'size >= 0' failed in GtkScrollbar
16:31:21 [2020-09-21T20:31:21.377Z] 
16:31:21 [2020-09-21T20:31:21.377Z] (SWT:1616): Gtk-CRITICAL **: 20:31:21.194: gtk_box_gadget_distribute: assertion 'size >= 0' failed in GtkScrollbar
16:31:21 [2020-09-21T20:31:21.377Z] 
16:31:21 [2020-09-21T20:31:21.377Z] (SWT:1616): Gtk-CRITICAL **: 20:31:21.212: gtk_box_gadget_distribute: assertion 'size >= 0' failed in GtkScrollbar
16:31:21 [2020-09-21T20:31:21.378Z] 
16:31:21 [2020-09-21T20:31:21.378Z] (SWT:1616): Gtk-CRITICAL **: 20:31:21.212: gtk_box_gadget_distribute: assertion 'size >= 0' failed in GtkScrollbar
16:31:21 [2020-09-21T20:31:21.378Z] 
16:31:21 [2020-09-21T20:31:21.378Z] (SWT:1616): Gtk-CRITICAL **: 20:31:21.228: gtk_box_gadget_distribute: assertion 'size >= 0' failed in GtkScrollbar
16:31:21 [2020-09-21T20:31:21.378Z] 
16:31:21 [2020-09-21T20:31:21.378Z] (SWT:1616): Gtk-CRITICAL **: 20:31:21.228: gtk_box_gadget_distribute: assertion 'size >= 0' failed in GtkScrollbar
16:31:21 [2020-09-21T20:31:21.378Z] 
16:31:21 [2020-09-21T20:31:21.378Z] (SWT:1616): Gtk-CRITICAL **: 20:31:21.245: gtk_box_gadget_distribute: assertion 'size >= 0' failed in GtkScrollbar
16:31:21 [2020-09-21T20:31:21.378Z] 
16:31:21 [2020-09-21T20:31:21.378Z] (SWT:1616): Gtk-CRITICAL **: 20:31:21.245: gtk_box_gadget_distribute: assertion 'size >= 0' failed in GtkScrollbar
16:31:21 [2020-09-21T20:31:21.378Z] 
16:31:21 [2020-09-21T20:31:21.378Z] (SWT:1616): Gtk-CRITICAL **: 20:31:21.250: gtk_box_gadget_distribute: assertion 'size >= 0' failed in GtkScrollbar
16:31:21 [2020-09-21T20:31:21.378Z] 
16:31:21 [2020-09-21T20:31:21.378Z] (SWT:1616): Gtk-CRITICAL **: 20:31:21.251: gtk_box_gadget_distribute: assertion 'size >= 0' failed in GtkScrollbar
16:31:21 [2020-09-21T20:31:21.378Z] 
16:31:21 [2020-09-21T20:31:21.378Z] (SWT:1616): Gtk-CRITICAL **: 20:31:21.255: gtk_box_gadget_distribute: assertion 'size >= 0' failed in GtkScrollbar
16:31:21 [2020-09-21T20:31:21.378Z] 
16:31:21 [2020-09-21T20:31:21.378Z] (SWT:1616): Gtk-CRITICAL **: 20:31:21.256: gtk_box_gadget_distribute: assertion 'size >= 0' failed in GtkScrollbar
16:31:21 [2020-09-21T20:31:21.378Z] 
16:31:21 [2020-09-21T20:31:21.378Z] (SWT:1616): Gtk-CRITICAL **: 20:31:21.256: gtk_box_gadget_distribute: assertion 'size >= 0' failed in GtkScrollbar
16:31:21 [2020-09-21T20:31:21.378Z] 
16:31:21 [2020-09-21T20:31:21.378Z] (SWT:1616): Gtk-CRITICAL **: 20:31:21.261: gtk_box_gadget_distribute: assertion 'size >= 0' failed in GtkScrollbar
16:31:21 [2020-09-21T20:31:21.378Z] 
16:31:21 [2020-09-21T20:31:21.378Z] (SWT:1616): Gtk-CRITICAL **: 20:31:21.262: gtk_box_gadget_distribute: assertion 'size >= 0' failed in GtkScrollbar
16:31:21 [2020-09-21T20:31:21.378Z] 
16:31:21 [2020-09-21T20:31:21.378Z] (SWT:1616): Gtk-CRITICAL **: 20:31:21.266: gtk_box_gadget_distribute: assertion 'size >= 0' failed in GtkScrollbar
16:31:21 [2020-09-21T20:31:21.378Z] 
16:31:21 [2020-09-21T20:31:21.378Z] (SWT:1616): Gtk-CRITICAL **: 20:31:21.269: gtk_box_gadget_distribute: assertion 'size >= 0' failed in GtkScrollbar
16:31:21 [2020-09-21T20:31:21.378Z] 
16:31:21 [2020-09-21T20:31:21.378Z] (SWT:1616): Gtk-CRITICAL **: 20:31:21.269: gtk_box_gadget_distribute: assertion 'size >= 0' failed in GtkScrollbar
16:31:21 [2020-09-21T20:31:21.378Z] 
16:31:21 [2020-09-21T20:31:21.378Z] (SWT:1616): Gtk-CRITICAL **: 20:31:21.273: gtk_box_gadget_distribute: assertion 'size >= 0' failed in GtkScrollbar
16:31:21 [2020-09-21T20:31:21.378Z] 
16:31:21 [2020-09-21T20:31:21.378Z] (SWT:1616): Gtk-CRITICAL **: 20:31:21.284: gtk_box_gadget_distribute: assertion 'size >= 0' failed in GtkScrollbar
16:31:21 [2020-09-21T20:31:21.378Z] 
16:31:21 [2020-09-21T20:31:21.378Z] (SWT:1616): Gtk-CRITICAL **: 20:31:21.284: gtk_box_gadget_distribute: assertion 'size >= 0' failed in GtkScrollbar
16:31:21 [2020-09-21T20:31:21.378Z] 
16:31:21 [2020-09-21T20:31:21.378Z] (SWT:1616): Gtk-CRITICAL **: 20:31:21.297: gtk_box_gadget_distribute: assertion 'size >= 0' failed in GtkScrollbar
16:31:21 [2020-09-21T20:31:21.378Z] 
16:31:21 [2020-09-21T20:31:21.378Z] (SWT:1616): Gtk-WARNING **: 20:31:21.314: Negative content width -6 (allocation 1, extents 4x3) while allocating gadget (node toolbar, owner GtkToolbar)
16:31:21 [2020-09-21T20:31:21.943Z] 
16:31:21 [2020-09-21T20:31:21.943Z] (SWT:1616): Gtk-WARNING **: 20:31:21.739: Negative content width -6 (allocation 1, extents 4x3) while allocating gadget (node toolbar, owner GtkToolbar)
16:31:21 [2020-09-21T20:31:21.943Z] 
16:31:21 [2020-09-21T20:31:21.944Z] (SWT:1616): Gtk-WARNING **: 20:31:21.748: Negative content width -6 (allocation 1, extents 4x3) while allocating gadget (node toolbar, owner GtkToolbar)
16:31:22 [2020-09-21T20:31:22.507Z] 
16:31:22 [2020-09-21T20:31:22.507Z] (SWT:1616): Gtk-WARNING **: 20:31:22.323: Negative content width -6 (allocation 1, extents 4x3) while allocating gadget (node toolbar, owner GtkToolbar)
16:31:23 [2020-09-21T20:31:23.070Z] 
16:31:23 [2020-09-21T20:31:23.070Z] (SWT:1616): Gtk-CRITICAL **: 20:31:22.770: gtk_box_gadget_distribute: assertion 'size >= 0' failed in GtkScrollbar
16:31:23 [2020-09-21T20:31:23.070Z] 
16:31:23 [2020-09-21T20:31:23.070Z] (SWT:1616): Gtk-CRITICAL **: 20:31:22.777: gtk_box_gadget_distribute: assertion 'size >= 0' failed in GtkScrollbar
16:31:23 [2020-09-21T20:31:23.070Z] 
16:31:23 [2020-09-21T20:31:23.070Z] (SWT:1616): Gtk-WARNING **: 20:31:22.780: Negative content width -6 (allocation 1, extents 4x3) while allocating gadget (node toolbar, owner GtkToolbar)
16:31:23 [2020-09-21T20:31:23.070Z] 
16:31:23 [2020-09-21T20:31:23.070Z] (SWT:1616): Gtk-CRITICAL **: 20:31:22.786: gtk_box_gadget_distribute: assertion 'size >= 0' failed in GtkScrollbar
16:31:23 [2020-09-21T20:31:23.070Z] 
16:31:23 [2020-09-21T20:31:23.070Z] (SWT:1616): Gtk-CRITICAL **: 20:31:22.791: gtk_box_gadget_distribute: assertion 'size >= 0' failed in GtkScrollbar
16:31:23 [2020-09-21T20:31:23.070Z] 
16:31:23 [2020-09-21T20:31:23.070Z] (SWT:1616): Gtk-CRITICAL **: 20:31:22.792: gtk_box_gadget_distribute: assertion 'size >= 0' failed in GtkScrollbar
16:31:23 [2020-09-21T20:31:23.070Z] 
16:31:23 [2020-09-21T20:31:23.070Z] (SWT:1616): Gtk-CRITICAL **: 20:31:22.792: gtk_box_gadget_distribute: assertion 'size >= 0' failed in GtkScrollbar
16:31:23 [2020-09-21T20:31:23.070Z] 
16:31:23 [2020-09-21T20:31:23.070Z] (SWT:1616): Gtk-CRITICAL **: 20:31:22.799: gtk_box_gadget_distribute: assertion 'size >= 0' failed in GtkScrollbar
16:31:23 [2020-09-21T20:31:23.070Z] 
16:31:23 [2020-09-21T20:31:23.070Z] (SWT:1616): Gtk-CRITICAL **: 20:31:22.800: gtk_box_gadget_distribute: assertion 'size >= 0' failed in GtkScrollbar
16:31:23 [2020-09-21T20:31:23.070Z] 
16:31:23 [2020-09-21T20:31:23.070Z] (SWT:1616): Gtk-CRITICAL **: 20:31:22.813: gtk_box_gadget_distribute: assertion 'size >= 0' failed in GtkScrollbar
16:31:23 [2020-09-21T20:31:23.070Z] 
16:31:23 [2020-09-21T20:31:23.070Z] (SWT:1616): Gtk-CRITICAL **: 20:31:22.824: gtk_box_gadget_distribute: assertion 'size >= 0' failed in GtkScrollbar
16:31:23 [2020-09-21T20:31:23.070Z] 
16:31:23 [2020-09-21T20:31:23.070Z] (SWT:1616): Gtk-CRITICAL **: 20:31:22.824: gtk_box_gadget_distribute: assertion 'size >= 0' failed in GtkScrollbar
16:31:23 [2020-09-21T20:31:23.070Z] 
16:31:23 [2020-09-21T20:31:23.070Z] (SWT:1616): Gtk-CRITICAL **: 20:31:22.841: gtk_box_gadget_distribute: assertion 'size >= 0' failed in GtkScrollbar
16:31:23 [2020-09-21T20:31:23.070Z] 
16:31:23 [2020-09-21T20:31:23.070Z] (SWT:1616): Gtk-CRITICAL **: 20:31:22.841: gtk_box_gadget_distribute: assertion 'size >= 0' failed in GtkScrollbar
16:31:23 [2020-09-21T20:31:23.070Z] 
16:31:23 [2020-09-21T20:31:23.070Z] (SWT:1616): Gtk-CRITICAL **: 20:31:22.857: gtk_box_gadget_distribute: assertion 'size >= 0' failed in GtkScrollbar
16:31:23 [2020-09-21T20:31:23.070Z] 
16:31:23 [2020-09-21T20:31:23.070Z] (SWT:1616): Gtk-CRITICAL **: 20:31:22.857: gtk_box_gadget_distribute: assertion 'size >= 0' failed in GtkScrollbar
16:31:23 [2020-09-21T20:31:23.070Z] 
16:31:23 [2020-09-21T20:31:23.070Z] (SWT:1616): Gtk-CRITICAL **: 20:31:22.873: gtk_box_gadget_distribute: assertion 'size >= 0' failed in GtkScrollbar
16:31:23 [2020-09-21T20:31:23.070Z] 
16:31:23 [2020-09-21T20:31:23.070Z] (SWT:1616): Gtk-CRITICAL **: 20:31:22.873: gtk_box_gadget_distribute: assertion 'size >= 0' failed in GtkScrollbar
16:31:23 [2020-09-21T20:31:23.070Z] 
16:31:23 [2020-09-21T20:31:23.070Z] (SWT:1616): Gtk-CRITICAL **: 20:31:22.890: gtk_box_gadget_distribute: assertion 'size >= 0' failed in GtkScrollbar
16:31:23 [2020-09-21T20:31:23.070Z] 
16:31:23 [2020-09-21T20:31:23.070Z] (SWT:1616): Gtk-CRITICAL **: 20:31:22.890: gtk_box_gadget_distribute: assertion 'size >= 0' failed in GtkScrollbar
16:31:23 [2020-09-21T20:31:23.070Z] 
16:31:23 [2020-09-21T20:31:23.070Z] (SWT:1616): Gtk-CRITICAL **: 20:31:22.907: gtk_box_gadget_distribute: assertion 'size >= 0' failed in GtkScrollbar
16:31:23 [2020-09-21T20:31:23.070Z] 
16:31:23 [2020-09-21T20:31:23.070Z] (SWT:1616): Gtk-CRITICAL **: 20:31:22.907: gtk_box_gadget_distribute: assertion 'size >= 0' failed in GtkScrollbar
16:31:23 [2020-09-21T20:31:23.070Z] 
16:31:23 [2020-09-21T20:31:23.070Z] (SWT:1616): Gtk-CRITICAL **: 20:31:22.915: gtk_box_gadget_distribute: assertion 'size >= 0' failed in GtkScrollbar
16:31:23 [2020-09-21T20:31:23.070Z] 
16:31:23 [2020-09-21T20:31:23.070Z] (SWT:1616): Gtk-CRITICAL **: 20:31:22.916: gtk_box_gadget_distribute: assertion 'size >= 0' failed in GtkScrollbar
16:31:23 [2020-09-21T20:31:23.070Z] 
16:31:23 [2020-09-21T20:31:23.070Z] (SWT:1616): Gtk-CRITICAL **: 20:31:22.919: gtk_box_gadget_distribute: assertion 'size >= 0' failed in GtkScrollbar
16:31:23 [2020-09-21T20:31:23.070Z] 
16:31:23 [2020-09-21T20:31:23.070Z] (SWT:1616): Gtk-CRITICAL **: 20:31:22.920: gtk_box_gadget_distribute: assertion 'size >= 0' failed in GtkScrollbar
16:31:23 [2020-09-21T20:31:23.070Z] 
16:31:23 [2020-09-21T20:31:23.070Z] (SWT:1616): Gtk-CRITICAL **: 20:31:22.920: gtk_box_gadget_distribute: assertion 'size >= 0' failed in GtkScrollbar
16:31:23 [2020-09-21T20:31:23.070Z] 
16:31:23 [2020-09-21T20:31:23.070Z] (SWT:1616): Gtk-CRITICAL **: 20:31:22.924: gtk_box_gadget_distribute: assertion 'size >= 0' failed in GtkScrollbar
16:31:23 [2020-09-21T20:31:23.070Z] 
16:31:23 [2020-09-21T20:31:23.070Z] (SWT:1616): Gtk-CRITICAL **: 20:31:22.924: gtk_box_gadget_distribute: assertion 'size >= 0' failed in GtkScrollbar
16:31:23 [2020-09-21T20:31:23.070Z] 
16:31:23 [2020-09-21T20:31:23.070Z] (SWT:1616): Gtk-CRITICAL **: 20:31:22.929: gtk_box_gadget_distribute: assertion 'size >= 0' failed in GtkScrollbar
16:31:23 [2020-09-21T20:31:23.070Z] 
16:31:23 [2020-09-21T20:31:23.070Z] (SWT:1616): Gtk-CRITICAL **: 20:31:22.937: gtk_box_gadget_distribute: assertion 'size >= 0' failed in GtkScrollbar
16:31:23 [2020-09-21T20:31:23.070Z] 
16:31:23 [2020-09-21T20:31:23.070Z] (SWT:1616): Gtk-CRITICAL **: 20:31:22.938: gtk_box_gadget_distribute: assertion 'size >= 0' failed in GtkScrollbar
16:31:23 [2020-09-21T20:31:23.070Z] 
16:31:23 [2020-09-21T20:31:23.071Z] (SWT:1616): Gtk-CRITICAL **: 20:31:22.942: gtk_box_gadget_distribute: assertion 'size >= 0' failed in GtkScrollbar
16:31:23 [2020-09-21T20:31:23.071Z] 
16:31:23 [2020-09-21T20:31:23.071Z] (SWT:1616): Gtk-CRITICAL **: 20:31:22.942: gtk_box_gadget_distribute: assertion 'size >= 0' failed in GtkScrollbar
16:31:23 [2020-09-21T20:31:23.071Z] 
16:31:23 [2020-09-21T20:31:23.071Z] (SWT:1616): Gtk-CRITICAL **: 20:31:22.946: gtk_box_gadget_distribute: assertion 'size >= 0' failed in GtkScrollbar
16:31:23 [2020-09-21T20:31:23.071Z] 
16:31:23 [2020-09-21T20:31:23.071Z] (SWT:1616): Gtk-CRITICAL **: 20:31:22.965: gtk_box_gadget_distribute: assertion 'size >= 0' failed in GtkScrollbar
16:31:23 [2020-09-21T20:31:23.071Z] 
16:31:23 [2020-09-21T20:31:23.071Z] (SWT:1616): Gtk-WARNING **: 20:31:22.979: Negative content width -6 (allocation 1, extents 4x3) while allocating gadget (node toolbar, owner GtkToolbar)
16:31:23 [2020-09-21T20:31:23.634Z] 
16:31:23 [2020-09-21T20:31:23.634Z] (SWT:1616): Gtk-WARNING **: 20:31:23.500: Negative content width -6 (allocation 1, extents 4x3) while allocating gadget (node toolbar, owner GtkToolbar)
16:31:23 [2020-09-21T20:31:23.634Z] 
16:31:23 [2020-09-21T20:31:23.634Z] (SWT:1616): Gtk-WARNING **: 20:31:23.509: Negative content width -6 (allocation 1, extents 4x3) while allocating gadget (node toolbar, owner GtkToolbar)
16:31:24 [2020-09-21T20:31:24.198Z] 
16:31:24 [2020-09-21T20:31:24.198Z] (SWT:1616): Gtk-WARNING **: 20:31:24.091: Negative content width -6 (allocation 1, extents 4x3) while allocating gadget (node toolbar, owner GtkToolbar)
16:31:24 [2020-09-21T20:31:24.456Z] 
16:31:24 [2020-09-21T20:31:24.456Z] (SWT:1616): Gtk-CRITICAL **: 20:31:24.366: gtk_box_gadget_distribute: assertion 'size >= 0' failed in GtkScrollbar
16:31:24 [2020-09-21T20:31:24.456Z] 
16:31:24 [2020-09-21T20:31:24.456Z] (SWT:1616): Gtk-CRITICAL **: 20:31:24.373: gtk_box_gadget_distribute: assertion 'size >= 0' failed in GtkScrollbar
16:31:24 [2020-09-21T20:31:24.456Z] 
16:31:24 [2020-09-21T20:31:24.456Z] (SWT:1616): Gtk-WARNING **: 20:31:24.376: Negative content width -6 (allocation 1, extents 4x3) while allocating gadget (node toolbar, owner GtkToolbar)
16:31:24 [2020-09-21T20:31:24.456Z] 
16:31:24 [2020-09-21T20:31:24.456Z] (SWT:1616): Gtk-CRITICAL **: 20:31:24.382: gtk_box_gadget_distribute: assertion 'size >= 0' failed in GtkScrollbar
16:31:24 [2020-09-21T20:31:24.456Z] 
16:31:24 [2020-09-21T20:31:24.456Z] (SWT:1616): Gtk-CRITICAL **: 20:31:24.387: gtk_box_gadget_distribute: assertion 'size >= 0' failed in GtkScrollbar
16:31:24 [2020-09-21T20:31:24.456Z] 
16:31:24 [2020-09-21T20:31:24.456Z] (SWT:1616): Gtk-CRITICAL **: 20:31:24.388: gtk_box_gadget_distribute: assertion 'size >= 0' failed in GtkScrollbar
16:31:24 [2020-09-21T20:31:24.456Z] 
16:31:24 [2020-09-21T20:31:24.456Z] (SWT:1616): Gtk-CRITICAL **: 20:31:24.388: gtk_box_gadget_distribute: assertion 'size >= 0' failed in GtkScrollbar
16:31:24 [2020-09-21T20:31:24.456Z] 
16:31:24 [2020-09-21T20:31:24.456Z] (SWT:1616): Gtk-CRITICAL **: 20:31:24.401: gtk_box_gadget_distribute: assertion 'size >= 0' failed in GtkScrollbar
16:31:24 [2020-09-21T20:31:24.456Z] 
16:31:24 [2020-09-21T20:31:24.456Z] (SWT:1616): Gtk-CRITICAL **: 20:31:24.402: gtk_box_gadget_distribute: assertion 'size >= 0' failed in GtkScrollbar
16:31:24 [2020-09-21T20:31:24.456Z] 
16:31:24 [2020-09-21T20:31:24.456Z] (SWT:1616): Gtk-CRITICAL **: 20:31:24.409: gtk_box_gadget_distribute: assertion 'size >= 0' failed in GtkScrollbar
16:31:24 [2020-09-21T20:31:24.456Z] 
16:31:24 [2020-09-21T20:31:24.456Z] (SWT:1616): Gtk-CRITICAL **: 20:31:24.415: gtk_box_gadget_distribute: assertion 'size >= 0' failed in GtkScrollbar
16:31:24 [2020-09-21T20:31:24.456Z] 
16:31:24 [2020-09-21T20:31:24.456Z] (SWT:1616): Gtk-CRITICAL **: 20:31:24.416: gtk_box_gadget_distribute: assertion 'size >= 0' failed in GtkScrollbar
16:31:24 [2020-09-21T20:31:24.456Z] 
16:31:24 [2020-09-21T20:31:24.456Z] (SWT:1616): Gtk-CRITICAL **: 20:31:24.432: gtk_box_gadget_distribute: assertion 'size >= 0' failed in GtkScrollbar
16:31:24 [2020-09-21T20:31:24.456Z] 
16:31:24 [2020-09-21T20:31:24.456Z] (SWT:1616): Gtk-CRITICAL **: 20:31:24.432: gtk_box_gadget_distribute: assertion 'size >= 0' failed in GtkScrollbar
16:31:24 [2020-09-21T20:31:24.456Z] 
16:31:24 [2020-09-21T20:31:24.456Z] (SWT:1616): Gtk-CRITICAL **: 20:31:24.449: gtk_box_gadget_distribute: assertion 'size >= 0' failed in GtkScrollbar
16:31:24 [2020-09-21T20:31:24.456Z] 
16:31:24 [2020-09-21T20:31:24.456Z] (SWT:1616): Gtk-CRITICAL **: 20:31:24.449: gtk_box_gadget_distribute: assertion 'size >= 0' failed in GtkScrollbar
16:31:24 [2020-09-21T20:31:24.713Z] 
16:31:24 [2020-09-21T20:31:24.713Z] (SWT:1616): Gtk-CRITICAL **: 20:31:24.465: gtk_box_gadget_distribute: assertion 'size >= 0' failed in GtkScrollbar
16:31:24 [2020-09-21T20:31:24.713Z] 
16:31:24 [2020-09-21T20:31:24.714Z] (SWT:1616): Gtk-CRITICAL **: 20:31:24.466: gtk_box_gadget_distribute: assertion 'size >= 0' failed in GtkScrollbar
16:31:24 [2020-09-21T20:31:24.714Z] 
16:31:24 [2020-09-21T20:31:24.714Z] (SWT:1616): Gtk-CRITICAL **: 20:31:24.482: gtk_box_gadget_distribute: assertion 'size >= 0' failed in GtkScrollbar
16:31:24 [2020-09-21T20:31:24.714Z] 
16:31:24 [2020-09-21T20:31:24.714Z] (SWT:1616): Gtk-CRITICAL **: 20:31:24.482: gtk_box_gadget_distribute: assertion 'size >= 0' failed in GtkScrollbar
16:31:24 [2020-09-21T20:31:24.714Z] 
16:31:24 [2020-09-21T20:31:24.714Z] (SWT:1616): Gtk-CRITICAL **: 20:31:24.499: gtk_box_gadget_distribute: assertion 'size >= 0' failed in GtkScrollbar
16:31:24 [2020-09-21T20:31:24.714Z] 
16:31:24 [2020-09-21T20:31:24.714Z] (SWT:1616): Gtk-CRITICAL **: 20:31:24.499: gtk_box_gadget_distribute: assertion 'size >= 0' failed in GtkScrollbar
16:31:24 [2020-09-21T20:31:24.714Z] 
16:31:24 [2020-09-21T20:31:24.714Z] (SWT:1616): Gtk-CRITICAL **: 20:31:24.512: gtk_box_gadget_distribute: assertion 'size >= 0' failed in GtkScrollbar
16:31:24 [2020-09-21T20:31:24.714Z] 
16:31:24 [2020-09-21T20:31:24.714Z] (SWT:1616): Gtk-CRITICAL **: 20:31:24.512: gtk_box_gadget_distribute: assertion 'size >= 0' failed in GtkScrollbar
16:31:24 [2020-09-21T20:31:24.714Z] 
16:31:24 [2020-09-21T20:31:24.714Z] (SWT:1616): Gtk-CRITICAL **: 20:31:24.516: gtk_box_gadget_distribute: assertion 'size >= 0' failed in GtkScrollbar
16:31:24 [2020-09-21T20:31:24.714Z] 
16:31:24 [2020-09-21T20:31:24.714Z] (SWT:1616): Gtk-CRITICAL **: 20:31:24.516: gtk_box_gadget_distribute: assertion 'size >= 0' failed in GtkScrollbar
16:31:24 [2020-09-21T20:31:24.714Z] 
16:31:24 [2020-09-21T20:31:24.714Z] (SWT:1616): Gtk-CRITICAL **: 20:31:24.521: gtk_box_gadget_distribute: assertion 'size >= 0' failed in GtkScrollbar
16:31:24 [2020-09-21T20:31:24.714Z] 
16:31:24 [2020-09-21T20:31:24.714Z] (SWT:1616): Gtk-CRITICAL **: 20:31:24.522: gtk_box_gadget_distribute: assertion 'size >= 0' failed in GtkScrollbar
16:31:24 [2020-09-21T20:31:24.714Z] 
16:31:24 [2020-09-21T20:31:24.714Z] (SWT:1616): Gtk-CRITICAL **: 20:31:24.522: gtk_box_gadget_distribute: assertion 'size >= 0' failed in GtkScrollbar
16:31:24 [2020-09-21T20:31:24.714Z] 
16:31:24 [2020-09-21T20:31:24.714Z] (SWT:1616): Gtk-CRITICAL **: 20:31:24.526: gtk_box_gadget_distribute: assertion 'size >= 0' failed in GtkScrollbar
16:31:24 [2020-09-21T20:31:24.714Z] 
16:31:24 [2020-09-21T20:31:24.714Z] (SWT:1616): Gtk-CRITICAL **: 20:31:24.533: gtk_box_gadget_distribute: assertion 'size >= 0' failed in GtkScrollbar
16:31:24 [2020-09-21T20:31:24.714Z] 
16:31:24 [2020-09-21T20:31:24.714Z] (SWT:1616): Gtk-CRITICAL **: 20:31:24.534: gtk_box_gadget_distribute: assertion 'size >= 0' failed in GtkScrollbar
16:31:24 [2020-09-21T20:31:24.714Z] 
16:31:24 [2020-09-21T20:31:24.714Z] (SWT:1616): Gtk-CRITICAL **: 20:31:24.539: gtk_box_gadget_distribute: assertion 'size >= 0' failed in GtkScrollbar
16:31:24 [2020-09-21T20:31:24.714Z] 
16:31:24 [2020-09-21T20:31:24.714Z] (SWT:1616): Gtk-CRITICAL **: 20:31:24.539: gtk_box_gadget_distribute: assertion 'size >= 0' failed in GtkScrollbar
16:31:24 [2020-09-21T20:31:24.714Z] 
16:31:24 [2020-09-21T20:31:24.714Z] (SWT:1616): Gtk-CRITICAL **: 20:31:24.543: gtk_box_gadget_distribute: assertion 'size >= 0' failed in GtkScrollbar
16:31:24 [2020-09-21T20:31:24.714Z] 
16:31:24 [2020-09-21T20:31:24.714Z] (SWT:1616): Gtk-CRITICAL **: 20:31:24.552: gtk_box_gadget_distribute: assertion 'size >= 0' failed in GtkScrollbar
16:31:24 [2020-09-21T20:31:24.714Z] 
16:31:24 [2020-09-21T20:31:24.714Z] (SWT:1616): Gtk-CRITICAL **: 20:31:24.552: gtk_box_gadget_distribute: assertion 'size >= 0' failed in GtkScrollbar
16:31:24 [2020-09-21T20:31:24.714Z] 
16:31:24 [2020-09-21T20:31:24.714Z] (SWT:1616): Gtk-WARNING **: 20:31:24.576: Negative content width -6 (allocation 1, extents 4x3) while allocating gadget (node toolbar, owner GtkToolbar)
16:31:25 [2020-09-21T20:31:25.279Z] 
16:31:25 [2020-09-21T20:31:25.279Z] (SWT:1616): Gtk-WARNING **: 20:31:25.102: Negative content width -6 (allocation 1, extents 4x3) while allocating gadget (node toolbar, owner GtkToolbar)
16:31:25 [2020-09-21T20:31:25.279Z] 
16:31:25 [2020-09-21T20:31:25.279Z] (SWT:1616): Gtk-WARNING **: 20:31:25.112: Negative content width -6 (allocation 1, extents 4x3) while allocating gadget (node toolbar, owner GtkToolbar)
16:31:25 [2020-09-21T20:31:25.843Z] 
16:31:25 [2020-09-21T20:31:25.843Z] (SWT:1616): Gtk-WARNING **: 20:31:25.708: Negative content width -6 (allocation 1, extents 4x3) while allocating gadget (node toolbar, owner GtkToolbar)
16:31:26 [2020-09-21T20:31:26.408Z] 
16:31:26 [2020-09-21T20:31:26.408Z] (SWT:1616): Gtk-CRITICAL **: 20:31:26.159: gtk_box_gadget_distribute: assertion 'size >= 0' failed in GtkScrollbar
16:31:26 [2020-09-21T20:31:26.408Z] 
16:31:26 [2020-09-21T20:31:26.408Z] (SWT:1616): Gtk-CRITICAL **: 20:31:26.165: gtk_box_gadget_distribute: assertion 'size >= 0' failed in GtkScrollbar
16:31:26 [2020-09-21T20:31:26.408Z] 
16:31:26 [2020-09-21T20:31:26.408Z] (SWT:1616): Gtk-WARNING **: 20:31:26.169: Negative content width -6 (allocation 1, extents 4x3) while allocating gadget (node toolbar, owner GtkToolbar)
16:31:26 [2020-09-21T20:31:26.408Z] 
16:31:26 [2020-09-21T20:31:26.408Z] (SWT:1616): Gtk-CRITICAL **: 20:31:26.174: gtk_box_gadget_distribute: assertion 'size >= 0' failed in GtkScrollbar
16:31:26 [2020-09-21T20:31:26.408Z] 
16:31:26 [2020-09-21T20:31:26.408Z] (SWT:1616): Gtk-CRITICAL **: 20:31:26.180: gtk_box_gadget_distribute: assertion 'size >= 0' failed in GtkScrollbar
16:31:26 [2020-09-21T20:31:26.408Z] 
16:31:26 [2020-09-21T20:31:26.408Z] (SWT:1616): Gtk-CRITICAL **: 20:31:26.180: gtk_box_gadget_distribute: assertion 'size >= 0' failed in GtkScrollbar
16:31:26 [2020-09-21T20:31:26.408Z] 
16:31:26 [2020-09-21T20:31:26.408Z] (SWT:1616): Gtk-CRITICAL **: 20:31:26.181: gtk_box_gadget_distribute: assertion 'size >= 0' failed in GtkScrollbar
16:31:26 [2020-09-21T20:31:26.408Z] 
16:31:26 [2020-09-21T20:31:26.408Z] (SWT:1616): Gtk-CRITICAL **: 20:31:26.194: gtk_box_gadget_distribute: assertion 'size >= 0' failed in GtkScrollbar
16:31:26 [2020-09-21T20:31:26.408Z] 
16:31:26 [2020-09-21T20:31:26.408Z] (SWT:1616): Gtk-CRITICAL **: 20:31:26.194: gtk_box_gadget_distribute: assertion 'size >= 0' failed in GtkScrollbar
16:31:26 [2020-09-21T20:31:26.408Z] 
16:31:26 [2020-09-21T20:31:26.408Z] (SWT:1616): Gtk-CRITICAL **: 20:31:26.201: gtk_box_gadget_distribute: assertion 'size >= 0' failed in GtkScrollbar
16:31:26 [2020-09-21T20:31:26.408Z] 
16:31:26 [2020-09-21T20:31:26.408Z] (SWT:1616): Gtk-CRITICAL **: 20:31:26.209: gtk_box_gadget_distribute: assertion 'size >= 0' failed in GtkScrollbar
16:31:26 [2020-09-21T20:31:26.408Z] 
16:31:26 [2020-09-21T20:31:26.408Z] (SWT:1616): Gtk-CRITICAL **: 20:31:26.209: gtk_box_gadget_distribute: assertion 'size >= 0' failed in GtkScrollbar
16:31:26 [2020-09-21T20:31:26.408Z] 
16:31:26 [2020-09-21T20:31:26.409Z] (SWT:1616): Gtk-CRITICAL **: 20:31:26.225: gtk_box_gadget_distribute: assertion 'size >= 0' failed in GtkScrollbar
16:31:26 [2020-09-21T20:31:26.409Z] 
16:31:26 [2020-09-21T20:31:26.409Z] (SWT:1616): Gtk-CRITICAL **: 20:31:26.225: gtk_box_gadget_distribute: assertion 'size >= 0' failed in GtkScrollbar
16:31:26 [2020-09-21T20:31:26.409Z] 
16:31:26 [2020-09-21T20:31:26.409Z] (SWT:1616): Gtk-CRITICAL **: 20:31:26.241: gtk_box_gadget_distribute: assertion 'size >= 0' failed in GtkScrollbar
16:31:26 [2020-09-21T20:31:26.409Z] 
16:31:26 [2020-09-21T20:31:26.409Z] (SWT:1616): Gtk-CRITICAL **: 20:31:26.241: gtk_box_gadget_distribute: assertion 'size >= 0' failed in GtkScrollbar
16:31:26 [2020-09-21T20:31:26.409Z] 
16:31:26 [2020-09-21T20:31:26.409Z] (SWT:1616): Gtk-CRITICAL **: 20:31:26.259: gtk_box_gadget_distribute: assertion 'size >= 0' failed in GtkScrollbar
16:31:26 [2020-09-21T20:31:26.409Z] 
16:31:26 [2020-09-21T20:31:26.409Z] (SWT:1616): Gtk-CRITICAL **: 20:31:26.259: gtk_box_gadget_distribute: assertion 'size >= 0' failed in GtkScrollbar
16:31:26 [2020-09-21T20:31:26.409Z] 
16:31:26 [2020-09-21T20:31:26.409Z] (SWT:1616): Gtk-CRITICAL **: 20:31:26.275: gtk_box_gadget_distribute: assertion 'size >= 0' failed in GtkScrollbar
16:31:26 [2020-09-21T20:31:26.409Z] 
16:31:26 [2020-09-21T20:31:26.409Z] (SWT:1616): Gtk-CRITICAL **: 20:31:26.275: gtk_box_gadget_distribute: assertion 'size >= 0' failed in GtkScrollbar
16:31:26 [2020-09-21T20:31:26.409Z] 
16:31:26 [2020-09-21T20:31:26.409Z] (SWT:1616): Gtk-CRITICAL **: 20:31:26.292: gtk_box_gadget_distribute: assertion 'size >= 0' failed in GtkScrollbar
16:31:26 [2020-09-21T20:31:26.409Z] 
16:31:26 [2020-09-21T20:31:26.409Z] (SWT:1616): Gtk-CRITICAL **: 20:31:26.292: gtk_box_gadget_distribute: assertion 'size >= 0' failed in GtkScrollbar
16:31:26 [2020-09-21T20:31:26.409Z] 
16:31:26 [2020-09-21T20:31:26.409Z] (SWT:1616): Gtk-CRITICAL **: 20:31:26.304: gtk_box_gadget_distribute: assertion 'size >= 0' failed in GtkScrollbar
16:31:26 [2020-09-21T20:31:26.409Z] 
16:31:26 [2020-09-21T20:31:26.409Z] (SWT:1616): Gtk-CRITICAL **: 20:31:26.304: gtk_box_gadget_distribute: assertion 'size >= 0' failed in GtkScrollbar
16:31:26 [2020-09-21T20:31:26.409Z] 
16:31:26 [2020-09-21T20:31:26.409Z] (SWT:1616): Gtk-CRITICAL **: 20:31:26.308: gtk_box_gadget_distribute: assertion 'size >= 0' failed in GtkScrollbar
16:31:26 [2020-09-21T20:31:26.409Z] 
16:31:26 [2020-09-21T20:31:26.409Z] (SWT:1616): Gtk-CRITICAL **: 20:31:26.309: gtk_box_gadget_distribute: assertion 'size >= 0' failed in GtkScrollbar
16:31:26 [2020-09-21T20:31:26.409Z] 
16:31:26 [2020-09-21T20:31:26.409Z] (SWT:1616): Gtk-CRITICAL **: 20:31:26.313: gtk_box_gadget_distribute: assertion 'size >= 0' failed in GtkScrollbar
16:31:26 [2020-09-21T20:31:26.409Z] 
16:31:26 [2020-09-21T20:31:26.409Z] (SWT:1616): Gtk-CRITICAL **: 20:31:26.314: gtk_box_gadget_distribute: assertion 'size >= 0' failed in GtkScrollbar
16:31:26 [2020-09-21T20:31:26.409Z] 
16:31:26 [2020-09-21T20:31:26.409Z] (SWT:1616): Gtk-CRITICAL **: 20:31:26.314: gtk_box_gadget_distribute: assertion 'size >= 0' failed in GtkScrollbar
16:31:26 [2020-09-21T20:31:26.409Z] 
16:31:26 [2020-09-21T20:31:26.409Z] (SWT:1616): Gtk-CRITICAL **: 20:31:26.318: gtk_box_gadget_distribute: assertion 'size >= 0' failed in GtkScrollbar
16:31:26 [2020-09-21T20:31:26.409Z] 
16:31:26 [2020-09-21T20:31:26.409Z] (SWT:1616): Gtk-CRITICAL **: 20:31:26.328: gtk_box_gadget_distribute: assertion 'size >= 0' failed in GtkScrollbar
16:31:26 [2020-09-21T20:31:26.409Z] 
16:31:26 [2020-09-21T20:31:26.409Z] (SWT:1616): Gtk-CRITICAL **: 20:31:26.328: gtk_box_gadget_distribute: assertion 'size >= 0' failed in GtkScrollbar
16:31:26 [2020-09-21T20:31:26.409Z] 
16:31:26 [2020-09-21T20:31:26.409Z] (SWT:1616): Gtk-CRITICAL **: 20:31:26.341: gtk_box_gadget_distribute: assertion 'size >= 0' failed in GtkScrollbar
16:31:26 [2020-09-21T20:31:26.409Z] 
16:31:26 [2020-09-21T20:31:26.409Z] (SWT:1616): Gtk-CRITICAL **: 20:31:26.341: gtk_box_gadget_distribute: assertion 'size >= 0' failed in GtkScrollbar
16:31:26 [2020-09-21T20:31:26.409Z] 
16:31:26 [2020-09-21T20:31:26.409Z] (SWT:1616): Gtk-CRITICAL **: 20:31:26.358: gtk_box_gadget_distribute: assertion 'size >= 0' failed in GtkScrollbar
16:31:26 [2020-09-21T20:31:26.409Z] 
16:31:26 [2020-09-21T20:31:26.409Z] (SWT:1616): Gtk-CRITICAL **: 20:31:26.358: gtk_box_gadget_distribute: assertion 'size >= 0' failed in GtkScrollbar
16:31:26 [2020-09-21T20:31:26.409Z] 
16:31:26 [2020-09-21T20:31:26.409Z] (SWT:1616): Gtk-CRITICAL **: 20:31:26.374: gtk_box_gadget_distribute: assertion 'size >= 0' failed in GtkScrollbar
16:31:26 [2020-09-21T20:31:26.409Z] 
16:31:26 [2020-09-21T20:31:26.409Z] (SWT:1616): Gtk-CRITICAL **: 20:31:26.374: gtk_box_gadget_distribute: assertion 'size >= 0' failed in GtkScrollbar
16:31:26 [2020-09-21T20:31:26.409Z] 
16:31:26 [2020-09-21T20:31:26.409Z] (SWT:1616): Gtk-CRITICAL **: 20:31:26.384: gtk_box_gadget_distribute: assertion 'size >= 0' failed in GtkScrollbar
16:31:26 [2020-09-21T20:31:26.409Z] 
16:31:26 [2020-09-21T20:31:26.409Z] (SWT:1616): Gtk-CRITICAL **: 20:31:26.392: gtk_box_gadget_distribute: assertion 'size >= 0' failed in GtkScrollbar
16:31:26 [2020-09-21T20:31:26.409Z] 
16:31:26 [2020-09-21T20:31:26.409Z] (SWT:1616): Gtk-CRITICAL **: 20:31:26.392: gtk_box_gadget_distribute: assertion 'size >= 0' failed in GtkScrollbar
16:31:26 [2020-09-21T20:31:26.665Z] 
16:31:26 [2020-09-21T20:31:26.665Z] (SWT:1616): Gtk-CRITICAL **: 20:31:26.408: gtk_box_gadget_distribute: assertion 'size >= 0' failed in GtkScrollbar
16:31:26 [2020-09-21T20:31:26.665Z] 
16:31:26 [2020-09-21T20:31:26.665Z] (SWT:1616): Gtk-WARNING **: 20:31:26.463: Negative content width -6 (allocation 1, extents 4x3) while allocating gadget (node toolbar, owner GtkToolbar)
16:31:27 [2020-09-21T20:31:27.232Z] 
16:31:27 [2020-09-21T20:31:27.232Z] (SWT:1616): Gtk-WARNING **: 20:31:27.002: Negative content width -6 (allocation 1, extents 4x3) while allocating gadget (node toolbar, owner GtkToolbar)
16:31:27 [2020-09-21T20:31:27.232Z] 
16:31:27 [2020-09-21T20:31:27.232Z] (SWT:1616): Gtk-WARNING **: 20:31:27.012: Negative content width -6 (allocation 1, extents 4x3) while allocating gadget (node toolbar, owner GtkToolbar)
16:31:27 [2020-09-21T20:31:27.797Z] 
16:31:27 [2020-09-21T20:31:27.797Z] (SWT:1616): Gtk-WARNING **: 20:31:27.589: Negative content width -6 (allocation 1, extents 4x3) while allocating gadget (node toolbar, owner GtkToolbar)
16:31:28 [2020-09-21T20:31:28.054Z] 
16:31:28 [2020-09-21T20:31:28.054Z] (SWT:1616): Gtk-CRITICAL **: 20:31:27.865: gtk_box_gadget_distribute: assertion 'size >= 0' failed in GtkScrollbar
16:31:28 [2020-09-21T20:31:28.054Z] 
16:31:28 [2020-09-21T20:31:28.054Z] (SWT:1616): Gtk-CRITICAL **: 20:31:27.872: gtk_box_gadget_distribute: assertion 'size >= 0' failed in GtkScrollbar
16:31:28 [2020-09-21T20:31:28.054Z] 
16:31:28 [2020-09-21T20:31:28.054Z] (SWT:1616): Gtk-WARNING **: 20:31:27.875: Negative content width -6 (allocation 1, extents 4x3) while allocating gadget (node toolbar, owner GtkToolbar)
16:31:28 [2020-09-21T20:31:28.054Z] 
16:31:28 [2020-09-21T20:31:28.054Z] (SWT:1616): Gtk-CRITICAL **: 20:31:27.881: gtk_box_gadget_distribute: assertion 'size >= 0' failed in GtkScrollbar
16:31:28 [2020-09-21T20:31:28.054Z] 
16:31:28 [2020-09-21T20:31:28.054Z] (SWT:1616): Gtk-CRITICAL **: 20:31:27.887: gtk_box_gadget_distribute: assertion 'size >= 0' failed in GtkScrollbar
16:31:28 [2020-09-21T20:31:28.054Z] 
16:31:28 [2020-09-21T20:31:28.054Z] (SWT:1616): Gtk-CRITICAL **: 20:31:27.888: gtk_box_gadget_distribute: assertion 'size >= 0' failed in GtkScrollbar
16:31:28 [2020-09-21T20:31:28.054Z] 
16:31:28 [2020-09-21T20:31:28.054Z] (SWT:1616): Gtk-CRITICAL **: 20:31:27.888: gtk_box_gadget_distribute: assertion 'size >= 0' failed in GtkScrollbar
16:31:28 [2020-09-21T20:31:28.054Z] 
16:31:28 [2020-09-21T20:31:28.054Z] (SWT:1616): Gtk-CRITICAL **: 20:31:27.895: gtk_box_gadget_distribute: assertion 'size >= 0' failed in GtkScrollbar
16:31:28 [2020-09-21T20:31:28.054Z] 
16:31:28 [2020-09-21T20:31:28.054Z] (SWT:1616): Gtk-CRITICAL **: 20:31:27.895: gtk_box_gadget_distribute: assertion 'size >= 0' failed in GtkScrollbar
16:31:28 [2020-09-21T20:31:28.054Z] 
16:31:28 [2020-09-21T20:31:28.054Z] (SWT:1616): Gtk-CRITICAL **: 20:31:27.908: gtk_box_gadget_distribute: assertion 'size >= 0' failed in GtkScrollbar
16:31:28 [2020-09-21T20:31:28.054Z] 
16:31:28 [2020-09-21T20:31:28.054Z] (SWT:1616): Gtk-CRITICAL **: 20:31:27.910: gtk_box_gadget_distribute: assertion 'size >= 0' failed in GtkScrollbar
16:31:28 [2020-09-21T20:31:28.054Z] 
16:31:28 [2020-09-21T20:31:28.054Z] (SWT:1616): Gtk-CRITICAL **: 20:31:27.910: gtk_box_gadget_distribute: assertion 'size >= 0' failed in GtkScrollbar
16:31:28 [2020-09-21T20:31:28.054Z] 
16:31:28 [2020-09-21T20:31:28.054Z] (SWT:1616): Gtk-CRITICAL **: 20:31:27.927: gtk_box_gadget_distribute: assertion 'size >= 0' failed in GtkScrollbar
16:31:28 [2020-09-21T20:31:28.054Z] 
16:31:28 [2020-09-21T20:31:28.054Z] (SWT:1616): Gtk-CRITICAL **: 20:31:27.927: gtk_box_gadget_distribute: assertion 'size >= 0' failed in GtkScrollbar
16:31:28 [2020-09-21T20:31:28.054Z] 
16:31:28 [2020-09-21T20:31:28.054Z] (SWT:1616): Gtk-CRITICAL **: 20:31:27.943: gtk_box_gadget_distribute: assertion 'size >= 0' failed in GtkScrollbar
16:31:28 [2020-09-21T20:31:28.054Z] 
16:31:28 [2020-09-21T20:31:28.054Z] (SWT:1616): Gtk-CRITICAL **: 20:31:27.943: gtk_box_gadget_distribute: assertion 'size >= 0' failed in GtkScrollbar
16:31:28 [2020-09-21T20:31:28.054Z] 
16:31:28 [2020-09-21T20:31:28.054Z] (SWT:1616): Gtk-CRITICAL **: 20:31:27.959: gtk_box_gadget_distribute: assertion 'size >= 0' failed in GtkScrollbar
16:31:28 [2020-09-21T20:31:28.054Z] 
16:31:28 [2020-09-21T20:31:28.054Z] (SWT:1616): Gtk-CRITICAL **: 20:31:27.959: gtk_box_gadget_distribute: assertion 'size >= 0' failed in GtkScrollbar
16:31:28 [2020-09-21T20:31:28.054Z] 
16:31:28 [2020-09-21T20:31:28.054Z] (SWT:1616): Gtk-CRITICAL **: 20:31:27.976: gtk_box_gadget_distribute: assertion 'size >= 0' failed in GtkScrollbar
16:31:28 [2020-09-21T20:31:28.054Z] 
16:31:28 [2020-09-21T20:31:28.054Z] (SWT:1616): Gtk-CRITICAL **: 20:31:27.976: gtk_box_gadget_distribute: assertion 'size >= 0' failed in GtkScrollbar
16:31:28 [2020-09-21T20:31:28.054Z] 
16:31:28 [2020-09-21T20:31:28.054Z] (SWT:1616): Gtk-CRITICAL **: 20:31:27.993: gtk_box_gadget_distribute: assertion 'size >= 0' failed in GtkScrollbar
16:31:28 [2020-09-21T20:31:28.054Z] 
16:31:28 [2020-09-21T20:31:28.054Z] (SWT:1616): Gtk-CRITICAL **: 20:31:27.993: gtk_box_gadget_distribute: assertion 'size >= 0' failed in GtkScrollbar
16:31:28 [2020-09-21T20:31:28.054Z] 
16:31:28 [2020-09-21T20:31:28.054Z] (SWT:1616): Gtk-CRITICAL **: 20:31:28.009: gtk_box_gadget_distribute: assertion 'size >= 0' failed in GtkScrollbar
16:31:28 [2020-09-21T20:31:28.054Z] 
16:31:28 [2020-09-21T20:31:28.054Z] (SWT:1616): Gtk-CRITICAL **: 20:31:28.009: gtk_box_gadget_distribute: assertion 'size >= 0' failed in GtkScrollbar
16:31:28 [2020-09-21T20:31:28.054Z] 
16:31:28 [2020-09-21T20:31:28.054Z] (SWT:1616): Gtk-CRITICAL **: 20:31:28.016: gtk_box_gadget_distribute: assertion 'size >= 0' failed in GtkScrollbar
16:31:28 [2020-09-21T20:31:28.054Z] 
16:31:28 [2020-09-21T20:31:28.054Z] (SWT:1616): Gtk-CRITICAL **: 20:31:28.016: gtk_box_gadget_distribute: assertion 'size >= 0' failed in GtkScrollbar
16:31:28 [2020-09-21T20:31:28.054Z] 
16:31:28 [2020-09-21T20:31:28.054Z] (SWT:1616): Gtk-CRITICAL **: 20:31:28.020: gtk_box_gadget_distribute: assertion 'size >= 0' failed in GtkScrollbar
16:31:28 [2020-09-21T20:31:28.054Z] 
16:31:28 [2020-09-21T20:31:28.054Z] (SWT:1616): Gtk-CRITICAL **: 20:31:28.021: gtk_box_gadget_distribute: assertion 'size >= 0' failed in GtkScrollbar
16:31:28 [2020-09-21T20:31:28.054Z] 
16:31:28 [2020-09-21T20:31:28.054Z] (SWT:1616): Gtk-CRITICAL **: 20:31:28.021: gtk_box_gadget_distribute: assertion 'size >= 0' failed in GtkScrollbar
16:31:28 [2020-09-21T20:31:28.054Z] 
16:31:28 [2020-09-21T20:31:28.054Z] (SWT:1616): Gtk-CRITICAL **: 20:31:28.025: gtk_box_gadget_distribute: assertion 'size >= 0' failed in GtkScrollbar
16:31:28 [2020-09-21T20:31:28.054Z] 
16:31:28 [2020-09-21T20:31:28.054Z] (SWT:1616): Gtk-CRITICAL **: 20:31:28.027: gtk_box_gadget_distribute: assertion 'size >= 0' failed in GtkScrollbar
16:31:28 [2020-09-21T20:31:28.055Z] 
16:31:28 [2020-09-21T20:31:28.055Z] (SWT:1616): Gtk-CRITICAL **: 20:31:28.027: gtk_box_gadget_distribute: assertion 'size >= 0' failed in GtkScrollbar
16:31:28 [2020-09-21T20:31:28.055Z] 
16:31:28 [2020-09-21T20:31:28.055Z] (SWT:1616): Gtk-CRITICAL **: 20:31:28.040: gtk_box_gadget_distribute: assertion 'size >= 0' failed in GtkScrollbar
16:31:28 [2020-09-21T20:31:28.055Z] 
16:31:28 [2020-09-21T20:31:28.055Z] (SWT:1616): Gtk-CRITICAL **: 20:31:28.040: gtk_box_gadget_distribute: assertion 'size >= 0' failed in GtkScrollbar
16:31:28 [2020-09-21T20:31:28.055Z] 
16:31:28 [2020-09-21T20:31:28.055Z] (SWT:1616): Gtk-CRITICAL **: 20:31:28.045: gtk_box_gadget_distribute: assertion 'size >= 0' failed in GtkScrollbar
16:31:28 [2020-09-21T20:31:28.055Z] 
16:31:28 [2020-09-21T20:31:28.055Z] (SWT:1616): Gtk-CRITICAL **: 20:31:28.045: gtk_box_gadget_distribute: assertion 'size >= 0' failed in GtkScrollbar
16:31:28 [2020-09-21T20:31:28.055Z] 
16:31:28 [2020-09-21T20:31:28.055Z] (SWT:1616): Gtk-CRITICAL **: 20:31:28.050: gtk_box_gadget_distribute: assertion 'size >= 0' failed in GtkScrollbar
16:31:28 [2020-09-21T20:31:28.312Z] 
16:31:28 [2020-09-21T20:31:28.312Z] (SWT:1616): Gtk-CRITICAL **: 20:31:28.075: gtk_box_gadget_distribute: assertion 'size >= 0' failed in GtkScrollbar
16:31:28 [2020-09-21T20:31:28.312Z] 
16:31:28 [2020-09-21T20:31:28.312Z] (SWT:1616): Gtk-WARNING **: 20:31:28.089: Negative content width -6 (allocation 1, extents 4x3) while allocating gadget (node toolbar, owner GtkToolbar)
16:31:28 [2020-09-21T20:31:28.569Z] 
16:31:28 [2020-09-21T20:31:28.569Z] (SWT:1616): Gtk-WARNING **: 20:31:28.405: Negative content width -6 (allocation 1, extents 4x3) while allocating gadget (node toolbar, owner GtkToolbar)
16:31:28 [2020-09-21T20:31:28.569Z] 
16:31:28 [2020-09-21T20:31:28.569Z] (SWT:1616): Gtk-WARNING **: 20:31:28.421: Negative content width -6 (allocation 1, extents 4x3) while allocating gadget (node toolbar, owner GtkToolbar)
16:31:29 [2020-09-21T20:31:29.133Z] 
16:31:29 [2020-09-21T20:31:29.133Z] (SWT:1616): Gtk-WARNING **: 20:31:29.003: Negative content width -6 (allocation 1, extents 4x3) while allocating gadget (node toolbar, owner GtkToolbar)
16:31:29 [2020-09-21T20:31:29.698Z] 
16:31:29 [2020-09-21T20:31:29.698Z] (SWT:1616): Gtk-CRITICAL **: 20:31:29.461: gtk_box_gadget_distribute: assertion 'size >= 0' failed in GtkScrollbar
16:31:29 [2020-09-21T20:31:29.699Z] 
16:31:29 [2020-09-21T20:31:29.699Z] (SWT:1616): Gtk-CRITICAL **: 20:31:29.468: gtk_box_gadget_distribute: assertion 'size >= 0' failed in GtkScrollbar
16:31:29 [2020-09-21T20:31:29.699Z] 
16:31:29 [2020-09-21T20:31:29.699Z] (SWT:1616): Gtk-WARNING **: 20:31:29.471: Negative content width -6 (allocation 1, extents 4x3) while allocating gadget (node toolbar, owner GtkToolbar)
16:31:29 [2020-09-21T20:31:29.699Z] 
16:31:29 [2020-09-21T20:31:29.699Z] (SWT:1616): Gtk-CRITICAL **: 20:31:29.478: gtk_box_gadget_distribute: assertion 'size >= 0' failed in GtkScrollbar
16:31:29 [2020-09-21T20:31:29.699Z] 
16:31:29 [2020-09-21T20:31:29.699Z] (SWT:1616): Gtk-CRITICAL **: 20:31:29.483: gtk_box_gadget_distribute: assertion 'size >= 0' failed in GtkScrollbar
16:31:29 [2020-09-21T20:31:29.699Z] 
16:31:29 [2020-09-21T20:31:29.699Z] (SWT:1616): Gtk-CRITICAL **: 20:31:29.484: gtk_box_gadget_distribute: assertion 'size >= 0' failed in GtkScrollbar
16:31:29 [2020-09-21T20:31:29.699Z] 
16:31:29 [2020-09-21T20:31:29.699Z] (SWT:1616): Gtk-CRITICAL **: 20:31:29.484: gtk_box_gadget_distribute: assertion 'size >= 0' failed in GtkScrollbar
16:31:29 [2020-09-21T20:31:29.699Z] 
16:31:29 [2020-09-21T20:31:29.699Z] (SWT:1616): Gtk-CRITICAL **: 20:31:29.497: gtk_box_gadget_distribute: assertion 'size >= 0' failed in GtkScrollbar
16:31:29 [2020-09-21T20:31:29.699Z] 
16:31:29 [2020-09-21T20:31:29.699Z] (SWT:1616): Gtk-CRITICAL **: 20:31:29.497: gtk_box_gadget_distribute: assertion 'size >= 0' failed in GtkScrollbar
16:31:29 [2020-09-21T20:31:29.699Z] 
16:31:29 [2020-09-21T20:31:29.699Z] (SWT:1616): Gtk-CRITICAL **: 20:31:29.505: gtk_box_gadget_distribute: assertion 'size >= 0' failed in GtkScrollbar
16:31:29 [2020-09-21T20:31:29.699Z] 
16:31:29 [2020-09-21T20:31:29.699Z] (SWT:1616): Gtk-CRITICAL **: 20:31:29.511: gtk_box_gadget_distribute: assertion 'size >= 0' failed in GtkScrollbar
16:31:29 [2020-09-21T20:31:29.699Z] 
16:31:29 [2020-09-21T20:31:29.699Z] (SWT:1616): Gtk-CRITICAL **: 20:31:29.511: gtk_box_gadget_distribute: assertion 'size >= 0' failed in GtkScrollbar
16:31:29 [2020-09-21T20:31:29.699Z] 
16:31:29 [2020-09-21T20:31:29.699Z] (SWT:1616): Gtk-CRITICAL **: 20:31:29.527: gtk_box_gadget_distribute: assertion 'size >= 0' failed in GtkScrollbar
16:31:29 [2020-09-21T20:31:29.699Z] 
16:31:29 [2020-09-21T20:31:29.699Z] (SWT:1616): Gtk-CRITICAL **: 20:31:29.527: gtk_box_gadget_distribute: assertion 'size >= 0' failed in GtkScrollbar
16:31:29 [2020-09-21T20:31:29.699Z] 
16:31:29 [2020-09-21T20:31:29.699Z] (SWT:1616): Gtk-CRITICAL **: 20:31:29.544: gtk_box_gadget_distribute: assertion 'size >= 0' failed in GtkScrollbar
16:31:29 [2020-09-21T20:31:29.699Z] 
16:31:29 [2020-09-21T20:31:29.699Z] (SWT:1616): Gtk-CRITICAL **: 20:31:29.545: gtk_box_gadget_distribute: assertion 'size >= 0' failed in GtkScrollbar
16:31:29 [2020-09-21T20:31:29.699Z] 
16:31:29 [2020-09-21T20:31:29.699Z] (SWT:1616): Gtk-CRITICAL **: 20:31:29.561: gtk_box_gadget_distribute: assertion 'size >= 0' failed in GtkScrollbar
16:31:29 [2020-09-21T20:31:29.699Z] 
16:31:29 [2020-09-21T20:31:29.699Z] (SWT:1616): Gtk-CRITICAL **: 20:31:29.561: gtk_box_gadget_distribute: assertion 'size >= 0' failed in GtkScrollbar
16:31:29 [2020-09-21T20:31:29.699Z] 
16:31:29 [2020-09-21T20:31:29.699Z] (SWT:1616): Gtk-CRITICAL **: 20:31:29.577: gtk_box_gadget_distribute: assertion 'size >= 0' failed in GtkScrollbar
16:31:29 [2020-09-21T20:31:29.699Z] 
16:31:29 [2020-09-21T20:31:29.699Z] (SWT:1616): Gtk-CRITICAL **: 20:31:29.577: gtk_box_gadget_distribute: assertion 'size >= 0' failed in GtkScrollbar
16:31:29 [2020-09-21T20:31:29.699Z] 
16:31:29 [2020-09-21T20:31:29.699Z] (SWT:1616): Gtk-CRITICAL **: 20:31:29.594: gtk_box_gadget_distribute: assertion 'size >= 0' failed in GtkScrollbar
16:31:29 [2020-09-21T20:31:29.699Z] 
16:31:29 [2020-09-21T20:31:29.699Z] (SWT:1616): Gtk-CRITICAL **: 20:31:29.594: gtk_box_gadget_distribute: assertion 'size >= 0' failed in GtkScrollbar
16:31:29 [2020-09-21T20:31:29.699Z] 
16:31:29 [2020-09-21T20:31:29.699Z] (SWT:1616): Gtk-CRITICAL **: 20:31:29.608: gtk_box_gadget_distribute: assertion 'size >= 0' failed in GtkScrollbar
16:31:29 [2020-09-21T20:31:29.699Z] 
16:31:29 [2020-09-21T20:31:29.699Z] (SWT:1616): Gtk-CRITICAL **: 20:31:29.608: gtk_box_gadget_distribute: assertion 'size >= 0' failed in GtkScrollbar
16:31:29 [2020-09-21T20:31:29.699Z] 
16:31:29 [2020-09-21T20:31:29.699Z] (SWT:1616): Gtk-CRITICAL **: 20:31:29.612: gtk_box_gadget_distribute: assertion 'size >= 0' failed in GtkScrollbar
16:31:29 [2020-09-21T20:31:29.699Z] 
16:31:29 [2020-09-21T20:31:29.699Z] (SWT:1616): Gtk-CRITICAL **: 20:31:29.612: gtk_box_gadget_distribute: assertion 'size >= 0' failed in GtkScrollbar
16:31:29 [2020-09-21T20:31:29.699Z] 
16:31:29 [2020-09-21T20:31:29.699Z] (SWT:1616): Gtk-CRITICAL **: 20:31:29.617: gtk_box_gadget_distribute: assertion 'size >= 0' failed in GtkScrollbar
16:31:29 [2020-09-21T20:31:29.699Z] 
16:31:29 [2020-09-21T20:31:29.699Z] (SWT:1616): Gtk-CRITICAL **: 20:31:29.617: gtk_box_gadget_distribute: assertion 'size >= 0' failed in GtkScrollbar
16:31:29 [2020-09-21T20:31:29.699Z] 
16:31:29 [2020-09-21T20:31:29.699Z] (SWT:1616): Gtk-CRITICAL **: 20:31:29.617: gtk_box_gadget_distribute: assertion 'size >= 0' failed in GtkScrollbar
16:31:29 [2020-09-21T20:31:29.699Z] 
16:31:29 [2020-09-21T20:31:29.699Z] (SWT:1616): Gtk-CRITICAL **: 20:31:29.621: gtk_box_gadget_distribute: assertion 'size >= 0' failed in GtkScrollbar
16:31:29 [2020-09-21T20:31:29.699Z] 
16:31:29 [2020-09-21T20:31:29.699Z] (SWT:1616): Gtk-CRITICAL **: 20:31:29.623: gtk_box_gadget_distribute: assertion 'size >= 0' failed in GtkScrollbar
16:31:29 [2020-09-21T20:31:29.699Z] 
16:31:29 [2020-09-21T20:31:29.699Z] (SWT:1616): Gtk-CRITICAL **: 20:31:29.623: gtk_box_gadget_distribute: assertion 'size >= 0' failed in GtkScrollbar
16:31:29 [2020-09-21T20:31:29.699Z] 
16:31:29 [2020-09-21T20:31:29.699Z] (SWT:1616): Gtk-CRITICAL **: 20:31:29.627: gtk_box_gadget_distribute: assertion 'size >= 0' failed in GtkScrollbar
16:31:29 [2020-09-21T20:31:29.699Z] 
16:31:29 [2020-09-21T20:31:29.699Z] (SWT:1616): Gtk-CRITICAL **: 20:31:29.628: gtk_box_gadget_distribute: assertion 'size >= 0' failed in GtkScrollbar
16:31:29 [2020-09-21T20:31:29.699Z] 
16:31:29 [2020-09-21T20:31:29.699Z] (SWT:1616): Gtk-CRITICAL **: 20:31:29.629: gtk_box_gadget_distribute: assertion 'size >= 0' failed in GtkScrollbar
16:31:29 [2020-09-21T20:31:29.699Z] 
16:31:29 [2020-09-21T20:31:29.699Z] (SWT:1616): Gtk-CRITICAL **: 20:31:29.649: gtk_box_gadget_distribute: assertion 'size >= 0' failed in GtkScrollbar
16:31:29 [2020-09-21T20:31:29.699Z] 
16:31:29 [2020-09-21T20:31:29.699Z] (SWT:1616): Gtk-CRITICAL **: 20:31:29.649: gtk_box_gadget_distribute: assertion 'size >= 0' failed in GtkScrollbar
16:31:29 [2020-09-21T20:31:29.699Z] 
16:31:29 [2020-09-21T20:31:29.699Z] (SWT:1616): Gtk-WARNING **: 20:31:29.671: Negative content width -6 (allocation 1, extents 4x3) while allocating gadget (node toolbar, owner GtkToolbar)
16:31:30 [2020-09-21T20:31:30.268Z] 
16:31:30 [2020-09-21T20:31:30.268Z] (SWT:1616): Gtk-WARNING **: 20:31:30.201: Negative content width -6 (allocation 1, extents 4x3) while allocating gadget (node toolbar, owner GtkToolbar)
16:31:30 [2020-09-21T20:31:30.268Z] 
16:31:30 [2020-09-21T20:31:30.268Z] (SWT:1616): Gtk-WARNING **: 20:31:30.211: Negative content width -6 (allocation 1, extents 4x3) while allocating gadget (node toolbar, owner GtkToolbar)
16:31:30 [2020-09-21T20:31:30.832Z] 
16:31:30 [2020-09-21T20:31:30.832Z] (SWT:1616): Gtk-WARNING **: 20:31:30.787: Negative content width -6 (allocation 1, extents 4x3) while allocating gadget (node toolbar, owner GtkToolbar)
16:31:31 [2020-09-21T20:31:31.764Z] 
16:31:31 [2020-09-21T20:31:31.764Z] (SWT:1616): Gtk-CRITICAL **: 20:31:31.397: gtk_box_gadget_distribute: assertion 'size >= 0' failed in GtkScrollbar
16:31:31 [2020-09-21T20:31:31.764Z] 
16:31:31 [2020-09-21T20:31:31.764Z] (SWT:1616): Gtk-CRITICAL **: 20:31:31.404: gtk_box_gadget_distribute: assertion 'size >= 0' failed in GtkScrollbar
16:31:31 [2020-09-21T20:31:31.764Z] 
16:31:31 [2020-09-21T20:31:31.764Z] (SWT:1616): Gtk-WARNING **: 20:31:31.408: Negative content width -6 (allocation 1, extents 4x3) while allocating gadget (node toolbar, owner GtkToolbar)
16:31:31 [2020-09-21T20:31:31.764Z] 
16:31:31 [2020-09-21T20:31:31.764Z] (SWT:1616): Gtk-CRITICAL **: 20:31:31.413: gtk_box_gadget_distribute: assertion 'size >= 0' failed in GtkScrollbar
16:31:31 [2020-09-21T20:31:31.764Z] 
16:31:31 [2020-09-21T20:31:31.764Z] (SWT:1616): Gtk-CRITICAL **: 20:31:31.420: gtk_box_gadget_distribute: assertion 'size >= 0' failed in GtkScrollbar
16:31:31 [2020-09-21T20:31:31.764Z] 
16:31:31 [2020-09-21T20:31:31.764Z] (SWT:1616): Gtk-CRITICAL **: 20:31:31.421: gtk_box_gadget_distribute: assertion 'size >= 0' failed in GtkScrollbar
16:31:31 [2020-09-21T20:31:31.764Z] 
16:31:31 [2020-09-21T20:31:31.764Z] (SWT:1616): Gtk-CRITICAL **: 20:31:31.421: gtk_box_gadget_distribute: assertion 'size >= 0' failed in GtkScrollbar
16:31:31 [2020-09-21T20:31:31.764Z] 
16:31:31 [2020-09-21T20:31:31.764Z] (SWT:1616): Gtk-CRITICAL **: 20:31:31.428: gtk_box_gadget_distribute: assertion 'size >= 0' failed in GtkScrollbar
16:31:31 [2020-09-21T20:31:31.764Z] 
16:31:31 [2020-09-21T20:31:31.764Z] (SWT:1616): Gtk-CRITICAL **: 20:31:31.429: gtk_box_gadget_distribute: assertion 'size >= 0' failed in GtkScrollbar
16:31:31 [2020-09-21T20:31:31.764Z] 
16:31:31 [2020-09-21T20:31:31.764Z] (SWT:1616): Gtk-CRITICAL **: 20:31:31.444: gtk_box_gadget_distribute: assertion 'size >= 0' failed in GtkScrollbar
16:31:31 [2020-09-21T20:31:31.764Z] 
16:31:31 [2020-09-21T20:31:31.764Z] (SWT:1616): Gtk-CRITICAL **: 20:31:31.444: gtk_box_gadget_distribute: assertion 'size >= 0' failed in GtkScrollbar
16:31:31 [2020-09-21T20:31:31.764Z] 
16:31:31 [2020-09-21T20:31:31.764Z] (SWT:1616): Gtk-CRITICAL **: 20:31:31.454: gtk_box_gadget_distribute: assertion 'size >= 0' failed in GtkScrollbar
16:31:31 [2020-09-21T20:31:31.765Z] 
16:31:31 [2020-09-21T20:31:31.765Z] (SWT:1616): Gtk-CRITICAL **: 20:31:31.458: gtk_box_gadget_distribute: assertion 'size >= 0' failed in GtkScrollbar
16:31:31 [2020-09-21T20:31:31.765Z] 
16:31:31 [2020-09-21T20:31:31.765Z] (SWT:1616): Gtk-CRITICAL **: 20:31:31.458: gtk_box_gadget_distribute: assertion 'size >= 0' failed in GtkScrollbar
16:31:31 [2020-09-21T20:31:31.765Z] 
16:31:31 [2020-09-21T20:31:31.765Z] (SWT:1616): Gtk-CRITICAL **: 20:31:31.475: gtk_box_gadget_distribute: assertion 'size >= 0' failed in GtkScrollbar
16:31:31 [2020-09-21T20:31:31.765Z] 
16:31:31 [2020-09-21T20:31:31.765Z] (SWT:1616): Gtk-CRITICAL **: 20:31:31.475: gtk_box_gadget_distribute: assertion 'size >= 0' failed in GtkScrollbar
16:31:31 [2020-09-21T20:31:31.765Z] 
16:31:31 [2020-09-21T20:31:31.765Z] (SWT:1616): Gtk-CRITICAL **: 20:31:31.492: gtk_box_gadget_distribute: assertion 'size >= 0' failed in GtkScrollbar
16:31:31 [2020-09-21T20:31:31.765Z] 
16:31:31 [2020-09-21T20:31:31.765Z] (SWT:1616): Gtk-CRITICAL **: 20:31:31.492: gtk_box_gadget_distribute: assertion 'size >= 0' failed in GtkScrollbar
16:31:31 [2020-09-21T20:31:31.765Z] 
16:31:31 [2020-09-21T20:31:31.765Z] (SWT:1616): Gtk-CRITICAL **: 20:31:31.508: gtk_box_gadget_distribute: assertion 'size >= 0' failed in GtkScrollbar
16:31:31 [2020-09-21T20:31:31.765Z] 
16:31:31 [2020-09-21T20:31:31.765Z] (SWT:1616): Gtk-CRITICAL **: 20:31:31.508: gtk_box_gadget_distribute: assertion 'size >= 0' failed in GtkScrollbar
16:31:31 [2020-09-21T20:31:31.765Z] 
16:31:31 [2020-09-21T20:31:31.765Z] (SWT:1616): Gtk-CRITICAL **: 20:31:31.525: gtk_box_gadget_distribute: assertion 'size >= 0' failed in GtkScrollbar
16:31:31 [2020-09-21T20:31:31.765Z] 
16:31:31 [2020-09-21T20:31:31.765Z] (SWT:1616): Gtk-CRITICAL **: 20:31:31.525: gtk_box_gadget_distribute: assertion 'size >= 0' failed in GtkScrollbar
16:31:31 [2020-09-21T20:31:31.765Z] 
16:31:31 [2020-09-21T20:31:31.765Z] (SWT:1616): Gtk-CRITICAL **: 20:31:31.541: gtk_box_gadget_distribute: assertion 'size >= 0' failed in GtkScrollbar
16:31:31 [2020-09-21T20:31:31.765Z] 
16:31:31 [2020-09-21T20:31:31.765Z] (SWT:1616): Gtk-CRITICAL **: 20:31:31.541: gtk_box_gadget_distribute: assertion 'size >= 0' failed in GtkScrollbar
16:31:31 [2020-09-21T20:31:31.765Z] 
16:31:31 [2020-09-21T20:31:31.765Z] (SWT:1616): Gtk-CRITICAL **: 20:31:31.565: gtk_box_gadget_distribute: assertion 'size >= 0' failed in GtkScrollbar
16:31:31 [2020-09-21T20:31:31.765Z] 
16:31:31 [2020-09-21T20:31:31.765Z] (SWT:1616): Gtk-CRITICAL **: 20:31:31.565: gtk_box_gadget_distribute: assertion 'size >= 0' failed in GtkScrollbar
16:31:31 [2020-09-21T20:31:31.765Z] 
16:31:31 [2020-09-21T20:31:31.765Z] (SWT:1616): Gtk-CRITICAL **: 20:31:31.575: gtk_box_gadget_distribute: assertion 'size >= 0' failed in GtkScrollbar
16:31:31 [2020-09-21T20:31:31.765Z] 
16:31:31 [2020-09-21T20:31:31.765Z] (SWT:1616): Gtk-CRITICAL **: 20:31:31.575: gtk_box_gadget_distribute: assertion 'size >= 0' failed in GtkScrollbar
16:31:31 [2020-09-21T20:31:31.765Z] 
16:31:31 [2020-09-21T20:31:31.765Z] (SWT:1616): Gtk-CRITICAL **: 20:31:31.593: gtk_box_gadget_distribute: assertion 'size >= 0' failed in GtkScrollbar
16:31:31 [2020-09-21T20:31:31.765Z] 
16:31:31 [2020-09-21T20:31:31.765Z] (SWT:1616): Gtk-CRITICAL **: 20:31:31.593: gtk_box_gadget_distribute: assertion 'size >= 0' failed in GtkScrollbar
16:31:31 [2020-09-21T20:31:31.765Z] 
16:31:31 [2020-09-21T20:31:31.765Z] (SWT:1616): Gtk-CRITICAL **: 20:31:31.594: gtk_box_gadget_distribute: assertion 'size >= 0' failed in GtkScrollbar
16:31:31 [2020-09-21T20:31:31.765Z] 
16:31:31 [2020-09-21T20:31:31.765Z] (SWT:1616): Gtk-CRITICAL **: 20:31:31.594: gtk_box_gadget_distribute: assertion 'size >= 0' failed in GtkScrollbar
16:31:31 [2020-09-21T20:31:31.765Z] 
16:31:31 [2020-09-21T20:31:31.765Z] (SWT:1616): Gtk-CRITICAL **: 20:31:31.600: gtk_box_gadget_distribute: assertion 'size >= 0' failed in GtkScrollbar
16:31:31 [2020-09-21T20:31:31.765Z] 
16:31:31 [2020-09-21T20:31:31.765Z] (SWT:1616): Gtk-CRITICAL **: 20:31:31.600: gtk_box_gadget_distribute: assertion 'size >= 0' failed in GtkScrollbar
16:31:31 [2020-09-21T20:31:31.765Z] 
16:31:31 [2020-09-21T20:31:31.765Z] (SWT:1616): Gtk-CRITICAL **: 20:31:31.600: gtk_box_gadget_distribute: assertion 'size >= 0' failed in GtkScrollbar
16:31:31 [2020-09-21T20:31:31.765Z] 
16:31:31 [2020-09-21T20:31:31.765Z] (SWT:1616): Gtk-CRITICAL **: 20:31:31.606: gtk_box_gadget_distribute: assertion 'size >= 0' failed in GtkScrollbar
16:31:31 [2020-09-21T20:31:31.765Z] 
16:31:31 [2020-09-21T20:31:31.765Z] (SWT:1616): Gtk-CRITICAL **: 20:31:31.624: gtk_box_gadget_distribute: assertion 'size >= 0' failed in GtkScrollbar
16:31:31 [2020-09-21T20:31:31.765Z] 
16:31:31 [2020-09-21T20:31:31.765Z] (SWT:1616): Gtk-CRITICAL **: 20:31:31.624: gtk_box_gadget_distribute: assertion 'size >= 0' failed in GtkScrollbar
16:31:31 [2020-09-21T20:31:31.765Z] 
16:31:31 [2020-09-21T20:31:31.765Z] (SWT:1616): Gtk-CRITICAL **: 20:31:31.624: gtk_box_gadget_distribute: assertion 'size >= 0' failed in GtkScrollbar
16:31:31 [2020-09-21T20:31:31.765Z] 
16:31:31 [2020-09-21T20:31:31.765Z] (SWT:1616): Gtk-CRITICAL **: 20:31:31.640: gtk_box_gadget_distribute: assertion 'size >= 0' failed in GtkScrollbar
16:31:31 [2020-09-21T20:31:31.765Z] 
16:31:31 [2020-09-21T20:31:31.765Z] (SWT:1616): Gtk-CRITICAL **: 20:31:31.640: gtk_box_gadget_distribute: assertion 'size >= 0' failed in GtkScrollbar
16:31:31 [2020-09-21T20:31:31.765Z] 
16:31:31 [2020-09-21T20:31:31.765Z] (SWT:1616): Gtk-CRITICAL **: 20:31:31.640: gtk_box_gadget_distribute: assertion 'size >= 0' failed in GtkScrollbar
16:31:31 [2020-09-21T20:31:31.765Z] 
16:31:31 [2020-09-21T20:31:31.765Z] (SWT:1616): Gtk-CRITICAL **: 20:31:31.657: gtk_box_gadget_distribute: assertion 'size >= 0' failed in GtkScrollbar
16:31:31 [2020-09-21T20:31:31.765Z] 
16:31:31 [2020-09-21T20:31:31.765Z] (SWT:1616): Gtk-CRITICAL **: 20:31:31.657: gtk_box_gadget_distribute: assertion 'size >= 0' failed in GtkScrollbar
16:31:31 [2020-09-21T20:31:31.765Z] 
16:31:31 [2020-09-21T20:31:31.765Z] (SWT:1616): Gtk-CRITICAL **: 20:31:31.685: gtk_box_gadget_distribute: assertion 'size >= 0' failed in GtkScrollbar
16:31:31 [2020-09-21T20:31:31.765Z] 
16:31:31 [2020-09-21T20:31:31.765Z] (SWT:1616): Gtk-CRITICAL **: 20:31:31.686: gtk_box_gadget_distribute: assertion 'size >= 0' failed in GtkScrollbar
16:31:31 [2020-09-21T20:31:31.765Z] 
16:31:31 [2020-09-21T20:31:31.765Z] (SWT:1616): Gtk-CRITICAL **: 20:31:31.689: gtk_box_gadget_distribute: assertion 'size >= 0' failed in GtkScrollbar
16:31:31 [2020-09-21T20:31:31.765Z] 
16:31:31 [2020-09-21T20:31:31.765Z] (SWT:1616): Gtk-CRITICAL **: 20:31:31.690: gtk_box_gadget_distribute: assertion 'size >= 0' failed in GtkScrollbar
16:31:31 [2020-09-21T20:31:31.765Z] 
16:31:31 [2020-09-21T20:31:31.765Z] (SWT:1616): Gtk-CRITICAL **: 20:31:31.690: gtk_box_gadget_distribute: assertion 'size >= 0' failed in GtkScrollbar
16:31:31 [2020-09-21T20:31:31.765Z] 
16:31:31 [2020-09-21T20:31:31.765Z] (SWT:1616): Gtk-CRITICAL **: 20:31:31.694: gtk_box_gadget_distribute: assertion 'size >= 0' failed in GtkScrollbar
16:31:31 [2020-09-21T20:31:31.765Z] 
16:31:31 [2020-09-21T20:31:31.765Z] (SWT:1616): Gtk-CRITICAL **: 20:31:31.695: gtk_box_gadget_distribute: assertion 'size >= 0' failed in GtkScrollbar
16:31:31 [2020-09-21T20:31:31.765Z] 
16:31:31 [2020-09-21T20:31:31.765Z] (SWT:1616): Gtk-CRITICAL **: 20:31:31.695: gtk_box_gadget_distribute: assertion 'size >= 0' failed in GtkScrollbar
16:31:31 [2020-09-21T20:31:31.765Z] 
16:31:31 [2020-09-21T20:31:31.765Z] (SWT:1616): Gtk-CRITICAL **: 20:31:31.699: gtk_box_gadget_distribute: assertion 'size >= 0' failed in GtkScrollbar
16:31:31 [2020-09-21T20:31:31.765Z] 
16:31:31 [2020-09-21T20:31:31.765Z] (SWT:1616): Gtk-CRITICAL **: 20:31:31.719: gtk_box_gadget_distribute: assertion 'size >= 0' failed in GtkScrollbar
16:31:31 [2020-09-21T20:31:31.765Z] 
16:31:31 [2020-09-21T20:31:31.765Z] (SWT:1616): Gtk-CRITICAL **: 20:31:31.720: gtk_box_gadget_distribute: assertion 'size >= 0' failed in GtkScrollbar
16:31:31 [2020-09-21T20:31:31.765Z] 
16:31:31 [2020-09-21T20:31:31.765Z] (SWT:1616): Gtk-CRITICAL **: 20:31:31.731: gtk_box_gadget_distribute: assertion 'size >= 0' failed in GtkScrollbar
16:31:31 [2020-09-21T20:31:31.765Z] 
16:31:31 [2020-09-21T20:31:31.765Z] (SWT:1616): Gtk-CRITICAL **: 20:31:31.735: gtk_box_gadget_distribute: assertion 'size >= 0' failed in GtkScrollbar
16:31:31 [2020-09-21T20:31:31.765Z] 
16:31:31 [2020-09-21T20:31:31.765Z] (SWT:1616): Gtk-CRITICAL **: 20:31:31.735: gtk_box_gadget_distribute: assertion 'size >= 0' failed in GtkScrollbar
16:31:31 [2020-09-21T20:31:31.765Z] 
16:31:31 [2020-09-21T20:31:31.765Z] (SWT:1616): Gtk-CRITICAL **: 20:31:31.747: gtk_box_gadget_distribute: assertion 'size >= 0' failed in GtkScrollbar
16:31:31 [2020-09-21T20:31:31.765Z] 
16:31:31 [2020-09-21T20:31:31.765Z] (SWT:1616): Gtk-CRITICAL **: 20:31:31.748: gtk_box_gadget_distribute: assertion 'size >= 0' failed in GtkScrollbar
16:31:31 [2020-09-21T20:31:31.765Z] 
16:31:31 [2020-09-21T20:31:31.765Z] (SWT:1616): Gtk-CRITICAL **: 20:31:31.748: gtk_box_gadget_distribute: assertion 'size >= 0' failed in GtkScrollbar
16:31:31 [2020-09-21T20:31:31.765Z] 
16:31:31 [2020-09-21T20:31:31.765Z] (SWT:1616): Gtk-CRITICAL **: 20:31:31.753: gtk_box_gadget_distribute: assertion 'size >= 0' failed in GtkScrollbar
16:31:32 [2020-09-21T20:31:32.022Z] 
16:31:32 [2020-09-21T20:31:32.022Z] (SWT:1616): Gtk-CRITICAL **: 20:31:31.811: gtk_box_gadget_distribute: assertion 'size >= 0' failed in GtkScrollbar
16:31:32 [2020-09-21T20:31:32.022Z] 
16:31:32 [2020-09-21T20:31:32.022Z] (SWT:1616): Gtk-CRITICAL **: 20:31:31.812: gtk_box_gadget_distribute: assertion 'size >= 0' failed in GtkScrollbar
16:31:32 [2020-09-21T20:31:32.022Z] 
16:31:32 [2020-09-21T20:31:32.022Z] (SWT:1616): Gtk-CRITICAL **: 20:31:31.812: gtk_box_gadget_distribute: assertion 'size >= 0' failed in GtkScrollbar
16:31:32 [2020-09-21T20:31:32.022Z] 
16:31:32 [2020-09-21T20:31:32.022Z] (SWT:1616): Gtk-CRITICAL **: 20:31:31.826: gtk_box_gadget_distribute: assertion 'size >= 0' failed in GtkScrollbar
16:31:32 [2020-09-21T20:31:32.022Z] 
16:31:32 [2020-09-21T20:31:32.022Z] (SWT:1616): Gtk-CRITICAL **: 20:31:31.939: gtk_box_gadget_distribute: assertion 'size >= 0' failed in GtkScrollbar
16:31:32 [2020-09-21T20:31:32.022Z] 
16:31:32 [2020-09-21T20:31:32.022Z] (SWT:1616): Gtk-CRITICAL **: 20:31:31.940: gtk_box_gadget_distribute: assertion 'size >= 0' failed in GtkScrollbar
16:31:32 [2020-09-21T20:31:32.022Z] 
16:31:32 [2020-09-21T20:31:32.022Z] (SWT:1616): Gtk-CRITICAL **: 20:31:31.940: gtk_box_gadget_distribute: assertion 'size >= 0' failed in GtkScrollbar
16:31:32 [2020-09-21T20:31:32.022Z] 
16:31:32 [2020-09-21T20:31:32.022Z] (SWT:1616): Gtk-CRITICAL **: 20:31:31.952: gtk_box_gadget_distribute: assertion 'size >= 0' failed in GtkScrollbar
16:31:32 [2020-09-21T20:31:32.022Z] 
16:31:32 [2020-09-21T20:31:32.022Z] (SWT:1616): Gtk-CRITICAL **: 20:31:31.983: gtk_box_gadget_distribute: assertion 'size >= 0' failed in GtkScrollbar
16:31:32 [2020-09-21T20:31:32.022Z] 
16:31:32 [2020-09-21T20:31:32.022Z] (SWT:1616): Gtk-CRITICAL **: 20:31:31.993: gtk_box_gadget_distribute: assertion 'size >= 0' failed in GtkScrollbar
16:31:32 [2020-09-21T20:31:32.022Z] 
16:31:32 [2020-09-21T20:31:32.022Z] (SWT:1616): Gtk-CRITICAL **: 20:31:32.014: gtk_box_gadget_distribute: assertion 'size >= 0' failed in GtkScrollbar
16:31:32 [2020-09-21T20:31:32.022Z] 
16:31:32 [2020-09-21T20:31:32.022Z] (SWT:1616): Gtk-CRITICAL **: 20:31:32.014: gtk_box_gadget_distribute: assertion 'size >= 0' failed in GtkScrollbar
16:31:32 [2020-09-21T20:31:32.022Z] 
16:31:32 [2020-09-21T20:31:32.022Z] (SWT:1616): Gtk-CRITICAL **: 20:31:32.015: gtk_box_gadget_distribute: assertion 'size >= 0' failed in GtkScrollbar
16:31:32 [2020-09-21T20:31:32.022Z] 
16:31:32 [2020-09-21T20:31:32.022Z] (SWT:1616): Gtk-CRITICAL **: 20:31:32.015: gtk_box_gadget_distribute: assertion 'size >= 0' failed in GtkScrollbar
16:31:32 [2020-09-21T20:31:32.022Z] 
16:31:32 [2020-09-21T20:31:32.022Z] (SWT:1616): Gtk-CRITICAL **: 20:31:32.016: gtk_box_gadget_distribute: assertion 'size >= 0' failed in GtkScrollbar
16:31:32 [2020-09-21T20:31:32.022Z] 
16:31:32 [2020-09-21T20:31:32.022Z] (SWT:1616): Gtk-CRITICAL **: 20:31:32.016: gtk_box_gadget_distribute: assertion 'size >= 0' failed in GtkScrollbar
16:31:32 [2020-09-21T20:31:32.280Z] 
16:31:32 [2020-09-21T20:31:32.280Z] (SWT:1616): Gtk-CRITICAL **: 20:31:32.024: gtk_box_gadget_distribute: assertion 'size >= 0' failed in GtkScrollbar
16:31:32 [2020-09-21T20:31:32.280Z] 
16:31:32 [2020-09-21T20:31:32.280Z] (SWT:1616): Gtk-CRITICAL **: 20:31:32.031: gtk_box_gadget_distribute: assertion 'size >= 0' failed in GtkScrollbar
16:31:32 [2020-09-21T20:31:32.280Z] 
16:31:32 [2020-09-21T20:31:32.280Z] (SWT:1616): Gtk-CRITICAL **: 20:31:32.099: gtk_box_gadget_distribute: assertion 'size >= 0' failed in GtkScrollbar
16:31:32 [2020-09-21T20:31:32.280Z] 
16:31:32 [2020-09-21T20:31:32.280Z] (SWT:1616): Gtk-CRITICAL **: 20:31:32.099: gtk_box_gadget_distribute: assertion 'size >= 0' failed in GtkScrollbar
16:31:32 [2020-09-21T20:31:32.280Z] 
16:31:32 [2020-09-21T20:31:32.280Z] (SWT:1616): Gtk-CRITICAL **: 20:31:32.146: gtk_box_gadget_distribute: assertion 'size >= 0' failed in GtkScrollbar
16:31:32 [2020-09-21T20:31:32.280Z] 
16:31:32 [2020-09-21T20:31:32.280Z] (SWT:1616): Gtk-CRITICAL **: 20:31:32.150: gtk_box_gadget_distribute: assertion 'size >= 0' failed in GtkScrollbar
16:31:32 [2020-09-21T20:31:32.280Z] 
16:31:32 [2020-09-21T20:31:32.280Z] (SWT:1616): Gtk-CRITICAL **: 20:31:32.150: gtk_box_gadget_distribute: assertion 'size >= 0' failed in GtkScrollbar
16:31:32 [2020-09-21T20:31:32.280Z] 
16:31:32 [2020-09-21T20:31:32.280Z] (SWT:1616): Gtk-CRITICAL **: 20:31:32.162: gtk_box_gadget_distribute: assertion 'size >= 0' failed in GtkScrollbar
16:31:32 [2020-09-21T20:31:32.280Z] 
16:31:32 [2020-09-21T20:31:32.280Z] (SWT:1616): Gtk-CRITICAL **: 20:31:32.163: gtk_box_gadget_distribute: assertion 'size >= 0' failed in GtkScrollbar
16:31:32 [2020-09-21T20:31:32.280Z] 
16:31:32 [2020-09-21T20:31:32.280Z] (SWT:1616): Gtk-CRITICAL **: 20:31:32.163: gtk_box_gadget_distribute: assertion 'size >= 0' failed in GtkScrollbar
16:31:32 [2020-09-21T20:31:32.280Z] 
16:31:32 [2020-09-21T20:31:32.280Z] (SWT:1616): Gtk-CRITICAL **: 20:31:32.168: gtk_box_gadget_distribute: assertion 'size >= 0' failed in GtkScrollbar
16:31:32 [2020-09-21T20:31:32.280Z] 
16:31:32 [2020-09-21T20:31:32.280Z] (SWT:1616): Gtk-WARNING **: 20:31:32.230: Negative content width -6 (allocation 1, extents 4x3) while allocating gadget (node toolbar, owner GtkToolbar)
16:31:32 [2020-09-21T20:31:32.844Z] 
16:31:32 [2020-09-21T20:31:32.844Z] (SWT:1616): Gtk-WARNING **: 20:31:32.709: Negative content width -6 (allocation 1, extents 4x3) while allocating gadget (node toolbar, owner GtkToolbar)
16:31:32 [2020-09-21T20:31:32.844Z] 
16:31:32 [2020-09-21T20:31:32.844Z] (SWT:1616): Gtk-WARNING **: 20:31:32.718: Negative content width -6 (allocation 1, extents 4x3) while allocating gadget (node toolbar, owner GtkToolbar)
16:31:33 [2020-09-21T20:31:33.101Z] Tests run: 11, Failures: 0, Errors: 0, Skipped: 0, Time elapsed: 21.912 s - in org.eclipse.egit.ui.test.stagview.StagingViewTest
16:31:33 [2020-09-21T20:31:33.101Z] testAmend(org.eclipse.egit.ui.test.stagview.StagingViewTest)  Time elapsed: 2.435 s
16:31:33 [2020-09-21T20:31:33.101Z] testButtonEnablement(org.eclipse.egit.ui.test.stagview.StagingViewTest)  Time elapsed: 1.757 s
16:31:33 [2020-09-21T20:31:33.101Z] testCommitSingleFile(org.eclipse.egit.ui.test.stagview.StagingViewTest)  Time elapsed: 1.875 s
16:31:33 [2020-09-21T20:31:33.101Z] testMergeConflict(org.eclipse.egit.ui.test.stagview.StagingViewTest)  Time elapsed: 3.108 s
16:31:33 [2020-09-21T20:31:33.101Z] testCommitMessageConfigChangeAmending(org.eclipse.egit.ui.test.stagview.StagingViewTest)  Time elapsed: 1.744 s
16:31:33 [2020-09-21T20:31:33.101Z] testCommitMessageConfigChangeWithAuthor(org.eclipse.egit.ui.test.stagview.StagingViewTest)  Time elapsed: 1.761 s
16:31:33 [2020-09-21T20:31:33.101Z] testCommitMessageConfigChange(org.eclipse.egit.ui.test.stagview.StagingViewTest)  Time elapsed: 1.622 s
16:31:33 [2020-09-21T20:31:33.101Z] testCommitMessageConfigChangeBranchSwitchToNew(org.eclipse.egit.ui.test.stagview.StagingViewTest)  Time elapsed: 1.881 s
16:31:33 [2020-09-21T20:31:33.101Z] testCommitMessageCommitterChangeSignOff(org.eclipse.egit.ui.test.stagview.StagingViewTest)  Time elapsed: 1.409 s
16:31:33 [2020-09-21T20:31:33.101Z] testCommitMessageConfigChangeNoSignOff(org.eclipse.egit.ui.test.stagview.StagingViewTest)  Time elapsed: 1.789 s
16:31:33 [2020-09-21T20:31:33.101Z] testDeleteModifyConflict(org.eclipse.egit.ui.test.stagview.StagingViewTest)  Time elapsed: 2.508 s
16:31:33 [2020-09-21T20:31:33.101Z] Running org.eclipse.egit.ui.test.stagview.CommitMessageProvidersTest
16:31:33 [2020-09-21T20:31:33.359Z] 
16:31:33 [2020-09-21T20:31:33.359Z] (SWT:1616): Gtk-WARNING **: 20:31:33.352: Negative content width -6 (allocation 1, extents 4x3) while allocating gadget (node toolbar, owner GtkToolbar)
16:31:33 [2020-09-21T20:31:33.924Z] 
16:31:33 [2020-09-21T20:31:33.924Z] (SWT:1616): Gtk-CRITICAL **: 20:31:33.651: gtk_box_gadget_distribute: assertion 'size >= 0' failed in GtkScrollbar
16:31:33 [2020-09-21T20:31:33.924Z] 
16:31:33 [2020-09-21T20:31:33.924Z] (SWT:1616): Gtk-CRITICAL **: 20:31:33.658: gtk_box_gadget_distribute: assertion 'size >= 0' failed in GtkScrollbar
16:31:33 [2020-09-21T20:31:33.924Z] 
16:31:33 [2020-09-21T20:31:33.924Z] (SWT:1616): Gtk-WARNING **: 20:31:33.661: Negative content width -6 (allocation 1, extents 4x3) while allocating gadget (node toolbar, owner GtkToolbar)
16:31:33 [2020-09-21T20:31:33.924Z] 
16:31:33 [2020-09-21T20:31:33.924Z] (SWT:1616): Gtk-CRITICAL **: 20:31:33.667: gtk_box_gadget_distribute: assertion 'size >= 0' failed in GtkScrollbar
16:31:33 [2020-09-21T20:31:33.924Z] 
16:31:33 [2020-09-21T20:31:33.924Z] (SWT:1616): Gtk-CRITICAL **: 20:31:33.672: gtk_box_gadget_distribute: assertion 'size >= 0' failed in GtkScrollbar
16:31:33 [2020-09-21T20:31:33.924Z] 
16:31:33 [2020-09-21T20:31:33.924Z] (SWT:1616): Gtk-CRITICAL **: 20:31:33.673: gtk_box_gadget_distribute: assertion 'size >= 0' failed in GtkScrollbar
16:31:33 [2020-09-21T20:31:33.924Z] 
16:31:33 [2020-09-21T20:31:33.924Z] (SWT:1616): Gtk-CRITICAL **: 20:31:33.673: gtk_box_gadget_distribute: assertion 'size >= 0' failed in GtkScrollbar
16:31:33 [2020-09-21T20:31:33.924Z] 
16:31:33 [2020-09-21T20:31:33.924Z] (SWT:1616): Gtk-CRITICAL **: 20:31:33.674: gtk_box_gadget_distribute: assertion 'size >= 0' failed in GtkScrollbar
16:31:33 [2020-09-21T20:31:33.924Z] 
16:31:33 [2020-09-21T20:31:33.924Z] (SWT:1616): Gtk-CRITICAL **: 20:31:33.674: gtk_box_gadget_distribute: assertion 'size >= 0' failed in GtkScrollbar
16:31:33 [2020-09-21T20:31:33.924Z] 
16:31:33 [2020-09-21T20:31:33.924Z] (SWT:1616): Gtk-CRITICAL **: 20:31:33.685: gtk_box_gadget_distribute: assertion 'size >= 0' failed in GtkScrollbar
16:31:33 [2020-09-21T20:31:33.924Z] 
16:31:33 [2020-09-21T20:31:33.924Z] (SWT:1616): Gtk-CRITICAL **: 20:31:33.685: gtk_box_gadget_distribute: assertion 'size >= 0' failed in GtkScrollbar
16:31:33 [2020-09-21T20:31:33.924Z] 
16:31:33 [2020-09-21T20:31:33.924Z] (SWT:1616): Gtk-CRITICAL **: 20:31:33.697: gtk_box_gadget_distribute: assertion 'size >= 0' failed in GtkScrollbar
16:31:33 [2020-09-21T20:31:33.924Z] 
16:31:33 [2020-09-21T20:31:33.924Z] (SWT:1616): Gtk-CRITICAL **: 20:31:33.701: gtk_box_gadget_distribute: assertion 'size >= 0' failed in GtkScrollbar
16:31:33 [2020-09-21T20:31:33.924Z] 
16:31:33 [2020-09-21T20:31:33.924Z] (SWT:1616): Gtk-CRITICAL **: 20:31:33.701: gtk_box_gadget_distribute: assertion 'size >= 0' failed in GtkScrollbar
16:31:33 [2020-09-21T20:31:33.924Z] 
16:31:33 [2020-09-21T20:31:33.924Z] (SWT:1616): Gtk-CRITICAL **: 20:31:33.718: gtk_box_gadget_distribute: assertion 'size >= 0' failed in GtkScrollbar
16:31:33 [2020-09-21T20:31:33.924Z] 
16:31:33 [2020-09-21T20:31:33.924Z] (SWT:1616): Gtk-CRITICAL **: 20:31:33.718: gtk_box_gadget_distribute: assertion 'size >= 0' failed in GtkScrollbar
16:31:33 [2020-09-21T20:31:33.924Z] 
16:31:33 [2020-09-21T20:31:33.924Z] (SWT:1616): Gtk-CRITICAL **: 20:31:33.734: gtk_box_gadget_distribute: assertion 'size >= 0' failed in GtkScrollbar
16:31:33 [2020-09-21T20:31:33.924Z] 
16:31:33 [2020-09-21T20:31:33.924Z] (SWT:1616): Gtk-CRITICAL **: 20:31:33.734: gtk_box_gadget_distribute: assertion 'size >= 0' failed in GtkScrollbar
16:31:33 [2020-09-21T20:31:33.924Z] 
16:31:33 [2020-09-21T20:31:33.924Z] (SWT:1616): Gtk-CRITICAL **: 20:31:33.751: gtk_box_gadget_distribute: assertion 'size >= 0' failed in GtkScrollbar
16:31:33 [2020-09-21T20:31:33.924Z] 
16:31:33 [2020-09-21T20:31:33.924Z] (SWT:1616): Gtk-CRITICAL **: 20:31:33.751: gtk_box_gadget_distribute: assertion 'size >= 0' failed in GtkScrollbar
16:31:33 [2020-09-21T20:31:33.924Z] 
16:31:33 [2020-09-21T20:31:33.924Z] (SWT:1616): Gtk-CRITICAL **: 20:31:33.768: gtk_box_gadget_distribute: assertion 'size >= 0' failed in GtkScrollbar
16:31:33 [2020-09-21T20:31:33.924Z] 
16:31:33 [2020-09-21T20:31:33.924Z] (SWT:1616): Gtk-CRITICAL **: 20:31:33.768: gtk_box_gadget_distribute: assertion 'size >= 0' failed in GtkScrollbar
16:31:33 [2020-09-21T20:31:33.924Z] 
16:31:33 [2020-09-21T20:31:33.924Z] (SWT:1616): Gtk-CRITICAL **: 20:31:33.784: gtk_box_gadget_distribute: assertion 'size >= 0' failed in GtkScrollbar
16:31:33 [2020-09-21T20:31:33.924Z] 
16:31:33 [2020-09-21T20:31:33.924Z] (SWT:1616): Gtk-CRITICAL **: 20:31:33.784: gtk_box_gadget_distribute: assertion 'size >= 0' failed in GtkScrollbar
16:31:33 [2020-09-21T20:31:33.924Z] 
16:31:33 [2020-09-21T20:31:33.924Z] (SWT:1616): Gtk-CRITICAL **: 20:31:33.807: gtk_box_gadget_distribute: assertion 'size >= 0' failed in GtkScrollbar
16:31:33 [2020-09-21T20:31:33.924Z] 
16:31:33 [2020-09-21T20:31:33.924Z] (SWT:1616): Gtk-CRITICAL **: 20:31:33.807: gtk_box_gadget_distribute: assertion 'size >= 0' failed in GtkScrollbar
16:31:33 [2020-09-21T20:31:33.924Z] 
16:31:33 [2020-09-21T20:31:33.924Z] (SWT:1616): Gtk-CRITICAL **: 20:31:33.821: gtk_box_gadget_distribute: assertion 'size >= 0' failed in GtkScrollbar
16:31:33 [2020-09-21T20:31:33.924Z] 
16:31:33 [2020-09-21T20:31:33.924Z] (SWT:1616): Gtk-CRITICAL **: 20:31:33.821: gtk_box_gadget_distribute: assertion 'size >= 0' failed in GtkScrollbar
16:31:33 [2020-09-21T20:31:33.924Z] 
16:31:33 [2020-09-21T20:31:33.924Z] (SWT:1616): Gtk-CRITICAL **: 20:31:33.834: gtk_box_gadget_distribute: assertion 'size >= 0' failed in GtkScrollbar
16:31:33 [2020-09-21T20:31:33.924Z] 
16:31:33 [2020-09-21T20:31:33.924Z] (SWT:1616): Gtk-CRITICAL **: 20:31:33.834: gtk_box_gadget_distribute: assertion 'size >= 0' failed in GtkScrollbar
16:31:33 [2020-09-21T20:31:33.924Z] 
16:31:33 [2020-09-21T20:31:33.924Z] (SWT:1616): Gtk-CRITICAL **: 20:31:33.851: gtk_box_gadget_distribute: assertion 'size >= 0' failed in GtkScrollbar
16:31:33 [2020-09-21T20:31:33.924Z] 
16:31:33 [2020-09-21T20:31:33.924Z] (SWT:1616): Gtk-CRITICAL **: 20:31:33.851: gtk_box_gadget_distribute: assertion 'size >= 0' failed in GtkScrollbar
16:31:33 [2020-09-21T20:31:33.924Z] 
16:31:33 [2020-09-21T20:31:33.924Z] (SWT:1616): Gtk-CRITICAL **: 20:31:33.867: gtk_box_gadget_distribute: assertion 'size >= 0' failed in GtkScrollbar
16:31:33 [2020-09-21T20:31:33.924Z] 
16:31:33 [2020-09-21T20:31:33.924Z] (SWT:1616): Gtk-CRITICAL **: 20:31:33.867: gtk_box_gadget_distribute: assertion 'size >= 0' failed in GtkScrollbar
16:31:33 [2020-09-21T20:31:33.924Z] 
16:31:33 [2020-09-21T20:31:33.924Z] (SWT:1616): Gtk-CRITICAL **: 20:31:33.883: gtk_box_gadget_distribute: assertion 'size >= 0' failed in GtkScrollbar
16:31:33 [2020-09-21T20:31:33.924Z] 
16:31:33 [2020-09-21T20:31:33.924Z] (SWT:1616): Gtk-CRITICAL **: 20:31:33.883: gtk_box_gadget_distribute: assertion 'size >= 0' failed in GtkScrollbar
16:31:33 [2020-09-21T20:31:33.924Z] 
16:31:33 [2020-09-21T20:31:33.924Z] (SWT:1616): Gtk-CRITICAL **: 20:31:33.889: gtk_box_gadget_distribute: assertion 'size >= 0' failed in GtkScrollbar
16:31:33 [2020-09-21T20:31:33.924Z] 
16:31:33 [2020-09-21T20:31:33.924Z] (SWT:1616): Gtk-CRITICAL **: 20:31:33.890: gtk_box_gadget_distribute: assertion 'size >= 0' failed in GtkScrollbar
16:31:33 [2020-09-21T20:31:33.924Z] 
16:31:33 [2020-09-21T20:31:33.924Z] (SWT:1616): Gtk-CRITICAL **: 20:31:33.890: gtk_box_gadget_distribute: assertion 'size >= 0' failed in GtkScrollbar
16:31:33 [2020-09-21T20:31:33.924Z] 
16:31:33 [2020-09-21T20:31:33.925Z] (SWT:1616): Gtk-CRITICAL **: 20:31:33.900: gtk_box_gadget_distribute: assertion 'size >= 0' failed in GtkScrollbar
16:31:34 [2020-09-21T20:31:34.181Z] 
16:31:34 [2020-09-21T20:31:34.181Z] (SWT:1616): Gtk-WARNING **: 20:31:33.953: Negative content width -6 (allocation 1, extents 4x3) while allocating gadget (node toolbar, owner GtkToolbar)
16:31:34 [2020-09-21T20:31:34.745Z] 
16:31:34 [2020-09-21T20:31:34.745Z] (SWT:1616): Gtk-WARNING **: 20:31:34.461: Negative content width -6 (allocation 1, extents 4x3) while allocating gadget (node toolbar, owner GtkToolbar)
16:31:34 [2020-09-21T20:31:34.745Z] 
16:31:34 [2020-09-21T20:31:34.745Z] (SWT:1616): Gtk-WARNING **: 20:31:34.471: Negative content width -6 (allocation 1, extents 4x3) while allocating gadget (node toolbar, owner GtkToolbar)
16:31:35 [2020-09-21T20:31:35.309Z] 
16:31:35 [2020-09-21T20:31:35.309Z] (SWT:1616): Gtk-WARNING **: 20:31:35.052: Negative content width -6 (allocation 1, extents 4x3) while allocating gadget (node toolbar, owner GtkToolbar)
16:31:35 [2020-09-21T20:31:35.566Z] 
16:31:35 [2020-09-21T20:31:35.566Z] (SWT:1616): Gtk-CRITICAL **: 20:31:35.494: gtk_box_gadget_distribute: assertion 'size >= 0' failed in GtkScrollbar
16:31:35 [2020-09-21T20:31:35.566Z] 
16:31:35 [2020-09-21T20:31:35.566Z] (SWT:1616): Gtk-CRITICAL **: 20:31:35.501: gtk_box_gadget_distribute: assertion 'size >= 0' failed in GtkScrollbar
16:31:35 [2020-09-21T20:31:35.566Z] 
16:31:35 [2020-09-21T20:31:35.566Z] (SWT:1616): Gtk-WARNING **: 20:31:35.504: Negative content width -6 (allocation 1, extents 4x3) while allocating gadget (node toolbar, owner GtkToolbar)
16:31:35 [2020-09-21T20:31:35.566Z] 
16:31:35 [2020-09-21T20:31:35.566Z] (SWT:1616): Gtk-CRITICAL **: 20:31:35.510: gtk_box_gadget_distribute: assertion 'size >= 0' failed in GtkScrollbar
16:31:35 [2020-09-21T20:31:35.566Z] 
16:31:35 [2020-09-21T20:31:35.566Z] (SWT:1616): Gtk-CRITICAL **: 20:31:35.516: gtk_box_gadget_distribute: assertion 'size >= 0' failed in GtkScrollbar
16:31:35 [2020-09-21T20:31:35.566Z] 
16:31:35 [2020-09-21T20:31:35.566Z] !ENTRY org.eclipse.egit.ui 2 0 2020-09-21 20:31:35.523
16:31:35 [2020-09-21T20:31:35.566Z] !MESSAGE Found multiple implementations of ICommitMessageProvider2. Ignoring caret positioning for org.eclipse.egit.ui.test.stagview.CommitMessageProvidersTest$TestCommitMessageProvider.
16:31:35 [2020-09-21T20:31:35.566Z] 
16:31:35 [2020-09-21T20:31:35.566Z] (SWT:1616): Gtk-CRITICAL **: 20:31:35.523: gtk_box_gadget_distribute: assertion 'size >= 0' failed in GtkScrollbar
16:31:35 [2020-09-21T20:31:35.566Z] 
16:31:35 [2020-09-21T20:31:35.566Z] (SWT:1616): Gtk-CRITICAL **: 20:31:35.523: gtk_box_gadget_distribute: assertion 'size >= 0' failed in GtkScrollbar
16:31:35 [2020-09-21T20:31:35.566Z] 
16:31:35 [2020-09-21T20:31:35.566Z] (SWT:1616): Gtk-CRITICAL **: 20:31:35.525: gtk_box_gadget_distribute: assertion 'size >= 0' failed in GtkScrollbar
16:31:35 [2020-09-21T20:31:35.566Z] 
16:31:35 [2020-09-21T20:31:35.567Z] (SWT:1616): Gtk-CRITICAL **: 20:31:35.525: gtk_box_gadget_distribute: assertion 'size >= 0' failed in GtkScrollbar
16:31:35 [2020-09-21T20:31:35.567Z] 
16:31:35 [2020-09-21T20:31:35.567Z] (SWT:1616): Gtk-CRITICAL **: 20:31:35.535: gtk_box_gadget_distribute: assertion 'size >= 0' failed in GtkScrollbar
16:31:35 [2020-09-21T20:31:35.567Z] 
16:31:35 [2020-09-21T20:31:35.567Z] (SWT:1616): Gtk-CRITICAL **: 20:31:35.535: gtk_box_gadget_distribute: assertion 'size >= 0' failed in GtkScrollbar
16:31:35 [2020-09-21T20:31:35.567Z] 
16:31:35 [2020-09-21T20:31:35.567Z] (SWT:1616): Gtk-CRITICAL **: 20:31:35.546: gtk_box_gadget_distribute: assertion 'size >= 0' failed in GtkScrollbar
16:31:35 [2020-09-21T20:31:35.567Z] 
16:31:35 [2020-09-21T20:31:35.567Z] (SWT:1616): Gtk-CRITICAL **: 20:31:35.561: gtk_box_gadget_distribute: assertion 'size >= 0' failed in GtkScrollbar
16:31:35 [2020-09-21T20:31:35.567Z] 
16:31:35 [2020-09-21T20:31:35.567Z] (SWT:1616): Gtk-CRITICAL **: 20:31:35.561: gtk_box_gadget_distribute: assertion 'size >= 0' failed in GtkScrollbar
16:31:35 [2020-09-21T20:31:35.824Z] 
16:31:35 [2020-09-21T20:31:35.824Z] (SWT:1616): Gtk-CRITICAL **: 20:31:35.577: gtk_box_gadget_distribute: assertion 'size >= 0' failed in GtkScrollbar
16:31:35 [2020-09-21T20:31:35.824Z] 
16:31:35 [2020-09-21T20:31:35.824Z] (SWT:1616): Gtk-CRITICAL **: 20:31:35.578: gtk_box_gadget_distribute: assertion 'size >= 0' failed in GtkScrollbar
16:31:35 [2020-09-21T20:31:35.824Z] 
16:31:35 [2020-09-21T20:31:35.824Z] (SWT:1616): Gtk-CRITICAL **: 20:31:35.594: gtk_box_gadget_distribute: assertion 'size >= 0' failed in GtkScrollbar
16:31:35 [2020-09-21T20:31:35.824Z] 
16:31:35 [2020-09-21T20:31:35.824Z] (SWT:1616): Gtk-CRITICAL **: 20:31:35.594: gtk_box_gadget_distribute: assertion 'size >= 0' failed in GtkScrollbar
16:31:35 [2020-09-21T20:31:35.824Z] 
16:31:35 [2020-09-21T20:31:35.824Z] (SWT:1616): Gtk-CRITICAL **: 20:31:35.610: gtk_box_gadget_distribute: assertion 'size >= 0' failed in GtkScrollbar
16:31:35 [2020-09-21T20:31:35.824Z] 
16:31:35 [2020-09-21T20:31:35.824Z] (SWT:1616): Gtk-CRITICAL **: 20:31:35.610: gtk_box_gadget_distribute: assertion 'size >= 0' failed in GtkScrollbar
16:31:35 [2020-09-21T20:31:35.824Z] 
16:31:35 [2020-09-21T20:31:35.824Z] (SWT:1616): Gtk-CRITICAL **: 20:31:35.627: gtk_box_gadget_distribute: assertion 'size >= 0' failed in GtkScrollbar
16:31:35 [2020-09-21T20:31:35.824Z] 
16:31:35 [2020-09-21T20:31:35.824Z] (SWT:1616): Gtk-CRITICAL **: 20:31:35.627: gtk_box_gadget_distribute: assertion 'size >= 0' failed in GtkScrollbar
16:31:35 [2020-09-21T20:31:35.824Z] 
16:31:35 [2020-09-21T20:31:35.824Z] (SWT:1616): Gtk-CRITICAL **: 20:31:35.644: gtk_box_gadget_distribute: assertion 'size >= 0' failed in GtkScrollbar
16:31:35 [2020-09-21T20:31:35.824Z] 
16:31:35 [2020-09-21T20:31:35.824Z] (SWT:1616): Gtk-CRITICAL **: 20:31:35.644: gtk_box_gadget_distribute: assertion 'size >= 0' failed in GtkScrollbar
16:31:35 [2020-09-21T20:31:35.824Z] 
16:31:35 [2020-09-21T20:31:35.824Z] (SWT:1616): Gtk-CRITICAL **: 20:31:35.667: gtk_box_gadget_distribute: assertion 'size >= 0' failed in GtkScrollbar
16:31:35 [2020-09-21T20:31:35.824Z] 
16:31:35 [2020-09-21T20:31:35.824Z] (SWT:1616): Gtk-CRITICAL **: 20:31:35.667: gtk_box_gadget_distribute: assertion 'size >= 0' failed in GtkScrollbar
16:31:35 [2020-09-21T20:31:35.824Z] 
16:31:35 [2020-09-21T20:31:35.824Z] (SWT:1616): Gtk-CRITICAL **: 20:31:35.678: gtk_box_gadget_distribute: assertion 'size >= 0' failed in GtkScrollbar
16:31:35 [2020-09-21T20:31:35.824Z] 
16:31:35 [2020-09-21T20:31:35.824Z] (SWT:1616): Gtk-CRITICAL **: 20:31:35.678: gtk_box_gadget_distribute: assertion 'size >= 0' failed in GtkScrollbar
16:31:35 [2020-09-21T20:31:35.824Z] 
16:31:35 [2020-09-21T20:31:35.824Z] (SWT:1616): Gtk-CRITICAL **: 20:31:35.694: gtk_box_gadget_distribute: assertion 'size >= 0' failed in GtkScrollbar
16:31:35 [2020-09-21T20:31:35.824Z] 
16:31:35 [2020-09-21T20:31:35.824Z] (SWT:1616): Gtk-CRITICAL **: 20:31:35.694: gtk_box_gadget_distribute: assertion 'size >= 0' failed in GtkScrollbar
16:31:35 [2020-09-21T20:31:35.824Z] 
16:31:35 [2020-09-21T20:31:35.824Z] (SWT:1616): Gtk-CRITICAL **: 20:31:35.711: gtk_box_gadget_distribute: assertion 'size >= 0' failed in GtkScrollbar
16:31:35 [2020-09-21T20:31:35.824Z] 
16:31:35 [2020-09-21T20:31:35.824Z] (SWT:1616): Gtk-CRITICAL **: 20:31:35.711: gtk_box_gadget_distribute: assertion 'size >= 0' failed in GtkScrollbar
16:31:35 [2020-09-21T20:31:35.824Z] 
16:31:35 [2020-09-21T20:31:35.824Z] (SWT:1616): Gtk-CRITICAL **: 20:31:35.721: gtk_box_gadget_distribute: assertion 'size >= 0' failed in GtkScrollbar
16:31:35 [2020-09-21T20:31:35.824Z] 
16:31:35 [2020-09-21T20:31:35.824Z] (SWT:1616): Gtk-CRITICAL **: 20:31:35.721: gtk_box_gadget_distribute: assertion 'size >= 0' failed in GtkScrollbar
16:31:35 [2020-09-21T20:31:35.824Z] 
16:31:35 [2020-09-21T20:31:35.824Z] (SWT:1616): Gtk-CRITICAL **: 20:31:35.728: gtk_box_gadget_distribute: assertion 'size >= 0' failed in GtkScrollbar
16:31:35 [2020-09-21T20:31:35.824Z] 
16:31:35 [2020-09-21T20:31:35.824Z] (SWT:1616): Gtk-CRITICAL **: 20:31:35.728: gtk_box_gadget_distribute: assertion 'size >= 0' failed in GtkScrollbar
16:31:35 [2020-09-21T20:31:35.824Z] 
16:31:35 [2020-09-21T20:31:35.824Z] (SWT:1616): Gtk-CRITICAL **: 20:31:35.728: gtk_box_gadget_distribute: assertion 'size >= 0' failed in GtkScrollbar
16:31:35 [2020-09-21T20:31:35.824Z] 
16:31:35 [2020-09-21T20:31:35.824Z] (SWT:1616): Gtk-CRITICAL **: 20:31:35.744: gtk_box_gadget_distribute: assertion 'size >= 0' failed in GtkScrollbar
16:31:35 [2020-09-21T20:31:35.824Z] 
16:31:35 [2020-09-21T20:31:35.824Z] (SWT:1616): Gtk-CRITICAL **: 20:31:35.744: gtk_box_gadget_distribute: assertion 'size >= 0' failed in GtkScrollbar
16:31:35 [2020-09-21T20:31:35.824Z] 
16:31:35 [2020-09-21T20:31:35.824Z] (SWT:1616): Gtk-CRITICAL **: 20:31:35.761: gtk_box_gadget_distribute: assertion 'size >= 0' failed in GtkScrollbar
16:31:35 [2020-09-21T20:31:35.824Z] 
16:31:35 [2020-09-21T20:31:35.824Z] (SWT:1616): Gtk-WARNING **: 20:31:35.785: Negative content width -6 (allocation 1, extents 4x3) while allocating gadget (node toolbar, owner GtkToolbar)
16:31:36 [2020-09-21T20:31:36.388Z] 
16:31:36 [2020-09-21T20:31:36.388Z] (SWT:1616): Gtk-WARNING **: 20:31:36.341: Negative content width -6 (allocation 1, extents 4x3) while allocating gadget (node toolbar, owner GtkToolbar)
16:31:36 [2020-09-21T20:31:36.388Z] 
16:31:36 [2020-09-21T20:31:36.388Z] (SWT:1616): Gtk-WARNING **: 20:31:36.351: Negative content width -6 (allocation 1, extents 4x3) while allocating gadget (node toolbar, owner GtkToolbar)
16:31:36 [2020-09-21T20:31:36.953Z] 
16:31:36 [2020-09-21T20:31:36.953Z] (SWT:1616): Gtk-WARNING **: 20:31:36.930: Negative content width -6 (allocation 1, extents 4x3) while allocating gadget (node toolbar, owner GtkToolbar)
16:31:37 [2020-09-21T20:31:37.518Z] 
16:31:37 [2020-09-21T20:31:37.518Z] (SWT:1616): Gtk-CRITICAL **: 20:31:37.380: gtk_box_gadget_distribute: assertion 'size >= 0' failed in GtkScrollbar
16:31:37 [2020-09-21T20:31:37.518Z] 
16:31:37 [2020-09-21T20:31:37.518Z] (SWT:1616): Gtk-CRITICAL **: 20:31:37.387: gtk_box_gadget_distribute: assertion 'size >= 0' failed in GtkScrollbar
16:31:37 [2020-09-21T20:31:37.518Z] 
16:31:37 [2020-09-21T20:31:37.518Z] (SWT:1616): Gtk-WARNING **: 20:31:37.390: Negative content width -6 (allocation 1, extents 4x3) while allocating gadget (node toolbar, owner GtkToolbar)
16:31:37 [2020-09-21T20:31:37.518Z] 
16:31:37 [2020-09-21T20:31:37.518Z] (SWT:1616): Gtk-CRITICAL **: 20:31:37.396: gtk_box_gadget_distribute: assertion 'size >= 0' failed in GtkScrollbar
16:31:37 [2020-09-21T20:31:37.518Z] 
16:31:37 [2020-09-21T20:31:37.518Z] (SWT:1616): Gtk-CRITICAL **: 20:31:37.401: gtk_box_gadget_distribute: assertion 'size >= 0' failed in GtkScrollbar
16:31:37 [2020-09-21T20:31:37.518Z] 
16:31:37 [2020-09-21T20:31:37.518Z] (SWT:1616): Gtk-CRITICAL **: 20:31:37.402: gtk_box_gadget_distribute: assertion 'size >= 0' failed in GtkScrollbar
16:31:37 [2020-09-21T20:31:37.518Z] 
16:31:37 [2020-09-21T20:31:37.518Z] (SWT:1616): Gtk-CRITICAL **: 20:31:37.402: gtk_box_gadget_distribute: assertion 'size >= 0' failed in GtkScrollbar
16:31:37 [2020-09-21T20:31:37.518Z] 
16:31:37 [2020-09-21T20:31:37.518Z] (SWT:1616): Gtk-CRITICAL **: 20:31:37.403: gtk_box_gadget_distribute: assertion 'size >= 0' failed in GtkScrollbar
16:31:37 [2020-09-21T20:31:37.518Z] 
16:31:37 [2020-09-21T20:31:37.518Z] (SWT:1616): Gtk-CRITICAL **: 20:31:37.403: gtk_box_gadget_distribute: assertion 'size >= 0' failed in GtkScrollbar
16:31:37 [2020-09-21T20:31:37.518Z] 
16:31:37 [2020-09-21T20:31:37.518Z] (SWT:1616): Gtk-CRITICAL **: 20:31:37.417: gtk_box_gadget_distribute: assertion 'size >= 0' failed in GtkScrollbar
16:31:37 [2020-09-21T20:31:37.518Z] 
16:31:37 [2020-09-21T20:31:37.518Z] (SWT:1616): Gtk-CRITICAL **: 20:31:37.417: gtk_box_gadget_distribute: assertion 'size >= 0' failed in GtkScrollbar
16:31:37 [2020-09-21T20:31:37.518Z] 
16:31:37 [2020-09-21T20:31:37.518Z] (SWT:1616): Gtk-CRITICAL **: 20:31:37.424: gtk_box_gadget_distribute: assertion 'size >= 0' failed in GtkScrollbar
16:31:37 [2020-09-21T20:31:37.518Z] 
16:31:37 [2020-09-21T20:31:37.518Z] (SWT:1616): Gtk-CRITICAL **: 20:31:37.429: gtk_box_gadget_distribute: assertion 'size >= 0' failed in GtkScrollbar
16:31:37 [2020-09-21T20:31:37.518Z] 
16:31:37 [2020-09-21T20:31:37.519Z] (SWT:1616): Gtk-CRITICAL **: 20:31:37.429: gtk_box_gadget_distribute: assertion 'size >= 0' failed in GtkScrollbar
16:31:37 [2020-09-21T20:31:37.519Z] 
16:31:37 [2020-09-21T20:31:37.519Z] (SWT:1616): Gtk-CRITICAL **: 20:31:37.446: gtk_box_gadget_distribute: assertion 'size >= 0' failed in GtkScrollbar
16:31:37 [2020-09-21T20:31:37.519Z] 
16:31:37 [2020-09-21T20:31:37.519Z] (SWT:1616): Gtk-CRITICAL **: 20:31:37.446: gtk_box_gadget_distribute: assertion 'size >= 0' failed in GtkScrollbar
16:31:37 [2020-09-21T20:31:37.519Z] 
16:31:37 [2020-09-21T20:31:37.519Z] (SWT:1616): Gtk-CRITICAL **: 20:31:37.463: gtk_box_gadget_distribute: assertion 'size >= 0' failed in GtkScrollbar
16:31:37 [2020-09-21T20:31:37.519Z] 
16:31:37 [2020-09-21T20:31:37.519Z] (SWT:1616): Gtk-CRITICAL **: 20:31:37.463: gtk_box_gadget_distribute: assertion 'size >= 0' failed in GtkScrollbar
16:31:37 [2020-09-21T20:31:37.519Z] 
16:31:37 [2020-09-21T20:31:37.519Z] (SWT:1616): Gtk-CRITICAL **: 20:31:37.479: gtk_box_gadget_distribute: assertion 'size >= 0' failed in GtkScrollbar
16:31:37 [2020-09-21T20:31:37.519Z] 
16:31:37 [2020-09-21T20:31:37.519Z] (SWT:1616): Gtk-CRITICAL **: 20:31:37.479: gtk_box_gadget_distribute: assertion 'size >= 0' failed in GtkScrollbar
16:31:37 [2020-09-21T20:31:37.519Z] 
16:31:37 [2020-09-21T20:31:37.519Z] (SWT:1616): Gtk-CRITICAL **: 20:31:37.496: gtk_box_gadget_distribute: assertion 'size >= 0' failed in GtkScrollbar
16:31:37 [2020-09-21T20:31:37.519Z] 
16:31:37 [2020-09-21T20:31:37.519Z] (SWT:1616): Gtk-CRITICAL **: 20:31:37.496: gtk_box_gadget_distribute: assertion 'size >= 0' failed in GtkScrollbar
16:31:37 [2020-09-21T20:31:37.519Z] 
16:31:37 [2020-09-21T20:31:37.519Z] (SWT:1616): Gtk-CRITICAL **: 20:31:37.513: gtk_box_gadget_distribute: assertion 'size >= 0' failed in GtkScrollbar
16:31:37 [2020-09-21T20:31:37.519Z] 
16:31:37 [2020-09-21T20:31:37.519Z] (SWT:1616): Gtk-CRITICAL **: 20:31:37.513: gtk_box_gadget_distribute: assertion 'size >= 0' failed in GtkScrollbar
16:31:37 [2020-09-21T20:31:37.775Z] 
16:31:37 [2020-09-21T20:31:37.775Z] (SWT:1616): Gtk-CRITICAL **: 20:31:37.535: gtk_box_gadget_distribute: assertion 'size >= 0' failed in GtkScrollbar
16:31:37 [2020-09-21T20:31:37.775Z] 
16:31:37 [2020-09-21T20:31:37.775Z] (SWT:1616): Gtk-CRITICAL **: 20:31:37.536: gtk_box_gadget_distribute: assertion 'size >= 0' failed in GtkScrollbar
16:31:37 [2020-09-21T20:31:37.775Z] 
16:31:37 [2020-09-21T20:31:37.775Z] (SWT:1616): Gtk-CRITICAL **: 20:31:37.548: gtk_box_gadget_distribute: assertion 'size >= 0' failed in GtkScrollbar
16:31:37 [2020-09-21T20:31:37.776Z] 
16:31:37 [2020-09-21T20:31:37.776Z] (SWT:1616): Gtk-CRITICAL **: 20:31:37.548: gtk_box_gadget_distribute: assertion 'size >= 0' failed in GtkScrollbar
16:31:37 [2020-09-21T20:31:37.776Z] 
16:31:37 [2020-09-21T20:31:37.776Z] (SWT:1616): Gtk-CRITICAL **: 20:31:37.563: gtk_box_gadget_distribute: assertion 'size >= 0' failed in GtkScrollbar
16:31:37 [2020-09-21T20:31:37.776Z] 
16:31:37 [2020-09-21T20:31:37.776Z] (SWT:1616): Gtk-CRITICAL **: 20:31:37.563: gtk_box_gadget_distribute: assertion 'size >= 0' failed in GtkScrollbar
16:31:37 [2020-09-21T20:31:37.776Z] 
16:31:37 [2020-09-21T20:31:37.776Z] (SWT:1616): Gtk-CRITICAL **: 20:31:37.580: gtk_box_gadget_distribute: assertion 'size >= 0' failed in GtkScrollbar
16:31:37 [2020-09-21T20:31:37.776Z] 
16:31:37 [2020-09-21T20:31:37.776Z] (SWT:1616): Gtk-CRITICAL **: 20:31:37.580: gtk_box_gadget_distribute: assertion 'size >= 0' failed in GtkScrollbar
16:31:37 [2020-09-21T20:31:37.776Z] 
16:31:37 [2020-09-21T20:31:37.776Z] (SWT:1616): Gtk-CRITICAL **: 20:31:37.596: gtk_box_gadget_distribute: assertion 'size >= 0' failed in GtkScrollbar
16:31:37 [2020-09-21T20:31:37.776Z] 
16:31:37 [2020-09-21T20:31:37.776Z] (SWT:1616): Gtk-CRITICAL **: 20:31:37.596: gtk_box_gadget_distribute: assertion 'size >= 0' failed in GtkScrollbar
16:31:37 [2020-09-21T20:31:37.776Z] 
16:31:37 [2020-09-21T20:31:37.776Z] (SWT:1616): Gtk-CRITICAL **: 20:31:37.608: gtk_box_gadget_distribute: assertion 'size >= 0' failed in GtkScrollbar
16:31:37 [2020-09-21T20:31:37.776Z] 
16:31:37 [2020-09-21T20:31:37.776Z] (SWT:1616): Gtk-CRITICAL **: 20:31:37.608: gtk_box_gadget_distribute: assertion 'size >= 0' failed in GtkScrollbar
16:31:37 [2020-09-21T20:31:37.776Z] 
16:31:37 [2020-09-21T20:31:37.776Z] (SWT:1616): Gtk-CRITICAL **: 20:31:37.614: gtk_box_gadget_distribute: assertion 'size >= 0' failed in GtkScrollbar
16:31:37 [2020-09-21T20:31:37.776Z] 
16:31:37 [2020-09-21T20:31:37.776Z] (SWT:1616): Gtk-CRITICAL **: 20:31:37.614: gtk_box_gadget_distribute: assertion 'size >= 0' failed in GtkScrollbar
16:31:37 [2020-09-21T20:31:37.776Z] 
16:31:37 [2020-09-21T20:31:37.776Z] (SWT:1616): Gtk-CRITICAL **: 20:31:37.614: gtk_box_gadget_distribute: assertion 'size >= 0' failed in GtkScrollbar
16:31:37 [2020-09-21T20:31:37.776Z] 
16:31:37 [2020-09-21T20:31:37.776Z] (SWT:1616): Gtk-CRITICAL **: 20:31:37.631: gtk_box_gadget_distribute: assertion 'size >= 0' failed in GtkScrollbar
16:31:37 [2020-09-21T20:31:37.776Z] 
16:31:37 [2020-09-21T20:31:37.776Z] (SWT:1616): Gtk-CRITICAL **: 20:31:37.631: gtk_box_gadget_distribute: assertion 'size >= 0' failed in GtkScrollbar
16:31:37 [2020-09-21T20:31:37.776Z] 
16:31:37 [2020-09-21T20:31:37.776Z] (SWT:1616): Gtk-CRITICAL **: 20:31:37.647: gtk_box_gadget_distribute: assertion 'size >= 0' failed in GtkScrollbar
16:31:37 [2020-09-21T20:31:37.776Z] 
16:31:37 [2020-09-21T20:31:37.776Z] (SWT:1616): Gtk-WARNING **: 20:31:37.672: Negative content width -6 (allocation 1, extents 4x3) while allocating gadget (node toolbar, owner GtkToolbar)
16:31:38 [2020-09-21T20:31:38.340Z] 
16:31:38 [2020-09-21T20:31:38.340Z] (SWT:1616): Gtk-WARNING **: 20:31:38.126: Negative content width -6 (allocation 1, extents 4x3) while allocating gadget (node toolbar, owner GtkToolbar)
16:31:38 [2020-09-21T20:31:38.340Z] 
16:31:38 [2020-09-21T20:31:38.340Z] (SWT:1616): Gtk-WARNING **: 20:31:38.135: Negative content width -6 (allocation 1, extents 4x3) while allocating gadget (node toolbar, owner GtkToolbar)
16:31:38 [2020-09-21T20:31:38.340Z] Tests run: 3, Failures: 0, Errors: 0, Skipped: 0, Time elapsed: 5.398 s - in org.eclipse.egit.ui.test.stagview.CommitMessageProvidersTest
16:31:38 [2020-09-21T20:31:38.340Z] testCaretPosition(org.eclipse.egit.ui.test.stagview.CommitMessageProvidersTest)  Time elapsed: 1.728 s
16:31:38 [2020-09-21T20:31:38.340Z] testTwoProvidersFromSameExtension(org.eclipse.egit.ui.test.stagview.CommitMessageProvidersTest)  Time elapsed: 1.881 s
16:31:38 [2020-09-21T20:31:38.340Z] testCaretPositionUndefined(org.eclipse.egit.ui.test.stagview.CommitMessageProvidersTest)  Time elapsed: 1.784 s
16:31:38 [2020-09-21T20:31:38.340Z] Running org.eclipse.egit.ui.variables.DynamicVariablesTest
16:31:43 [2020-09-21T20:31:43.618Z] Tests run: 4, Failures: 0, Errors: 0, Skipped: 0, Time elapsed: 4.314 s - in org.eclipse.egit.ui.variables.DynamicVariablesTest
16:31:43 [2020-09-21T20:31:43.618Z] testGitBranch(org.eclipse.egit.ui.variables.DynamicVariablesTest)  Time elapsed: 1.108 s
16:31:43 [2020-09-21T20:31:43.618Z] testGitPath(org.eclipse.egit.ui.variables.DynamicVariablesTest)  Time elapsed: 1.078 s
16:31:43 [2020-09-21T20:31:43.618Z] testGitWorkTree(org.eclipse.egit.ui.variables.DynamicVariablesTest)  Time elapsed: 1.063 s
16:31:43 [2020-09-21T20:31:43.618Z] testGitDir(org.eclipse.egit.ui.variables.DynamicVariablesTest)  Time elapsed: 1.064 s
16:31:43 [2020-09-21T20:31:43.618Z] Running org.eclipse.egit.ui.gitflow.FeatureFinishSquashHandlerTest
16:31:43 [2020-09-21T20:31:43.618Z] 
16:31:43 [2020-09-21T20:31:43.618Z] (SWT:1616): Gtk-CRITICAL **: 20:31:43.233: gtk_box_gadget_distribute: assertion 'size >= 0' failed in GtkScrollbar
16:31:43 [2020-09-21T20:31:43.618Z] 
16:31:43 [2020-09-21T20:31:43.618Z] (SWT:1616): Gtk-CRITICAL **: 20:31:43.252: gtk_box_gadget_distribute: assertion 'size >= 0' failed in GtkScrollbar
16:31:43 [2020-09-21T20:31:43.618Z] 
16:31:43 [2020-09-21T20:31:43.618Z] (SWT:1616): Gtk-CRITICAL **: 20:31:43.268: gtk_box_gadget_distribute: assertion 'size >= 0' failed in GtkScrollbar
16:31:43 [2020-09-21T20:31:43.618Z] 
16:31:43 [2020-09-21T20:31:43.618Z] (SWT:1616): Gtk-CRITICAL **: 20:31:43.285: gtk_box_gadget_distribute: assertion 'size >= 0' failed in GtkScrollbar
16:31:43 [2020-09-21T20:31:43.618Z] 
16:31:43 [2020-09-21T20:31:43.618Z] (SWT:1616): Gtk-CRITICAL **: 20:31:43.301: gtk_box_gadget_distribute: assertion 'size >= 0' failed in GtkScrollbar
16:31:43 [2020-09-21T20:31:43.618Z] 
16:31:43 [2020-09-21T20:31:43.618Z] (SWT:1616): Gtk-CRITICAL **: 20:31:43.318: gtk_box_gadget_distribute: assertion 'size >= 0' failed in GtkScrollbar
16:31:43 [2020-09-21T20:31:43.618Z] 
16:31:43 [2020-09-21T20:31:43.618Z] (SWT:1616): Gtk-CRITICAL **: 20:31:43.335: gtk_box_gadget_distribute: assertion 'size >= 0' failed in GtkScrollbar
16:31:43 [2020-09-21T20:31:43.618Z] 
16:31:43 [2020-09-21T20:31:43.618Z] (SWT:1616): Gtk-CRITICAL **: 20:31:43.356: gtk_box_gadget_distribute: assertion 'size >= 0' failed in GtkScrollbar
16:31:43 [2020-09-21T20:31:43.619Z] 
16:31:43 [2020-09-21T20:31:43.619Z] (SWT:1616): Gtk-CRITICAL **: 20:31:43.368: gtk_box_gadget_distribute: assertion 'size >= 0' failed in GtkScrollbar
16:31:43 [2020-09-21T20:31:43.619Z] 
16:31:43 [2020-09-21T20:31:43.619Z] (SWT:1616): Gtk-CRITICAL **: 20:31:43.384: gtk_box_gadget_distribute: assertion 'size >= 0' failed in GtkScrollbar
16:31:43 [2020-09-21T20:31:43.619Z] 
16:31:43 [2020-09-21T20:31:43.619Z] (SWT:1616): Gtk-CRITICAL **: 20:31:43.401: gtk_box_gadget_distribute: assertion 'size >= 0' failed in GtkScrollbar
16:31:43 [2020-09-21T20:31:43.619Z] 
16:31:43 [2020-09-21T20:31:43.619Z] (SWT:1616): Gtk-CRITICAL **: 20:31:43.417: gtk_box_gadget_distribute: assertion 'size >= 0' failed in GtkScrollbar
16:31:43 [2020-09-21T20:31:43.619Z] 
16:31:43 [2020-09-21T20:31:43.619Z] (SWT:1616): Gtk-CRITICAL **: 20:31:43.434: gtk_box_gadget_distribute: assertion 'size >= 0' failed in GtkScrollbar
16:31:43 [2020-09-21T20:31:43.619Z] 
16:31:43 [2020-09-21T20:31:43.619Z] (SWT:1616): Gtk-CRITICAL **: 20:31:43.451: gtk_box_gadget_distribute: assertion 'size >= 0' failed in GtkScrollbar
16:31:44 [2020-09-21T20:31:44.182Z] 
16:31:44 [2020-09-21T20:31:44.182Z] (SWT:1616): Gtk-CRITICAL **: 20:31:43.962: gtk_box_gadget_distribute: assertion 'size >= 0' failed in GtkScrollbar
16:31:44 [2020-09-21T20:31:44.746Z] Tests run: 1, Failures: 0, Errors: 0, Skipped: 0, Time elapsed: 2.085 s - in org.eclipse.egit.ui.gitflow.FeatureFinishSquashHandlerTest
16:31:44 [2020-09-21T20:31:44.746Z] testFeatureFinishSquash(org.eclipse.egit.ui.gitflow.FeatureFinishSquashHandlerTest)  Time elapsed: 2.081 s
16:31:44 [2020-09-21T20:31:44.746Z] Running org.eclipse.egit.ui.gitflow.FeatureStartFinishHandlerTest
16:31:45 [2020-09-21T20:31:45.676Z] 
16:31:45 [2020-09-21T20:31:45.676Z] (SWT:1616): Gtk-CRITICAL **: 20:31:45.347: gtk_box_gadget_distribute: assertion 'size >= 0' failed in GtkScrollbar
16:31:45 [2020-09-21T20:31:45.676Z] 
16:31:45 [2020-09-21T20:31:45.676Z] (SWT:1616): Gtk-CRITICAL **: 20:31:45.361: gtk_box_gadget_distribute: assertion 'size >= 0' failed in GtkScrollbar
16:31:45 [2020-09-21T20:31:45.676Z] 
16:31:45 [2020-09-21T20:31:45.676Z] (SWT:1616): Gtk-CRITICAL **: 20:31:45.377: gtk_box_gadget_distribute: assertion 'size >= 0' failed in GtkScrollbar
16:31:45 [2020-09-21T20:31:45.676Z] 
16:31:45 [2020-09-21T20:31:45.677Z] (SWT:1616): Gtk-CRITICAL **: 20:31:45.394: gtk_box_gadget_distribute: assertion 'size >= 0' failed in GtkScrollbar
16:31:45 [2020-09-21T20:31:45.677Z] 
16:31:45 [2020-09-21T20:31:45.677Z] (SWT:1616): Gtk-CRITICAL **: 20:31:45.411: gtk_box_gadget_distribute: assertion 'size >= 0' failed in GtkScrollbar
16:31:45 [2020-09-21T20:31:45.677Z] 
16:31:45 [2020-09-21T20:31:45.677Z] (SWT:1616): Gtk-CRITICAL **: 20:31:45.427: gtk_box_gadget_distribute: assertion 'size >= 0' failed in GtkScrollbar
16:31:45 [2020-09-21T20:31:45.677Z] 
16:31:45 [2020-09-21T20:31:45.677Z] (SWT:1616): Gtk-CRITICAL **: 20:31:45.444: gtk_box_gadget_distribute: assertion 'size >= 0' failed in GtkScrollbar
16:31:45 [2020-09-21T20:31:45.677Z] 
16:31:45 [2020-09-21T20:31:45.677Z] (SWT:1616): Gtk-CRITICAL **: 20:31:45.461: gtk_box_gadget_distribute: assertion 'size >= 0' failed in GtkScrollbar
16:31:45 [2020-09-21T20:31:45.677Z] 
16:31:45 [2020-09-21T20:31:45.677Z] (SWT:1616): Gtk-CRITICAL **: 20:31:45.477: gtk_box_gadget_distribute: assertion 'size >= 0' failed in GtkScrollbar
16:31:45 [2020-09-21T20:31:45.677Z] 
16:31:45 [2020-09-21T20:31:45.677Z] (SWT:1616): Gtk-CRITICAL **: 20:31:45.494: gtk_box_gadget_distribute: assertion 'size >= 0' failed in GtkScrollbar
16:31:45 [2020-09-21T20:31:45.677Z] 
16:31:45 [2020-09-21T20:31:45.677Z] (SWT:1616): Gtk-CRITICAL **: 20:31:45.511: gtk_box_gadget_distribute: assertion 'size >= 0' failed in GtkScrollbar
16:31:45 [2020-09-21T20:31:45.677Z] 
16:31:45 [2020-09-21T20:31:45.677Z] (SWT:1616): Gtk-CRITICAL **: 20:31:45.527: gtk_box_gadget_distribute: assertion 'size >= 0' failed in GtkScrollbar
16:31:45 [2020-09-21T20:31:45.677Z] 
16:31:45 [2020-09-21T20:31:45.677Z] (SWT:1616): Gtk-CRITICAL **: 20:31:45.544: gtk_box_gadget_distribute: assertion 'size >= 0' failed in GtkScrollbar
16:31:45 [2020-09-21T20:31:45.677Z] 
16:31:45 [2020-09-21T20:31:45.677Z] (SWT:1616): Gtk-CRITICAL **: 20:31:45.560: gtk_box_gadget_distribute: assertion 'size >= 0' failed in GtkScrollbar
16:31:45 [2020-09-21T20:31:45.677Z] 
16:31:45 [2020-09-21T20:31:45.677Z] (SWT:1616): Gtk-CRITICAL **: 20:31:45.577: gtk_box_gadget_distribute: assertion 'size >= 0' failed in GtkScrollbar
16:31:45 [2020-09-21T20:31:45.677Z] 
16:31:45 [2020-09-21T20:31:45.677Z] (SWT:1616): Gtk-CRITICAL **: 20:31:45.594: gtk_box_gadget_distribute: assertion 'size >= 0' failed in GtkScrollbar
16:31:46 [2020-09-21T20:31:46.241Z] 
16:31:46 [2020-09-21T20:31:46.241Z] (SWT:1616): Gtk-CRITICAL **: 20:31:46.061: gtk_box_gadget_distribute: assertion 'size >= 0' failed in GtkScrollbar
16:31:46 [2020-09-21T20:31:46.806Z] Tests run: 1, Failures: 0, Errors: 0, Skipped: 0, Time elapsed: 2.026 s - in org.eclipse.egit.ui.gitflow.FeatureStartFinishHandlerTest
16:31:46 [2020-09-21T20:31:46.806Z] testFeatureStart(org.eclipse.egit.ui.gitflow.FeatureStartFinishHandlerTest)  Time elapsed: 2.023 s
16:31:46 [2020-09-21T20:31:46.806Z] Running org.eclipse.egit.ui.gitflow.InitHandlerTest
16:31:50 [2020-09-21T20:31:50.082Z] Tests run: 3, Failures: 0, Errors: 0, Skipped: 0, Time elapsed: 3.381 s - in org.eclipse.egit.ui.gitflow.InitHandlerTest
16:31:50 [2020-09-21T20:31:50.082Z] testInit(org.eclipse.egit.ui.gitflow.InitHandlerTest)  Time elapsed: 0.815 s
16:31:50 [2020-09-21T20:31:50.082Z] testInitEmptyRepoMissingMaster(org.eclipse.egit.ui.gitflow.InitHandlerTest)  Time elapsed: 1.385 s
16:31:50 [2020-09-21T20:31:50.082Z] testInitMissingMaster(org.eclipse.egit.ui.gitflow.InitHandlerTest)  Time elapsed: 1.175 s
16:31:50 [2020-09-21T20:31:50.082Z] Running org.eclipse.egit.ui.gitflow.FeatureRebaseHandlerTest
16:31:51 [2020-09-21T20:31:51.013Z] 
16:31:51 [2020-09-21T20:31:51.013Z] (SWT:1616): Gtk-WARNING **: 20:31:50.827: Negative content width -6 (allocation 1, extents 4x3) while allocating gadget (node toolbar, owner GtkToolbar)
16:31:51 [2020-09-21T20:31:51.013Z] 
16:31:51 [2020-09-21T20:31:51.013Z] (SWT:1616): Gtk-WARNING **: 20:31:50.831: Negative content width -6 (allocation 1, extents 4x3) while allocating gadget (node toolbar, owner GtkToolbar)
16:31:51 [2020-09-21T20:31:51.013Z] 
16:31:51 [2020-09-21T20:31:51.013Z] (SWT:1616): Gtk-WARNING **: 20:31:50.835: Negative content width -6 (allocation 1, extents 4x3) while allocating gadget (node toolbar, owner GtkToolbar)
16:31:51 [2020-09-21T20:31:51.013Z] 
16:31:51 [2020-09-21T20:31:51.013Z] (SWT:1616): Gtk-WARNING **: 20:31:50.836: Negative content width -6 (allocation 1, extents 4x3) while allocating gadget (node toolbar, owner GtkToolbar)
16:31:51 [2020-09-21T20:31:51.013Z] 
16:31:51 [2020-09-21T20:31:51.013Z] (SWT:1616): Gtk-WARNING **: 20:31:50.836: Negative content width -6 (allocation 1, extents 4x3) while allocating gadget (node toolbar, owner GtkToolbar)
16:31:51 [2020-09-21T20:31:51.013Z] 
16:31:51 [2020-09-21T20:31:51.013Z] (SWT:1616): Gtk-WARNING **: 20:31:50.865: Negative content width -6 (allocation 1, extents 4x3) while allocating gadget (node toolbar, owner GtkToolbar)
16:31:51 [2020-09-21T20:31:51.578Z] 
16:31:51 [2020-09-21T20:31:51.578Z] (SWT:1616): Gtk-WARNING **: 20:31:51.306: Negative content height -1 (allocation 1, extents 1x1) while allocating gadget (node scrolledwindow, owner GtkScrolledWindow)
16:31:51 [2020-09-21T20:31:51.578Z] 
16:31:51 [2020-09-21T20:31:51.578Z] (SWT:1616): Gtk-CRITICAL **: 20:31:51.306: gtk_box_gadget_distribute: assertion 'size >= 0' failed in GtkScrollbar
16:31:51 [2020-09-21T20:31:51.578Z] 
16:31:51 [2020-09-21T20:31:51.578Z] (SWT:1616): Gtk-WARNING **: 20:31:51.356: Negative content width -6 (allocation 1, extents 4x3) while allocating gadget (node toolbar, owner GtkToolbar)
16:31:52 [2020-09-21T20:31:52.952Z] 
16:31:52 [2020-09-21T20:31:52.952Z] (SWT:1616): Gtk-WARNING **: 20:31:52.680: Negative content height -1 (allocation 1, extents 1x1) while allocating gadget (node scrolledwindow, owner GtkScrolledWindow)
16:31:52 [2020-09-21T20:31:52.952Z] 
16:31:52 [2020-09-21T20:31:52.952Z] (SWT:1616): Gtk-CRITICAL **: 20:31:52.680: gtk_box_gadget_distribute: assertion 'size >= 0' failed in GtkScrollbar
16:31:52 [2020-09-21T20:31:52.952Z] Tests run: 2, Failures: 0, Errors: 0, Skipped: 0, Time elapsed: 2.739 s - in org.eclipse.egit.ui.gitflow.FeatureRebaseHandlerTest
16:31:52 [2020-09-21T20:31:52.952Z] testRebaseFailOnConflict(org.eclipse.egit.ui.gitflow.FeatureRebaseHandlerTest)  Time elapsed: 1.39 s
16:31:52 [2020-09-21T20:31:52.952Z] testRebaseFailOnDirtyWorkingDirectory(org.eclipse.egit.ui.gitflow.FeatureRebaseHandlerTest)  Time elapsed: 1.341 s
16:31:52 [2020-09-21T20:31:52.952Z] Running org.eclipse.egit.ui.gitflow.FeatureStartCheckoutConflictTest
16:31:53 [2020-09-21T20:31:53.517Z] 
16:31:53 [2020-09-21T20:31:53.517Z] (SWT:1616): Gtk-CRITICAL **: 20:31:53.387: gtk_box_gadget_distribute: assertion 'size >= 0' failed in GtkScrollbar
16:31:53 [2020-09-21T20:31:53.517Z] 
16:31:53 [2020-09-21T20:31:53.517Z] (SWT:1616): Gtk-CRITICAL **: 20:31:53.394: gtk_box_gadget_distribute: assertion 'size >= 0' failed in GtkScrollbar
16:31:53 [2020-09-21T20:31:53.780Z] Tests run: 1, Failures: 0, Errors: 0, Skipped: 0, Time elapsed: 0.726 s - in org.eclipse.egit.ui.gitflow.FeatureStartCheckoutConflictTest
16:31:53 [2020-09-21T20:31:53.780Z] testFeatureStart(org.eclipse.egit.ui.gitflow.FeatureStartCheckoutConflictTest)  Time elapsed: 0.722 s
16:31:53 [2020-09-21T20:31:53.780Z] Running org.eclipse.egit.ui.gitflow.CommandEnablementTest
16:31:54 [2020-09-21T20:31:54.711Z] 
16:31:54 [2020-09-21T20:31:54.711Z] (SWT:1616): Gtk-WARNING **: 20:31:54.651: Negative content width -6 (allocation 1, extents 4x3) while allocating gadget (node toolbar, owner GtkToolbar)
16:31:54 [2020-09-21T20:31:54.968Z] 
16:31:54 [2020-09-21T20:31:54.968Z] (SWT:1616): Gtk-WARNING **: 20:31:54.801: Negative content width -6 (allocation 1, extents 4x3) while allocating gadget (node toolbar, owner GtkToolbar)
16:31:55 [2020-09-21T20:31:55.226Z] Tests run: 2, Failures: 0, Errors: 0, Skipped: 0, Time elapsed: 1.647 s - in org.eclipse.egit.ui.gitflow.CommandEnablementTest
16:31:55 [2020-09-21T20:31:55.226Z] testPackageExplorerStartFinishEnablement(org.eclipse.egit.ui.gitflow.CommandEnablementTest)  Time elapsed: 0.633 s
16:31:55 [2020-09-21T20:31:55.226Z] testRepositoryViewStartFinishEnablement(org.eclipse.egit.ui.gitflow.CommandEnablementTest)  Time elapsed: 1.009 s
16:31:55 [2020-09-21T20:31:55.226Z] Running org.eclipse.egit.ui.gitflow.FeatureFinishKeepBranchHandlerTest
16:31:55 [2020-09-21T20:31:55.790Z] 
16:31:55 [2020-09-21T20:31:55.790Z] (SWT:1616): Gtk-CRITICAL **: 20:31:55.770: gtk_box_gadget_distribute: assertion 'size >= 0' failed in GtkScrollbar
16:31:55 [2020-09-21T20:31:55.790Z] 
16:31:55 [2020-09-21T20:31:55.790Z] (SWT:1616): Gtk-CRITICAL **: 20:31:55.788: gtk_box_gadget_distribute: assertion 'size >= 0' failed in GtkScrollbar
16:31:56 [2020-09-21T20:31:56.047Z] 
16:31:56 [2020-09-21T20:31:56.047Z] (SWT:1616): Gtk-CRITICAL **: 20:31:55.801: gtk_box_gadget_distribute: assertion 'size >= 0' failed in GtkScrollbar
16:31:56 [2020-09-21T20:31:56.047Z] 
16:31:56 [2020-09-21T20:31:56.047Z] (SWT:1616): Gtk-CRITICAL **: 20:31:55.817: gtk_box_gadget_distribute: assertion 'size >= 0' failed in GtkScrollbar
16:31:56 [2020-09-21T20:31:56.047Z] 
16:31:56 [2020-09-21T20:31:56.047Z] (SWT:1616): Gtk-CRITICAL **: 20:31:55.835: gtk_box_gadget_distribute: assertion 'size >= 0' failed in GtkScrollbar
16:31:56 [2020-09-21T20:31:56.047Z] 
16:31:56 [2020-09-21T20:31:56.047Z] (SWT:1616): Gtk-CRITICAL **: 20:31:55.851: gtk_box_gadget_distribute: assertion 'size >= 0' failed in GtkScrollbar
16:31:56 [2020-09-21T20:31:56.047Z] 
16:31:56 [2020-09-21T20:31:56.047Z] (SWT:1616): Gtk-CRITICAL **: 20:31:55.868: gtk_box_gadget_distribute: assertion 'size >= 0' failed in GtkScrollbar
16:31:56 [2020-09-21T20:31:56.047Z] 
16:31:56 [2020-09-21T20:31:56.047Z] (SWT:1616): Gtk-CRITICAL **: 20:31:55.884: gtk_box_gadget_distribute: assertion 'size >= 0' failed in GtkScrollbar
16:31:56 [2020-09-21T20:31:56.047Z] 
16:31:56 [2020-09-21T20:31:56.047Z] (SWT:1616): Gtk-CRITICAL **: 20:31:55.901: gtk_box_gadget_distribute: assertion 'size >= 0' failed in GtkScrollbar
16:31:56 [2020-09-21T20:31:56.047Z] 
16:31:56 [2020-09-21T20:31:56.047Z] (SWT:1616): Gtk-CRITICAL **: 20:31:55.918: gtk_box_gadget_distribute: assertion 'size >= 0' failed in GtkScrollbar
16:31:56 [2020-09-21T20:31:56.047Z] 
16:31:56 [2020-09-21T20:31:56.047Z] (SWT:1616): Gtk-CRITICAL **: 20:31:55.934: gtk_box_gadget_distribute: assertion 'size >= 0' failed in GtkScrollbar
16:31:56 [2020-09-21T20:31:56.047Z] 
16:31:56 [2020-09-21T20:31:56.047Z] (SWT:1616): Gtk-CRITICAL **: 20:31:55.951: gtk_box_gadget_distribute: assertion 'size >= 0' failed in GtkScrollbar
16:31:56 [2020-09-21T20:31:56.047Z] 
16:31:56 [2020-09-21T20:31:56.047Z] (SWT:1616): Gtk-CRITICAL **: 20:31:55.967: gtk_box_gadget_distribute: assertion 'size >= 0' failed in GtkScrollbar
16:31:56 [2020-09-21T20:31:56.047Z] 
16:31:56 [2020-09-21T20:31:56.047Z] (SWT:1616): Gtk-CRITICAL **: 20:31:55.985: gtk_box_gadget_distribute: assertion 'size >= 0' failed in GtkScrollbar
16:31:56 [2020-09-21T20:31:56.047Z] 
16:31:56 [2020-09-21T20:31:56.047Z] (SWT:1616): Gtk-CRITICAL **: 20:31:56.001: gtk_box_gadget_distribute: assertion 'size >= 0' failed in GtkScrollbar
16:31:56 [2020-09-21T20:31:56.047Z] 
16:31:56 [2020-09-21T20:31:56.047Z] (SWT:1616): Gtk-CRITICAL **: 20:31:56.017: gtk_box_gadget_distribute: assertion 'size >= 0' failed in GtkScrollbar
16:31:56 [2020-09-21T20:31:56.611Z] 
16:31:56 [2020-09-21T20:31:56.611Z] (SWT:1616): Gtk-CRITICAL **: 20:31:56.530: gtk_box_gadget_distribute: assertion 'size >= 0' failed in GtkScrollbar
16:31:57 [2020-09-21T20:31:57.543Z] Tests run: 1, Failures: 0, Errors: 0, Skipped: 0, Time elapsed: 2.126 s - in org.eclipse.egit.ui.gitflow.FeatureFinishKeepBranchHandlerTest
16:31:57 [2020-09-21T20:31:57.543Z] testFeatureFinishKeepBranch(org.eclipse.egit.ui.gitflow.FeatureFinishKeepBranchHandlerTest)  Time elapsed: 2.122 s
16:31:57 [2020-09-21T20:31:57.543Z] Running org.eclipse.egit.ui.wizards.share.SharingWizardTest
16:31:57 [2020-09-21T20:31:57.543Z] 
16:31:57 [2020-09-21T20:31:57.543Z] (SWT:1616): Gtk-CRITICAL **: 20:31:57.346: gtk_box_gadget_distribute: assertion 'size >= 0' failed in GtkScrollbar
16:31:57 [2020-09-21T20:31:57.543Z] 
16:31:57 [2020-09-21T20:31:57.543Z] (SWT:1616): Gtk-WARNING **: 20:31:57.346: Negative content width -13 (allocation 5, extents 9x9) while allocating gadget (node entry, owner GtkEntry)
16:31:57 [2020-09-21T20:31:57.543Z] 
16:31:57 [2020-09-21T20:31:57.543Z] (SWT:1616): Gtk-WARNING **: 20:31:57.346: Negative content height -1 (allocation 1, extents 1x1) while allocating gadget (node scrolledwindow, owner GtkScrolledWindow)
16:31:57 [2020-09-21T20:31:57.543Z] 
16:31:57 [2020-09-21T20:31:57.543Z] (SWT:1616): Gtk-CRITICAL **: 20:31:57.347: gtk_box_gadget_distribute: assertion 'size >= 0' failed in GtkScrollbar
16:31:57 [2020-09-21T20:31:57.543Z] 
16:31:57 [2020-09-21T20:31:57.543Z] (SWT:1616): Gtk-CRITICAL **: 20:31:57.347: gtk_box_gadget_distribute: assertion 'size >= 0' failed in GtkScrollbar
16:31:58 [2020-09-21T20:31:58.108Z] 
16:31:58 [2020-09-21T20:31:58.108Z] (SWT:1616): Gtk-CRITICAL **: 20:31:57.937: gtk_box_gadget_distribute: assertion 'size >= 0' failed in GtkScrollbar
16:31:58 [2020-09-21T20:31:58.108Z] 
16:31:58 [2020-09-21T20:31:58.108Z] (SWT:1616): Gtk-WARNING **: 20:31:57.937: Negative content width -13 (allocation 5, extents 9x9) while allocating gadget (node entry, owner GtkEntry)
16:31:58 [2020-09-21T20:31:58.108Z] 
16:31:58 [2020-09-21T20:31:58.108Z] (SWT:1616): Gtk-WARNING **: 20:31:57.937: Negative content height -1 (allocation 1, extents 1x1) while allocating gadget (node scrolledwindow, owner GtkScrolledWindow)
16:31:58 [2020-09-21T20:31:58.108Z] 
16:31:58 [2020-09-21T20:31:58.108Z] (SWT:1616): Gtk-CRITICAL **: 20:31:57.937: gtk_box_gadget_distribute: assertion 'size >= 0' failed in GtkScrollbar
16:31:58 [2020-09-21T20:31:58.108Z] 
16:31:58 [2020-09-21T20:31:58.108Z] (SWT:1616): Gtk-CRITICAL **: 20:31:57.937: gtk_box_gadget_distribute: assertion 'size >= 0' failed in GtkScrollbar
16:31:58 [2020-09-21T20:31:58.673Z] 
16:31:58 [2020-09-21T20:31:58.673Z] (SWT:1616): Gtk-CRITICAL **: 20:31:58.517: gtk_box_gadget_distribute: assertion 'size >= 0' failed in GtkScrollbar
16:31:58 [2020-09-21T20:31:58.673Z] 
16:31:58 [2020-09-21T20:31:58.673Z] (SWT:1616): Gtk-WARNING **: 20:31:58.518: Negative content width -13 (allocation 5, extents 9x9) while allocating gadget (node entry, owner GtkEntry)
16:31:58 [2020-09-21T20:31:58.673Z] 
16:31:58 [2020-09-21T20:31:58.673Z] (SWT:1616): Gtk-WARNING **: 20:31:58.518: Negative content height -1 (allocation 1, extents 1x1) while allocating gadget (node scrolledwindow, owner GtkScrolledWindow)
16:31:58 [2020-09-21T20:31:58.673Z] 
16:31:58 [2020-09-21T20:31:58.673Z] (SWT:1616): Gtk-CRITICAL **: 20:31:58.518: gtk_box_gadget_distribute: assertion 'size >= 0' failed in GtkScrollbar
16:31:58 [2020-09-21T20:31:58.673Z] 
16:31:58 [2020-09-21T20:31:58.673Z] (SWT:1616): Gtk-CRITICAL **: 20:31:58.518: gtk_box_gadget_distribute: assertion 'size >= 0' failed in GtkScrollbar
16:31:59 [2020-09-21T20:31:59.238Z] 
16:31:59 [2020-09-21T20:31:59.238Z] (SWT:1616): Gtk-CRITICAL **: 20:31:59.100: gtk_box_gadget_distribute: assertion 'size >= 0' failed in GtkScrollbar
16:31:59 [2020-09-21T20:31:59.238Z] 
16:31:59 [2020-09-21T20:31:59.238Z] (SWT:1616): Gtk-WARNING **: 20:31:59.101: Negative content width -13 (allocation 5, extents 9x9) while allocating gadget (node entry, owner GtkEntry)
16:31:59 [2020-09-21T20:31:59.238Z] 
16:31:59 [2020-09-21T20:31:59.238Z] (SWT:1616): Gtk-WARNING **: 20:31:59.101: Negative content height -1 (allocation 1, extents 1x1) while allocating gadget (node scrolledwindow, owner GtkScrolledWindow)
16:31:59 [2020-09-21T20:31:59.238Z] 
16:31:59 [2020-09-21T20:31:59.238Z] (SWT:1616): Gtk-CRITICAL **: 20:31:59.101: gtk_box_gadget_distribute: assertion 'size >= 0' failed in GtkScrollbar
16:31:59 [2020-09-21T20:31:59.238Z] 
16:31:59 [2020-09-21T20:31:59.238Z] (SWT:1616): Gtk-CRITICAL **: 20:31:59.101: gtk_box_gadget_distribute: assertion 'size >= 0' failed in GtkScrollbar
16:32:00 [2020-09-21T20:32:00.609Z] 
16:32:00 [2020-09-21T20:32:00.609Z] (SWT:1616): Gtk-CRITICAL **: 20:32:00.503: gtk_box_gadget_distribute: assertion 'size >= 0' failed in GtkScrollbar
16:32:00 [2020-09-21T20:32:00.609Z] 
16:32:00 [2020-09-21T20:32:00.609Z] (SWT:1616): Gtk-WARNING **: 20:32:00.503: Negative content width -13 (allocation 5, extents 9x9) while allocating gadget (node entry, owner GtkEntry)
16:32:00 [2020-09-21T20:32:00.609Z] 
16:32:00 [2020-09-21T20:32:00.609Z] (SWT:1616): Gtk-WARNING **: 20:32:00.504: Negative content height -1 (allocation 1, extents 1x1) while allocating gadget (node scrolledwindow, owner GtkScrolledWindow)
16:32:00 [2020-09-21T20:32:00.609Z] 
16:32:00 [2020-09-21T20:32:00.609Z] (SWT:1616): Gtk-CRITICAL **: 20:32:00.504: gtk_box_gadget_distribute: assertion 'size >= 0' failed in GtkScrollbar
16:32:00 [2020-09-21T20:32:00.609Z] 
16:32:00 [2020-09-21T20:32:00.609Z] (SWT:1616): Gtk-CRITICAL **: 20:32:00.504: gtk_box_gadget_distribute: assertion 'size >= 0' failed in GtkScrollbar
16:32:01 [2020-09-21T20:32:01.174Z] 
16:32:01 [2020-09-21T20:32:01.174Z] (SWT:1616): Gtk-CRITICAL **: 20:32:01.086: gtk_box_gadget_distribute: assertion 'size >= 0' failed in GtkScrollbar
16:32:01 [2020-09-21T20:32:01.174Z] 
16:32:01 [2020-09-21T20:32:01.174Z] (SWT:1616): Gtk-WARNING **: 20:32:01.087: Negative content width -13 (allocation 5, extents 9x9) while allocating gadget (node entry, owner GtkEntry)
16:32:01 [2020-09-21T20:32:01.174Z] 
16:32:01 [2020-09-21T20:32:01.174Z] (SWT:1616): Gtk-WARNING **: 20:32:01.087: Negative content height -1 (allocation 1, extents 1x1) while allocating gadget (node scrolledwindow, owner GtkScrolledWindow)
16:32:01 [2020-09-21T20:32:01.174Z] 
16:32:01 [2020-09-21T20:32:01.174Z] (SWT:1616): Gtk-CRITICAL **: 20:32:01.087: gtk_box_gadget_distribute: assertion 'size >= 0' failed in GtkScrollbar
16:32:01 [2020-09-21T20:32:01.174Z] 
16:32:01 [2020-09-21T20:32:01.174Z] (SWT:1616): Gtk-CRITICAL **: 20:32:01.087: gtk_box_gadget_distribute: assertion 'size >= 0' failed in GtkScrollbar
16:32:01 [2020-09-21T20:32:01.739Z] 
16:32:01 [2020-09-21T20:32:01.739Z] (SWT:1616): Gtk-CRITICAL **: 20:32:01.671: gtk_box_gadget_distribute: assertion 'size >= 0' failed in GtkScrollbar
16:32:01 [2020-09-21T20:32:01.739Z] 
16:32:01 [2020-09-21T20:32:01.739Z] (SWT:1616): Gtk-WARNING **: 20:32:01.672: Negative content width -13 (allocation 5, extents 9x9) while allocating gadget (node entry, owner GtkEntry)
16:32:01 [2020-09-21T20:32:01.739Z] 
16:32:01 [2020-09-21T20:32:01.739Z] (SWT:1616): Gtk-WARNING **: 20:32:01.672: Negative content height -1 (allocation 1, extents 1x1) while allocating gadget (node scrolledwindow, owner GtkScrolledWindow)
16:32:01 [2020-09-21T20:32:01.739Z] 
16:32:01 [2020-09-21T20:32:01.739Z] (SWT:1616): Gtk-CRITICAL **: 20:32:01.672: gtk_box_gadget_distribute: assertion 'size >= 0' failed in GtkScrollbar
16:32:01 [2020-09-21T20:32:01.739Z] 
16:32:01 [2020-09-21T20:32:01.739Z] (SWT:1616): Gtk-CRITICAL **: 20:32:01.672: gtk_box_gadget_distribute: assertion 'size >= 0' failed in GtkScrollbar
16:32:03 [2020-09-21T20:32:03.111Z] 
16:32:03 [2020-09-21T20:32:03.111Z] (SWT:1616): Gtk-CRITICAL **: 20:32:02.834: gtk_box_gadget_distribute: assertion 'size >= 0' failed in GtkScrollbar
16:32:03 [2020-09-21T20:32:03.112Z] 
16:32:03 [2020-09-21T20:32:03.112Z] (SWT:1616): Gtk-WARNING **: 20:32:02.835: Negative content width -13 (allocation 5, extents 9x9) while allocating gadget (node entry, owner GtkEntry)
16:32:03 [2020-09-21T20:32:03.112Z] 
16:32:03 [2020-09-21T20:32:03.112Z] (SWT:1616): Gtk-WARNING **: 20:32:02.835: Negative content height -1 (allocation 1, extents 1x1) while allocating gadget (node scrolledwindow, owner GtkScrolledWindow)
16:32:03 [2020-09-21T20:32:03.112Z] 
16:32:03 [2020-09-21T20:32:03.112Z] (SWT:1616): Gtk-CRITICAL **: 20:32:02.835: gtk_box_gadget_distribute: assertion 'size >= 0' failed in GtkScrollbar
16:32:03 [2020-09-21T20:32:03.112Z] 
16:32:03 [2020-09-21T20:32:03.112Z] (SWT:1616): Gtk-CRITICAL **: 20:32:02.835: gtk_box_gadget_distribute: assertion 'size >= 0' failed in GtkScrollbar
16:32:04 [2020-09-21T20:32:04.496Z] Tests run: 3, Failures: 0, Errors: 0, Skipped: 0, Time elapsed: 6.857 s - in org.eclipse.egit.ui.wizards.share.SharingWizardTest
16:32:04 [2020-09-21T20:32:04.496Z] shareProjectWithExternalRepo(org.eclipse.egit.ui.wizards.share.SharingWizardTest)  Time elapsed: 3.159 s
16:32:04 [2020-09-21T20:32:04.496Z] shareProjectWithAlreadyCreatedRepos(org.eclipse.egit.ui.wizards.share.SharingWizardTest)  Time elapsed: 2.332 s
16:32:04 [2020-09-21T20:32:04.496Z] shareProjectAndCreateRepo(org.eclipse.egit.ui.wizards.share.SharingWizardTest)  Time elapsed: 1.364 s
16:32:04 [2020-09-21T20:32:04.496Z] Running org.eclipse.egit.ui.wizards.clone.GitCloneSourceProviderExtensionTest
16:32:04 [2020-09-21T20:32:04.496Z] Tests run: 1, Failures: 0, Errors: 0, Skipped: 0, Time elapsed: 0.001 s - in org.eclipse.egit.ui.wizards.clone.GitCloneSourceProviderExtensionTest
16:32:04 [2020-09-21T20:32:04.496Z] testGetRepositoryImports(org.eclipse.egit.ui.wizards.clone.GitCloneSourceProviderExtensionTest)  Time elapsed: 0 s
16:32:04 [2020-09-21T20:32:04.496Z] Running org.eclipse.egit.ui.wizards.clone.GitCloneWizardHttpTest
16:32:04 [2020-09-21T20:32:04.496Z] 2020-09-21 20:32:04.467:INFO::WorkbenchTestable: Logging initialized @704059ms to org.eclipse.jetty.util.log.StdErrLog
16:32:04 [2020-09-21T20:32:04.753Z] 2020-09-21 20:32:04.549:INFO:oejs.Server:WorkbenchTestable: jetty-9.4.30.v20200611; built: 2020-06-16T05:54:33.713Z; git: 271836e4c1f4612f12b7bb13ef5a92a927634b0d; jvm 1.8.0_262-b10
16:32:04 [2020-09-21T20:32:04.753Z] 2020-09-21 20:32:04.590:INFO:oejsh.ContextHandler:WorkbenchTestable: Started o.e.j.s.ServletContextHandler@225d9f9f{/sbasic,null,AVAILABLE}
16:32:04 [2020-09-21T20:32:04.754Z] 2020-09-21 20:32:04.646:INFO:oejs.AbstractConnector:WorkbenchTestable: Started ServerConnector@2e95d3c0{HTTP/1.1, (http/1.1)}{127.0.0.1:37136}
16:32:04 [2020-09-21T20:32:04.754Z] 2020-09-21 20:32:04.647:INFO:oejs.Server:WorkbenchTestable: Started @704239ms
16:32:07 [2020-09-21T20:32:07.278Z] 2020-09-21 20:32:06.694:INFO:oejs.AbstractConnector:WorkbenchTestable: Stopped ServerConnector@2e95d3c0{HTTP/1.1, (http/1.1)}{127.0.0.1:0}
16:32:07 [2020-09-21T20:32:07.278Z] 2020-09-21 20:32:06.696:INFO:oejsh.ContextHandler:WorkbenchTestable: Stopped o.e.j.s.ServletContextHandler@225d9f9f{/sbasic,null,UNAVAILABLE}
16:32:07 [2020-09-21T20:32:07.278Z] Tests run: 1, Failures: 0, Errors: 0, Skipped: 0, Time elapsed: 2.529 s - in org.eclipse.egit.ui.wizards.clone.GitCloneWizardHttpTest
16:32:07 [2020-09-21T20:32:07.278Z] canCloneARemoteRepo(org.eclipse.egit.ui.wizards.clone.GitCloneWizardHttpTest)  Time elapsed: 2.044 s
16:32:07 [2020-09-21T20:32:07.278Z] Running org.eclipse.egit.ui.wizards.clone.GitCloneWizardHttpsTest
16:32:07 [2020-09-21T20:32:07.536Z] 2020-09-21 20:32:07.323:INFO:oejs.Server:WorkbenchTestable: jetty-9.4.30.v20200611; built: 2020-06-16T05:54:33.713Z; git: 271836e4c1f4612f12b7bb13ef5a92a927634b0d; jvm 1.8.0_262-b10
16:32:07 [2020-09-21T20:32:07.536Z] 2020-09-21 20:32:07.324:INFO:oejsh.ContextHandler:WorkbenchTestable: Started o.e.j.s.ServletContextHandler@7b5580ad{/sbasic,null,AVAILABLE}
16:32:07 [2020-09-21T20:32:07.536Z] 2020-09-21 20:32:07.330:INFO:oejs.AbstractConnector:WorkbenchTestable: Started ServerConnector@39940aba{HTTP/1.1, (http/1.1)}{127.0.0.1:35658}
16:32:07 [2020-09-21T20:32:07.536Z] 2020-09-21 20:32:07.333:INFO:oejus.SslContextFactory:WorkbenchTestable: x509=X509@136cd16b(centos-7-s1jb9,h=[],w=[]) for Client@5fdf8c61[provider=null,keyStore=file:///tmp/jks6112499064450074428/keystore.jks,trustStore=file:///tmp/jks6112499064450074428/keystore.jks]
16:32:07 [2020-09-21T20:32:07.536Z] 2020-09-21 20:32:07.354:WARN:oejusS.config:WorkbenchTestable: Trusting all certificates configured for Client@5fdf8c61[provider=null,keyStore=file:///tmp/jks6112499064450074428/keystore.jks,trustStore=file:///tmp/jks6112499064450074428/keystore.jks]
16:32:07 [2020-09-21T20:32:07.536Z] 2020-09-21 20:32:07.354:WARN:oejusS.config:WorkbenchTestable: No Client EndPointIdentificationAlgorithm configured for Client@5fdf8c61[provider=null,keyStore=file:///tmp/jks6112499064450074428/keystore.jks,trustStore=file:///tmp/jks6112499064450074428/keystore.jks]
16:32:07 [2020-09-21T20:32:07.536Z] 2020-09-21 20:32:07.362:INFO:oejs.AbstractConnector:WorkbenchTestable: Started ServerConnector@6d32c6a9{SSL, (ssl, http/1.1)}{127.0.0.1:39885}
16:32:07 [2020-09-21T20:32:07.536Z] 2020-09-21 20:32:07.362:INFO:oejs.Server:WorkbenchTestable: Started @706955ms
16:32:10 [2020-09-21T20:32:10.061Z] 2020-09-21 20:32:09.728:INFO:oejs.AbstractConnector:WorkbenchTestable: Stopped ServerConnector@39940aba{HTTP/1.1, (http/1.1)}{127.0.0.1:0}
16:32:10 [2020-09-21T20:32:10.061Z] 2020-09-21 20:32:09.729:INFO:oejs.AbstractConnector:WorkbenchTestable: Stopped ServerConnector@6d32c6a9{SSL, (ssl, http/1.1)}{127.0.0.1:0}
16:32:10 [2020-09-21T20:32:10.061Z] 2020-09-21 20:32:09.729:INFO:oejsh.ContextHandler:WorkbenchTestable: Stopped o.e.j.s.ServletContextHandler@7b5580ad{/sbasic,null,UNAVAILABLE}
16:32:10 [2020-09-21T20:32:10.061Z] Tests run: 1, Failures: 0, Errors: 0, Skipped: 0, Time elapsed: 3.03 s - in org.eclipse.egit.ui.wizards.clone.GitCloneWizardHttpsTest
16:32:10 [2020-09-21T20:32:10.061Z] canCloneARemoteRepo(org.eclipse.egit.ui.wizards.clone.GitCloneWizardHttpsTest)  Time elapsed: 2.366 s
16:32:10 [2020-09-21T20:32:10.061Z] Running org.eclipse.egit.ui.wizards.clone.GitCloneWizardTest
16:32:16 [2020-09-21T20:32:16.611Z] Tests run: 10, Failures: 0, Errors: 0, Skipped: 2, Time elapsed: 6.3 s - in org.eclipse.egit.ui.wizards.clone.GitCloneWizardTest
16:32:16 [2020-09-21T20:32:16.611Z] canCloneARemoteRepo(org.eclipse.egit.ui.wizards.clone.GitCloneWizardTest)  Time elapsed: 1.033 s
16:32:16 [2020-09-21T20:32:16.611Z] invalidPortFreezesDialog(org.eclipse.egit.ui.wizards.clone.GitCloneWizardTest) skipped
16:32:16 [2020-09-21T20:32:16.611Z] updatesParameterFieldsInImportDialogWhenURIIsUpdated(org.eclipse.egit.ui.wizards.clone.GitCloneWizardTest)  Time elapsed: 0.605 s
16:32:16 [2020-09-21T20:32:16.611Z] clonedRepositoryShouldExistOnFileSystem(org.eclipse.egit.ui.wizards.clone.GitCloneWizardTest)  Time elapsed: 1.299 s
16:32:16 [2020-09-21T20:32:16.611Z] alteringSomeParametersDuringClone(org.eclipse.egit.ui.wizards.clone.GitCloneWizardTest)  Time elapsed: 1.345 s
16:32:16 [2020-09-21T20:32:16.611Z] gitStyleUriSelectsSshProtocol(org.eclipse.egit.ui.wizards.clone.GitCloneWizardTest)  Time elapsed: 0.232 s
16:32:16 [2020-09-21T20:32:16.611Z] invalidHostnameFreezesDialog(org.eclipse.egit.ui.wizards.clone.GitCloneWizardTest) skipped
16:32:16 [2020-09-21T20:32:16.611Z] acceptCloneCommandAsURI(org.eclipse.egit.ui.wizards.clone.GitCloneWizardTest)  Time elapsed: 0.276 s
16:32:16 [2020-09-21T20:32:16.611Z] cloneWithTagOption(org.eclipse.egit.ui.wizards.clone.GitCloneWizardTest)  Time elapsed: 0.996 s
16:32:16 [2020-09-21T20:32:16.611Z] testFileURIWithSpace(org.eclipse.egit.ui.wizards.clone.GitCloneWizardTest)  Time elapsed: 0.245 s
16:32:16 [2020-09-21T20:32:16.611Z] Running org.eclipse.egit.ui.wizards.pull.PullWizardTest
16:32:16 [2020-09-21T20:32:16.889Z] 
16:32:16 [2020-09-21T20:32:16.889Z] (SWT:1616): Gtk-WARNING **: 20:32:16.732: Negative content width -6 (allocation 1, extents 4x3) while allocating gadget (node toolbar, owner GtkToolbar)
16:32:18 [2020-09-21T20:32:18.786Z] 
16:32:18 [2020-09-21T20:32:18.786Z] (SWT:1616): Gtk-WARNING **: 20:32:18.475: Negative content width -6 (allocation 1, extents 4x3) while allocating gadget (node toolbar, owner GtkToolbar)
16:32:18 [2020-09-21T20:32:18.786Z] Tests run: 1, Failures: 0, Errors: 0, Skipped: 0, Time elapsed: 2.549 s - in org.eclipse.egit.ui.wizards.pull.PullWizardTest
16:32:18 [2020-09-21T20:32:18.787Z] pullFromProjectRepo(org.eclipse.egit.ui.wizards.pull.PullWizardTest)  Time elapsed: 2.545 s
16:32:18 [2020-09-21T20:32:18.787Z] Running org.eclipse.egit.ui.search.CommitSearchQueryTest
16:32:22 [2020-09-21T20:32:22.966Z] Tests run: 7, Failures: 0, Errors: 0, Skipped: 0, Time elapsed: 4.005 s - in org.eclipse.egit.ui.search.CommitSearchQueryTest
16:32:22 [2020-09-21T20:32:22.966Z] testQuery(org.eclipse.egit.ui.search.CommitSearchQueryTest)  Time elapsed: 0.545 s
16:32:22 [2020-09-21T20:32:22.966Z] testMatchMessage(org.eclipse.egit.ui.search.CommitSearchQueryTest)  Time elapsed: 0.542 s
16:32:22 [2020-09-21T20:32:22.966Z] testCaseInsensitive(org.eclipse.egit.ui.search.CommitSearchQueryTest)  Time elapsed: 0.544 s
16:32:22 [2020-09-21T20:32:22.966Z] testMatchCommit(org.eclipse.egit.ui.search.CommitSearchQueryTest)  Time elapsed: 0.66 s
16:32:22 [2020-09-21T20:32:22.966Z] testMatchParent(org.eclipse.egit.ui.search.CommitSearchQueryTest)  Time elapsed: 0.541 s
16:32:22 [2020-09-21T20:32:22.966Z] testMatchTree(org.eclipse.egit.ui.search.CommitSearchQueryTest)  Time elapsed: 0.575 s
16:32:22 [2020-09-21T20:32:22.966Z] testEmptyMatches(org.eclipse.egit.ui.search.CommitSearchQueryTest)  Time elapsed: 0.556 s
16:32:22 [2020-09-21T20:32:22.966Z] Running org.eclipse.egit.ui.search.CommitSearchDialogTest
16:32:23 [2020-09-21T20:32:23.532Z] 
16:32:23 [2020-09-21T20:32:23.532Z] (SWT:1616): Gtk-WARNING **: 20:32:23.243: Negative content width -6 (allocation 1, extents 4x3) while allocating gadget (node toolbar, owner GtkToolbar)
16:32:23 [2020-09-21T20:32:23.532Z] 
16:32:23 [2020-09-21T20:32:23.532Z] (SWT:1616): Gtk-WARNING **: 20:32:23.255: Negative content width -6 (allocation 1, extents 4x3) while allocating gadget (node toolbar, owner GtkToolbar)
16:32:23 [2020-09-21T20:32:23.532Z] 
16:32:23 [2020-09-21T20:32:23.532Z] (SWT:1616): Gtk-WARNING **: 20:32:23.307: Negative content width -6 (allocation 1, extents 4x3) while allocating gadget (node toolbar, owner GtkToolbar)
16:32:23 [2020-09-21T20:32:23.532Z] 
16:32:23 [2020-09-21T20:32:23.532Z] (SWT:1616): Gtk-WARNING **: 20:32:23.345: Negative content width -6 (allocation 1, extents 4x3) while allocating gadget (node toolbar, owner GtkToolbar)
16:32:24 [2020-09-21T20:32:24.096Z] 
16:32:24 [2020-09-21T20:32:24.097Z] (SWT:1616): Gtk-WARNING **: 20:32:23.985: Negative content width -6 (allocation 1, extents 4x3) while allocating gadget (node toolbar, owner GtkToolbar)
16:32:24 [2020-09-21T20:32:24.097Z] Tests run: 1, Failures: 0, Errors: 0, Skipped: 0, Time elapsed: 1.488 s - in org.eclipse.egit.ui.search.CommitSearchDialogTest
16:32:24 [2020-09-21T20:32:24.097Z] openCommitTabOnSearchDialog(org.eclipse.egit.ui.search.CommitSearchDialogTest)  Time elapsed: 1.485 s
16:32:24 [2020-09-21T20:32:24.097Z] Running org.eclipse.egit.ui.prefpages.configuration.GlobalConfigurationPageTest
16:32:24 [2020-09-21T20:32:24.354Z] 
16:32:24 [2020-09-21T20:32:24.354Z] !ENTRY org.eclipse.ui 2 2 2020-09-21 20:32:24.108
16:32:24 [2020-09-21T20:32:24.354Z] !MESSAGE Invalid preference category path: org.eclipse.ui.net.NetPreferences (bundle: org.eclipse.jsch.ui, page: org.eclipse.jsch.ui.SSHPreferences)
16:32:24 [2020-09-21T20:32:24.354Z] 
16:32:24 [2020-09-21T20:32:24.354Z] (SWT:1616): Gtk-WARNING **: 20:32:24.118: Negative content width -13 (allocation 5, extents 9x9) while allocating gadget (node entry, owner GtkEntry)
16:32:24 [2020-09-21T20:32:24.354Z] 
16:32:24 [2020-09-21T20:32:24.354Z] (SWT:1616): Gtk-WARNING **: 20:32:24.266: Negative content width -13 (allocation 5, extents 9x9) while allocating gadget (node entry, owner GtkEntry)
16:32:24 [2020-09-21T20:32:24.612Z] 
16:32:24 [2020-09-21T20:32:24.612Z] (SWT:1616): Gtk-WARNING **: 20:32:24.403: Negative content width -13 (allocation 5, extents 9x9) while allocating gadget (node entry, owner GtkEntry)
16:32:24 [2020-09-21T20:32:24.612Z] 
16:32:24 [2020-09-21T20:32:24.612Z] (SWT:1616): Gtk-WARNING **: 20:32:24.515: Negative content width -13 (allocation 5, extents 9x9) while allocating gadget (node entry, owner GtkEntry)
16:32:24 [2020-09-21T20:32:24.612Z] 
16:32:24 [2020-09-21T20:32:24.612Z] (SWT:1616): Gtk-WARNING **: 20:32:24.588: Negative content width -13 (allocation 5, extents 9x9) while allocating gadget (node entry, owner GtkEntry)
16:32:24 [2020-09-21T20:32:24.869Z] 
16:32:24 [2020-09-21T20:32:24.869Z] (SWT:1616): Gtk-WARNING **: 20:32:24.673: Negative content width -13 (allocation 5, extents 9x9) while allocating gadget (node entry, owner GtkEntry)
16:32:24 [2020-09-21T20:32:24.869Z] 
16:32:24 [2020-09-21T20:32:24.869Z] (SWT:1616): Gtk-WARNING **: 20:32:24.784: Negative content width -13 (allocation 5, extents 9x9) while allocating gadget (node entry, owner GtkEntry)
16:32:24 [2020-09-21T20:32:24.869Z] 
16:32:24 [2020-09-21T20:32:24.869Z] (SWT:1616): Gtk-WARNING **: 20:32:24.832: Negative content width -6 (allocation 1, extents 4x3) while allocating gadget (node toolbar, owner GtkToolbar)
16:32:24 [2020-09-21T20:32:24.869Z] 
16:32:24 [2020-09-21T20:32:24.869Z] (SWT:1616): Gtk-WARNING **: 20:32:24.832: Negative content height -3 (allocation 1, extents 2x2) while allocating gadget (node toolbar, owner GtkToolbar)
16:32:24 [2020-09-21T20:32:24.869Z] 
16:32:24 [2020-09-21T20:32:24.869Z] (SWT:1616): Gtk-WARNING **: 20:32:24.832: Negative content width -6 (allocation 1, extents 4x3) while allocating gadget (node toolbar, owner GtkToolbar)
16:32:24 [2020-09-21T20:32:24.870Z] 
16:32:24 [2020-09-21T20:32:24.870Z] (SWT:1616): Gtk-WARNING **: 20:32:24.832: Negative content height -3 (allocation 1, extents 2x2) while allocating gadget (node toolbar, owner GtkToolbar)
16:32:25 [2020-09-21T20:32:25.127Z] 
16:32:25 [2020-09-21T20:32:25.127Z] (SWT:1616): Gtk-WARNING **: 20:32:24.945: Negative content width -13 (allocation 5, extents 9x9) while allocating gadget (node entry, owner GtkEntry)
16:32:25 [2020-09-21T20:32:25.127Z] 
16:32:25 [2020-09-21T20:32:25.127Z] (SWT:1616): Gtk-WARNING **: 20:32:25.071: Negative content width -13 (allocation 5, extents 9x9) while allocating gadget (node entry, owner GtkEntry)
16:32:25 [2020-09-21T20:32:25.385Z] 
16:32:25 [2020-09-21T20:32:25.385Z] (SWT:1616): Gtk-WARNING **: 20:32:25.234: Negative content width -13 (allocation 5, extents 9x9) while allocating gadget (node entry, owner GtkEntry)
16:32:25 [2020-09-21T20:32:25.385Z] 
16:32:25 [2020-09-21T20:32:25.385Z] (SWT:1616): Gtk-WARNING **: 20:32:25.346: Negative content width -13 (allocation 5, extents 9x9) while allocating gadget (node entry, owner GtkEntry)
16:32:25 [2020-09-21T20:32:25.644Z] 
16:32:25 [2020-09-21T20:32:25.644Z] (SWT:1616): Gtk-WARNING **: 20:32:25.464: Negative content width -13 (allocation 5, extents 9x9) while allocating gadget (node entry, owner GtkEntry)
16:32:25 [2020-09-21T20:32:25.644Z] Tests run: 11, Failures: 0, Errors: 0, Skipped: 0, Time elapsed: 1.475 s - in org.eclipse.egit.ui.prefpages.configuration.GlobalConfigurationPageTest
16:32:25 [2020-09-21T20:32:25.644Z] testAddSubSectionEntry(org.eclipse.egit.ui.prefpages.configuration.GlobalConfigurationPageTest)  Time elapsed: 0.162 s
16:32:25 [2020-09-21T20:32:25.644Z] testAddSectionEntry(org.eclipse.egit.ui.prefpages.configuration.GlobalConfigurationPageTest)  Time elapsed: 0.138 s
16:32:25 [2020-09-21T20:32:25.644Z] testCanCreateSameEntryValue(org.eclipse.egit.ui.prefpages.configuration.GlobalConfigurationPageTest)  Time elapsed: 0.109 s
16:32:25 [2020-09-21T20:32:25.644Z] testNodes(org.eclipse.egit.ui.prefpages.configuration.GlobalConfigurationPageTest)  Time elapsed: 0.076 s
16:32:25 [2020-09-21T20:32:25.644Z] testRemoveValue(org.eclipse.egit.ui.prefpages.configuration.GlobalConfigurationPageTest)  Time elapsed: 0.086 s
16:32:25 [2020-09-21T20:32:25.644Z] testAddSubSectionEntryWithSuggestion(org.eclipse.egit.ui.prefpages.configuration.GlobalConfigurationPageTest)  Time elapsed: 0.111 s
16:32:25 [2020-09-21T20:32:25.644Z] testOpenEditor(org.eclipse.egit.ui.prefpages.configuration.GlobalConfigurationPageTest)  Time elapsed: 0.161 s
16:32:25 [2020-09-21T20:32:25.644Z] testSubsectionWithDot(org.eclipse.egit.ui.prefpages.configuration.GlobalConfigurationPageTest)  Time elapsed: 0.126 s
16:32:25 [2020-09-21T20:32:25.644Z] testChecksForKey(org.eclipse.egit.ui.prefpages.configuration.GlobalConfigurationPageTest)  Time elapsed: 0.162 s
16:32:25 [2020-09-21T20:32:25.644Z] testRemoveSubSection(org.eclipse.egit.ui.prefpages.configuration.GlobalConfigurationPageTest)  Time elapsed: 0.112 s
16:32:25 [2020-09-21T20:32:25.644Z] testRemoveSection(org.eclipse.egit.ui.prefpages.configuration.GlobalConfigurationPageTest)  Time elapsed: 0.118 s
16:32:25 [2020-09-21T20:32:25.644Z] Running org.eclipse.egit.ui.submodule.SubmoduleUpdateTest
16:32:26 [2020-09-21T20:32:26.577Z] 
16:32:26 [2020-09-21T20:32:26.577Z] (SWT:1616): Gtk-WARNING **: 20:32:26.299: Negative content width -6 (allocation 1, extents 4x3) while allocating gadget (node toolbar, owner GtkToolbar)
16:32:29 [2020-09-21T20:32:29.102Z] 
16:32:29 [2020-09-21T20:32:29.102Z] (SWT:1616): Gtk-WARNING **: 20:32:28.514: Negative content width -6 (allocation 1, extents 4x3) while allocating gadget (node toolbar, owner GtkToolbar)
16:32:29 [2020-09-21T20:32:29.102Z] Tests run: 1, Failures: 0, Errors: 0, Skipped: 0, Time elapsed: 3.044 s - in org.eclipse.egit.ui.submodule.SubmoduleUpdateTest
16:32:29 [2020-09-21T20:32:29.102Z] updateSubmodule(org.eclipse.egit.ui.submodule.SubmoduleUpdateTest)  Time elapsed: 3.04 s
16:32:29 [2020-09-21T20:32:29.102Z] Running org.eclipse.egit.ui.submodule.SubmoduleSyncTest
16:32:29 [2020-09-21T20:32:29.360Z] 
16:32:29 [2020-09-21T20:32:29.360Z] (SWT:1616): Gtk-WARNING **: 20:32:29.349: Negative content width -6 (allocation 1, extents 4x3) while allocating gadget (node toolbar, owner GtkToolbar)
16:32:31 [2020-09-21T20:32:31.887Z] 
16:32:31 [2020-09-21T20:32:31.887Z] (SWT:1616): Gtk-WARNING **: 20:32:31.703: Negative content width -6 (allocation 1, extents 4x3) while allocating gadget (node toolbar, owner GtkToolbar)
16:32:31 [2020-09-21T20:32:31.887Z] Tests run: 1, Failures: 0, Errors: 0, Skipped: 0, Time elapsed: 3.188 s - in org.eclipse.egit.ui.submodule.SubmoduleSyncTest
16:32:31 [2020-09-21T20:32:31.887Z] syncSubmodule(org.eclipse.egit.ui.submodule.SubmoduleSyncTest)  Time elapsed: 3.184 s
16:32:31 [2020-09-21T20:32:31.887Z] Running org.eclipse.egit.ui.submodule.SubmoduleAddTest
16:32:32 [2020-09-21T20:32:32.515Z] 
16:32:32 [2020-09-21T20:32:32.515Z] (SWT:1616): Gtk-WARNING **: 20:32:32.502: Negative content width -6 (allocation 1, extents 4x3) while allocating gadget (node toolbar, owner GtkToolbar)
16:32:35 [2020-09-21T20:32:35.040Z] 
16:32:35 [2020-09-21T20:32:35.040Z] (SWT:1616): Gtk-WARNING **: 20:32:34.966: Negative content width -6 (allocation 1, extents 4x3) while allocating gadget (node toolbar, owner GtkToolbar)
16:32:35 [2020-09-21T20:32:35.298Z] Tests run: 1, Failures: 0, Errors: 0, Skipped: 0, Time elapsed: 3.26 s - in org.eclipse.egit.ui.submodule.SubmoduleAddTest
16:32:35 [2020-09-21T20:32:35.298Z] addAtRoot(org.eclipse.egit.ui.submodule.SubmoduleAddTest)  Time elapsed: 3.256 s
16:32:35 [2020-09-21T20:32:35.298Z] Running org.eclipse.egit.ui.httpauth.PushTest
16:32:35 [2020-09-21T20:32:35.298Z] 2020-09-21 20:32:35.158:INFO:oejs.Server:WorkbenchTestable: jetty-9.4.30.v20200611; built: 2020-06-16T05:54:33.713Z; git: 271836e4c1f4612f12b7bb13ef5a92a927634b0d; jvm 1.8.0_262-b10
16:32:35 [2020-09-21T20:32:35.298Z] 2020-09-21 20:32:35.159:INFO:oejsh.ContextHandler:WorkbenchTestable: Started o.e.j.s.ServletContextHandler@6bb8fb9d{/sbasic,null,AVAILABLE}
16:32:35 [2020-09-21T20:32:35.298Z] 2020-09-21 20:32:35.165:INFO:oejs.AbstractConnector:WorkbenchTestable: Started ServerConnector@31d89cd{HTTP/1.1, (http/1.1)}{127.0.0.1:38639}
16:32:35 [2020-09-21T20:32:35.298Z] 2020-09-21 20:32:35.165:INFO:oejs.Server:WorkbenchTestable: Started @734757ms
16:32:36 [2020-09-21T20:32:36.230Z] 
16:32:36 [2020-09-21T20:32:36.230Z] (SWT:1616): Gtk-CRITICAL **: 20:32:36.013: gtk_box_gadget_distribute: assertion 'size >= 0' failed in GtkCheckButton
16:32:37 [2020-09-21T20:32:37.161Z] 2020-09-21 20:32:36.867:INFO:oejs.AbstractConnector:WorkbenchTestable: Stopped ServerConnector@31d89cd{HTTP/1.1, (http/1.1)}{127.0.0.1:0}
16:32:37 [2020-09-21T20:32:37.161Z] 2020-09-21 20:32:36.868:INFO:oejsh.ContextHandler:WorkbenchTestable: Stopped o.e.j.s.ServletContextHandler@6bb8fb9d{/sbasic,null,UNAVAILABLE}
16:32:37 [2020-09-21T20:32:37.161Z] Tests run: 1, Failures: 0, Errors: 0, Skipped: 0, Time elapsed: 1.795 s - in org.eclipse.egit.ui.httpauth.PushTest
16:32:37 [2020-09-21T20:32:37.161Z] testPush(org.eclipse.egit.ui.httpauth.PushTest)  Time elapsed: 1.795 s
16:32:37 [2020-09-21T20:32:37.161Z] Running org.eclipse.egit.ui.operations.GitScopeUtilTest
16:32:41 [2020-09-21T20:32:41.340Z] Tests run: 5, Failures: 0, Errors: 0, Skipped: 0, Time elapsed: 4.245 s - in org.eclipse.egit.ui.operations.GitScopeUtilTest
16:32:41 [2020-09-21T20:32:41.340Z] relatedChangesWithPrompt(org.eclipse.egit.ui.operations.GitScopeUtilTest)  Time elapsed: 1.861 s
16:32:41 [2020-09-21T20:32:41.340Z] modelProviderWithExtensionFiles(org.eclipse.egit.ui.operations.GitScopeUtilTest)  Time elapsed: 0.57 s
16:32:41 [2020-09-21T20:32:41.340Z] relatedChangesWithInvalidParams(org.eclipse.egit.ui.operations.GitScopeUtilTest)  Time elapsed: 0.551 s
16:32:41 [2020-09-21T20:32:41.340Z] relatedChangesWithNullResources(org.eclipse.egit.ui.operations.GitScopeUtilTest)  Time elapsed: 0.605 s
16:32:41 [2020-09-21T20:32:41.340Z] relatedChangesWithEmptyResources(org.eclipse.egit.ui.operations.GitScopeUtilTest)  Time elapsed: 0.656 s
16:32:41 [2020-09-21T20:32:41.340Z] 
16:32:41 [2020-09-21T20:32:41.340Z] Results:
16:32:41 [2020-09-21T20:32:41.340Z] 
16:32:41 [2020-09-21T20:32:41.340Z] Errors: 
16:32:41 [2020-09-21T20:32:41.340Z]   PushTagsWizardTest>LocalRepositoryTestCase.afterClassBase:288 » IO Could not d...
16:32:41 [2020-09-21T20:32:41.340Z] 
16:32:41 [2020-09-21T20:32:41.340Z] Tests run: 542, Failures: 0, Errors: 1, Skipped: 12
16:32:41 [2020-09-21T20:32:41.340Z] 
16:32:41 [2020-09-21T20:32:41.340Z] 
16:32:41 [2020-09-21T20:32:41.340Z] (SWT:1616): Gtk-WARNING **: 20:32:41.126: Negative content width -6 (allocation 1, extents 4x3) while allocating gadget (node toolbar, owner GtkToolbar)
16:32:42 [2020-09-21T20:32:42.273Z] 
16:32:42 [2020-09-21T20:32:42.273Z] !ENTRY org.eclipse.core.resources 2 10035 2020-09-21 20:32:42.076
16:32:42 [2020-09-21T20:32:42.273Z] !MESSAGE The workspace will exit with unsaved changes in this session.
16:32:43 [2020-09-21T20:32:43.206Z] 20:32:42 [INFO] ------------------------------------------------------------------------
16:32:43 [2020-09-21T20:32:43.206Z] 20:32:42 [INFO] Reactor Summary for EGit Parent 5.10.0-SNAPSHOT:
16:32:43 [2020-09-21T20:32:43.206Z] 20:32:42 [INFO] 
16:32:43 [2020-09-21T20:32:43.206Z] 20:32:42 [INFO] EGit Parent ........................................ SUCCESS [ 40.840 s]
16:32:43 [2020-09-21T20:32:43.206Z] 20:32:42 [INFO] EGit Target Platform Definition .................... SUCCESS [  1.062 s]
16:32:43 [2020-09-21T20:32:43.206Z] 20:32:42 [INFO] Eclipse EGit ....................................... SUCCESS [  5.757 s]
16:32:43 [2020-09-21T20:32:43.206Z] 20:32:42 [INFO] Git Team Provider (Core) ........................... SUCCESS [ 17.782 s]
16:32:43 [2020-09-21T20:32:43.206Z] 20:32:42 [INFO] Git Team Provider (UI) ............................. SUCCESS [ 44.625 s]
16:32:43 [2020-09-21T20:32:43.206Z] 20:32:42 [INFO] EGit Mylyn UI ...................................... SUCCESS [  7.181 s]
16:32:43 [2020-09-21T20:32:43.206Z] 20:32:43 [INFO] Git Team Provider (Documentation) .................. SUCCESS [  5.001 s]
16:32:43 [2020-09-21T20:32:43.206Z] 20:32:43 [INFO] Eclipse EGit Feature ............................... SUCCESS [  1.146 s]
16:32:43 [2020-09-21T20:32:43.206Z] 20:32:43 [INFO] EGit Mylyn Feature ................................. SUCCESS [  1.201 s]
16:32:43 [2020-09-21T20:32:43.206Z] 20:32:43 [INFO] Git Flow ........................................... SUCCESS [  6.622 s]
16:32:43 [2020-09-21T20:32:43.206Z] 20:32:43 [INFO] Git Flow UI ........................................ SUCCESS [  8.613 s]
16:32:43 [2020-09-21T20:32:43.206Z] 20:32:43 [INFO] Eclipse EGit Gitflow Feature ....................... SUCCESS [  1.278 s]
16:32:43 [2020-09-21T20:32:43.206Z] 20:32:43 [INFO] EGit JUnit Support ................................. SUCCESS [  6.729 s]
16:32:43 [2020-09-21T20:32:43.206Z] 20:32:43 [INFO] GitFlow Test Plug-in ............................... SUCCESS [ 26.849 s]
16:32:43 [2020-09-21T20:32:43.206Z] 20:32:43 [INFO] Eclipse EGit Source Feature ........................ SUCCESS [  1.172 s]
16:32:43 [2020-09-21T20:32:43.206Z] 20:32:43 [INFO] EGit P2 Repository ................................. SUCCESS [  8.653 s]
16:32:43 [2020-09-21T20:32:43.206Z] 20:32:43 [INFO] EGit Core Test Plug-in ............................. SUCCESS [02:06 min]
16:32:43 [2020-09-21T20:32:43.206Z] 20:32:43 [INFO] EGit UI Test Plug-in ............................... FAILURE [12:23 min]
16:32:43 [2020-09-21T20:32:43.206Z] 20:32:43 [INFO] EGit Mylyn UI Test Plug-in ......................... SKIPPED
16:32:43 [2020-09-21T20:32:43.206Z] 20:32:43 [INFO] ------------------------------------------------------------------------
16:32:43 [2020-09-21T20:32:43.206Z] 20:32:43 [INFO] BUILD FAILURE
16:32:43 [2020-09-21T20:32:43.206Z] 20:32:43 [INFO] ------------------------------------------------------------------------
16:32:43 [2020-09-21T20:32:43.206Z] 20:32:43 [INFO] Total time:  20:13 min
16:32:43 [2020-09-21T20:32:43.206Z] 20:32:43 [INFO] Finished at: 2020-09-21T20:32:43Z
16:32:43 [2020-09-21T20:32:43.206Z] 20:32:43 [INFO] ------------------------------------------------------------------------
16:32:43 [2020-09-21T20:32:43.206Z] 20:32:43 [ERROR] Failed to execute goal org.eclipse.tycho:tycho-surefire-plugin:1.7.0:test (default-test) on project org.eclipse.egit.ui.test: There are test failures.
16:32:43 [2020-09-21T20:32:43.206Z] 20:32:43 [ERROR] 
16:32:43 [2020-09-21T20:32:43.206Z] 20:32:43 [ERROR] Please refer to /home/jenkins/agent/workspace/egit.gerrit/repo/org.eclipse.egit.ui.test/target/surefire-reports for the individual test results.
16:32:43 [2020-09-21T20:32:43.206Z] 20:32:43 [ERROR] -> [Help 1]
16:32:43 [2020-09-21T20:32:43.206Z] org.apache.maven.lifecycle.LifecycleExecutionException: Failed to execute goal org.eclipse.tycho:tycho-surefire-plugin:1.7.0:test (default-test) on project org.eclipse.egit.ui.test: There are test failures.
16:32:43 [2020-09-21T20:32:43.206Z] 
16:32:43 [2020-09-21T20:32:43.206Z] Please refer to /home/jenkins/agent/workspace/egit.gerrit/repo/org.eclipse.egit.ui.test/target/surefire-reports for the individual test results.
16:32:43 [2020-09-21T20:32:43.206Z]     at org.apache.maven.lifecycle.internal.MojoExecutor.execute (MojoExecutor.java:215)
16:32:43 [2020-09-21T20:32:43.206Z]     at org.apache.maven.lifecycle.internal.MojoExecutor.execute (MojoExecutor.java:156)
16:32:43 [2020-09-21T20:32:43.206Z]     at org.apache.maven.lifecycle.internal.MojoExecutor.execute (MojoExecutor.java:148)
16:32:43 [2020-09-21T20:32:43.206Z]     at org.apache.maven.lifecycle.internal.LifecycleModuleBuilder.buildProject (LifecycleModuleBuilder.java:117)
16:32:43 [2020-09-21T20:32:43.206Z]     at org.apache.maven.lifecycle.internal.LifecycleModuleBuilder.buildProject (LifecycleModuleBuilder.java:81)
16:32:43 [2020-09-21T20:32:43.206Z]     at org.apache.maven.lifecycle.internal.builder.singlethreaded.SingleThreadedBuilder.build (SingleThreadedBuilder.java:56)
16:32:43 [2020-09-21T20:32:43.206Z]     at org.apache.maven.lifecycle.internal.LifecycleStarter.execute (LifecycleStarter.java:128)
16:32:43 [2020-09-21T20:32:43.206Z]     at org.apache.maven.DefaultMaven.doExecute (DefaultMaven.java:305)
16:32:43 [2020-09-21T20:32:43.206Z]     at org.apache.maven.DefaultMaven.doExecute (DefaultMaven.java:192)
16:32:43 [2020-09-21T20:32:43.206Z]     at org.apache.maven.DefaultMaven.execute (DefaultMaven.java:105)
16:32:43 [2020-09-21T20:32:43.206Z]     at org.apache.maven.cli.MavenCli.execute (MavenCli.java:957)
16:32:43 [2020-09-21T20:32:43.206Z]     at org.apache.maven.cli.MavenCli.doMain (MavenCli.java:289)
16:32:43 [2020-09-21T20:32:43.206Z]     at org.apache.maven.cli.MavenCli.main (MavenCli.java:193)
16:32:43 [2020-09-21T20:32:43.206Z]     at sun.reflect.NativeMethodAccessorImpl.invoke0 (Native Method)
16:32:43 [2020-09-21T20:32:43.206Z]     at sun.reflect.NativeMethodAccessorImpl.invoke (NativeMethodAccessorImpl.java:62)
16:32:43 [2020-09-21T20:32:43.206Z]     at sun.reflect.DelegatingMethodAccessorImpl.invoke (DelegatingMethodAccessorImpl.java:43)
16:32:43 [2020-09-21T20:32:43.206Z]     at java.lang.reflect.Method.invoke (Method.java:498)
16:32:43 [2020-09-21T20:32:43.206Z]     at org.codehaus.plexus.classworlds.launcher.Launcher.launchEnhanced (Launcher.java:282)
16:32:43 [2020-09-21T20:32:43.206Z]     at org.codehaus.plexus.classworlds.launcher.Launcher.launch (Launcher.java:225)
16:32:43 [2020-09-21T20:32:43.206Z]     at org.codehaus.plexus.classworlds.launcher.Launcher.mainWithExitCode (Launcher.java:406)
16:32:43 [2020-09-21T20:32:43.206Z]     at org.codehaus.plexus.classworlds.launcher.Launcher.main (Launcher.java:347)
16:32:43 [2020-09-21T20:32:43.206Z] Caused by: org.apache.maven.plugin.MojoFailureException: There are test failures.
16:32:43 [2020-09-21T20:32:43.206Z] 
16:32:43 [2020-09-21T20:32:43.206Z] Please refer to /home/jenkins/agent/workspace/egit.gerrit/repo/org.eclipse.egit.ui.test/target/surefire-reports for the individual test results.
16:32:43 [2020-09-21T20:32:43.206Z]     at org.eclipse.tycho.surefire.TestMojo.runTest (TestMojo.java:1063)
16:32:43 [2020-09-21T20:32:43.206Z]     at org.eclipse.tycho.surefire.TestMojo.execute (TestMojo.java:712)
16:32:43 [2020-09-21T20:32:43.206Z]     at org.apache.maven.plugin.DefaultBuildPluginManager.executeMojo (DefaultBuildPluginManager.java:137)
16:32:43 [2020-09-21T20:32:43.206Z]     at org.apache.maven.lifecycle.internal.MojoExecutor.execute (MojoExecutor.java:210)
16:32:43 [2020-09-21T20:32:43.206Z]     at org.apache.maven.lifecycle.internal.MojoExecutor.execute (MojoExecutor.java:156)
16:32:43 [2020-09-21T20:32:43.206Z]     at org.apache.maven.lifecycle.internal.MojoExecutor.execute (MojoExecutor.java:148)
16:32:43 [2020-09-21T20:32:43.206Z]     at org.apache.maven.lifecycle.internal.LifecycleModuleBuilder.buildProject (LifecycleModuleBuilder.java:117)
16:32:43 [2020-09-21T20:32:43.206Z]     at org.apache.maven.lifecycle.internal.LifecycleModuleBuilder.buildProject (LifecycleModuleBuilder.java:81)
16:32:43 [2020-09-21T20:32:43.206Z]     at org.apache.maven.lifecycle.internal.builder.singlethreaded.SingleThreadedBuilder.build (SingleThreadedBuilder.java:56)
16:32:43 [2020-09-21T20:32:43.206Z]     at org.apache.maven.lifecycle.internal.LifecycleStarter.execute (LifecycleStarter.java:128)
16:32:43 [2020-09-21T20:32:43.206Z]     at org.apache.maven.DefaultMaven.doExecute (DefaultMaven.java:305)
16:32:43 [2020-09-21T20:32:43.206Z]     at org.apache.maven.DefaultMaven.doExecute (DefaultMaven.java:192)
16:32:43 [2020-09-21T20:32:43.206Z]     at org.apache.maven.DefaultMaven.execute (DefaultMaven.java:105)
16:32:43 [2020-09-21T20:32:43.206Z]     at org.apache.maven.cli.MavenCli.execute (MavenCli.java:957)
16:32:43 [2020-09-21T20:32:43.206Z]     at org.apache.maven.cli.MavenCli.doMain (MavenCli.java:289)
16:32:43 [2020-09-21T20:32:43.206Z]     at org.apache.maven.cli.MavenCli.main (MavenCli.java:193)
16:32:43 [2020-09-21T20:32:43.206Z]     at sun.reflect.NativeMethodAccessorImpl.invoke0 (Native Method)
16:32:43 [2020-09-21T20:32:43.206Z]     at sun.reflect.NativeMethodAccessorImpl.invoke (NativeMethodAccessorImpl.java:62)
16:32:43 [2020-09-21T20:32:43.206Z]     at sun.reflect.DelegatingMethodAccessorImpl.invoke (DelegatingMethodAccessorImpl.java:43)
16:32:43 [2020-09-21T20:32:43.206Z]     at java.lang.reflect.Method.invoke (Method.java:498)
16:32:43 [2020-09-21T20:32:43.206Z]     at org.codehaus.plexus.classworlds.launcher.Launcher.launchEnhanced (Launcher.java:282)
16:32:43 [2020-09-21T20:32:43.206Z]     at org.codehaus.plexus.classworlds.launcher.Launcher.launch (Launcher.java:225)
16:32:43 [2020-09-21T20:32:43.206Z]     at org.codehaus.plexus.classworlds.launcher.Launcher.mainWithExitCode (Launcher.java:406)
16:32:43 [2020-09-21T20:32:43.206Z]     at org.codehaus.plexus.classworlds.launcher.Launcher.main (Launcher.java:347)
16:32:43 [2020-09-21T20:32:43.206Z] 20:32:43 [ERROR] 
16:32:43 [2020-09-21T20:32:43.206Z] 20:32:43 [ERROR] Re-run Maven using the -X switch to enable full debug logging.
16:32:43 [2020-09-21T20:32:43.206Z] 20:32:43 [ERROR] 
16:32:43 [2020-09-21T20:32:43.206Z] 20:32:43 [ERROR] For more information about the errors and possible solutions, please read the following articles:
16:32:43 [2020-09-21T20:32:43.206Z] 20:32:43 [ERROR] [Help 1] http://cwiki.apache.org/confluence/display/MAVEN/MojoFailureException
16:32:43 [2020-09-21T20:32:43.206Z] 20:32:43 [ERROR] 
16:32:43 [2020-09-21T20:32:43.206Z] 20:32:43 [ERROR] After correcting the problems, you can resume the build with the command
16:32:43 [2020-09-21T20:32:43.206Z] 20:32:43 [ERROR]   mvn <args> -rf :org.eclipse.egit.ui.test
[Pipeline] }
[Pipeline] // stage
[Pipeline] stage
[Pipeline] { (Results)
[Pipeline] junit
16:32:45 [2020-09-21T20:32:45.038Z] Recording test results
[Pipeline] archiveArtifacts
16:32:45 [2020-09-21T20:32:45.928Z] Archiving artifacts
[Pipeline] findbugs
16:32:48 [2020-09-21T20:32:48.799Z] [FINDBUGS] Collecting findbugs analysis files...
16:32:52 [2020-09-21T20:32:52.182Z] [FINDBUGS] Searching for all files in /home/jenkins/agent/workspace/egit.gerrit/repo that match the pattern */target/*bugsXml.xml
16:32:52 [2020-09-21T20:32:52.182Z] [FINDBUGS] Parsing 8 files in /home/jenkins/agent/workspace/egit.gerrit/repo
16:32:52 [2020-09-21T20:32:52.182Z] [FINDBUGS] Successfully parsed file /home/jenkins/agent/workspace/egit.gerrit/repo/org.eclipse.egit.core.junit/target/spotbugsXml.xml with 4 unique warnings and 0 duplicates.
16:32:52 [2020-09-21T20:32:52.182Z] [FINDBUGS] Successfully parsed file /home/jenkins/agent/workspace/egit.gerrit/repo/org.eclipse.egit.core.test/target/spotbugsXml.xml with 9 unique warnings and 0 duplicates.
16:32:52 [2020-09-21T20:32:52.182Z] [FINDBUGS] Successfully parsed file /home/jenkins/agent/workspace/egit.gerrit/repo/org.eclipse.egit.core/target/spotbugsXml.xml with 20 unique warnings and 0 duplicates.
16:32:52 [2020-09-21T20:32:52.182Z] [FINDBUGS] Successfully parsed file /home/jenkins/agent/workspace/egit.gerrit/repo/org.eclipse.egit.gitflow.test/target/spotbugsXml.xml with 20 unique warnings and 0 duplicates.
16:32:52 [2020-09-21T20:32:52.182Z] [FINDBUGS] Successfully parsed file /home/jenkins/agent/workspace/egit.gerrit/repo/org.eclipse.egit.gitflow.ui/target/spotbugsXml.xml with 20 unique warnings and 0 duplicates.
16:32:52 [2020-09-21T20:32:52.182Z] [FINDBUGS] Successfully parsed file /home/jenkins/agent/workspace/egit.gerrit/repo/org.eclipse.egit.gitflow/target/spotbugsXml.xml with 22 unique warnings and 0 duplicates.
16:32:52 [2020-09-21T20:32:52.182Z] [FINDBUGS] Successfully parsed file /home/jenkins/agent/workspace/egit.gerrit/repo/org.eclipse.egit.mylyn.ui/target/spotbugsXml.xml with 22 unique warnings and 0 duplicates.
16:32:52 [2020-09-21T20:32:52.182Z] [FINDBUGS] Successfully parsed file /home/jenkins/agent/workspace/egit.gerrit/repo/org.eclipse.egit.ui/target/spotbugsXml.xml with 59 unique warnings and 0 duplicates.
16:32:52 [2020-09-21T20:32:52.182Z] Skipping warnings blame since pipelines do not have an SCM link.%n
16:32:52 [2020-09-21T20:32:52.242Z] [FINDBUGS] Computing warning deltas based on reference build #1666
[Pipeline] dry
16:32:52 [2020-09-21T20:32:52.460Z] [DRY] Collecting duplicate code analysis files...
16:32:52 [2020-09-21T20:32:52.681Z] [DRY] Searching for all files in /home/jenkins/agent/workspace/egit.gerrit/repo that match the pattern **/cpd.xml
16:32:52 [2020-09-21T20:32:52.681Z] [DRY] Parsing 15 files in /home/jenkins/agent/workspace/egit.gerrit/repo
16:32:52 [2020-09-21T20:32:52.681Z] [DRY] Successfully parsed file /home/jenkins/agent/workspace/egit.gerrit/repo/org.eclipse.egit-feature/target/cpd.xml with 0 unique warnings and 0 duplicates.
16:32:52 [2020-09-21T20:32:52.681Z] [DRY] Successfully parsed file /home/jenkins/agent/workspace/egit.gerrit/repo/org.eclipse.egit.core.junit/target/cpd.xml with 0 unique warnings and 0 duplicates.
16:32:52 [2020-09-21T20:32:52.681Z] [DRY] Successfully parsed file /home/jenkins/agent/workspace/egit.gerrit/repo/org.eclipse.egit.core.test/target/cpd.xml with 0 unique warnings and 0 duplicates.
16:32:52 [2020-09-21T20:32:52.681Z] [DRY] Successfully parsed file /home/jenkins/agent/workspace/egit.gerrit/repo/org.eclipse.egit.core/target/cpd.xml with 4 unique warnings and 0 duplicates.
16:32:52 [2020-09-21T20:32:52.681Z] [DRY] Successfully parsed file /home/jenkins/agent/workspace/egit.gerrit/repo/org.eclipse.egit.doc/target/cpd.xml with 4 unique warnings and 0 duplicates.
16:32:52 [2020-09-21T20:32:52.681Z] [DRY] Successfully parsed file /home/jenkins/agent/workspace/egit.gerrit/repo/org.eclipse.egit.gitflow-feature/target/cpd.xml with 4 unique warnings and 0 duplicates.
16:32:52 [2020-09-21T20:32:52.681Z] [DRY] Successfully parsed file /home/jenkins/agent/workspace/egit.gerrit/repo/org.eclipse.egit.gitflow.test/target/cpd.xml with 4 unique warnings and 0 duplicates.
16:32:52 [2020-09-21T20:32:52.681Z] [DRY] Successfully parsed file /home/jenkins/agent/workspace/egit.gerrit/repo/org.eclipse.egit.gitflow.ui/target/cpd.xml with 4 unique warnings and 0 duplicates.
16:32:52 [2020-09-21T20:32:52.681Z] [DRY] Successfully parsed file /home/jenkins/agent/workspace/egit.gerrit/repo/org.eclipse.egit.gitflow/target/cpd.xml with 4 unique warnings and 0 duplicates.
16:32:52 [2020-09-21T20:32:52.681Z] [DRY] Successfully parsed file /home/jenkins/agent/workspace/egit.gerrit/repo/org.eclipse.egit.mylyn-feature/target/cpd.xml with 4 unique warnings and 0 duplicates.
16:32:52 [2020-09-21T20:32:52.681Z] [DRY] Successfully parsed file /home/jenkins/agent/workspace/egit.gerrit/repo/org.eclipse.egit.mylyn.ui/target/cpd.xml with 4 unique warnings and 0 duplicates.
16:32:52 [2020-09-21T20:32:52.681Z] [DRY] Successfully parsed file /home/jenkins/agent/workspace/egit.gerrit/repo/org.eclipse.egit.repository/target/cpd.xml with 4 unique warnings and 0 duplicates.
16:32:52 [2020-09-21T20:32:52.681Z] [DRY] Successfully parsed file /home/jenkins/agent/workspace/egit.gerrit/repo/org.eclipse.egit.source-feature/target/cpd.xml with 4 unique warnings and 0 duplicates.
16:32:52 [2020-09-21T20:32:52.681Z] [DRY] Successfully parsed file /home/jenkins/agent/workspace/egit.gerrit/repo/org.eclipse.egit.ui/target/cpd.xml with 37 unique warnings and 0 duplicates.
16:32:52 [2020-09-21T20:32:52.681Z] [DRY] Successfully parsed file /home/jenkins/agent/workspace/egit.gerrit/repo/org.eclipse.egit/target/cpd.xml with 37 unique warnings and 0 duplicates.
16:32:52 [2020-09-21T20:32:52.681Z] Skipping warnings blame since pipelines do not have an SCM link.%n
16:32:52 [2020-09-21T20:32:52.717Z] [DRY] Computing warning deltas based on reference build #1666
[Pipeline] }
[Pipeline] // stage
[Pipeline] }
[Pipeline] // dir
[Pipeline] }
16:32:53 [2020-09-21T20:32:53.469Z] Terminating xvnc.
[Pipeline] // wrap
[Pipeline] }
[Pipeline] // timeout
[Pipeline] }
[Pipeline] // node
[Pipeline] }
[Pipeline] // timestamps
[Pipeline] End of Pipeline
ERROR: script returned exit code 1
Finished: FAILURE