FailedConsole Output

Skipping 924 KB.. Full Log
] (SWT:1672): Gtk-CRITICAL **: 21:00:00.972: gtk_box_gadget_distribute: assertion 'size >= 0' failed in GtkScrollbar
17:00:01 [2020-09-13T21:00:01.028Z] 
17:00:01 [2020-09-13T21:00:01.028Z] (SWT:1672): Gtk-CRITICAL **: 21:00:00.979: gtk_box_gadget_distribute: assertion 'size >= 0' failed in GtkScrollbar
17:00:01 [2020-09-13T21:00:01.028Z] 
17:00:01 [2020-09-13T21:00:01.028Z] (SWT:1672): Gtk-WARNING **: 21:00:01.006: Negative content width -6 (allocation 1, extents 4x3) while allocating gadget (node toolbar, owner GtkToolbar)
17:00:01 [2020-09-13T21:00:01.961Z] 
17:00:01 [2020-09-13T21:00:01.961Z] (SWT:1672): Gtk-WARNING **: 21:00:01.635: Negative content width -6 (allocation 1, extents 4x3) while allocating gadget (node toolbar, owner GtkToolbar)
17:00:01 [2020-09-13T21:00:01.961Z] 
17:00:01 [2020-09-13T21:00:01.961Z] (SWT:1672): Gtk-WARNING **: 21:00:01.645: Negative content width -6 (allocation 1, extents 4x3) while allocating gadget (node toolbar, owner GtkToolbar)
17:00:02 [2020-09-13T21:00:02.527Z] 
17:00:02 [2020-09-13T21:00:02.527Z] (SWT:1672): Gtk-WARNING **: 21:00:02.260: Negative content width -6 (allocation 1, extents 4x3) while allocating gadget (node toolbar, owner GtkToolbar)
17:00:02 [2020-09-13T21:00:02.785Z] 
17:00:02 [2020-09-13T21:00:02.785Z] (SWT:1672): Gtk-CRITICAL **: 21:00:02.550: gtk_box_gadget_distribute: assertion 'size >= 0' failed in GtkScrollbar
17:00:02 [2020-09-13T21:00:02.785Z] 
17:00:02 [2020-09-13T21:00:02.785Z] (SWT:1672): Gtk-CRITICAL **: 21:00:02.557: gtk_box_gadget_distribute: assertion 'size >= 0' failed in GtkScrollbar
17:00:02 [2020-09-13T21:00:02.785Z] 
17:00:02 [2020-09-13T21:00:02.785Z] (SWT:1672): Gtk-WARNING **: 21:00:02.560: Negative content width -6 (allocation 1, extents 4x3) while allocating gadget (node toolbar, owner GtkToolbar)
17:00:02 [2020-09-13T21:00:02.785Z] 
17:00:02 [2020-09-13T21:00:02.785Z] (SWT:1672): Gtk-CRITICAL **: 21:00:02.566: gtk_box_gadget_distribute: assertion 'size >= 0' failed in GtkScrollbar
17:00:02 [2020-09-13T21:00:02.785Z] 
17:00:02 [2020-09-13T21:00:02.785Z] (SWT:1672): Gtk-CRITICAL **: 21:00:02.571: gtk_box_gadget_distribute: assertion 'size >= 0' failed in GtkScrollbar
17:00:02 [2020-09-13T21:00:02.785Z] 
17:00:02 [2020-09-13T21:00:02.785Z] (SWT:1672): Gtk-CRITICAL **: 21:00:02.572: gtk_box_gadget_distribute: assertion 'size >= 0' failed in GtkScrollbar
17:00:02 [2020-09-13T21:00:02.786Z] 
17:00:02 [2020-09-13T21:00:02.786Z] (SWT:1672): Gtk-CRITICAL **: 21:00:02.572: gtk_box_gadget_distribute: assertion 'size >= 0' failed in GtkScrollbar
17:00:02 [2020-09-13T21:00:02.786Z] 
17:00:02 [2020-09-13T21:00:02.786Z] (SWT:1672): Gtk-CRITICAL **: 21:00:02.579: gtk_box_gadget_distribute: assertion 'size >= 0' failed in GtkScrollbar
17:00:02 [2020-09-13T21:00:02.786Z] 
17:00:02 [2020-09-13T21:00:02.786Z] (SWT:1672): Gtk-CRITICAL **: 21:00:02.584: gtk_box_gadget_distribute: assertion 'size >= 0' failed in GtkScrollbar
17:00:02 [2020-09-13T21:00:02.786Z] 
17:00:02 [2020-09-13T21:00:02.786Z] (SWT:1672): Gtk-CRITICAL **: 21:00:02.585: gtk_box_gadget_distribute: assertion 'size >= 0' failed in GtkScrollbar
17:00:02 [2020-09-13T21:00:02.786Z] 
17:00:02 [2020-09-13T21:00:02.786Z] (SWT:1672): Gtk-CRITICAL **: 21:00:02.600: gtk_box_gadget_distribute: assertion 'size >= 0' failed in GtkScrollbar
17:00:02 [2020-09-13T21:00:02.786Z] 
17:00:02 [2020-09-13T21:00:02.786Z] (SWT:1672): Gtk-CRITICAL **: 21:00:02.600: gtk_box_gadget_distribute: assertion 'size >= 0' failed in GtkScrollbar
17:00:02 [2020-09-13T21:00:02.786Z] 
17:00:02 [2020-09-13T21:00:02.786Z] (SWT:1672): Gtk-CRITICAL **: 21:00:02.616: gtk_box_gadget_distribute: assertion 'size >= 0' failed in GtkScrollbar
17:00:02 [2020-09-13T21:00:02.786Z] 
17:00:02 [2020-09-13T21:00:02.786Z] (SWT:1672): Gtk-CRITICAL **: 21:00:02.616: gtk_box_gadget_distribute: assertion 'size >= 0' failed in GtkScrollbar
17:00:02 [2020-09-13T21:00:02.786Z] 
17:00:02 [2020-09-13T21:00:02.786Z] (SWT:1672): Gtk-CRITICAL **: 21:00:02.635: gtk_box_gadget_distribute: assertion 'size >= 0' failed in GtkScrollbar
17:00:02 [2020-09-13T21:00:02.786Z] 
17:00:02 [2020-09-13T21:00:02.786Z] (SWT:1672): Gtk-CRITICAL **: 21:00:02.635: gtk_box_gadget_distribute: assertion 'size >= 0' failed in GtkScrollbar
17:00:02 [2020-09-13T21:00:02.786Z] 
17:00:02 [2020-09-13T21:00:02.786Z] (SWT:1672): Gtk-CRITICAL **: 21:00:02.650: gtk_box_gadget_distribute: assertion 'size >= 0' failed in GtkScrollbar
17:00:02 [2020-09-13T21:00:02.786Z] 
17:00:02 [2020-09-13T21:00:02.786Z] (SWT:1672): Gtk-CRITICAL **: 21:00:02.650: gtk_box_gadget_distribute: assertion 'size >= 0' failed in GtkScrollbar
17:00:02 [2020-09-13T21:00:02.786Z] 
17:00:02 [2020-09-13T21:00:02.786Z] (SWT:1672): Gtk-CRITICAL **: 21:00:02.667: gtk_box_gadget_distribute: assertion 'size >= 0' failed in GtkScrollbar
17:00:02 [2020-09-13T21:00:02.786Z] 
17:00:02 [2020-09-13T21:00:02.786Z] (SWT:1672): Gtk-CRITICAL **: 21:00:02.667: gtk_box_gadget_distribute: assertion 'size >= 0' failed in GtkScrollbar
17:00:02 [2020-09-13T21:00:02.786Z] 
17:00:02 [2020-09-13T21:00:02.786Z] (SWT:1672): Gtk-CRITICAL **: 21:00:02.683: gtk_box_gadget_distribute: assertion 'size >= 0' failed in GtkScrollbar
17:00:02 [2020-09-13T21:00:02.786Z] 
17:00:02 [2020-09-13T21:00:02.786Z] (SWT:1672): Gtk-CRITICAL **: 21:00:02.683: gtk_box_gadget_distribute: assertion 'size >= 0' failed in GtkScrollbar
17:00:02 [2020-09-13T21:00:02.786Z] 
17:00:02 [2020-09-13T21:00:02.786Z] (SWT:1672): Gtk-CRITICAL **: 21:00:02.700: gtk_box_gadget_distribute: assertion 'size >= 0' failed in GtkScrollbar
17:00:02 [2020-09-13T21:00:02.786Z] 
17:00:02 [2020-09-13T21:00:02.786Z] (SWT:1672): Gtk-CRITICAL **: 21:00:02.700: gtk_box_gadget_distribute: assertion 'size >= 0' failed in GtkScrollbar
17:00:02 [2020-09-13T21:00:02.786Z] 
17:00:02 [2020-09-13T21:00:02.786Z] (SWT:1672): Gtk-CRITICAL **: 21:00:02.716: gtk_box_gadget_distribute: assertion 'size >= 0' failed in GtkScrollbar
17:00:02 [2020-09-13T21:00:02.786Z] 
17:00:02 [2020-09-13T21:00:02.786Z] (SWT:1672): Gtk-CRITICAL **: 21:00:02.716: gtk_box_gadget_distribute: assertion 'size >= 0' failed in GtkScrollbar
17:00:02 [2020-09-13T21:00:02.786Z] 
17:00:02 [2020-09-13T21:00:02.786Z] (SWT:1672): Gtk-CRITICAL **: 21:00:02.736: gtk_box_gadget_distribute: assertion 'size >= 0' failed in GtkScrollbar
17:00:02 [2020-09-13T21:00:02.786Z] 
17:00:02 [2020-09-13T21:00:02.786Z] (SWT:1672): Gtk-CRITICAL **: 21:00:02.736: gtk_box_gadget_distribute: assertion 'size >= 0' failed in GtkScrollbar
17:00:02 [2020-09-13T21:00:02.786Z] 
17:00:02 [2020-09-13T21:00:02.786Z] (SWT:1672): Gtk-CRITICAL **: 21:00:02.758: gtk_box_gadget_distribute: assertion 'size >= 0' failed in GtkScrollbar
17:00:02 [2020-09-13T21:00:02.786Z] 
17:00:02 [2020-09-13T21:00:02.786Z] (SWT:1672): Gtk-CRITICAL **: 21:00:02.758: gtk_box_gadget_distribute: assertion 'size >= 0' failed in GtkScrollbar
17:00:02 [2020-09-13T21:00:02.786Z] 
17:00:02 [2020-09-13T21:00:02.786Z] (SWT:1672): Gtk-CRITICAL **: 21:00:02.774: gtk_box_gadget_distribute: assertion 'size >= 0' failed in GtkScrollbar
17:00:02 [2020-09-13T21:00:02.786Z] 
17:00:02 [2020-09-13T21:00:02.786Z] (SWT:1672): Gtk-CRITICAL **: 21:00:02.774: gtk_box_gadget_distribute: assertion 'size >= 0' failed in GtkScrollbar
17:00:03 [2020-09-13T21:00:03.044Z] 
17:00:03 [2020-09-13T21:00:03.044Z] (SWT:1672): Gtk-CRITICAL **: 21:00:02.791: gtk_box_gadget_distribute: assertion 'size >= 0' failed in GtkScrollbar
17:00:03 [2020-09-13T21:00:03.044Z] 
17:00:03 [2020-09-13T21:00:03.044Z] (SWT:1672): Gtk-CRITICAL **: 21:00:03.040: gtk_box_gadget_distribute: assertion 'size >= 0' failed in GtkScrollbar
17:00:03 [2020-09-13T21:00:03.044Z] 
17:00:03 [2020-09-13T21:00:03.044Z] (SWT:1672): Gtk-CRITICAL **: 21:00:03.041: gtk_box_gadget_distribute: assertion 'size >= 0' failed in GtkScrollbar
17:00:03 [2020-09-13T21:00:03.302Z] 
17:00:03 [2020-09-13T21:00:03.302Z] (SWT:1672): Gtk-CRITICAL **: 21:00:03.045: gtk_box_gadget_distribute: assertion 'size >= 0' failed in GtkScrollbar
17:00:03 [2020-09-13T21:00:03.302Z] 
17:00:03 [2020-09-13T21:00:03.302Z] (SWT:1672): Gtk-CRITICAL **: 21:00:03.047: gtk_box_gadget_distribute: assertion 'size >= 0' failed in GtkScrollbar
17:00:03 [2020-09-13T21:00:03.302Z] 
17:00:03 [2020-09-13T21:00:03.302Z] (SWT:1672): Gtk-CRITICAL **: 21:00:03.047: gtk_box_gadget_distribute: assertion 'size >= 0' failed in GtkScrollbar
17:00:03 [2020-09-13T21:00:03.302Z] 
17:00:03 [2020-09-13T21:00:03.302Z] (SWT:1672): Gtk-CRITICAL **: 21:00:03.056: gtk_box_gadget_distribute: assertion 'size >= 0' failed in GtkScrollbar
17:00:03 [2020-09-13T21:00:03.302Z] 
17:00:03 [2020-09-13T21:00:03.302Z] (SWT:1672): Gtk-CRITICAL **: 21:00:03.059: gtk_box_gadget_distribute: assertion 'size >= 0' failed in GtkScrollbar
17:00:03 [2020-09-13T21:00:03.302Z] 
17:00:03 [2020-09-13T21:00:03.302Z] (SWT:1672): Gtk-CRITICAL **: 21:00:03.059: gtk_box_gadget_distribute: assertion 'size >= 0' failed in GtkScrollbar
17:00:03 [2020-09-13T21:00:03.302Z] 
17:00:03 [2020-09-13T21:00:03.302Z] (SWT:1672): Gtk-CRITICAL **: 21:00:03.063: gtk_box_gadget_distribute: assertion 'size >= 0' failed in GtkScrollbar
17:00:03 [2020-09-13T21:00:03.302Z] 
17:00:03 [2020-09-13T21:00:03.302Z] (SWT:1672): Gtk-WARNING **: 21:00:03.106: Negative content width -6 (allocation 1, extents 4x3) while allocating gadget (node toolbar, owner GtkToolbar)
17:00:03 [2020-09-13T21:00:03.867Z] 
17:00:03 [2020-09-13T21:00:03.867Z] (SWT:1672): Gtk-WARNING **: 21:00:03.636: Negative content width -6 (allocation 1, extents 4x3) while allocating gadget (node toolbar, owner GtkToolbar)
17:00:03 [2020-09-13T21:00:03.867Z] 
17:00:03 [2020-09-13T21:00:03.867Z] (SWT:1672): Gtk-WARNING **: 21:00:03.647: Negative content width -6 (allocation 1, extents 4x3) while allocating gadget (node toolbar, owner GtkToolbar)
17:00:04 [2020-09-13T21:00:04.433Z] 
17:00:04 [2020-09-13T21:00:04.433Z] (SWT:1672): Gtk-WARNING **: 21:00:04.243: Negative content width -6 (allocation 1, extents 4x3) while allocating gadget (node toolbar, owner GtkToolbar)
17:00:04 [2020-09-13T21:00:04.691Z] 
17:00:04 [2020-09-13T21:00:04.693Z] (SWT:1672): Gtk-CRITICAL **: 21:00:04.525: gtk_box_gadget_distribute: assertion 'size >= 0' failed in GtkScrollbar
17:00:04 [2020-09-13T21:00:04.693Z] 
17:00:04 [2020-09-13T21:00:04.693Z] (SWT:1672): Gtk-CRITICAL **: 21:00:04.532: gtk_box_gadget_distribute: assertion 'size >= 0' failed in GtkScrollbar
17:00:04 [2020-09-13T21:00:04.693Z] 
17:00:04 [2020-09-13T21:00:04.693Z] (SWT:1672): Gtk-WARNING **: 21:00:04.536: Negative content width -6 (allocation 1, extents 4x3) while allocating gadget (node toolbar, owner GtkToolbar)
17:00:04 [2020-09-13T21:00:04.693Z] 
17:00:04 [2020-09-13T21:00:04.693Z] (SWT:1672): Gtk-CRITICAL **: 21:00:04.542: gtk_box_gadget_distribute: assertion 'size >= 0' failed in GtkScrollbar
17:00:04 [2020-09-13T21:00:04.693Z] 
17:00:04 [2020-09-13T21:00:04.693Z] (SWT:1672): Gtk-CRITICAL **: 21:00:04.548: gtk_box_gadget_distribute: assertion 'size >= 0' failed in GtkScrollbar
17:00:04 [2020-09-13T21:00:04.693Z] 
17:00:04 [2020-09-13T21:00:04.693Z] (SWT:1672): Gtk-CRITICAL **: 21:00:04.549: gtk_box_gadget_distribute: assertion 'size >= 0' failed in GtkScrollbar
17:00:04 [2020-09-13T21:00:04.693Z] 
17:00:04 [2020-09-13T21:00:04.693Z] (SWT:1672): Gtk-CRITICAL **: 21:00:04.549: gtk_box_gadget_distribute: assertion 'size >= 0' failed in GtkScrollbar
17:00:04 [2020-09-13T21:00:04.693Z] 
17:00:04 [2020-09-13T21:00:04.693Z] (SWT:1672): Gtk-CRITICAL **: 21:00:04.560: gtk_box_gadget_distribute: assertion 'size >= 0' failed in GtkScrollbar
17:00:04 [2020-09-13T21:00:04.693Z] 
17:00:04 [2020-09-13T21:00:04.693Z] (SWT:1672): Gtk-CRITICAL **: 21:00:04.560: gtk_box_gadget_distribute: assertion 'size >= 0' failed in GtkScrollbar
17:00:04 [2020-09-13T21:00:04.693Z] 
17:00:04 [2020-09-13T21:00:04.693Z] (SWT:1672): Gtk-CRITICAL **: 21:00:04.572: gtk_box_gadget_distribute: assertion 'size >= 0' failed in GtkScrollbar
17:00:04 [2020-09-13T21:00:04.693Z] 
17:00:04 [2020-09-13T21:00:04.693Z] (SWT:1672): Gtk-CRITICAL **: 21:00:04.573: gtk_box_gadget_distribute: assertion 'size >= 0' failed in GtkScrollbar
17:00:04 [2020-09-13T21:00:04.693Z] 
17:00:04 [2020-09-13T21:00:04.693Z] (SWT:1672): Gtk-CRITICAL **: 21:00:04.574: gtk_box_gadget_distribute: assertion 'size >= 0' failed in GtkScrollbar
17:00:04 [2020-09-13T21:00:04.693Z] 
17:00:04 [2020-09-13T21:00:04.693Z] (SWT:1672): Gtk-CRITICAL **: 21:00:04.590: gtk_box_gadget_distribute: assertion 'size >= 0' failed in GtkScrollbar
17:00:04 [2020-09-13T21:00:04.693Z] 
17:00:04 [2020-09-13T21:00:04.693Z] (SWT:1672): Gtk-CRITICAL **: 21:00:04.590: gtk_box_gadget_distribute: assertion 'size >= 0' failed in GtkScrollbar
17:00:04 [2020-09-13T21:00:04.693Z] 
17:00:04 [2020-09-13T21:00:04.694Z] (SWT:1672): Gtk-CRITICAL **: 21:00:04.607: gtk_box_gadget_distribute: assertion 'size >= 0' failed in GtkScrollbar
17:00:04 [2020-09-13T21:00:04.694Z] 
17:00:04 [2020-09-13T21:00:04.694Z] (SWT:1672): Gtk-CRITICAL **: 21:00:04.607: gtk_box_gadget_distribute: assertion 'size >= 0' failed in GtkScrollbar
17:00:04 [2020-09-13T21:00:04.694Z] 
17:00:04 [2020-09-13T21:00:04.694Z] (SWT:1672): Gtk-CRITICAL **: 21:00:04.623: gtk_box_gadget_distribute: assertion 'size >= 0' failed in GtkScrollbar
17:00:04 [2020-09-13T21:00:04.694Z] 
17:00:04 [2020-09-13T21:00:04.694Z] (SWT:1672): Gtk-CRITICAL **: 21:00:04.623: gtk_box_gadget_distribute: assertion 'size >= 0' failed in GtkScrollbar
17:00:04 [2020-09-13T21:00:04.694Z] 
17:00:04 [2020-09-13T21:00:04.694Z] (SWT:1672): Gtk-CRITICAL **: 21:00:04.640: gtk_box_gadget_distribute: assertion 'size >= 0' failed in GtkScrollbar
17:00:04 [2020-09-13T21:00:04.694Z] 
17:00:04 [2020-09-13T21:00:04.694Z] (SWT:1672): Gtk-CRITICAL **: 21:00:04.640: gtk_box_gadget_distribute: assertion 'size >= 0' failed in GtkScrollbar
17:00:04 [2020-09-13T21:00:04.694Z] 
17:00:04 [2020-09-13T21:00:04.694Z] (SWT:1672): Gtk-CRITICAL **: 21:00:04.656: gtk_box_gadget_distribute: assertion 'size >= 0' failed in GtkScrollbar
17:00:04 [2020-09-13T21:00:04.694Z] 
17:00:04 [2020-09-13T21:00:04.694Z] (SWT:1672): Gtk-CRITICAL **: 21:00:04.656: gtk_box_gadget_distribute: assertion 'size >= 0' failed in GtkScrollbar
17:00:04 [2020-09-13T21:00:04.694Z] 
17:00:04 [2020-09-13T21:00:04.694Z] (SWT:1672): Gtk-CRITICAL **: 21:00:04.674: gtk_box_gadget_distribute: assertion 'size >= 0' failed in GtkScrollbar
17:00:04 [2020-09-13T21:00:04.694Z] 
17:00:04 [2020-09-13T21:00:04.694Z] (SWT:1672): Gtk-CRITICAL **: 21:00:04.674: gtk_box_gadget_distribute: assertion 'size >= 0' failed in GtkScrollbar
17:00:04 [2020-09-13T21:00:04.694Z] 
17:00:04 [2020-09-13T21:00:04.694Z] (SWT:1672): Gtk-CRITICAL **: 21:00:04.680: gtk_box_gadget_distribute: assertion 'size >= 0' failed in GtkScrollbar
17:00:04 [2020-09-13T21:00:04.694Z] 
17:00:04 [2020-09-13T21:00:04.694Z] (SWT:1672): Gtk-CRITICAL **: 21:00:04.680: gtk_box_gadget_distribute: assertion 'size >= 0' failed in GtkScrollbar
17:00:04 [2020-09-13T21:00:04.694Z] 
17:00:04 [2020-09-13T21:00:04.694Z] (SWT:1672): Gtk-CRITICAL **: 21:00:04.685: gtk_box_gadget_distribute: assertion 'size >= 0' failed in GtkScrollbar
17:00:04 [2020-09-13T21:00:04.694Z] 
17:00:04 [2020-09-13T21:00:04.694Z] (SWT:1672): Gtk-CRITICAL **: 21:00:04.685: gtk_box_gadget_distribute: assertion 'size >= 0' failed in GtkScrollbar
17:00:04 [2020-09-13T21:00:04.694Z] 
17:00:04 [2020-09-13T21:00:04.694Z] (SWT:1672): Gtk-CRITICAL **: 21:00:04.685: gtk_box_gadget_distribute: assertion 'size >= 0' failed in GtkScrollbar
17:00:04 [2020-09-13T21:00:04.951Z] 
17:00:04 [2020-09-13T21:00:04.951Z] (SWT:1672): Gtk-CRITICAL **: 21:00:04.691: gtk_box_gadget_distribute: assertion 'size >= 0' failed in GtkScrollbar
17:00:04 [2020-09-13T21:00:04.951Z] 
17:00:04 [2020-09-13T21:00:04.951Z] (SWT:1672): Gtk-CRITICAL **: 21:00:04.691: gtk_box_gadget_distribute: assertion 'size >= 0' failed in GtkScrollbar
17:00:04 [2020-09-13T21:00:04.951Z] 
17:00:04 [2020-09-13T21:00:04.951Z] (SWT:1672): Gtk-CRITICAL **: 21:00:04.696: gtk_box_gadget_distribute: assertion 'size >= 0' failed in GtkScrollbar
17:00:04 [2020-09-13T21:00:04.951Z] 
17:00:04 [2020-09-13T21:00:04.951Z] (SWT:1672): Gtk-CRITICAL **: 21:00:04.707: gtk_box_gadget_distribute: assertion 'size >= 0' failed in GtkScrollbar
17:00:04 [2020-09-13T21:00:04.951Z] 
17:00:04 [2020-09-13T21:00:04.951Z] (SWT:1672): Gtk-CRITICAL **: 21:00:04.707: gtk_box_gadget_distribute: assertion 'size >= 0' failed in GtkScrollbar
17:00:04 [2020-09-13T21:00:04.951Z] 
17:00:04 [2020-09-13T21:00:04.951Z] (SWT:1672): Gtk-CRITICAL **: 21:00:04.711: gtk_box_gadget_distribute: assertion 'size >= 0' failed in GtkScrollbar
17:00:04 [2020-09-13T21:00:04.951Z] 
17:00:04 [2020-09-13T21:00:04.951Z] (SWT:1672): Gtk-CRITICAL **: 21:00:04.711: gtk_box_gadget_distribute: assertion 'size >= 0' failed in GtkScrollbar
17:00:04 [2020-09-13T21:00:04.951Z] 
17:00:04 [2020-09-13T21:00:04.951Z] (SWT:1672): Gtk-CRITICAL **: 21:00:04.715: gtk_box_gadget_distribute: assertion 'size >= 0' failed in GtkScrollbar
17:00:04 [2020-09-13T21:00:04.951Z] 
17:00:04 [2020-09-13T21:00:04.951Z] (SWT:1672): Gtk-CRITICAL **: 21:00:04.724: gtk_box_gadget_distribute: assertion 'size >= 0' failed in GtkScrollbar
17:00:04 [2020-09-13T21:00:04.951Z] 
17:00:04 [2020-09-13T21:00:04.951Z] (SWT:1672): Gtk-CRITICAL **: 21:00:04.724: gtk_box_gadget_distribute: assertion 'size >= 0' failed in GtkScrollbar
17:00:04 [2020-09-13T21:00:04.951Z] 
17:00:04 [2020-09-13T21:00:04.951Z] (SWT:1672): Gtk-WARNING **: 21:00:04.749: Negative content width -6 (allocation 1, extents 4x3) while allocating gadget (node toolbar, owner GtkToolbar)
17:00:05 [2020-09-13T21:00:05.516Z] 
17:00:05 [2020-09-13T21:00:05.516Z] (SWT:1672): Gtk-WARNING **: 21:00:05.283: Negative content width -6 (allocation 1, extents 4x3) while allocating gadget (node toolbar, owner GtkToolbar)
17:00:05 [2020-09-13T21:00:05.516Z] 
17:00:05 [2020-09-13T21:00:05.516Z] (SWT:1672): Gtk-WARNING **: 21:00:05.293: Negative content width -6 (allocation 1, extents 4x3) while allocating gadget (node toolbar, owner GtkToolbar)
17:00:06 [2020-09-13T21:00:06.080Z] 
17:00:06 [2020-09-13T21:00:06.080Z] (SWT:1672): Gtk-WARNING **: 21:00:05.879: Negative content width -6 (allocation 1, extents 4x3) while allocating gadget (node toolbar, owner GtkToolbar)
17:00:06 [2020-09-13T21:00:06.341Z] 
17:00:06 [2020-09-13T21:00:06.341Z] (SWT:1672): Gtk-CRITICAL **: 21:00:06.325: gtk_box_gadget_distribute: assertion 'size >= 0' failed in GtkScrollbar
17:00:06 [2020-09-13T21:00:06.342Z] 
17:00:06 [2020-09-13T21:00:06.342Z] (SWT:1672): Gtk-CRITICAL **: 21:00:06.332: gtk_box_gadget_distribute: assertion 'size >= 0' failed in GtkScrollbar
17:00:06 [2020-09-13T21:00:06.342Z] 
17:00:06 [2020-09-13T21:00:06.342Z] (SWT:1672): Gtk-WARNING **: 21:00:06.336: Negative content width -6 (allocation 1, extents 4x3) while allocating gadget (node toolbar, owner GtkToolbar)
17:00:06 [2020-09-13T21:00:06.599Z] 
17:00:06 [2020-09-13T21:00:06.599Z] (SWT:1672): Gtk-CRITICAL **: 21:00:06.342: gtk_box_gadget_distribute: assertion 'size >= 0' failed in GtkScrollbar
17:00:06 [2020-09-13T21:00:06.599Z] 
17:00:06 [2020-09-13T21:00:06.599Z] (SWT:1672): Gtk-CRITICAL **: 21:00:06.352: gtk_box_gadget_distribute: assertion 'size >= 0' failed in GtkScrollbar
17:00:06 [2020-09-13T21:00:06.599Z] 
17:00:06 [2020-09-13T21:00:06.599Z] (SWT:1672): Gtk-CRITICAL **: 21:00:06.363: gtk_box_gadget_distribute: assertion 'size >= 0' failed in GtkScrollbar
17:00:06 [2020-09-13T21:00:06.599Z] 
17:00:06 [2020-09-13T21:00:06.599Z] (SWT:1672): Gtk-CRITICAL **: 21:00:06.364: gtk_box_gadget_distribute: assertion 'size >= 0' failed in GtkScrollbar
17:00:06 [2020-09-13T21:00:06.599Z] 
17:00:06 [2020-09-13T21:00:06.599Z] (SWT:1672): Gtk-CRITICAL **: 21:00:06.364: gtk_box_gadget_distribute: assertion 'size >= 0' failed in GtkScrollbar
17:00:06 [2020-09-13T21:00:06.599Z] 
17:00:06 [2020-09-13T21:00:06.599Z] (SWT:1672): Gtk-CRITICAL **: 21:00:06.375: gtk_box_gadget_distribute: assertion 'size >= 0' failed in GtkScrollbar
17:00:06 [2020-09-13T21:00:06.599Z] 
17:00:06 [2020-09-13T21:00:06.599Z] (SWT:1672): Gtk-CRITICAL **: 21:00:06.376: gtk_box_gadget_distribute: assertion 'size >= 0' failed in GtkScrollbar
17:00:06 [2020-09-13T21:00:06.599Z] 
17:00:06 [2020-09-13T21:00:06.599Z] (SWT:1672): Gtk-CRITICAL **: 21:00:06.391: gtk_box_gadget_distribute: assertion 'size >= 0' failed in GtkScrollbar
17:00:06 [2020-09-13T21:00:06.599Z] 
17:00:06 [2020-09-13T21:00:06.599Z] (SWT:1672): Gtk-CRITICAL **: 21:00:06.402: gtk_box_gadget_distribute: assertion 'size >= 0' failed in GtkScrollbar
17:00:06 [2020-09-13T21:00:06.599Z] 
17:00:06 [2020-09-13T21:00:06.599Z] (SWT:1672): Gtk-CRITICAL **: 21:00:06.402: gtk_box_gadget_distribute: assertion 'size >= 0' failed in GtkScrollbar
17:00:06 [2020-09-13T21:00:06.599Z] 
17:00:06 [2020-09-13T21:00:06.599Z] (SWT:1672): Gtk-CRITICAL **: 21:00:06.419: gtk_box_gadget_distribute: assertion 'size >= 0' failed in GtkScrollbar
17:00:06 [2020-09-13T21:00:06.599Z] 
17:00:06 [2020-09-13T21:00:06.599Z] (SWT:1672): Gtk-CRITICAL **: 21:00:06.419: gtk_box_gadget_distribute: assertion 'size >= 0' failed in GtkScrollbar
17:00:06 [2020-09-13T21:00:06.599Z] 
17:00:06 [2020-09-13T21:00:06.599Z] (SWT:1672): Gtk-CRITICAL **: 21:00:06.435: gtk_box_gadget_distribute: assertion 'size >= 0' failed in GtkScrollbar
17:00:06 [2020-09-13T21:00:06.599Z] 
17:00:06 [2020-09-13T21:00:06.599Z] (SWT:1672): Gtk-CRITICAL **: 21:00:06.435: gtk_box_gadget_distribute: assertion 'size >= 0' failed in GtkScrollbar
17:00:06 [2020-09-13T21:00:06.599Z] 
17:00:06 [2020-09-13T21:00:06.599Z] (SWT:1672): Gtk-CRITICAL **: 21:00:06.451: gtk_box_gadget_distribute: assertion 'size >= 0' failed in GtkScrollbar
17:00:06 [2020-09-13T21:00:06.599Z] 
17:00:06 [2020-09-13T21:00:06.599Z] (SWT:1672): Gtk-CRITICAL **: 21:00:06.451: gtk_box_gadget_distribute: assertion 'size >= 0' failed in GtkScrollbar
17:00:06 [2020-09-13T21:00:06.599Z] 
17:00:06 [2020-09-13T21:00:06.599Z] (SWT:1672): Gtk-CRITICAL **: 21:00:06.469: gtk_box_gadget_distribute: assertion 'size >= 0' failed in GtkScrollbar
17:00:06 [2020-09-13T21:00:06.599Z] 
17:00:06 [2020-09-13T21:00:06.599Z] (SWT:1672): Gtk-CRITICAL **: 21:00:06.469: gtk_box_gadget_distribute: assertion 'size >= 0' failed in GtkScrollbar
17:00:06 [2020-09-13T21:00:06.599Z] 
17:00:06 [2020-09-13T21:00:06.599Z] (SWT:1672): Gtk-CRITICAL **: 21:00:06.485: gtk_box_gadget_distribute: assertion 'size >= 0' failed in GtkScrollbar
17:00:06 [2020-09-13T21:00:06.599Z] 
17:00:06 [2020-09-13T21:00:06.599Z] (SWT:1672): Gtk-CRITICAL **: 21:00:06.485: gtk_box_gadget_distribute: assertion 'size >= 0' failed in GtkScrollbar
17:00:06 [2020-09-13T21:00:06.599Z] 
17:00:06 [2020-09-13T21:00:06.599Z] (SWT:1672): Gtk-CRITICAL **: 21:00:06.493: gtk_box_gadget_distribute: assertion 'size >= 0' failed in GtkScrollbar
17:00:06 [2020-09-13T21:00:06.599Z] 
17:00:06 [2020-09-13T21:00:06.599Z] (SWT:1672): Gtk-CRITICAL **: 21:00:06.494: gtk_box_gadget_distribute: assertion 'size >= 0' failed in GtkScrollbar
17:00:06 [2020-09-13T21:00:06.599Z] 
17:00:06 [2020-09-13T21:00:06.599Z] (SWT:1672): Gtk-CRITICAL **: 21:00:06.498: gtk_box_gadget_distribute: assertion 'size >= 0' failed in GtkScrollbar
17:00:06 [2020-09-13T21:00:06.599Z] 
17:00:06 [2020-09-13T21:00:06.599Z] (SWT:1672): Gtk-CRITICAL **: 21:00:06.499: gtk_box_gadget_distribute: assertion 'size >= 0' failed in GtkScrollbar
17:00:06 [2020-09-13T21:00:06.599Z] 
17:00:06 [2020-09-13T21:00:06.599Z] (SWT:1672): Gtk-CRITICAL **: 21:00:06.499: gtk_box_gadget_distribute: assertion 'size >= 0' failed in GtkScrollbar
17:00:06 [2020-09-13T21:00:06.599Z] 
17:00:06 [2020-09-13T21:00:06.599Z] (SWT:1672): Gtk-CRITICAL **: 21:00:06.505: gtk_box_gadget_distribute: assertion 'size >= 0' failed in GtkScrollbar
17:00:06 [2020-09-13T21:00:06.599Z] 
17:00:06 [2020-09-13T21:00:06.599Z] (SWT:1672): Gtk-CRITICAL **: 21:00:06.506: gtk_box_gadget_distribute: assertion 'size >= 0' failed in GtkScrollbar
17:00:06 [2020-09-13T21:00:06.599Z] 
17:00:06 [2020-09-13T21:00:06.599Z] (SWT:1672): Gtk-CRITICAL **: 21:00:06.511: gtk_box_gadget_distribute: assertion 'size >= 0' failed in GtkScrollbar
17:00:06 [2020-09-13T21:00:06.599Z] 
17:00:06 [2020-09-13T21:00:06.599Z] (SWT:1672): Gtk-CRITICAL **: 21:00:06.519: gtk_box_gadget_distribute: assertion 'size >= 0' failed in GtkScrollbar
17:00:06 [2020-09-13T21:00:06.599Z] 
17:00:06 [2020-09-13T21:00:06.599Z] (SWT:1672): Gtk-CRITICAL **: 21:00:06.519: gtk_box_gadget_distribute: assertion 'size >= 0' failed in GtkScrollbar
17:00:06 [2020-09-13T21:00:06.599Z] 
17:00:06 [2020-09-13T21:00:06.599Z] (SWT:1672): Gtk-CRITICAL **: 21:00:06.523: gtk_box_gadget_distribute: assertion 'size >= 0' failed in GtkScrollbar
17:00:06 [2020-09-13T21:00:06.600Z] 
17:00:06 [2020-09-13T21:00:06.600Z] (SWT:1672): Gtk-CRITICAL **: 21:00:06.523: gtk_box_gadget_distribute: assertion 'size >= 0' failed in GtkScrollbar
17:00:06 [2020-09-13T21:00:06.600Z] 
17:00:06 [2020-09-13T21:00:06.600Z] (SWT:1672): Gtk-CRITICAL **: 21:00:06.527: gtk_box_gadget_distribute: assertion 'size >= 0' failed in GtkScrollbar
17:00:06 [2020-09-13T21:00:06.600Z] 
17:00:06 [2020-09-13T21:00:06.600Z] (SWT:1672): Gtk-CRITICAL **: 21:00:06.536: gtk_box_gadget_distribute: assertion 'size >= 0' failed in GtkScrollbar
17:00:06 [2020-09-13T21:00:06.600Z] 
17:00:06 [2020-09-13T21:00:06.600Z] (SWT:1672): Gtk-CRITICAL **: 21:00:06.536: gtk_box_gadget_distribute: assertion 'size >= 0' failed in GtkScrollbar
17:00:06 [2020-09-13T21:00:06.600Z] 
17:00:06 [2020-09-13T21:00:06.600Z] (SWT:1672): Gtk-WARNING **: 21:00:06.560: Negative content width -6 (allocation 1, extents 4x3) while allocating gadget (node toolbar, owner GtkToolbar)
17:00:07 [2020-09-13T21:00:07.165Z] 
17:00:07 [2020-09-13T21:00:07.165Z] (SWT:1672): Gtk-WARNING **: 21:00:07.100: Negative content width -6 (allocation 1, extents 4x3) while allocating gadget (node toolbar, owner GtkToolbar)
17:00:07 [2020-09-13T21:00:07.165Z] 
17:00:07 [2020-09-13T21:00:07.165Z] (SWT:1672): Gtk-WARNING **: 21:00:07.110: Negative content width -6 (allocation 1, extents 4x3) while allocating gadget (node toolbar, owner GtkToolbar)
17:00:07 [2020-09-13T21:00:07.730Z] 
17:00:07 [2020-09-13T21:00:07.730Z] (SWT:1672): Gtk-WARNING **: 21:00:07.707: Negative content width -6 (allocation 1, extents 4x3) while allocating gadget (node toolbar, owner GtkToolbar)
17:00:08 [2020-09-13T21:00:08.310Z] 
17:00:08 [2020-09-13T21:00:08.310Z] (SWT:1672): Gtk-CRITICAL **: 21:00:08.184: gtk_box_gadget_distribute: assertion 'size >= 0' failed in GtkScrollbar
17:00:08 [2020-09-13T21:00:08.310Z] 
17:00:08 [2020-09-13T21:00:08.310Z] (SWT:1672): Gtk-CRITICAL **: 21:00:08.191: gtk_box_gadget_distribute: assertion 'size >= 0' failed in GtkScrollbar
17:00:08 [2020-09-13T21:00:08.310Z] 
17:00:08 [2020-09-13T21:00:08.310Z] (SWT:1672): Gtk-WARNING **: 21:00:08.194: Negative content width -6 (allocation 1, extents 4x3) while allocating gadget (node toolbar, owner GtkToolbar)
17:00:08 [2020-09-13T21:00:08.310Z] 
17:00:08 [2020-09-13T21:00:08.310Z] (SWT:1672): Gtk-CRITICAL **: 21:00:08.200: gtk_box_gadget_distribute: assertion 'size >= 0' failed in GtkScrollbar
17:00:08 [2020-09-13T21:00:08.310Z] 
17:00:08 [2020-09-13T21:00:08.310Z] (SWT:1672): Gtk-CRITICAL **: 21:00:08.206: gtk_box_gadget_distribute: assertion 'size >= 0' failed in GtkScrollbar
17:00:08 [2020-09-13T21:00:08.310Z] 
17:00:08 [2020-09-13T21:00:08.310Z] (SWT:1672): Gtk-CRITICAL **: 21:00:08.207: gtk_box_gadget_distribute: assertion 'size >= 0' failed in GtkScrollbar
17:00:08 [2020-09-13T21:00:08.310Z] 
17:00:08 [2020-09-13T21:00:08.310Z] (SWT:1672): Gtk-CRITICAL **: 21:00:08.207: gtk_box_gadget_distribute: assertion 'size >= 0' failed in GtkScrollbar
17:00:08 [2020-09-13T21:00:08.310Z] 
17:00:08 [2020-09-13T21:00:08.310Z] (SWT:1672): Gtk-CRITICAL **: 21:00:08.218: gtk_box_gadget_distribute: assertion 'size >= 0' failed in GtkScrollbar
17:00:08 [2020-09-13T21:00:08.310Z] 
17:00:08 [2020-09-13T21:00:08.310Z] (SWT:1672): Gtk-CRITICAL **: 21:00:08.218: gtk_box_gadget_distribute: assertion 'size >= 0' failed in GtkScrollbar
17:00:08 [2020-09-13T21:00:08.310Z] 
17:00:08 [2020-09-13T21:00:08.310Z] (SWT:1672): Gtk-CRITICAL **: 21:00:08.229: gtk_box_gadget_distribute: assertion 'size >= 0' failed in GtkScrollbar
17:00:08 [2020-09-13T21:00:08.310Z] 
17:00:08 [2020-09-13T21:00:08.310Z] (SWT:1672): Gtk-CRITICAL **: 21:00:08.233: gtk_box_gadget_distribute: assertion 'size >= 0' failed in GtkScrollbar
17:00:08 [2020-09-13T21:00:08.310Z] 
17:00:08 [2020-09-13T21:00:08.310Z] (SWT:1672): Gtk-CRITICAL **: 21:00:08.233: gtk_box_gadget_distribute: assertion 'size >= 0' failed in GtkScrollbar
17:00:08 [2020-09-13T21:00:08.310Z] 
17:00:08 [2020-09-13T21:00:08.310Z] (SWT:1672): Gtk-CRITICAL **: 21:00:08.250: gtk_box_gadget_distribute: assertion 'size >= 0' failed in GtkScrollbar
17:00:08 [2020-09-13T21:00:08.310Z] 
17:00:08 [2020-09-13T21:00:08.310Z] (SWT:1672): Gtk-CRITICAL **: 21:00:08.250: gtk_box_gadget_distribute: assertion 'size >= 0' failed in GtkScrollbar
17:00:08 [2020-09-13T21:00:08.310Z] 
17:00:08 [2020-09-13T21:00:08.310Z] (SWT:1672): Gtk-CRITICAL **: 21:00:08.267: gtk_box_gadget_distribute: assertion 'size >= 0' failed in GtkScrollbar
17:00:08 [2020-09-13T21:00:08.310Z] 
17:00:08 [2020-09-13T21:00:08.310Z] (SWT:1672): Gtk-CRITICAL **: 21:00:08.267: gtk_box_gadget_distribute: assertion 'size >= 0' failed in GtkScrollbar
17:00:08 [2020-09-13T21:00:08.310Z] 
17:00:08 [2020-09-13T21:00:08.310Z] (SWT:1672): Gtk-CRITICAL **: 21:00:08.283: gtk_box_gadget_distribute: assertion 'size >= 0' failed in GtkScrollbar
17:00:08 [2020-09-13T21:00:08.310Z] 
17:00:08 [2020-09-13T21:00:08.310Z] (SWT:1672): Gtk-CRITICAL **: 21:00:08.283: gtk_box_gadget_distribute: assertion 'size >= 0' failed in GtkScrollbar
17:00:08 [2020-09-13T21:00:08.310Z] 
17:00:08 [2020-09-13T21:00:08.310Z] (SWT:1672): Gtk-CRITICAL **: 21:00:08.300: gtk_box_gadget_distribute: assertion 'size >= 0' failed in GtkScrollbar
17:00:08 [2020-09-13T21:00:08.310Z] 
17:00:08 [2020-09-13T21:00:08.310Z] (SWT:1672): Gtk-CRITICAL **: 21:00:08.300: gtk_box_gadget_distribute: assertion 'size >= 0' failed in GtkScrollbar
17:00:08 [2020-09-13T21:00:08.568Z] 
17:00:08 [2020-09-13T21:00:08.568Z] (SWT:1672): Gtk-CRITICAL **: 21:00:08.316: gtk_box_gadget_distribute: assertion 'size >= 0' failed in GtkScrollbar
17:00:08 [2020-09-13T21:00:08.568Z] 
17:00:08 [2020-09-13T21:00:08.568Z] (SWT:1672): Gtk-CRITICAL **: 21:00:08.316: gtk_box_gadget_distribute: assertion 'size >= 0' failed in GtkScrollbar
17:00:08 [2020-09-13T21:00:08.568Z] 
17:00:08 [2020-09-13T21:00:08.568Z] (SWT:1672): Gtk-CRITICAL **: 21:00:08.333: gtk_box_gadget_distribute: assertion 'size >= 0' failed in GtkScrollbar
17:00:08 [2020-09-13T21:00:08.568Z] 
17:00:08 [2020-09-13T21:00:08.568Z] (SWT:1672): Gtk-CRITICAL **: 21:00:08.333: gtk_box_gadget_distribute: assertion 'size >= 0' failed in GtkScrollbar
17:00:08 [2020-09-13T21:00:08.568Z] 
17:00:08 [2020-09-13T21:00:08.568Z] (SWT:1672): Gtk-CRITICAL **: 21:00:08.337: gtk_box_gadget_distribute: assertion 'size >= 0' failed in GtkScrollbar
17:00:08 [2020-09-13T21:00:08.568Z] 
17:00:08 [2020-09-13T21:00:08.568Z] (SWT:1672): Gtk-CRITICAL **: 21:00:08.337: gtk_box_gadget_distribute: assertion 'size >= 0' failed in GtkScrollbar
17:00:08 [2020-09-13T21:00:08.568Z] 
17:00:08 [2020-09-13T21:00:08.568Z] (SWT:1672): Gtk-CRITICAL **: 21:00:08.341: gtk_box_gadget_distribute: assertion 'size >= 0' failed in GtkScrollbar
17:00:08 [2020-09-13T21:00:08.568Z] 
17:00:08 [2020-09-13T21:00:08.568Z] (SWT:1672): Gtk-CRITICAL **: 21:00:08.342: gtk_box_gadget_distribute: assertion 'size >= 0' failed in GtkScrollbar
17:00:08 [2020-09-13T21:00:08.568Z] 
17:00:08 [2020-09-13T21:00:08.568Z] (SWT:1672): Gtk-CRITICAL **: 21:00:08.342: gtk_box_gadget_distribute: assertion 'size >= 0' failed in GtkScrollbar
17:00:08 [2020-09-13T21:00:08.568Z] 
17:00:08 [2020-09-13T21:00:08.568Z] (SWT:1672): Gtk-CRITICAL **: 21:00:08.346: gtk_box_gadget_distribute: assertion 'size >= 0' failed in GtkScrollbar
17:00:08 [2020-09-13T21:00:08.568Z] 
17:00:08 [2020-09-13T21:00:08.568Z] (SWT:1672): Gtk-CRITICAL **: 21:00:08.351: gtk_box_gadget_distribute: assertion 'size >= 0' failed in GtkScrollbar
17:00:08 [2020-09-13T21:00:08.568Z] 
17:00:08 [2020-09-13T21:00:08.568Z] (SWT:1672): Gtk-CRITICAL **: 21:00:08.351: gtk_box_gadget_distribute: assertion 'size >= 0' failed in GtkScrollbar
17:00:08 [2020-09-13T21:00:08.568Z] 
17:00:08 [2020-09-13T21:00:08.568Z] (SWT:1672): Gtk-CRITICAL **: 21:00:08.367: gtk_box_gadget_distribute: assertion 'size >= 0' failed in GtkScrollbar
17:00:08 [2020-09-13T21:00:08.568Z] 
17:00:08 [2020-09-13T21:00:08.568Z] (SWT:1672): Gtk-CRITICAL **: 21:00:08.367: gtk_box_gadget_distribute: assertion 'size >= 0' failed in GtkScrollbar
17:00:08 [2020-09-13T21:00:08.568Z] 
17:00:08 [2020-09-13T21:00:08.568Z] (SWT:1672): Gtk-CRITICAL **: 21:00:08.383: gtk_box_gadget_distribute: assertion 'size >= 0' failed in GtkScrollbar
17:00:08 [2020-09-13T21:00:08.568Z] 
17:00:08 [2020-09-13T21:00:08.568Z] (SWT:1672): Gtk-CRITICAL **: 21:00:08.383: gtk_box_gadget_distribute: assertion 'size >= 0' failed in GtkScrollbar
17:00:08 [2020-09-13T21:00:08.568Z] 
17:00:08 [2020-09-13T21:00:08.568Z] (SWT:1672): Gtk-CRITICAL **: 21:00:08.399: gtk_box_gadget_distribute: assertion 'size >= 0' failed in GtkScrollbar
17:00:08 [2020-09-13T21:00:08.568Z] 
17:00:08 [2020-09-13T21:00:08.568Z] (SWT:1672): Gtk-CRITICAL **: 21:00:08.399: gtk_box_gadget_distribute: assertion 'size >= 0' failed in GtkScrollbar
17:00:08 [2020-09-13T21:00:08.568Z] 
17:00:08 [2020-09-13T21:00:08.568Z] (SWT:1672): Gtk-CRITICAL **: 21:00:08.416: gtk_box_gadget_distribute: assertion 'size >= 0' failed in GtkScrollbar
17:00:08 [2020-09-13T21:00:08.568Z] 
17:00:08 [2020-09-13T21:00:08.568Z] (SWT:1672): Gtk-CRITICAL **: 21:00:08.416: gtk_box_gadget_distribute: assertion 'size >= 0' failed in GtkScrollbar
17:00:08 [2020-09-13T21:00:08.568Z] 
17:00:08 [2020-09-13T21:00:08.568Z] (SWT:1672): Gtk-CRITICAL **: 21:00:08.430: gtk_box_gadget_distribute: assertion 'size >= 0' failed in GtkScrollbar
17:00:08 [2020-09-13T21:00:08.568Z] 
17:00:08 [2020-09-13T21:00:08.568Z] (SWT:1672): Gtk-CRITICAL **: 21:00:08.437: gtk_box_gadget_distribute: assertion 'size >= 0' failed in GtkScrollbar
17:00:08 [2020-09-13T21:00:08.568Z] 
17:00:08 [2020-09-13T21:00:08.568Z] (SWT:1672): Gtk-WARNING **: 21:00:08.492: Negative content width -6 (allocation 1, extents 4x3) while allocating gadget (node toolbar, owner GtkToolbar)
17:00:09 [2020-09-13T21:00:09.133Z] 
17:00:09 [2020-09-13T21:00:09.133Z] (SWT:1672): Gtk-WARNING **: 21:00:08.956: Negative content width -6 (allocation 1, extents 4x3) while allocating gadget (node toolbar, owner GtkToolbar)
17:00:09 [2020-09-13T21:00:09.133Z] 
17:00:09 [2020-09-13T21:00:09.133Z] (SWT:1672): Gtk-WARNING **: 21:00:08.967: Negative content width -6 (allocation 1, extents 4x3) while allocating gadget (node toolbar, owner GtkToolbar)
17:00:09 [2020-09-13T21:00:09.698Z] 
17:00:09 [2020-09-13T21:00:09.698Z] (SWT:1672): Gtk-WARNING **: 21:00:09.580: Negative content width -6 (allocation 1, extents 4x3) while allocating gadget (node toolbar, owner GtkToolbar)
17:00:09 [2020-09-13T21:00:09.956Z] 
17:00:09 [2020-09-13T21:00:09.956Z] (SWT:1672): Gtk-CRITICAL **: 21:00:09.875: gtk_box_gadget_distribute: assertion 'size >= 0' failed in GtkScrollbar
17:00:09 [2020-09-13T21:00:09.956Z] 
17:00:09 [2020-09-13T21:00:09.956Z] (SWT:1672): Gtk-CRITICAL **: 21:00:09.882: gtk_box_gadget_distribute: assertion 'size >= 0' failed in GtkScrollbar
17:00:09 [2020-09-13T21:00:09.956Z] 
17:00:09 [2020-09-13T21:00:09.956Z] (SWT:1672): Gtk-WARNING **: 21:00:09.886: Negative content width -6 (allocation 1, extents 4x3) while allocating gadget (node toolbar, owner GtkToolbar)
17:00:09 [2020-09-13T21:00:09.956Z] 
17:00:09 [2020-09-13T21:00:09.956Z] (SWT:1672): Gtk-CRITICAL **: 21:00:09.899: gtk_box_gadget_distribute: assertion 'size >= 0' failed in GtkScrollbar
17:00:09 [2020-09-13T21:00:09.956Z] 
17:00:09 [2020-09-13T21:00:09.956Z] (SWT:1672): Gtk-CRITICAL **: 21:00:09.905: gtk_box_gadget_distribute: assertion 'size >= 0' failed in GtkScrollbar
17:00:09 [2020-09-13T21:00:09.956Z] 
17:00:09 [2020-09-13T21:00:09.956Z] (SWT:1672): Gtk-CRITICAL **: 21:00:09.912: gtk_box_gadget_distribute: assertion 'size >= 0' failed in GtkScrollbar
17:00:09 [2020-09-13T21:00:09.956Z] 
17:00:09 [2020-09-13T21:00:09.956Z] (SWT:1672): Gtk-CRITICAL **: 21:00:09.914: gtk_box_gadget_distribute: assertion 'size >= 0' failed in GtkScrollbar
17:00:09 [2020-09-13T21:00:09.956Z] 
17:00:09 [2020-09-13T21:00:09.956Z] (SWT:1672): Gtk-CRITICAL **: 21:00:09.914: gtk_box_gadget_distribute: assertion 'size >= 0' failed in GtkScrollbar
17:00:09 [2020-09-13T21:00:09.956Z] 
17:00:09 [2020-09-13T21:00:09.956Z] (SWT:1672): Gtk-CRITICAL **: 21:00:09.926: gtk_box_gadget_distribute: assertion 'size >= 0' failed in GtkScrollbar
17:00:09 [2020-09-13T21:00:09.956Z] 
17:00:09 [2020-09-13T21:00:09.956Z] (SWT:1672): Gtk-CRITICAL **: 21:00:09.927: gtk_box_gadget_distribute: assertion 'size >= 0' failed in GtkScrollbar
17:00:09 [2020-09-13T21:00:09.956Z] 
17:00:09 [2020-09-13T21:00:09.956Z] (SWT:1672): Gtk-CRITICAL **: 21:00:09.951: gtk_box_gadget_distribute: assertion 'size >= 0' failed in GtkScrollbar
17:00:09 [2020-09-13T21:00:09.956Z] 
17:00:09 [2020-09-13T21:00:09.956Z] (SWT:1672): Gtk-CRITICAL **: 21:00:09.951: gtk_box_gadget_distribute: assertion 'size >= 0' failed in GtkScrollbar
17:00:10 [2020-09-13T21:00:10.214Z] 
17:00:10 [2020-09-13T21:00:10.214Z] (SWT:1672): Gtk-CRITICAL **: 21:00:09.959: gtk_box_gadget_distribute: assertion 'size >= 0' failed in GtkScrollbar
17:00:10 [2020-09-13T21:00:10.214Z] 
17:00:10 [2020-09-13T21:00:10.214Z] (SWT:1672): Gtk-CRITICAL **: 21:00:09.966: gtk_box_gadget_distribute: assertion 'size >= 0' failed in GtkScrollbar
17:00:10 [2020-09-13T21:00:10.214Z] 
17:00:10 [2020-09-13T21:00:10.214Z] (SWT:1672): Gtk-CRITICAL **: 21:00:09.967: gtk_box_gadget_distribute: assertion 'size >= 0' failed in GtkScrollbar
17:00:10 [2020-09-13T21:00:10.214Z] 
17:00:10 [2020-09-13T21:00:10.214Z] (SWT:1672): Gtk-CRITICAL **: 21:00:09.983: gtk_box_gadget_distribute: assertion 'size >= 0' failed in GtkScrollbar
17:00:10 [2020-09-13T21:00:10.214Z] 
17:00:10 [2020-09-13T21:00:10.214Z] (SWT:1672): Gtk-CRITICAL **: 21:00:09.983: gtk_box_gadget_distribute: assertion 'size >= 0' failed in GtkScrollbar
17:00:10 [2020-09-13T21:00:10.214Z] 
17:00:10 [2020-09-13T21:00:10.214Z] (SWT:1672): Gtk-CRITICAL **: 21:00:10.000: gtk_box_gadget_distribute: assertion 'size >= 0' failed in GtkScrollbar
17:00:10 [2020-09-13T21:00:10.214Z] 
17:00:10 [2020-09-13T21:00:10.214Z] (SWT:1672): Gtk-CRITICAL **: 21:00:10.000: gtk_box_gadget_distribute: assertion 'size >= 0' failed in GtkScrollbar
17:00:10 [2020-09-13T21:00:10.214Z] 
17:00:10 [2020-09-13T21:00:10.214Z] (SWT:1672): Gtk-CRITICAL **: 21:00:10.016: gtk_box_gadget_distribute: assertion 'size >= 0' failed in GtkScrollbar
17:00:10 [2020-09-13T21:00:10.214Z] 
17:00:10 [2020-09-13T21:00:10.214Z] (SWT:1672): Gtk-CRITICAL **: 21:00:10.016: gtk_box_gadget_distribute: assertion 'size >= 0' failed in GtkScrollbar
17:00:10 [2020-09-13T21:00:10.214Z] 
17:00:10 [2020-09-13T21:00:10.214Z] (SWT:1672): Gtk-CRITICAL **: 21:00:10.033: gtk_box_gadget_distribute: assertion 'size >= 0' failed in GtkScrollbar
17:00:10 [2020-09-13T21:00:10.214Z] 
17:00:10 [2020-09-13T21:00:10.214Z] (SWT:1672): Gtk-CRITICAL **: 21:00:10.034: gtk_box_gadget_distribute: assertion 'size >= 0' failed in GtkScrollbar
17:00:10 [2020-09-13T21:00:10.214Z] 
17:00:10 [2020-09-13T21:00:10.214Z] (SWT:1672): Gtk-CRITICAL **: 21:00:10.050: gtk_box_gadget_distribute: assertion 'size >= 0' failed in GtkScrollbar
17:00:10 [2020-09-13T21:00:10.214Z] 
17:00:10 [2020-09-13T21:00:10.214Z] (SWT:1672): Gtk-CRITICAL **: 21:00:10.050: gtk_box_gadget_distribute: assertion 'size >= 0' failed in GtkScrollbar
17:00:10 [2020-09-13T21:00:10.214Z] 
17:00:10 [2020-09-13T21:00:10.214Z] (SWT:1672): Gtk-CRITICAL **: 21:00:10.062: gtk_box_gadget_distribute: assertion 'size >= 0' failed in GtkScrollbar
17:00:10 [2020-09-13T21:00:10.214Z] 
17:00:10 [2020-09-13T21:00:10.214Z] (SWT:1672): Gtk-CRITICAL **: 21:00:10.062: gtk_box_gadget_distribute: assertion 'size >= 0' failed in GtkScrollbar
17:00:10 [2020-09-13T21:00:10.214Z] 
17:00:10 [2020-09-13T21:00:10.214Z] (SWT:1672): Gtk-CRITICAL **: 21:00:10.067: gtk_box_gadget_distribute: assertion 'size >= 0' failed in GtkScrollbar
17:00:10 [2020-09-13T21:00:10.214Z] 
17:00:10 [2020-09-13T21:00:10.214Z] (SWT:1672): Gtk-CRITICAL **: 21:00:10.067: gtk_box_gadget_distribute: assertion 'size >= 0' failed in GtkScrollbar
17:00:10 [2020-09-13T21:00:10.214Z] 
17:00:10 [2020-09-13T21:00:10.214Z] (SWT:1672): Gtk-CRITICAL **: 21:00:10.073: gtk_box_gadget_distribute: assertion 'size >= 0' failed in GtkScrollbar
17:00:10 [2020-09-13T21:00:10.214Z] 
17:00:10 [2020-09-13T21:00:10.214Z] (SWT:1672): Gtk-CRITICAL **: 21:00:10.073: gtk_box_gadget_distribute: assertion 'size >= 0' failed in GtkScrollbar
17:00:10 [2020-09-13T21:00:10.214Z] 
17:00:10 [2020-09-13T21:00:10.214Z] (SWT:1672): Gtk-CRITICAL **: 21:00:10.073: gtk_box_gadget_distribute: assertion 'size >= 0' failed in GtkScrollbar
17:00:10 [2020-09-13T21:00:10.214Z] 
17:00:10 [2020-09-13T21:00:10.214Z] (SWT:1672): Gtk-CRITICAL **: 21:00:10.077: gtk_box_gadget_distribute: assertion 'size >= 0' failed in GtkScrollbar
17:00:10 [2020-09-13T21:00:10.214Z] 
17:00:10 [2020-09-13T21:00:10.214Z] (SWT:1672): Gtk-CRITICAL **: 21:00:10.085: gtk_box_gadget_distribute: assertion 'size >= 0' failed in GtkScrollbar
17:00:10 [2020-09-13T21:00:10.214Z] 
17:00:10 [2020-09-13T21:00:10.214Z] (SWT:1672): Gtk-CRITICAL **: 21:00:10.086: gtk_box_gadget_distribute: assertion 'size >= 0' failed in GtkScrollbar
17:00:10 [2020-09-13T21:00:10.214Z] 
17:00:10 [2020-09-13T21:00:10.214Z] (SWT:1672): Gtk-CRITICAL **: 21:00:10.095: gtk_box_gadget_distribute: assertion 'size >= 0' failed in GtkScrollbar
17:00:10 [2020-09-13T21:00:10.214Z] 
17:00:10 [2020-09-13T21:00:10.214Z] (SWT:1672): Gtk-CRITICAL **: 21:00:10.095: gtk_box_gadget_distribute: assertion 'size >= 0' failed in GtkScrollbar
17:00:10 [2020-09-13T21:00:10.214Z] 
17:00:10 [2020-09-13T21:00:10.214Z] (SWT:1672): Gtk-CRITICAL **: 21:00:10.101: gtk_box_gadget_distribute: assertion 'size >= 0' failed in GtkScrollbar
17:00:10 [2020-09-13T21:00:10.214Z] 
17:00:10 [2020-09-13T21:00:10.214Z] (SWT:1672): Gtk-CRITICAL **: 21:00:10.101: gtk_box_gadget_distribute: assertion 'size >= 0' failed in GtkScrollbar
17:00:10 [2020-09-13T21:00:10.214Z] 
17:00:10 [2020-09-13T21:00:10.214Z] (SWT:1672): Gtk-CRITICAL **: 21:00:10.108: gtk_box_gadget_distribute: assertion 'size >= 0' failed in GtkScrollbar
17:00:10 [2020-09-13T21:00:10.214Z] 
17:00:10 [2020-09-13T21:00:10.214Z] (SWT:1672): Gtk-CRITICAL **: 21:00:10.120: gtk_box_gadget_distribute: assertion 'size >= 0' failed in GtkScrollbar
17:00:10 [2020-09-13T21:00:10.214Z] 
17:00:10 [2020-09-13T21:00:10.214Z] (SWT:1672): Gtk-WARNING **: 21:00:10.156: Negative content width -6 (allocation 1, extents 4x3) while allocating gadget (node toolbar, owner GtkToolbar)
17:00:10 [2020-09-13T21:00:10.778Z] 
17:00:10 [2020-09-13T21:00:10.779Z] (SWT:1672): Gtk-WARNING **: 21:00:10.481: Negative content width -6 (allocation 1, extents 4x3) while allocating gadget (node toolbar, owner GtkToolbar)
17:00:10 [2020-09-13T21:00:10.779Z] 
17:00:10 [2020-09-13T21:00:10.779Z] (SWT:1672): Gtk-WARNING **: 21:00:10.501: Negative content width -6 (allocation 1, extents 4x3) while allocating gadget (node toolbar, owner GtkToolbar)
17:00:11 [2020-09-13T21:00:11.344Z] 
17:00:11 [2020-09-13T21:00:11.344Z] (SWT:1672): Gtk-WARNING **: 21:00:11.092: Negative content width -6 (allocation 1, extents 4x3) while allocating gadget (node toolbar, owner GtkToolbar)
17:00:11 [2020-09-13T21:00:11.602Z] 
17:00:11 [2020-09-13T21:00:11.602Z] (SWT:1672): Gtk-CRITICAL **: 21:00:11.378: gtk_box_gadget_distribute: assertion 'size >= 0' failed in GtkScrollbar
17:00:11 [2020-09-13T21:00:11.602Z] 
17:00:11 [2020-09-13T21:00:11.602Z] (SWT:1672): Gtk-CRITICAL **: 21:00:11.386: gtk_box_gadget_distribute: assertion 'size >= 0' failed in GtkScrollbar
17:00:11 [2020-09-13T21:00:11.602Z] 
17:00:11 [2020-09-13T21:00:11.602Z] (SWT:1672): Gtk-WARNING **: 21:00:11.390: Negative content width -6 (allocation 1, extents 4x3) while allocating gadget (node toolbar, owner GtkToolbar)
17:00:11 [2020-09-13T21:00:11.602Z] 
17:00:11 [2020-09-13T21:00:11.602Z] (SWT:1672): Gtk-CRITICAL **: 21:00:11.396: gtk_box_gadget_distribute: assertion 'size >= 0' failed in GtkScrollbar
17:00:11 [2020-09-13T21:00:11.602Z] 
17:00:11 [2020-09-13T21:00:11.602Z] (SWT:1672): Gtk-CRITICAL **: 21:00:11.412: gtk_box_gadget_distribute: assertion 'size >= 0' failed in GtkScrollbar
17:00:11 [2020-09-13T21:00:11.602Z] 
17:00:11 [2020-09-13T21:00:11.602Z] (SWT:1672): Gtk-CRITICAL **: 21:00:11.413: gtk_box_gadget_distribute: assertion 'size >= 0' failed in GtkScrollbar
17:00:11 [2020-09-13T21:00:11.602Z] 
17:00:11 [2020-09-13T21:00:11.602Z] (SWT:1672): Gtk-CRITICAL **: 21:00:11.413: gtk_box_gadget_distribute: assertion 'size >= 0' failed in GtkScrollbar
17:00:11 [2020-09-13T21:00:11.602Z] 
17:00:11 [2020-09-13T21:00:11.602Z] (SWT:1672): Gtk-CRITICAL **: 21:00:11.421: gtk_box_gadget_distribute: assertion 'size >= 0' failed in GtkScrollbar
17:00:11 [2020-09-13T21:00:11.602Z] 
17:00:11 [2020-09-13T21:00:11.602Z] (SWT:1672): Gtk-CRITICAL **: 21:00:11.421: gtk_box_gadget_distribute: assertion 'size >= 0' failed in GtkScrollbar
17:00:11 [2020-09-13T21:00:11.602Z] 
17:00:11 [2020-09-13T21:00:11.602Z] (SWT:1672): Gtk-CRITICAL **: 21:00:11.433: gtk_box_gadget_distribute: assertion 'size >= 0' failed in GtkScrollbar
17:00:11 [2020-09-13T21:00:11.602Z] 
17:00:11 [2020-09-13T21:00:11.602Z] (SWT:1672): Gtk-CRITICAL **: 21:00:11.446: gtk_box_gadget_distribute: assertion 'size >= 0' failed in GtkScrollbar
17:00:11 [2020-09-13T21:00:11.602Z] 
17:00:11 [2020-09-13T21:00:11.602Z] (SWT:1672): Gtk-CRITICAL **: 21:00:11.446: gtk_box_gadget_distribute: assertion 'size >= 0' failed in GtkScrollbar
17:00:11 [2020-09-13T21:00:11.602Z] 
17:00:11 [2020-09-13T21:00:11.602Z] (SWT:1672): Gtk-CRITICAL **: 21:00:11.463: gtk_box_gadget_distribute: assertion 'size >= 0' failed in GtkScrollbar
17:00:11 [2020-09-13T21:00:11.602Z] 
17:00:11 [2020-09-13T21:00:11.602Z] (SWT:1672): Gtk-CRITICAL **: 21:00:11.463: gtk_box_gadget_distribute: assertion 'size >= 0' failed in GtkScrollbar
17:00:11 [2020-09-13T21:00:11.602Z] 
17:00:11 [2020-09-13T21:00:11.602Z] (SWT:1672): Gtk-CRITICAL **: 21:00:11.480: gtk_box_gadget_distribute: assertion 'size >= 0' failed in GtkScrollbar
17:00:11 [2020-09-13T21:00:11.602Z] 
17:00:11 [2020-09-13T21:00:11.602Z] (SWT:1672): Gtk-CRITICAL **: 21:00:11.480: gtk_box_gadget_distribute: assertion 'size >= 0' failed in GtkScrollbar
17:00:11 [2020-09-13T21:00:11.602Z] 
17:00:11 [2020-09-13T21:00:11.602Z] (SWT:1672): Gtk-CRITICAL **: 21:00:11.496: gtk_box_gadget_distribute: assertion 'size >= 0' failed in GtkScrollbar
17:00:11 [2020-09-13T21:00:11.602Z] 
17:00:11 [2020-09-13T21:00:11.602Z] (SWT:1672): Gtk-CRITICAL **: 21:00:11.496: gtk_box_gadget_distribute: assertion 'size >= 0' failed in GtkScrollbar
17:00:11 [2020-09-13T21:00:11.602Z] 
17:00:11 [2020-09-13T21:00:11.602Z] (SWT:1672): Gtk-CRITICAL **: 21:00:11.513: gtk_box_gadget_distribute: assertion 'size >= 0' failed in GtkScrollbar
17:00:11 [2020-09-13T21:00:11.602Z] 
17:00:11 [2020-09-13T21:00:11.602Z] (SWT:1672): Gtk-CRITICAL **: 21:00:11.513: gtk_box_gadget_distribute: assertion 'size >= 0' failed in GtkScrollbar
17:00:11 [2020-09-13T21:00:11.602Z] 
17:00:11 [2020-09-13T21:00:11.602Z] (SWT:1672): Gtk-CRITICAL **: 21:00:11.529: gtk_box_gadget_distribute: assertion 'size >= 0' failed in GtkScrollbar
17:00:11 [2020-09-13T21:00:11.602Z] 
17:00:11 [2020-09-13T21:00:11.602Z] (SWT:1672): Gtk-CRITICAL **: 21:00:11.530: gtk_box_gadget_distribute: assertion 'size >= 0' failed in GtkScrollbar
17:00:11 [2020-09-13T21:00:11.602Z] 
17:00:11 [2020-09-13T21:00:11.602Z] (SWT:1672): Gtk-CRITICAL **: 21:00:11.537: gtk_box_gadget_distribute: assertion 'size >= 0' failed in GtkScrollbar
17:00:11 [2020-09-13T21:00:11.602Z] 
17:00:11 [2020-09-13T21:00:11.602Z] (SWT:1672): Gtk-CRITICAL **: 21:00:11.537: gtk_box_gadget_distribute: assertion 'size >= 0' failed in GtkScrollbar
17:00:11 [2020-09-13T21:00:11.602Z] 
17:00:11 [2020-09-13T21:00:11.602Z] (SWT:1672): Gtk-CRITICAL **: 21:00:11.541: gtk_box_gadget_distribute: assertion 'size >= 0' failed in GtkScrollbar
17:00:11 [2020-09-13T21:00:11.602Z] 
17:00:11 [2020-09-13T21:00:11.602Z] (SWT:1672): Gtk-CRITICAL **: 21:00:11.542: gtk_box_gadget_distribute: assertion 'size >= 0' failed in GtkScrollbar
17:00:11 [2020-09-13T21:00:11.602Z] 
17:00:11 [2020-09-13T21:00:11.602Z] (SWT:1672): Gtk-CRITICAL **: 21:00:11.542: gtk_box_gadget_distribute: assertion 'size >= 0' failed in GtkScrollbar
17:00:11 [2020-09-13T21:00:11.602Z] 
17:00:11 [2020-09-13T21:00:11.602Z] (SWT:1672): Gtk-CRITICAL **: 21:00:11.547: gtk_box_gadget_distribute: assertion 'size >= 0' failed in GtkScrollbar
17:00:11 [2020-09-13T21:00:11.602Z] 
17:00:11 [2020-09-13T21:00:11.602Z] (SWT:1672): Gtk-CRITICAL **: 21:00:11.547: gtk_box_gadget_distribute: assertion 'size >= 0' failed in GtkScrollbar
17:00:11 [2020-09-13T21:00:11.602Z] 
17:00:11 [2020-09-13T21:00:11.602Z] (SWT:1672): Gtk-CRITICAL **: 21:00:11.552: gtk_box_gadget_distribute: assertion 'size >= 0' failed in GtkScrollbar
17:00:11 [2020-09-13T21:00:11.603Z] 
17:00:11 [2020-09-13T21:00:11.603Z] (SWT:1672): Gtk-CRITICAL **: 21:00:11.554: gtk_box_gadget_distribute: assertion 'size >= 0' failed in GtkScrollbar
17:00:11 [2020-09-13T21:00:11.603Z] 
17:00:11 [2020-09-13T21:00:11.603Z] (SWT:1672): Gtk-CRITICAL **: 21:00:11.554: gtk_box_gadget_distribute: assertion 'size >= 0' failed in GtkScrollbar
17:00:11 [2020-09-13T21:00:11.603Z] 
17:00:11 [2020-09-13T21:00:11.603Z] (SWT:1672): Gtk-CRITICAL **: 21:00:11.558: gtk_box_gadget_distribute: assertion 'size >= 0' failed in GtkScrollbar
17:00:11 [2020-09-13T21:00:11.603Z] 
17:00:11 [2020-09-13T21:00:11.603Z] (SWT:1672): Gtk-CRITICAL **: 21:00:11.566: gtk_box_gadget_distribute: assertion 'size >= 0' failed in GtkScrollbar
17:00:11 [2020-09-13T21:00:11.603Z] 
17:00:11 [2020-09-13T21:00:11.603Z] (SWT:1672): Gtk-CRITICAL **: 21:00:11.566: gtk_box_gadget_distribute: assertion 'size >= 0' failed in GtkScrollbar
17:00:11 [2020-09-13T21:00:11.603Z] 
17:00:11 [2020-09-13T21:00:11.603Z] (SWT:1672): Gtk-CRITICAL **: 21:00:11.584: gtk_box_gadget_distribute: assertion 'size >= 0' failed in GtkScrollbar
17:00:11 [2020-09-13T21:00:11.603Z] 
17:00:11 [2020-09-13T21:00:11.603Z] (SWT:1672): Gtk-CRITICAL **: 21:00:11.584: gtk_box_gadget_distribute: assertion 'size >= 0' failed in GtkScrollbar
17:00:11 [2020-09-13T21:00:11.603Z] 
17:00:11 [2020-09-13T21:00:11.603Z] (SWT:1672): Gtk-CRITICAL **: 21:00:11.598: gtk_box_gadget_distribute: assertion 'size >= 0' failed in GtkScrollbar
17:00:11 [2020-09-13T21:00:11.603Z] 
17:00:11 [2020-09-13T21:00:11.603Z] (SWT:1672): Gtk-CRITICAL **: 21:00:11.598: gtk_box_gadget_distribute: assertion 'size >= 0' failed in GtkScrollbar
17:00:11 [2020-09-13T21:00:11.860Z] 
17:00:11 [2020-09-13T21:00:11.860Z] (SWT:1672): Gtk-WARNING **: 21:00:11.622: Negative content width -6 (allocation 1, extents 4x3) while allocating gadget (node toolbar, owner GtkToolbar)
17:00:12 [2020-09-13T21:00:12.425Z] 
17:00:12 [2020-09-13T21:00:12.426Z] (SWT:1672): Gtk-WARNING **: 21:00:12.201: Negative content width -6 (allocation 1, extents 4x3) while allocating gadget (node toolbar, owner GtkToolbar)
17:00:12 [2020-09-13T21:00:12.426Z] 
17:00:12 [2020-09-13T21:00:12.426Z] (SWT:1672): Gtk-WARNING **: 21:00:12.210: Negative content width -6 (allocation 1, extents 4x3) while allocating gadget (node toolbar, owner GtkToolbar)
17:00:12 [2020-09-13T21:00:12.991Z] 
17:00:12 [2020-09-13T21:00:12.991Z] (SWT:1672): Gtk-WARNING **: 21:00:12.793: Negative content width -6 (allocation 1, extents 4x3) while allocating gadget (node toolbar, owner GtkToolbar)
17:00:13 [2020-09-13T21:00:13.556Z] 
17:00:13 [2020-09-13T21:00:13.556Z] (SWT:1672): Gtk-CRITICAL **: 21:00:13.321: gtk_box_gadget_distribute: assertion 'size >= 0' failed in GtkScrollbar
17:00:13 [2020-09-13T21:00:13.556Z] 
17:00:13 [2020-09-13T21:00:13.556Z] (SWT:1672): Gtk-CRITICAL **: 21:00:13.328: gtk_box_gadget_distribute: assertion 'size >= 0' failed in GtkScrollbar
17:00:13 [2020-09-13T21:00:13.556Z] 
17:00:13 [2020-09-13T21:00:13.556Z] (SWT:1672): Gtk-WARNING **: 21:00:13.331: Negative content width -6 (allocation 1, extents 4x3) while allocating gadget (node toolbar, owner GtkToolbar)
17:00:13 [2020-09-13T21:00:13.556Z] 
17:00:13 [2020-09-13T21:00:13.556Z] (SWT:1672): Gtk-CRITICAL **: 21:00:13.337: gtk_box_gadget_distribute: assertion 'size >= 0' failed in GtkScrollbar
17:00:13 [2020-09-13T21:00:13.556Z] 
17:00:13 [2020-09-13T21:00:13.556Z] (SWT:1672): Gtk-CRITICAL **: 21:00:13.343: gtk_box_gadget_distribute: assertion 'size >= 0' failed in GtkScrollbar
17:00:13 [2020-09-13T21:00:13.556Z] 
17:00:13 [2020-09-13T21:00:13.556Z] (SWT:1672): Gtk-CRITICAL **: 21:00:13.344: gtk_box_gadget_distribute: assertion 'size >= 0' failed in GtkScrollbar
17:00:13 [2020-09-13T21:00:13.556Z] 
17:00:13 [2020-09-13T21:00:13.556Z] (SWT:1672): Gtk-CRITICAL **: 21:00:13.344: gtk_box_gadget_distribute: assertion 'size >= 0' failed in GtkScrollbar
17:00:13 [2020-09-13T21:00:13.556Z] 
17:00:13 [2020-09-13T21:00:13.556Z] (SWT:1672): Gtk-CRITICAL **: 21:00:13.351: gtk_box_gadget_distribute: assertion 'size >= 0' failed in GtkScrollbar
17:00:13 [2020-09-13T21:00:13.556Z] 
17:00:13 [2020-09-13T21:00:13.556Z] (SWT:1672): Gtk-CRITICAL **: 21:00:13.355: gtk_box_gadget_distribute: assertion 'size >= 0' failed in GtkScrollbar
17:00:13 [2020-09-13T21:00:13.556Z] 
17:00:13 [2020-09-13T21:00:13.556Z] (SWT:1672): Gtk-CRITICAL **: 21:00:13.355: gtk_box_gadget_distribute: assertion 'size >= 0' failed in GtkScrollbar
17:00:13 [2020-09-13T21:00:13.556Z] 
17:00:13 [2020-09-13T21:00:13.556Z] (SWT:1672): Gtk-CRITICAL **: 21:00:13.370: gtk_box_gadget_distribute: assertion 'size >= 0' failed in GtkScrollbar
17:00:13 [2020-09-13T21:00:13.556Z] 
17:00:13 [2020-09-13T21:00:13.556Z] (SWT:1672): Gtk-CRITICAL **: 21:00:13.370: gtk_box_gadget_distribute: assertion 'size >= 0' failed in GtkScrollbar
17:00:13 [2020-09-13T21:00:13.556Z] 
17:00:13 [2020-09-13T21:00:13.556Z] (SWT:1672): Gtk-CRITICAL **: 21:00:13.388: gtk_box_gadget_distribute: assertion 'size >= 0' failed in GtkScrollbar
17:00:13 [2020-09-13T21:00:13.556Z] 
17:00:13 [2020-09-13T21:00:13.556Z] (SWT:1672): Gtk-CRITICAL **: 21:00:13.388: gtk_box_gadget_distribute: assertion 'size >= 0' failed in GtkScrollbar
17:00:13 [2020-09-13T21:00:13.556Z] 
17:00:13 [2020-09-13T21:00:13.556Z] (SWT:1672): Gtk-CRITICAL **: 21:00:13.404: gtk_box_gadget_distribute: assertion 'size >= 0' failed in GtkScrollbar
17:00:13 [2020-09-13T21:00:13.556Z] 
17:00:13 [2020-09-13T21:00:13.556Z] (SWT:1672): Gtk-CRITICAL **: 21:00:13.404: gtk_box_gadget_distribute: assertion 'size >= 0' failed in GtkScrollbar
17:00:13 [2020-09-13T21:00:13.556Z] 
17:00:13 [2020-09-13T21:00:13.556Z] (SWT:1672): Gtk-CRITICAL **: 21:00:13.421: gtk_box_gadget_distribute: assertion 'size >= 0' failed in GtkScrollbar
17:00:13 [2020-09-13T21:00:13.556Z] 
17:00:13 [2020-09-13T21:00:13.556Z] (SWT:1672): Gtk-CRITICAL **: 21:00:13.421: gtk_box_gadget_distribute: assertion 'size >= 0' failed in GtkScrollbar
17:00:13 [2020-09-13T21:00:13.556Z] 
17:00:13 [2020-09-13T21:00:13.556Z] (SWT:1672): Gtk-CRITICAL **: 21:00:13.438: gtk_box_gadget_distribute: assertion 'size >= 0' failed in GtkScrollbar
17:00:13 [2020-09-13T21:00:13.556Z] 
17:00:13 [2020-09-13T21:00:13.556Z] (SWT:1672): Gtk-CRITICAL **: 21:00:13.438: gtk_box_gadget_distribute: assertion 'size >= 0' failed in GtkScrollbar
17:00:13 [2020-09-13T21:00:13.556Z] 
17:00:13 [2020-09-13T21:00:13.556Z] (SWT:1672): Gtk-CRITICAL **: 21:00:13.460: gtk_box_gadget_distribute: assertion 'size >= 0' failed in GtkScrollbar
17:00:13 [2020-09-13T21:00:13.556Z] 
17:00:13 [2020-09-13T21:00:13.556Z] (SWT:1672): Gtk-CRITICAL **: 21:00:13.460: gtk_box_gadget_distribute: assertion 'size >= 0' failed in GtkScrollbar
17:00:13 [2020-09-13T21:00:13.556Z] 
17:00:13 [2020-09-13T21:00:13.556Z] (SWT:1672): Gtk-CRITICAL **: 21:00:13.475: gtk_box_gadget_distribute: assertion 'size >= 0' failed in GtkScrollbar
17:00:13 [2020-09-13T21:00:13.556Z] 
17:00:13 [2020-09-13T21:00:13.556Z] (SWT:1672): Gtk-CRITICAL **: 21:00:13.475: gtk_box_gadget_distribute: assertion 'size >= 0' failed in GtkScrollbar
17:00:13 [2020-09-13T21:00:13.556Z] 
17:00:13 [2020-09-13T21:00:13.556Z] (SWT:1672): Gtk-CRITICAL **: 21:00:13.488: gtk_box_gadget_distribute: assertion 'size >= 0' failed in GtkScrollbar
17:00:13 [2020-09-13T21:00:13.556Z] 
17:00:13 [2020-09-13T21:00:13.556Z] (SWT:1672): Gtk-CRITICAL **: 21:00:13.488: gtk_box_gadget_distribute: assertion 'size >= 0' failed in GtkScrollbar
17:00:13 [2020-09-13T21:00:13.556Z] 
17:00:13 [2020-09-13T21:00:13.556Z] (SWT:1672): Gtk-CRITICAL **: 21:00:13.497: gtk_box_gadget_distribute: assertion 'size >= 0' failed in GtkScrollbar
17:00:13 [2020-09-13T21:00:13.556Z] 
17:00:13 [2020-09-13T21:00:13.556Z] (SWT:1672): Gtk-CRITICAL **: 21:00:13.498: gtk_box_gadget_distribute: assertion 'size >= 0' failed in GtkScrollbar
17:00:13 [2020-09-13T21:00:13.556Z] 
17:00:13 [2020-09-13T21:00:13.556Z] (SWT:1672): Gtk-CRITICAL **: 21:00:13.498: gtk_box_gadget_distribute: assertion 'size >= 0' failed in GtkScrollbar
17:00:13 [2020-09-13T21:00:13.556Z] 
17:00:13 [2020-09-13T21:00:13.556Z] (SWT:1672): Gtk-CRITICAL **: 21:00:13.499: gtk_box_gadget_distribute: assertion 'size >= 0' failed in GtkScrollbar
17:00:13 [2020-09-13T21:00:13.556Z] 
17:00:13 [2020-09-13T21:00:13.556Z] (SWT:1672): Gtk-CRITICAL **: 21:00:13.505: gtk_box_gadget_distribute: assertion 'size >= 0' failed in GtkScrollbar
17:00:13 [2020-09-13T21:00:13.556Z] 
17:00:13 [2020-09-13T21:00:13.556Z] (SWT:1672): Gtk-CRITICAL **: 21:00:13.505: gtk_box_gadget_distribute: assertion 'size >= 0' failed in GtkScrollbar
17:00:13 [2020-09-13T21:00:13.556Z] 
17:00:13 [2020-09-13T21:00:13.556Z] (SWT:1672): Gtk-CRITICAL **: 21:00:13.505: gtk_box_gadget_distribute: assertion 'size >= 0' failed in GtkScrollbar
17:00:13 [2020-09-13T21:00:13.556Z] 
17:00:13 [2020-09-13T21:00:13.556Z] (SWT:1672): Gtk-CRITICAL **: 21:00:13.512: gtk_box_gadget_distribute: assertion 'size >= 0' failed in GtkScrollbar
17:00:13 [2020-09-13T21:00:13.556Z] 
17:00:13 [2020-09-13T21:00:13.556Z] (SWT:1672): Gtk-CRITICAL **: 21:00:13.521: gtk_box_gadget_distribute: assertion 'size >= 0' failed in GtkScrollbar
17:00:13 [2020-09-13T21:00:13.556Z] 
17:00:13 [2020-09-13T21:00:13.556Z] (SWT:1672): Gtk-CRITICAL **: 21:00:13.521: gtk_box_gadget_distribute: assertion 'size >= 0' failed in GtkScrollbar
17:00:13 [2020-09-13T21:00:13.556Z] 
17:00:13 [2020-09-13T21:00:13.556Z] (SWT:1672): Gtk-CRITICAL **: 21:00:13.521: gtk_box_gadget_distribute: assertion 'size >= 0' failed in GtkScrollbar
17:00:13 [2020-09-13T21:00:13.556Z] 
17:00:13 [2020-09-13T21:00:13.556Z] (SWT:1672): Gtk-CRITICAL **: 21:00:13.538: gtk_box_gadget_distribute: assertion 'size >= 0' failed in GtkScrollbar
17:00:13 [2020-09-13T21:00:13.556Z] 
17:00:13 [2020-09-13T21:00:13.556Z] (SWT:1672): Gtk-CRITICAL **: 21:00:13.538: gtk_box_gadget_distribute: assertion 'size >= 0' failed in GtkScrollbar
17:00:13 [2020-09-13T21:00:13.556Z] 
17:00:13 [2020-09-13T21:00:13.556Z] (SWT:1672): Gtk-CRITICAL **: 21:00:13.538: gtk_box_gadget_distribute: assertion 'size >= 0' failed in GtkScrollbar
17:00:13 [2020-09-13T21:00:13.814Z] 
17:00:13 [2020-09-13T21:00:13.814Z] (SWT:1672): Gtk-CRITICAL **: 21:00:13.553: gtk_box_gadget_distribute: assertion 'size >= 0' failed in GtkScrollbar
17:00:13 [2020-09-13T21:00:13.814Z] 
17:00:13 [2020-09-13T21:00:13.814Z] (SWT:1672): Gtk-CRITICAL **: 21:00:13.554: gtk_box_gadget_distribute: assertion 'size >= 0' failed in GtkScrollbar
17:00:13 [2020-09-13T21:00:13.814Z] 
17:00:13 [2020-09-13T21:00:13.814Z] (SWT:1672): Gtk-CRITICAL **: 21:00:13.554: gtk_box_gadget_distribute: assertion 'size >= 0' failed in GtkScrollbar
17:00:13 [2020-09-13T21:00:13.814Z] 
17:00:13 [2020-09-13T21:00:13.814Z] (SWT:1672): Gtk-CRITICAL **: 21:00:13.570: gtk_box_gadget_distribute: assertion 'size >= 0' failed in GtkScrollbar
17:00:13 [2020-09-13T21:00:13.814Z] 
17:00:13 [2020-09-13T21:00:13.814Z] (SWT:1672): Gtk-CRITICAL **: 21:00:13.570: gtk_box_gadget_distribute: assertion 'size >= 0' failed in GtkScrollbar
17:00:13 [2020-09-13T21:00:13.814Z] 
17:00:13 [2020-09-13T21:00:13.814Z] (SWT:1672): Gtk-CRITICAL **: 21:00:13.574: gtk_box_gadget_distribute: assertion 'size >= 0' failed in GtkScrollbar
17:00:13 [2020-09-13T21:00:13.814Z] 
17:00:13 [2020-09-13T21:00:13.814Z] (SWT:1672): Gtk-CRITICAL **: 21:00:13.574: gtk_box_gadget_distribute: assertion 'size >= 0' failed in GtkScrollbar
17:00:13 [2020-09-13T21:00:13.814Z] 
17:00:13 [2020-09-13T21:00:13.814Z] (SWT:1672): Gtk-CRITICAL **: 21:00:13.578: gtk_box_gadget_distribute: assertion 'size >= 0' failed in GtkScrollbar
17:00:13 [2020-09-13T21:00:13.814Z] 
17:00:13 [2020-09-13T21:00:13.814Z] (SWT:1672): Gtk-CRITICAL **: 21:00:13.579: gtk_box_gadget_distribute: assertion 'size >= 0' failed in GtkScrollbar
17:00:13 [2020-09-13T21:00:13.814Z] 
17:00:13 [2020-09-13T21:00:13.814Z] (SWT:1672): Gtk-CRITICAL **: 21:00:13.579: gtk_box_gadget_distribute: assertion 'size >= 0' failed in GtkScrollbar
17:00:13 [2020-09-13T21:00:13.814Z] 
17:00:13 [2020-09-13T21:00:13.814Z] (SWT:1672): Gtk-CRITICAL **: 21:00:13.583: gtk_box_gadget_distribute: assertion 'size >= 0' failed in GtkScrollbar
17:00:13 [2020-09-13T21:00:13.814Z] 
17:00:13 [2020-09-13T21:00:13.814Z] (SWT:1672): Gtk-CRITICAL **: 21:00:13.585: gtk_box_gadget_distribute: assertion 'size >= 0' failed in GtkScrollbar
17:00:13 [2020-09-13T21:00:13.814Z] 
17:00:13 [2020-09-13T21:00:13.814Z] (SWT:1672): Gtk-CRITICAL **: 21:00:13.585: gtk_box_gadget_distribute: assertion 'size >= 0' failed in GtkScrollbar
17:00:13 [2020-09-13T21:00:13.814Z] 
17:00:13 [2020-09-13T21:00:13.814Z] (SWT:1672): Gtk-CRITICAL **: 21:00:13.589: gtk_box_gadget_distribute: assertion 'size >= 0' failed in GtkScrollbar
17:00:13 [2020-09-13T21:00:13.814Z] 
17:00:13 [2020-09-13T21:00:13.814Z] (SWT:1672): Gtk-CRITICAL **: 21:00:13.594: gtk_box_gadget_distribute: assertion 'size >= 0' failed in GtkScrollbar
17:00:13 [2020-09-13T21:00:13.814Z] 
17:00:13 [2020-09-13T21:00:13.814Z] (SWT:1672): Gtk-CRITICAL **: 21:00:13.610: gtk_box_gadget_distribute: assertion 'size >= 0' failed in GtkScrollbar
17:00:13 [2020-09-13T21:00:13.814Z] 
17:00:13 [2020-09-13T21:00:13.814Z] (SWT:1672): Gtk-CRITICAL **: 21:00:13.610: gtk_box_gadget_distribute: assertion 'size >= 0' failed in GtkScrollbar
17:00:13 [2020-09-13T21:00:13.814Z] 
17:00:13 [2020-09-13T21:00:13.814Z] (SWT:1672): Gtk-CRITICAL **: 21:00:13.628: gtk_box_gadget_distribute: assertion 'size >= 0' failed in GtkScrollbar
17:00:13 [2020-09-13T21:00:13.814Z] 
17:00:13 [2020-09-13T21:00:13.814Z] (SWT:1672): Gtk-CRITICAL **: 21:00:13.636: gtk_box_gadget_distribute: assertion 'size >= 0' failed in GtkScrollbar
17:00:13 [2020-09-13T21:00:13.814Z] 
17:00:13 [2020-09-13T21:00:13.814Z] (SWT:1672): Gtk-CRITICAL **: 21:00:13.637: gtk_box_gadget_distribute: assertion 'size >= 0' failed in GtkScrollbar
17:00:13 [2020-09-13T21:00:13.814Z] 
17:00:13 [2020-09-13T21:00:13.814Z] (SWT:1672): Gtk-CRITICAL **: 21:00:13.637: gtk_box_gadget_distribute: assertion 'size >= 0' failed in GtkScrollbar
17:00:13 [2020-09-13T21:00:13.814Z] 
17:00:13 [2020-09-13T21:00:13.814Z] (SWT:1672): Gtk-CRITICAL **: 21:00:13.643: gtk_box_gadget_distribute: assertion 'size >= 0' failed in GtkScrollbar
17:00:13 [2020-09-13T21:00:13.814Z] 
17:00:13 [2020-09-13T21:00:13.814Z] (SWT:1672): Gtk-CRITICAL **: 21:00:13.650: gtk_box_gadget_distribute: assertion 'size >= 0' failed in GtkScrollbar
17:00:13 [2020-09-13T21:00:13.814Z] 
17:00:13 [2020-09-13T21:00:13.814Z] (SWT:1672): Gtk-CRITICAL **: 21:00:13.698: gtk_box_gadget_distribute: assertion 'size >= 0' failed in GtkScrollbar
17:00:13 [2020-09-13T21:00:13.814Z] 
17:00:13 [2020-09-13T21:00:13.814Z] (SWT:1672): Gtk-CRITICAL **: 21:00:13.699: gtk_box_gadget_distribute: assertion 'size >= 0' failed in GtkScrollbar
17:00:13 [2020-09-13T21:00:13.814Z] 
17:00:13 [2020-09-13T21:00:13.814Z] (SWT:1672): Gtk-CRITICAL **: 21:00:13.700: gtk_box_gadget_distribute: assertion 'size >= 0' failed in GtkScrollbar
17:00:13 [2020-09-13T21:00:13.814Z] 
17:00:13 [2020-09-13T21:00:13.814Z] (SWT:1672): Gtk-CRITICAL **: 21:00:13.715: gtk_box_gadget_distribute: assertion 'size >= 0' failed in GtkScrollbar
17:00:13 [2020-09-13T21:00:13.814Z] 
17:00:13 [2020-09-13T21:00:13.814Z] (SWT:1672): Gtk-CRITICAL **: 21:00:13.776: gtk_box_gadget_distribute: assertion 'size >= 0' failed in GtkScrollbar
17:00:13 [2020-09-13T21:00:13.814Z] 
17:00:13 [2020-09-13T21:00:13.814Z] (SWT:1672): Gtk-CRITICAL **: 21:00:13.776: gtk_box_gadget_distribute: assertion 'size >= 0' failed in GtkScrollbar
17:00:13 [2020-09-13T21:00:13.814Z] 
17:00:13 [2020-09-13T21:00:13.814Z] (SWT:1672): Gtk-CRITICAL **: 21:00:13.777: gtk_box_gadget_distribute: assertion 'size >= 0' failed in GtkScrollbar
17:00:13 [2020-09-13T21:00:13.814Z] 
17:00:13 [2020-09-13T21:00:13.814Z] (SWT:1672): Gtk-CRITICAL **: 21:00:13.794: gtk_box_gadget_distribute: assertion 'size >= 0' failed in GtkScrollbar
17:00:14 [2020-09-13T21:00:14.071Z] 
17:00:14 [2020-09-13T21:00:14.071Z] (SWT:1672): Gtk-CRITICAL **: 21:00:13.871: gtk_box_gadget_distribute: assertion 'size >= 0' failed in GtkScrollbar
17:00:14 [2020-09-13T21:00:14.071Z] 
17:00:14 [2020-09-13T21:00:14.071Z] (SWT:1672): Gtk-CRITICAL **: 21:00:13.884: gtk_box_gadget_distribute: assertion 'size >= 0' failed in GtkScrollbar
17:00:14 [2020-09-13T21:00:14.071Z] 
17:00:14 [2020-09-13T21:00:14.071Z] (SWT:1672): Gtk-CRITICAL **: 21:00:13.897: gtk_box_gadget_distribute: assertion 'size >= 0' failed in GtkScrollbar
17:00:14 [2020-09-13T21:00:14.071Z] 
17:00:14 [2020-09-13T21:00:14.071Z] (SWT:1672): Gtk-CRITICAL **: 21:00:13.897: gtk_box_gadget_distribute: assertion 'size >= 0' failed in GtkScrollbar
17:00:14 [2020-09-13T21:00:14.071Z] 
17:00:14 [2020-09-13T21:00:14.071Z] (SWT:1672): Gtk-CRITICAL **: 21:00:13.898: gtk_box_gadget_distribute: assertion 'size >= 0' failed in GtkScrollbar
17:00:14 [2020-09-13T21:00:14.071Z] 
17:00:14 [2020-09-13T21:00:14.071Z] (SWT:1672): Gtk-CRITICAL **: 21:00:13.898: gtk_box_gadget_distribute: assertion 'size >= 0' failed in GtkScrollbar
17:00:14 [2020-09-13T21:00:14.071Z] 
17:00:14 [2020-09-13T21:00:14.071Z] (SWT:1672): Gtk-CRITICAL **: 21:00:13.899: gtk_box_gadget_distribute: assertion 'size >= 0' failed in GtkScrollbar
17:00:14 [2020-09-13T21:00:14.071Z] 
17:00:14 [2020-09-13T21:00:14.071Z] (SWT:1672): Gtk-CRITICAL **: 21:00:13.899: gtk_box_gadget_distribute: assertion 'size >= 0' failed in GtkScrollbar
17:00:14 [2020-09-13T21:00:14.071Z] 
17:00:14 [2020-09-13T21:00:14.071Z] (SWT:1672): Gtk-CRITICAL **: 21:00:13.906: gtk_box_gadget_distribute: assertion 'size >= 0' failed in GtkScrollbar
17:00:14 [2020-09-13T21:00:14.071Z] 
17:00:14 [2020-09-13T21:00:14.071Z] (SWT:1672): Gtk-CRITICAL **: 21:00:13.914: gtk_box_gadget_distribute: assertion 'size >= 0' failed in GtkScrollbar
17:00:14 [2020-09-13T21:00:14.071Z] 
17:00:14 [2020-09-13T21:00:14.071Z] (SWT:1672): Gtk-CRITICAL **: 21:00:14.002: gtk_box_gadget_distribute: assertion 'size >= 0' failed in GtkScrollbar
17:00:14 [2020-09-13T21:00:14.071Z] 
17:00:14 [2020-09-13T21:00:14.071Z] (SWT:1672): Gtk-CRITICAL **: 21:00:14.002: gtk_box_gadget_distribute: assertion 'size >= 0' failed in GtkScrollbar
17:00:14 [2020-09-13T21:00:14.071Z] 
17:00:14 [2020-09-13T21:00:14.071Z] (SWT:1672): Gtk-CRITICAL **: 21:00:14.016: gtk_box_gadget_distribute: assertion 'size >= 0' failed in GtkScrollbar
17:00:14 [2020-09-13T21:00:14.071Z] 
17:00:14 [2020-09-13T21:00:14.071Z] (SWT:1672): Gtk-CRITICAL **: 21:00:14.020: gtk_box_gadget_distribute: assertion 'size >= 0' failed in GtkScrollbar
17:00:14 [2020-09-13T21:00:14.071Z] 
17:00:14 [2020-09-13T21:00:14.071Z] (SWT:1672): Gtk-CRITICAL **: 21:00:14.020: gtk_box_gadget_distribute: assertion 'size >= 0' failed in GtkScrollbar
17:00:14 [2020-09-13T21:00:14.071Z] 
17:00:14 [2020-09-13T21:00:14.071Z] (SWT:1672): Gtk-CRITICAL **: 21:00:14.032: gtk_box_gadget_distribute: assertion 'size >= 0' failed in GtkScrollbar
17:00:14 [2020-09-13T21:00:14.071Z] 
17:00:14 [2020-09-13T21:00:14.071Z] (SWT:1672): Gtk-CRITICAL **: 21:00:14.033: gtk_box_gadget_distribute: assertion 'size >= 0' failed in GtkScrollbar
17:00:14 [2020-09-13T21:00:14.071Z] 
17:00:14 [2020-09-13T21:00:14.071Z] (SWT:1672): Gtk-CRITICAL **: 21:00:14.034: gtk_box_gadget_distribute: assertion 'size >= 0' failed in GtkScrollbar
17:00:14 [2020-09-13T21:00:14.071Z] 
17:00:14 [2020-09-13T21:00:14.071Z] (SWT:1672): Gtk-CRITICAL **: 21:00:14.039: gtk_box_gadget_distribute: assertion 'size >= 0' failed in GtkScrollbar
17:00:14 [2020-09-13T21:00:14.328Z] 
17:00:14 [2020-09-13T21:00:14.328Z] (SWT:1672): Gtk-WARNING **: 21:00:14.081: Negative content width -6 (allocation 1, extents 4x3) while allocating gadget (node toolbar, owner GtkToolbar)
17:00:14 [2020-09-13T21:00:14.586Z] 
17:00:14 [2020-09-13T21:00:14.586Z] (SWT:1672): Gtk-WARNING **: 21:00:14.452: Negative content width -6 (allocation 1, extents 4x3) while allocating gadget (node toolbar, owner GtkToolbar)
17:00:14 [2020-09-13T21:00:14.586Z] 
17:00:14 [2020-09-13T21:00:14.586Z] (SWT:1672): Gtk-WARNING **: 21:00:14.462: Negative content width -6 (allocation 1, extents 4x3) while allocating gadget (node toolbar, owner GtkToolbar)
17:00:14 [2020-09-13T21:00:14.843Z] Tests run: 11, Failures: 0, Errors: 0, Skipped: 0, Time elapsed: 22.569 s - in org.eclipse.egit.ui.test.stagview.StagingViewTest
17:00:14 [2020-09-13T21:00:14.844Z] testAmend(org.eclipse.egit.ui.test.stagview.StagingViewTest)  Time elapsed: 2.851 s
17:00:14 [2020-09-13T21:00:14.844Z] testButtonEnablement(org.eclipse.egit.ui.test.stagview.StagingViewTest)  Time elapsed: 1.669 s
17:00:14 [2020-09-13T21:00:14.844Z] testCommitSingleFile(org.eclipse.egit.ui.test.stagview.StagingViewTest)  Time elapsed: 1.932 s
17:00:14 [2020-09-13T21:00:14.844Z] testMergeConflict(org.eclipse.egit.ui.test.stagview.StagingViewTest)  Time elapsed: 3.272 s
17:00:14 [2020-09-13T21:00:14.844Z] testCommitMessageConfigChangeAmending(org.eclipse.egit.ui.test.stagview.StagingViewTest)  Time elapsed: 2.009 s
17:00:14 [2020-09-13T21:00:14.844Z] testCommitMessageConfigChangeWithAuthor(org.eclipse.egit.ui.test.stagview.StagingViewTest)  Time elapsed: 1.64 s
17:00:14 [2020-09-13T21:00:14.844Z] testCommitMessageConfigChange(org.eclipse.egit.ui.test.stagview.StagingViewTest)  Time elapsed: 1.817 s
17:00:14 [2020-09-13T21:00:14.844Z] testCommitMessageConfigChangeBranchSwitchToNew(org.eclipse.egit.ui.test.stagview.StagingViewTest)  Time elapsed: 1.856 s
17:00:14 [2020-09-13T21:00:14.844Z] testCommitMessageCommitterChangeSignOff(org.eclipse.egit.ui.test.stagview.StagingViewTest)  Time elapsed: 1.536 s
17:00:14 [2020-09-13T21:00:14.844Z] testCommitMessageConfigChangeNoSignOff(org.eclipse.egit.ui.test.stagview.StagingViewTest)  Time elapsed: 1.711 s
17:00:14 [2020-09-13T21:00:14.844Z] testDeleteModifyConflict(org.eclipse.egit.ui.test.stagview.StagingViewTest)  Time elapsed: 2.249 s
17:00:14 [2020-09-13T21:00:14.844Z] Running org.eclipse.egit.ui.test.stagview.CommitMessageProvidersTest
17:00:15 [2020-09-13T21:00:15.101Z] 
17:00:15 [2020-09-13T21:00:15.101Z] (SWT:1672): Gtk-WARNING **: 21:00:15.078: Negative content width -6 (allocation 1, extents 4x3) while allocating gadget (node toolbar, owner GtkToolbar)
17:00:15 [2020-09-13T21:00:15.667Z] 
17:00:15 [2020-09-13T21:00:15.667Z] (SWT:1672): Gtk-CRITICAL **: 21:00:15.553: gtk_box_gadget_distribute: assertion 'size >= 0' failed in GtkScrollbar
17:00:15 [2020-09-13T21:00:15.667Z] 
17:00:15 [2020-09-13T21:00:15.667Z] (SWT:1672): Gtk-CRITICAL **: 21:00:15.560: gtk_box_gadget_distribute: assertion 'size >= 0' failed in GtkScrollbar
17:00:15 [2020-09-13T21:00:15.667Z] 
17:00:15 [2020-09-13T21:00:15.667Z] (SWT:1672): Gtk-WARNING **: 21:00:15.564: Negative content width -6 (allocation 1, extents 4x3) while allocating gadget (node toolbar, owner GtkToolbar)
17:00:15 [2020-09-13T21:00:15.667Z] 
17:00:15 [2020-09-13T21:00:15.667Z] (SWT:1672): Gtk-CRITICAL **: 21:00:15.570: gtk_box_gadget_distribute: assertion 'size >= 0' failed in GtkScrollbar
17:00:15 [2020-09-13T21:00:15.667Z] 
17:00:15 [2020-09-13T21:00:15.667Z] (SWT:1672): Gtk-CRITICAL **: 21:00:15.584: gtk_box_gadget_distribute: assertion 'size >= 0' failed in GtkScrollbar
17:00:15 [2020-09-13T21:00:15.667Z] 
17:00:15 [2020-09-13T21:00:15.667Z] (SWT:1672): Gtk-CRITICAL **: 21:00:15.585: gtk_box_gadget_distribute: assertion 'size >= 0' failed in GtkScrollbar
17:00:15 [2020-09-13T21:00:15.667Z] 
17:00:15 [2020-09-13T21:00:15.667Z] (SWT:1672): Gtk-CRITICAL **: 21:00:15.586: gtk_box_gadget_distribute: assertion 'size >= 0' failed in GtkScrollbar
17:00:15 [2020-09-13T21:00:15.667Z] 
17:00:15 [2020-09-13T21:00:15.667Z] (SWT:1672): Gtk-CRITICAL **: 21:00:15.586: gtk_box_gadget_distribute: assertion 'size >= 0' failed in GtkScrollbar
17:00:15 [2020-09-13T21:00:15.667Z] 
17:00:15 [2020-09-13T21:00:15.667Z] (SWT:1672): Gtk-CRITICAL **: 21:00:15.587: gtk_box_gadget_distribute: assertion 'size >= 0' failed in GtkScrollbar
17:00:15 [2020-09-13T21:00:15.667Z] 
17:00:15 [2020-09-13T21:00:15.667Z] (SWT:1672): Gtk-CRITICAL **: 21:00:15.594: gtk_box_gadget_distribute: assertion 'size >= 0' failed in GtkScrollbar
17:00:15 [2020-09-13T21:00:15.667Z] 
17:00:15 [2020-09-13T21:00:15.667Z] (SWT:1672): Gtk-CRITICAL **: 21:00:15.595: gtk_box_gadget_distribute: assertion 'size >= 0' failed in GtkScrollbar
17:00:15 [2020-09-13T21:00:15.667Z] 
17:00:15 [2020-09-13T21:00:15.667Z] (SWT:1672): Gtk-CRITICAL **: 21:00:15.610: gtk_box_gadget_distribute: assertion 'size >= 0' failed in GtkScrollbar
17:00:15 [2020-09-13T21:00:15.667Z] 
17:00:15 [2020-09-13T21:00:15.667Z] (SWT:1672): Gtk-CRITICAL **: 21:00:15.619: gtk_box_gadget_distribute: assertion 'size >= 0' failed in GtkScrollbar
17:00:15 [2020-09-13T21:00:15.667Z] 
17:00:15 [2020-09-13T21:00:15.667Z] (SWT:1672): Gtk-CRITICAL **: 21:00:15.620: gtk_box_gadget_distribute: assertion 'size >= 0' failed in GtkScrollbar
17:00:15 [2020-09-13T21:00:15.667Z] 
17:00:15 [2020-09-13T21:00:15.667Z] (SWT:1672): Gtk-CRITICAL **: 21:00:15.636: gtk_box_gadget_distribute: assertion 'size >= 0' failed in GtkScrollbar
17:00:15 [2020-09-13T21:00:15.667Z] 
17:00:15 [2020-09-13T21:00:15.667Z] (SWT:1672): Gtk-CRITICAL **: 21:00:15.636: gtk_box_gadget_distribute: assertion 'size >= 0' failed in GtkScrollbar
17:00:15 [2020-09-13T21:00:15.667Z] 
17:00:15 [2020-09-13T21:00:15.667Z] (SWT:1672): Gtk-CRITICAL **: 21:00:15.653: gtk_box_gadget_distribute: assertion 'size >= 0' failed in GtkScrollbar
17:00:15 [2020-09-13T21:00:15.667Z] 
17:00:15 [2020-09-13T21:00:15.667Z] (SWT:1672): Gtk-CRITICAL **: 21:00:15.653: gtk_box_gadget_distribute: assertion 'size >= 0' failed in GtkScrollbar
17:00:15 [2020-09-13T21:00:15.924Z] 
17:00:15 [2020-09-13T21:00:15.924Z] (SWT:1672): Gtk-CRITICAL **: 21:00:15.669: gtk_box_gadget_distribute: assertion 'size >= 0' failed in GtkScrollbar
17:00:15 [2020-09-13T21:00:15.924Z] 
17:00:15 [2020-09-13T21:00:15.924Z] (SWT:1672): Gtk-CRITICAL **: 21:00:15.669: gtk_box_gadget_distribute: assertion 'size >= 0' failed in GtkScrollbar
17:00:15 [2020-09-13T21:00:15.924Z] 
17:00:15 [2020-09-13T21:00:15.924Z] (SWT:1672): Gtk-CRITICAL **: 21:00:15.686: gtk_box_gadget_distribute: assertion 'size >= 0' failed in GtkScrollbar
17:00:15 [2020-09-13T21:00:15.924Z] 
17:00:15 [2020-09-13T21:00:15.924Z] (SWT:1672): Gtk-CRITICAL **: 21:00:15.686: gtk_box_gadget_distribute: assertion 'size >= 0' failed in GtkScrollbar
17:00:15 [2020-09-13T21:00:15.924Z] 
17:00:15 [2020-09-13T21:00:15.924Z] (SWT:1672): Gtk-CRITICAL **: 21:00:15.703: gtk_box_gadget_distribute: assertion 'size >= 0' failed in GtkScrollbar
17:00:15 [2020-09-13T21:00:15.924Z] 
17:00:15 [2020-09-13T21:00:15.924Z] (SWT:1672): Gtk-CRITICAL **: 21:00:15.703: gtk_box_gadget_distribute: assertion 'size >= 0' failed in GtkScrollbar
17:00:15 [2020-09-13T21:00:15.924Z] 
17:00:15 [2020-09-13T21:00:15.924Z] (SWT:1672): Gtk-CRITICAL **: 21:00:15.730: gtk_box_gadget_distribute: assertion 'size >= 0' failed in GtkScrollbar
17:00:15 [2020-09-13T21:00:15.924Z] 
17:00:15 [2020-09-13T21:00:15.924Z] (SWT:1672): Gtk-CRITICAL **: 21:00:15.730: gtk_box_gadget_distribute: assertion 'size >= 0' failed in GtkScrollbar
17:00:15 [2020-09-13T21:00:15.924Z] 
17:00:15 [2020-09-13T21:00:15.924Z] (SWT:1672): Gtk-CRITICAL **: 21:00:15.736: gtk_box_gadget_distribute: assertion 'size >= 0' failed in GtkScrollbar
17:00:15 [2020-09-13T21:00:15.924Z] 
17:00:15 [2020-09-13T21:00:15.924Z] (SWT:1672): Gtk-CRITICAL **: 21:00:15.737: gtk_box_gadget_distribute: assertion 'size >= 0' failed in GtkScrollbar
17:00:15 [2020-09-13T21:00:15.924Z] 
17:00:15 [2020-09-13T21:00:15.924Z] (SWT:1672): Gtk-CRITICAL **: 21:00:15.752: gtk_box_gadget_distribute: assertion 'size >= 0' failed in GtkScrollbar
17:00:15 [2020-09-13T21:00:15.924Z] 
17:00:15 [2020-09-13T21:00:15.924Z] (SWT:1672): Gtk-CRITICAL **: 21:00:15.752: gtk_box_gadget_distribute: assertion 'size >= 0' failed in GtkScrollbar
17:00:15 [2020-09-13T21:00:15.924Z] 
17:00:15 [2020-09-13T21:00:15.924Z] (SWT:1672): Gtk-CRITICAL **: 21:00:15.770: gtk_box_gadget_distribute: assertion 'size >= 0' failed in GtkScrollbar
17:00:15 [2020-09-13T21:00:15.924Z] 
17:00:15 [2020-09-13T21:00:15.924Z] (SWT:1672): Gtk-CRITICAL **: 21:00:15.770: gtk_box_gadget_distribute: assertion 'size >= 0' failed in GtkScrollbar
17:00:15 [2020-09-13T21:00:15.924Z] 
17:00:15 [2020-09-13T21:00:15.924Z] (SWT:1672): Gtk-CRITICAL **: 21:00:15.787: gtk_box_gadget_distribute: assertion 'size >= 0' failed in GtkScrollbar
17:00:15 [2020-09-13T21:00:15.924Z] 
17:00:15 [2020-09-13T21:00:15.924Z] (SWT:1672): Gtk-CRITICAL **: 21:00:15.788: gtk_box_gadget_distribute: assertion 'size >= 0' failed in GtkScrollbar
17:00:15 [2020-09-13T21:00:15.924Z] 
17:00:15 [2020-09-13T21:00:15.924Z] (SWT:1672): Gtk-CRITICAL **: 21:00:15.796: gtk_box_gadget_distribute: assertion 'size >= 0' failed in GtkScrollbar
17:00:15 [2020-09-13T21:00:15.924Z] 
17:00:15 [2020-09-13T21:00:15.924Z] (SWT:1672): Gtk-CRITICAL **: 21:00:15.796: gtk_box_gadget_distribute: assertion 'size >= 0' failed in GtkScrollbar
17:00:15 [2020-09-13T21:00:15.924Z] 
17:00:15 [2020-09-13T21:00:15.924Z] (SWT:1672): Gtk-CRITICAL **: 21:00:15.796: gtk_box_gadget_distribute: assertion 'size >= 0' failed in GtkScrollbar
17:00:15 [2020-09-13T21:00:15.924Z] 
17:00:15 [2020-09-13T21:00:15.924Z] (SWT:1672): Gtk-WARNING **: 21:00:15.862: Negative content width -6 (allocation 1, extents 4x3) while allocating gadget (node toolbar, owner GtkToolbar)
17:00:16 [2020-09-13T21:00:16.487Z] 
17:00:16 [2020-09-13T21:00:16.487Z] (SWT:1672): Gtk-WARNING **: 21:00:16.375: Negative content width -6 (allocation 1, extents 4x3) while allocating gadget (node toolbar, owner GtkToolbar)
17:00:16 [2020-09-13T21:00:16.488Z] 
17:00:16 [2020-09-13T21:00:16.488Z] (SWT:1672): Gtk-WARNING **: 21:00:16.386: Negative content width -6 (allocation 1, extents 4x3) while allocating gadget (node toolbar, owner GtkToolbar)
17:00:17 [2020-09-13T21:00:17.054Z] 
17:00:17 [2020-09-13T21:00:17.054Z] (SWT:1672): Gtk-WARNING **: 21:00:16.978: Negative content width -6 (allocation 1, extents 4x3) while allocating gadget (node toolbar, owner GtkToolbar)
17:00:17 [2020-09-13T21:00:17.627Z] 
17:00:17 [2020-09-13T21:00:17.628Z] (SWT:1672): Gtk-CRITICAL **: 21:00:17.325: gtk_box_gadget_distribute: assertion 'size >= 0' failed in GtkScrollbar
17:00:17 [2020-09-13T21:00:17.628Z] 
17:00:17 [2020-09-13T21:00:17.628Z] (SWT:1672): Gtk-CRITICAL **: 21:00:17.333: gtk_box_gadget_distribute: assertion 'size >= 0' failed in GtkScrollbar
17:00:17 [2020-09-13T21:00:17.628Z] 
17:00:17 [2020-09-13T21:00:17.628Z] (SWT:1672): Gtk-WARNING **: 21:00:17.336: Negative content width -6 (allocation 1, extents 4x3) while allocating gadget (node toolbar, owner GtkToolbar)
17:00:17 [2020-09-13T21:00:17.628Z] 
17:00:17 [2020-09-13T21:00:17.628Z] (SWT:1672): Gtk-CRITICAL **: 21:00:17.342: gtk_box_gadget_distribute: assertion 'size >= 0' failed in GtkScrollbar
17:00:17 [2020-09-13T21:00:17.628Z] 
17:00:17 [2020-09-13T21:00:17.628Z] (SWT:1672): Gtk-CRITICAL **: 21:00:17.348: gtk_box_gadget_distribute: assertion 'size >= 0' failed in GtkScrollbar
17:00:17 [2020-09-13T21:00:17.628Z] 
17:00:17 [2020-09-13T21:00:17.628Z] !ENTRY org.eclipse.egit.ui 2 0 2020-09-13 21:00:17.354
17:00:17 [2020-09-13T21:00:17.628Z] !MESSAGE Found multiple implementations of ICommitMessageProvider2. Ignoring caret positioning for org.eclipse.egit.ui.test.stagview.CommitMessageProvidersTest$TestCommitMessageProvider.
17:00:17 [2020-09-13T21:00:17.628Z] 
17:00:17 [2020-09-13T21:00:17.628Z] (SWT:1672): Gtk-CRITICAL **: 21:00:17.355: gtk_box_gadget_distribute: assertion 'size >= 0' failed in GtkScrollbar
17:00:17 [2020-09-13T21:00:17.628Z] 
17:00:17 [2020-09-13T21:00:17.628Z] (SWT:1672): Gtk-CRITICAL **: 21:00:17.355: gtk_box_gadget_distribute: assertion 'size >= 0' failed in GtkScrollbar
17:00:17 [2020-09-13T21:00:17.628Z] 
17:00:17 [2020-09-13T21:00:17.628Z] (SWT:1672): Gtk-CRITICAL **: 21:00:17.357: gtk_box_gadget_distribute: assertion 'size >= 0' failed in GtkScrollbar
17:00:17 [2020-09-13T21:00:17.628Z] 
17:00:17 [2020-09-13T21:00:17.628Z] (SWT:1672): Gtk-CRITICAL **: 21:00:17.357: gtk_box_gadget_distribute: assertion 'size >= 0' failed in GtkScrollbar
17:00:17 [2020-09-13T21:00:17.628Z] 
17:00:17 [2020-09-13T21:00:17.628Z] (SWT:1672): Gtk-CRITICAL **: 21:00:17.367: gtk_box_gadget_distribute: assertion 'size >= 0' failed in GtkScrollbar
17:00:17 [2020-09-13T21:00:17.628Z] 
17:00:17 [2020-09-13T21:00:17.628Z] (SWT:1672): Gtk-CRITICAL **: 21:00:17.367: gtk_box_gadget_distribute: assertion 'size >= 0' failed in GtkScrollbar
17:00:17 [2020-09-13T21:00:17.628Z] 
17:00:17 [2020-09-13T21:00:17.628Z] (SWT:1672): Gtk-CRITICAL **: 21:00:17.383: gtk_box_gadget_distribute: assertion 'size >= 0' failed in GtkScrollbar
17:00:17 [2020-09-13T21:00:17.628Z] 
17:00:17 [2020-09-13T21:00:17.628Z] (SWT:1672): Gtk-CRITICAL **: 21:00:17.392: gtk_box_gadget_distribute: assertion 'size >= 0' failed in GtkScrollbar
17:00:17 [2020-09-13T21:00:17.628Z] 
17:00:17 [2020-09-13T21:00:17.628Z] (SWT:1672): Gtk-CRITICAL **: 21:00:17.392: gtk_box_gadget_distribute: assertion 'size >= 0' failed in GtkScrollbar
17:00:17 [2020-09-13T21:00:17.628Z] 
17:00:17 [2020-09-13T21:00:17.628Z] (SWT:1672): Gtk-CRITICAL **: 21:00:17.407: gtk_box_gadget_distribute: assertion 'size >= 0' failed in GtkScrollbar
17:00:17 [2020-09-13T21:00:17.628Z] 
17:00:17 [2020-09-13T21:00:17.628Z] (SWT:1672): Gtk-CRITICAL **: 21:00:17.408: gtk_box_gadget_distribute: assertion 'size >= 0' failed in GtkScrollbar
17:00:17 [2020-09-13T21:00:17.628Z] 
17:00:17 [2020-09-13T21:00:17.628Z] (SWT:1672): Gtk-CRITICAL **: 21:00:17.425: gtk_box_gadget_distribute: assertion 'size >= 0' failed in GtkScrollbar
17:00:17 [2020-09-13T21:00:17.628Z] 
17:00:17 [2020-09-13T21:00:17.628Z] (SWT:1672): Gtk-CRITICAL **: 21:00:17.425: gtk_box_gadget_distribute: assertion 'size >= 0' failed in GtkScrollbar
17:00:17 [2020-09-13T21:00:17.628Z] 
17:00:17 [2020-09-13T21:00:17.628Z] (SWT:1672): Gtk-CRITICAL **: 21:00:17.441: gtk_box_gadget_distribute: assertion 'size >= 0' failed in GtkScrollbar
17:00:17 [2020-09-13T21:00:17.628Z] 
17:00:17 [2020-09-13T21:00:17.628Z] (SWT:1672): Gtk-CRITICAL **: 21:00:17.441: gtk_box_gadget_distribute: assertion 'size >= 0' failed in GtkScrollbar
17:00:17 [2020-09-13T21:00:17.628Z] 
17:00:17 [2020-09-13T21:00:17.628Z] (SWT:1672): Gtk-CRITICAL **: 21:00:17.457: gtk_box_gadget_distribute: assertion 'size >= 0' failed in GtkScrollbar
17:00:17 [2020-09-13T21:00:17.628Z] 
17:00:17 [2020-09-13T21:00:17.628Z] (SWT:1672): Gtk-CRITICAL **: 21:00:17.457: gtk_box_gadget_distribute: assertion 'size >= 0' failed in GtkScrollbar
17:00:17 [2020-09-13T21:00:17.628Z] 
17:00:17 [2020-09-13T21:00:17.628Z] (SWT:1672): Gtk-CRITICAL **: 21:00:17.474: gtk_box_gadget_distribute: assertion 'size >= 0' failed in GtkScrollbar
17:00:17 [2020-09-13T21:00:17.628Z] 
17:00:17 [2020-09-13T21:00:17.628Z] (SWT:1672): Gtk-CRITICAL **: 21:00:17.474: gtk_box_gadget_distribute: assertion 'size >= 0' failed in GtkScrollbar
17:00:17 [2020-09-13T21:00:17.628Z] 
17:00:17 [2020-09-13T21:00:17.628Z] (SWT:1672): Gtk-CRITICAL **: 21:00:17.498: gtk_box_gadget_distribute: assertion 'size >= 0' failed in GtkScrollbar
17:00:17 [2020-09-13T21:00:17.628Z] 
17:00:17 [2020-09-13T21:00:17.628Z] (SWT:1672): Gtk-CRITICAL **: 21:00:17.498: gtk_box_gadget_distribute: assertion 'size >= 0' failed in GtkScrollbar
17:00:17 [2020-09-13T21:00:17.628Z] 
17:00:17 [2020-09-13T21:00:17.628Z] (SWT:1672): Gtk-CRITICAL **: 21:00:17.508: gtk_box_gadget_distribute: assertion 'size >= 0' failed in GtkScrollbar
17:00:17 [2020-09-13T21:00:17.628Z] 
17:00:17 [2020-09-13T21:00:17.628Z] (SWT:1672): Gtk-CRITICAL **: 21:00:17.508: gtk_box_gadget_distribute: assertion 'size >= 0' failed in GtkScrollbar
17:00:17 [2020-09-13T21:00:17.628Z] 
17:00:17 [2020-09-13T21:00:17.628Z] (SWT:1672): Gtk-CRITICAL **: 21:00:17.525: gtk_box_gadget_distribute: assertion 'size >= 0' failed in GtkScrollbar
17:00:17 [2020-09-13T21:00:17.628Z] 
17:00:17 [2020-09-13T21:00:17.628Z] (SWT:1672): Gtk-CRITICAL **: 21:00:17.525: gtk_box_gadget_distribute: assertion 'size >= 0' failed in GtkScrollbar
17:00:17 [2020-09-13T21:00:17.628Z] 
17:00:17 [2020-09-13T21:00:17.628Z] (SWT:1672): Gtk-CRITICAL **: 21:00:17.541: gtk_box_gadget_distribute: assertion 'size >= 0' failed in GtkScrollbar
17:00:17 [2020-09-13T21:00:17.628Z] 
17:00:17 [2020-09-13T21:00:17.628Z] (SWT:1672): Gtk-CRITICAL **: 21:00:17.541: gtk_box_gadget_distribute: assertion 'size >= 0' failed in GtkScrollbar
17:00:17 [2020-09-13T21:00:17.628Z] 
17:00:17 [2020-09-13T21:00:17.628Z] (SWT:1672): Gtk-CRITICAL **: 21:00:17.558: gtk_box_gadget_distribute: assertion 'size >= 0' failed in GtkScrollbar
17:00:17 [2020-09-13T21:00:17.628Z] 
17:00:17 [2020-09-13T21:00:17.628Z] (SWT:1672): Gtk-CRITICAL **: 21:00:17.559: gtk_box_gadget_distribute: assertion 'size >= 0' failed in GtkScrollbar
17:00:17 [2020-09-13T21:00:17.628Z] 
17:00:17 [2020-09-13T21:00:17.628Z] (SWT:1672): Gtk-CRITICAL **: 21:00:17.577: gtk_box_gadget_distribute: assertion 'size >= 0' failed in GtkScrollbar
17:00:17 [2020-09-13T21:00:17.628Z] 
17:00:17 [2020-09-13T21:00:17.628Z] (SWT:1672): Gtk-CRITICAL **: 21:00:17.577: gtk_box_gadget_distribute: assertion 'size >= 0' failed in GtkScrollbar
17:00:17 [2020-09-13T21:00:17.628Z] 
17:00:17 [2020-09-13T21:00:17.628Z] (SWT:1672): Gtk-CRITICAL **: 21:00:17.585: gtk_box_gadget_distribute: assertion 'size >= 0' failed in GtkScrollbar
17:00:17 [2020-09-13T21:00:17.628Z] 
17:00:17 [2020-09-13T21:00:17.628Z] (SWT:1672): Gtk-CRITICAL **: 21:00:17.585: gtk_box_gadget_distribute: assertion 'size >= 0' failed in GtkScrollbar
17:00:17 [2020-09-13T21:00:17.628Z] 
17:00:17 [2020-09-13T21:00:17.628Z] (SWT:1672): Gtk-CRITICAL **: 21:00:17.585: gtk_box_gadget_distribute: assertion 'size >= 0' failed in GtkScrollbar
17:00:17 [2020-09-13T21:00:17.886Z] 
17:00:17 [2020-09-13T21:00:17.886Z] (SWT:1672): Gtk-WARNING **: 21:00:17.651: Negative content width -6 (allocation 1, extents 4x3) while allocating gadget (node toolbar, owner GtkToolbar)
17:00:18 [2020-09-13T21:00:18.451Z] 
17:00:18 [2020-09-13T21:00:18.451Z] (SWT:1672): Gtk-WARNING **: 21:00:18.150: Negative content width -6 (allocation 1, extents 4x3) while allocating gadget (node toolbar, owner GtkToolbar)
17:00:18 [2020-09-13T21:00:18.451Z] 
17:00:18 [2020-09-13T21:00:18.451Z] (SWT:1672): Gtk-WARNING **: 21:00:18.161: Negative content width -6 (allocation 1, extents 4x3) while allocating gadget (node toolbar, owner GtkToolbar)
17:00:19 [2020-09-13T21:00:19.016Z] 
17:00:19 [2020-09-13T21:00:19.016Z] (SWT:1672): Gtk-WARNING **: 21:00:18.752: Negative content width -6 (allocation 1, extents 4x3) while allocating gadget (node toolbar, owner GtkToolbar)
17:00:19 [2020-09-13T21:00:19.273Z] 
17:00:19 [2020-09-13T21:00:19.273Z] (SWT:1672): Gtk-CRITICAL **: 21:00:19.200: gtk_box_gadget_distribute: assertion 'size >= 0' failed in GtkScrollbar
17:00:19 [2020-09-13T21:00:19.273Z] 
17:00:19 [2020-09-13T21:00:19.273Z] (SWT:1672): Gtk-CRITICAL **: 21:00:19.207: gtk_box_gadget_distribute: assertion 'size >= 0' failed in GtkScrollbar
17:00:19 [2020-09-13T21:00:19.273Z] 
17:00:19 [2020-09-13T21:00:19.273Z] (SWT:1672): Gtk-WARNING **: 21:00:19.210: Negative content width -6 (allocation 1, extents 4x3) while allocating gadget (node toolbar, owner GtkToolbar)
17:00:19 [2020-09-13T21:00:19.273Z] 
17:00:19 [2020-09-13T21:00:19.273Z] (SWT:1672): Gtk-CRITICAL **: 21:00:19.216: gtk_box_gadget_distribute: assertion 'size >= 0' failed in GtkScrollbar
17:00:19 [2020-09-13T21:00:19.273Z] 
17:00:19 [2020-09-13T21:00:19.273Z] (SWT:1672): Gtk-CRITICAL **: 21:00:19.222: gtk_box_gadget_distribute: assertion 'size >= 0' failed in GtkScrollbar
17:00:19 [2020-09-13T21:00:19.273Z] 
17:00:19 [2020-09-13T21:00:19.273Z] (SWT:1672): Gtk-CRITICAL **: 21:00:19.223: gtk_box_gadget_distribute: assertion 'size >= 0' failed in GtkScrollbar
17:00:19 [2020-09-13T21:00:19.273Z] 
17:00:19 [2020-09-13T21:00:19.273Z] (SWT:1672): Gtk-CRITICAL **: 21:00:19.224: gtk_box_gadget_distribute: assertion 'size >= 0' failed in GtkScrollbar
17:00:19 [2020-09-13T21:00:19.273Z] 
17:00:19 [2020-09-13T21:00:19.273Z] (SWT:1672): Gtk-CRITICAL **: 21:00:19.224: gtk_box_gadget_distribute: assertion 'size >= 0' failed in GtkScrollbar
17:00:19 [2020-09-13T21:00:19.273Z] 
17:00:19 [2020-09-13T21:00:19.273Z] (SWT:1672): Gtk-CRITICAL **: 21:00:19.225: gtk_box_gadget_distribute: assertion 'size >= 0' failed in GtkScrollbar
17:00:19 [2020-09-13T21:00:19.273Z] 
17:00:19 [2020-09-13T21:00:19.273Z] (SWT:1672): Gtk-CRITICAL **: 21:00:19.262: gtk_box_gadget_distribute: assertion 'size >= 0' failed in GtkScrollbar
17:00:19 [2020-09-13T21:00:19.273Z] 
17:00:19 [2020-09-13T21:00:19.273Z] (SWT:1672): Gtk-CRITICAL **: 21:00:19.263: gtk_box_gadget_distribute: assertion 'size >= 0' failed in GtkScrollbar
17:00:19 [2020-09-13T21:00:19.531Z] 
17:00:19 [2020-09-13T21:00:19.531Z] (SWT:1672): Gtk-CRITICAL **: 21:00:19.271: gtk_box_gadget_distribute: assertion 'size >= 0' failed in GtkScrollbar
17:00:19 [2020-09-13T21:00:19.531Z] 
17:00:19 [2020-09-13T21:00:19.531Z] (SWT:1672): Gtk-CRITICAL **: 21:00:19.279: gtk_box_gadget_distribute: assertion 'size >= 0' failed in GtkScrollbar
17:00:19 [2020-09-13T21:00:19.531Z] 
17:00:19 [2020-09-13T21:00:19.531Z] (SWT:1672): Gtk-CRITICAL **: 21:00:19.279: gtk_box_gadget_distribute: assertion 'size >= 0' failed in GtkScrollbar
17:00:19 [2020-09-13T21:00:19.531Z] 
17:00:19 [2020-09-13T21:00:19.531Z] (SWT:1672): Gtk-CRITICAL **: 21:00:19.295: gtk_box_gadget_distribute: assertion 'size >= 0' failed in GtkScrollbar
17:00:19 [2020-09-13T21:00:19.531Z] 
17:00:19 [2020-09-13T21:00:19.531Z] (SWT:1672): Gtk-CRITICAL **: 21:00:19.296: gtk_box_gadget_distribute: assertion 'size >= 0' failed in GtkScrollbar
17:00:19 [2020-09-13T21:00:19.531Z] 
17:00:19 [2020-09-13T21:00:19.531Z] (SWT:1672): Gtk-CRITICAL **: 21:00:19.312: gtk_box_gadget_distribute: assertion 'size >= 0' failed in GtkScrollbar
17:00:19 [2020-09-13T21:00:19.531Z] 
17:00:19 [2020-09-13T21:00:19.531Z] (SWT:1672): Gtk-CRITICAL **: 21:00:19.312: gtk_box_gadget_distribute: assertion 'size >= 0' failed in GtkScrollbar
17:00:19 [2020-09-13T21:00:19.531Z] 
17:00:19 [2020-09-13T21:00:19.531Z] (SWT:1672): Gtk-CRITICAL **: 21:00:19.328: gtk_box_gadget_distribute: assertion 'size >= 0' failed in GtkScrollbar
17:00:19 [2020-09-13T21:00:19.532Z] 
17:00:19 [2020-09-13T21:00:19.532Z] (SWT:1672): Gtk-CRITICAL **: 21:00:19.328: gtk_box_gadget_distribute: assertion 'size >= 0' failed in GtkScrollbar
17:00:19 [2020-09-13T21:00:19.532Z] 
17:00:19 [2020-09-13T21:00:19.532Z] (SWT:1672): Gtk-CRITICAL **: 21:00:19.345: gtk_box_gadget_distribute: assertion 'size >= 0' failed in GtkScrollbar
17:00:19 [2020-09-13T21:00:19.532Z] 
17:00:19 [2020-09-13T21:00:19.532Z] (SWT:1672): Gtk-CRITICAL **: 21:00:19.346: gtk_box_gadget_distribute: assertion 'size >= 0' failed in GtkScrollbar
17:00:19 [2020-09-13T21:00:19.532Z] 
17:00:19 [2020-09-13T21:00:19.532Z] (SWT:1672): Gtk-CRITICAL **: 21:00:19.362: gtk_box_gadget_distribute: assertion 'size >= 0' failed in GtkScrollbar
17:00:19 [2020-09-13T21:00:19.532Z] 
17:00:19 [2020-09-13T21:00:19.532Z] (SWT:1672): Gtk-CRITICAL **: 21:00:19.362: gtk_box_gadget_distribute: assertion 'size >= 0' failed in GtkScrollbar
17:00:19 [2020-09-13T21:00:19.532Z] 
17:00:19 [2020-09-13T21:00:19.532Z] (SWT:1672): Gtk-CRITICAL **: 21:00:19.386: gtk_box_gadget_distribute: assertion 'size >= 0' failed in GtkScrollbar
17:00:19 [2020-09-13T21:00:19.532Z] 
17:00:19 [2020-09-13T21:00:19.532Z] (SWT:1672): Gtk-CRITICAL **: 21:00:19.386: gtk_box_gadget_distribute: assertion 'size >= 0' failed in GtkScrollbar
17:00:19 [2020-09-13T21:00:19.532Z] 
17:00:19 [2020-09-13T21:00:19.532Z] (SWT:1672): Gtk-CRITICAL **: 21:00:19.409: gtk_box_gadget_distribute: assertion 'size >= 0' failed in GtkScrollbar
17:00:19 [2020-09-13T21:00:19.532Z] 
17:00:19 [2020-09-13T21:00:19.532Z] (SWT:1672): Gtk-CRITICAL **: 21:00:19.409: gtk_box_gadget_distribute: assertion 'size >= 0' failed in GtkScrollbar
17:00:19 [2020-09-13T21:00:19.532Z] 
17:00:19 [2020-09-13T21:00:19.532Z] (SWT:1672): Gtk-CRITICAL **: 21:00:19.425: gtk_box_gadget_distribute: assertion 'size >= 0' failed in GtkScrollbar
17:00:19 [2020-09-13T21:00:19.532Z] 
17:00:19 [2020-09-13T21:00:19.532Z] (SWT:1672): Gtk-CRITICAL **: 21:00:19.425: gtk_box_gadget_distribute: assertion 'size >= 0' failed in GtkScrollbar
17:00:19 [2020-09-13T21:00:19.532Z] 
17:00:19 [2020-09-13T21:00:19.532Z] (SWT:1672): Gtk-CRITICAL **: 21:00:19.441: gtk_box_gadget_distribute: assertion 'size >= 0' failed in GtkScrollbar
17:00:19 [2020-09-13T21:00:19.532Z] 
17:00:19 [2020-09-13T21:00:19.532Z] (SWT:1672): Gtk-CRITICAL **: 21:00:19.441: gtk_box_gadget_distribute: assertion 'size >= 0' failed in GtkScrollbar
17:00:19 [2020-09-13T21:00:19.532Z] 
17:00:19 [2020-09-13T21:00:19.532Z] (SWT:1672): Gtk-CRITICAL **: 21:00:19.463: gtk_box_gadget_distribute: assertion 'size >= 0' failed in GtkScrollbar
17:00:19 [2020-09-13T21:00:19.532Z] 
17:00:19 [2020-09-13T21:00:19.532Z] (SWT:1672): Gtk-CRITICAL **: 21:00:19.463: gtk_box_gadget_distribute: assertion 'size >= 0' failed in GtkScrollbar
17:00:19 [2020-09-13T21:00:19.532Z] 
17:00:19 [2020-09-13T21:00:19.532Z] (SWT:1672): Gtk-CRITICAL **: 21:00:19.469: gtk_box_gadget_distribute: assertion 'size >= 0' failed in GtkScrollbar
17:00:19 [2020-09-13T21:00:19.532Z] 
17:00:19 [2020-09-13T21:00:19.532Z] (SWT:1672): Gtk-CRITICAL **: 21:00:19.470: gtk_box_gadget_distribute: assertion 'size >= 0' failed in GtkScrollbar
17:00:19 [2020-09-13T21:00:19.789Z] 
17:00:19 [2020-09-13T21:00:19.789Z] (SWT:1672): Gtk-WARNING **: 21:00:19.534: Negative content width -6 (allocation 1, extents 4x3) while allocating gadget (node toolbar, owner GtkToolbar)
17:00:20 [2020-09-13T21:00:20.046Z] 
17:00:20 [2020-09-13T21:00:20.046Z] (SWT:1672): Gtk-WARNING **: 21:00:20.040: Negative content width -6 (allocation 1, extents 4x3) while allocating gadget (node toolbar, owner GtkToolbar)
17:00:20 [2020-09-13T21:00:20.304Z] 
17:00:20 [2020-09-13T21:00:20.304Z] (SWT:1672): Gtk-WARNING **: 21:00:20.051: Negative content width -6 (allocation 1, extents 4x3) while allocating gadget (node toolbar, owner GtkToolbar)
17:00:20 [2020-09-13T21:00:20.304Z] Tests run: 3, Failures: 0, Errors: 0, Skipped: 0, Time elapsed: 5.567 s - in org.eclipse.egit.ui.test.stagview.CommitMessageProvidersTest
17:00:20 [2020-09-13T21:00:20.304Z] testCaretPosition(org.eclipse.egit.ui.test.stagview.CommitMessageProvidersTest)  Time elapsed: 1.895 s
17:00:20 [2020-09-13T21:00:20.304Z] testTwoProvidersFromSameExtension(org.eclipse.egit.ui.test.stagview.CommitMessageProvidersTest)  Time elapsed: 1.776 s
17:00:20 [2020-09-13T21:00:20.304Z] testCaretPositionUndefined(org.eclipse.egit.ui.test.stagview.CommitMessageProvidersTest)  Time elapsed: 1.889 s
17:00:20 [2020-09-13T21:00:20.304Z] Running org.eclipse.egit.ui.variables.DynamicVariablesTest
17:00:25 [2020-09-13T21:00:25.566Z] Tests run: 4, Failures: 0, Errors: 0, Skipped: 0, Time elapsed: 4.422 s - in org.eclipse.egit.ui.variables.DynamicVariablesTest
17:00:25 [2020-09-13T21:00:25.566Z] testGitBranch(org.eclipse.egit.ui.variables.DynamicVariablesTest)  Time elapsed: 1.135 s
17:00:25 [2020-09-13T21:00:25.566Z] testGitPath(org.eclipse.egit.ui.variables.DynamicVariablesTest)  Time elapsed: 1.089 s
17:00:25 [2020-09-13T21:00:25.566Z] testGitWorkTree(org.eclipse.egit.ui.variables.DynamicVariablesTest)  Time elapsed: 1.098 s
17:00:25 [2020-09-13T21:00:25.566Z] testGitDir(org.eclipse.egit.ui.variables.DynamicVariablesTest)  Time elapsed: 1.099 s
17:00:25 [2020-09-13T21:00:25.566Z] Running org.eclipse.egit.ui.gitflow.FeatureFinishSquashHandlerTest
17:00:25 [2020-09-13T21:00:25.566Z] 
17:00:25 [2020-09-13T21:00:25.566Z] (SWT:1672): Gtk-CRITICAL **: 21:00:25.285: gtk_box_gadget_distribute: assertion 'size >= 0' failed in GtkScrollbar
17:00:25 [2020-09-13T21:00:25.566Z] 
17:00:25 [2020-09-13T21:00:25.566Z] (SWT:1672): Gtk-CRITICAL **: 21:00:25.325: gtk_box_gadget_distribute: assertion 'size >= 0' failed in GtkScrollbar
17:00:25 [2020-09-13T21:00:25.566Z] 
17:00:25 [2020-09-13T21:00:25.566Z] (SWT:1672): Gtk-CRITICAL **: 21:00:25.343: gtk_box_gadget_distribute: assertion 'size >= 0' failed in GtkScrollbar
17:00:25 [2020-09-13T21:00:25.566Z] 
17:00:25 [2020-09-13T21:00:25.566Z] (SWT:1672): Gtk-CRITICAL **: 21:00:25.358: gtk_box_gadget_distribute: assertion 'size >= 0' failed in GtkScrollbar
17:00:25 [2020-09-13T21:00:25.566Z] 
17:00:25 [2020-09-13T21:00:25.566Z] (SWT:1672): Gtk-CRITICAL **: 21:00:25.374: gtk_box_gadget_distribute: assertion 'size >= 0' failed in GtkScrollbar
17:00:25 [2020-09-13T21:00:25.566Z] 
17:00:25 [2020-09-13T21:00:25.566Z] (SWT:1672): Gtk-CRITICAL **: 21:00:25.391: gtk_box_gadget_distribute: assertion 'size >= 0' failed in GtkScrollbar
17:00:25 [2020-09-13T21:00:25.566Z] 
17:00:25 [2020-09-13T21:00:25.566Z] (SWT:1672): Gtk-CRITICAL **: 21:00:25.408: gtk_box_gadget_distribute: assertion 'size >= 0' failed in GtkScrollbar
17:00:25 [2020-09-13T21:00:25.566Z] 
17:00:25 [2020-09-13T21:00:25.566Z] (SWT:1672): Gtk-CRITICAL **: 21:00:25.425: gtk_box_gadget_distribute: assertion 'size >= 0' failed in GtkScrollbar
17:00:25 [2020-09-13T21:00:25.566Z] 
17:00:25 [2020-09-13T21:00:25.566Z] (SWT:1672): Gtk-CRITICAL **: 21:00:25.444: gtk_box_gadget_distribute: assertion 'size >= 0' failed in GtkScrollbar
17:00:25 [2020-09-13T21:00:25.566Z] 
17:00:25 [2020-09-13T21:00:25.566Z] (SWT:1672): Gtk-CRITICAL **: 21:00:25.458: gtk_box_gadget_distribute: assertion 'size >= 0' failed in GtkScrollbar
17:00:25 [2020-09-13T21:00:25.566Z] 
17:00:25 [2020-09-13T21:00:25.566Z] (SWT:1672): Gtk-CRITICAL **: 21:00:25.475: gtk_box_gadget_distribute: assertion 'size >= 0' failed in GtkScrollbar
17:00:25 [2020-09-13T21:00:25.566Z] 
17:00:25 [2020-09-13T21:00:25.566Z] (SWT:1672): Gtk-CRITICAL **: 21:00:25.491: gtk_box_gadget_distribute: assertion 'size >= 0' failed in GtkScrollbar
17:00:25 [2020-09-13T21:00:25.566Z] 
17:00:25 [2020-09-13T21:00:25.566Z] (SWT:1672): Gtk-CRITICAL **: 21:00:25.508: gtk_box_gadget_distribute: assertion 'size >= 0' failed in GtkScrollbar
17:00:25 [2020-09-13T21:00:25.566Z] 
17:00:25 [2020-09-13T21:00:25.566Z] (SWT:1672): Gtk-CRITICAL **: 21:00:25.524: gtk_box_gadget_distribute: assertion 'size >= 0' failed in GtkScrollbar
17:00:26 [2020-09-13T21:00:26.132Z] 
17:00:26 [2020-09-13T21:00:26.132Z] (SWT:1672): Gtk-CRITICAL **: 21:00:26.042: gtk_box_gadget_distribute: assertion 'size >= 0' failed in GtkScrollbar
17:00:27 [2020-09-13T21:00:27.064Z] Tests run: 1, Failures: 0, Errors: 0, Skipped: 0, Time elapsed: 2.159 s - in org.eclipse.egit.ui.gitflow.FeatureFinishSquashHandlerTest
17:00:27 [2020-09-13T21:00:27.064Z] testFeatureFinishSquash(org.eclipse.egit.ui.gitflow.FeatureFinishSquashHandlerTest)  Time elapsed: 2.154 s
17:00:27 [2020-09-13T21:00:27.064Z] Running org.eclipse.egit.ui.gitflow.FeatureStartFinishHandlerTest
17:00:27 [2020-09-13T21:00:27.632Z] 
17:00:27 [2020-09-13T21:00:27.632Z] (SWT:1672): Gtk-CRITICAL **: 21:00:27.374: gtk_box_gadget_distribute: assertion 'size >= 0' failed in GtkScrollbar
17:00:27 [2020-09-13T21:00:27.632Z] 
17:00:27 [2020-09-13T21:00:27.632Z] (SWT:1672): Gtk-CRITICAL **: 21:00:27.408: gtk_box_gadget_distribute: assertion 'size >= 0' failed in GtkScrollbar
17:00:27 [2020-09-13T21:00:27.632Z] 
17:00:27 [2020-09-13T21:00:27.632Z] (SWT:1672): Gtk-CRITICAL **: 21:00:27.426: gtk_box_gadget_distribute: assertion 'size >= 0' failed in GtkScrollbar
17:00:27 [2020-09-13T21:00:27.632Z] 
17:00:27 [2020-09-13T21:00:27.632Z] (SWT:1672): Gtk-CRITICAL **: 21:00:27.441: gtk_box_gadget_distribute: assertion 'size >= 0' failed in GtkScrollbar
17:00:27 [2020-09-13T21:00:27.632Z] 
17:00:27 [2020-09-13T21:00:27.632Z] (SWT:1672): Gtk-CRITICAL **: 21:00:27.457: gtk_box_gadget_distribute: assertion 'size >= 0' failed in GtkScrollbar
17:00:27 [2020-09-13T21:00:27.632Z] 
17:00:27 [2020-09-13T21:00:27.632Z] (SWT:1672): Gtk-CRITICAL **: 21:00:27.475: gtk_box_gadget_distribute: assertion 'size >= 0' failed in GtkScrollbar
17:00:27 [2020-09-13T21:00:27.632Z] 
17:00:27 [2020-09-13T21:00:27.632Z] (SWT:1672): Gtk-CRITICAL **: 21:00:27.491: gtk_box_gadget_distribute: assertion 'size >= 0' failed in GtkScrollbar
17:00:27 [2020-09-13T21:00:27.632Z] 
17:00:27 [2020-09-13T21:00:27.632Z] (SWT:1672): Gtk-CRITICAL **: 21:00:27.508: gtk_box_gadget_distribute: assertion 'size >= 0' failed in GtkScrollbar
17:00:27 [2020-09-13T21:00:27.632Z] 
17:00:27 [2020-09-13T21:00:27.632Z] (SWT:1672): Gtk-CRITICAL **: 21:00:27.524: gtk_box_gadget_distribute: assertion 'size >= 0' failed in GtkScrollbar
17:00:27 [2020-09-13T21:00:27.632Z] 
17:00:27 [2020-09-13T21:00:27.632Z] (SWT:1672): Gtk-CRITICAL **: 21:00:27.541: gtk_box_gadget_distribute: assertion 'size >= 0' failed in GtkScrollbar
17:00:27 [2020-09-13T21:00:27.632Z] 
17:00:27 [2020-09-13T21:00:27.632Z] (SWT:1672): Gtk-CRITICAL **: 21:00:27.558: gtk_box_gadget_distribute: assertion 'size >= 0' failed in GtkScrollbar
17:00:27 [2020-09-13T21:00:27.632Z] 
17:00:27 [2020-09-13T21:00:27.632Z] (SWT:1672): Gtk-CRITICAL **: 21:00:27.574: gtk_box_gadget_distribute: assertion 'size >= 0' failed in GtkScrollbar
17:00:27 [2020-09-13T21:00:27.632Z] 
17:00:27 [2020-09-13T21:00:27.632Z] (SWT:1672): Gtk-CRITICAL **: 21:00:27.590: gtk_box_gadget_distribute: assertion 'size >= 0' failed in GtkScrollbar
17:00:27 [2020-09-13T21:00:27.632Z] 
17:00:27 [2020-09-13T21:00:27.632Z] (SWT:1672): Gtk-CRITICAL **: 21:00:27.608: gtk_box_gadget_distribute: assertion 'size >= 0' failed in GtkScrollbar
17:00:27 [2020-09-13T21:00:27.632Z] 
17:00:27 [2020-09-13T21:00:27.632Z] (SWT:1672): Gtk-CRITICAL **: 21:00:27.624: gtk_box_gadget_distribute: assertion 'size >= 0' failed in GtkScrollbar
17:00:27 [2020-09-13T21:00:27.890Z] 
17:00:27 [2020-09-13T21:00:27.890Z] (SWT:1672): Gtk-CRITICAL **: 21:00:27.640: gtk_box_gadget_distribute: assertion 'size >= 0' failed in GtkScrollbar
17:00:27 [2020-09-13T21:00:27.890Z] 
17:00:27 [2020-09-13T21:00:27.890Z] (SWT:1672): Gtk-CRITICAL **: 21:00:27.658: gtk_box_gadget_distribute: assertion 'size >= 0' failed in GtkScrollbar
17:00:28 [2020-09-13T21:00:28.454Z] 
17:00:28 [2020-09-13T21:00:28.454Z] (SWT:1672): Gtk-CRITICAL **: 21:00:28.164: gtk_box_gadget_distribute: assertion 'size >= 0' failed in GtkScrollbar
17:00:29 [2020-09-13T21:00:29.020Z] Tests run: 1, Failures: 0, Errors: 0, Skipped: 0, Time elapsed: 2.008 s - in org.eclipse.egit.ui.gitflow.FeatureStartFinishHandlerTest
17:00:29 [2020-09-13T21:00:29.020Z] testFeatureStart(org.eclipse.egit.ui.gitflow.FeatureStartFinishHandlerTest)  Time elapsed: 2.004 s
17:00:29 [2020-09-13T21:00:29.020Z] Running org.eclipse.egit.ui.gitflow.InitHandlerTest
17:00:32 [2020-09-13T21:00:32.303Z] Tests run: 3, Failures: 0, Errors: 0, Skipped: 0, Time elapsed: 3.333 s - in org.eclipse.egit.ui.gitflow.InitHandlerTest
17:00:32 [2020-09-13T21:00:32.303Z] testInit(org.eclipse.egit.ui.gitflow.InitHandlerTest)  Time elapsed: 0.762 s
17:00:32 [2020-09-13T21:00:32.303Z] testInitEmptyRepoMissingMaster(org.eclipse.egit.ui.gitflow.InitHandlerTest)  Time elapsed: 1.428 s
17:00:32 [2020-09-13T21:00:32.303Z] testInitMissingMaster(org.eclipse.egit.ui.gitflow.InitHandlerTest)  Time elapsed: 1.137 s
17:00:32 [2020-09-13T21:00:32.303Z] Running org.eclipse.egit.ui.gitflow.FeatureRebaseHandlerTest
17:00:33 [2020-09-13T21:00:33.235Z] 
17:00:33 [2020-09-13T21:00:33.235Z] (SWT:1672): Gtk-WARNING **: 21:00:32.913: Negative content width -6 (allocation 1, extents 4x3) while allocating gadget (node toolbar, owner GtkToolbar)
17:00:33 [2020-09-13T21:00:33.235Z] 
17:00:33 [2020-09-13T21:00:33.235Z] (SWT:1672): Gtk-WARNING **: 21:00:32.918: Negative content width -6 (allocation 1, extents 4x3) while allocating gadget (node toolbar, owner GtkToolbar)
17:00:33 [2020-09-13T21:00:33.235Z] 
17:00:33 [2020-09-13T21:00:33.235Z] (SWT:1672): Gtk-WARNING **: 21:00:32.922: Negative content width -6 (allocation 1, extents 4x3) while allocating gadget (node toolbar, owner GtkToolbar)
17:00:33 [2020-09-13T21:00:33.235Z] 
17:00:33 [2020-09-13T21:00:33.235Z] (SWT:1672): Gtk-WARNING **: 21:00:32.924: Negative content width -6 (allocation 1, extents 4x3) while allocating gadget (node toolbar, owner GtkToolbar)
17:00:33 [2020-09-13T21:00:33.235Z] 
17:00:33 [2020-09-13T21:00:33.235Z] (SWT:1672): Gtk-WARNING **: 21:00:32.924: Negative content width -6 (allocation 1, extents 4x3) while allocating gadget (node toolbar, owner GtkToolbar)
17:00:33 [2020-09-13T21:00:33.235Z] 
17:00:33 [2020-09-13T21:00:33.235Z] (SWT:1672): Gtk-WARNING **: 21:00:32.956: Negative content width -6 (allocation 1, extents 4x3) while allocating gadget (node toolbar, owner GtkToolbar)
17:00:33 [2020-09-13T21:00:33.492Z] 
17:00:33 [2020-09-13T21:00:33.492Z] (SWT:1672): Gtk-WARNING **: 21:00:33.384: Negative content height -1 (allocation 1, extents 1x1) while allocating gadget (node scrolledwindow, owner GtkScrolledWindow)
17:00:33 [2020-09-13T21:00:33.492Z] 
17:00:33 [2020-09-13T21:00:33.492Z] (SWT:1672): Gtk-CRITICAL **: 21:00:33.384: gtk_box_gadget_distribute: assertion 'size >= 0' failed in GtkScrollbar
17:00:33 [2020-09-13T21:00:33.492Z] 
17:00:33 [2020-09-13T21:00:33.492Z] (SWT:1672): Gtk-WARNING **: 21:00:33.427: Negative content width -6 (allocation 1, extents 4x3) while allocating gadget (node toolbar, owner GtkToolbar)
17:00:34 [2020-09-13T21:00:34.864Z] 
17:00:34 [2020-09-13T21:00:34.864Z] (SWT:1672): Gtk-WARNING **: 21:00:34.721: Negative content height -1 (allocation 1, extents 1x1) while allocating gadget (node scrolledwindow, owner GtkScrolledWindow)
17:00:34 [2020-09-13T21:00:34.864Z] 
17:00:34 [2020-09-13T21:00:34.864Z] (SWT:1672): Gtk-CRITICAL **: 21:00:34.721: gtk_box_gadget_distribute: assertion 'size >= 0' failed in GtkScrollbar
17:00:35 [2020-09-13T21:00:35.139Z] Tests run: 2, Failures: 0, Errors: 0, Skipped: 0, Time elapsed: 2.826 s - in org.eclipse.egit.ui.gitflow.FeatureRebaseHandlerTest
17:00:35 [2020-09-13T21:00:35.139Z] testRebaseFailOnConflict(org.eclipse.egit.ui.gitflow.FeatureRebaseHandlerTest)  Time elapsed: 1.432 s
17:00:35 [2020-09-13T21:00:35.139Z] testRebaseFailOnDirtyWorkingDirectory(org.eclipse.egit.ui.gitflow.FeatureRebaseHandlerTest)  Time elapsed: 1.383 s
17:00:35 [2020-09-13T21:00:35.139Z] Running org.eclipse.egit.ui.gitflow.FeatureStartCheckoutConflictTest
17:00:35 [2020-09-13T21:00:35.704Z] 
17:00:35 [2020-09-13T21:00:35.704Z] (SWT:1672): Gtk-CRITICAL **: 21:00:35.530: gtk_box_gadget_distribute: assertion 'size >= 0' failed in GtkScrollbar
17:00:35 [2020-09-13T21:00:35.704Z] 
17:00:35 [2020-09-13T21:00:35.705Z] (SWT:1672): Gtk-CRITICAL **: 21:00:35.540: gtk_box_gadget_distribute: assertion 'size >= 0' failed in GtkScrollbar
17:00:35 [2020-09-13T21:00:35.705Z] Tests run: 1, Failures: 0, Errors: 0, Skipped: 0, Time elapsed: 0.766 s - in org.eclipse.egit.ui.gitflow.FeatureStartCheckoutConflictTest
17:00:35 [2020-09-13T21:00:35.705Z] testFeatureStart(org.eclipse.egit.ui.gitflow.FeatureStartCheckoutConflictTest)  Time elapsed: 0.759 s
17:00:35 [2020-09-13T21:00:35.705Z] Running org.eclipse.egit.ui.gitflow.CommandEnablementTest
17:00:37 [2020-09-13T21:00:37.077Z] 
17:00:37 [2020-09-13T21:00:37.077Z] (SWT:1672): Gtk-WARNING **: 21:00:36.840: Negative content width -6 (allocation 1, extents 4x3) while allocating gadget (node toolbar, owner GtkToolbar)
17:00:37 [2020-09-13T21:00:37.077Z] 
17:00:37 [2020-09-13T21:00:37.077Z] (SWT:1672): Gtk-WARNING **: 21:00:36.996: Negative content width -6 (allocation 1, extents 4x3) while allocating gadget (node toolbar, owner GtkToolbar)
17:00:37 [2020-09-13T21:00:37.334Z] Tests run: 2, Failures: 0, Errors: 0, Skipped: 0, Time elapsed: 1.428 s - in org.eclipse.egit.ui.gitflow.CommandEnablementTest
17:00:37 [2020-09-13T21:00:37.334Z] testPackageExplorerStartFinishEnablement(org.eclipse.egit.ui.gitflow.CommandEnablementTest)  Time elapsed: 0.664 s
17:00:37 [2020-09-13T21:00:37.334Z] testRepositoryViewStartFinishEnablement(org.eclipse.egit.ui.gitflow.CommandEnablementTest)  Time elapsed: 0.757 s
17:00:37 [2020-09-13T21:00:37.334Z] Running org.eclipse.egit.ui.gitflow.FeatureFinishKeepBranchHandlerTest
17:00:38 [2020-09-13T21:00:38.267Z] 
17:00:38 [2020-09-13T21:00:38.267Z] (SWT:1672): Gtk-CRITICAL **: 21:00:38.051: gtk_box_gadget_distribute: assertion 'size >= 0' failed in GtkScrollbar
17:00:38 [2020-09-13T21:00:38.267Z] 
17:00:38 [2020-09-13T21:00:38.267Z] (SWT:1672): Gtk-CRITICAL **: 21:00:38.084: gtk_box_gadget_distribute: assertion 'size >= 0' failed in GtkScrollbar
17:00:38 [2020-09-13T21:00:38.267Z] 
17:00:38 [2020-09-13T21:00:38.267Z] (SWT:1672): Gtk-CRITICAL **: 21:00:38.086: gtk_box_gadget_distribute: assertion 'size >= 0' failed in GtkScrollbar
17:00:38 [2020-09-13T21:00:38.267Z] 
17:00:38 [2020-09-13T21:00:38.267Z] (SWT:1672): Gtk-CRITICAL **: 21:00:38.103: gtk_box_gadget_distribute: assertion 'size >= 0' failed in GtkScrollbar
17:00:38 [2020-09-13T21:00:38.267Z] 
17:00:38 [2020-09-13T21:00:38.267Z] (SWT:1672): Gtk-CRITICAL **: 21:00:38.120: gtk_box_gadget_distribute: assertion 'size >= 0' failed in GtkScrollbar
17:00:38 [2020-09-13T21:00:38.267Z] 
17:00:38 [2020-09-13T21:00:38.267Z] (SWT:1672): Gtk-CRITICAL **: 21:00:38.136: gtk_box_gadget_distribute: assertion 'size >= 0' failed in GtkScrollbar
17:00:38 [2020-09-13T21:00:38.267Z] 
17:00:38 [2020-09-13T21:00:38.267Z] (SWT:1672): Gtk-CRITICAL **: 21:00:38.152: gtk_box_gadget_distribute: assertion 'size >= 0' failed in GtkScrollbar
17:00:38 [2020-09-13T21:00:38.267Z] 
17:00:38 [2020-09-13T21:00:38.267Z] (SWT:1672): Gtk-CRITICAL **: 21:00:38.170: gtk_box_gadget_distribute: assertion 'size >= 0' failed in GtkScrollbar
17:00:38 [2020-09-13T21:00:38.267Z] 
17:00:38 [2020-09-13T21:00:38.267Z] (SWT:1672): Gtk-CRITICAL **: 21:00:38.186: gtk_box_gadget_distribute: assertion 'size >= 0' failed in GtkScrollbar
17:00:38 [2020-09-13T21:00:38.267Z] 
17:00:38 [2020-09-13T21:00:38.267Z] (SWT:1672): Gtk-CRITICAL **: 21:00:38.202: gtk_box_gadget_distribute: assertion 'size >= 0' failed in GtkScrollbar
17:00:38 [2020-09-13T21:00:38.267Z] 
17:00:38 [2020-09-13T21:00:38.267Z] (SWT:1672): Gtk-CRITICAL **: 21:00:38.220: gtk_box_gadget_distribute: assertion 'size >= 0' failed in GtkScrollbar
17:00:38 [2020-09-13T21:00:38.267Z] 
17:00:38 [2020-09-13T21:00:38.267Z] (SWT:1672): Gtk-CRITICAL **: 21:00:38.236: gtk_box_gadget_distribute: assertion 'size >= 0' failed in GtkScrollbar
17:00:38 [2020-09-13T21:00:38.267Z] 
17:00:38 [2020-09-13T21:00:38.267Z] (SWT:1672): Gtk-CRITICAL **: 21:00:38.252: gtk_box_gadget_distribute: assertion 'size >= 0' failed in GtkScrollbar
17:00:38 [2020-09-13T21:00:38.524Z] 
17:00:38 [2020-09-13T21:00:38.524Z] (SWT:1672): Gtk-CRITICAL **: 21:00:38.269: gtk_box_gadget_distribute: assertion 'size >= 0' failed in GtkScrollbar
17:00:38 [2020-09-13T21:00:38.524Z] 
17:00:38 [2020-09-13T21:00:38.524Z] (SWT:1672): Gtk-CRITICAL **: 21:00:38.286: gtk_box_gadget_distribute: assertion 'size >= 0' failed in GtkScrollbar
17:00:38 [2020-09-13T21:00:38.524Z] 
17:00:38 [2020-09-13T21:00:38.524Z] (SWT:1672): Gtk-CRITICAL **: 21:00:38.302: gtk_box_gadget_distribute: assertion 'size >= 0' failed in GtkScrollbar
17:00:38 [2020-09-13T21:00:38.524Z] 
17:00:38 [2020-09-13T21:00:38.524Z] (SWT:1672): Gtk-CRITICAL **: 21:00:38.319: gtk_box_gadget_distribute: assertion 'size >= 0' failed in GtkScrollbar
17:00:39 [2020-09-13T21:00:39.087Z] 
17:00:39 [2020-09-13T21:00:39.087Z] (SWT:1672): Gtk-CRITICAL **: 21:00:38.799: gtk_box_gadget_distribute: assertion 'size >= 0' failed in GtkScrollbar
17:00:39 [2020-09-13T21:00:39.651Z] Tests run: 1, Failures: 0, Errors: 0, Skipped: 0, Time elapsed: 2.312 s - in org.eclipse.egit.ui.gitflow.FeatureFinishKeepBranchHandlerTest
17:00:39 [2020-09-13T21:00:39.652Z] testFeatureFinishKeepBranch(org.eclipse.egit.ui.gitflow.FeatureFinishKeepBranchHandlerTest)  Time elapsed: 2.308 s
17:00:39 [2020-09-13T21:00:39.652Z] Running org.eclipse.egit.ui.wizards.share.SharingWizardTest
17:00:39 [2020-09-13T21:00:39.652Z] 
17:00:39 [2020-09-13T21:00:39.652Z] (SWT:1672): Gtk-CRITICAL **: 21:00:39.483: gtk_box_gadget_distribute: assertion 'size >= 0' failed in GtkScrollbar
17:00:39 [2020-09-13T21:00:39.652Z] 
17:00:39 [2020-09-13T21:00:39.652Z] (SWT:1672): Gtk-WARNING **: 21:00:39.484: Negative content width -13 (allocation 5, extents 9x9) while allocating gadget (node entry, owner GtkEntry)
17:00:39 [2020-09-13T21:00:39.652Z] 
17:00:39 [2020-09-13T21:00:39.652Z] (SWT:1672): Gtk-WARNING **: 21:00:39.484: Negative content height -1 (allocation 1, extents 1x1) while allocating gadget (node scrolledwindow, owner GtkScrolledWindow)
17:00:39 [2020-09-13T21:00:39.652Z] 
17:00:39 [2020-09-13T21:00:39.652Z] (SWT:1672): Gtk-CRITICAL **: 21:00:39.484: gtk_box_gadget_distribute: assertion 'size >= 0' failed in GtkScrollbar
17:00:39 [2020-09-13T21:00:39.652Z] 
17:00:39 [2020-09-13T21:00:39.652Z] (SWT:1672): Gtk-CRITICAL **: 21:00:39.484: gtk_box_gadget_distribute: assertion 'size >= 0' failed in GtkScrollbar
17:00:40 [2020-09-13T21:00:40.217Z] 
17:00:40 [2020-09-13T21:00:40.217Z] (SWT:1672): Gtk-CRITICAL **: 21:00:40.091: gtk_box_gadget_distribute: assertion 'size >= 0' failed in GtkScrollbar
17:00:40 [2020-09-13T21:00:40.217Z] 
17:00:40 [2020-09-13T21:00:40.217Z] (SWT:1672): Gtk-WARNING **: 21:00:40.091: Negative content width -13 (allocation 5, extents 9x9) while allocating gadget (node entry, owner GtkEntry)
17:00:40 [2020-09-13T21:00:40.217Z] 
17:00:40 [2020-09-13T21:00:40.217Z] (SWT:1672): Gtk-WARNING **: 21:00:40.092: Negative content height -1 (allocation 1, extents 1x1) while allocating gadget (node scrolledwindow, owner GtkScrolledWindow)
17:00:40 [2020-09-13T21:00:40.217Z] 
17:00:40 [2020-09-13T21:00:40.217Z] (SWT:1672): Gtk-CRITICAL **: 21:00:40.092: gtk_box_gadget_distribute: assertion 'size >= 0' failed in GtkScrollbar
17:00:40 [2020-09-13T21:00:40.217Z] 
17:00:40 [2020-09-13T21:00:40.217Z] (SWT:1672): Gtk-CRITICAL **: 21:00:40.092: gtk_box_gadget_distribute: assertion 'size >= 0' failed in GtkScrollbar
17:00:40 [2020-09-13T21:00:40.483Z] 
17:00:40 [2020-09-13T21:00:40.483Z] (SWT:1672): Gtk-CRITICAL **: 21:00:40.290: gtk_box_gadget_distribute: assertion 'size >= 0' failed in GtkScrollbar
17:00:40 [2020-09-13T21:00:40.483Z] 
17:00:40 [2020-09-13T21:00:40.483Z] (SWT:1672): Gtk-WARNING **: 21:00:40.291: Negative content width -13 (allocation 5, extents 9x9) while allocating gadget (node entry, owner GtkEntry)
17:00:40 [2020-09-13T21:00:40.483Z] 
17:00:40 [2020-09-13T21:00:40.483Z] (SWT:1672): Gtk-WARNING **: 21:00:40.291: Negative content height -1 (allocation 1, extents 1x1) while allocating gadget (node scrolledwindow, owner GtkScrolledWindow)
17:00:40 [2020-09-13T21:00:40.483Z] 
17:00:40 [2020-09-13T21:00:40.483Z] (SWT:1672): Gtk-CRITICAL **: 21:00:40.291: gtk_box_gadget_distribute: assertion 'size >= 0' failed in GtkScrollbar
17:00:40 [2020-09-13T21:00:40.483Z] 
17:00:40 [2020-09-13T21:00:40.483Z] (SWT:1672): Gtk-CRITICAL **: 21:00:40.291: gtk_box_gadget_distribute: assertion 'size >= 0' failed in GtkScrollbar
17:00:41 [2020-09-13T21:00:41.063Z] 
17:00:41 [2020-09-13T21:00:41.063Z] (SWT:1672): Gtk-CRITICAL **: 21:00:40.918: gtk_box_gadget_distribute: assertion 'size >= 0' failed in GtkScrollbar
17:00:41 [2020-09-13T21:00:41.064Z] 
17:00:41 [2020-09-13T21:00:41.064Z] (SWT:1672): Gtk-WARNING **: 21:00:40.918: Negative content width -13 (allocation 5, extents 9x9) while allocating gadget (node entry, owner GtkEntry)
17:00:41 [2020-09-13T21:00:41.064Z] 
17:00:41 [2020-09-13T21:00:41.064Z] (SWT:1672): Gtk-WARNING **: 21:00:40.918: Negative content height -1 (allocation 1, extents 1x1) while allocating gadget (node scrolledwindow, owner GtkScrolledWindow)
17:00:41 [2020-09-13T21:00:41.064Z] 
17:00:41 [2020-09-13T21:00:41.064Z] (SWT:1672): Gtk-CRITICAL **: 21:00:40.918: gtk_box_gadget_distribute: assertion 'size >= 0' failed in GtkScrollbar
17:00:41 [2020-09-13T21:00:41.064Z] 
17:00:41 [2020-09-13T21:00:41.064Z] (SWT:1672): Gtk-CRITICAL **: 21:00:40.919: gtk_box_gadget_distribute: assertion 'size >= 0' failed in GtkScrollbar
17:00:42 [2020-09-13T21:00:42.499Z] 
17:00:42 [2020-09-13T21:00:42.499Z] (SWT:1672): Gtk-CRITICAL **: 21:00:42.373: gtk_box_gadget_distribute: assertion 'size >= 0' failed in GtkScrollbar
17:00:42 [2020-09-13T21:00:42.499Z] 
17:00:42 [2020-09-13T21:00:42.499Z] (SWT:1672): Gtk-WARNING **: 21:00:42.374: Negative content width -13 (allocation 5, extents 9x9) while allocating gadget (node entry, owner GtkEntry)
17:00:42 [2020-09-13T21:00:42.499Z] 
17:00:42 [2020-09-13T21:00:42.499Z] (SWT:1672): Gtk-WARNING **: 21:00:42.374: Negative content height -1 (allocation 1, extents 1x1) while allocating gadget (node scrolledwindow, owner GtkScrolledWindow)
17:00:42 [2020-09-13T21:00:42.499Z] 
17:00:42 [2020-09-13T21:00:42.499Z] (SWT:1672): Gtk-CRITICAL **: 21:00:42.374: gtk_box_gadget_distribute: assertion 'size >= 0' failed in GtkScrollbar
17:00:42 [2020-09-13T21:00:42.499Z] 
17:00:42 [2020-09-13T21:00:42.499Z] (SWT:1672): Gtk-CRITICAL **: 21:00:42.374: gtk_box_gadget_distribute: assertion 'size >= 0' failed in GtkScrollbar
17:00:43 [2020-09-13T21:00:43.063Z] 
17:00:43 [2020-09-13T21:00:43.063Z] (SWT:1672): Gtk-CRITICAL **: 21:00:42.963: gtk_box_gadget_distribute: assertion 'size >= 0' failed in GtkScrollbar
17:00:43 [2020-09-13T21:00:43.063Z] 
17:00:43 [2020-09-13T21:00:43.063Z] (SWT:1672): Gtk-WARNING **: 21:00:42.963: Negative content width -13 (allocation 5, extents 9x9) while allocating gadget (node entry, owner GtkEntry)
17:00:43 [2020-09-13T21:00:43.063Z] 
17:00:43 [2020-09-13T21:00:43.063Z] (SWT:1672): Gtk-WARNING **: 21:00:42.963: Negative content height -1 (allocation 1, extents 1x1) while allocating gadget (node scrolledwindow, owner GtkScrolledWindow)
17:00:43 [2020-09-13T21:00:43.063Z] 
17:00:43 [2020-09-13T21:00:43.063Z] (SWT:1672): Gtk-CRITICAL **: 21:00:42.963: gtk_box_gadget_distribute: assertion 'size >= 0' failed in GtkScrollbar
17:00:43 [2020-09-13T21:00:43.063Z] 
17:00:43 [2020-09-13T21:00:43.063Z] (SWT:1672): Gtk-CRITICAL **: 21:00:42.964: gtk_box_gadget_distribute: assertion 'size >= 0' failed in GtkScrollbar
17:00:43 [2020-09-13T21:00:43.629Z] 
17:00:43 [2020-09-13T21:00:43.629Z] (SWT:1672): Gtk-CRITICAL **: 21:00:43.547: gtk_box_gadget_distribute: assertion 'size >= 0' failed in GtkScrollbar
17:00:43 [2020-09-13T21:00:43.629Z] 
17:00:43 [2020-09-13T21:00:43.629Z] (SWT:1672): Gtk-WARNING **: 21:00:43.548: Negative content width -13 (allocation 5, extents 9x9) while allocating gadget (node entry, owner GtkEntry)
17:00:43 [2020-09-13T21:00:43.629Z] 
17:00:43 [2020-09-13T21:00:43.629Z] (SWT:1672): Gtk-WARNING **: 21:00:43.548: Negative content height -1 (allocation 1, extents 1x1) while allocating gadget (node scrolledwindow, owner GtkScrolledWindow)
17:00:43 [2020-09-13T21:00:43.629Z] 
17:00:43 [2020-09-13T21:00:43.629Z] (SWT:1672): Gtk-CRITICAL **: 21:00:43.548: gtk_box_gadget_distribute: assertion 'size >= 0' failed in GtkScrollbar
17:00:43 [2020-09-13T21:00:43.629Z] 
17:00:43 [2020-09-13T21:00:43.629Z] (SWT:1672): Gtk-CRITICAL **: 21:00:43.548: gtk_box_gadget_distribute: assertion 'size >= 0' failed in GtkScrollbar
17:00:44 [2020-09-13T21:00:44.563Z] 
17:00:44 [2020-09-13T21:00:44.563Z] (SWT:1672): Gtk-CRITICAL **: 21:00:44.500: gtk_box_gadget_distribute: assertion 'size >= 0' failed in GtkScrollbar
17:00:44 [2020-09-13T21:00:44.563Z] 
17:00:44 [2020-09-13T21:00:44.563Z] (SWT:1672): Gtk-WARNING **: 21:00:44.500: Negative content width -13 (allocation 5, extents 9x9) while allocating gadget (node entry, owner GtkEntry)
17:00:44 [2020-09-13T21:00:44.563Z] 
17:00:44 [2020-09-13T21:00:44.563Z] (SWT:1672): Gtk-WARNING **: 21:00:44.501: Negative content height -1 (allocation 1, extents 1x1) while allocating gadget (node scrolledwindow, owner GtkScrolledWindow)
17:00:44 [2020-09-13T21:00:44.563Z] 
17:00:44 [2020-09-13T21:00:44.563Z] (SWT:1672): Gtk-CRITICAL **: 21:00:44.501: gtk_box_gadget_distribute: assertion 'size >= 0' failed in GtkScrollbar
17:00:44 [2020-09-13T21:00:44.563Z] 
17:00:44 [2020-09-13T21:00:44.563Z] (SWT:1672): Gtk-CRITICAL **: 21:00:44.501: gtk_box_gadget_distribute: assertion 'size >= 0' failed in GtkScrollbar
17:00:45 [2020-09-13T21:00:45.936Z] Tests run: 3, Failures: 0, Errors: 0, Skipped: 0, Time elapsed: 6.441 s - in org.eclipse.egit.ui.wizards.share.SharingWizardTest
17:00:45 [2020-09-13T21:00:45.936Z] shareProjectWithExternalRepo(org.eclipse.egit.ui.wizards.share.SharingWizardTest)  Time elapsed: 2.89 s
17:00:45 [2020-09-13T21:00:45.936Z] shareProjectWithAlreadyCreatedRepos(org.eclipse.egit.ui.wizards.share.SharingWizardTest)  Time elapsed: 2.144 s
17:00:45 [2020-09-13T21:00:45.936Z] shareProjectAndCreateRepo(org.eclipse.egit.ui.wizards.share.SharingWizardTest)  Time elapsed: 1.402 s
17:00:45 [2020-09-13T21:00:45.936Z] Running org.eclipse.egit.ui.wizards.clone.GitCloneSourceProviderExtensionTest
17:00:45 [2020-09-13T21:00:45.936Z] Tests run: 1, Failures: 0, Errors: 0, Skipped: 0, Time elapsed: 0.001 s - in org.eclipse.egit.ui.wizards.clone.GitCloneSourceProviderExtensionTest
17:00:45 [2020-09-13T21:00:45.936Z] testGetRepositoryImports(org.eclipse.egit.ui.wizards.clone.GitCloneSourceProviderExtensionTest)  Time elapsed: 0 s
17:00:45 [2020-09-13T21:00:45.936Z] Running org.eclipse.egit.ui.wizards.clone.GitCloneWizardHttpTest
17:00:46 [2020-09-13T21:00:46.500Z] 2020-09-13 21:00:46.432:INFO::WorkbenchTestable: Logging initialized @720939ms to org.eclipse.jetty.util.log.StdErrLog
17:00:46 [2020-09-13T21:00:46.758Z] 2020-09-13 21:00:46.529:INFO:oejs.Server:WorkbenchTestable: jetty-9.4.30.v20200611; built: 2020-06-16T05:54:33.713Z; git: 271836e4c1f4612f12b7bb13ef5a92a927634b0d; jvm 1.8.0_262-b10
17:00:46 [2020-09-13T21:00:46.758Z] 2020-09-13 21:00:46.572:INFO:oejsh.ContextHandler:WorkbenchTestable: Started o.e.j.s.ServletContextHandler@769c5e08{/sbasic,null,AVAILABLE}
17:00:46 [2020-09-13T21:00:46.758Z] 2020-09-13 21:00:46.628:INFO:oejs.AbstractConnector:WorkbenchTestable: Started ServerConnector@79b6f6df{HTTP/1.1, (http/1.1)}{127.0.0.1:40255}
17:00:46 [2020-09-13T21:00:46.758Z] 2020-09-13 21:00:46.629:INFO:oejs.Server:WorkbenchTestable: Started @721136ms
17:00:49 [2020-09-13T21:00:49.288Z] 2020-09-13 21:00:49.043:INFO:oejs.AbstractConnector:WorkbenchTestable: Stopped ServerConnector@79b6f6df{HTTP/1.1, (http/1.1)}{127.0.0.1:0}
17:00:49 [2020-09-13T21:00:49.288Z] 2020-09-13 21:00:49.050:INFO:oejsh.ContextHandler:WorkbenchTestable: Stopped o.e.j.s.ServletContextHandler@769c5e08{/sbasic,null,UNAVAILABLE}
17:00:49 [2020-09-13T21:00:49.288Z] Tests run: 1, Failures: 0, Errors: 0, Skipped: 0, Time elapsed: 3.176 s - in org.eclipse.egit.ui.wizards.clone.GitCloneWizardHttpTest
17:00:49 [2020-09-13T21:00:49.288Z] canCloneARemoteRepo(org.eclipse.egit.ui.wizards.clone.GitCloneWizardHttpTest)  Time elapsed: 2.41 s
17:00:49 [2020-09-13T21:00:49.289Z] Running org.eclipse.egit.ui.wizards.clone.GitCloneWizardHttpsTest
17:00:50 [2020-09-13T21:00:50.222Z] 2020-09-13 21:00:49.966:INFO:oejs.Server:WorkbenchTestable: jetty-9.4.30.v20200611; built: 2020-06-16T05:54:33.713Z; git: 271836e4c1f4612f12b7bb13ef5a92a927634b0d; jvm 1.8.0_262-b10
17:00:50 [2020-09-13T21:00:50.222Z] 2020-09-13 21:00:49.967:INFO:oejsh.ContextHandler:WorkbenchTestable: Started o.e.j.s.ServletContextHandler@791fa299{/sbasic,null,AVAILABLE}
17:00:50 [2020-09-13T21:00:50.222Z] 2020-09-13 21:00:49.972:INFO:oejs.AbstractConnector:WorkbenchTestable: Started ServerConnector@4c811765{HTTP/1.1, (http/1.1)}{127.0.0.1:46123}
17:00:50 [2020-09-13T21:00:50.222Z] 2020-09-13 21:00:49.975:INFO:oejus.SslContextFactory:WorkbenchTestable: x509=X509@61ab98fb(centos-7-mvqtp,h=[],w=[]) for Client@551cc2b9[provider=null,keyStore=file:///tmp/jks2909705696306575667/keystore.jks,trustStore=file:///tmp/jks2909705696306575667/keystore.jks]
17:00:50 [2020-09-13T21:00:50.222Z] 2020-09-13 21:00:49.994:WARN:oejusS.config:WorkbenchTestable: Trusting all certificates configured for Client@551cc2b9[provider=null,keyStore=file:///tmp/jks2909705696306575667/keystore.jks,trustStore=file:///tmp/jks2909705696306575667/keystore.jks]
17:00:50 [2020-09-13T21:00:50.222Z] 2020-09-13 21:00:49.994:WARN:oejusS.config:WorkbenchTestable: No Client EndPointIdentificationAlgorithm configured for Client@551cc2b9[provider=null,keyStore=file:///tmp/jks2909705696306575667/keystore.jks,trustStore=file:///tmp/jks2909705696306575667/keystore.jks]
17:00:50 [2020-09-13T21:00:50.222Z] 2020-09-13 21:00:50.001:INFO:oejs.AbstractConnector:WorkbenchTestable: Started ServerConnector@b615599{SSL, (ssl, http/1.1)}{127.0.0.1:36874}
17:00:50 [2020-09-13T21:00:50.222Z] 2020-09-13 21:00:50.001:INFO:oejs.Server:WorkbenchTestable: Started @724508ms
17:00:52 [2020-09-13T21:00:52.748Z] 2020-09-13 21:00:52.541:INFO:oejs.AbstractConnector:WorkbenchTestable: Stopped ServerConnector@4c811765{HTTP/1.1, (http/1.1)}{127.0.0.1:0}
17:00:52 [2020-09-13T21:00:52.748Z] 2020-09-13 21:00:52.542:INFO:oejs.AbstractConnector:WorkbenchTestable: Stopped ServerConnector@b615599{SSL, (ssl, http/1.1)}{127.0.0.1:0}
17:00:52 [2020-09-13T21:00:52.748Z] 2020-09-13 21:00:52.542:INFO:oejsh.ContextHandler:WorkbenchTestable: Stopped o.e.j.s.ServletContextHandler@791fa299{/sbasic,null,UNAVAILABLE}
17:00:52 [2020-09-13T21:00:52.748Z] Tests run: 1, Failures: 0, Errors: 0, Skipped: 0, Time elapsed: 3.469 s - in org.eclipse.egit.ui.wizards.clone.GitCloneWizardHttpsTest
17:00:52 [2020-09-13T21:00:52.748Z] canCloneARemoteRepo(org.eclipse.egit.ui.wizards.clone.GitCloneWizardHttpsTest)  Time elapsed: 2.54 s
17:00:52 [2020-09-13T21:00:52.748Z] Running org.eclipse.egit.ui.wizards.clone.GitCloneWizardTest
17:00:59 [2020-09-13T21:00:59.371Z] Tests run: 10, Failures: 0, Errors: 0, Skipped: 2, Time elapsed: 5.832 s - in org.eclipse.egit.ui.wizards.clone.GitCloneWizardTest
17:00:59 [2020-09-13T21:00:59.371Z] canCloneARemoteRepo(org.eclipse.egit.ui.wizards.clone.GitCloneWizardTest)  Time elapsed: 0.956 s
17:00:59 [2020-09-13T21:00:59.371Z] invalidPortFreezesDialog(org.eclipse.egit.ui.wizards.clone.GitCloneWizardTest) skipped
17:00:59 [2020-09-13T21:00:59.371Z] updatesParameterFieldsInImportDialogWhenURIIsUpdated(org.eclipse.egit.ui.wizards.clone.GitCloneWizardTest)  Time elapsed: 0.638 s
17:00:59 [2020-09-13T21:00:59.371Z] clonedRepositoryShouldExistOnFileSystem(org.eclipse.egit.ui.wizards.clone.GitCloneWizardTest)  Time elapsed: 1.401 s
17:00:59 [2020-09-13T21:00:59.371Z] alteringSomeParametersDuringClone(org.eclipse.egit.ui.wizards.clone.GitCloneWizardTest)  Time elapsed: 0.891 s
17:00:59 [2020-09-13T21:00:59.371Z] gitStyleUriSelectsSshProtocol(org.eclipse.egit.ui.wizards.clone.GitCloneWizardTest)  Time elapsed: 0.251 s
17:00:59 [2020-09-13T21:00:59.371Z] invalidHostnameFreezesDialog(org.eclipse.egit.ui.wizards.clone.GitCloneWizardTest) skipped
17:00:59 [2020-09-13T21:00:59.371Z] acceptCloneCommandAsURI(org.eclipse.egit.ui.wizards.clone.GitCloneWizardTest)  Time elapsed: 0.291 s
17:00:59 [2020-09-13T21:00:59.371Z] cloneWithTagOption(org.eclipse.egit.ui.wizards.clone.GitCloneWizardTest)  Time elapsed: 0.861 s
17:00:59 [2020-09-13T21:00:59.371Z] testFileURIWithSpace(org.eclipse.egit.ui.wizards.clone.GitCloneWizardTest)  Time elapsed: 0.253 s
17:00:59 [2020-09-13T21:00:59.371Z] Running org.eclipse.egit.ui.wizards.pull.PullWizardTest
17:00:59 [2020-09-13T21:00:59.371Z] 
17:00:59 [2020-09-13T21:00:59.371Z] (SWT:1672): Gtk-WARNING **: 21:00:59.085: Negative content width -6 (allocation 1, extents 4x3) while allocating gadget (node toolbar, owner GtkToolbar)
17:01:00 [2020-09-13T21:01:00.741Z] 
17:01:00 [2020-09-13T21:01:00.741Z] (SWT:1672): Gtk-WARNING **: 21:01:00.505: Negative content width -6 (allocation 1, extents 4x3) while allocating gadget (node toolbar, owner GtkToolbar)
17:01:00 [2020-09-13T21:01:00.741Z] Tests run: 1, Failures: 0, Errors: 0, Skipped: 0, Time elapsed: 2.222 s - in org.eclipse.egit.ui.wizards.pull.PullWizardTest
17:01:00 [2020-09-13T21:01:00.741Z] pullFromProjectRepo(org.eclipse.egit.ui.wizards.pull.PullWizardTest)  Time elapsed: 2.219 s
17:01:00 [2020-09-13T21:01:00.741Z] Running org.eclipse.egit.ui.search.CommitSearchQueryTest
17:01:04 [2020-09-13T21:01:04.929Z] Tests run: 7, Failures: 0, Errors: 0, Skipped: 0, Time elapsed: 4.131 s - in org.eclipse.egit.ui.search.CommitSearchQueryTest
17:01:04 [2020-09-13T21:01:04.929Z] testQuery(org.eclipse.egit.ui.search.CommitSearchQueryTest)  Time elapsed: 0.666 s
17:01:04 [2020-09-13T21:01:04.929Z] testMatchMessage(org.eclipse.egit.ui.search.CommitSearchQueryTest)  Time elapsed: 0.576 s
17:01:04 [2020-09-13T21:01:04.929Z] testCaseInsensitive(org.eclipse.egit.ui.search.CommitSearchQueryTest)  Time elapsed: 0.558 s
17:01:04 [2020-09-13T21:01:04.929Z] testMatchCommit(org.eclipse.egit.ui.search.CommitSearchQueryTest)  Time elapsed: 0.549 s
17:01:04 [2020-09-13T21:01:04.929Z] testMatchParent(org.eclipse.egit.ui.search.CommitSearchQueryTest)  Time elapsed: 0.57 s
17:01:04 [2020-09-13T21:01:04.929Z] testMatchTree(org.eclipse.egit.ui.search.CommitSearchQueryTest)  Time elapsed: 0.621 s
17:01:04 [2020-09-13T21:01:04.929Z] testEmptyMatches(org.eclipse.egit.ui.search.CommitSearchQueryTest)  Time elapsed: 0.554 s
17:01:04 [2020-09-13T21:01:04.929Z] Running org.eclipse.egit.ui.search.CommitSearchDialogTest
17:01:05 [2020-09-13T21:01:05.493Z] 
17:01:05 [2020-09-13T21:01:05.493Z] (SWT:1672): Gtk-WARNING **: 21:01:05.416: Negative content width -6 (allocation 1, extents 4x3) while allocating gadget (node toolbar, owner GtkToolbar)
17:01:05 [2020-09-13T21:01:05.493Z] 
17:01:05 [2020-09-13T21:01:05.493Z] (SWT:1672): Gtk-WARNING **: 21:01:05.428: Negative content width -6 (allocation 1, extents 4x3) while allocating gadget (node toolbar, owner GtkToolbar)
17:01:05 [2020-09-13T21:01:05.493Z] 
17:01:05 [2020-09-13T21:01:05.493Z] (SWT:1672): Gtk-WARNING **: 21:01:05.479: Negative content width -6 (allocation 1, extents 4x3) while allocating gadget (node toolbar, owner GtkToolbar)
17:01:05 [2020-09-13T21:01:05.752Z] 
17:01:05 [2020-09-13T21:01:05.752Z] (SWT:1672): Gtk-WARNING **: 21:01:05.512: Negative content width -6 (allocation 1, extents 4x3) while allocating gadget (node toolbar, owner GtkToolbar)
17:01:06 [2020-09-13T21:01:06.316Z] 
17:01:06 [2020-09-13T21:01:06.316Z] (SWT:1672): Gtk-WARNING **: 21:01:06.166: Negative content width -6 (allocation 1, extents 4x3) while allocating gadget (node toolbar, owner GtkToolbar)
17:01:06 [2020-09-13T21:01:06.316Z] Tests run: 1, Failures: 0, Errors: 0, Skipped: 0, Time elapsed: 1.533 s - in org.eclipse.egit.ui.search.CommitSearchDialogTest
17:01:06 [2020-09-13T21:01:06.316Z] openCommitTabOnSearchDialog(org.eclipse.egit.ui.search.CommitSearchDialogTest)  Time elapsed: 1.529 s
17:01:06 [2020-09-13T21:01:06.316Z] Running org.eclipse.egit.ui.prefpages.configuration.GlobalConfigurationPageTest
17:01:06 [2020-09-13T21:01:06.316Z] 
17:01:06 [2020-09-13T21:01:06.316Z] !ENTRY org.eclipse.ui 2 2 2020-09-13 21:01:06.297
17:01:06 [2020-09-13T21:01:06.316Z] !MESSAGE Invalid preference category path: org.eclipse.ui.net.NetPreferences (bundle: org.eclipse.jsch.ui, page: org.eclipse.jsch.ui.SSHPreferences)
17:01:06 [2020-09-13T21:01:06.316Z] 
17:01:06 [2020-09-13T21:01:06.316Z] (SWT:1672): Gtk-WARNING **: 21:01:06.307: Negative content width -13 (allocation 5, extents 9x9) while allocating gadget (node entry, owner GtkEntry)
17:01:06 [2020-09-13T21:01:06.574Z] 
17:01:06 [2020-09-13T21:01:06.574Z] (SWT:1672): Gtk-WARNING **: 21:01:06.468: Negative content width -13 (allocation 5, extents 9x9) while allocating gadget (node entry, owner GtkEntry)
17:01:06 [2020-09-13T21:01:06.839Z] 
17:01:06 [2020-09-13T21:01:06.840Z] (SWT:1672): Gtk-WARNING **: 21:01:06.604: Negative content width -13 (allocation 5, extents 9x9) while allocating gadget (node entry, owner GtkEntry)
17:01:06 [2020-09-13T21:01:06.840Z] 
17:01:06 [2020-09-13T21:01:06.840Z] (SWT:1672): Gtk-WARNING **: 21:01:06.728: Negative content width -13 (allocation 5, extents 9x9) while allocating gadget (node entry, owner GtkEntry)
17:01:06 [2020-09-13T21:01:06.840Z] 
17:01:06 [2020-09-13T21:01:06.840Z] (SWT:1672): Gtk-WARNING **: 21:01:06.808: Negative content width -13 (allocation 5, extents 9x9) while allocating gadget (node entry, owner GtkEntry)
17:01:07 [2020-09-13T21:01:07.096Z] 
17:01:07 [2020-09-13T21:01:07.096Z] (SWT:1672): Gtk-WARNING **: 21:01:06.902: Negative content width -13 (allocation 5, extents 9x9) while allocating gadget (node entry, owner GtkEntry)
17:01:07 [2020-09-13T21:01:07.096Z] 
17:01:07 [2020-09-13T21:01:07.096Z] (SWT:1672): Gtk-WARNING **: 21:01:07.024: Negative content width -13 (allocation 5, extents 9x9) while allocating gadget (node entry, owner GtkEntry)
17:01:07 [2020-09-13T21:01:07.096Z] 
17:01:07 [2020-09-13T21:01:07.096Z] (SWT:1672): Gtk-WARNING **: 21:01:07.085: Negative content width -6 (allocation 1, extents 4x3) while allocating gadget (node toolbar, owner GtkToolbar)
17:01:07 [2020-09-13T21:01:07.096Z] 
17:01:07 [2020-09-13T21:01:07.096Z] (SWT:1672): Gtk-WARNING **: 21:01:07.085: Negative content height -3 (allocation 1, extents 2x2) while allocating gadget (node toolbar, owner GtkToolbar)
17:01:07 [2020-09-13T21:01:07.096Z] 
17:01:07 [2020-09-13T21:01:07.096Z] (SWT:1672): Gtk-WARNING **: 21:01:07.085: Negative content width -6 (allocation 1, extents 4x3) while allocating gadget (node toolbar, owner GtkToolbar)
17:01:07 [2020-09-13T21:01:07.096Z] 
17:01:07 [2020-09-13T21:01:07.096Z] (SWT:1672): Gtk-WARNING **: 21:01:07.085: Negative content height -3 (allocation 1, extents 2x2) while allocating gadget (node toolbar, owner GtkToolbar)
17:01:07 [2020-09-13T21:01:07.354Z] 
17:01:07 [2020-09-13T21:01:07.354Z] (SWT:1672): Gtk-WARNING **: 21:01:07.206: Negative content width -13 (allocation 5, extents 9x9) while allocating gadget (node entry, owner GtkEntry)
17:01:07 [2020-09-13T21:01:07.354Z] 
17:01:07 [2020-09-13T21:01:07.354Z] (SWT:1672): Gtk-WARNING **: 21:01:07.344: Negative content width -13 (allocation 5, extents 9x9) while allocating gadget (node entry, owner GtkEntry)
17:01:07 [2020-09-13T21:01:07.612Z] 
17:01:07 [2020-09-13T21:01:07.612Z] (SWT:1672): Gtk-WARNING **: 21:01:07.569: Negative content width -13 (allocation 5, extents 9x9) while allocating gadget (node entry, owner GtkEntry)
17:01:07 [2020-09-13T21:01:07.870Z] 
17:01:07 [2020-09-13T21:01:07.870Z] (SWT:1672): Gtk-WARNING **: 21:01:07.715: Negative content width -13 (allocation 5, extents 9x9) while allocating gadget (node entry, owner GtkEntry)
17:01:07 [2020-09-13T21:01:07.870Z] 
17:01:07 [2020-09-13T21:01:07.870Z] (SWT:1672): Gtk-WARNING **: 21:01:07.841: Negative content width -13 (allocation 5, extents 9x9) while allocating gadget (node entry, owner GtkEntry)
17:01:08 [2020-09-13T21:01:08.152Z] Tests run: 11, Failures: 0, Errors: 0, Skipped: 0, Time elapsed: 1.668 s - in org.eclipse.egit.ui.prefpages.configuration.GlobalConfigurationPageTest
17:01:08 [2020-09-13T21:01:08.152Z] testAddSubSectionEntry(org.eclipse.egit.ui.prefpages.configuration.GlobalConfigurationPageTest)  Time elapsed: 0.176 s
17:01:08 [2020-09-13T21:01:08.152Z] testAddSectionEntry(org.eclipse.egit.ui.prefpages.configuration.GlobalConfigurationPageTest)  Time elapsed: 0.136 s
17:01:08 [2020-09-13T21:01:08.152Z] testCanCreateSameEntryValue(org.eclipse.egit.ui.prefpages.configuration.GlobalConfigurationPageTest)  Time elapsed: 0.124 s
17:01:08 [2020-09-13T21:01:08.152Z] testNodes(org.eclipse.egit.ui.prefpages.configuration.GlobalConfigurationPageTest)  Time elapsed: 0.08 s
17:01:08 [2020-09-13T21:01:08.152Z] testRemoveValue(org.eclipse.egit.ui.prefpages.configuration.GlobalConfigurationPageTest)  Time elapsed: 0.094 s
17:01:08 [2020-09-13T21:01:08.152Z] testAddSubSectionEntryWithSuggestion(org.eclipse.egit.ui.prefpages.configuration.GlobalConfigurationPageTest)  Time elapsed: 0.122 s
17:01:08 [2020-09-13T21:01:08.152Z] testOpenEditor(org.eclipse.egit.ui.prefpages.configuration.GlobalConfigurationPageTest)  Time elapsed: 0.182 s
17:01:08 [2020-09-13T21:01:08.152Z] testSubsectionWithDot(org.eclipse.egit.ui.prefpages.configuration.GlobalConfigurationPageTest)  Time elapsed: 0.137 s
17:01:08 [2020-09-13T21:01:08.152Z] testChecksForKey(org.eclipse.egit.ui.prefpages.configuration.GlobalConfigurationPageTest)  Time elapsed: 0.226 s
17:01:08 [2020-09-13T21:01:08.152Z] testRemoveSubSection(org.eclipse.egit.ui.prefpages.configuration.GlobalConfigurationPageTest)  Time elapsed: 0.146 s
17:01:08 [2020-09-13T21:01:08.152Z] testRemoveSection(org.eclipse.egit.ui.prefpages.configuration.GlobalConfigurationPageTest)  Time elapsed: 0.125 s
17:01:08 [2020-09-13T21:01:08.152Z] Running org.eclipse.egit.ui.submodule.SubmoduleUpdateTest
17:01:08 [2020-09-13T21:01:08.743Z] 
17:01:08 [2020-09-13T21:01:08.743Z] (SWT:1672): Gtk-WARNING **: 21:01:08.682: Negative content width -6 (allocation 1, extents 4x3) while allocating gadget (node toolbar, owner GtkToolbar)
17:01:11 [2020-09-13T21:01:11.269Z] 
17:01:11 [2020-09-13T21:01:11.269Z] (SWT:1672): Gtk-WARNING **: 21:01:11.195: Negative content width -6 (allocation 1, extents 4x3) while allocating gadget (node toolbar, owner GtkToolbar)
17:01:11 [2020-09-13T21:01:11.525Z] Tests run: 1, Failures: 0, Errors: 0, Skipped: 0, Time elapsed: 3.341 s - in org.eclipse.egit.ui.submodule.SubmoduleUpdateTest
17:01:11 [2020-09-13T21:01:11.525Z] updateSubmodule(org.eclipse.egit.ui.submodule.SubmoduleUpdateTest)  Time elapsed: 3.337 s
17:01:11 [2020-09-13T21:01:11.525Z] Running org.eclipse.egit.ui.submodule.SubmoduleSyncTest
17:01:12 [2020-09-13T21:01:12.091Z] 
17:01:12 [2020-09-13T21:01:12.091Z] (SWT:1672): Gtk-WARNING **: 21:01:12.042: Negative content width -6 (allocation 1, extents 4x3) while allocating gadget (node toolbar, owner GtkToolbar)
17:01:15 [2020-09-13T21:01:15.370Z] 
17:01:15 [2020-09-13T21:01:15.370Z] (SWT:1672): Gtk-WARNING **: 21:01:14.818: Negative content width -6 (allocation 1, extents 4x3) while allocating gadget (node toolbar, owner GtkToolbar)
17:01:15 [2020-09-13T21:01:15.370Z] Tests run: 1, Failures: 0, Errors: 0, Skipped: 0, Time elapsed: 3.621 s - in org.eclipse.egit.ui.submodule.SubmoduleSyncTest
17:01:15 [2020-09-13T21:01:15.370Z] syncSubmodule(org.eclipse.egit.ui.submodule.SubmoduleSyncTest)  Time elapsed: 3.617 s
17:01:15 [2020-09-13T21:01:15.370Z] Running org.eclipse.egit.ui.submodule.SubmoduleAddTest
17:01:15 [2020-09-13T21:01:15.934Z] 
17:01:15 [2020-09-13T21:01:15.934Z] (SWT:1672): Gtk-WARNING **: 21:01:15.626: Negative content width -6 (allocation 1, extents 4x3) while allocating gadget (node toolbar, owner GtkToolbar)
17:01:18 [2020-09-13T21:01:18.459Z] 
17:01:18 [2020-09-13T21:01:18.459Z] (SWT:1672): Gtk-WARNING **: 21:01:17.892: Negative content width -6 (allocation 1, extents 4x3) while allocating gadget (node toolbar, owner GtkToolbar)
17:01:18 [2020-09-13T21:01:18.459Z] Tests run: 1, Failures: 0, Errors: 0, Skipped: 0, Time elapsed: 3.071 s - in org.eclipse.egit.ui.submodule.SubmoduleAddTest
17:01:18 [2020-09-13T21:01:18.459Z] addAtRoot(org.eclipse.egit.ui.submodule.SubmoduleAddTest)  Time elapsed: 3.067 s
17:01:18 [2020-09-13T21:01:18.459Z] Running org.eclipse.egit.ui.httpauth.PushTest
17:01:18 [2020-09-13T21:01:18.459Z] 2020-09-13 21:01:18.093:INFO:oejs.Server:WorkbenchTestable: jetty-9.4.30.v20200611; built: 2020-06-16T05:54:33.713Z; git: 271836e4c1f4612f12b7bb13ef5a92a927634b0d; jvm 1.8.0_262-b10
17:01:18 [2020-09-13T21:01:18.459Z] 2020-09-13 21:01:18.094:INFO:oejsh.ContextHandler:WorkbenchTestable: Started o.e.j.s.ServletContextHandler@7be98716{/sbasic,null,AVAILABLE}
17:01:18 [2020-09-13T21:01:18.459Z] 2020-09-13 21:01:18.099:INFO:oejs.AbstractConnector:WorkbenchTestable: Started ServerConnector@1d5b3cd6{HTTP/1.1, (http/1.1)}{127.0.0.1:45892}
17:01:18 [2020-09-13T21:01:18.459Z] 2020-09-13 21:01:18.100:INFO:oejs.Server:WorkbenchTestable: Started @752607ms
17:01:19 [2020-09-13T21:01:19.025Z] 
17:01:19 [2020-09-13T21:01:19.025Z] (SWT:1672): Gtk-CRITICAL **: 21:01:18.890: gtk_box_gadget_distribute: assertion 'size >= 0' failed in GtkCheckButton
17:01:19 [2020-09-13T21:01:19.283Z] 
17:01:19 [2020-09-13T21:01:19.283Z] (SWT:1672): Gtk-WARNING **: 21:01:19.213: Negative content width -1 (allocation 1, extents 1x1) while allocating gadget (node trough, owner GtkProgressBar)
17:01:19 [2020-09-13T21:01:19.283Z] 
17:01:19 [2020-09-13T21:01:19.283Z] (SWT:1672): Gtk-WARNING **: 21:01:19.219: Negative content width -1 (allocation 1, extents 1x1) while allocating gadget (node trough, owner GtkProgressBar)
17:01:19 [2020-09-13T21:01:19.283Z] 
17:01:19 [2020-09-13T21:01:19.283Z] (SWT:1672): Gtk-WARNING **: 21:01:19.224: Negative content width -1 (allocation 1, extents 1x1) while allocating gadget (node trough, owner GtkProgressBar)
17:01:19 [2020-09-13T21:01:19.848Z] 2020-09-13 21:01:19.771:INFO:oejs.AbstractConnector:WorkbenchTestable: Stopped ServerConnector@1d5b3cd6{HTTP/1.1, (http/1.1)}{127.0.0.1:0}
17:01:19 [2020-09-13T21:01:19.848Z] 2020-09-13 21:01:19.771:INFO:oejsh.ContextHandler:WorkbenchTestable: Stopped o.e.j.s.ServletContextHandler@7be98716{/sbasic,null,UNAVAILABLE}
17:01:19 [2020-09-13T21:01:19.848Z] Tests run: 1, Failures: 0, Errors: 0, Skipped: 0, Time elapsed: 1.773 s - in org.eclipse.egit.ui.httpauth.PushTest
17:01:19 [2020-09-13T21:01:19.848Z] testPush(org.eclipse.egit.ui.httpauth.PushTest)  Time elapsed: 1.772 s
17:01:19 [2020-09-13T21:01:19.848Z] Running org.eclipse.egit.ui.operations.GitScopeUtilTest
17:01:24 [2020-09-13T21:01:24.108Z] Tests run: 5, Failures: 0, Errors: 0, Skipped: 0, Time elapsed: 3.865 s - in org.eclipse.egit.ui.operations.GitScopeUtilTest
17:01:24 [2020-09-13T21:01:24.108Z] relatedChangesWithPrompt(org.eclipse.egit.ui.operations.GitScopeUtilTest)  Time elapsed: 1.429 s
17:01:24 [2020-09-13T21:01:24.108Z] modelProviderWithExtensionFiles(org.eclipse.egit.ui.operations.GitScopeUtilTest)  Time elapsed: 0.593 s
17:01:24 [2020-09-13T21:01:24.108Z] relatedChangesWithInvalidParams(org.eclipse.egit.ui.operations.GitScopeUtilTest)  Time elapsed: 0.567 s
17:01:24 [2020-09-13T21:01:24.108Z] relatedChangesWithNullResources(org.eclipse.egit.ui.operations.GitScopeUtilTest)  Time elapsed: 0.674 s
17:01:24 [2020-09-13T21:01:24.108Z] relatedChangesWithEmptyResources(org.eclipse.egit.ui.operations.GitScopeUtilTest)  Time elapsed: 0.596 s
17:01:24 [2020-09-13T21:01:24.108Z] 
17:01:24 [2020-09-13T21:01:24.108Z] Results:
17:01:24 [2020-09-13T21:01:24.108Z] 
17:01:24 [2020-09-13T21:01:24.108Z] Errors: 
17:01:24 [2020-09-13T21:01:24.108Z]   SmartImportWizardTest>LocalRepositoryTestCase.afterClassBase:288 » IO Could no...
17:01:24 [2020-09-13T21:01:24.108Z] 
17:01:24 [2020-09-13T21:01:24.108Z] Tests run: 542, Failures: 0, Errors: 1, Skipped: 12
17:01:24 [2020-09-13T21:01:24.108Z] 
17:01:24 [2020-09-13T21:01:24.108Z] 
17:01:24 [2020-09-13T21:01:24.108Z] (SWT:1672): Gtk-WARNING **: 21:01:23.652: Negative content width -6 (allocation 1, extents 4x3) while allocating gadget (node toolbar, owner GtkToolbar)
17:01:24 [2020-09-13T21:01:24.672Z] 
17:01:24 [2020-09-13T21:01:24.672Z] !ENTRY org.eclipse.core.resources 2 10035 2020-09-13 21:01:24.587
17:01:24 [2020-09-13T21:01:24.672Z] !MESSAGE The workspace will exit with unsaved changes in this session.
17:01:25 [2020-09-13T21:01:25.607Z] [INFO] ------------------------------------------------------------------------
17:01:25 [2020-09-13T21:01:25.607Z] [INFO] Reactor Summary for EGit Parent 5.10.0-SNAPSHOT:
17:01:25 [2020-09-13T21:01:25.607Z] [INFO] 
17:01:25 [2020-09-13T21:01:25.607Z] [INFO] EGit Parent ........................................ SUCCESS [ 26.665 s]
17:01:25 [2020-09-13T21:01:25.607Z] [INFO] EGit Target Platform Definition .................... SUCCESS [  1.278 s]
17:01:25 [2020-09-13T21:01:25.607Z] [INFO] Eclipse EGit ....................................... SUCCESS [  4.626 s]
17:01:25 [2020-09-13T21:01:25.607Z] [INFO] Git Team Provider (Core) ........................... SUCCESS [ 18.907 s]
17:01:25 [2020-09-13T21:01:25.607Z] [INFO] Git Team Provider (UI) ............................. SUCCESS [ 47.037 s]
17:01:25 [2020-09-13T21:01:25.607Z] [INFO] EGit Mylyn UI ...................................... SUCCESS [  7.079 s]
17:01:25 [2020-09-13T21:01:25.607Z] [INFO] Git Team Provider (Documentation) .................. SUCCESS [01:16 min]
17:01:25 [2020-09-13T21:01:25.607Z] [INFO] Eclipse EGit Feature ............................... SUCCESS [  1.200 s]
17:01:25 [2020-09-13T21:01:25.607Z] [INFO] EGit Mylyn Feature ................................. SUCCESS [  1.150 s]
17:01:25 [2020-09-13T21:01:25.607Z] [INFO] Git Flow ........................................... SUCCESS [  6.904 s]
17:01:25 [2020-09-13T21:01:25.607Z] [INFO] Git Flow UI ........................................ SUCCESS [  8.451 s]
17:01:25 [2020-09-13T21:01:25.607Z] [INFO] Eclipse EGit Gitflow Feature ....................... SUCCESS [  1.151 s]
17:01:25 [2020-09-13T21:01:25.607Z] [INFO] EGit JUnit Support ................................. SUCCESS [  7.119 s]
17:01:25 [2020-09-13T21:01:25.607Z] [INFO] GitFlow Test Plug-in ............................... SUCCESS [ 24.923 s]
17:01:25 [2020-09-13T21:01:25.607Z] [INFO] Eclipse EGit Source Feature ........................ SUCCESS [  1.169 s]
17:01:25 [2020-09-13T21:01:25.607Z] [INFO] EGit P2 Repository ................................. SUCCESS [ 16.158 s]
17:01:25 [2020-09-13T21:01:25.607Z] [INFO] EGit Core Test Plug-in ............................. SUCCESS [02:06 min]
17:01:25 [2020-09-13T21:01:25.607Z] [INFO] EGit UI Test Plug-in ............................... FAILURE [12:40 min]
17:01:25 [2020-09-13T21:01:25.607Z] [INFO] EGit Mylyn UI Test Plug-in ......................... SKIPPED
17:01:25 [2020-09-13T21:01:25.607Z] [INFO] ------------------------------------------------------------------------
17:01:25 [2020-09-13T21:01:25.607Z] [INFO] BUILD FAILURE
17:01:25 [2020-09-13T21:01:25.607Z] [INFO] ------------------------------------------------------------------------
17:01:25 [2020-09-13T21:01:25.607Z] [INFO] Total time:  21:50 min
17:01:25 [2020-09-13T21:01:25.607Z] [INFO] Finished at: 2020-09-13T21:01:25Z
17:01:25 [2020-09-13T21:01:25.607Z] [INFO] ------------------------------------------------------------------------
17:01:25 [2020-09-13T21:01:25.607Z] [ERROR] Failed to execute goal org.eclipse.tycho:tycho-surefire-plugin:1.7.0:test (default-test) on project org.eclipse.egit.ui.test: There are test failures.
17:01:25 [2020-09-13T21:01:25.607Z] [ERROR] 
17:01:25 [2020-09-13T21:01:25.607Z] [ERROR] Please refer to /home/jenkins/agent/workspace/egit.gerrit/repo/org.eclipse.egit.ui.test/target/surefire-reports for the individual test results.
17:01:25 [2020-09-13T21:01:25.607Z] [ERROR] -> [Help 1]
17:01:25 [2020-09-13T21:01:25.607Z] org.apache.maven.lifecycle.LifecycleExecutionException: Failed to execute goal org.eclipse.tycho:tycho-surefire-plugin:1.7.0:test (default-test) on project org.eclipse.egit.ui.test: There are test failures.
17:01:25 [2020-09-13T21:01:25.607Z] 
17:01:25 [2020-09-13T21:01:25.607Z] Please refer to /home/jenkins/agent/workspace/egit.gerrit/repo/org.eclipse.egit.ui.test/target/surefire-reports for the individual test results.
17:01:25 [2020-09-13T21:01:25.607Z]     at org.apache.maven.lifecycle.internal.MojoExecutor.execute (MojoExecutor.java:215)
17:01:25 [2020-09-13T21:01:25.607Z]     at org.apache.maven.lifecycle.internal.MojoExecutor.execute (MojoExecutor.java:156)
17:01:25 [2020-09-13T21:01:25.607Z]     at org.apache.maven.lifecycle.internal.MojoExecutor.execute (MojoExecutor.java:148)
17:01:25 [2020-09-13T21:01:25.607Z]     at org.apache.maven.lifecycle.internal.LifecycleModuleBuilder.buildProject (LifecycleModuleBuilder.java:117)
17:01:25 [2020-09-13T21:01:25.607Z]     at org.apache.maven.lifecycle.internal.LifecycleModuleBuilder.buildProject (LifecycleModuleBuilder.java:81)
17:01:25 [2020-09-13T21:01:25.607Z]     at org.apache.maven.lifecycle.internal.builder.singlethreaded.SingleThreadedBuilder.build (SingleThreadedBuilder.java:56)
17:01:25 [2020-09-13T21:01:25.607Z]     at org.apache.maven.lifecycle.internal.LifecycleStarter.execute (LifecycleStarter.java:128)
17:01:25 [2020-09-13T21:01:25.607Z]     at org.apache.maven.DefaultMaven.doExecute (DefaultMaven.java:305)
17:01:25 [2020-09-13T21:01:25.607Z]     at org.apache.maven.DefaultMaven.doExecute (DefaultMaven.java:192)
17:01:25 [2020-09-13T21:01:25.607Z]     at org.apache.maven.DefaultMaven.execute (DefaultMaven.java:105)
17:01:25 [2020-09-13T21:01:25.607Z]     at org.apache.maven.cli.MavenCli.execute (MavenCli.java:957)
17:01:25 [2020-09-13T21:01:25.607Z]     at org.apache.maven.cli.MavenCli.doMain (MavenCli.java:289)
17:01:25 [2020-09-13T21:01:25.607Z]     at org.apache.maven.cli.MavenCli.main (MavenCli.java:193)
17:01:25 [2020-09-13T21:01:25.607Z]     at sun.reflect.NativeMethodAccessorImpl.invoke0 (Native Method)
17:01:25 [2020-09-13T21:01:25.607Z]     at sun.reflect.NativeMethodAccessorImpl.invoke (NativeMethodAccessorImpl.java:62)
17:01:25 [2020-09-13T21:01:25.607Z]     at sun.reflect.DelegatingMethodAccessorImpl.invoke (DelegatingMethodAccessorImpl.java:43)
17:01:25 [2020-09-13T21:01:25.607Z]     at java.lang.reflect.Method.invoke (Method.java:498)
17:01:25 [2020-09-13T21:01:25.607Z]     at org.codehaus.plexus.classworlds.launcher.Launcher.launchEnhanced (Launcher.java:282)
17:01:25 [2020-09-13T21:01:25.607Z]     at org.codehaus.plexus.classworlds.launcher.Launcher.launch (Launcher.java:225)
17:01:25 [2020-09-13T21:01:25.607Z]     at org.codehaus.plexus.classworlds.launcher.Launcher.mainWithExitCode (Launcher.java:406)
17:01:25 [2020-09-13T21:01:25.607Z]     at org.codehaus.plexus.classworlds.launcher.Launcher.main (Launcher.java:347)
17:01:25 [2020-09-13T21:01:25.607Z] Caused by: org.apache.maven.plugin.MojoFailureException: There are test failures.
17:01:25 [2020-09-13T21:01:25.607Z] 
17:01:25 [2020-09-13T21:01:25.607Z] Please refer to /home/jenkins/agent/workspace/egit.gerrit/repo/org.eclipse.egit.ui.test/target/surefire-reports for the individual test results.
17:01:25 [2020-09-13T21:01:25.607Z]     at org.eclipse.tycho.surefire.TestMojo.runTest (TestMojo.java:1063)
17:01:25 [2020-09-13T21:01:25.607Z]     at org.eclipse.tycho.surefire.TestMojo.execute (TestMojo.java:712)
17:01:25 [2020-09-13T21:01:25.607Z]     at org.apache.maven.plugin.DefaultBuildPluginManager.executeMojo (DefaultBuildPluginManager.java:137)
17:01:25 [2020-09-13T21:01:25.607Z]     at org.apache.maven.lifecycle.internal.MojoExecutor.execute (MojoExecutor.java:210)
17:01:25 [2020-09-13T21:01:25.607Z]     at org.apache.maven.lifecycle.internal.MojoExecutor.execute (MojoExecutor.java:156)
17:01:25 [2020-09-13T21:01:25.607Z]     at org.apache.maven.lifecycle.internal.MojoExecutor.execute (MojoExecutor.java:148)
17:01:25 [2020-09-13T21:01:25.607Z]     at org.apache.maven.lifecycle.internal.LifecycleModuleBuilder.buildProject (LifecycleModuleBuilder.java:117)
17:01:25 [2020-09-13T21:01:25.607Z]     at org.apache.maven.lifecycle.internal.LifecycleModuleBuilder.buildProject (LifecycleModuleBuilder.java:81)
17:01:25 [2020-09-13T21:01:25.607Z]     at org.apache.maven.lifecycle.internal.builder.singlethreaded.SingleThreadedBuilder.build (SingleThreadedBuilder.java:56)
17:01:25 [2020-09-13T21:01:25.607Z]     at org.apache.maven.lifecycle.internal.LifecycleStarter.execute (LifecycleStarter.java:128)
17:01:25 [2020-09-13T21:01:25.607Z]     at org.apache.maven.DefaultMaven.doExecute (DefaultMaven.java:305)
17:01:25 [2020-09-13T21:01:25.607Z]     at org.apache.maven.DefaultMaven.doExecute (DefaultMaven.java:192)
17:01:25 [2020-09-13T21:01:25.607Z]     at org.apache.maven.DefaultMaven.execute (DefaultMaven.java:105)
17:01:25 [2020-09-13T21:01:25.607Z]     at org.apache.maven.cli.MavenCli.execute (MavenCli.java:957)
17:01:25 [2020-09-13T21:01:25.607Z]     at org.apache.maven.cli.MavenCli.doMain (MavenCli.java:289)
17:01:25 [2020-09-13T21:01:25.607Z]     at org.apache.maven.cli.MavenCli.main (MavenCli.java:193)
17:01:25 [2020-09-13T21:01:25.607Z]     at sun.reflect.NativeMethodAccessorImpl.invoke0 (Native Method)
17:01:25 [2020-09-13T21:01:25.607Z]     at sun.reflect.NativeMethodAccessorImpl.invoke (NativeMethodAccessorImpl.java:62)
17:01:25 [2020-09-13T21:01:25.607Z]     at sun.reflect.DelegatingMethodAccessorImpl.invoke (DelegatingMethodAccessorImpl.java:43)
17:01:25 [2020-09-13T21:01:25.607Z]     at java.lang.reflect.Method.invoke (Method.java:498)
17:01:25 [2020-09-13T21:01:25.607Z]     at org.codehaus.plexus.classworlds.launcher.Launcher.launchEnhanced (Launcher.java:282)
17:01:25 [2020-09-13T21:01:25.607Z]     at org.codehaus.plexus.classworlds.launcher.Launcher.launch (Launcher.java:225)
17:01:25 [2020-09-13T21:01:25.607Z]     at org.codehaus.plexus.classworlds.launcher.Launcher.mainWithExitCode (Launcher.java:406)
17:01:25 [2020-09-13T21:01:25.607Z]     at org.codehaus.plexus.classworlds.launcher.Launcher.main (Launcher.java:347)
17:01:25 [2020-09-13T21:01:25.607Z] [ERROR] 
17:01:25 [2020-09-13T21:01:25.607Z] [ERROR] Re-run Maven using the -X switch to enable full debug logging.
17:01:25 [2020-09-13T21:01:25.607Z] [ERROR] 
17:01:25 [2020-09-13T21:01:25.607Z] [ERROR] For more information about the errors and possible solutions, please read the following articles:
17:01:25 [2020-09-13T21:01:25.607Z] [ERROR] [Help 1] http://cwiki.apache.org/confluence/display/MAVEN/MojoFailureException
17:01:25 [2020-09-13T21:01:25.607Z] [ERROR] 
17:01:25 [2020-09-13T21:01:25.607Z] [ERROR] After correcting the problems, you can resume the build with the command
17:01:25 [2020-09-13T21:01:25.608Z] [ERROR]   mvn <args> -rf :org.eclipse.egit.ui.test
[Pipeline] }
[Pipeline] // stage
[Pipeline] stage
[Pipeline] { (Results)
[Pipeline] junit
17:01:26 [2020-09-13T21:01:26.979Z] Recording test results
[Pipeline] archiveArtifacts
17:01:27 [2020-09-13T21:01:27.902Z] Archiving artifacts
[Pipeline] findbugs
17:01:31 [2020-09-13T21:01:31.156Z] [FINDBUGS] Collecting findbugs analysis files...
17:01:34 [2020-09-13T21:01:34.907Z] [FINDBUGS] Searching for all files in /home/jenkins/agent/workspace/egit.gerrit/repo that match the pattern */target/*bugsXml.xml
17:01:34 [2020-09-13T21:01:34.907Z] [FINDBUGS] Parsing 8 files in /home/jenkins/agent/workspace/egit.gerrit/repo
17:01:34 [2020-09-13T21:01:34.907Z] [FINDBUGS] Successfully parsed file /home/jenkins/agent/workspace/egit.gerrit/repo/org.eclipse.egit.core.junit/target/spotbugsXml.xml with 4 unique warnings and 0 duplicates.
17:01:34 [2020-09-13T21:01:34.907Z] [FINDBUGS] Successfully parsed file /home/jenkins/agent/workspace/egit.gerrit/repo/org.eclipse.egit.core.test/target/spotbugsXml.xml with 9 unique warnings and 0 duplicates.
17:01:34 [2020-09-13T21:01:34.907Z] [FINDBUGS] Successfully parsed file /home/jenkins/agent/workspace/egit.gerrit/repo/org.eclipse.egit.core/target/spotbugsXml.xml with 20 unique warnings and 0 duplicates.
17:01:34 [2020-09-13T21:01:34.907Z] [FINDBUGS] Successfully parsed file /home/jenkins/agent/workspace/egit.gerrit/repo/org.eclipse.egit.gitflow.test/target/spotbugsXml.xml with 20 unique warnings and 0 duplicates.
17:01:34 [2020-09-13T21:01:34.907Z] [FINDBUGS] Successfully parsed file /home/jenkins/agent/workspace/egit.gerrit/repo/org.eclipse.egit.gitflow.ui/target/spotbugsXml.xml with 20 unique warnings and 0 duplicates.
17:01:34 [2020-09-13T21:01:34.907Z] [FINDBUGS] Successfully parsed file /home/jenkins/agent/workspace/egit.gerrit/repo/org.eclipse.egit.gitflow/target/spotbugsXml.xml with 22 unique warnings and 0 duplicates.
17:01:34 [2020-09-13T21:01:34.907Z] [FINDBUGS] Successfully parsed file /home/jenkins/agent/workspace/egit.gerrit/repo/org.eclipse.egit.mylyn.ui/target/spotbugsXml.xml with 22 unique warnings and 0 duplicates.
17:01:34 [2020-09-13T21:01:34.907Z] [FINDBUGS] Successfully parsed file /home/jenkins/agent/workspace/egit.gerrit/repo/org.eclipse.egit.ui/target/spotbugsXml.xml with 59 unique warnings and 0 duplicates.
17:01:34 [2020-09-13T21:01:34.907Z] Skipping warnings blame since pipelines do not have an SCM link.%n
17:01:34 [2020-09-13T21:01:34.971Z] [FINDBUGS] Computing warning deltas based on reference build #1659
[Pipeline] dry
17:01:35 [2020-09-13T21:01:35.183Z] [DRY] Collecting duplicate code analysis files...
17:01:35 [2020-09-13T21:01:35.447Z] [DRY] Searching for all files in /home/jenkins/agent/workspace/egit.gerrit/repo that match the pattern **/cpd.xml
17:01:35 [2020-09-13T21:01:35.447Z] [DRY] Parsing 15 files in /home/jenkins/agent/workspace/egit.gerrit/repo
17:01:35 [2020-09-13T21:01:35.447Z] [DRY] Successfully parsed file /home/jenkins/agent/workspace/egit.gerrit/repo/org.eclipse.egit-feature/target/cpd.xml with 0 unique warnings and 0 duplicates.
17:01:35 [2020-09-13T21:01:35.447Z] [DRY] Successfully parsed file /home/jenkins/agent/workspace/egit.gerrit/repo/org.eclipse.egit.core.junit/target/cpd.xml with 0 unique warnings and 0 duplicates.
17:01:35 [2020-09-13T21:01:35.447Z] [DRY] Successfully parsed file /home/jenkins/agent/workspace/egit.gerrit/repo/org.eclipse.egit.core.test/target/cpd.xml with 0 unique warnings and 0 duplicates.
17:01:35 [2020-09-13T21:01:35.447Z] [DRY] Successfully parsed file /home/jenkins/agent/workspace/egit.gerrit/repo/org.eclipse.egit.core/target/cpd.xml with 4 unique warnings and 0 duplicates.
17:01:35 [2020-09-13T21:01:35.447Z] [DRY] Successfully parsed file /home/jenkins/agent/workspace/egit.gerrit/repo/org.eclipse.egit.doc/target/cpd.xml with 4 unique warnings and 0 duplicates.
17:01:35 [2020-09-13T21:01:35.447Z] [DRY] Successfully parsed file /home/jenkins/agent/workspace/egit.gerrit/repo/org.eclipse.egit.gitflow-feature/target/cpd.xml with 4 unique warnings and 0 duplicates.
17:01:35 [2020-09-13T21:01:35.447Z] [DRY] Successfully parsed file /home/jenkins/agent/workspace/egit.gerrit/repo/org.eclipse.egit.gitflow.test/target/cpd.xml with 4 unique warnings and 0 duplicates.
17:01:35 [2020-09-13T21:01:35.447Z] [DRY] Successfully parsed file /home/jenkins/agent/workspace/egit.gerrit/repo/org.eclipse.egit.gitflow.ui/target/cpd.xml with 4 unique warnings and 0 duplicates.
17:01:35 [2020-09-13T21:01:35.447Z] [DRY] Successfully parsed file /home/jenkins/agent/workspace/egit.gerrit/repo/org.eclipse.egit.gitflow/target/cpd.xml with 4 unique warnings and 0 duplicates.
17:01:35 [2020-09-13T21:01:35.447Z] [DRY] Successfully parsed file /home/jenkins/agent/workspace/egit.gerrit/repo/org.eclipse.egit.mylyn-feature/target/cpd.xml with 4 unique warnings and 0 duplicates.
17:01:35 [2020-09-13T21:01:35.447Z] [DRY] Successfully parsed file /home/jenkins/agent/workspace/egit.gerrit/repo/org.eclipse.egit.mylyn.ui/target/cpd.xml with 4 unique warnings and 0 duplicates.
17:01:35 [2020-09-13T21:01:35.447Z] [DRY] Successfully parsed file /home/jenkins/agent/workspace/egit.gerrit/repo/org.eclipse.egit.repository/target/cpd.xml with 4 unique warnings and 0 duplicates.
17:01:35 [2020-09-13T21:01:35.447Z] [DRY] Successfully parsed file /home/jenkins/agent/workspace/egit.gerrit/repo/org.eclipse.egit.source-feature/target/cpd.xml with 4 unique warnings and 0 duplicates.
17:01:35 [2020-09-13T21:01:35.447Z] [DRY] Successfully parsed file /home/jenkins/agent/workspace/egit.gerrit/repo/org.eclipse.egit.ui/target/cpd.xml with 37 unique warnings and 0 duplicates.
17:01:35 [2020-09-13T21:01:35.447Z] [DRY] Successfully parsed file /home/jenkins/agent/workspace/egit.gerrit/repo/org.eclipse.egit/target/cpd.xml with 37 unique warnings and 0 duplicates.
17:01:35 [2020-09-13T21:01:35.447Z] Skipping warnings blame since pipelines do not have an SCM link.%n
17:01:35 [2020-09-13T21:01:35.487Z] [DRY] Computing warning deltas based on reference build #1659
[Pipeline] }
[Pipeline] // stage
[Pipeline] }
[Pipeline] // dir
[Pipeline] }
17:01:36 [2020-09-13T21:01:36.152Z] Terminating xvnc.
[Pipeline] // wrap
[Pipeline] }
[Pipeline] // timeout
[Pipeline] }
[Pipeline] // node
[Pipeline] }
[Pipeline] // timestamps
[Pipeline] End of Pipeline
ERROR: script returned exit code 1
Finished: FAILURE