AbortedConsole Output

Skipping 1,444 KB.. Full Log
T20:04:16.311Z] (SWT:1606): Gtk-WARNING **: 20:04:08.115: Negative content width -6 (allocation 1, extents 4x3) while allocating gadget (node toolbar, owner GtkToolbar)
16:04:16 [2020-08-27T20:04:16.311Z] 
16:04:16 [2020-08-27T20:04:16.311Z] (SWT:1606): Gtk-WARNING **: 20:04:08.408: Negative content width -6 (allocation 1, extents 4x3) while allocating gadget (node toolbar, owner GtkToolbar)
16:04:16 [2020-08-27T20:04:16.311Z] 
16:04:16 [2020-08-27T20:04:16.311Z] (SWT:1606): Gtk-WARNING **: 20:04:08.409: Negative content width -6 (allocation 1, extents 4x3) while allocating gadget (node toolbar, owner GtkToolbar)
16:04:16 [2020-08-27T20:04:16.311Z] 
16:04:16 [2020-08-27T20:04:16.311Z] (SWT:1606): Gtk-WARNING **: 20:04:08.799: Negative content width -6 (allocation 1, extents 4x3) while allocating gadget (node toolbar, owner GtkToolbar)
16:04:16 [2020-08-27T20:04:16.311Z] 
16:04:16 [2020-08-27T20:04:16.311Z] (SWT:1606): Gtk-WARNING **: 20:04:08.800: Negative content width -6 (allocation 1, extents 4x3) while allocating gadget (node toolbar, owner GtkToolbar)
16:04:16 [2020-08-27T20:04:16.311Z] 
16:04:16 [2020-08-27T20:04:16.311Z] (SWT:1606): Gtk-CRITICAL **: 20:04:08.920: gtk_box_gadget_distribute: assertion 'size >= 0' failed in GtkScrollbar
16:04:16 [2020-08-27T20:04:16.311Z] 
16:04:16 [2020-08-27T20:04:16.311Z] (SWT:1606): Gtk-CRITICAL **: 20:04:08.921: gtk_box_gadget_distribute: assertion 'size >= 0' failed in GtkScrollbar
16:04:16 [2020-08-27T20:04:16.311Z] 
16:04:16 [2020-08-27T20:04:16.311Z] (SWT:1606): Gtk-CRITICAL **: 20:04:08.921: gtk_box_gadget_distribute: assertion 'size >= 0' failed in GtkScrollbar
16:04:16 [2020-08-27T20:04:16.311Z] 
16:04:16 [2020-08-27T20:04:16.311Z] (SWT:1606): Gtk-CRITICAL **: 20:04:08.927: gtk_box_gadget_distribute: assertion 'size >= 0' failed in GtkScrollbar
16:04:16 [2020-08-27T20:04:16.311Z] 
16:04:16 [2020-08-27T20:04:16.311Z] (SWT:1606): Gtk-CRITICAL **: 20:04:08.936: gtk_box_gadget_distribute: assertion 'size >= 0' failed in GtkScrollbar
16:05:12 [2020-08-27T20:05:12.527Z] Tests run: 2, Failures: 0, Errors: 2, Skipped: 0, Time elapsed: 67.228 s <<< FAILURE! - in org.eclipse.egit.ui.test.team.actions.JavaCompareTest
16:05:12 [2020-08-27T20:05:12.527Z] testJavaCompareWithIndex(org.eclipse.egit.ui.test.team.actions.JavaCompareTest)  Time elapsed: 67.224 s  <<< ERROR!
16:05:12 [2020-08-27T20:05:12.527Z] org.eclipse.swtbot.swt.finder.widgets.TimeoutException: Timeout after: 30000 ms.: Timed out waiting for Shell {Create Branch} to close.
16:05:12 [2020-08-27T20:05:12.527Z] 	at org.eclipse.swtbot.swt.finder.SWTBotFactory.waitUntil(SWTBotFactory.java:523)
16:05:12 [2020-08-27T20:05:12.527Z] 	at org.eclipse.swtbot.swt.finder.SWTBot.waitUntil(SWTBot.java:1)
16:05:12 [2020-08-27T20:05:12.527Z] 	at org.eclipse.swtbot.swt.finder.SWTBotFactory.waitUntil(SWTBotFactory.java:497)
16:05:12 [2020-08-27T20:05:12.527Z] 	at org.eclipse.swtbot.swt.finder.SWTBot.waitUntil(SWTBot.java:1)
16:05:12 [2020-08-27T20:05:12.527Z] 	at org.eclipse.swtbot.swt.finder.SWTBotFactory.waitUntil(SWTBotFactory.java:485)
16:05:12 [2020-08-27T20:05:12.527Z] 	at org.eclipse.swtbot.swt.finder.SWTBot.waitUntil(SWTBot.java:1)
16:05:12 [2020-08-27T20:05:12.527Z] 	at org.eclipse.swtbot.swt.finder.widgets.SWTBotShell.close(SWTBotShell.java:117)
16:05:12 [2020-08-27T20:05:12.527Z] 	at org.eclipse.egit.ui.test.Eclipse.closeAllShells(Eclipse.java:45)
16:05:12 [2020-08-27T20:05:12.527Z] 	at org.eclipse.egit.ui.test.Eclipse.reset(Eclipse.java:38)
16:05:12 [2020-08-27T20:05:12.527Z] 	at org.eclipse.egit.ui.common.LocalRepositoryTestCase.resetWorkspace(LocalRepositoryTestCase.java:243)
16:05:12 [2020-08-27T20:05:12.527Z] 	at sun.reflect.GeneratedMethodAccessor84.invoke(Unknown Source)
16:05:12 [2020-08-27T20:05:12.527Z] 	at sun.reflect.DelegatingMethodAccessorImpl.invoke(DelegatingMethodAccessorImpl.java:43)
16:05:12 [2020-08-27T20:05:12.527Z] 	at java.lang.reflect.Method.invoke(Method.java:498)
16:05:12 [2020-08-27T20:05:12.527Z] 	at org.junit.runners.model.FrameworkMethod$1.runReflectiveCall(FrameworkMethod.java:59)
16:05:12 [2020-08-27T20:05:12.527Z] 	at org.junit.internal.runners.model.ReflectiveCallable.run(ReflectiveCallable.java:12)
16:05:12 [2020-08-27T20:05:12.527Z] 	at org.junit.runners.model.FrameworkMethod.invokeExplosively(FrameworkMethod.java:56)
16:05:12 [2020-08-27T20:05:12.527Z] 	at org.junit.internal.runners.statements.RunAfters.invokeMethod(RunAfters.java:46)
16:05:12 [2020-08-27T20:05:12.527Z] 	at org.junit.internal.runners.statements.RunAfters.evaluate(RunAfters.java:33)
16:05:12 [2020-08-27T20:05:12.527Z] 	at org.junit.rules.TestWatcher$1.evaluate(TestWatcher.java:61)
16:05:12 [2020-08-27T20:05:12.527Z] 	at org.junit.runners.ParentRunner$3.evaluate(ParentRunner.java:306)
16:05:12 [2020-08-27T20:05:12.527Z] 	at org.junit.runners.ParentRunner.runLeaf(ParentRunner.java:366)
16:05:12 [2020-08-27T20:05:12.527Z] 	at org.eclipse.swtbot.swt.finder.junit.SWTBotJunit4ClassRunner.runChild(SWTBotJunit4ClassRunner.java:77)
16:05:12 [2020-08-27T20:05:12.527Z] 	at org.junit.runners.BlockJUnit4ClassRunner.runChild(BlockJUnit4ClassRunner.java:63)
16:05:12 [2020-08-27T20:05:12.527Z] 	at org.junit.runners.ParentRunner$4.run(ParentRunner.java:331)
16:05:12 [2020-08-27T20:05:12.527Z] 	at org.junit.runners.ParentRunner$1.schedule(ParentRunner.java:79)
16:05:12 [2020-08-27T20:05:12.527Z] 	at org.junit.runners.ParentRunner.runChildren(ParentRunner.java:329)
16:05:12 [2020-08-27T20:05:12.527Z] 	at org.junit.runners.ParentRunner.access$100(ParentRunner.java:66)
16:05:12 [2020-08-27T20:05:12.527Z] 	at org.junit.runners.ParentRunner$2.evaluate(ParentRunner.java:293)
16:05:12 [2020-08-27T20:05:12.527Z] 	at org.junit.internal.runners.statements.RunBefores.evaluate(RunBefores.java:26)
16:05:12 [2020-08-27T20:05:12.527Z] 	at org.junit.internal.runners.statements.RunAfters.evaluate(RunAfters.java:27)
16:05:12 [2020-08-27T20:05:12.527Z] 	at org.junit.runners.ParentRunner$3.evaluate(ParentRunner.java:306)
16:05:12 [2020-08-27T20:05:12.527Z] 	at org.junit.runners.ParentRunner.run(ParentRunner.java:413)
16:05:12 [2020-08-27T20:05:12.527Z] 	at org.eclipse.swtbot.swt.finder.junit.SWTBotJunit4ClassRunner.run(SWTBotJunit4ClassRunner.java:62)
16:05:12 [2020-08-27T20:05:12.527Z] 	at org.apache.maven.surefire.junit4.JUnit4Provider.execute(JUnit4Provider.java:365)
16:05:12 [2020-08-27T20:05:12.527Z] 	at org.apache.maven.surefire.junit4.JUnit4Provider.executeWithRerun(JUnit4Provider.java:273)
16:05:12 [2020-08-27T20:05:12.527Z] 	at org.apache.maven.surefire.junit4.JUnit4Provider.executeTestSet(JUnit4Provider.java:238)
16:05:12 [2020-08-27T20:05:12.527Z] 	at org.apache.maven.surefire.junit4.JUnit4Provider.invoke(JUnit4Provider.java:159)
16:05:12 [2020-08-27T20:05:12.527Z] 	at sun.reflect.NativeMethodAccessorImpl.invoke0(Native Method)
16:05:12 [2020-08-27T20:05:12.527Z] 	at sun.reflect.NativeMethodAccessorImpl.invoke(NativeMethodAccessorImpl.java:62)
16:05:12 [2020-08-27T20:05:12.527Z] 	at sun.reflect.DelegatingMethodAccessorImpl.invoke(DelegatingMethodAccessorImpl.java:43)
16:05:12 [2020-08-27T20:05:12.527Z] 	at java.lang.reflect.Method.invoke(Method.java:498)
16:05:12 [2020-08-27T20:05:12.527Z] 	at org.apache.maven.surefire.util.ReflectionUtils.invokeMethodWithArray2(ReflectionUtils.java:206)
16:05:12 [2020-08-27T20:05:12.527Z] 	at org.apache.maven.surefire.booter.ProviderFactory$ProviderProxy.invoke(ProviderFactory.java:161)
16:05:12 [2020-08-27T20:05:12.527Z] 	at org.apache.maven.surefire.booter.ProviderFactory.invokeProvider(ProviderFactory.java:84)
16:05:12 [2020-08-27T20:05:12.527Z] 	at org.eclipse.tycho.surefire.osgibooter.OsgiSurefireBooter.run(OsgiSurefireBooter.java:113)
16:05:12 [2020-08-27T20:05:12.528Z] 	at org.eclipse.tycho.surefire.osgibooter.AbstractUITestApplication.runTests(AbstractUITestApplication.java:44)
16:05:12 [2020-08-27T20:05:12.528Z] 	at org.eclipse.e4.ui.internal.workbench.swt.E4Testable$1.run(E4Testable.java:73)
16:05:12 [2020-08-27T20:05:12.528Z] 	at java.lang.Thread.run(Thread.java:748)
16:05:12 [2020-08-27T20:05:12.528Z] 
16:05:12 [2020-08-27T20:05:12.528Z] testJavaCompareWithIndex(org.eclipse.egit.ui.test.team.actions.JavaCompareTest)  Time elapsed: 67.224 s  <<< ERROR!
16:05:12 [2020-08-27T20:05:12.528Z] org.eclipse.swtbot.swt.finder.widgets.TimeoutException: Timeout after: 30000 ms.: Timed out waiting for Shell {Create Branch} to close.
16:05:12 [2020-08-27T20:05:12.528Z] 	at org.eclipse.swtbot.swt.finder.SWTBotFactory.waitUntil(SWTBotFactory.java:523)
16:05:12 [2020-08-27T20:05:12.528Z] 	at org.eclipse.swtbot.swt.finder.SWTBot.waitUntil(SWTBot.java:1)
16:05:12 [2020-08-27T20:05:12.528Z] 	at org.eclipse.swtbot.swt.finder.SWTBotFactory.waitUntil(SWTBotFactory.java:497)
16:05:12 [2020-08-27T20:05:12.528Z] 	at org.eclipse.swtbot.swt.finder.SWTBot.waitUntil(SWTBot.java:1)
16:05:12 [2020-08-27T20:05:12.528Z] 	at org.eclipse.swtbot.swt.finder.SWTBotFactory.waitUntil(SWTBotFactory.java:485)
16:05:12 [2020-08-27T20:05:12.528Z] 	at org.eclipse.swtbot.swt.finder.SWTBot.waitUntil(SWTBot.java:1)
16:05:12 [2020-08-27T20:05:12.528Z] 	at org.eclipse.swtbot.swt.finder.widgets.SWTBotShell.close(SWTBotShell.java:117)
16:05:12 [2020-08-27T20:05:12.528Z] 	at org.eclipse.egit.ui.test.Eclipse.closeAllShells(Eclipse.java:45)
16:05:12 [2020-08-27T20:05:12.528Z] 	at org.eclipse.egit.ui.test.Eclipse.reset(Eclipse.java:38)
16:05:12 [2020-08-27T20:05:12.528Z] 	at org.eclipse.egit.ui.common.EGitTestCase.resetWorkbench(EGitTestCase.java:63)
16:05:12 [2020-08-27T20:05:12.528Z] 	at sun.reflect.GeneratedMethodAccessor85.invoke(Unknown Source)
16:05:12 [2020-08-27T20:05:12.528Z] 	at sun.reflect.DelegatingMethodAccessorImpl.invoke(DelegatingMethodAccessorImpl.java:43)
16:05:12 [2020-08-27T20:05:12.528Z] 	at java.lang.reflect.Method.invoke(Method.java:498)
16:05:12 [2020-08-27T20:05:12.528Z] 	at org.junit.runners.model.FrameworkMethod$1.runReflectiveCall(FrameworkMethod.java:59)
16:05:12 [2020-08-27T20:05:12.528Z] 	at org.junit.internal.runners.model.ReflectiveCallable.run(ReflectiveCallable.java:12)
16:05:12 [2020-08-27T20:05:12.528Z] 	at org.junit.runners.model.FrameworkMethod.invokeExplosively(FrameworkMethod.java:56)
16:05:12 [2020-08-27T20:05:12.528Z] 	at org.junit.internal.runners.statements.RunAfters.invokeMethod(RunAfters.java:46)
16:05:12 [2020-08-27T20:05:12.528Z] 	at org.junit.internal.runners.statements.RunAfters.evaluate(RunAfters.java:33)
16:05:12 [2020-08-27T20:05:12.528Z] 	at org.junit.rules.TestWatcher$1.evaluate(TestWatcher.java:61)
16:05:12 [2020-08-27T20:05:12.528Z] 	at org.junit.runners.ParentRunner$3.evaluate(ParentRunner.java:306)
16:05:12 [2020-08-27T20:05:12.528Z] 	at org.junit.runners.ParentRunner.runLeaf(ParentRunner.java:366)
16:05:12 [2020-08-27T20:05:12.528Z] 	at org.eclipse.swtbot.swt.finder.junit.SWTBotJunit4ClassRunner.runChild(SWTBotJunit4ClassRunner.java:77)
16:05:12 [2020-08-27T20:05:12.528Z] 	at org.junit.runners.BlockJUnit4ClassRunner.runChild(BlockJUnit4ClassRunner.java:63)
16:05:12 [2020-08-27T20:05:12.528Z] 	at org.junit.runners.ParentRunner$4.run(ParentRunner.java:331)
16:05:12 [2020-08-27T20:05:12.528Z] 	at org.junit.runners.ParentRunner$1.schedule(ParentRunner.java:79)
16:05:12 [2020-08-27T20:05:12.528Z] 	at org.junit.runners.ParentRunner.runChildren(ParentRunner.java:329)
16:05:12 [2020-08-27T20:05:12.528Z] 	at org.junit.runners.ParentRunner.access$100(ParentRunner.java:66)
16:05:12 [2020-08-27T20:05:12.528Z] 	at org.junit.runners.ParentRunner$2.evaluate(ParentRunner.java:293)
16:05:12 [2020-08-27T20:05:12.528Z] 	at org.junit.internal.runners.statements.RunBefores.evaluate(RunBefores.java:26)
16:05:12 [2020-08-27T20:05:12.528Z] 	at org.junit.internal.runners.statements.RunAfters.evaluate(RunAfters.java:27)
16:05:12 [2020-08-27T20:05:12.528Z] 	at org.junit.runners.ParentRunner$3.evaluate(ParentRunner.java:306)
16:05:12 [2020-08-27T20:05:12.528Z] 	at org.junit.runners.ParentRunner.run(ParentRunner.java:413)
16:05:12 [2020-08-27T20:05:12.528Z] 	at org.eclipse.swtbot.swt.finder.junit.SWTBotJunit4ClassRunner.run(SWTBotJunit4ClassRunner.java:62)
16:05:12 [2020-08-27T20:05:12.528Z] 	at org.apache.maven.surefire.junit4.JUnit4Provider.execute(JUnit4Provider.java:365)
16:05:12 [2020-08-27T20:05:12.528Z] 	at org.apache.maven.surefire.junit4.JUnit4Provider.executeWithRerun(JUnit4Provider.java:273)
16:05:12 [2020-08-27T20:05:12.528Z] 	at org.apache.maven.surefire.junit4.JUnit4Provider.executeTestSet(JUnit4Provider.java:238)
16:05:12 [2020-08-27T20:05:12.528Z] 	at org.apache.maven.surefire.junit4.JUnit4Provider.invoke(JUnit4Provider.java:159)
16:05:12 [2020-08-27T20:05:12.528Z] 	at sun.reflect.NativeMethodAccessorImpl.invoke0(Native Method)
16:05:12 [2020-08-27T20:05:12.528Z] 	at sun.reflect.NativeMethodAccessorImpl.invoke(NativeMethodAccessorImpl.java:62)
16:05:12 [2020-08-27T20:05:12.528Z] 	at sun.reflect.DelegatingMethodAccessorImpl.invoke(DelegatingMethodAccessorImpl.java:43)
16:05:12 [2020-08-27T20:05:12.528Z] 	at java.lang.reflect.Method.invoke(Method.java:498)
16:05:12 [2020-08-27T20:05:12.528Z] 	at org.apache.maven.surefire.util.ReflectionUtils.invokeMethodWithArray2(ReflectionUtils.java:206)
16:05:12 [2020-08-27T20:05:12.528Z] 	at org.apache.maven.surefire.booter.ProviderFactory$ProviderProxy.invoke(ProviderFactory.java:161)
16:05:12 [2020-08-27T20:05:12.528Z] 	at org.apache.maven.surefire.booter.ProviderFactory.invokeProvider(ProviderFactory.java:84)
16:05:12 [2020-08-27T20:05:12.528Z] 	at org.eclipse.tycho.surefire.osgibooter.OsgiSurefireBooter.run(OsgiSurefireBooter.java:113)
16:05:12 [2020-08-27T20:05:12.528Z] 	at org.eclipse.tycho.surefire.osgibooter.AbstractUITestApplication.runTests(AbstractUITestApplication.java:44)
16:05:12 [2020-08-27T20:05:12.528Z] 	at org.eclipse.e4.ui.internal.workbench.swt.E4Testable$1.run(E4Testable.java:73)
16:05:12 [2020-08-27T20:05:12.528Z] 	at java.lang.Thread.run(Thread.java:748)
16:05:12 [2020-08-27T20:05:12.528Z] 
16:05:12 [2020-08-27T20:05:12.528Z] Running org.eclipse.egit.ui.test.team.actions.FetchAndMergeActionTest
16:05:12 [2020-08-27T20:05:12.528Z] 
16:05:12 [2020-08-27T20:05:12.528Z] (SWT:1606): Gtk-WARNING **: 20:05:09.569: Negative content width -6 (allocation 1, extents 4x3) while allocating gadget (node toolbar, owner GtkToolbar)
16:05:12 [2020-08-27T20:05:12.528Z] 
16:05:12 [2020-08-27T20:05:12.528Z] !ENTRY org.eclipse.core.resources 2 2 2020-08-27 20:05:09.594
16:05:12 [2020-08-27T20:05:12.528Z] !MESSAGE Save operation warnings.
16:05:12 [2020-08-27T20:05:12.528Z] !SUBENTRY 1 org.eclipse.core.resources 2 234 2020-08-27 20:05:09.594
16:05:12 [2020-08-27T20:05:12.528Z] !MESSAGE The project description file (.project) for 'ProjectWithoutDotProject' was missing.  This file contains important information about the project.  A new project description file has been created, but some information about the project may have been lost.
16:06:20 [2020-08-27T20:06:20.204Z] clickContextMenu failed. Retrying in 250 ms
16:06:20 [2020-08-27T20:06:20.204Z] clickContextMenu failed. Retrying in 500 ms
16:06:20 [2020-08-27T20:06:20.204Z] clickContextMenu failed. Retrying in 1000 ms
16:06:21 [2020-08-27T20:06:21.138Z] clickContextMenu failed. Retrying in 2000 ms
16:06:25 [2020-08-27T20:06:25.315Z] clickContextMenu failed 5 times
16:07:33 [2020-08-27T20:07:33.034Z] Tests run: 5, Failures: 0, Errors: 5, Skipped: 0, Time elapsed: 135.284 s <<< FAILURE! - in org.eclipse.egit.ui.test.team.actions.FetchAndMergeActionTest
16:07:33 [2020-08-27T20:07:33.034Z] testMergeSquash(org.eclipse.egit.ui.test.team.actions.FetchAndMergeActionTest)  Time elapsed: 62.141 s  <<< ERROR!
16:07:33 [2020-08-27T20:07:33.034Z] org.eclipse.swtbot.swt.finder.widgets.TimeoutException: Timeout after: 30000 ms.: Timed out waiting for Shell {Create Branch} to close.
16:07:33 [2020-08-27T20:07:33.034Z] 	at org.eclipse.swtbot.swt.finder.SWTBotFactory.waitUntil(SWTBotFactory.java:523)
16:07:33 [2020-08-27T20:07:33.034Z] 	at org.eclipse.swtbot.swt.finder.SWTBot.waitUntil(SWTBot.java:1)
16:07:33 [2020-08-27T20:07:33.034Z] 	at org.eclipse.swtbot.swt.finder.SWTBotFactory.waitUntil(SWTBotFactory.java:497)
16:07:33 [2020-08-27T20:07:33.034Z] 	at org.eclipse.swtbot.swt.finder.SWTBot.waitUntil(SWTBot.java:1)
16:07:33 [2020-08-27T20:07:33.034Z] 	at org.eclipse.swtbot.swt.finder.SWTBotFactory.waitUntil(SWTBotFactory.java:485)
16:07:33 [2020-08-27T20:07:33.034Z] 	at org.eclipse.swtbot.swt.finder.SWTBot.waitUntil(SWTBot.java:1)
16:07:33 [2020-08-27T20:07:33.034Z] 	at org.eclipse.swtbot.swt.finder.widgets.SWTBotShell.close(SWTBotShell.java:117)
16:07:33 [2020-08-27T20:07:33.034Z] 	at org.eclipse.egit.ui.test.Eclipse.closeAllShells(Eclipse.java:45)
16:07:33 [2020-08-27T20:07:33.034Z] 	at org.eclipse.egit.ui.test.Eclipse.reset(Eclipse.java:38)
16:07:33 [2020-08-27T20:07:33.034Z] 	at org.eclipse.egit.ui.common.LocalRepositoryTestCase.resetWorkspace(LocalRepositoryTestCase.java:243)
16:07:33 [2020-08-27T20:07:33.034Z] 	at sun.reflect.GeneratedMethodAccessor84.invoke(Unknown Source)
16:07:33 [2020-08-27T20:07:33.034Z] 	at sun.reflect.DelegatingMethodAccessorImpl.invoke(DelegatingMethodAccessorImpl.java:43)
16:07:33 [2020-08-27T20:07:33.034Z] 	at java.lang.reflect.Method.invoke(Method.java:498)
16:07:33 [2020-08-27T20:07:33.034Z] 	at org.junit.runners.model.FrameworkMethod$1.runReflectiveCall(FrameworkMethod.java:59)
16:07:33 [2020-08-27T20:07:33.034Z] 	at org.junit.internal.runners.model.ReflectiveCallable.run(ReflectiveCallable.java:12)
16:07:33 [2020-08-27T20:07:33.034Z] 	at org.junit.runners.model.FrameworkMethod.invokeExplosively(FrameworkMethod.java:56)
16:07:33 [2020-08-27T20:07:33.034Z] 	at org.junit.internal.runners.statements.RunAfters.invokeMethod(RunAfters.java:46)
16:07:33 [2020-08-27T20:07:33.034Z] 	at org.junit.internal.runners.statements.RunAfters.evaluate(RunAfters.java:33)
16:07:33 [2020-08-27T20:07:33.034Z] 	at org.junit.rules.TestWatcher$1.evaluate(TestWatcher.java:61)
16:07:33 [2020-08-27T20:07:33.034Z] 	at org.junit.runners.ParentRunner$3.evaluate(ParentRunner.java:306)
16:07:33 [2020-08-27T20:07:33.034Z] 	at org.junit.runners.ParentRunner.runLeaf(ParentRunner.java:366)
16:07:33 [2020-08-27T20:07:33.034Z] 	at org.eclipse.swtbot.swt.finder.junit.SWTBotJunit4ClassRunner.runChild(SWTBotJunit4ClassRunner.java:77)
16:07:33 [2020-08-27T20:07:33.034Z] 	at org.junit.runners.BlockJUnit4ClassRunner.runChild(BlockJUnit4ClassRunner.java:63)
16:07:33 [2020-08-27T20:07:33.035Z] 	at org.junit.runners.ParentRunner$4.run(ParentRunner.java:331)
16:07:33 [2020-08-27T20:07:33.035Z] 	at org.junit.runners.ParentRunner$1.schedule(ParentRunner.java:79)
16:07:33 [2020-08-27T20:07:33.035Z] 	at org.junit.runners.ParentRunner.runChildren(ParentRunner.java:329)
16:07:33 [2020-08-27T20:07:33.035Z] 	at org.junit.runners.ParentRunner.access$100(ParentRunner.java:66)
16:07:33 [2020-08-27T20:07:33.035Z] 	at org.junit.runners.ParentRunner$2.evaluate(ParentRunner.java:293)
16:07:33 [2020-08-27T20:07:33.035Z] 	at org.junit.internal.runners.statements.RunBefores.evaluate(RunBefores.java:26)
16:07:33 [2020-08-27T20:07:33.035Z] 	at org.junit.internal.runners.statements.RunAfters.evaluate(RunAfters.java:27)
16:07:33 [2020-08-27T20:07:33.035Z] 	at org.junit.runners.ParentRunner$3.evaluate(ParentRunner.java:306)
16:07:33 [2020-08-27T20:07:33.035Z] 	at org.junit.runners.ParentRunner.run(ParentRunner.java:413)
16:07:33 [2020-08-27T20:07:33.035Z] 	at org.eclipse.swtbot.swt.finder.junit.SWTBotJunit4ClassRunner.run(SWTBotJunit4ClassRunner.java:62)
16:07:33 [2020-08-27T20:07:33.035Z] 	at org.apache.maven.surefire.junit4.JUnit4Provider.execute(JUnit4Provider.java:365)
16:07:33 [2020-08-27T20:07:33.035Z] 	at org.apache.maven.surefire.junit4.JUnit4Provider.executeWithRerun(JUnit4Provider.java:273)
16:07:33 [2020-08-27T20:07:33.035Z] 	at org.apache.maven.surefire.junit4.JUnit4Provider.executeTestSet(JUnit4Provider.java:238)
16:07:33 [2020-08-27T20:07:33.035Z] 	at org.apache.maven.surefire.junit4.JUnit4Provider.invoke(JUnit4Provider.java:159)
16:07:33 [2020-08-27T20:07:33.035Z] 	at sun.reflect.NativeMethodAccessorImpl.invoke0(Native Method)
16:07:33 [2020-08-27T20:07:33.035Z] 	at sun.reflect.NativeMethodAccessorImpl.invoke(NativeMethodAccessorImpl.java:62)
16:07:33 [2020-08-27T20:07:33.035Z] 	at sun.reflect.DelegatingMethodAccessorImpl.invoke(DelegatingMethodAccessorImpl.java:43)
16:07:33 [2020-08-27T20:07:33.035Z] 	at java.lang.reflect.Method.invoke(Method.java:498)
16:07:33 [2020-08-27T20:07:33.035Z] 	at org.apache.maven.surefire.util.ReflectionUtils.invokeMethodWithArray2(ReflectionUtils.java:206)
16:07:33 [2020-08-27T20:07:33.035Z] 	at org.apache.maven.surefire.booter.ProviderFactory$ProviderProxy.invoke(ProviderFactory.java:161)
16:07:33 [2020-08-27T20:07:33.035Z] 	at org.apache.maven.surefire.booter.ProviderFactory.invokeProvider(ProviderFactory.java:84)
16:07:33 [2020-08-27T20:07:33.035Z] 	at org.eclipse.tycho.surefire.osgibooter.OsgiSurefireBooter.run(OsgiSurefireBooter.java:113)
16:07:33 [2020-08-27T20:07:33.035Z] 	at org.eclipse.tycho.surefire.osgibooter.AbstractUITestApplication.runTests(AbstractUITestApplication.java:44)
16:07:33 [2020-08-27T20:07:33.035Z] 	at org.eclipse.e4.ui.internal.workbench.swt.E4Testable$1.run(E4Testable.java:73)
16:07:33 [2020-08-27T20:07:33.035Z] 	at java.lang.Thread.run(Thread.java:748)
16:07:33 [2020-08-27T20:07:33.035Z] 
16:07:33 [2020-08-27T20:07:33.035Z] testMergeSquash(org.eclipse.egit.ui.test.team.actions.FetchAndMergeActionTest)  Time elapsed: 62.141 s  <<< ERROR!
16:07:33 [2020-08-27T20:07:33.035Z] org.eclipse.swtbot.swt.finder.widgets.TimeoutException: Timeout after: 30000 ms.: Timed out waiting for Shell {Create Branch} to close.
16:07:33 [2020-08-27T20:07:33.035Z] 	at org.eclipse.swtbot.swt.finder.SWTBotFactory.waitUntil(SWTBotFactory.java:523)
16:07:33 [2020-08-27T20:07:33.035Z] 	at org.eclipse.swtbot.swt.finder.SWTBot.waitUntil(SWTBot.java:1)
16:07:33 [2020-08-27T20:07:33.035Z] 	at org.eclipse.swtbot.swt.finder.SWTBotFactory.waitUntil(SWTBotFactory.java:497)
16:07:33 [2020-08-27T20:07:33.035Z] 	at org.eclipse.swtbot.swt.finder.SWTBot.waitUntil(SWTBot.java:1)
16:07:33 [2020-08-27T20:07:33.035Z] 	at org.eclipse.swtbot.swt.finder.SWTBotFactory.waitUntil(SWTBotFactory.java:485)
16:07:33 [2020-08-27T20:07:33.035Z] 	at org.eclipse.swtbot.swt.finder.SWTBot.waitUntil(SWTBot.java:1)
16:07:33 [2020-08-27T20:07:33.035Z] 	at org.eclipse.swtbot.swt.finder.widgets.SWTBotShell.close(SWTBotShell.java:117)
16:07:33 [2020-08-27T20:07:33.035Z] 	at org.eclipse.egit.ui.test.Eclipse.closeAllShells(Eclipse.java:45)
16:07:33 [2020-08-27T20:07:33.035Z] 	at org.eclipse.egit.ui.test.Eclipse.reset(Eclipse.java:38)
16:07:33 [2020-08-27T20:07:33.035Z] 	at org.eclipse.egit.ui.common.EGitTestCase.resetWorkbench(EGitTestCase.java:63)
16:07:33 [2020-08-27T20:07:33.035Z] 	at sun.reflect.GeneratedMethodAccessor85.invoke(Unknown Source)
16:07:33 [2020-08-27T20:07:33.035Z] 	at sun.reflect.DelegatingMethodAccessorImpl.invoke(DelegatingMethodAccessorImpl.java:43)
16:07:33 [2020-08-27T20:07:33.035Z] 	at java.lang.reflect.Method.invoke(Method.java:498)
16:07:33 [2020-08-27T20:07:33.035Z] 	at org.junit.runners.model.FrameworkMethod$1.runReflectiveCall(FrameworkMethod.java:59)
16:07:33 [2020-08-27T20:07:33.035Z] 	at org.junit.internal.runners.model.ReflectiveCallable.run(ReflectiveCallable.java:12)
16:07:33 [2020-08-27T20:07:33.035Z] 	at org.junit.runners.model.FrameworkMethod.invokeExplosively(FrameworkMethod.java:56)
16:07:33 [2020-08-27T20:07:33.035Z] 	at org.junit.internal.runners.statements.RunAfters.invokeMethod(RunAfters.java:46)
16:07:33 [2020-08-27T20:07:33.035Z] 	at org.junit.internal.runners.statements.RunAfters.evaluate(RunAfters.java:33)
16:07:33 [2020-08-27T20:07:33.035Z] 	at org.junit.rules.TestWatcher$1.evaluate(TestWatcher.java:61)
16:07:33 [2020-08-27T20:07:33.035Z] 	at org.junit.runners.ParentRunner$3.evaluate(ParentRunner.java:306)
16:07:33 [2020-08-27T20:07:33.035Z] 	at org.junit.runners.ParentRunner.runLeaf(ParentRunner.java:366)
16:07:33 [2020-08-27T20:07:33.035Z] 	at org.eclipse.swtbot.swt.finder.junit.SWTBotJunit4ClassRunner.runChild(SWTBotJunit4ClassRunner.java:77)
16:07:33 [2020-08-27T20:07:33.035Z] 	at org.junit.runners.BlockJUnit4ClassRunner.runChild(BlockJUnit4ClassRunner.java:63)
16:07:33 [2020-08-27T20:07:33.035Z] 	at org.junit.runners.ParentRunner$4.run(ParentRunner.java:331)
16:07:33 [2020-08-27T20:07:33.035Z] 	at org.junit.runners.ParentRunner$1.schedule(ParentRunner.java:79)
16:07:33 [2020-08-27T20:07:33.035Z] 	at org.junit.runners.ParentRunner.runChildren(ParentRunner.java:329)
16:07:33 [2020-08-27T20:07:33.035Z] 	at org.junit.runners.ParentRunner.access$100(ParentRunner.java:66)
16:07:33 [2020-08-27T20:07:33.035Z] 	at org.junit.runners.ParentRunner$2.evaluate(ParentRunner.java:293)
16:07:33 [2020-08-27T20:07:33.035Z] 	at org.junit.internal.runners.statements.RunBefores.evaluate(RunBefores.java:26)
16:07:33 [2020-08-27T20:07:33.035Z] 	at org.junit.internal.runners.statements.RunAfters.evaluate(RunAfters.java:27)
16:07:33 [2020-08-27T20:07:33.035Z] 	at org.junit.runners.ParentRunner$3.evaluate(ParentRunner.java:306)
16:07:33 [2020-08-27T20:07:33.035Z] 	at org.junit.runners.ParentRunner.run(ParentRunner.java:413)
16:07:33 [2020-08-27T20:07:33.035Z] 	at org.eclipse.swtbot.swt.finder.junit.SWTBotJunit4ClassRunner.run(SWTBotJunit4ClassRunner.java:62)
16:07:33 [2020-08-27T20:07:33.035Z] 	at org.apache.maven.surefire.junit4.JUnit4Provider.execute(JUnit4Provider.java:365)
16:07:33 [2020-08-27T20:07:33.035Z] 	at org.apache.maven.surefire.junit4.JUnit4Provider.executeWithRerun(JUnit4Provider.java:273)
16:07:33 [2020-08-27T20:07:33.035Z] 	at org.apache.maven.surefire.junit4.JUnit4Provider.executeTestSet(JUnit4Provider.java:238)
16:07:33 [2020-08-27T20:07:33.035Z] 	at org.apache.maven.surefire.junit4.JUnit4Provider.invoke(JUnit4Provider.java:159)
16:07:33 [2020-08-27T20:07:33.035Z] 	at sun.reflect.NativeMethodAccessorImpl.invoke0(Native Method)
16:07:33 [2020-08-27T20:07:33.035Z] 	at sun.reflect.NativeMethodAccessorImpl.invoke(NativeMethodAccessorImpl.java:62)
16:07:33 [2020-08-27T20:07:33.035Z] 	at sun.reflect.DelegatingMethodAccessorImpl.invoke(DelegatingMethodAccessorImpl.java:43)
16:07:33 [2020-08-27T20:07:33.035Z] 	at java.lang.reflect.Method.invoke(Method.java:498)
16:07:33 [2020-08-27T20:07:33.035Z] 	at org.apache.maven.surefire.util.ReflectionUtils.invokeMethodWithArray2(ReflectionUtils.java:206)
16:07:33 [2020-08-27T20:07:33.035Z] 	at org.apache.maven.surefire.booter.ProviderFactory$ProviderProxy.invoke(ProviderFactory.java:161)
16:07:33 [2020-08-27T20:07:33.035Z] 	at org.apache.maven.surefire.booter.ProviderFactory.invokeProvider(ProviderFactory.java:84)
16:07:33 [2020-08-27T20:07:33.035Z] 	at org.eclipse.tycho.surefire.osgibooter.OsgiSurefireBooter.run(OsgiSurefireBooter.java:113)
16:07:33 [2020-08-27T20:07:33.035Z] 	at org.eclipse.tycho.surefire.osgibooter.AbstractUITestApplication.runTests(AbstractUITestApplication.java:44)
16:07:33 [2020-08-27T20:07:33.035Z] 	at org.eclipse.e4.ui.internal.workbench.swt.E4Testable$1.run(E4Testable.java:73)
16:07:33 [2020-08-27T20:07:33.035Z] 	at java.lang.Thread.run(Thread.java:748)
16:07:33 [2020-08-27T20:07:33.035Z] 
16:07:33 [2020-08-27T20:07:33.035Z] testFetchFromOriginThenMerge(org.eclipse.egit.ui.test.team.actions.FetchAndMergeActionTest)  Time elapsed: 73.097 s  <<< ERROR!
16:07:33 [2020-08-27T20:07:33.035Z] org.eclipse.swtbot.swt.finder.exceptions.WidgetNotFoundException: Could not find menu: [Team, Fetch from origin]
16:07:33 [2020-08-27T20:07:33.035Z] 	at org.eclipse.egit.ui.test.ContextMenuHelper.clickContextMenuInternal(ContextMenuHelper.java:133)
16:07:33 [2020-08-27T20:07:33.035Z] 	at org.eclipse.egit.ui.test.ContextMenuHelper.clickContextMenuWithRetry(ContextMenuHelper.java:91)
16:07:33 [2020-08-27T20:07:33.035Z] 	at org.eclipse.egit.ui.test.ContextMenuHelper.clickContextMenu(ContextMenuHelper.java:81)
16:07:33 [2020-08-27T20:07:33.035Z] 	at org.eclipse.egit.ui.test.team.actions.FetchAndMergeActionTest.fetch(FetchAndMergeActionTest.java:165)
16:07:33 [2020-08-27T20:07:33.035Z] 	at org.eclipse.egit.ui.test.team.actions.FetchAndMergeActionTest.testFetchFromOriginThenMerge(FetchAndMergeActionTest.java:77)
16:07:33 [2020-08-27T20:07:33.035Z] 	at sun.reflect.NativeMethodAccessorImpl.invoke0(Native Method)
16:07:33 [2020-08-27T20:07:33.035Z] 	at sun.reflect.NativeMethodAccessorImpl.invoke(NativeMethodAccessorImpl.java:62)
16:07:33 [2020-08-27T20:07:33.035Z] 	at sun.reflect.DelegatingMethodAccessorImpl.invoke(DelegatingMethodAccessorImpl.java:43)
16:07:33 [2020-08-27T20:07:33.035Z] 	at java.lang.reflect.Method.invoke(Method.java:498)
16:07:33 [2020-08-27T20:07:33.035Z] 	at org.junit.runners.model.FrameworkMethod$1.runReflectiveCall(FrameworkMethod.java:59)
16:07:33 [2020-08-27T20:07:33.035Z] 	at org.junit.internal.runners.model.ReflectiveCallable.run(ReflectiveCallable.java:12)
16:07:33 [2020-08-27T20:07:33.035Z] 	at org.junit.runners.model.FrameworkMethod.invokeExplosively(FrameworkMethod.java:56)
16:07:33 [2020-08-27T20:07:33.035Z] 	at org.eclipse.swtbot.swt.finder.junit.internal.CapturingFrameworkMethod.invokeExplosively(CapturingFrameworkMethod.java:49)
16:07:33 [2020-08-27T20:07:33.035Z] 	at org.junit.internal.runners.statements.InvokeMethod.evaluate(InvokeMethod.java:17)
16:07:33 [2020-08-27T20:07:33.035Z] 	at org.junit.internal.runners.statements.RunBefores.evaluate(RunBefores.java:26)
16:07:33 [2020-08-27T20:07:33.035Z] 	at org.junit.internal.runners.statements.RunAfters.evaluate(RunAfters.java:27)
16:07:33 [2020-08-27T20:07:33.035Z] 	at org.junit.rules.TestWatcher$1.evaluate(TestWatcher.java:61)
16:07:33 [2020-08-27T20:07:33.035Z] 	at org.junit.runners.ParentRunner$3.evaluate(ParentRunner.java:306)
16:07:33 [2020-08-27T20:07:33.035Z] 	at org.junit.runners.ParentRunner.runLeaf(ParentRunner.java:366)
16:07:33 [2020-08-27T20:07:33.035Z] 	at org.eclipse.swtbot.swt.finder.junit.SWTBotJunit4ClassRunner.runChild(SWTBotJunit4ClassRunner.java:77)
16:07:33 [2020-08-27T20:07:33.035Z] 	at org.junit.runners.BlockJUnit4ClassRunner.runChild(BlockJUnit4ClassRunner.java:63)
16:07:33 [2020-08-27T20:07:33.035Z] 	at org.junit.runners.ParentRunner$4.run(ParentRunner.java:331)
16:07:33 [2020-08-27T20:07:33.035Z] 	at org.junit.runners.ParentRunner$1.schedule(ParentRunner.java:79)
16:07:33 [2020-08-27T20:07:33.035Z] 	at org.junit.runners.ParentRunner.runChildren(ParentRunner.java:329)
16:07:33 [2020-08-27T20:07:33.035Z] 	at org.junit.runners.ParentRunner.access$100(ParentRunner.java:66)
16:07:33 [2020-08-27T20:07:33.035Z] 	at org.junit.runners.ParentRunner$2.evaluate(ParentRunner.java:293)
16:07:33 [2020-08-27T20:07:33.035Z] 	at org.junit.internal.runners.statements.RunBefores.evaluate(RunBefores.java:26)
16:07:33 [2020-08-27T20:07:33.035Z] 	at org.junit.internal.runners.statements.RunAfters.evaluate(RunAfters.java:27)
16:07:33 [2020-08-27T20:07:33.035Z] 	at org.junit.runners.ParentRunner$3.evaluate(ParentRunner.java:306)
16:07:33 [2020-08-27T20:07:33.035Z] 	at org.junit.runners.ParentRunner.run(ParentRunner.java:413)
16:07:33 [2020-08-27T20:07:33.035Z] 	at org.eclipse.swtbot.swt.finder.junit.SWTBotJunit4ClassRunner.run(SWTBotJunit4ClassRunner.java:62)
16:07:33 [2020-08-27T20:07:33.035Z] 	at org.apache.maven.surefire.junit4.JUnit4Provider.execute(JUnit4Provider.java:365)
16:07:33 [2020-08-27T20:07:33.035Z] 	at org.apache.maven.surefire.junit4.JUnit4Provider.executeWithRerun(JUnit4Provider.java:273)
16:07:33 [2020-08-27T20:07:33.035Z] 	at org.apache.maven.surefire.junit4.JUnit4Provider.executeTestSet(JUnit4Provider.java:238)
16:07:33 [2020-08-27T20:07:33.035Z] 	at org.apache.maven.surefire.junit4.JUnit4Provider.invoke(JUnit4Provider.java:159)
16:07:33 [2020-08-27T20:07:33.036Z] 	at sun.reflect.NativeMethodAccessorImpl.invoke0(Native Method)
16:07:33 [2020-08-27T20:07:33.036Z] 	at sun.reflect.NativeMethodAccessorImpl.invoke(NativeMethodAccessorImpl.java:62)
16:07:33 [2020-08-27T20:07:33.036Z] 	at sun.reflect.DelegatingMethodAccessorImpl.invoke(DelegatingMethodAccessorImpl.java:43)
16:07:33 [2020-08-27T20:07:33.036Z] 	at java.lang.reflect.Method.invoke(Method.java:498)
16:07:33 [2020-08-27T20:07:33.036Z] 	at org.apache.maven.surefire.util.ReflectionUtils.invokeMethodWithArray2(ReflectionUtils.java:206)
16:07:33 [2020-08-27T20:07:33.036Z] 	at org.apache.maven.surefire.booter.ProviderFactory$ProviderProxy.invoke(ProviderFactory.java:161)
16:07:33 [2020-08-27T20:07:33.036Z] 	at org.apache.maven.surefire.booter.ProviderFactory.invokeProvider(ProviderFactory.java:84)
16:07:33 [2020-08-27T20:07:33.036Z] 	at org.eclipse.tycho.surefire.osgibooter.OsgiSurefireBooter.run(OsgiSurefireBooter.java:113)
16:07:33 [2020-08-27T20:07:33.036Z] 	at org.eclipse.tycho.surefire.osgibooter.AbstractUITestApplication.runTests(AbstractUITestApplication.java:44)
16:07:33 [2020-08-27T20:07:33.036Z] 	at org.eclipse.e4.ui.internal.workbench.swt.E4Testable$1.run(E4Testable.java:73)
16:07:33 [2020-08-27T20:07:33.036Z] 	at java.lang.Thread.run(Thread.java:748)
16:07:33 [2020-08-27T20:07:33.036Z] 
16:07:33 [2020-08-27T20:07:33.036Z] testFetchFromOriginThenMerge(org.eclipse.egit.ui.test.team.actions.FetchAndMergeActionTest)  Time elapsed: 73.097 s  <<< ERROR!
16:07:33 [2020-08-27T20:07:33.036Z] org.eclipse.swtbot.swt.finder.widgets.TimeoutException: Timeout after: 30000 ms.: Timed out waiting for Shell {Create Branch} to close.
16:07:33 [2020-08-27T20:07:33.036Z] 	at org.eclipse.swtbot.swt.finder.SWTBotFactory.waitUntil(SWTBotFactory.java:523)
16:07:33 [2020-08-27T20:07:33.036Z] 	at org.eclipse.swtbot.swt.finder.SWTBot.waitUntil(SWTBot.java:1)
16:07:33 [2020-08-27T20:07:33.036Z] 	at org.eclipse.swtbot.swt.finder.SWTBotFactory.waitUntil(SWTBotFactory.java:497)
16:07:33 [2020-08-27T20:07:33.036Z] 	at org.eclipse.swtbot.swt.finder.SWTBot.waitUntil(SWTBot.java:1)
16:07:33 [2020-08-27T20:07:33.036Z] 	at org.eclipse.swtbot.swt.finder.SWTBotFactory.waitUntil(SWTBotFactory.java:485)
16:07:33 [2020-08-27T20:07:33.036Z] 	at org.eclipse.swtbot.swt.finder.SWTBot.waitUntil(SWTBot.java:1)
16:07:33 [2020-08-27T20:07:33.036Z] 	at org.eclipse.swtbot.swt.finder.widgets.SWTBotShell.close(SWTBotShell.java:117)
16:07:33 [2020-08-27T20:07:33.036Z] 	at org.eclipse.egit.ui.test.Eclipse.closeAllShells(Eclipse.java:45)
16:07:33 [2020-08-27T20:07:33.036Z] 	at org.eclipse.egit.ui.test.Eclipse.reset(Eclipse.java:38)
16:07:33 [2020-08-27T20:07:33.036Z] 	at org.eclipse.egit.ui.common.LocalRepositoryTestCase.resetWorkspace(LocalRepositoryTestCase.java:243)
16:07:33 [2020-08-27T20:07:33.036Z] 	at sun.reflect.GeneratedMethodAccessor84.invoke(Unknown Source)
16:07:33 [2020-08-27T20:07:33.036Z] 	at sun.reflect.DelegatingMethodAccessorImpl.invoke(DelegatingMethodAccessorImpl.java:43)
16:07:33 [2020-08-27T20:07:33.036Z] 	at java.lang.reflect.Method.invoke(Method.java:498)
16:07:33 [2020-08-27T20:07:33.036Z] 	at org.junit.runners.model.FrameworkMethod$1.runReflectiveCall(FrameworkMethod.java:59)
16:07:33 [2020-08-27T20:07:33.036Z] 	at org.junit.internal.runners.model.ReflectiveCallable.run(ReflectiveCallable.java:12)
16:07:33 [2020-08-27T20:07:33.036Z] 	at org.junit.runners.model.FrameworkMethod.invokeExplosively(FrameworkMethod.java:56)
16:07:33 [2020-08-27T20:07:33.036Z] 	at org.junit.internal.runners.statements.RunAfters.invokeMethod(RunAfters.java:46)
16:07:33 [2020-08-27T20:07:33.036Z] 	at org.junit.internal.runners.statements.RunAfters.evaluate(RunAfters.java:33)
16:07:33 [2020-08-27T20:07:33.036Z] 	at org.junit.rules.TestWatcher$1.evaluate(TestWatcher.java:61)
16:07:33 [2020-08-27T20:07:33.036Z] 	at org.junit.runners.ParentRunner$3.evaluate(ParentRunner.java:306)
16:07:33 [2020-08-27T20:07:33.036Z] 	at org.junit.runners.ParentRunner.runLeaf(ParentRunner.java:366)
16:07:33 [2020-08-27T20:07:33.036Z] 	at org.eclipse.swtbot.swt.finder.junit.SWTBotJunit4ClassRunner.runChild(SWTBotJunit4ClassRunner.java:77)
16:07:33 [2020-08-27T20:07:33.036Z] 	at org.junit.runners.BlockJUnit4ClassRunner.runChild(BlockJUnit4ClassRunner.java:63)
16:07:33 [2020-08-27T20:07:33.036Z] 	at org.junit.runners.ParentRunner$4.run(ParentRunner.java:331)
16:07:33 [2020-08-27T20:07:33.036Z] 	at org.junit.runners.ParentRunner$1.schedule(ParentRunner.java:79)
16:07:33 [2020-08-27T20:07:33.036Z] 	at org.junit.runners.ParentRunner.runChildren(ParentRunner.java:329)
16:07:33 [2020-08-27T20:07:33.036Z] 	at org.junit.runners.ParentRunner.access$100(ParentRunner.java:66)
16:07:33 [2020-08-27T20:07:33.036Z] 	at org.junit.runners.ParentRunner$2.evaluate(ParentRunner.java:293)
16:07:33 [2020-08-27T20:07:33.036Z] 	at org.junit.internal.runners.statements.RunBefores.evaluate(RunBefores.java:26)
16:07:33 [2020-08-27T20:07:33.036Z] 	at org.junit.internal.runners.statements.RunAfters.evaluate(RunAfters.java:27)
16:07:33 [2020-08-27T20:07:33.036Z] 	at org.junit.runners.ParentRunner$3.evaluate(ParentRunner.java:306)
16:07:33 [2020-08-27T20:07:33.036Z] 	at org.junit.runners.ParentRunner.run(ParentRunner.java:413)
16:07:33 [2020-08-27T20:07:33.036Z] 	at org.eclipse.swtbot.swt.finder.junit.SWTBotJunit4ClassRunner.run(SWTBotJunit4ClassRunner.java:62)
16:07:33 [2020-08-27T20:07:33.036Z] 	at org.apache.maven.surefire.junit4.JUnit4Provider.execute(JUnit4Provider.java:365)
16:07:33 [2020-08-27T20:07:33.036Z] 	at org.apache.maven.surefire.junit4.JUnit4Provider.executeWithRerun(JUnit4Provider.java:273)
16:07:33 [2020-08-27T20:07:33.036Z] 	at org.apache.maven.surefire.junit4.JUnit4Provider.executeTestSet(JUnit4Provider.java:238)
16:07:33 [2020-08-27T20:07:33.036Z] 	at org.apache.maven.surefire.junit4.JUnit4Provider.invoke(JUnit4Provider.java:159)
16:07:33 [2020-08-27T20:07:33.036Z] 	at sun.reflect.NativeMethodAccessorImpl.invoke0(Native Method)
16:07:33 [2020-08-27T20:07:33.036Z] 	at sun.reflect.NativeMethodAccessorImpl.invoke(NativeMethodAccessorImpl.java:62)
16:07:33 [2020-08-27T20:07:33.036Z] 	at sun.reflect.DelegatingMethodAccessorImpl.invoke(DelegatingMethodAccessorImpl.java:43)
16:07:33 [2020-08-27T20:07:33.036Z] 	at java.lang.reflect.Method.invoke(Method.java:498)
16:07:33 [2020-08-27T20:07:33.036Z] 	at org.apache.maven.surefire.util.ReflectionUtils.invokeMethodWithArray2(ReflectionUtils.java:206)
16:07:33 [2020-08-27T20:07:33.036Z] 	at org.apache.maven.surefire.booter.ProviderFactory$ProviderProxy.invoke(ProviderFactory.java:161)
16:07:33 [2020-08-27T20:07:33.036Z] 	at org.apache.maven.surefire.booter.ProviderFactory.invokeProvider(ProviderFactory.java:84)
16:07:33 [2020-08-27T20:07:33.036Z] 	at org.eclipse.tycho.surefire.osgibooter.OsgiSurefireBooter.run(OsgiSurefireBooter.java:113)
16:07:33 [2020-08-27T20:07:33.036Z] 	at org.eclipse.tycho.surefire.osgibooter.AbstractUITestApplication.runTests(AbstractUITestApplication.java:44)
16:07:33 [2020-08-27T20:07:33.036Z] 	at org.eclipse.e4.ui.internal.workbench.swt.E4Testable$1.run(E4Testable.java:73)
16:07:33 [2020-08-27T20:07:33.036Z] 	at java.lang.Thread.run(Thread.java:748)
16:07:33 [2020-08-27T20:07:33.036Z] 
16:07:33 [2020-08-27T20:07:33.036Z] testFetchFromOriginThenMerge(org.eclipse.egit.ui.test.team.actions.FetchAndMergeActionTest)  Time elapsed: 73.097 s  <<< ERROR!
16:07:33 [2020-08-27T20:07:33.036Z] org.eclipse.swtbot.swt.finder.widgets.TimeoutException: Timeout after: 30000 ms.: Timed out waiting for Shell {Create Branch} to close.
16:07:33 [2020-08-27T20:07:33.036Z] 	at org.eclipse.swtbot.swt.finder.SWTBotFactory.waitUntil(SWTBotFactory.java:523)
16:07:33 [2020-08-27T20:07:33.036Z] 	at org.eclipse.swtbot.swt.finder.SWTBot.waitUntil(SWTBot.java:1)
16:07:33 [2020-08-27T20:07:33.036Z] 	at org.eclipse.swtbot.swt.finder.SWTBotFactory.waitUntil(SWTBotFactory.java:497)
16:07:33 [2020-08-27T20:07:33.036Z] 	at org.eclipse.swtbot.swt.finder.SWTBot.waitUntil(SWTBot.java:1)
16:07:33 [2020-08-27T20:07:33.036Z] 	at org.eclipse.swtbot.swt.finder.SWTBotFactory.waitUntil(SWTBotFactory.java:485)
16:07:33 [2020-08-27T20:07:33.036Z] 	at org.eclipse.swtbot.swt.finder.SWTBot.waitUntil(SWTBot.java:1)
16:07:33 [2020-08-27T20:07:33.036Z] 	at org.eclipse.swtbot.swt.finder.widgets.SWTBotShell.close(SWTBotShell.java:117)
16:07:33 [2020-08-27T20:07:33.036Z] 	at org.eclipse.egit.ui.test.Eclipse.closeAllShells(Eclipse.java:45)
16:07:33 [2020-08-27T20:07:33.036Z] 	at org.eclipse.egit.ui.test.Eclipse.reset(Eclipse.java:38)
16:07:33 [2020-08-27T20:07:33.036Z] 	at org.eclipse.egit.ui.common.EGitTestCase.resetWorkbench(EGitTestCase.java:63)
16:07:33 [2020-08-27T20:07:33.036Z] 	at sun.reflect.GeneratedMethodAccessor85.invoke(Unknown Source)
16:07:33 [2020-08-27T20:07:33.036Z] 	at sun.reflect.DelegatingMethodAccessorImpl.invoke(DelegatingMethodAccessorImpl.java:43)
16:07:33 [2020-08-27T20:07:33.036Z] 	at java.lang.reflect.Method.invoke(Method.java:498)
16:07:33 [2020-08-27T20:07:33.036Z] 	at org.junit.runners.model.FrameworkMethod$1.runReflectiveCall(FrameworkMethod.java:59)
16:07:33 [2020-08-27T20:07:33.036Z] 	at org.junit.internal.runners.model.ReflectiveCallable.run(ReflectiveCallable.java:12)
16:07:33 [2020-08-27T20:07:33.036Z] 	at org.junit.runners.model.FrameworkMethod.invokeExplosively(FrameworkMethod.java:56)
16:07:33 [2020-08-27T20:07:33.036Z] 	at org.junit.internal.runners.statements.RunAfters.invokeMethod(RunAfters.java:46)
16:07:33 [2020-08-27T20:07:33.036Z] 	at org.junit.internal.runners.statements.RunAfters.evaluate(RunAfters.java:33)
16:07:33 [2020-08-27T20:07:33.036Z] 	at org.junit.rules.TestWatcher$1.evaluate(TestWatcher.java:61)
16:07:33 [2020-08-27T20:07:33.036Z] 	at org.junit.runners.ParentRunner$3.evaluate(ParentRunner.java:306)
16:07:33 [2020-08-27T20:07:33.036Z] 	at org.junit.runners.ParentRunner.runLeaf(ParentRunner.java:366)
16:07:33 [2020-08-27T20:07:33.036Z] 	at org.eclipse.swtbot.swt.finder.junit.SWTBotJunit4ClassRunner.runChild(SWTBotJunit4ClassRunner.java:77)
16:07:33 [2020-08-27T20:07:33.036Z] 	at org.junit.runners.BlockJUnit4ClassRunner.runChild(BlockJUnit4ClassRunner.java:63)
16:07:33 [2020-08-27T20:07:33.036Z] 	at org.junit.runners.ParentRunner$4.run(ParentRunner.java:331)
16:07:33 [2020-08-27T20:07:33.036Z] 	at org.junit.runners.ParentRunner$1.schedule(ParentRunner.java:79)
16:07:33 [2020-08-27T20:07:33.036Z] 	at org.junit.runners.ParentRunner.runChildren(ParentRunner.java:329)
16:07:33 [2020-08-27T20:07:33.036Z] 	at org.junit.runners.ParentRunner.access$100(ParentRunner.java:66)
16:07:33 [2020-08-27T20:07:33.036Z] 	at org.junit.runners.ParentRunner$2.evaluate(ParentRunner.java:293)
16:07:33 [2020-08-27T20:07:33.036Z] 	at org.junit.internal.runners.statements.RunBefores.evaluate(RunBefores.java:26)
16:07:33 [2020-08-27T20:07:33.036Z] 	at org.junit.internal.runners.statements.RunAfters.evaluate(RunAfters.java:27)
16:07:33 [2020-08-27T20:07:33.036Z] 	at org.junit.runners.ParentRunner$3.evaluate(ParentRunner.java:306)
16:07:33 [2020-08-27T20:07:33.036Z] 	at org.junit.runners.ParentRunner.run(ParentRunner.java:413)
16:07:33 [2020-08-27T20:07:33.036Z] 	at org.eclipse.swtbot.swt.finder.junit.SWTBotJunit4ClassRunner.run(SWTBotJunit4ClassRunner.java:62)
16:07:33 [2020-08-27T20:07:33.036Z] 	at org.apache.maven.surefire.junit4.JUnit4Provider.execute(JUnit4Provider.java:365)
16:07:33 [2020-08-27T20:07:33.036Z] 	at org.apache.maven.surefire.junit4.JUnit4Provider.executeWithRerun(JUnit4Provider.java:273)
16:07:33 [2020-08-27T20:07:33.036Z] 	at org.apache.maven.surefire.junit4.JUnit4Provider.executeTestSet(JUnit4Provider.java:238)
16:07:33 [2020-08-27T20:07:33.036Z] 	at org.apache.maven.surefire.junit4.JUnit4Provider.invoke(JUnit4Provider.java:159)
16:07:33 [2020-08-27T20:07:33.036Z] 	at sun.reflect.NativeMethodAccessorImpl.invoke0(Native Method)
16:07:33 [2020-08-27T20:07:33.036Z] 	at sun.reflect.NativeMethodAccessorImpl.invoke(NativeMethodAccessorImpl.java:62)
16:07:33 [2020-08-27T20:07:33.036Z] 	at sun.reflect.DelegatingMethodAccessorImpl.invoke(DelegatingMethodAccessorImpl.java:43)
16:07:33 [2020-08-27T20:07:33.036Z] 	at java.lang.reflect.Method.invoke(Method.java:498)
16:07:33 [2020-08-27T20:07:33.036Z] 	at org.apache.maven.surefire.util.ReflectionUtils.invokeMethodWithArray2(ReflectionUtils.java:206)
16:07:33 [2020-08-27T20:07:33.036Z] 	at org.apache.maven.surefire.booter.ProviderFactory$ProviderProxy.invoke(ProviderFactory.java:161)
16:07:33 [2020-08-27T20:07:33.036Z] 	at org.apache.maven.surefire.booter.ProviderFactory.invokeProvider(ProviderFactory.java:84)
16:07:33 [2020-08-27T20:07:33.036Z] 	at org.eclipse.tycho.surefire.osgibooter.OsgiSurefireBooter.run(OsgiSurefireBooter.java:113)
16:07:33 [2020-08-27T20:07:33.036Z] 	at org.eclipse.tycho.surefire.osgibooter.AbstractUITestApplication.runTests(AbstractUITestApplication.java:44)
16:07:33 [2020-08-27T20:07:33.036Z] 	at org.eclipse.e4.ui.internal.workbench.swt.E4Testable$1.run(E4Testable.java:73)
16:07:33 [2020-08-27T20:07:33.036Z] 	at java.lang.Thread.run(Thread.java:748)
16:07:33 [2020-08-27T20:07:33.036Z] 
16:07:33 [2020-08-27T20:07:33.036Z] Running org.eclipse.egit.ui.test.team.actions.MergeToolTest
16:07:33 [2020-08-27T20:07:33.036Z] 
16:07:33 [2020-08-27T20:07:33.036Z] (SWT:1606): Gtk-WARNING **: 20:07:25.782: Negative content width -6 (allocation 1, extents 4x3) while allocating gadget (node toolbar, owner GtkToolbar)
16:07:33 [2020-08-27T20:07:33.036Z] 
16:07:33 [2020-08-27T20:07:33.037Z] (SWT:1606): Gtk-WARNING **: 20:07:25.782: Negative content height -3 (allocation 1, extents 2x2) while allocating gadget (node toolbar, owner GtkToolbar)
16:07:33 [2020-08-27T20:07:33.037Z] 
16:07:33 [2020-08-27T20:07:33.037Z] (SWT:1606): Gtk-WARNING **: 20:07:25.782: Negative content width -6 (allocation 1, extents 4x3) while allocating gadget (node toolbar, owner GtkToolbar)
16:07:33 [2020-08-27T20:07:33.037Z] 
16:07:33 [2020-08-27T20:07:33.037Z] (SWT:1606): Gtk-WARNING **: 20:07:25.782: Negative content height -3 (allocation 1, extents 2x2) while allocating gadget (node toolbar, owner GtkToolbar)
16:07:33 [2020-08-27T20:07:33.037Z] 
16:07:33 [2020-08-27T20:07:33.037Z] (SWT:1606): Gtk-WARNING **: 20:07:26.076: Negative content width -6 (allocation 1, extents 4x3) while allocating gadget (node toolbar, owner GtkToolbar)
16:07:33 [2020-08-27T20:07:33.037Z] 
16:07:33 [2020-08-27T20:07:33.037Z] (SWT:1606): Gtk-WARNING **: 20:07:26.079: Negative content width -6 (allocation 1, extents 4x3) while allocating gadget (node toolbar, owner GtkToolbar)
16:07:33 [2020-08-27T20:07:33.037Z] 
16:07:33 [2020-08-27T20:07:33.037Z] (SWT:1606): Gtk-WARNING **: 20:07:26.083: Negative content width -6 (allocation 1, extents 4x3) while allocating gadget (node toolbar, owner GtkToolbar)
16:07:33 [2020-08-27T20:07:33.037Z] 
16:07:33 [2020-08-27T20:07:33.037Z] (SWT:1606): Gtk-WARNING **: 20:07:26.087: Negative content width -6 (allocation 1, extents 4x3) while allocating gadget (node toolbar, owner GtkToolbar)
16:07:33 [2020-08-27T20:07:33.037Z] 
16:07:33 [2020-08-27T20:07:33.037Z] (SWT:1606): Gtk-WARNING **: 20:07:26.108: Negative content width -6 (allocation 1, extents 4x3) while allocating gadget (node toolbar, owner GtkToolbar)
16:07:33 [2020-08-27T20:07:33.037Z] 
16:07:33 [2020-08-27T20:07:33.037Z] (SWT:1606): Gtk-WARNING **: 20:07:26.108: Negative content width -6 (allocation 1, extents 4x3) while allocating gadget (node toolbar, owner GtkToolbar)
16:07:33 [2020-08-27T20:07:33.037Z] 
16:07:33 [2020-08-27T20:07:33.037Z] (SWT:1606): Gtk-WARNING **: 20:07:26.151: Negative content width -6 (allocation 1, extents 4x3) while allocating gadget (node toolbar, owner GtkToolbar)
16:07:33 [2020-08-27T20:07:33.037Z] 
16:07:33 [2020-08-27T20:07:33.037Z] (SWT:1606): Gtk-WARNING **: 20:07:26.152: Negative content width -6 (allocation 1, extents 4x3) while allocating gadget (node toolbar, owner GtkToolbar)
16:08:29 [2020-08-27T20:08:29.247Z] Tests run: 2, Failures: 0, Errors: 2, Skipped: 0, Time elapsed: 61.996 s <<< FAILURE! - in org.eclipse.egit.ui.test.team.actions.MergeToolTest
16:08:29 [2020-08-27T20:08:29.247Z] useHeadOptionShouldCauseFileToNotHaveConflictMarkers(org.eclipse.egit.ui.test.team.actions.MergeToolTest)  Time elapsed: 61.991 s  <<< ERROR!
16:08:29 [2020-08-27T20:08:29.247Z] org.eclipse.swtbot.swt.finder.widgets.TimeoutException: Timeout after: 30000 ms.: Timed out waiting for Shell {Create Branch} to close.
16:08:29 [2020-08-27T20:08:29.247Z] 	at org.eclipse.swtbot.swt.finder.SWTBotFactory.waitUntil(SWTBotFactory.java:523)
16:08:29 [2020-08-27T20:08:29.247Z] 	at org.eclipse.swtbot.swt.finder.SWTBot.waitUntil(SWTBot.java:1)
16:08:29 [2020-08-27T20:08:29.247Z] 	at org.eclipse.swtbot.swt.finder.SWTBotFactory.waitUntil(SWTBotFactory.java:497)
16:08:29 [2020-08-27T20:08:29.247Z] 	at org.eclipse.swtbot.swt.finder.SWTBot.waitUntil(SWTBot.java:1)
16:08:29 [2020-08-27T20:08:29.247Z] 	at org.eclipse.swtbot.swt.finder.SWTBotFactory.waitUntil(SWTBotFactory.java:485)
16:08:29 [2020-08-27T20:08:29.247Z] 	at org.eclipse.swtbot.swt.finder.SWTBot.waitUntil(SWTBot.java:1)
16:08:29 [2020-08-27T20:08:29.247Z] 	at org.eclipse.swtbot.swt.finder.widgets.SWTBotShell.close(SWTBotShell.java:117)
16:08:29 [2020-08-27T20:08:29.247Z] 	at org.eclipse.egit.ui.test.Eclipse.closeAllShells(Eclipse.java:45)
16:08:29 [2020-08-27T20:08:29.247Z] 	at org.eclipse.egit.ui.test.Eclipse.reset(Eclipse.java:38)
16:08:29 [2020-08-27T20:08:29.247Z] 	at org.eclipse.egit.ui.common.LocalRepositoryTestCase.resetWorkspace(LocalRepositoryTestCase.java:243)
16:08:29 [2020-08-27T20:08:29.247Z] 	at sun.reflect.GeneratedMethodAccessor84.invoke(Unknown Source)
16:08:29 [2020-08-27T20:08:29.247Z] 	at sun.reflect.DelegatingMethodAccessorImpl.invoke(DelegatingMethodAccessorImpl.java:43)
16:08:29 [2020-08-27T20:08:29.247Z] 	at java.lang.reflect.Method.invoke(Method.java:498)
16:08:29 [2020-08-27T20:08:29.247Z] 	at org.junit.runners.model.FrameworkMethod$1.runReflectiveCall(FrameworkMethod.java:59)
16:08:29 [2020-08-27T20:08:29.247Z] 	at org.junit.internal.runners.model.ReflectiveCallable.run(ReflectiveCallable.java:12)
16:08:29 [2020-08-27T20:08:29.247Z] 	at org.junit.runners.model.FrameworkMethod.invokeExplosively(FrameworkMethod.java:56)
16:08:29 [2020-08-27T20:08:29.247Z] 	at org.junit.internal.runners.statements.RunAfters.invokeMethod(RunAfters.java:46)
16:08:29 [2020-08-27T20:08:29.247Z] 	at org.junit.internal.runners.statements.RunAfters.evaluate(RunAfters.java:33)
16:08:29 [2020-08-27T20:08:29.247Z] 	at org.junit.rules.TestWatcher$1.evaluate(TestWatcher.java:61)
16:08:29 [2020-08-27T20:08:29.248Z] 	at org.junit.runners.ParentRunner$3.evaluate(ParentRunner.java:306)
16:08:29 [2020-08-27T20:08:29.248Z] 	at org.junit.runners.ParentRunner.runLeaf(ParentRunner.java:366)
16:08:29 [2020-08-27T20:08:29.248Z] 	at org.eclipse.swtbot.swt.finder.junit.SWTBotJunit4ClassRunner.runChild(SWTBotJunit4ClassRunner.java:77)
16:08:29 [2020-08-27T20:08:29.248Z] 	at org.junit.runners.BlockJUnit4ClassRunner.runChild(BlockJUnit4ClassRunner.java:63)
16:08:29 [2020-08-27T20:08:29.248Z] 	at org.junit.runners.ParentRunner$4.run(ParentRunner.java:331)
16:08:29 [2020-08-27T20:08:29.248Z] 	at org.junit.runners.ParentRunner$1.schedule(ParentRunner.java:79)
16:08:29 [2020-08-27T20:08:29.248Z] 	at org.junit.runners.ParentRunner.runChildren(ParentRunner.java:329)
16:08:29 [2020-08-27T20:08:29.248Z] 	at org.junit.runners.ParentRunner.access$100(ParentRunner.java:66)
16:08:29 [2020-08-27T20:08:29.248Z] 	at org.junit.runners.ParentRunner$2.evaluate(ParentRunner.java:293)
16:08:29 [2020-08-27T20:08:29.248Z] 	at org.junit.internal.runners.statements.RunBefores.evaluate(RunBefores.java:26)
16:08:29 [2020-08-27T20:08:29.248Z] 	at org.junit.internal.runners.statements.RunAfters.evaluate(RunAfters.java:27)
16:08:29 [2020-08-27T20:08:29.248Z] 	at org.junit.runners.ParentRunner$3.evaluate(ParentRunner.java:306)
16:08:29 [2020-08-27T20:08:29.248Z] 	at org.junit.runners.ParentRunner.run(ParentRunner.java:413)
16:08:29 [2020-08-27T20:08:29.248Z] 	at org.eclipse.swtbot.swt.finder.junit.SWTBotJunit4ClassRunner.run(SWTBotJunit4ClassRunner.java:62)
16:08:29 [2020-08-27T20:08:29.248Z] 	at org.apache.maven.surefire.junit4.JUnit4Provider.execute(JUnit4Provider.java:365)
16:08:29 [2020-08-27T20:08:29.248Z] 	at org.apache.maven.surefire.junit4.JUnit4Provider.executeWithRerun(JUnit4Provider.java:273)
16:08:29 [2020-08-27T20:08:29.248Z] 	at org.apache.maven.surefire.junit4.JUnit4Provider.executeTestSet(JUnit4Provider.java:238)
16:08:29 [2020-08-27T20:08:29.248Z] 	at org.apache.maven.surefire.junit4.JUnit4Provider.invoke(JUnit4Provider.java:159)
16:08:29 [2020-08-27T20:08:29.248Z] 	at sun.reflect.NativeMethodAccessorImpl.invoke0(Native Method)
16:08:29 [2020-08-27T20:08:29.248Z] 	at sun.reflect.NativeMethodAccessorImpl.invoke(NativeMethodAccessorImpl.java:62)
16:08:29 [2020-08-27T20:08:29.248Z] 	at sun.reflect.DelegatingMethodAccessorImpl.invoke(DelegatingMethodAccessorImpl.java:43)
16:08:29 [2020-08-27T20:08:29.248Z] 	at java.lang.reflect.Method.invoke(Method.java:498)
16:08:29 [2020-08-27T20:08:29.248Z] 	at org.apache.maven.surefire.util.ReflectionUtils.invokeMethodWithArray2(ReflectionUtils.java:206)
16:08:29 [2020-08-27T20:08:29.248Z] 	at org.apache.maven.surefire.booter.ProviderFactory$ProviderProxy.invoke(ProviderFactory.java:161)
16:08:29 [2020-08-27T20:08:29.248Z] 	at org.apache.maven.surefire.booter.ProviderFactory.invokeProvider(ProviderFactory.java:84)
16:08:29 [2020-08-27T20:08:29.248Z] 	at org.eclipse.tycho.surefire.osgibooter.OsgiSurefireBooter.run(OsgiSurefireBooter.java:113)
16:08:29 [2020-08-27T20:08:29.248Z] 	at org.eclipse.tycho.surefire.osgibooter.AbstractUITestApplication.runTests(AbstractUITestApplication.java:44)
16:08:29 [2020-08-27T20:08:29.248Z] 	at org.eclipse.e4.ui.internal.workbench.swt.E4Testable$1.run(E4Testable.java:73)
16:08:29 [2020-08-27T20:08:29.248Z] 	at java.lang.Thread.run(Thread.java:748)
16:08:29 [2020-08-27T20:08:29.248Z] 
16:08:29 [2020-08-27T20:08:29.248Z] useHeadOptionShouldCauseFileToNotHaveConflictMarkers(org.eclipse.egit.ui.test.team.actions.MergeToolTest)  Time elapsed: 61.991 s  <<< ERROR!
16:08:29 [2020-08-27T20:08:29.248Z] org.eclipse.swtbot.swt.finder.widgets.TimeoutException: Timeout after: 30000 ms.: Timed out waiting for Shell {Create Branch} to close.
16:08:29 [2020-08-27T20:08:29.248Z] 	at org.eclipse.swtbot.swt.finder.SWTBotFactory.waitUntil(SWTBotFactory.java:523)
16:08:29 [2020-08-27T20:08:29.248Z] 	at org.eclipse.swtbot.swt.finder.SWTBot.waitUntil(SWTBot.java:1)
16:08:29 [2020-08-27T20:08:29.248Z] 	at org.eclipse.swtbot.swt.finder.SWTBotFactory.waitUntil(SWTBotFactory.java:497)
16:08:29 [2020-08-27T20:08:29.248Z] 	at org.eclipse.swtbot.swt.finder.SWTBot.waitUntil(SWTBot.java:1)
16:08:29 [2020-08-27T20:08:29.248Z] 	at org.eclipse.swtbot.swt.finder.SWTBotFactory.waitUntil(SWTBotFactory.java:485)
16:08:29 [2020-08-27T20:08:29.248Z] 	at org.eclipse.swtbot.swt.finder.SWTBot.waitUntil(SWTBot.java:1)
16:08:29 [2020-08-27T20:08:29.248Z] 	at org.eclipse.swtbot.swt.finder.widgets.SWTBotShell.close(SWTBotShell.java:117)
16:08:29 [2020-08-27T20:08:29.248Z] 	at org.eclipse.egit.ui.test.Eclipse.closeAllShells(Eclipse.java:45)
16:08:29 [2020-08-27T20:08:29.248Z] 	at org.eclipse.egit.ui.test.Eclipse.reset(Eclipse.java:38)
16:08:29 [2020-08-27T20:08:29.248Z] 	at org.eclipse.egit.ui.common.EGitTestCase.resetWorkbench(EGitTestCase.java:63)
16:08:29 [2020-08-27T20:08:29.248Z] 	at sun.reflect.GeneratedMethodAccessor85.invoke(Unknown Source)
16:08:29 [2020-08-27T20:08:29.248Z] 	at sun.reflect.DelegatingMethodAccessorImpl.invoke(DelegatingMethodAccessorImpl.java:43)
16:08:29 [2020-08-27T20:08:29.248Z] 	at java.lang.reflect.Method.invoke(Method.java:498)
16:08:29 [2020-08-27T20:08:29.248Z] 	at org.junit.runners.model.FrameworkMethod$1.runReflectiveCall(FrameworkMethod.java:59)
16:08:29 [2020-08-27T20:08:29.248Z] 	at org.junit.internal.runners.model.ReflectiveCallable.run(ReflectiveCallable.java:12)
16:08:29 [2020-08-27T20:08:29.248Z] 	at org.junit.runners.model.FrameworkMethod.invokeExplosively(FrameworkMethod.java:56)
16:08:29 [2020-08-27T20:08:29.248Z] 	at org.junit.internal.runners.statements.RunAfters.invokeMethod(RunAfters.java:46)
16:08:29 [2020-08-27T20:08:29.248Z] 	at org.junit.internal.runners.statements.RunAfters.evaluate(RunAfters.java:33)
16:08:29 [2020-08-27T20:08:29.248Z] 	at org.junit.rules.TestWatcher$1.evaluate(TestWatcher.java:61)
16:08:29 [2020-08-27T20:08:29.248Z] 	at org.junit.runners.ParentRunner$3.evaluate(ParentRunner.java:306)
16:08:29 [2020-08-27T20:08:29.248Z] 	at org.junit.runners.ParentRunner.runLeaf(ParentRunner.java:366)
16:08:29 [2020-08-27T20:08:29.248Z] 	at org.eclipse.swtbot.swt.finder.junit.SWTBotJunit4ClassRunner.runChild(SWTBotJunit4ClassRunner.java:77)
16:08:29 [2020-08-27T20:08:29.248Z] 	at org.junit.runners.BlockJUnit4ClassRunner.runChild(BlockJUnit4ClassRunner.java:63)
16:08:29 [2020-08-27T20:08:29.248Z] 	at org.junit.runners.ParentRunner$4.run(ParentRunner.java:331)
16:08:29 [2020-08-27T20:08:29.248Z] 	at org.junit.runners.ParentRunner$1.schedule(ParentRunner.java:79)
16:08:29 [2020-08-27T20:08:29.248Z] 	at org.junit.runners.ParentRunner.runChildren(ParentRunner.java:329)
16:08:29 [2020-08-27T20:08:29.248Z] 	at org.junit.runners.ParentRunner.access$100(ParentRunner.java:66)
16:08:29 [2020-08-27T20:08:29.248Z] 	at org.junit.runners.ParentRunner$2.evaluate(ParentRunner.java:293)
16:08:29 [2020-08-27T20:08:29.248Z] 	at org.junit.internal.runners.statements.RunBefores.evaluate(RunBefores.java:26)
16:08:29 [2020-08-27T20:08:29.248Z] 	at org.junit.internal.runners.statements.RunAfters.evaluate(RunAfters.java:27)
16:08:29 [2020-08-27T20:08:29.248Z] 	at org.junit.runners.ParentRunner$3.evaluate(ParentRunner.java:306)
16:08:29 [2020-08-27T20:08:29.248Z] 	at org.junit.runners.ParentRunner.run(ParentRunner.java:413)
16:08:29 [2020-08-27T20:08:29.248Z] 	at org.eclipse.swtbot.swt.finder.junit.SWTBotJunit4ClassRunner.run(SWTBotJunit4ClassRunner.java:62)
16:08:29 [2020-08-27T20:08:29.248Z] 	at org.apache.maven.surefire.junit4.JUnit4Provider.execute(JUnit4Provider.java:365)
16:08:29 [2020-08-27T20:08:29.248Z] 	at org.apache.maven.surefire.junit4.JUnit4Provider.executeWithRerun(JUnit4Provider.java:273)
16:08:29 [2020-08-27T20:08:29.248Z] 	at org.apache.maven.surefire.junit4.JUnit4Provider.executeTestSet(JUnit4Provider.java:238)
16:08:29 [2020-08-27T20:08:29.248Z] 	at org.apache.maven.surefire.junit4.JUnit4Provider.invoke(JUnit4Provider.java:159)
16:08:29 [2020-08-27T20:08:29.248Z] 	at sun.reflect.NativeMethodAccessorImpl.invoke0(Native Method)
16:08:29 [2020-08-27T20:08:29.248Z] 	at sun.reflect.NativeMethodAccessorImpl.invoke(NativeMethodAccessorImpl.java:62)
16:08:29 [2020-08-27T20:08:29.248Z] 	at sun.reflect.DelegatingMethodAccessorImpl.invoke(DelegatingMethodAccessorImpl.java:43)
16:08:29 [2020-08-27T20:08:29.248Z] 	at java.lang.reflect.Method.invoke(Method.java:498)
16:08:29 [2020-08-27T20:08:29.248Z] 	at org.apache.maven.surefire.util.ReflectionUtils.invokeMethodWithArray2(ReflectionUtils.java:206)
16:08:29 [2020-08-27T20:08:29.248Z] 	at org.apache.maven.surefire.booter.ProviderFactory$ProviderProxy.invoke(ProviderFactory.java:161)
16:08:29 [2020-08-27T20:08:29.248Z] 	at org.apache.maven.surefire.booter.ProviderFactory.invokeProvider(ProviderFactory.java:84)
16:08:29 [2020-08-27T20:08:29.248Z] 	at org.eclipse.tycho.surefire.osgibooter.OsgiSurefireBooter.run(OsgiSurefireBooter.java:113)
16:08:29 [2020-08-27T20:08:29.248Z] 	at org.eclipse.tycho.surefire.osgibooter.AbstractUITestApplication.runTests(AbstractUITestApplication.java:44)
16:08:29 [2020-08-27T20:08:29.248Z] 	at org.eclipse.e4.ui.internal.workbench.swt.E4Testable$1.run(E4Testable.java:73)
16:08:29 [2020-08-27T20:08:29.248Z] 	at java.lang.Thread.run(Thread.java:748)
16:08:29 [2020-08-27T20:08:29.248Z] 
16:08:29 [2020-08-27T20:08:29.248Z] Running org.eclipse.egit.ui.test.team.actions.CommitActionStagingViewTest
16:08:29 [2020-08-27T20:08:29.248Z] 
16:08:29 [2020-08-27T20:08:29.248Z] !ENTRY org.eclipse.core.resources 2 2 2020-08-27 20:08:26.848
16:08:29 [2020-08-27T20:08:29.248Z] !MESSAGE Save operation warnings.
16:08:29 [2020-08-27T20:08:29.248Z] !SUBENTRY 1 org.eclipse.core.resources 2 234 2020-08-27 20:08:26.848
16:08:29 [2020-08-27T20:08:29.248Z] !MESSAGE The project description file (.project) for 'ProjectWithoutDotProject' was missing.  This file contains important information about the project.  A new project description file has been created, but some information about the project may have been lost.
16:08:29 [2020-08-27T20:08:29.248Z] 
16:08:29 [2020-08-27T20:08:29.248Z] (SWT:1606): Gtk-CRITICAL **: 20:08:27.631: gtk_box_gadget_distribute: assertion 'size >= 0' failed in GtkScrollbar
16:08:29 [2020-08-27T20:08:29.248Z] 
16:08:29 [2020-08-27T20:08:29.248Z] (SWT:1606): Gtk-CRITICAL **: 20:08:27.637: gtk_box_gadget_distribute: assertion 'size >= 0' failed in GtkScrollbar
16:08:29 [2020-08-27T20:08:29.248Z] 
16:08:29 [2020-08-27T20:08:29.248Z] (SWT:1606): Gtk-WARNING **: 20:08:27.641: Negative content width -6 (allocation 1, extents 4x3) while allocating gadget (node toolbar, owner GtkToolbar)
16:08:29 [2020-08-27T20:08:29.248Z] 
16:08:29 [2020-08-27T20:08:29.248Z] (SWT:1606): Gtk-CRITICAL **: 20:08:27.652: gtk_box_gadget_distribute: assertion 'size >= 0' failed in GtkScrollbar
16:08:29 [2020-08-27T20:08:29.248Z] 
16:08:29 [2020-08-27T20:08:29.248Z] (SWT:1606): Gtk-CRITICAL **: 20:08:27.658: gtk_box_gadget_distribute: assertion 'size >= 0' failed in GtkScrollbar
16:08:29 [2020-08-27T20:08:29.248Z] 
16:08:29 [2020-08-27T20:08:29.248Z] (SWT:1606): Gtk-CRITICAL **: 20:08:27.659: gtk_box_gadget_distribute: assertion 'size >= 0' failed in GtkScrollbar
16:08:29 [2020-08-27T20:08:29.248Z] 
16:08:29 [2020-08-27T20:08:29.248Z] (SWT:1606): Gtk-CRITICAL **: 20:08:27.660: gtk_box_gadget_distribute: assertion 'size >= 0' failed in GtkScrollbar
16:08:29 [2020-08-27T20:08:29.248Z] 
16:08:29 [2020-08-27T20:08:29.248Z] (SWT:1606): Gtk-CRITICAL **: 20:08:27.667: gtk_box_gadget_distribute: assertion 'size >= 0' failed in GtkScrollbar
16:08:29 [2020-08-27T20:08:29.248Z] 
16:08:29 [2020-08-27T20:08:29.248Z] (SWT:1606): Gtk-CRITICAL **: 20:08:27.667: gtk_box_gadget_distribute: assertion 'size >= 0' failed in GtkScrollbar
16:08:29 [2020-08-27T20:08:29.248Z] 
16:08:29 [2020-08-27T20:08:29.248Z] (SWT:1606): Gtk-CRITICAL **: 20:08:27.675: gtk_box_gadget_distribute: assertion 'size >= 0' failed in GtkScrollbar
16:08:29 [2020-08-27T20:08:29.248Z] 
16:08:29 [2020-08-27T20:08:29.248Z] (SWT:1606): Gtk-CRITICAL **: 20:08:27.693: gtk_box_gadget_distribute: assertion 'size >= 0' failed in GtkScrollbar
16:08:29 [2020-08-27T20:08:29.248Z] 
16:08:29 [2020-08-27T20:08:29.248Z] (SWT:1606): Gtk-CRITICAL **: 20:08:27.693: gtk_box_gadget_distribute: assertion 'size >= 0' failed in GtkScrollbar
16:08:29 [2020-08-27T20:08:29.248Z] 
16:08:29 [2020-08-27T20:08:29.248Z] (SWT:1606): Gtk-CRITICAL **: 20:08:27.709: gtk_box_gadget_distribute: assertion 'size >= 0' failed in GtkScrollbar
16:08:29 [2020-08-27T20:08:29.249Z] 
16:08:29 [2020-08-27T20:08:29.249Z] (SWT:1606): Gtk-CRITICAL **: 20:08:27.709: gtk_box_gadget_distribute: assertion 'size >= 0' failed in GtkScrollbar
16:08:29 [2020-08-27T20:08:29.249Z] 
16:08:29 [2020-08-27T20:08:29.249Z] (SWT:1606): Gtk-CRITICAL **: 20:08:27.725: gtk_box_gadget_distribute: assertion 'size >= 0' failed in GtkScrollbar
16:08:29 [2020-08-27T20:08:29.249Z] 
16:08:29 [2020-08-27T20:08:29.249Z] (SWT:1606): Gtk-CRITICAL **: 20:08:27.725: gtk_box_gadget_distribute: assertion 'size >= 0' failed in GtkScrollbar
16:08:29 [2020-08-27T20:08:29.249Z] 
16:08:29 [2020-08-27T20:08:29.249Z] (SWT:1606): Gtk-CRITICAL **: 20:08:27.742: gtk_box_gadget_distribute: assertion 'size >= 0' failed in GtkScrollbar
16:08:29 [2020-08-27T20:08:29.249Z] 
16:08:29 [2020-08-27T20:08:29.249Z] (SWT:1606): Gtk-CRITICAL **: 20:08:27.742: gtk_box_gadget_distribute: assertion 'size >= 0' failed in GtkScrollbar
16:08:29 [2020-08-27T20:08:29.249Z] 
16:08:29 [2020-08-27T20:08:29.249Z] (SWT:1606): Gtk-CRITICAL **: 20:08:27.759: gtk_box_gadget_distribute: assertion 'size >= 0' failed in GtkScrollbar
16:08:29 [2020-08-27T20:08:29.249Z] 
16:08:29 [2020-08-27T20:08:29.249Z] (SWT:1606): Gtk-CRITICAL **: 20:08:27.759: gtk_box_gadget_distribute: assertion 'size >= 0' failed in GtkScrollbar
16:08:29 [2020-08-27T20:08:29.249Z] 
16:08:29 [2020-08-27T20:08:29.249Z] (SWT:1606): Gtk-CRITICAL **: 20:08:27.775: gtk_box_gadget_distribute: assertion 'size >= 0' failed in GtkScrollbar
16:08:29 [2020-08-27T20:08:29.249Z] 
16:08:29 [2020-08-27T20:08:29.249Z] (SWT:1606): Gtk-CRITICAL **: 20:08:27.775: gtk_box_gadget_distribute: assertion 'size >= 0' failed in GtkScrollbar
16:08:29 [2020-08-27T20:08:29.249Z] 
16:08:29 [2020-08-27T20:08:29.249Z] (SWT:1606): Gtk-CRITICAL **: 20:08:27.793: gtk_box_gadget_distribute: assertion 'size >= 0' failed in GtkScrollbar
16:08:29 [2020-08-27T20:08:29.249Z] 
16:08:29 [2020-08-27T20:08:29.249Z] (SWT:1606): Gtk-CRITICAL **: 20:08:27.793: gtk_box_gadget_distribute: assertion 'size >= 0' failed in GtkScrollbar
16:08:29 [2020-08-27T20:08:29.249Z] 
16:08:29 [2020-08-27T20:08:29.249Z] (SWT:1606): Gtk-CRITICAL **: 20:08:27.811: gtk_box_gadget_distribute: assertion 'size >= 0' failed in GtkScrollbar
16:08:29 [2020-08-27T20:08:29.249Z] 
16:08:29 [2020-08-27T20:08:29.249Z] (SWT:1606): Gtk-CRITICAL **: 20:08:27.812: gtk_box_gadget_distribute: assertion 'size >= 0' failed in GtkScrollbar
16:08:29 [2020-08-27T20:08:29.249Z] 
16:08:29 [2020-08-27T20:08:29.249Z] (SWT:1606): Gtk-CRITICAL **: 20:08:27.828: gtk_box_gadget_distribute: assertion 'size >= 0' failed in GtkScrollbar
16:08:29 [2020-08-27T20:08:29.249Z] 
16:08:29 [2020-08-27T20:08:29.249Z] (SWT:1606): Gtk-CRITICAL **: 20:08:27.828: gtk_box_gadget_distribute: assertion 'size >= 0' failed in GtkScrollbar
16:08:29 [2020-08-27T20:08:29.249Z] 
16:08:29 [2020-08-27T20:08:29.249Z] (SWT:1606): Gtk-CRITICAL **: 20:08:27.843: gtk_box_gadget_distribute: assertion 'size >= 0' failed in GtkScrollbar
16:08:29 [2020-08-27T20:08:29.249Z] 
16:08:29 [2020-08-27T20:08:29.249Z] (SWT:1606): Gtk-CRITICAL **: 20:08:27.843: gtk_box_gadget_distribute: assertion 'size >= 0' failed in GtkScrollbar
16:08:29 [2020-08-27T20:08:29.249Z] 
16:08:29 [2020-08-27T20:08:29.249Z] (SWT:1606): Gtk-CRITICAL **: 20:08:27.860: gtk_box_gadget_distribute: assertion 'size >= 0' failed in GtkScrollbar
16:08:29 [2020-08-27T20:08:29.249Z] 
16:08:29 [2020-08-27T20:08:29.249Z] (SWT:1606): Gtk-CRITICAL **: 20:08:27.860: gtk_box_gadget_distribute: assertion 'size >= 0' failed in GtkScrollbar
16:08:29 [2020-08-27T20:08:29.249Z] 
16:08:29 [2020-08-27T20:08:29.249Z] (SWT:1606): Gtk-CRITICAL **: 20:08:27.875: gtk_box_gadget_distribute: assertion 'size >= 0' failed in GtkScrollbar
16:08:29 [2020-08-27T20:08:29.249Z] 
16:08:29 [2020-08-27T20:08:29.249Z] (SWT:1606): Gtk-CRITICAL **: 20:08:27.876: gtk_box_gadget_distribute: assertion 'size >= 0' failed in GtkScrollbar
16:09:36 [2020-08-27T20:09:36.937Z] 
16:09:36 [2020-08-27T20:09:36.937Z] (SWT:1606): Gtk-WARNING **: 20:09:27.982: Negative content width -6 (allocation 1, extents 4x3) while allocating gadget (node toolbar, owner GtkToolbar)
16:09:36 [2020-08-27T20:09:36.937Z] 
16:09:36 [2020-08-27T20:09:36.937Z] (SWT:1606): Gtk-CRITICAL **: 20:09:28.677: gtk_box_gadget_distribute: assertion 'size >= 0' failed in GtkScrollbar
16:09:36 [2020-08-27T20:09:36.937Z] 
16:09:36 [2020-08-27T20:09:36.937Z] (SWT:1606): Gtk-CRITICAL **: 20:09:28.682: gtk_box_gadget_distribute: assertion 'size >= 0' failed in GtkScrollbar
16:09:36 [2020-08-27T20:09:36.937Z] 
16:09:36 [2020-08-27T20:09:36.937Z] (SWT:1606): Gtk-WARNING **: 20:09:28.686: Negative content width -6 (allocation 1, extents 4x3) while allocating gadget (node toolbar, owner GtkToolbar)
16:09:36 [2020-08-27T20:09:36.937Z] 
16:09:36 [2020-08-27T20:09:36.937Z] (SWT:1606): Gtk-CRITICAL **: 20:09:28.697: gtk_box_gadget_distribute: assertion 'size >= 0' failed in GtkScrollbar
16:09:36 [2020-08-27T20:09:36.937Z] 
16:09:36 [2020-08-27T20:09:36.937Z] (SWT:1606): Gtk-CRITICAL **: 20:09:28.703: gtk_box_gadget_distribute: assertion 'size >= 0' failed in GtkScrollbar
16:09:36 [2020-08-27T20:09:36.937Z] 
16:09:36 [2020-08-27T20:09:36.937Z] (SWT:1606): Gtk-CRITICAL **: 20:09:28.705: gtk_box_gadget_distribute: assertion 'size >= 0' failed in GtkScrollbar
16:09:36 [2020-08-27T20:09:36.937Z] 
16:09:36 [2020-08-27T20:09:36.937Z] (SWT:1606): Gtk-CRITICAL **: 20:09:28.705: gtk_box_gadget_distribute: assertion 'size >= 0' failed in GtkScrollbar
16:09:36 [2020-08-27T20:09:36.937Z] 
16:09:36 [2020-08-27T20:09:36.937Z] (SWT:1606): Gtk-CRITICAL **: 20:09:28.713: gtk_box_gadget_distribute: assertion 'size >= 0' failed in GtkScrollbar
16:09:36 [2020-08-27T20:09:36.937Z] 
16:09:36 [2020-08-27T20:09:36.937Z] (SWT:1606): Gtk-CRITICAL **: 20:09:28.713: gtk_box_gadget_distribute: assertion 'size >= 0' failed in GtkScrollbar
16:09:36 [2020-08-27T20:09:36.937Z] 
16:09:36 [2020-08-27T20:09:36.937Z] (SWT:1606): Gtk-CRITICAL **: 20:09:28.721: gtk_box_gadget_distribute: assertion 'size >= 0' failed in GtkScrollbar
16:09:36 [2020-08-27T20:09:36.937Z] 
16:09:36 [2020-08-27T20:09:36.937Z] (SWT:1606): Gtk-CRITICAL **: 20:09:28.743: gtk_box_gadget_distribute: assertion 'size >= 0' failed in GtkScrollbar
16:09:36 [2020-08-27T20:09:36.937Z] 
16:09:36 [2020-08-27T20:09:36.937Z] (SWT:1606): Gtk-CRITICAL **: 20:09:28.743: gtk_box_gadget_distribute: assertion 'size >= 0' failed in GtkScrollbar
16:09:36 [2020-08-27T20:09:36.937Z] 
16:09:36 [2020-08-27T20:09:36.937Z] (SWT:1606): Gtk-CRITICAL **: 20:09:28.761: gtk_box_gadget_distribute: assertion 'size >= 0' failed in GtkScrollbar
16:09:36 [2020-08-27T20:09:36.937Z] 
16:09:36 [2020-08-27T20:09:36.937Z] (SWT:1606): Gtk-CRITICAL **: 20:09:28.761: gtk_box_gadget_distribute: assertion 'size >= 0' failed in GtkScrollbar
16:09:36 [2020-08-27T20:09:36.937Z] 
16:09:36 [2020-08-27T20:09:36.937Z] (SWT:1606): Gtk-CRITICAL **: 20:09:28.773: gtk_box_gadget_distribute: assertion 'size >= 0' failed in GtkScrollbar
16:09:36 [2020-08-27T20:09:36.937Z] 
16:09:36 [2020-08-27T20:09:36.937Z] (SWT:1606): Gtk-CRITICAL **: 20:09:28.773: gtk_box_gadget_distribute: assertion 'size >= 0' failed in GtkScrollbar
16:09:36 [2020-08-27T20:09:36.937Z] 
16:09:36 [2020-08-27T20:09:36.937Z] (SWT:1606): Gtk-CRITICAL **: 20:09:28.788: gtk_box_gadget_distribute: assertion 'size >= 0' failed in GtkScrollbar
16:09:36 [2020-08-27T20:09:36.937Z] 
16:09:36 [2020-08-27T20:09:36.937Z] (SWT:1606): Gtk-CRITICAL **: 20:09:28.788: gtk_box_gadget_distribute: assertion 'size >= 0' failed in GtkScrollbar
16:09:36 [2020-08-27T20:09:36.937Z] 
16:09:36 [2020-08-27T20:09:36.937Z] (SWT:1606): Gtk-CRITICAL **: 20:09:28.805: gtk_box_gadget_distribute: assertion 'size >= 0' failed in GtkScrollbar
16:09:36 [2020-08-27T20:09:36.937Z] 
16:09:36 [2020-08-27T20:09:36.937Z] (SWT:1606): Gtk-CRITICAL **: 20:09:28.805: gtk_box_gadget_distribute: assertion 'size >= 0' failed in GtkScrollbar
16:09:36 [2020-08-27T20:09:36.937Z] 
16:09:36 [2020-08-27T20:09:36.937Z] (SWT:1606): Gtk-CRITICAL **: 20:09:28.821: gtk_box_gadget_distribute: assertion 'size >= 0' failed in GtkScrollbar
16:09:36 [2020-08-27T20:09:36.937Z] 
16:09:36 [2020-08-27T20:09:36.937Z] (SWT:1606): Gtk-CRITICAL **: 20:09:28.822: gtk_box_gadget_distribute: assertion 'size >= 0' failed in GtkScrollbar
16:09:36 [2020-08-27T20:09:36.937Z] 
16:09:36 [2020-08-27T20:09:36.937Z] (SWT:1606): Gtk-CRITICAL **: 20:09:28.838: gtk_box_gadget_distribute: assertion 'size >= 0' failed in GtkScrollbar
16:09:36 [2020-08-27T20:09:36.937Z] 
16:09:36 [2020-08-27T20:09:36.937Z] (SWT:1606): Gtk-CRITICAL **: 20:09:28.838: gtk_box_gadget_distribute: assertion 'size >= 0' failed in GtkScrollbar
16:09:36 [2020-08-27T20:09:36.937Z] 
16:09:36 [2020-08-27T20:09:36.937Z] (SWT:1606): Gtk-CRITICAL **: 20:09:28.855: gtk_box_gadget_distribute: assertion 'size >= 0' failed in GtkScrollbar
16:09:36 [2020-08-27T20:09:36.937Z] 
16:09:36 [2020-08-27T20:09:36.937Z] (SWT:1606): Gtk-CRITICAL **: 20:09:28.855: gtk_box_gadget_distribute: assertion 'size >= 0' failed in GtkScrollbar
16:09:36 [2020-08-27T20:09:36.937Z] 
16:09:36 [2020-08-27T20:09:36.937Z] (SWT:1606): Gtk-CRITICAL **: 20:09:28.871: gtk_box_gadget_distribute: assertion 'size >= 0' failed in GtkScrollbar
16:09:36 [2020-08-27T20:09:36.937Z] 
16:09:36 [2020-08-27T20:09:36.937Z] (SWT:1606): Gtk-CRITICAL **: 20:09:28.871: gtk_box_gadget_distribute: assertion 'size >= 0' failed in GtkScrollbar
16:09:36 [2020-08-27T20:09:36.937Z] 
16:09:36 [2020-08-27T20:09:36.937Z] (SWT:1606): Gtk-CRITICAL **: 20:09:28.888: gtk_box_gadget_distribute: assertion 'size >= 0' failed in GtkScrollbar
16:09:36 [2020-08-27T20:09:36.937Z] 
16:09:36 [2020-08-27T20:09:36.937Z] (SWT:1606): Gtk-CRITICAL **: 20:09:28.888: gtk_box_gadget_distribute: assertion 'size >= 0' failed in GtkScrollbar
16:09:36 [2020-08-27T20:09:36.937Z] 
16:09:36 [2020-08-27T20:09:36.937Z] (SWT:1606): Gtk-CRITICAL **: 20:09:28.904: gtk_box_gadget_distribute: assertion 'size >= 0' failed in GtkScrollbar
16:09:36 [2020-08-27T20:09:36.937Z] 
16:09:36 [2020-08-27T20:09:36.937Z] (SWT:1606): Gtk-CRITICAL **: 20:09:28.904: gtk_box_gadget_distribute: assertion 'size >= 0' failed in GtkScrollbar
16:09:36 [2020-08-27T20:09:36.937Z] 
16:09:36 [2020-08-27T20:09:36.937Z] (SWT:1606): Gtk-CRITICAL **: 20:09:28.921: gtk_box_gadget_distribute: assertion 'size >= 0' failed in GtkScrollbar
16:10:33 [2020-08-27T20:10:33.198Z] 
16:10:33 [2020-08-27T20:10:33.198Z] (SWT:1606): Gtk-WARNING **: 20:10:28.937: Negative content width -6 (allocation 1, extents 4x3) while allocating gadget (node toolbar, owner GtkToolbar)
16:10:33 [2020-08-27T20:10:33.198Z] 
16:10:33 [2020-08-27T20:10:33.198Z] (SWT:1606): Gtk-CRITICAL **: 20:10:29.766: gtk_box_gadget_distribute: assertion 'size >= 0' failed in GtkScrollbar
16:10:33 [2020-08-27T20:10:33.198Z] 
16:10:33 [2020-08-27T20:10:33.198Z] (SWT:1606): Gtk-CRITICAL **: 20:10:29.772: gtk_box_gadget_distribute: assertion 'size >= 0' failed in GtkScrollbar
16:10:33 [2020-08-27T20:10:33.198Z] 
16:10:33 [2020-08-27T20:10:33.198Z] (SWT:1606): Gtk-WARNING **: 20:10:29.776: Negative content width -6 (allocation 1, extents 4x3) while allocating gadget (node toolbar, owner GtkToolbar)
16:10:33 [2020-08-27T20:10:33.198Z] 
16:10:33 [2020-08-27T20:10:33.198Z] (SWT:1606): Gtk-CRITICAL **: 20:10:29.789: gtk_box_gadget_distribute: assertion 'size >= 0' failed in GtkScrollbar
16:10:33 [2020-08-27T20:10:33.198Z] 
16:10:33 [2020-08-27T20:10:33.198Z] (SWT:1606): Gtk-CRITICAL **: 20:10:29.793: gtk_box_gadget_distribute: assertion 'size >= 0' failed in GtkScrollbar
16:10:33 [2020-08-27T20:10:33.198Z] 
16:10:33 [2020-08-27T20:10:33.198Z] (SWT:1606): Gtk-CRITICAL **: 20:10:29.801: gtk_box_gadget_distribute: assertion 'size >= 0' failed in GtkScrollbar
16:10:33 [2020-08-27T20:10:33.198Z] 
16:10:33 [2020-08-27T20:10:33.198Z] (SWT:1606): Gtk-CRITICAL **: 20:10:29.801: gtk_box_gadget_distribute: assertion 'size >= 0' failed in GtkScrollbar
16:10:33 [2020-08-27T20:10:33.198Z] 
16:10:33 [2020-08-27T20:10:33.198Z] (SWT:1606): Gtk-CRITICAL **: 20:10:29.802: gtk_box_gadget_distribute: assertion 'size >= 0' failed in GtkScrollbar
16:10:33 [2020-08-27T20:10:33.198Z] 
16:10:33 [2020-08-27T20:10:33.198Z] (SWT:1606): Gtk-CRITICAL **: 20:10:29.803: gtk_box_gadget_distribute: assertion 'size >= 0' failed in GtkScrollbar
16:10:33 [2020-08-27T20:10:33.198Z] 
16:10:33 [2020-08-27T20:10:33.198Z] (SWT:1606): Gtk-CRITICAL **: 20:10:29.810: gtk_box_gadget_distribute: assertion 'size >= 0' failed in GtkScrollbar
16:10:33 [2020-08-27T20:10:33.198Z] 
16:10:33 [2020-08-27T20:10:33.198Z] (SWT:1606): Gtk-CRITICAL **: 20:10:29.811: gtk_box_gadget_distribute: assertion 'size >= 0' failed in GtkScrollbar
16:10:33 [2020-08-27T20:10:33.198Z] 
16:10:33 [2020-08-27T20:10:33.198Z] (SWT:1606): Gtk-CRITICAL **: 20:10:29.811: gtk_box_gadget_distribute: assertion 'size >= 0' failed in GtkScrollbar
16:10:33 [2020-08-27T20:10:33.198Z] 
16:10:33 [2020-08-27T20:10:33.198Z] (SWT:1606): Gtk-CRITICAL **: 20:10:29.821: gtk_box_gadget_distribute: assertion 'size >= 0' failed in GtkScrollbar
16:10:33 [2020-08-27T20:10:33.198Z] 
16:10:33 [2020-08-27T20:10:33.198Z] (SWT:1606): Gtk-CRITICAL **: 20:10:29.823: gtk_box_gadget_distribute: assertion 'size >= 0' failed in GtkScrollbar
16:10:33 [2020-08-27T20:10:33.198Z] 
16:10:33 [2020-08-27T20:10:33.198Z] (SWT:1606): Gtk-CRITICAL **: 20:10:29.823: gtk_box_gadget_distribute: assertion 'size >= 0' failed in GtkScrollbar
16:10:33 [2020-08-27T20:10:33.198Z] 
16:10:33 [2020-08-27T20:10:33.198Z] (SWT:1606): Gtk-CRITICAL **: 20:10:29.823: gtk_box_gadget_distribute: assertion 'size >= 0' failed in GtkScrollbar
16:10:33 [2020-08-27T20:10:33.198Z] 
16:10:33 [2020-08-27T20:10:33.198Z] (SWT:1606): Gtk-CRITICAL **: 20:10:29.840: gtk_box_gadget_distribute: assertion 'size >= 0' failed in GtkScrollbar
16:10:33 [2020-08-27T20:10:33.198Z] 
16:10:33 [2020-08-27T20:10:33.198Z] (SWT:1606): Gtk-CRITICAL **: 20:10:29.840: gtk_box_gadget_distribute: assertion 'size >= 0' failed in GtkScrollbar
16:10:33 [2020-08-27T20:10:33.198Z] 
16:10:33 [2020-08-27T20:10:33.198Z] (SWT:1606): Gtk-CRITICAL **: 20:10:29.840: gtk_box_gadget_distribute: assertion 'size >= 0' failed in GtkScrollbar
16:10:33 [2020-08-27T20:10:33.198Z] 
16:10:33 [2020-08-27T20:10:33.198Z] (SWT:1606): Gtk-CRITICAL **: 20:10:29.857: gtk_box_gadget_distribute: assertion 'size >= 0' failed in GtkScrollbar
16:10:33 [2020-08-27T20:10:33.198Z] 
16:10:33 [2020-08-27T20:10:33.198Z] (SWT:1606): Gtk-CRITICAL **: 20:10:29.857: gtk_box_gadget_distribute: assertion 'size >= 0' failed in GtkScrollbar
16:10:33 [2020-08-27T20:10:33.198Z] 
16:10:33 [2020-08-27T20:10:33.198Z] (SWT:1606): Gtk-CRITICAL **: 20:10:29.857: gtk_box_gadget_distribute: assertion 'size >= 0' failed in GtkScrollbar
16:10:33 [2020-08-27T20:10:33.198Z] 
16:10:33 [2020-08-27T20:10:33.198Z] (SWT:1606): Gtk-CRITICAL **: 20:10:29.873: gtk_box_gadget_distribute: assertion 'size >= 0' failed in GtkScrollbar
16:10:33 [2020-08-27T20:10:33.198Z] 
16:10:33 [2020-08-27T20:10:33.198Z] (SWT:1606): Gtk-CRITICAL **: 20:10:29.873: gtk_box_gadget_distribute: assertion 'size >= 0' failed in GtkScrollbar
16:10:33 [2020-08-27T20:10:33.198Z] 
16:10:33 [2020-08-27T20:10:33.198Z] (SWT:1606): Gtk-CRITICAL **: 20:10:29.873: gtk_box_gadget_distribute: assertion 'size >= 0' failed in GtkScrollbar
16:10:33 [2020-08-27T20:10:33.198Z] 
16:10:33 [2020-08-27T20:10:33.198Z] (SWT:1606): Gtk-CRITICAL **: 20:10:29.889: gtk_box_gadget_distribute: assertion 'size >= 0' failed in GtkScrollbar
16:10:33 [2020-08-27T20:10:33.198Z] 
16:10:33 [2020-08-27T20:10:33.198Z] (SWT:1606): Gtk-CRITICAL **: 20:10:29.889: gtk_box_gadget_distribute: assertion 'size >= 0' failed in GtkScrollbar
16:10:33 [2020-08-27T20:10:33.198Z] 
16:10:33 [2020-08-27T20:10:33.198Z] (SWT:1606): Gtk-CRITICAL **: 20:10:29.889: gtk_box_gadget_distribute: assertion 'size >= 0' failed in GtkScrollbar
16:10:33 [2020-08-27T20:10:33.198Z] 
16:10:33 [2020-08-27T20:10:33.198Z] (SWT:1606): Gtk-CRITICAL **: 20:10:29.906: gtk_box_gadget_distribute: assertion 'size >= 0' failed in GtkScrollbar
16:10:33 [2020-08-27T20:10:33.198Z] 
16:10:33 [2020-08-27T20:10:33.198Z] (SWT:1606): Gtk-CRITICAL **: 20:10:29.906: gtk_box_gadget_distribute: assertion 'size >= 0' failed in GtkScrollbar
16:10:33 [2020-08-27T20:10:33.198Z] 
16:10:33 [2020-08-27T20:10:33.198Z] (SWT:1606): Gtk-CRITICAL **: 20:10:29.906: gtk_box_gadget_distribute: assertion 'size >= 0' failed in GtkScrollbar
16:10:33 [2020-08-27T20:10:33.198Z] 
16:10:33 [2020-08-27T20:10:33.198Z] (SWT:1606): Gtk-CRITICAL **: 20:10:29.923: gtk_box_gadget_distribute: assertion 'size >= 0' failed in GtkScrollbar
16:10:33 [2020-08-27T20:10:33.198Z] 
16:10:33 [2020-08-27T20:10:33.198Z] (SWT:1606): Gtk-CRITICAL **: 20:10:29.923: gtk_box_gadget_distribute: assertion 'size >= 0' failed in GtkScrollbar
16:10:33 [2020-08-27T20:10:33.198Z] 
16:10:33 [2020-08-27T20:10:33.198Z] (SWT:1606): Gtk-CRITICAL **: 20:10:29.923: gtk_box_gadget_distribute: assertion 'size >= 0' failed in GtkScrollbar
16:10:33 [2020-08-27T20:10:33.198Z] 
16:10:33 [2020-08-27T20:10:33.198Z] (SWT:1606): Gtk-CRITICAL **: 20:10:29.939: gtk_box_gadget_distribute: assertion 'size >= 0' failed in GtkScrollbar
16:10:33 [2020-08-27T20:10:33.198Z] 
16:10:33 [2020-08-27T20:10:33.198Z] (SWT:1606): Gtk-CRITICAL **: 20:10:29.939: gtk_box_gadget_distribute: assertion 'size >= 0' failed in GtkScrollbar
16:10:33 [2020-08-27T20:10:33.198Z] 
16:10:33 [2020-08-27T20:10:33.198Z] (SWT:1606): Gtk-CRITICAL **: 20:10:29.939: gtk_box_gadget_distribute: assertion 'size >= 0' failed in GtkScrollbar
16:10:33 [2020-08-27T20:10:33.198Z] 
16:10:33 [2020-08-27T20:10:33.198Z] (SWT:1606): Gtk-CRITICAL **: 20:10:29.956: gtk_box_gadget_distribute: assertion 'size >= 0' failed in GtkScrollbar
16:10:33 [2020-08-27T20:10:33.198Z] 
16:10:33 [2020-08-27T20:10:33.198Z] (SWT:1606): Gtk-CRITICAL **: 20:10:29.956: gtk_box_gadget_distribute: assertion 'size >= 0' failed in GtkScrollbar
16:10:33 [2020-08-27T20:10:33.198Z] 
16:10:33 [2020-08-27T20:10:33.198Z] (SWT:1606): Gtk-CRITICAL **: 20:10:29.956: gtk_box_gadget_distribute: assertion 'size >= 0' failed in GtkScrollbar
16:10:33 [2020-08-27T20:10:33.198Z] 
16:10:33 [2020-08-27T20:10:33.198Z] (SWT:1606): Gtk-CRITICAL **: 20:10:29.973: gtk_box_gadget_distribute: assertion 'size >= 0' failed in GtkScrollbar
16:10:33 [2020-08-27T20:10:33.198Z] 
16:10:33 [2020-08-27T20:10:33.198Z] (SWT:1606): Gtk-CRITICAL **: 20:10:29.973: gtk_box_gadget_distribute: assertion 'size >= 0' failed in GtkScrollbar
16:10:33 [2020-08-27T20:10:33.198Z] 
16:10:33 [2020-08-27T20:10:33.198Z] (SWT:1606): Gtk-CRITICAL **: 20:10:29.973: gtk_box_gadget_distribute: assertion 'size >= 0' failed in GtkScrollbar
16:10:33 [2020-08-27T20:10:33.198Z] 
16:10:33 [2020-08-27T20:10:33.198Z] (SWT:1606): Gtk-CRITICAL **: 20:10:29.990: gtk_box_gadget_distribute: assertion 'size >= 0' failed in GtkScrollbar
16:10:33 [2020-08-27T20:10:33.198Z] 
16:10:33 [2020-08-27T20:10:33.198Z] (SWT:1606): Gtk-CRITICAL **: 20:10:29.990: gtk_box_gadget_distribute: assertion 'size >= 0' failed in GtkScrollbar
16:10:33 [2020-08-27T20:10:33.198Z] 
16:10:33 [2020-08-27T20:10:33.198Z] (SWT:1606): Gtk-CRITICAL **: 20:10:29.990: gtk_box_gadget_distribute: assertion 'size >= 0' failed in GtkScrollbar
16:10:33 [2020-08-27T20:10:33.198Z] 
16:10:33 [2020-08-27T20:10:33.198Z] (SWT:1606): Gtk-CRITICAL **: 20:10:30.006: gtk_box_gadget_distribute: assertion 'size >= 0' failed in GtkScrollbar
16:10:33 [2020-08-27T20:10:33.198Z] 
16:10:33 [2020-08-27T20:10:33.198Z] (SWT:1606): Gtk-CRITICAL **: 20:10:30.006: gtk_box_gadget_distribute: assertion 'size >= 0' failed in GtkScrollbar
16:10:33 [2020-08-27T20:10:33.198Z] 
16:10:33 [2020-08-27T20:10:33.198Z] (SWT:1606): Gtk-CRITICAL **: 20:10:30.022: gtk_box_gadget_distribute: assertion 'size >= 0' failed in GtkScrollbar
16:11:40 [2020-08-27T20:11:40.878Z] 
16:11:40 [2020-08-27T20:11:40.878Z] (SWT:1606): Gtk-WARNING **: 20:11:30.297: Negative content width -6 (allocation 1, extents 4x3) while allocating gadget (node toolbar, owner GtkToolbar)
16:11:40 [2020-08-27T20:11:40.878Z] 
16:11:40 [2020-08-27T20:11:40.878Z] (SWT:1606): Gtk-CRITICAL **: 20:11:31.118: gtk_box_gadget_distribute: assertion 'size >= 0' failed in GtkScrollbar
16:11:40 [2020-08-27T20:11:40.878Z] 
16:11:40 [2020-08-27T20:11:40.878Z] (SWT:1606): Gtk-CRITICAL **: 20:11:31.124: gtk_box_gadget_distribute: assertion 'size >= 0' failed in GtkScrollbar
16:11:40 [2020-08-27T20:11:40.878Z] 
16:11:40 [2020-08-27T20:11:40.878Z] (SWT:1606): Gtk-WARNING **: 20:11:31.128: Negative content width -6 (allocation 1, extents 4x3) while allocating gadget (node toolbar, owner GtkToolbar)
16:11:40 [2020-08-27T20:11:40.878Z] 
16:11:40 [2020-08-27T20:11:40.878Z] (SWT:1606): Gtk-CRITICAL **: 20:11:31.141: gtk_box_gadget_distribute: assertion 'size >= 0' failed in GtkScrollbar
16:11:40 [2020-08-27T20:11:40.878Z] 
16:11:40 [2020-08-27T20:11:40.878Z] (SWT:1606): Gtk-CRITICAL **: 20:11:31.147: gtk_box_gadget_distribute: assertion 'size >= 0' failed in GtkScrollbar
16:11:40 [2020-08-27T20:11:40.878Z] 
16:11:40 [2020-08-27T20:11:40.878Z] (SWT:1606): Gtk-CRITICAL **: 20:11:31.147: gtk_box_gadget_distribute: assertion 'size >= 0' failed in GtkScrollbar
16:11:40 [2020-08-27T20:11:40.878Z] 
16:11:40 [2020-08-27T20:11:40.878Z] (SWT:1606): Gtk-CRITICAL **: 20:11:31.148: gtk_box_gadget_distribute: assertion 'size >= 0' failed in GtkScrollbar
16:11:40 [2020-08-27T20:11:40.878Z] 
16:11:40 [2020-08-27T20:11:40.878Z] (SWT:1606): Gtk-CRITICAL **: 20:11:31.149: gtk_box_gadget_distribute: assertion 'size >= 0' failed in GtkScrollbar
16:11:40 [2020-08-27T20:11:40.878Z] 
16:11:40 [2020-08-27T20:11:40.878Z] (SWT:1606): Gtk-CRITICAL **: 20:11:31.156: gtk_box_gadget_distribute: assertion 'size >= 0' failed in GtkScrollbar
16:11:40 [2020-08-27T20:11:40.878Z] 
16:11:40 [2020-08-27T20:11:40.878Z] (SWT:1606): Gtk-CRITICAL **: 20:11:31.156: gtk_box_gadget_distribute: assertion 'size >= 0' failed in GtkScrollbar
16:11:40 [2020-08-27T20:11:40.878Z] 
16:11:40 [2020-08-27T20:11:40.878Z] (SWT:1606): Gtk-CRITICAL **: 20:11:31.156: gtk_box_gadget_distribute: assertion 'size >= 0' failed in GtkScrollbar
16:11:40 [2020-08-27T20:11:40.878Z] 
16:11:40 [2020-08-27T20:11:40.878Z] (SWT:1606): Gtk-CRITICAL **: 20:11:31.166: gtk_box_gadget_distribute: assertion 'size >= 0' failed in GtkScrollbar
16:11:40 [2020-08-27T20:11:40.878Z] 
16:11:40 [2020-08-27T20:11:40.878Z] (SWT:1606): Gtk-CRITICAL **: 20:11:31.182: gtk_box_gadget_distribute: assertion 'size >= 0' failed in GtkScrollbar
16:11:40 [2020-08-27T20:11:40.878Z] 
16:11:40 [2020-08-27T20:11:40.878Z] (SWT:1606): Gtk-CRITICAL **: 20:11:31.182: gtk_box_gadget_distribute: assertion 'size >= 0' failed in GtkScrollbar
16:11:40 [2020-08-27T20:11:40.878Z] 
16:11:40 [2020-08-27T20:11:40.878Z] (SWT:1606): Gtk-CRITICAL **: 20:11:31.182: gtk_box_gadget_distribute: assertion 'size >= 0' failed in GtkScrollbar
16:11:40 [2020-08-27T20:11:40.878Z] 
16:11:40 [2020-08-27T20:11:40.878Z] (SWT:1606): Gtk-CRITICAL **: 20:11:31.197: gtk_box_gadget_distribute: assertion 'size >= 0' failed in GtkScrollbar
16:11:40 [2020-08-27T20:11:40.878Z] 
16:11:40 [2020-08-27T20:11:40.878Z] (SWT:1606): Gtk-CRITICAL **: 20:11:31.197: gtk_box_gadget_distribute: assertion 'size >= 0' failed in GtkScrollbar
16:11:40 [2020-08-27T20:11:40.878Z] 
16:11:40 [2020-08-27T20:11:40.878Z] (SWT:1606): Gtk-CRITICAL **: 20:11:31.197: gtk_box_gadget_distribute: assertion 'size >= 0' failed in GtkScrollbar
16:11:40 [2020-08-27T20:11:40.878Z] 
16:11:40 [2020-08-27T20:11:40.878Z] (SWT:1606): Gtk-CRITICAL **: 20:11:31.214: gtk_box_gadget_distribute: assertion 'size >= 0' failed in GtkScrollbar
16:11:40 [2020-08-27T20:11:40.878Z] 
16:11:40 [2020-08-27T20:11:40.878Z] (SWT:1606): Gtk-CRITICAL **: 20:11:31.214: gtk_box_gadget_distribute: assertion 'size >= 0' failed in GtkScrollbar
16:11:40 [2020-08-27T20:11:40.878Z] 
16:11:40 [2020-08-27T20:11:40.878Z] (SWT:1606): Gtk-CRITICAL **: 20:11:31.214: gtk_box_gadget_distribute: assertion 'size >= 0' failed in GtkScrollbar
16:11:40 [2020-08-27T20:11:40.878Z] 
16:11:40 [2020-08-27T20:11:40.878Z] (SWT:1606): Gtk-CRITICAL **: 20:11:31.231: gtk_box_gadget_distribute: assertion 'size >= 0' failed in GtkScrollbar
16:11:40 [2020-08-27T20:11:40.878Z] 
16:11:40 [2020-08-27T20:11:40.878Z] (SWT:1606): Gtk-CRITICAL **: 20:11:31.231: gtk_box_gadget_distribute: assertion 'size >= 0' failed in GtkScrollbar
16:11:40 [2020-08-27T20:11:40.878Z] 
16:11:40 [2020-08-27T20:11:40.878Z] (SWT:1606): Gtk-CRITICAL **: 20:11:31.231: gtk_box_gadget_distribute: assertion 'size >= 0' failed in GtkScrollbar
16:11:40 [2020-08-27T20:11:40.878Z] 
16:11:40 [2020-08-27T20:11:40.878Z] (SWT:1606): Gtk-CRITICAL **: 20:11:31.248: gtk_box_gadget_distribute: assertion 'size >= 0' failed in GtkScrollbar
16:11:40 [2020-08-27T20:11:40.878Z] 
16:11:40 [2020-08-27T20:11:40.878Z] (SWT:1606): Gtk-CRITICAL **: 20:11:31.248: gtk_box_gadget_distribute: assertion 'size >= 0' failed in GtkScrollbar
16:11:40 [2020-08-27T20:11:40.878Z] 
16:11:40 [2020-08-27T20:11:40.878Z] (SWT:1606): Gtk-CRITICAL **: 20:11:31.248: gtk_box_gadget_distribute: assertion 'size >= 0' failed in GtkScrollbar
16:11:40 [2020-08-27T20:11:40.878Z] 
16:11:40 [2020-08-27T20:11:40.878Z] (SWT:1606): Gtk-CRITICAL **: 20:11:31.264: gtk_box_gadget_distribute: assertion 'size >= 0' failed in GtkScrollbar
16:11:40 [2020-08-27T20:11:40.878Z] 
16:11:40 [2020-08-27T20:11:40.878Z] (SWT:1606): Gtk-CRITICAL **: 20:11:31.264: gtk_box_gadget_distribute: assertion 'size >= 0' failed in GtkScrollbar
16:11:40 [2020-08-27T20:11:40.878Z] 
16:11:40 [2020-08-27T20:11:40.878Z] (SWT:1606): Gtk-CRITICAL **: 20:11:31.264: gtk_box_gadget_distribute: assertion 'size >= 0' failed in GtkScrollbar
16:11:40 [2020-08-27T20:11:40.878Z] 
16:11:40 [2020-08-27T20:11:40.878Z] (SWT:1606): Gtk-CRITICAL **: 20:11:31.284: gtk_box_gadget_distribute: assertion 'size >= 0' failed in GtkScrollbar
16:11:40 [2020-08-27T20:11:40.878Z] 
16:11:40 [2020-08-27T20:11:40.878Z] (SWT:1606): Gtk-CRITICAL **: 20:11:31.284: gtk_box_gadget_distribute: assertion 'size >= 0' failed in GtkScrollbar
16:11:40 [2020-08-27T20:11:40.878Z] 
16:11:40 [2020-08-27T20:11:40.878Z] (SWT:1606): Gtk-CRITICAL **: 20:11:31.284: gtk_box_gadget_distribute: assertion 'size >= 0' failed in GtkScrollbar
16:11:40 [2020-08-27T20:11:40.878Z] 
16:11:40 [2020-08-27T20:11:40.878Z] (SWT:1606): Gtk-CRITICAL **: 20:11:31.298: gtk_box_gadget_distribute: assertion 'size >= 0' failed in GtkScrollbar
16:11:40 [2020-08-27T20:11:40.878Z] 
16:11:40 [2020-08-27T20:11:40.878Z] (SWT:1606): Gtk-CRITICAL **: 20:11:31.298: gtk_box_gadget_distribute: assertion 'size >= 0' failed in GtkScrollbar
16:11:40 [2020-08-27T20:11:40.878Z] 
16:11:40 [2020-08-27T20:11:40.878Z] (SWT:1606): Gtk-CRITICAL **: 20:11:31.298: gtk_box_gadget_distribute: assertion 'size >= 0' failed in GtkScrollbar
16:11:40 [2020-08-27T20:11:40.878Z] 
16:11:40 [2020-08-27T20:11:40.878Z] (SWT:1606): Gtk-CRITICAL **: 20:11:31.314: gtk_box_gadget_distribute: assertion 'size >= 0' failed in GtkScrollbar
16:11:40 [2020-08-27T20:11:40.878Z] 
16:11:40 [2020-08-27T20:11:40.878Z] (SWT:1606): Gtk-CRITICAL **: 20:11:31.314: gtk_box_gadget_distribute: assertion 'size >= 0' failed in GtkScrollbar
16:11:40 [2020-08-27T20:11:40.878Z] 
16:11:40 [2020-08-27T20:11:40.878Z] (SWT:1606): Gtk-CRITICAL **: 20:11:31.314: gtk_box_gadget_distribute: assertion 'size >= 0' failed in GtkScrollbar
16:11:40 [2020-08-27T20:11:40.878Z] 
16:11:40 [2020-08-27T20:11:40.878Z] (SWT:1606): Gtk-CRITICAL **: 20:11:31.333: gtk_box_gadget_distribute: assertion 'size >= 0' failed in GtkScrollbar
16:11:40 [2020-08-27T20:11:40.878Z] 
16:11:40 [2020-08-27T20:11:40.878Z] (SWT:1606): Gtk-CRITICAL **: 20:11:31.333: gtk_box_gadget_distribute: assertion 'size >= 0' failed in GtkScrollbar
16:11:40 [2020-08-27T20:11:40.878Z] 
16:11:40 [2020-08-27T20:11:40.878Z] (SWT:1606): Gtk-CRITICAL **: 20:11:31.333: gtk_box_gadget_distribute: assertion 'size >= 0' failed in GtkScrollbar
16:11:40 [2020-08-27T20:11:40.878Z] 
16:11:40 [2020-08-27T20:11:40.878Z] (SWT:1606): Gtk-CRITICAL **: 20:11:31.347: gtk_box_gadget_distribute: assertion 'size >= 0' failed in GtkScrollbar
16:11:40 [2020-08-27T20:11:40.878Z] 
16:11:40 [2020-08-27T20:11:40.878Z] (SWT:1606): Gtk-CRITICAL **: 20:11:31.347: gtk_box_gadget_distribute: assertion 'size >= 0' failed in GtkScrollbar
16:11:40 [2020-08-27T20:11:40.878Z] 
16:11:40 [2020-08-27T20:11:40.878Z] (SWT:1606): Gtk-CRITICAL **: 20:11:31.347: gtk_box_gadget_distribute: assertion 'size >= 0' failed in GtkScrollbar
16:11:40 [2020-08-27T20:11:40.879Z] 
16:11:40 [2020-08-27T20:11:40.879Z] (SWT:1606): Gtk-CRITICAL **: 20:11:31.364: gtk_box_gadget_distribute: assertion 'size >= 0' failed in GtkScrollbar
16:11:40 [2020-08-27T20:11:40.879Z] 
16:11:40 [2020-08-27T20:11:40.879Z] (SWT:1606): Gtk-CRITICAL **: 20:11:31.364: gtk_box_gadget_distribute: assertion 'size >= 0' failed in GtkScrollbar
16:11:40 [2020-08-27T20:11:40.879Z] 
16:11:40 [2020-08-27T20:11:40.879Z] (SWT:1606): Gtk-CRITICAL **: 20:11:31.364: gtk_box_gadget_distribute: assertion 'size >= 0' failed in GtkScrollbar
16:11:40 [2020-08-27T20:11:40.879Z] 
16:11:40 [2020-08-27T20:11:40.879Z] (SWT:1606): Gtk-CRITICAL **: 20:11:31.383: gtk_box_gadget_distribute: assertion 'size >= 0' failed in GtkScrollbar
16:12:37 [2020-08-27T20:12:37.093Z] Tests run: 8, Failures: 0, Errors: 8, Skipped: 0, Time elapsed: 244.76 s <<< FAILURE! - in org.eclipse.egit.ui.test.team.actions.CommitActionStagingViewTest
16:12:37 [2020-08-27T20:12:37.094Z] testCommitWithoutAutoStage(org.eclipse.egit.ui.test.team.actions.CommitActionStagingViewTest)  Time elapsed: 61.122 s  <<< ERROR!
16:12:37 [2020-08-27T20:12:37.094Z] org.eclipse.swtbot.swt.finder.widgets.TimeoutException: Timeout after: 30000 ms.: Timed out waiting for Shell {Create Branch} to close.
16:12:37 [2020-08-27T20:12:37.094Z] 	at org.eclipse.swtbot.swt.finder.SWTBotFactory.waitUntil(SWTBotFactory.java:523)
16:12:37 [2020-08-27T20:12:37.094Z] 	at org.eclipse.swtbot.swt.finder.SWTBot.waitUntil(SWTBot.java:1)
16:12:37 [2020-08-27T20:12:37.094Z] 	at org.eclipse.swtbot.swt.finder.SWTBotFactory.waitUntil(SWTBotFactory.java:497)
16:12:37 [2020-08-27T20:12:37.094Z] 	at org.eclipse.swtbot.swt.finder.SWTBot.waitUntil(SWTBot.java:1)
16:12:37 [2020-08-27T20:12:37.094Z] 	at org.eclipse.swtbot.swt.finder.SWTBotFactory.waitUntil(SWTBotFactory.java:485)
16:12:37 [2020-08-27T20:12:37.094Z] 	at org.eclipse.swtbot.swt.finder.SWTBot.waitUntil(SWTBot.java:1)
16:12:37 [2020-08-27T20:12:37.094Z] 	at org.eclipse.swtbot.swt.finder.widgets.SWTBotShell.close(SWTBotShell.java:117)
16:12:37 [2020-08-27T20:12:37.094Z] 	at org.eclipse.egit.ui.test.Eclipse.closeAllShells(Eclipse.java:45)
16:12:37 [2020-08-27T20:12:37.094Z] 	at org.eclipse.egit.ui.test.Eclipse.reset(Eclipse.java:38)
16:12:37 [2020-08-27T20:12:37.094Z] 	at org.eclipse.egit.ui.common.LocalRepositoryTestCase.resetWorkspace(LocalRepositoryTestCase.java:243)
16:12:37 [2020-08-27T20:12:37.094Z] 	at sun.reflect.GeneratedMethodAccessor84.invoke(Unknown Source)
16:12:37 [2020-08-27T20:12:37.094Z] 	at sun.reflect.DelegatingMethodAccessorImpl.invoke(DelegatingMethodAccessorImpl.java:43)
16:12:37 [2020-08-27T20:12:37.094Z] 	at java.lang.reflect.Method.invoke(Method.java:498)
16:12:37 [2020-08-27T20:12:37.094Z] 	at org.junit.runners.model.FrameworkMethod$1.runReflectiveCall(FrameworkMethod.java:59)
16:12:37 [2020-08-27T20:12:37.094Z] 	at org.junit.internal.runners.model.ReflectiveCallable.run(ReflectiveCallable.java:12)
16:12:37 [2020-08-27T20:12:37.094Z] 	at org.junit.runners.model.FrameworkMethod.invokeExplosively(FrameworkMethod.java:56)
16:12:37 [2020-08-27T20:12:37.094Z] 	at org.junit.internal.runners.statements.RunAfters.invokeMethod(RunAfters.java:46)
16:12:37 [2020-08-27T20:12:37.094Z] 	at org.junit.internal.runners.statements.RunAfters.evaluate(RunAfters.java:33)
16:12:37 [2020-08-27T20:12:37.094Z] 	at org.junit.rules.TestWatcher$1.evaluate(TestWatcher.java:61)
16:12:37 [2020-08-27T20:12:37.094Z] 	at org.junit.runners.ParentRunner$3.evaluate(ParentRunner.java:306)
16:12:37 [2020-08-27T20:12:37.094Z] 	at org.junit.runners.ParentRunner.runLeaf(ParentRunner.java:366)
16:12:37 [2020-08-27T20:12:37.094Z] 	at org.eclipse.swtbot.swt.finder.junit.SWTBotJunit4ClassRunner.runChild(SWTBotJunit4ClassRunner.java:77)
16:12:37 [2020-08-27T20:12:37.094Z] 	at org.junit.runners.BlockJUnit4ClassRunner.runChild(BlockJUnit4ClassRunner.java:63)
16:12:37 [2020-08-27T20:12:37.094Z] 	at org.junit.runners.ParentRunner$4.run(ParentRunner.java:331)
16:12:37 [2020-08-27T20:12:37.094Z] 	at org.junit.runners.ParentRunner$1.schedule(ParentRunner.java:79)
16:12:37 [2020-08-27T20:12:37.094Z] 	at org.junit.runners.ParentRunner.runChildren(ParentRunner.java:329)
16:12:37 [2020-08-27T20:12:37.094Z] 	at org.junit.runners.ParentRunner.access$100(ParentRunner.java:66)
16:12:37 [2020-08-27T20:12:37.094Z] 	at org.junit.runners.ParentRunner$2.evaluate(ParentRunner.java:293)
16:12:37 [2020-08-27T20:12:37.094Z] 	at org.junit.internal.runners.statements.RunBefores.evaluate(RunBefores.java:26)
16:12:37 [2020-08-27T20:12:37.094Z] 	at org.junit.internal.runners.statements.RunAfters.evaluate(RunAfters.java:27)
16:12:37 [2020-08-27T20:12:37.094Z] 	at org.junit.runners.ParentRunner$3.evaluate(ParentRunner.java:306)
16:12:37 [2020-08-27T20:12:37.094Z] 	at org.junit.runners.ParentRunner.run(ParentRunner.java:413)
16:12:37 [2020-08-27T20:12:37.094Z] 	at org.eclipse.swtbot.swt.finder.junit.SWTBotJunit4ClassRunner.run(SWTBotJunit4ClassRunner.java:62)
16:12:37 [2020-08-27T20:12:37.094Z] 	at org.apache.maven.surefire.junit4.JUnit4Provider.execute(JUnit4Provider.java:365)
16:12:37 [2020-08-27T20:12:37.094Z] 	at org.apache.maven.surefire.junit4.JUnit4Provider.executeWithRerun(JUnit4Provider.java:273)
16:12:37 [2020-08-27T20:12:37.094Z] 	at org.apache.maven.surefire.junit4.JUnit4Provider.executeTestSet(JUnit4Provider.java:238)
16:12:37 [2020-08-27T20:12:37.094Z] 	at org.apache.maven.surefire.junit4.JUnit4Provider.invoke(JUnit4Provider.java:159)
16:12:37 [2020-08-27T20:12:37.094Z] 	at sun.reflect.NativeMethodAccessorImpl.invoke0(Native Method)
16:12:37 [2020-08-27T20:12:37.094Z] 	at sun.reflect.NativeMethodAccessorImpl.invoke(NativeMethodAccessorImpl.java:62)
16:12:37 [2020-08-27T20:12:37.094Z] 	at sun.reflect.DelegatingMethodAccessorImpl.invoke(DelegatingMethodAccessorImpl.java:43)
16:12:37 [2020-08-27T20:12:37.094Z] 	at java.lang.reflect.Method.invoke(Method.java:498)
16:12:37 [2020-08-27T20:12:37.094Z] 	at org.apache.maven.surefire.util.ReflectionUtils.invokeMethodWithArray2(ReflectionUtils.java:206)
16:12:37 [2020-08-27T20:12:37.094Z] 	at org.apache.maven.surefire.booter.ProviderFactory$ProviderProxy.invoke(ProviderFactory.java:161)
16:12:37 [2020-08-27T20:12:37.094Z] 	at org.apache.maven.surefire.booter.ProviderFactory.invokeProvider(ProviderFactory.java:84)
16:12:37 [2020-08-27T20:12:37.094Z] 	at org.eclipse.tycho.surefire.osgibooter.OsgiSurefireBooter.run(OsgiSurefireBooter.java:113)
16:12:37 [2020-08-27T20:12:37.094Z] 	at org.eclipse.tycho.surefire.osgibooter.AbstractUITestApplication.runTests(AbstractUITestApplication.java:44)
16:12:37 [2020-08-27T20:12:37.094Z] 	at org.eclipse.e4.ui.internal.workbench.swt.E4Testable$1.run(E4Testable.java:73)
16:12:37 [2020-08-27T20:12:37.094Z] 	at java.lang.Thread.run(Thread.java:748)
16:12:37 [2020-08-27T20:12:37.094Z] 
16:12:37 [2020-08-27T20:12:37.094Z] testCommitWithoutAutoStage(org.eclipse.egit.ui.test.team.actions.CommitActionStagingViewTest)  Time elapsed: 61.122 s  <<< ERROR!
16:12:37 [2020-08-27T20:12:37.094Z] org.eclipse.swtbot.swt.finder.widgets.TimeoutException: Timeout after: 30000 ms.: Timed out waiting for Shell {Create Branch} to close.
16:12:37 [2020-08-27T20:12:37.094Z] 	at org.eclipse.swtbot.swt.finder.SWTBotFactory.waitUntil(SWTBotFactory.java:523)
16:12:37 [2020-08-27T20:12:37.094Z] 	at org.eclipse.swtbot.swt.finder.SWTBot.waitUntil(SWTBot.java:1)
16:12:37 [2020-08-27T20:12:37.094Z] 	at org.eclipse.swtbot.swt.finder.SWTBotFactory.waitUntil(SWTBotFactory.java:497)
16:12:37 [2020-08-27T20:12:37.094Z] 	at org.eclipse.swtbot.swt.finder.SWTBot.waitUntil(SWTBot.java:1)
16:12:37 [2020-08-27T20:12:37.094Z] 	at org.eclipse.swtbot.swt.finder.SWTBotFactory.waitUntil(SWTBotFactory.java:485)
16:12:37 [2020-08-27T20:12:37.094Z] 	at org.eclipse.swtbot.swt.finder.SWTBot.waitUntil(SWTBot.java:1)
16:12:37 [2020-08-27T20:12:37.094Z] 	at org.eclipse.swtbot.swt.finder.widgets.SWTBotShell.close(SWTBotShell.java:117)
16:12:37 [2020-08-27T20:12:37.094Z] 	at org.eclipse.egit.ui.test.Eclipse.closeAllShells(Eclipse.java:45)
16:12:37 [2020-08-27T20:12:37.094Z] 	at org.eclipse.egit.ui.test.Eclipse.reset(Eclipse.java:38)
16:12:37 [2020-08-27T20:12:37.094Z] 	at org.eclipse.egit.ui.common.EGitTestCase.resetWorkbench(EGitTestCase.java:63)
16:12:37 [2020-08-27T20:12:37.094Z] 	at sun.reflect.GeneratedMethodAccessor85.invoke(Unknown Source)
16:12:37 [2020-08-27T20:12:37.094Z] 	at sun.reflect.DelegatingMethodAccessorImpl.invoke(DelegatingMethodAccessorImpl.java:43)
16:12:37 [2020-08-27T20:12:37.094Z] 	at java.lang.reflect.Method.invoke(Method.java:498)
16:12:37 [2020-08-27T20:12:37.094Z] 	at org.junit.runners.model.FrameworkMethod$1.runReflectiveCall(FrameworkMethod.java:59)
16:12:37 [2020-08-27T20:12:37.094Z] 	at org.junit.internal.runners.model.ReflectiveCallable.run(ReflectiveCallable.java:12)
16:12:37 [2020-08-27T20:12:37.094Z] 	at org.junit.runners.model.FrameworkMethod.invokeExplosively(FrameworkMethod.java:56)
16:12:37 [2020-08-27T20:12:37.094Z] 	at org.junit.internal.runners.statements.RunAfters.invokeMethod(RunAfters.java:46)
16:12:37 [2020-08-27T20:12:37.094Z] 	at org.junit.internal.runners.statements.RunAfters.evaluate(RunAfters.java:33)
16:12:37 [2020-08-27T20:12:37.094Z] 	at org.junit.rules.TestWatcher$1.evaluate(TestWatcher.java:61)
16:12:37 [2020-08-27T20:12:37.094Z] 	at org.junit.runners.ParentRunner$3.evaluate(ParentRunner.java:306)
16:12:37 [2020-08-27T20:12:37.094Z] 	at org.junit.runners.ParentRunner.runLeaf(ParentRunner.java:366)
16:12:37 [2020-08-27T20:12:37.094Z] 	at org.eclipse.swtbot.swt.finder.junit.SWTBotJunit4ClassRunner.runChild(SWTBotJunit4ClassRunner.java:77)
16:12:37 [2020-08-27T20:12:37.094Z] 	at org.junit.runners.BlockJUnit4ClassRunner.runChild(BlockJUnit4ClassRunner.java:63)
16:12:37 [2020-08-27T20:12:37.094Z] 	at org.junit.runners.ParentRunner$4.run(ParentRunner.java:331)
16:12:37 [2020-08-27T20:12:37.094Z] 	at org.junit.runners.ParentRunner$1.schedule(ParentRunner.java:79)
16:12:37 [2020-08-27T20:12:37.094Z] 	at org.junit.runners.ParentRunner.runChildren(ParentRunner.java:329)
16:12:37 [2020-08-27T20:12:37.094Z] 	at org.junit.runners.ParentRunner.access$100(ParentRunner.java:66)
16:12:37 [2020-08-27T20:12:37.094Z] 	at org.junit.runners.ParentRunner$2.evaluate(ParentRunner.java:293)
16:12:37 [2020-08-27T20:12:37.094Z] 	at org.junit.internal.runners.statements.RunBefores.evaluate(RunBefores.java:26)
16:12:37 [2020-08-27T20:12:37.094Z] 	at org.junit.internal.runners.statements.RunAfters.evaluate(RunAfters.java:27)
16:12:37 [2020-08-27T20:12:37.094Z] 	at org.junit.runners.ParentRunner$3.evaluate(ParentRunner.java:306)
16:12:37 [2020-08-27T20:12:37.094Z] 	at org.junit.runners.ParentRunner.run(ParentRunner.java:413)
16:12:37 [2020-08-27T20:12:37.094Z] 	at org.eclipse.swtbot.swt.finder.junit.SWTBotJunit4ClassRunner.run(SWTBotJunit4ClassRunner.java:62)
16:12:37 [2020-08-27T20:12:37.094Z] 	at org.apache.maven.surefire.junit4.JUnit4Provider.execute(JUnit4Provider.java:365)
16:12:37 [2020-08-27T20:12:37.094Z] 	at org.apache.maven.surefire.junit4.JUnit4Provider.executeWithRerun(JUnit4Provider.java:273)
16:12:37 [2020-08-27T20:12:37.094Z] 	at org.apache.maven.surefire.junit4.JUnit4Provider.executeTestSet(JUnit4Provider.java:238)
16:12:37 [2020-08-27T20:12:37.094Z] 	at org.apache.maven.surefire.junit4.JUnit4Provider.invoke(JUnit4Provider.java:159)
16:12:37 [2020-08-27T20:12:37.094Z] 	at sun.reflect.NativeMethodAccessorImpl.invoke0(Native Method)
16:12:37 [2020-08-27T20:12:37.094Z] 	at sun.reflect.NativeMethodAccessorImpl.invoke(NativeMethodAccessorImpl.java:62)
16:12:37 [2020-08-27T20:12:37.094Z] 	at sun.reflect.DelegatingMethodAccessorImpl.invoke(DelegatingMethodAccessorImpl.java:43)
16:12:37 [2020-08-27T20:12:37.094Z] 	at java.lang.reflect.Method.invoke(Method.java:498)
16:12:37 [2020-08-27T20:12:37.094Z] 	at org.apache.maven.surefire.util.ReflectionUtils.invokeMethodWithArray2(ReflectionUtils.java:206)
16:12:37 [2020-08-27T20:12:37.094Z] 	at org.apache.maven.surefire.booter.ProviderFactory$ProviderProxy.invoke(ProviderFactory.java:161)
16:12:37 [2020-08-27T20:12:37.094Z] 	at org.apache.maven.surefire.booter.ProviderFactory.invokeProvider(ProviderFactory.java:84)
16:12:37 [2020-08-27T20:12:37.094Z] 	at org.eclipse.tycho.surefire.osgibooter.OsgiSurefireBooter.run(OsgiSurefireBooter.java:113)
16:12:37 [2020-08-27T20:12:37.094Z] 	at org.eclipse.tycho.surefire.osgibooter.AbstractUITestApplication.runTests(AbstractUITestApplication.java:44)
16:12:37 [2020-08-27T20:12:37.094Z] 	at org.eclipse.e4.ui.internal.workbench.swt.E4Testable$1.run(E4Testable.java:73)
16:12:37 [2020-08-27T20:12:37.094Z] 	at java.lang.Thread.run(Thread.java:748)
16:12:37 [2020-08-27T20:12:37.094Z] 
16:12:37 [2020-08-27T20:12:37.094Z] testOpenStagingViewNoLinkWithSelection(org.eclipse.egit.ui.test.team.actions.CommitActionStagingViewTest)  Time elapsed: 60.933 s  <<< ERROR!
16:12:37 [2020-08-27T20:12:37.094Z] org.eclipse.swtbot.swt.finder.widgets.TimeoutException: Timeout after: 30000 ms.: Timed out waiting for Shell {Create Branch} to close.
16:12:37 [2020-08-27T20:12:37.094Z] 	at org.eclipse.swtbot.swt.finder.SWTBotFactory.waitUntil(SWTBotFactory.java:523)
16:12:37 [2020-08-27T20:12:37.094Z] 	at org.eclipse.swtbot.swt.finder.SWTBot.waitUntil(SWTBot.java:1)
16:12:37 [2020-08-27T20:12:37.094Z] 	at org.eclipse.swtbot.swt.finder.SWTBotFactory.waitUntil(SWTBotFactory.java:497)
16:12:37 [2020-08-27T20:12:37.094Z] 	at org.eclipse.swtbot.swt.finder.SWTBot.waitUntil(SWTBot.java:1)
16:12:37 [2020-08-27T20:12:37.094Z] 	at org.eclipse.swtbot.swt.finder.SWTBotFactory.waitUntil(SWTBotFactory.java:485)
16:12:37 [2020-08-27T20:12:37.094Z] 	at org.eclipse.swtbot.swt.finder.SWTBot.waitUntil(SWTBot.java:1)
16:12:37 [2020-08-27T20:12:37.094Z] 	at org.eclipse.swtbot.swt.finder.widgets.SWTBotShell.close(SWTBotShell.java:117)
16:12:37 [2020-08-27T20:12:37.094Z] 	at org.eclipse.egit.ui.test.Eclipse.closeAllShells(Eclipse.java:45)
16:12:37 [2020-08-27T20:12:37.094Z] 	at org.eclipse.egit.ui.test.Eclipse.reset(Eclipse.java:38)
16:12:37 [2020-08-27T20:12:37.094Z] 	at org.eclipse.egit.ui.common.LocalRepositoryTestCase.resetWorkspace(LocalRepositoryTestCase.java:243)
16:12:37 [2020-08-27T20:12:37.094Z] 	at sun.reflect.GeneratedMethodAccessor84.invoke(Unknown Source)
16:12:37 [2020-08-27T20:12:37.094Z] 	at sun.reflect.DelegatingMethodAccessorImpl.invoke(DelegatingMethodAccessorImpl.java:43)
16:12:37 [2020-08-27T20:12:37.094Z] 	at java.lang.reflect.Method.invoke(Method.java:498)
16:12:37 [2020-08-27T20:12:37.094Z] 	at org.junit.runners.model.FrameworkMethod$1.runReflectiveCall(FrameworkMethod.java:59)
16:12:37 [2020-08-27T20:12:37.094Z] 	at org.junit.internal.runners.model.ReflectiveCallable.run(ReflectiveCallable.java:12)
16:12:37 [2020-08-27T20:12:37.095Z] 	at org.junit.runners.model.FrameworkMethod.invokeExplosively(FrameworkMethod.java:56)
16:12:37 [2020-08-27T20:12:37.095Z] 	at org.junit.internal.runners.statements.RunAfters.invokeMethod(RunAfters.java:46)
16:12:37 [2020-08-27T20:12:37.095Z] 	at org.junit.internal.runners.statements.RunAfters.evaluate(RunAfters.java:33)
16:12:37 [2020-08-27T20:12:37.095Z] 	at org.junit.rules.TestWatcher$1.evaluate(TestWatcher.java:61)
16:12:37 [2020-08-27T20:12:37.095Z] 	at org.junit.runners.ParentRunner$3.evaluate(ParentRunner.java:306)
16:12:37 [2020-08-27T20:12:37.095Z] 	at org.junit.runners.ParentRunner.runLeaf(ParentRunner.java:366)
16:12:37 [2020-08-27T20:12:37.095Z] 	at org.eclipse.swtbot.swt.finder.junit.SWTBotJunit4ClassRunner.runChild(SWTBotJunit4ClassRunner.java:77)
16:12:37 [2020-08-27T20:12:37.095Z] 	at org.junit.runners.BlockJUnit4ClassRunner.runChild(BlockJUnit4ClassRunner.java:63)
16:12:37 [2020-08-27T20:12:37.095Z] 	at org.junit.runners.ParentRunner$4.run(ParentRunner.java:331)
16:12:37 [2020-08-27T20:12:37.095Z] 	at org.junit.runners.ParentRunner$1.schedule(ParentRunner.java:79)
16:12:37 [2020-08-27T20:12:37.095Z] 	at org.junit.runners.ParentRunner.runChildren(ParentRunner.java:329)
16:12:37 [2020-08-27T20:12:37.095Z] 	at org.junit.runners.ParentRunner.access$100(ParentRunner.java:66)
16:12:37 [2020-08-27T20:12:37.095Z] 	at org.junit.runners.ParentRunner$2.evaluate(ParentRunner.java:293)
16:12:37 [2020-08-27T20:12:37.095Z] 	at org.junit.internal.runners.statements.RunBefores.evaluate(RunBefores.java:26)
16:12:37 [2020-08-27T20:12:37.095Z] 	at org.junit.internal.runners.statements.RunAfters.evaluate(RunAfters.java:27)
16:12:37 [2020-08-27T20:12:37.095Z] 	at org.junit.runners.ParentRunner$3.evaluate(ParentRunner.java:306)
16:12:37 [2020-08-27T20:12:37.095Z] 	at org.junit.runners.ParentRunner.run(ParentRunner.java:413)
16:12:37 [2020-08-27T20:12:37.095Z] 	at org.eclipse.swtbot.swt.finder.junit.SWTBotJunit4ClassRunner.run(SWTBotJunit4ClassRunner.java:62)
16:12:37 [2020-08-27T20:12:37.095Z] 	at org.apache.maven.surefire.junit4.JUnit4Provider.execute(JUnit4Provider.java:365)
16:12:37 [2020-08-27T20:12:37.095Z] 	at org.apache.maven.surefire.junit4.JUnit4Provider.executeWithRerun(JUnit4Provider.java:273)
16:12:37 [2020-08-27T20:12:37.095Z] 	at org.apache.maven.surefire.junit4.JUnit4Provider.executeTestSet(JUnit4Provider.java:238)
16:12:37 [2020-08-27T20:12:37.095Z] 	at org.apache.maven.surefire.junit4.JUnit4Provider.invoke(JUnit4Provider.java:159)
16:12:37 [2020-08-27T20:12:37.095Z] 	at sun.reflect.NativeMethodAccessorImpl.invoke0(Native Method)
16:12:37 [2020-08-27T20:12:37.095Z] 	at sun.reflect.NativeMethodAccessorImpl.invoke(NativeMethodAccessorImpl.java:62)
16:12:37 [2020-08-27T20:12:37.095Z] 	at sun.reflect.DelegatingMethodAccessorImpl.invoke(DelegatingMethodAccessorImpl.java:43)
16:12:37 [2020-08-27T20:12:37.095Z] 	at java.lang.reflect.Method.invoke(Method.java:498)
16:12:37 [2020-08-27T20:12:37.095Z] 	at org.apache.maven.surefire.util.ReflectionUtils.invokeMethodWithArray2(ReflectionUtils.java:206)
16:12:37 [2020-08-27T20:12:37.095Z] 	at org.apache.maven.surefire.booter.ProviderFactory$ProviderProxy.invoke(ProviderFactory.java:161)
16:12:37 [2020-08-27T20:12:37.095Z] 	at org.apache.maven.surefire.booter.ProviderFactory.invokeProvider(ProviderFactory.java:84)
16:12:37 [2020-08-27T20:12:37.095Z] 	at org.eclipse.tycho.surefire.osgibooter.OsgiSurefireBooter.run(OsgiSurefireBooter.java:113)
16:12:37 [2020-08-27T20:12:37.095Z] 	at org.eclipse.tycho.surefire.osgibooter.AbstractUITestApplication.runTests(AbstractUITestApplication.java:44)
16:12:37 [2020-08-27T20:12:37.095Z] 	at org.eclipse.e4.ui.internal.workbench.swt.E4Testable$1.run(E4Testable.java:73)
16:12:37 [2020-08-27T20:12:37.095Z] 	at java.lang.Thread.run(Thread.java:748)
16:12:37 [2020-08-27T20:12:37.095Z] 
16:12:37 [2020-08-27T20:12:37.095Z] testOpenStagingViewNoLinkWithSelection(org.eclipse.egit.ui.test.team.actions.CommitActionStagingViewTest)  Time elapsed: 60.933 s  <<< ERROR!
16:12:37 [2020-08-27T20:12:37.095Z] org.eclipse.swtbot.swt.finder.widgets.TimeoutException: Timeout after: 30000 ms.: Timed out waiting for Shell {Create Branch} to close.
16:12:37 [2020-08-27T20:12:37.095Z] 	at org.eclipse.swtbot.swt.finder.SWTBotFactory.waitUntil(SWTBotFactory.java:523)
16:12:37 [2020-08-27T20:12:37.095Z] 	at org.eclipse.swtbot.swt.finder.SWTBot.waitUntil(SWTBot.java:1)
16:12:37 [2020-08-27T20:12:37.095Z] 	at org.eclipse.swtbot.swt.finder.SWTBotFactory.waitUntil(SWTBotFactory.java:497)
16:12:37 [2020-08-27T20:12:37.095Z] 	at org.eclipse.swtbot.swt.finder.SWTBot.waitUntil(SWTBot.java:1)
16:12:37 [2020-08-27T20:12:37.095Z] 	at org.eclipse.swtbot.swt.finder.SWTBotFactory.waitUntil(SWTBotFactory.java:485)
16:12:37 [2020-08-27T20:12:37.095Z] 	at org.eclipse.swtbot.swt.finder.SWTBot.waitUntil(SWTBot.java:1)
16:12:37 [2020-08-27T20:12:37.095Z] 	at org.eclipse.swtbot.swt.finder.widgets.SWTBotShell.close(SWTBotShell.java:117)
16:12:37 [2020-08-27T20:12:37.095Z] 	at org.eclipse.egit.ui.test.Eclipse.closeAllShells(Eclipse.java:45)
16:12:37 [2020-08-27T20:12:37.095Z] 	at org.eclipse.egit.ui.test.Eclipse.reset(Eclipse.java:38)
16:12:37 [2020-08-27T20:12:37.095Z] 	at org.eclipse.egit.ui.common.EGitTestCase.resetWorkbench(EGitTestCase.java:63)
16:12:37 [2020-08-27T20:12:37.095Z] 	at sun.reflect.GeneratedMethodAccessor85.invoke(Unknown Source)
16:12:37 [2020-08-27T20:12:37.095Z] 	at sun.reflect.DelegatingMethodAccessorImpl.invoke(DelegatingMethodAccessorImpl.java:43)
16:12:37 [2020-08-27T20:12:37.095Z] 	at java.lang.reflect.Method.invoke(Method.java:498)
16:12:37 [2020-08-27T20:12:37.095Z] 	at org.junit.runners.model.FrameworkMethod$1.runReflectiveCall(FrameworkMethod.java:59)
16:12:37 [2020-08-27T20:12:37.095Z] 	at org.junit.internal.runners.model.ReflectiveCallable.run(ReflectiveCallable.java:12)
16:12:37 [2020-08-27T20:12:37.095Z] 	at org.junit.runners.model.FrameworkMethod.invokeExplosively(FrameworkMethod.java:56)
16:12:37 [2020-08-27T20:12:37.095Z] 	at org.junit.internal.runners.statements.RunAfters.invokeMethod(RunAfters.java:46)
16:12:37 [2020-08-27T20:12:37.095Z] 	at org.junit.internal.runners.statements.RunAfters.evaluate(RunAfters.java:33)
16:12:37 [2020-08-27T20:12:37.095Z] 	at org.junit.rules.TestWatcher$1.evaluate(TestWatcher.java:61)
16:12:37 [2020-08-27T20:12:37.095Z] 	at org.junit.runners.ParentRunner$3.evaluate(ParentRunner.java:306)
16:12:37 [2020-08-27T20:12:37.095Z] 	at org.junit.runners.ParentRunner.runLeaf(ParentRunner.java:366)
16:12:37 [2020-08-27T20:12:37.095Z] 	at org.eclipse.swtbot.swt.finder.junit.SWTBotJunit4ClassRunner.runChild(SWTBotJunit4ClassRunner.java:77)
16:12:37 [2020-08-27T20:12:37.095Z] 	at org.junit.runners.BlockJUnit4ClassRunner.runChild(BlockJUnit4ClassRunner.java:63)
16:12:37 [2020-08-27T20:12:37.095Z] 	at org.junit.runners.ParentRunner$4.run(ParentRunner.java:331)
16:12:37 [2020-08-27T20:12:37.095Z] 	at org.junit.runners.ParentRunner$1.schedule(ParentRunner.java:79)
16:12:37 [2020-08-27T20:12:37.095Z] 	at org.junit.runners.ParentRunner.runChildren(ParentRunner.java:329)
16:12:37 [2020-08-27T20:12:37.095Z] 	at org.junit.runners.ParentRunner.access$100(ParentRunner.java:66)
16:12:37 [2020-08-27T20:12:37.095Z] 	at org.junit.runners.ParentRunner$2.evaluate(ParentRunner.java:293)
16:12:37 [2020-08-27T20:12:37.095Z] 	at org.junit.internal.runners.statements.RunBefores.evaluate(RunBefores.java:26)
16:12:37 [2020-08-27T20:12:37.095Z] 	at org.junit.internal.runners.statements.RunAfters.evaluate(RunAfters.java:27)
16:12:37 [2020-08-27T20:12:37.095Z] 	at org.junit.runners.ParentRunner$3.evaluate(ParentRunner.java:306)
16:12:37 [2020-08-27T20:12:37.095Z] 	at org.junit.runners.ParentRunner.run(ParentRunner.java:413)
16:12:37 [2020-08-27T20:12:37.095Z] 	at org.eclipse.swtbot.swt.finder.junit.SWTBotJunit4ClassRunner.run(SWTBotJunit4ClassRunner.java:62)
16:12:37 [2020-08-27T20:12:37.095Z] 	at org.apache.maven.surefire.junit4.JUnit4Provider.execute(JUnit4Provider.java:365)
16:12:37 [2020-08-27T20:12:37.095Z] 	at org.apache.maven.surefire.junit4.JUnit4Provider.executeWithRerun(JUnit4Provider.java:273)
16:12:37 [2020-08-27T20:12:37.095Z] 	at org.apache.maven.surefire.junit4.JUnit4Provider.executeTestSet(JUnit4Provider.java:238)
16:12:37 [2020-08-27T20:12:37.095Z] 	at org.apache.maven.surefire.junit4.JUnit4Provider.invoke(JUnit4Provider.java:159)
16:12:37 [2020-08-27T20:12:37.095Z] 	at sun.reflect.NativeMethodAccessorImpl.invoke0(Native Method)
16:12:37 [2020-08-27T20:12:37.095Z] 	at sun.reflect.NativeMethodAccessorImpl.invoke(NativeMethodAccessorImpl.java:62)
16:12:37 [2020-08-27T20:12:37.095Z] 	at sun.reflect.DelegatingMethodAccessorImpl.invoke(DelegatingMethodAccessorImpl.java:43)
16:12:37 [2020-08-27T20:12:37.095Z] 	at java.lang.reflect.Method.invoke(Method.java:498)
16:12:37 [2020-08-27T20:12:37.095Z] 	at org.apache.maven.surefire.util.ReflectionUtils.invokeMethodWithArray2(ReflectionUtils.java:206)
16:12:37 [2020-08-27T20:12:37.095Z] 	at org.apache.maven.surefire.booter.ProviderFactory$ProviderProxy.invoke(ProviderFactory.java:161)
16:12:37 [2020-08-27T20:12:37.095Z] 	at org.apache.maven.surefire.booter.ProviderFactory.invokeProvider(ProviderFactory.java:84)
16:12:37 [2020-08-27T20:12:37.095Z] 	at org.eclipse.tycho.surefire.osgibooter.OsgiSurefireBooter.run(OsgiSurefireBooter.java:113)
16:12:37 [2020-08-27T20:12:37.095Z] 	at org.eclipse.tycho.surefire.osgibooter.AbstractUITestApplication.runTests(AbstractUITestApplication.java:44)
16:12:37 [2020-08-27T20:12:37.095Z] 	at org.eclipse.e4.ui.internal.workbench.swt.E4Testable$1.run(E4Testable.java:73)
16:12:37 [2020-08-27T20:12:37.095Z] 	at java.lang.Thread.run(Thread.java:748)
16:12:37 [2020-08-27T20:12:37.095Z] 
16:12:37 [2020-08-27T20:12:37.095Z] testCommitWithAutoStageWithUntracked(org.eclipse.egit.ui.test.team.actions.CommitActionStagingViewTest)  Time elapsed: 61.372 s  <<< ERROR!
16:12:37 [2020-08-27T20:12:37.095Z] org.eclipse.swtbot.swt.finder.widgets.TimeoutException: Timeout after: 30000 ms.: Timed out waiting for Shell {Create Branch} to close.
16:12:37 [2020-08-27T20:12:37.095Z] 	at org.eclipse.swtbot.swt.finder.SWTBotFactory.waitUntil(SWTBotFactory.java:523)
16:12:37 [2020-08-27T20:12:37.095Z] 	at org.eclipse.swtbot.swt.finder.SWTBot.waitUntil(SWTBot.java:1)
16:12:37 [2020-08-27T20:12:37.095Z] 	at org.eclipse.swtbot.swt.finder.SWTBotFactory.waitUntil(SWTBotFactory.java:497)
16:12:37 [2020-08-27T20:12:37.095Z] 	at org.eclipse.swtbot.swt.finder.SWTBot.waitUntil(SWTBot.java:1)
16:12:37 [2020-08-27T20:12:37.095Z] 	at org.eclipse.swtbot.swt.finder.SWTBotFactory.waitUntil(SWTBotFactory.java:485)
16:12:37 [2020-08-27T20:12:37.095Z] 	at org.eclipse.swtbot.swt.finder.SWTBot.waitUntil(SWTBot.java:1)
16:12:37 [2020-08-27T20:12:37.095Z] 	at org.eclipse.swtbot.swt.finder.widgets.SWTBotShell.close(SWTBotShell.java:117)
16:12:37 [2020-08-27T20:12:37.095Z] 	at org.eclipse.egit.ui.test.Eclipse.closeAllShells(Eclipse.java:45)
16:12:37 [2020-08-27T20:12:37.095Z] 	at org.eclipse.egit.ui.test.Eclipse.reset(Eclipse.java:38)
16:12:37 [2020-08-27T20:12:37.095Z] 	at org.eclipse.egit.ui.common.LocalRepositoryTestCase.resetWorkspace(LocalRepositoryTestCase.java:243)
16:12:37 [2020-08-27T20:12:37.095Z] 	at sun.reflect.GeneratedMethodAccessor84.invoke(Unknown Source)
16:12:37 [2020-08-27T20:12:37.095Z] 	at sun.reflect.DelegatingMethodAccessorImpl.invoke(DelegatingMethodAccessorImpl.java:43)
16:12:37 [2020-08-27T20:12:37.095Z] 	at java.lang.reflect.Method.invoke(Method.java:498)
16:12:37 [2020-08-27T20:12:37.095Z] 	at org.junit.runners.model.FrameworkMethod$1.runReflectiveCall(FrameworkMethod.java:59)
16:12:37 [2020-08-27T20:12:37.095Z] 	at org.junit.internal.runners.model.ReflectiveCallable.run(ReflectiveCallable.java:12)
16:12:37 [2020-08-27T20:12:37.095Z] 	at org.junit.runners.model.FrameworkMethod.invokeExplosively(FrameworkMethod.java:56)
16:12:37 [2020-08-27T20:12:37.095Z] 	at org.junit.internal.runners.statements.RunAfters.invokeMethod(RunAfters.java:46)
16:12:37 [2020-08-27T20:12:37.095Z] 	at org.junit.internal.runners.statements.RunAfters.evaluate(RunAfters.java:33)
16:12:37 [2020-08-27T20:12:37.095Z] 	at org.junit.rules.TestWatcher$1.evaluate(TestWatcher.java:61)
16:12:37 [2020-08-27T20:12:37.095Z] 	at org.junit.runners.ParentRunner$3.evaluate(ParentRunner.java:306)
16:12:37 [2020-08-27T20:12:37.095Z] 	at org.junit.runners.ParentRunner.runLeaf(ParentRunner.java:366)
16:12:37 [2020-08-27T20:12:37.095Z] 	at org.eclipse.swtbot.swt.finder.junit.SWTBotJunit4ClassRunner.runChild(SWTBotJunit4ClassRunner.java:77)
16:12:37 [2020-08-27T20:12:37.095Z] 	at org.junit.runners.BlockJUnit4ClassRunner.runChild(BlockJUnit4ClassRunner.java:63)
16:12:37 [2020-08-27T20:12:37.095Z] 	at org.junit.runners.ParentRunner$4.run(ParentRunner.java:331)
16:12:37 [2020-08-27T20:12:37.095Z] 	at org.junit.runners.ParentRunner$1.schedule(ParentRunner.java:79)
16:12:37 [2020-08-27T20:12:37.095Z] 	at org.junit.runners.ParentRunner.runChildren(ParentRunner.java:329)
16:12:37 [2020-08-27T20:12:37.095Z] 	at org.junit.runners.ParentRunner.access$100(ParentRunner.java:66)
16:12:37 [2020-08-27T20:12:37.095Z] 	at org.junit.runners.ParentRunner$2.evaluate(ParentRunner.java:293)
16:12:37 [2020-08-27T20:12:37.095Z] 	at org.junit.internal.runners.statements.RunBefores.evaluate(RunBefores.java:26)
16:12:37 [2020-08-27T20:12:37.095Z] 	at org.junit.internal.runners.statements.RunAfters.evaluate(RunAfters.java:27)
16:12:37 [2020-08-27T20:12:37.095Z] 	at org.junit.runners.ParentRunner$3.evaluate(ParentRunner.java:306)
16:12:37 [2020-08-27T20:12:37.095Z] 	at org.junit.runners.ParentRunner.run(ParentRunner.java:413)
16:12:37 [2020-08-27T20:12:37.095Z] 	at org.eclipse.swtbot.swt.finder.junit.SWTBotJunit4ClassRunner.run(SWTBotJunit4ClassRunner.java:62)
16:12:37 [2020-08-27T20:12:37.095Z] 	at org.apache.maven.surefire.junit4.JUnit4Provider.execute(JUnit4Provider.java:365)
16:12:37 [2020-08-27T20:12:37.095Z] 	at org.apache.maven.surefire.junit4.JUnit4Provider.executeWithRerun(JUnit4Provider.java:273)
16:12:37 [2020-08-27T20:12:37.096Z] 	at org.apache.maven.surefire.junit4.JUnit4Provider.executeTestSet(JUnit4Provider.java:238)
16:12:37 [2020-08-27T20:12:37.096Z] 	at org.apache.maven.surefire.junit4.JUnit4Provider.invoke(JUnit4Provider.java:159)
16:12:37 [2020-08-27T20:12:37.096Z] 	at sun.reflect.NativeMethodAccessorImpl.invoke0(Native Method)
16:12:37 [2020-08-27T20:12:37.096Z] 	at sun.reflect.NativeMethodAccessorImpl.invoke(NativeMethodAccessorImpl.java:62)
16:12:37 [2020-08-27T20:12:37.096Z] 	at sun.reflect.DelegatingMethodAccessorImpl.invoke(DelegatingMethodAccessorImpl.java:43)
16:12:37 [2020-08-27T20:12:37.096Z] 	at java.lang.reflect.Method.invoke(Method.java:498)
16:12:37 [2020-08-27T20:12:37.096Z] 	at org.apache.maven.surefire.util.ReflectionUtils.invokeMethodWithArray2(ReflectionUtils.java:206)
16:12:37 [2020-08-27T20:12:37.096Z] 	at org.apache.maven.surefire.booter.ProviderFactory$ProviderProxy.invoke(ProviderFactory.java:161)
16:12:37 [2020-08-27T20:12:37.096Z] 	at org.apache.maven.surefire.booter.ProviderFactory.invokeProvider(ProviderFactory.java:84)
16:12:37 [2020-08-27T20:12:37.096Z] 	at org.eclipse.tycho.surefire.osgibooter.OsgiSurefireBooter.run(OsgiSurefireBooter.java:113)
16:12:37 [2020-08-27T20:12:37.096Z] 	at org.eclipse.tycho.surefire.osgibooter.AbstractUITestApplication.runTests(AbstractUITestApplication.java:44)
16:12:37 [2020-08-27T20:12:37.096Z] 	at org.eclipse.e4.ui.internal.workbench.swt.E4Testable$1.run(E4Testable.java:73)
16:12:37 [2020-08-27T20:12:37.096Z] 	at java.lang.Thread.run(Thread.java:748)
16:12:37 [2020-08-27T20:12:37.096Z] 
16:12:37 [2020-08-27T20:12:37.096Z] testCommitWithAutoStageWithUntracked(org.eclipse.egit.ui.test.team.actions.CommitActionStagingViewTest)  Time elapsed: 61.372 s  <<< ERROR!
16:12:37 [2020-08-27T20:12:37.096Z] org.eclipse.swtbot.swt.finder.widgets.TimeoutException: Timeout after: 30000 ms.: Timed out waiting for Shell {Create Branch} to close.
16:12:37 [2020-08-27T20:12:37.096Z] 	at org.eclipse.swtbot.swt.finder.SWTBotFactory.waitUntil(SWTBotFactory.java:523)
16:12:37 [2020-08-27T20:12:37.096Z] 	at org.eclipse.swtbot.swt.finder.SWTBot.waitUntil(SWTBot.java:1)
16:12:37 [2020-08-27T20:12:37.096Z] 	at org.eclipse.swtbot.swt.finder.SWTBotFactory.waitUntil(SWTBotFactory.java:497)
16:12:37 [2020-08-27T20:12:37.096Z] 	at org.eclipse.swtbot.swt.finder.SWTBot.waitUntil(SWTBot.java:1)
16:12:37 [2020-08-27T20:12:37.096Z] 	at org.eclipse.swtbot.swt.finder.SWTBotFactory.waitUntil(SWTBotFactory.java:485)
16:12:37 [2020-08-27T20:12:37.096Z] 	at org.eclipse.swtbot.swt.finder.SWTBot.waitUntil(SWTBot.java:1)
16:12:37 [2020-08-27T20:12:37.096Z] 	at org.eclipse.swtbot.swt.finder.widgets.SWTBotShell.close(SWTBotShell.java:117)
16:12:37 [2020-08-27T20:12:37.096Z] 	at org.eclipse.egit.ui.test.Eclipse.closeAllShells(Eclipse.java:45)
16:12:37 [2020-08-27T20:12:37.096Z] 	at org.eclipse.egit.ui.test.Eclipse.reset(Eclipse.java:38)
16:12:37 [2020-08-27T20:12:37.096Z] 	at org.eclipse.egit.ui.common.EGitTestCase.resetWorkbench(EGitTestCase.java:63)
16:12:37 [2020-08-27T20:12:37.096Z] 	at sun.reflect.GeneratedMethodAccessor85.invoke(Unknown Source)
16:12:37 [2020-08-27T20:12:37.096Z] 	at sun.reflect.DelegatingMethodAccessorImpl.invoke(DelegatingMethodAccessorImpl.java:43)
16:12:37 [2020-08-27T20:12:37.096Z] 	at java.lang.reflect.Method.invoke(Method.java:498)
16:12:37 [2020-08-27T20:12:37.096Z] 	at org.junit.runners.model.FrameworkMethod$1.runReflectiveCall(FrameworkMethod.java:59)
16:12:37 [2020-08-27T20:12:37.096Z] 	at org.junit.internal.runners.model.ReflectiveCallable.run(ReflectiveCallable.java:12)
16:12:37 [2020-08-27T20:12:37.096Z] 	at org.junit.runners.model.FrameworkMethod.invokeExplosively(FrameworkMethod.java:56)
16:12:37 [2020-08-27T20:12:37.096Z] 	at org.junit.internal.runners.statements.RunAfters.invokeMethod(RunAfters.java:46)
16:12:37 [2020-08-27T20:12:37.096Z] 	at org.junit.internal.runners.statements.RunAfters.evaluate(RunAfters.java:33)
16:12:37 [2020-08-27T20:12:37.096Z] 	at org.junit.rules.TestWatcher$1.evaluate(TestWatcher.java:61)
16:12:37 [2020-08-27T20:12:37.096Z] 	at org.junit.runners.ParentRunner$3.evaluate(ParentRunner.java:306)
16:12:37 [2020-08-27T20:12:37.096Z] 	at org.junit.runners.ParentRunner.runLeaf(ParentRunner.java:366)
16:12:37 [2020-08-27T20:12:37.096Z] 	at org.eclipse.swtbot.swt.finder.junit.SWTBotJunit4ClassRunner.runChild(SWTBotJunit4ClassRunner.java:77)
16:12:37 [2020-08-27T20:12:37.096Z] 	at org.junit.runners.BlockJUnit4ClassRunner.runChild(BlockJUnit4ClassRunner.java:63)
16:12:37 [2020-08-27T20:12:37.096Z] 	at org.junit.runners.ParentRunner$4.run(ParentRunner.java:331)
16:12:37 [2020-08-27T20:12:37.096Z] 	at org.junit.runners.ParentRunner$1.schedule(ParentRunner.java:79)
16:12:37 [2020-08-27T20:12:37.096Z] 	at org.junit.runners.ParentRunner.runChildren(ParentRunner.java:329)
16:12:37 [2020-08-27T20:12:37.096Z] 	at org.junit.runners.ParentRunner.access$100(ParentRunner.java:66)
16:12:37 [2020-08-27T20:12:37.096Z] 	at org.junit.runners.ParentRunner$2.evaluate(ParentRunner.java:293)
16:12:37 [2020-08-27T20:12:37.096Z] 	at org.junit.internal.runners.statements.RunBefores.evaluate(RunBefores.java:26)
16:12:37 [2020-08-27T20:12:37.096Z] 	at org.junit.internal.runners.statements.RunAfters.evaluate(RunAfters.java:27)
16:12:37 [2020-08-27T20:12:37.096Z] 	at org.junit.runners.ParentRunner$3.evaluate(ParentRunner.java:306)
16:12:37 [2020-08-27T20:12:37.096Z] 	at org.junit.runners.ParentRunner.run(ParentRunner.java:413)
16:12:37 [2020-08-27T20:12:37.096Z] 	at org.eclipse.swtbot.swt.finder.junit.SWTBotJunit4ClassRunner.run(SWTBotJunit4ClassRunner.java:62)
16:12:37 [2020-08-27T20:12:37.096Z] 	at org.apache.maven.surefire.junit4.JUnit4Provider.execute(JUnit4Provider.java:365)
16:12:37 [2020-08-27T20:12:37.096Z] 	at org.apache.maven.surefire.junit4.JUnit4Provider.executeWithRerun(JUnit4Provider.java:273)
16:12:37 [2020-08-27T20:12:37.096Z] 	at org.apache.maven.surefire.junit4.JUnit4Provider.executeTestSet(JUnit4Provider.java:238)
16:12:37 [2020-08-27T20:12:37.096Z] 	at org.apache.maven.surefire.junit4.JUnit4Provider.invoke(JUnit4Provider.java:159)
16:12:37 [2020-08-27T20:12:37.096Z] 	at sun.reflect.NativeMethodAccessorImpl.invoke0(Native Method)
16:12:37 [2020-08-27T20:12:37.096Z] 	at sun.reflect.NativeMethodAccessorImpl.invoke(NativeMethodAccessorImpl.java:62)
16:12:37 [2020-08-27T20:12:37.096Z] 	at sun.reflect.DelegatingMethodAccessorImpl.invoke(DelegatingMethodAccessorImpl.java:43)
16:12:37 [2020-08-27T20:12:37.096Z] 	at java.lang.reflect.Method.invoke(Method.java:498)
16:12:37 [2020-08-27T20:12:37.096Z] 	at org.apache.maven.surefire.util.ReflectionUtils.invokeMethodWithArray2(ReflectionUtils.java:206)
16:12:37 [2020-08-27T20:12:37.096Z] 	at org.apache.maven.surefire.booter.ProviderFactory$ProviderProxy.invoke(ProviderFactory.java:161)
16:12:37 [2020-08-27T20:12:37.096Z] 	at org.apache.maven.surefire.booter.ProviderFactory.invokeProvider(ProviderFactory.java:84)
16:12:37 [2020-08-27T20:12:37.096Z] 	at org.eclipse.tycho.surefire.osgibooter.OsgiSurefireBooter.run(OsgiSurefireBooter.java:113)
16:12:37 [2020-08-27T20:12:37.096Z] 	at org.eclipse.tycho.surefire.osgibooter.AbstractUITestApplication.runTests(AbstractUITestApplication.java:44)
16:12:37 [2020-08-27T20:12:37.096Z] 	at org.eclipse.e4.ui.internal.workbench.swt.E4Testable$1.run(E4Testable.java:73)
16:12:37 [2020-08-27T20:12:37.096Z] 	at java.lang.Thread.run(Thread.java:748)
16:12:37 [2020-08-27T20:12:37.096Z] 
16:12:37 [2020-08-27T20:12:37.096Z] testCommitWithAutoStageNoUntracked(org.eclipse.egit.ui.test.team.actions.CommitActionStagingViewTest)  Time elapsed: 61.324 s  <<< ERROR!
16:12:37 [2020-08-27T20:12:37.096Z] org.eclipse.swtbot.swt.finder.widgets.TimeoutException: Timeout after: 30000 ms.: Timed out waiting for Shell {Create Branch} to close.
16:12:37 [2020-08-27T20:12:37.096Z] 	at org.eclipse.swtbot.swt.finder.SWTBotFactory.waitUntil(SWTBotFactory.java:523)
16:12:37 [2020-08-27T20:12:37.096Z] 	at org.eclipse.swtbot.swt.finder.SWTBot.waitUntil(SWTBot.java:1)
16:12:37 [2020-08-27T20:12:37.096Z] 	at org.eclipse.swtbot.swt.finder.SWTBotFactory.waitUntil(SWTBotFactory.java:497)
16:12:37 [2020-08-27T20:12:37.096Z] 	at org.eclipse.swtbot.swt.finder.SWTBot.waitUntil(SWTBot.java:1)
16:12:37 [2020-08-27T20:12:37.096Z] 	at org.eclipse.swtbot.swt.finder.SWTBotFactory.waitUntil(SWTBotFactory.java:485)
16:12:37 [2020-08-27T20:12:37.096Z] 	at org.eclipse.swtbot.swt.finder.SWTBot.waitUntil(SWTBot.java:1)
16:12:37 [2020-08-27T20:12:37.096Z] 	at org.eclipse.swtbot.swt.finder.widgets.SWTBotShell.close(SWTBotShell.java:117)
16:12:37 [2020-08-27T20:12:37.096Z] 	at org.eclipse.egit.ui.test.Eclipse.closeAllShells(Eclipse.java:45)
16:12:37 [2020-08-27T20:12:37.096Z] 	at org.eclipse.egit.ui.test.Eclipse.reset(Eclipse.java:38)
16:12:37 [2020-08-27T20:12:37.096Z] 	at org.eclipse.egit.ui.common.LocalRepositoryTestCase.resetWorkspace(LocalRepositoryTestCase.java:243)
16:12:37 [2020-08-27T20:12:37.096Z] 	at sun.reflect.GeneratedMethodAccessor84.invoke(Unknown Source)
16:12:37 [2020-08-27T20:12:37.096Z] 	at sun.reflect.DelegatingMethodAccessorImpl.invoke(DelegatingMethodAccessorImpl.java:43)
16:12:37 [2020-08-27T20:12:37.096Z] 	at java.lang.reflect.Method.invoke(Method.java:498)
16:12:37 [2020-08-27T20:12:37.096Z] 	at org.junit.runners.model.FrameworkMethod$1.runReflectiveCall(FrameworkMethod.java:59)
16:12:37 [2020-08-27T20:12:37.096Z] 	at org.junit.internal.runners.model.ReflectiveCallable.run(ReflectiveCallable.java:12)
16:12:37 [2020-08-27T20:12:37.096Z] 	at org.junit.runners.model.FrameworkMethod.invokeExplosively(FrameworkMethod.java:56)
16:12:37 [2020-08-27T20:12:37.096Z] 	at org.junit.internal.runners.statements.RunAfters.invokeMethod(RunAfters.java:46)
16:12:37 [2020-08-27T20:12:37.096Z] 	at org.junit.internal.runners.statements.RunAfters.evaluate(RunAfters.java:33)
16:12:37 [2020-08-27T20:12:37.096Z] 	at org.junit.rules.TestWatcher$1.evaluate(TestWatcher.java:61)
16:12:37 [2020-08-27T20:12:37.096Z] 	at org.junit.runners.ParentRunner$3.evaluate(ParentRunner.java:306)
16:12:37 [2020-08-27T20:12:37.096Z] 	at org.junit.runners.ParentRunner.runLeaf(ParentRunner.java:366)
16:12:37 [2020-08-27T20:12:37.096Z] 	at org.eclipse.swtbot.swt.finder.junit.SWTBotJunit4ClassRunner.runChild(SWTBotJunit4ClassRunner.java:77)
16:12:37 [2020-08-27T20:12:37.096Z] 	at org.junit.runners.BlockJUnit4ClassRunner.runChild(BlockJUnit4ClassRunner.java:63)
16:12:37 [2020-08-27T20:12:37.096Z] 	at org.junit.runners.ParentRunner$4.run(ParentRunner.java:331)
16:12:37 [2020-08-27T20:12:37.096Z] 	at org.junit.runners.ParentRunner$1.schedule(ParentRunner.java:79)
16:12:37 [2020-08-27T20:12:37.096Z] 	at org.junit.runners.ParentRunner.runChildren(ParentRunner.java:329)
16:12:37 [2020-08-27T20:12:37.096Z] 	at org.junit.runners.ParentRunner.access$100(ParentRunner.java:66)
16:12:37 [2020-08-27T20:12:37.096Z] 	at org.junit.runners.ParentRunner$2.evaluate(ParentRunner.java:293)
16:12:37 [2020-08-27T20:12:37.096Z] 	at org.junit.internal.runners.statements.RunBefores.evaluate(RunBefores.java:26)
16:12:37 [2020-08-27T20:12:37.096Z] 	at org.junit.internal.runners.statements.RunAfters.evaluate(RunAfters.java:27)
16:12:37 [2020-08-27T20:12:37.096Z] 	at org.junit.runners.ParentRunner$3.evaluate(ParentRunner.java:306)
16:12:37 [2020-08-27T20:12:37.096Z] 	at org.junit.runners.ParentRunner.run(ParentRunner.java:413)
16:12:37 [2020-08-27T20:12:37.096Z] 	at org.eclipse.swtbot.swt.finder.junit.SWTBotJunit4ClassRunner.run(SWTBotJunit4ClassRunner.java:62)
16:12:37 [2020-08-27T20:12:37.096Z] 	at org.apache.maven.surefire.junit4.JUnit4Provider.execute(JUnit4Provider.java:365)
16:12:37 [2020-08-27T20:12:37.096Z] 	at org.apache.maven.surefire.junit4.JUnit4Provider.executeWithRerun(JUnit4Provider.java:273)
16:12:37 [2020-08-27T20:12:37.096Z] 	at org.apache.maven.surefire.junit4.JUnit4Provider.executeTestSet(JUnit4Provider.java:238)
16:12:37 [2020-08-27T20:12:37.096Z] 	at org.apache.maven.surefire.junit4.JUnit4Provider.invoke(JUnit4Provider.java:159)
16:12:37 [2020-08-27T20:12:37.096Z] 	at sun.reflect.NativeMethodAccessorImpl.invoke0(Native Method)
16:12:37 [2020-08-27T20:12:37.096Z] 	at sun.reflect.NativeMethodAccessorImpl.invoke(NativeMethodAccessorImpl.java:62)
16:12:37 [2020-08-27T20:12:37.096Z] 	at sun.reflect.DelegatingMethodAccessorImpl.invoke(DelegatingMethodAccessorImpl.java:43)
16:12:37 [2020-08-27T20:12:37.096Z] 	at java.lang.reflect.Method.invoke(Method.java:498)
16:12:37 [2020-08-27T20:12:37.096Z] 	at org.apache.maven.surefire.util.ReflectionUtils.invokeMethodWithArray2(ReflectionUtils.java:206)
16:12:37 [2020-08-27T20:12:37.096Z] 	at org.apache.maven.surefire.booter.ProviderFactory$ProviderProxy.invoke(ProviderFactory.java:161)
16:12:37 [2020-08-27T20:12:37.096Z] 	at org.apache.maven.surefire.booter.ProviderFactory.invokeProvider(ProviderFactory.java:84)
16:12:37 [2020-08-27T20:12:37.096Z] 	at org.eclipse.tycho.surefire.osgibooter.OsgiSurefireBooter.run(OsgiSurefireBooter.java:113)
16:12:37 [2020-08-27T20:12:37.096Z] 	at org.eclipse.tycho.surefire.osgibooter.AbstractUITestApplication.runTests(AbstractUITestApplication.java:44)
16:12:37 [2020-08-27T20:12:37.096Z] 	at org.eclipse.e4.ui.internal.workbench.swt.E4Testable$1.run(E4Testable.java:73)
16:12:37 [2020-08-27T20:12:37.096Z] 	at java.lang.Thread.run(Thread.java:748)
16:12:37 [2020-08-27T20:12:37.096Z] 
16:12:37 [2020-08-27T20:12:37.096Z] testCommitWithAutoStageNoUntracked(org.eclipse.egit.ui.test.team.actions.CommitActionStagingViewTest)  Time elapsed: 61.324 s  <<< ERROR!
16:12:37 [2020-08-27T20:12:37.096Z] org.eclipse.swtbot.swt.finder.widgets.TimeoutException: Timeout after: 30000 ms.: Timed out waiting for Shell {Create Branch} to close.
16:12:37 [2020-08-27T20:12:37.096Z] 	at org.eclipse.swtbot.swt.finder.SWTBotFactory.waitUntil(SWTBotFactory.java:523)
16:12:37 [2020-08-27T20:12:37.096Z] 	at org.eclipse.swtbot.swt.finder.SWTBot.waitUntil(SWTBot.java:1)
16:12:37 [2020-08-27T20:12:37.096Z] 	at org.eclipse.swtbot.swt.finder.SWTBotFactory.waitUntil(SWTBotFactory.java:497)
16:12:37 [2020-08-27T20:12:37.096Z] 	at org.eclipse.swtbot.swt.finder.SWTBot.waitUntil(SWTBot.java:1)
16:12:37 [2020-08-27T20:12:37.097Z] 	at org.eclipse.swtbot.swt.finder.SWTBotFactory.waitUntil(SWTBotFactory.java:485)
16:12:37 [2020-08-27T20:12:37.097Z] 	at org.eclipse.swtbot.swt.finder.SWTBot.waitUntil(SWTBot.java:1)
16:12:37 [2020-08-27T20:12:37.097Z] 	at org.eclipse.swtbot.swt.finder.widgets.SWTBotShell.close(SWTBotShell.java:117)
16:12:37 [2020-08-27T20:12:37.097Z] 	at org.eclipse.egit.ui.test.Eclipse.closeAllShells(Eclipse.java:45)
16:12:37 [2020-08-27T20:12:37.097Z] 	at org.eclipse.egit.ui.test.Eclipse.reset(Eclipse.java:38)
16:12:37 [2020-08-27T20:12:37.097Z] 	at org.eclipse.egit.ui.common.EGitTestCase.resetWorkbench(EGitTestCase.java:63)
16:12:37 [2020-08-27T20:12:37.097Z] 	at sun.reflect.GeneratedMethodAccessor85.invoke(Unknown Source)
16:12:37 [2020-08-27T20:12:37.097Z] 	at sun.reflect.DelegatingMethodAccessorImpl.invoke(DelegatingMethodAccessorImpl.java:43)
16:12:37 [2020-08-27T20:12:37.097Z] 	at java.lang.reflect.Method.invoke(Method.java:498)
16:12:37 [2020-08-27T20:12:37.097Z] 	at org.junit.runners.model.FrameworkMethod$1.runReflectiveCall(FrameworkMethod.java:59)
16:12:37 [2020-08-27T20:12:37.097Z] 	at org.junit.internal.runners.model.ReflectiveCallable.run(ReflectiveCallable.java:12)
16:12:37 [2020-08-27T20:12:37.097Z] 	at org.junit.runners.model.FrameworkMethod.invokeExplosively(FrameworkMethod.java:56)
16:12:37 [2020-08-27T20:12:37.097Z] 	at org.junit.internal.runners.statements.RunAfters.invokeMethod(RunAfters.java:46)
16:12:37 [2020-08-27T20:12:37.097Z] 	at org.junit.internal.runners.statements.RunAfters.evaluate(RunAfters.java:33)
16:12:37 [2020-08-27T20:12:37.097Z] 	at org.junit.rules.TestWatcher$1.evaluate(TestWatcher.java:61)
16:12:37 [2020-08-27T20:12:37.097Z] 	at org.junit.runners.ParentRunner$3.evaluate(ParentRunner.java:306)
16:12:37 [2020-08-27T20:12:37.097Z] 	at org.junit.runners.ParentRunner.runLeaf(ParentRunner.java:366)
16:12:37 [2020-08-27T20:12:37.097Z] 	at org.eclipse.swtbot.swt.finder.junit.SWTBotJunit4ClassRunner.runChild(SWTBotJunit4ClassRunner.java:77)
16:12:37 [2020-08-27T20:12:37.097Z] 	at org.junit.runners.BlockJUnit4ClassRunner.runChild(BlockJUnit4ClassRunner.java:63)
16:12:37 [2020-08-27T20:12:37.097Z] 	at org.junit.runners.ParentRunner$4.run(ParentRunner.java:331)
16:12:37 [2020-08-27T20:12:37.097Z] 	at org.junit.runners.ParentRunner$1.schedule(ParentRunner.java:79)
16:12:37 [2020-08-27T20:12:37.097Z] 	at org.junit.runners.ParentRunner.runChildren(ParentRunner.java:329)
16:12:37 [2020-08-27T20:12:37.097Z] 	at org.junit.runners.ParentRunner.access$100(ParentRunner.java:66)
16:12:37 [2020-08-27T20:12:37.097Z] 	at org.junit.runners.ParentRunner$2.evaluate(ParentRunner.java:293)
16:12:37 [2020-08-27T20:12:37.097Z] 	at org.junit.internal.runners.statements.RunBefores.evaluate(RunBefores.java:26)
16:12:37 [2020-08-27T20:12:37.097Z] 	at org.junit.internal.runners.statements.RunAfters.evaluate(RunAfters.java:27)
16:12:37 [2020-08-27T20:12:37.097Z] 	at org.junit.runners.ParentRunner$3.evaluate(ParentRunner.java:306)
16:12:37 [2020-08-27T20:12:37.097Z] 	at org.junit.runners.ParentRunner.run(ParentRunner.java:413)
16:12:37 [2020-08-27T20:12:37.097Z] 	at org.eclipse.swtbot.swt.finder.junit.SWTBotJunit4ClassRunner.run(SWTBotJunit4ClassRunner.java:62)
16:12:37 [2020-08-27T20:12:37.097Z] 	at org.apache.maven.surefire.junit4.JUnit4Provider.execute(JUnit4Provider.java:365)
16:12:37 [2020-08-27T20:12:37.097Z] 	at org.apache.maven.surefire.junit4.JUnit4Provider.executeWithRerun(JUnit4Provider.java:273)
16:12:37 [2020-08-27T20:12:37.097Z] 	at org.apache.maven.surefire.junit4.JUnit4Provider.executeTestSet(JUnit4Provider.java:238)
16:12:37 [2020-08-27T20:12:37.097Z] 	at org.apache.maven.surefire.junit4.JUnit4Provider.invoke(JUnit4Provider.java:159)
16:12:37 [2020-08-27T20:12:37.097Z] 	at sun.reflect.NativeMethodAccessorImpl.invoke0(Native Method)
16:12:37 [2020-08-27T20:12:37.097Z] 	at sun.reflect.NativeMethodAccessorImpl.invoke(NativeMethodAccessorImpl.java:62)
16:12:37 [2020-08-27T20:12:37.097Z] 	at sun.reflect.DelegatingMethodAccessorImpl.invoke(DelegatingMethodAccessorImpl.java:43)
16:12:37 [2020-08-27T20:12:37.097Z] 	at java.lang.reflect.Method.invoke(Method.java:498)
16:12:37 [2020-08-27T20:12:37.097Z] 	at org.apache.maven.surefire.util.ReflectionUtils.invokeMethodWithArray2(ReflectionUtils.java:206)
16:12:37 [2020-08-27T20:12:37.097Z] 	at org.apache.maven.surefire.booter.ProviderFactory$ProviderProxy.invoke(ProviderFactory.java:161)
16:12:37 [2020-08-27T20:12:37.097Z] 	at org.apache.maven.surefire.booter.ProviderFactory.invokeProvider(ProviderFactory.java:84)
16:12:37 [2020-08-27T20:12:37.097Z] 	at org.eclipse.tycho.surefire.osgibooter.OsgiSurefireBooter.run(OsgiSurefireBooter.java:113)
16:12:37 [2020-08-27T20:12:37.097Z] 	at org.eclipse.tycho.surefire.osgibooter.AbstractUITestApplication.runTests(AbstractUITestApplication.java:44)
16:12:37 [2020-08-27T20:12:37.097Z] 	at org.eclipse.e4.ui.internal.workbench.swt.E4Testable$1.run(E4Testable.java:73)
16:12:37 [2020-08-27T20:12:37.097Z] 	at java.lang.Thread.run(Thread.java:748)
16:12:37 [2020-08-27T20:12:37.097Z] 
16:12:37 [2020-08-27T20:12:37.097Z] Running org.eclipse.egit.ui.test.team.actions.TagActionTest
16:12:37 [2020-08-27T20:12:37.097Z] 
16:12:37 [2020-08-27T20:12:37.097Z] (SWT:1606): Gtk-WARNING **: 20:12:31.618: Negative content width -6 (allocation 1, extents 4x3) while allocating gadget (node toolbar, owner GtkToolbar)
16:14:06 [2020-08-27T20:14:06.369Z] Cancelling nested steps due to timeout
16:14:06 [2020-08-27T20:14:06.373Z] Sending interrupt signal to process
16:14:13 [2020-08-27T20:14:13.530Z] [INFO] ------------------------------------------------------------------------
16:14:13 [2020-08-27T20:14:13.530Z] [INFO] Reactor Summary for EGit Parent 5.9.0-SNAPSHOT:
16:14:13 [2020-08-27T20:14:13.530Z] [INFO] 
16:14:13 [2020-08-27T20:14:13.530Z] [INFO] EGit Parent ........................................ SUCCESS [ 40.984 s]
16:14:13 [2020-08-27T20:14:13.530Z] [INFO] EGit Target Platform Definition .................... SUCCESS [  1.772 s]
16:14:13 [2020-08-27T20:14:13.530Z] [INFO] Eclipse EGit ....................................... SUCCESS [  5.397 s]
16:14:13 [2020-08-27T20:14:13.530Z] [INFO] Git Team Provider (Core) ........................... SUCCESS [ 17.068 s]
16:14:13 [2020-08-27T20:14:13.530Z] [INFO] Git Team Provider (UI) ............................. SUCCESS [ 43.865 s]
16:14:13 [2020-08-27T20:14:13.530Z] [INFO] EGit Mylyn UI ...................................... SUCCESS [  6.941 s]
16:14:13 [2020-08-27T20:14:13.530Z] [INFO] Git Team Provider (Documentation) .................. SUCCESS [  5.071 s]
16:14:13 [2020-08-27T20:14:13.530Z] [INFO] Eclipse EGit Feature ............................... SUCCESS [  1.174 s]
16:14:13 [2020-08-27T20:14:13.530Z] [INFO] EGit Mylyn Feature ................................. SUCCESS [  1.151 s]
16:14:13 [2020-08-27T20:14:13.530Z] [INFO] Git Flow ........................................... SUCCESS [  6.586 s]
16:14:13 [2020-08-27T20:14:13.530Z] [INFO] Git Flow UI ........................................ SUCCESS [  8.620 s]
16:14:13 [2020-08-27T20:14:13.530Z] [INFO] Eclipse EGit Gitflow Feature ....................... SUCCESS [  1.130 s]
16:14:13 [2020-08-27T20:14:13.530Z] [INFO] EGit JUnit Support ................................. SUCCESS [  6.431 s]
16:14:13 [2020-08-27T20:14:13.530Z] [INFO] GitFlow Test Plug-in ............................... SUCCESS [ 25.854 s]
16:14:13 [2020-08-27T20:14:13.530Z] [INFO] Eclipse EGit Source Feature ........................ SUCCESS [  1.099 s]
16:14:13 [2020-08-27T20:14:13.530Z] [INFO] EGit P2 Repository ................................. SUCCESS [ 17.050 s]
16:14:13 [2020-08-27T20:14:13.530Z] [INFO] EGit Core Test Plug-in ............................. SUCCESS [02:00 min]
16:14:13 [2020-08-27T20:14:13.530Z] [INFO] EGit UI Test Plug-in ............................... FAILURE [  01:11 h]
16:14:13 [2020-08-27T20:14:13.530Z] [INFO] EGit Mylyn UI Test Plug-in ......................... SKIPPED
16:14:13 [2020-08-27T20:14:13.530Z] [INFO] ------------------------------------------------------------------------
16:14:13 [2020-08-27T20:14:13.530Z] [INFO] BUILD FAILURE
16:14:13 [2020-08-27T20:14:13.530Z] [INFO] ------------------------------------------------------------------------
16:14:13 [2020-08-27T20:14:13.530Z] [INFO] Total time:  01:19 h
16:14:13 [2020-08-27T20:14:13.530Z] [INFO] Finished at: 2020-08-27T20:14:07Z
16:14:13 [2020-08-27T20:14:13.530Z] [INFO] ------------------------------------------------------------------------
16:14:13 [2020-08-27T20:14:13.530Z] [ERROR] Failed to execute goal org.eclipse.tycho:tycho-surefire-plugin:1.7.0:test (default-test) on project org.eclipse.egit.ui.test: An unexpected error occurred while launching the test runtime (process returned error code 143(SIGTERM received?)). The process logfile /home/jenkins/agent/workspace/egit.gerrit/repo/org.eclipse.egit.ui.test/target/work/data/.metadata/.log might contain further details. Command-line used to launch the sub-process was null -Dosgi.noShutdown=false -Dosgi.os=linux -Dosgi.ws=gtk -Dosgi.arch=x86_64 -Declipse.consoleLog=true -Degit.test.tmpdir=/home/jenkins/agent/workspace/egit.gerrit/tmp/egit.tmp/ -Dorg.eclipse.swtbot.search.timeout=30000 -Dorg.eclipse.swtbot.screenshots.dir=target/screenshots -Xmx1024m -Dosgi.clean=true -jar /home/jenkins/agent/workspace/egit.gerrit/.repository/p2/osgi/bundle/org.eclipse.equinox.launcher/1.3.201.v20161025-1711/org.eclipse.equinox.launcher-1.3.201.v20161025-1711.jar -data /home/jenkins/agent/workspace/egit.gerrit/repo/org.eclipse.egit.ui.test/target/work/data -install /home/jenkins/agent/workspace/egit.gerrit/repo/org.eclipse.egit.ui.test/target/work -configuration /home/jenkins/agent/workspace/egit.gerrit/repo/org.eclipse.egit.ui.test/target/work/configuration -application org.eclipse.tycho.surefire.osgibooter.uitest -testproperties /home/jenkins/agent/workspace/egit.gerrit/repo/org.eclipse.egit.ui.test/target/surefire.properties -testApplication org.eclipse.ui.ide.workbench -nouithread in working directory /home/jenkins/agent/workspace/egit.gerrit/repo/org.eclipse.egit.ui.test -> [Help 1]
16:14:13 [2020-08-27T20:14:13.530Z] org.apache.maven.lifecycle.LifecycleExecutionException: Failed to execute goal org.eclipse.tycho:tycho-surefire-plugin:1.7.0:test (default-test) on project org.eclipse.egit.ui.test: An unexpected error occurred while launching the test runtime (process returned error code 143(SIGTERM received?)). The process logfile /home/jenkins/agent/workspace/egit.gerrit/repo/org.eclipse.egit.ui.test/target/work/data/.metadata/.log might contain further details. Command-line used to launch the sub-process was null -Dosgi.noShutdown=false -Dosgi.os=linux -Dosgi.ws=gtk -Dosgi.arch=x86_64 -Declipse.consoleLog=true -Degit.test.tmpdir=/home/jenkins/agent/workspace/egit.gerrit/tmp/egit.tmp/ -Dorg.eclipse.swtbot.search.timeout=30000 -Dorg.eclipse.swtbot.screenshots.dir=target/screenshots -Xmx1024m -Dosgi.clean=true -jar /home/jenkins/agent/workspace/egit.gerrit/.repository/p2/osgi/bundle/org.eclipse.equinox.launcher/1.3.201.v20161025-1711/org.eclipse.equinox.launcher-1.3.201.v20161025-1711.jar -data /home/jenkins/agent/workspace/egit.gerrit/repo/org.eclipse.egit.ui.test/target/work/data -install /home/jenkins/agent/workspace/egit.gerrit/repo/org.eclipse.egit.ui.test/target/work -configuration /home/jenkins/agent/workspace/egit.gerrit/repo/org.eclipse.egit.ui.test/target/work/configuration -application org.eclipse.tycho.surefire.osgibooter.uitest -testproperties /home/jenkins/agent/workspace/egit.gerrit/repo/org.eclipse.egit.ui.test/target/surefire.properties -testApplication org.eclipse.ui.ide.workbench -nouithread in working directory /home/jenkins/agent/workspace/egit.gerrit/repo/org.eclipse.egit.ui.test
16:14:13 [2020-08-27T20:14:13.530Z]     at org.apache.maven.lifecycle.internal.MojoExecutor.execute (MojoExecutor.java:215)
16:14:13 [2020-08-27T20:14:13.530Z]     at org.apache.maven.lifecycle.internal.MojoExecutor.execute (MojoExecutor.java:156)
16:14:13 [2020-08-27T20:14:13.530Z]     at org.apache.maven.lifecycle.internal.MojoExecutor.execute (MojoExecutor.java:148)
16:14:13 [2020-08-27T20:14:13.530Z]     at org.apache.maven.lifecycle.internal.LifecycleModuleBuilder.buildProject (LifecycleModuleBuilder.java:117)
16:14:13 [2020-08-27T20:14:13.530Z]     at org.apache.maven.lifecycle.internal.LifecycleModuleBuilder.buildProject (LifecycleModuleBuilder.java:81)
16:14:13 [2020-08-27T20:14:13.530Z]     at org.apache.maven.lifecycle.internal.builder.singlethreaded.SingleThreadedBuilder.build (SingleThreadedBuilder.java:56)
16:14:13 [2020-08-27T20:14:13.530Z]     at org.apache.maven.lifecycle.internal.LifecycleStarter.execute (LifecycleStarter.java:128)
16:14:13 [2020-08-27T20:14:13.530Z]     at org.apache.maven.DefaultMaven.doExecute (DefaultMaven.java:305)
16:14:13 [2020-08-27T20:14:13.530Z]     at org.apache.maven.DefaultMaven.doExecute (DefaultMaven.java:192)
16:14:13 [2020-08-27T20:14:13.530Z]     at org.apache.maven.DefaultMaven.execute (DefaultMaven.java:105)
16:14:13 [2020-08-27T20:14:13.530Z]     at org.apache.maven.cli.MavenCli.execute (MavenCli.java:957)
16:14:13 [2020-08-27T20:14:13.530Z]     at org.apache.maven.cli.MavenCli.doMain (MavenCli.java:289)
16:14:13 [2020-08-27T20:14:13.530Z]     at org.apache.maven.cli.MavenCli.main (MavenCli.java:193)
16:14:13 [2020-08-27T20:14:13.530Z]     at sun.reflect.NativeMethodAccessorImpl.invoke0 (Native Method)
16:14:13 [2020-08-27T20:14:13.530Z]     at sun.reflect.NativeMethodAccessorImpl.invoke (NativeMethodAccessorImpl.java:62)
16:14:13 [2020-08-27T20:14:13.530Z]     at sun.reflect.DelegatingMethodAccessorImpl.invoke (DelegatingMethodAccessorImpl.java:43)
16:14:13 [2020-08-27T20:14:13.530Z]     at java.lang.reflect.Method.invoke (Method.java:498)
16:14:13 [2020-08-27T20:14:13.530Z]     at org.codehaus.plexus.classworlds.launcher.Launcher.launchEnhanced (Launcher.java:282)
16:14:13 [2020-08-27T20:14:13.530Z]     at org.codehaus.plexus.classworlds.launcher.Launcher.launch (Launcher.java:225)
16:14:13 [2020-08-27T20:14:13.530Z]     at org.codehaus.plexus.classworlds.launcher.Launcher.mainWithExitCode (Launcher.java:406)
16:14:13 [2020-08-27T20:14:13.530Z]     at org.codehaus.plexus.classworlds.launcher.Launcher.main (Launcher.java:347)
16:14:13 [2020-08-27T20:14:13.530Z] Caused by: org.apache.maven.plugin.MojoFailureException: An unexpected error occurred while launching the test runtime (process returned error code 143(SIGTERM received?)). The process logfile /home/jenkins/agent/workspace/egit.gerrit/repo/org.eclipse.egit.ui.test/target/work/data/.metadata/.log might contain further details. Command-line used to launch the sub-process was null -Dosgi.noShutdown=false -Dosgi.os=linux -Dosgi.ws=gtk -Dosgi.arch=x86_64 -Declipse.consoleLog=true -Degit.test.tmpdir=/home/jenkins/agent/workspace/egit.gerrit/tmp/egit.tmp/ -Dorg.eclipse.swtbot.search.timeout=30000 -Dorg.eclipse.swtbot.screenshots.dir=target/screenshots -Xmx1024m -Dosgi.clean=true -jar /home/jenkins/agent/workspace/egit.gerrit/.repository/p2/osgi/bundle/org.eclipse.equinox.launcher/1.3.201.v20161025-1711/org.eclipse.equinox.launcher-1.3.201.v20161025-1711.jar -data /home/jenkins/agent/workspace/egit.gerrit/repo/org.eclipse.egit.ui.test/target/work/data -install /home/jenkins/agent/workspace/egit.gerrit/repo/org.eclipse.egit.ui.test/target/work -configuration /home/jenkins/agent/workspace/egit.gerrit/repo/org.eclipse.egit.ui.test/target/work/configuration -application org.eclipse.tycho.surefire.osgibooter.uitest -testproperties /home/jenkins/agent/workspace/egit.gerrit/repo/org.eclipse.egit.ui.test/target/surefire.properties -testApplication org.eclipse.ui.ide.workbench -nouithread in working directory /home/jenkins/agent/workspace/egit.gerrit/repo/org.eclipse.egit.ui.test
16:14:13 [2020-08-27T20:14:13.530Z]     at org.eclipse.tycho.surefire.TestMojo.runTest (TestMojo.java:1093)
16:14:13 [2020-08-27T20:14:13.530Z]     at org.eclipse.tycho.surefire.TestMojo.execute (TestMojo.java:712)
16:14:13 [2020-08-27T20:14:13.530Z]     at org.apache.maven.plugin.DefaultBuildPluginManager.executeMojo (DefaultBuildPluginManager.java:137)
16:14:13 [2020-08-27T20:14:13.530Z]     at org.apache.maven.lifecycle.internal.MojoExecutor.execute (MojoExecutor.java:210)
16:14:13 [2020-08-27T20:14:13.530Z]     at org.apache.maven.lifecycle.internal.MojoExecutor.execute (MojoExecutor.java:156)
16:14:13 [2020-08-27T20:14:13.530Z]     at org.apache.maven.lifecycle.internal.MojoExecutor.execute (MojoExecutor.java:148)
16:14:13 [2020-08-27T20:14:13.530Z]     at org.apache.maven.lifecycle.internal.LifecycleModuleBuilder.buildProject (LifecycleModuleBuilder.java:117)
16:14:13 [2020-08-27T20:14:13.530Z]     at org.apache.maven.lifecycle.internal.LifecycleModuleBuilder.buildProject (LifecycleModuleBuilder.java:81)
16:14:13 [2020-08-27T20:14:13.531Z]     at org.apache.maven.lifecycle.internal.builder.singlethreaded.SingleThreadedBuilder.build (SingleThreadedBuilder.java:56)
16:14:13 [2020-08-27T20:14:13.531Z]     at org.apache.maven.lifecycle.internal.LifecycleStarter.execute (LifecycleStarter.java:128)
16:14:13 [2020-08-27T20:14:13.531Z]     at org.apache.maven.DefaultMaven.doExecute (DefaultMaven.java:305)
16:14:13 [2020-08-27T20:14:13.531Z]     at org.apache.maven.DefaultMaven.doExecute (DefaultMaven.java:192)
16:14:13 [2020-08-27T20:14:13.531Z]     at org.apache.maven.DefaultMaven.execute (DefaultMaven.java:105)
16:14:13 [2020-08-27T20:14:13.531Z]     at org.apache.maven.cli.MavenCli.execute (MavenCli.java:957)
16:14:13 [2020-08-27T20:14:13.531Z]     at org.apache.maven.cli.MavenCli.doMain (MavenCli.java:289)
16:14:13 [2020-08-27T20:14:13.531Z]     at org.apache.maven.cli.MavenCli.main (MavenCli.java:193)
16:14:13 [2020-08-27T20:14:13.531Z]     at sun.reflect.NativeMethodAccessorImpl.invoke0 (Native Method)
16:14:13 [2020-08-27T20:14:13.531Z]     at sun.reflect.NativeMethodAccessorImpl.invoke (NativeMethodAccessorImpl.java:62)
16:14:13 [2020-08-27T20:14:13.531Z]     at sun.reflect.DelegatingMethodAccessorImpl.invoke (DelegatingMethodAccessorImpl.java:43)
16:14:13 [2020-08-27T20:14:13.531Z]     at java.lang.reflect.Method.invoke (Method.java:498)
16:14:13 [2020-08-27T20:14:13.531Z]     at org.codehaus.plexus.classworlds.launcher.Launcher.launchEnhanced (Launcher.java:282)
16:14:13 [2020-08-27T20:14:13.531Z]     at org.codehaus.plexus.classworlds.launcher.Launcher.launch (Launcher.java:225)
16:14:13 [2020-08-27T20:14:13.531Z]     at org.codehaus.plexus.classworlds.launcher.Launcher.mainWithExitCode (Launcher.java:406)
16:14:13 [2020-08-27T20:14:13.531Z]     at org.codehaus.plexus.classworlds.launcher.Launcher.main (Launcher.java:347)
16:14:13 [2020-08-27T20:14:13.531Z] [ERROR] 
16:14:13 [2020-08-27T20:14:13.531Z] [ERROR] Re-run Maven using the -X switch to enable full debug logging.
16:14:13 [2020-08-27T20:14:13.531Z] [ERROR] 
16:14:13 [2020-08-27T20:14:13.531Z] [ERROR] For more information about the errors and possible solutions, please read the following articles:
16:14:13 [2020-08-27T20:14:13.531Z] [ERROR] [Help 1] http://cwiki.apache.org/confluence/display/MAVEN/MojoFailureException
16:14:13 [2020-08-27T20:14:13.531Z] [ERROR] 
16:14:13 [2020-08-27T20:14:13.531Z] [ERROR] After correcting the problems, you can resume the build with the command
16:14:13 [2020-08-27T20:14:13.531Z] [ERROR]   mvn <args> -rf :org.eclipse.egit.ui.test
16:14:13 [2020-08-27T20:14:13.536Z] script returned exit code 143
[Pipeline] }
[Pipeline] // stage
[Pipeline] stage
[Pipeline] { (Results)
[Pipeline] junit
16:14:13 [2020-08-27T20:14:13.957Z] Recording test results
[Pipeline] archiveArtifacts
16:14:14 [2020-08-27T20:14:14.622Z] Archiving artifacts
[Pipeline] findbugs
16:14:17 [2020-08-27T20:14:17.683Z] [FINDBUGS] Collecting findbugs analysis files...
16:14:20 [2020-08-27T20:14:20.983Z] [FINDBUGS] Searching for all files in /home/jenkins/agent/workspace/egit.gerrit/repo that match the pattern */target/*bugsXml.xml
16:14:20 [2020-08-27T20:14:20.983Z] [FINDBUGS] Parsing 8 files in /home/jenkins/agent/workspace/egit.gerrit/repo
16:14:20 [2020-08-27T20:14:20.983Z] [FINDBUGS] Successfully parsed file /home/jenkins/agent/workspace/egit.gerrit/repo/org.eclipse.egit.core.junit/target/spotbugsXml.xml with 4 unique warnings and 0 duplicates.
16:14:20 [2020-08-27T20:14:20.983Z] [FINDBUGS] Successfully parsed file /home/jenkins/agent/workspace/egit.gerrit/repo/org.eclipse.egit.core.test/target/spotbugsXml.xml with 9 unique warnings and 0 duplicates.
16:14:20 [2020-08-27T20:14:20.983Z] [FINDBUGS] Successfully parsed file /home/jenkins/agent/workspace/egit.gerrit/repo/org.eclipse.egit.core/target/spotbugsXml.xml with 20 unique warnings and 0 duplicates.
16:14:20 [2020-08-27T20:14:20.983Z] [FINDBUGS] Successfully parsed file /home/jenkins/agent/workspace/egit.gerrit/repo/org.eclipse.egit.gitflow.test/target/spotbugsXml.xml with 20 unique warnings and 0 duplicates.
16:14:20 [2020-08-27T20:14:20.983Z] [FINDBUGS] Successfully parsed file /home/jenkins/agent/workspace/egit.gerrit/repo/org.eclipse.egit.gitflow.ui/target/spotbugsXml.xml with 20 unique warnings and 0 duplicates.
16:14:20 [2020-08-27T20:14:20.983Z] [FINDBUGS] Successfully parsed file /home/jenkins/agent/workspace/egit.gerrit/repo/org.eclipse.egit.gitflow/target/spotbugsXml.xml with 22 unique warnings and 0 duplicates.
16:14:20 [2020-08-27T20:14:20.983Z] [FINDBUGS] Successfully parsed file /home/jenkins/agent/workspace/egit.gerrit/repo/org.eclipse.egit.mylyn.ui/target/spotbugsXml.xml with 22 unique warnings and 0 duplicates.
16:14:20 [2020-08-27T20:14:20.983Z] [FINDBUGS] Successfully parsed file /home/jenkins/agent/workspace/egit.gerrit/repo/org.eclipse.egit.ui/target/spotbugsXml.xml with 59 unique warnings and 0 duplicates.
16:14:20 [2020-08-27T20:14:20.983Z] Skipping warnings blame since pipelines do not have an SCM link.%n
16:14:21 [2020-08-27T20:14:21.048Z] [FINDBUGS] Computing warning deltas based on reference build #1650
[Pipeline] dry
16:14:21 [2020-08-27T20:14:21.260Z] [DRY] Collecting duplicate code analysis files...
16:14:21 [2020-08-27T20:14:21.537Z] [DRY] Searching for all files in /home/jenkins/agent/workspace/egit.gerrit/repo that match the pattern **/cpd.xml
16:14:21 [2020-08-27T20:14:21.537Z] [DRY] Parsing 15 files in /home/jenkins/agent/workspace/egit.gerrit/repo
16:14:21 [2020-08-27T20:14:21.537Z] [DRY] Successfully parsed file /home/jenkins/agent/workspace/egit.gerrit/repo/org.eclipse.egit-feature/target/cpd.xml with 0 unique warnings and 0 duplicates.
16:14:21 [2020-08-27T20:14:21.537Z] [DRY] Successfully parsed file /home/jenkins/agent/workspace/egit.gerrit/repo/org.eclipse.egit.core.junit/target/cpd.xml with 0 unique warnings and 0 duplicates.
16:14:21 [2020-08-27T20:14:21.537Z] [DRY] Successfully parsed file /home/jenkins/agent/workspace/egit.gerrit/repo/org.eclipse.egit.core.test/target/cpd.xml with 0 unique warnings and 0 duplicates.
16:14:21 [2020-08-27T20:14:21.537Z] [DRY] Successfully parsed file /home/jenkins/agent/workspace/egit.gerrit/repo/org.eclipse.egit.core/target/cpd.xml with 4 unique warnings and 0 duplicates.
16:14:21 [2020-08-27T20:14:21.537Z] [DRY] Successfully parsed file /home/jenkins/agent/workspace/egit.gerrit/repo/org.eclipse.egit.doc/target/cpd.xml with 4 unique warnings and 0 duplicates.
16:14:21 [2020-08-27T20:14:21.537Z] [DRY] Successfully parsed file /home/jenkins/agent/workspace/egit.gerrit/repo/org.eclipse.egit.gitflow-feature/target/cpd.xml with 4 unique warnings and 0 duplicates.
16:14:21 [2020-08-27T20:14:21.537Z] [DRY] Successfully parsed file /home/jenkins/agent/workspace/egit.gerrit/repo/org.eclipse.egit.gitflow.test/target/cpd.xml with 4 unique warnings and 0 duplicates.
16:14:21 [2020-08-27T20:14:21.537Z] [DRY] Successfully parsed file /home/jenkins/agent/workspace/egit.gerrit/repo/org.eclipse.egit.gitflow.ui/target/cpd.xml with 4 unique warnings and 0 duplicates.
16:14:21 [2020-08-27T20:14:21.537Z] [DRY] Successfully parsed file /home/jenkins/agent/workspace/egit.gerrit/repo/org.eclipse.egit.gitflow/target/cpd.xml with 4 unique warnings and 0 duplicates.
16:14:21 [2020-08-27T20:14:21.537Z] [DRY] Successfully parsed file /home/jenkins/agent/workspace/egit.gerrit/repo/org.eclipse.egit.mylyn-feature/target/cpd.xml with 4 unique warnings and 0 duplicates.
16:14:21 [2020-08-27T20:14:21.537Z] [DRY] Successfully parsed file /home/jenkins/agent/workspace/egit.gerrit/repo/org.eclipse.egit.mylyn.ui/target/cpd.xml with 4 unique warnings and 0 duplicates.
16:14:21 [2020-08-27T20:14:21.537Z] [DRY] Successfully parsed file /home/jenkins/agent/workspace/egit.gerrit/repo/org.eclipse.egit.repository/target/cpd.xml with 4 unique warnings and 0 duplicates.
16:14:21 [2020-08-27T20:14:21.537Z] [DRY] Successfully parsed file /home/jenkins/agent/workspace/egit.gerrit/repo/org.eclipse.egit.source-feature/target/cpd.xml with 4 unique warnings and 0 duplicates.
16:14:21 [2020-08-27T20:14:21.537Z] [DRY] Successfully parsed file /home/jenkins/agent/workspace/egit.gerrit/repo/org.eclipse.egit.ui/target/cpd.xml with 37 unique warnings and 0 duplicates.
16:14:21 [2020-08-27T20:14:21.537Z] [DRY] Successfully parsed file /home/jenkins/agent/workspace/egit.gerrit/repo/org.eclipse.egit/target/cpd.xml with 37 unique warnings and 0 duplicates.
16:14:21 [2020-08-27T20:14:21.537Z] Skipping warnings blame since pipelines do not have an SCM link.%n
16:14:21 [2020-08-27T20:14:21.573Z] [DRY] Computing warning deltas based on reference build #1650
[Pipeline] }
[Pipeline] // stage
[Pipeline] }
[Pipeline] // dir
[Pipeline] }
16:14:22 [2020-08-27T20:14:22.234Z] Terminating xvnc.
[Pipeline] // wrap
[Pipeline] }
[Pipeline] // timeout
[Pipeline] }
[Pipeline] // node
[Pipeline] }
[Pipeline] // timestamps
[Pipeline] End of Pipeline
Timeout has been exceeded
Finished: ABORTED