FailedConsole Output

Skipping 911 KB.. Full Log
_box_gadget_distribute: assertion 'size >= 0' failed in GtkScrollbar
14:43:34 [2020-08-25T18:43:34.158Z] 
14:43:34 [2020-08-25T18:43:34.158Z] (SWT:1624): Gtk-CRITICAL **: 18:43:33.997: gtk_box_gadget_distribute: assertion 'size >= 0' failed in GtkScrollbar
14:43:34 [2020-08-25T18:43:34.158Z] 
14:43:34 [2020-08-25T18:43:34.158Z] (SWT:1624): Gtk-CRITICAL **: 18:43:33.997: gtk_box_gadget_distribute: assertion 'size >= 0' failed in GtkScrollbar
14:43:34 [2020-08-25T18:43:34.158Z] 
14:43:34 [2020-08-25T18:43:34.158Z] (SWT:1624): Gtk-CRITICAL **: 18:43:33.998: gtk_box_gadget_distribute: assertion 'size >= 0' failed in GtkScrollbar
14:43:34 [2020-08-25T18:43:34.158Z] 
14:43:34 [2020-08-25T18:43:34.158Z] (SWT:1624): Gtk-CRITICAL **: 18:43:34.013: gtk_box_gadget_distribute: assertion 'size >= 0' failed in GtkScrollbar
14:43:34 [2020-08-25T18:43:34.159Z] 
14:43:34 [2020-08-25T18:43:34.159Z] (SWT:1624): Gtk-CRITICAL **: 18:43:34.033: gtk_box_gadget_distribute: assertion 'size >= 0' failed in GtkScrollbar
14:43:34 [2020-08-25T18:43:34.159Z] 
14:43:34 [2020-08-25T18:43:34.159Z] (SWT:1624): Gtk-CRITICAL **: 18:43:34.042: gtk_box_gadget_distribute: assertion 'size >= 0' failed in GtkScrollbar
14:43:34 [2020-08-25T18:43:34.159Z] 
14:43:34 [2020-08-25T18:43:34.159Z] (SWT:1624): Gtk-CRITICAL **: 18:43:34.059: gtk_box_gadget_distribute: assertion 'size >= 0' failed in GtkScrollbar
14:43:34 [2020-08-25T18:43:34.159Z] 
14:43:34 [2020-08-25T18:43:34.159Z] (SWT:1624): Gtk-CRITICAL **: 18:43:34.076: gtk_box_gadget_distribute: assertion 'size >= 0' failed in GtkScrollbar
14:43:34 [2020-08-25T18:43:34.159Z] 
14:43:34 [2020-08-25T18:43:34.159Z] (SWT:1624): Gtk-CRITICAL **: 18:43:34.085: gtk_box_gadget_distribute: assertion 'size >= 0' failed in GtkScrollbar
14:43:34 [2020-08-25T18:43:34.159Z] 
14:43:34 [2020-08-25T18:43:34.159Z] (SWT:1624): Gtk-CRITICAL **: 18:43:34.085: gtk_box_gadget_distribute: assertion 'size >= 0' failed in GtkScrollbar
14:43:34 [2020-08-25T18:43:34.159Z] 
14:43:34 [2020-08-25T18:43:34.159Z] (SWT:1624): Gtk-CRITICAL **: 18:43:34.086: gtk_box_gadget_distribute: assertion 'size >= 0' failed in GtkScrollbar
14:43:34 [2020-08-25T18:43:34.159Z] 
14:43:34 [2020-08-25T18:43:34.159Z] (SWT:1624): Gtk-CRITICAL **: 18:43:34.087: gtk_box_gadget_distribute: assertion 'size >= 0' failed in GtkScrollbar
14:43:34 [2020-08-25T18:43:34.159Z] 
14:43:34 [2020-08-25T18:43:34.159Z] (SWT:1624): Gtk-CRITICAL **: 18:43:34.087: gtk_box_gadget_distribute: assertion 'size >= 0' failed in GtkScrollbar
14:43:34 [2020-08-25T18:43:34.159Z] 
14:43:34 [2020-08-25T18:43:34.159Z] (SWT:1624): Gtk-CRITICAL **: 18:43:34.087: gtk_box_gadget_distribute: assertion 'size >= 0' failed in GtkScrollbar
14:43:34 [2020-08-25T18:43:34.159Z] 
14:43:34 [2020-08-25T18:43:34.159Z] (SWT:1624): Gtk-CRITICAL **: 18:43:34.095: gtk_box_gadget_distribute: assertion 'size >= 0' failed in GtkScrollbar
14:43:34 [2020-08-25T18:43:34.159Z] 
14:43:34 [2020-08-25T18:43:34.159Z] (SWT:1624): Gtk-CRITICAL **: 18:43:34.101: gtk_box_gadget_distribute: assertion 'size >= 0' failed in GtkScrollbar
14:43:34 [2020-08-25T18:43:34.159Z] 
14:43:34 [2020-08-25T18:43:34.159Z] (SWT:1624): Gtk-CRITICAL **: 18:43:34.144: gtk_box_gadget_distribute: assertion 'size >= 0' failed in GtkScrollbar
14:43:34 [2020-08-25T18:43:34.159Z] 
14:43:34 [2020-08-25T18:43:34.159Z] (SWT:1624): Gtk-CRITICAL **: 18:43:34.144: gtk_box_gadget_distribute: assertion 'size >= 0' failed in GtkScrollbar
14:43:34 [2020-08-25T18:43:34.416Z] 
14:43:34 [2020-08-25T18:43:34.416Z] (SWT:1624): Gtk-CRITICAL **: 18:43:34.196: gtk_box_gadget_distribute: assertion 'size >= 0' failed in GtkScrollbar
14:43:34 [2020-08-25T18:43:34.416Z] 
14:43:34 [2020-08-25T18:43:34.416Z] (SWT:1624): Gtk-CRITICAL **: 18:43:34.200: gtk_box_gadget_distribute: assertion 'size >= 0' failed in GtkScrollbar
14:43:34 [2020-08-25T18:43:34.416Z] 
14:43:34 [2020-08-25T18:43:34.416Z] (SWT:1624): Gtk-CRITICAL **: 18:43:34.200: gtk_box_gadget_distribute: assertion 'size >= 0' failed in GtkScrollbar
14:43:34 [2020-08-25T18:43:34.416Z] 
14:43:34 [2020-08-25T18:43:34.416Z] (SWT:1624): Gtk-CRITICAL **: 18:43:34.212: gtk_box_gadget_distribute: assertion 'size >= 0' failed in GtkScrollbar
14:43:34 [2020-08-25T18:43:34.416Z] 
14:43:34 [2020-08-25T18:43:34.416Z] (SWT:1624): Gtk-CRITICAL **: 18:43:34.213: gtk_box_gadget_distribute: assertion 'size >= 0' failed in GtkScrollbar
14:43:34 [2020-08-25T18:43:34.416Z] 
14:43:34 [2020-08-25T18:43:34.416Z] (SWT:1624): Gtk-CRITICAL **: 18:43:34.213: gtk_box_gadget_distribute: assertion 'size >= 0' failed in GtkScrollbar
14:43:34 [2020-08-25T18:43:34.416Z] 
14:43:34 [2020-08-25T18:43:34.416Z] (SWT:1624): Gtk-CRITICAL **: 18:43:34.226: gtk_box_gadget_distribute: assertion 'size >= 0' failed in GtkScrollbar
14:43:34 [2020-08-25T18:43:34.416Z] 
14:43:34 [2020-08-25T18:43:34.417Z] (SWT:1624): Gtk-WARNING **: 18:43:34.284: Negative content width -6 (allocation 1, extents 4x3) while allocating gadget (node toolbar, owner GtkToolbar)
14:43:34 [2020-08-25T18:43:34.983Z] 
14:43:34 [2020-08-25T18:43:34.983Z] (SWT:1624): Gtk-WARNING **: 18:43:34.709: Negative content width -6 (allocation 1, extents 4x3) while allocating gadget (node toolbar, owner GtkToolbar)
14:43:34 [2020-08-25T18:43:34.983Z] 
14:43:34 [2020-08-25T18:43:34.983Z] (SWT:1624): Gtk-WARNING **: 18:43:34.718: Negative content width -6 (allocation 1, extents 4x3) while allocating gadget (node toolbar, owner GtkToolbar)
14:43:35 [2020-08-25T18:43:35.547Z] 
14:43:35 [2020-08-25T18:43:35.547Z] (SWT:1624): Gtk-WARNING **: 18:43:35.321: Negative content width -6 (allocation 1, extents 4x3) while allocating gadget (node toolbar, owner GtkToolbar)
14:43:35 [2020-08-25T18:43:35.805Z] 
14:43:35 [2020-08-25T18:43:35.805Z] (SWT:1624): Gtk-CRITICAL **: 18:43:35.778: gtk_box_gadget_distribute: assertion 'size >= 0' failed in GtkScrollbar
14:43:35 [2020-08-25T18:43:35.805Z] 
14:43:35 [2020-08-25T18:43:35.805Z] (SWT:1624): Gtk-CRITICAL **: 18:43:35.785: gtk_box_gadget_distribute: assertion 'size >= 0' failed in GtkScrollbar
14:43:35 [2020-08-25T18:43:35.805Z] 
14:43:35 [2020-08-25T18:43:35.805Z] (SWT:1624): Gtk-WARNING **: 18:43:35.788: Negative content width -6 (allocation 1, extents 4x3) while allocating gadget (node toolbar, owner GtkToolbar)
14:43:35 [2020-08-25T18:43:35.805Z] 
14:43:35 [2020-08-25T18:43:35.805Z] (SWT:1624): Gtk-CRITICAL **: 18:43:35.794: gtk_box_gadget_distribute: assertion 'size >= 0' failed in GtkScrollbar
14:43:35 [2020-08-25T18:43:35.805Z] 
14:43:35 [2020-08-25T18:43:35.805Z] (SWT:1624): Gtk-CRITICAL **: 18:43:35.799: gtk_box_gadget_distribute: assertion 'size >= 0' failed in GtkScrollbar
14:43:35 [2020-08-25T18:43:35.805Z] 
14:43:35 [2020-08-25T18:43:35.805Z] (SWT:1624): Gtk-CRITICAL **: 18:43:35.800: gtk_box_gadget_distribute: assertion 'size >= 0' failed in GtkScrollbar
14:43:35 [2020-08-25T18:43:35.805Z] 
14:43:35 [2020-08-25T18:43:35.805Z] (SWT:1624): Gtk-CRITICAL **: 18:43:35.801: gtk_box_gadget_distribute: assertion 'size >= 0' failed in GtkScrollbar
14:43:36 [2020-08-25T18:43:36.065Z] 
14:43:36 [2020-08-25T18:43:36.065Z] (SWT:1624): Gtk-CRITICAL **: 18:43:35.807: gtk_box_gadget_distribute: assertion 'size >= 0' failed in GtkScrollbar
14:43:36 [2020-08-25T18:43:36.065Z] 
14:43:36 [2020-08-25T18:43:36.065Z] (SWT:1624): Gtk-CRITICAL **: 18:43:35.812: gtk_box_gadget_distribute: assertion 'size >= 0' failed in GtkScrollbar
14:43:36 [2020-08-25T18:43:36.065Z] 
14:43:36 [2020-08-25T18:43:36.065Z] (SWT:1624): Gtk-CRITICAL **: 18:43:35.812: gtk_box_gadget_distribute: assertion 'size >= 0' failed in GtkScrollbar
14:43:36 [2020-08-25T18:43:36.065Z] 
14:43:36 [2020-08-25T18:43:36.065Z] (SWT:1624): Gtk-CRITICAL **: 18:43:35.827: gtk_box_gadget_distribute: assertion 'size >= 0' failed in GtkScrollbar
14:43:36 [2020-08-25T18:43:36.065Z] 
14:43:36 [2020-08-25T18:43:36.065Z] (SWT:1624): Gtk-CRITICAL **: 18:43:35.827: gtk_box_gadget_distribute: assertion 'size >= 0' failed in GtkScrollbar
14:43:36 [2020-08-25T18:43:36.065Z] 
14:43:36 [2020-08-25T18:43:36.065Z] (SWT:1624): Gtk-CRITICAL **: 18:43:35.844: gtk_box_gadget_distribute: assertion 'size >= 0' failed in GtkScrollbar
14:43:36 [2020-08-25T18:43:36.065Z] 
14:43:36 [2020-08-25T18:43:36.065Z] (SWT:1624): Gtk-CRITICAL **: 18:43:35.844: gtk_box_gadget_distribute: assertion 'size >= 0' failed in GtkScrollbar
14:43:36 [2020-08-25T18:43:36.065Z] 
14:43:36 [2020-08-25T18:43:36.065Z] (SWT:1624): Gtk-CRITICAL **: 18:43:35.863: gtk_box_gadget_distribute: assertion 'size >= 0' failed in GtkScrollbar
14:43:36 [2020-08-25T18:43:36.065Z] 
14:43:36 [2020-08-25T18:43:36.065Z] (SWT:1624): Gtk-CRITICAL **: 18:43:35.863: gtk_box_gadget_distribute: assertion 'size >= 0' failed in GtkScrollbar
14:43:36 [2020-08-25T18:43:36.065Z] 
14:43:36 [2020-08-25T18:43:36.065Z] (SWT:1624): Gtk-CRITICAL **: 18:43:35.877: gtk_box_gadget_distribute: assertion 'size >= 0' failed in GtkScrollbar
14:43:36 [2020-08-25T18:43:36.065Z] 
14:43:36 [2020-08-25T18:43:36.065Z] (SWT:1624): Gtk-CRITICAL **: 18:43:35.877: gtk_box_gadget_distribute: assertion 'size >= 0' failed in GtkScrollbar
14:43:36 [2020-08-25T18:43:36.065Z] 
14:43:36 [2020-08-25T18:43:36.065Z] (SWT:1624): Gtk-CRITICAL **: 18:43:35.894: gtk_box_gadget_distribute: assertion 'size >= 0' failed in GtkScrollbar
14:43:36 [2020-08-25T18:43:36.065Z] 
14:43:36 [2020-08-25T18:43:36.065Z] (SWT:1624): Gtk-CRITICAL **: 18:43:35.894: gtk_box_gadget_distribute: assertion 'size >= 0' failed in GtkScrollbar
14:43:36 [2020-08-25T18:43:36.065Z] 
14:43:36 [2020-08-25T18:43:36.065Z] (SWT:1624): Gtk-CRITICAL **: 18:43:35.909: gtk_box_gadget_distribute: assertion 'size >= 0' failed in GtkScrollbar
14:43:36 [2020-08-25T18:43:36.065Z] 
14:43:36 [2020-08-25T18:43:36.065Z] (SWT:1624): Gtk-CRITICAL **: 18:43:35.909: gtk_box_gadget_distribute: assertion 'size >= 0' failed in GtkScrollbar
14:43:36 [2020-08-25T18:43:36.065Z] 
14:43:36 [2020-08-25T18:43:36.065Z] (SWT:1624): Gtk-CRITICAL **: 18:43:35.914: gtk_box_gadget_distribute: assertion 'size >= 0' failed in GtkScrollbar
14:43:36 [2020-08-25T18:43:36.065Z] 
14:43:36 [2020-08-25T18:43:36.065Z] (SWT:1624): Gtk-CRITICAL **: 18:43:35.914: gtk_box_gadget_distribute: assertion 'size >= 0' failed in GtkScrollbar
14:43:36 [2020-08-25T18:43:36.065Z] 
14:43:36 [2020-08-25T18:43:36.065Z] (SWT:1624): Gtk-CRITICAL **: 18:43:35.919: gtk_box_gadget_distribute: assertion 'size >= 0' failed in GtkScrollbar
14:43:36 [2020-08-25T18:43:36.065Z] 
14:43:36 [2020-08-25T18:43:36.065Z] (SWT:1624): Gtk-CRITICAL **: 18:43:35.920: gtk_box_gadget_distribute: assertion 'size >= 0' failed in GtkScrollbar
14:43:36 [2020-08-25T18:43:36.065Z] 
14:43:36 [2020-08-25T18:43:36.065Z] (SWT:1624): Gtk-CRITICAL **: 18:43:35.920: gtk_box_gadget_distribute: assertion 'size >= 0' failed in GtkScrollbar
14:43:36 [2020-08-25T18:43:36.065Z] 
14:43:36 [2020-08-25T18:43:36.065Z] (SWT:1624): Gtk-CRITICAL **: 18:43:35.924: gtk_box_gadget_distribute: assertion 'size >= 0' failed in GtkScrollbar
14:43:36 [2020-08-25T18:43:36.065Z] 
14:43:36 [2020-08-25T18:43:36.065Z] (SWT:1624): Gtk-CRITICAL **: 18:43:35.926: gtk_box_gadget_distribute: assertion 'size >= 0' failed in GtkScrollbar
14:43:36 [2020-08-25T18:43:36.065Z] 
14:43:36 [2020-08-25T18:43:36.065Z] (SWT:1624): Gtk-CRITICAL **: 18:43:35.927: gtk_box_gadget_distribute: assertion 'size >= 0' failed in GtkScrollbar
14:43:36 [2020-08-25T18:43:36.065Z] 
14:43:36 [2020-08-25T18:43:36.065Z] (SWT:1624): Gtk-CRITICAL **: 18:43:35.931: gtk_box_gadget_distribute: assertion 'size >= 0' failed in GtkScrollbar
14:43:36 [2020-08-25T18:43:36.065Z] 
14:43:36 [2020-08-25T18:43:36.065Z] (SWT:1624): Gtk-CRITICAL **: 18:43:35.940: gtk_box_gadget_distribute: assertion 'size >= 0' failed in GtkScrollbar
14:43:36 [2020-08-25T18:43:36.065Z] 
14:43:36 [2020-08-25T18:43:36.065Z] (SWT:1624): Gtk-CRITICAL **: 18:43:35.941: gtk_box_gadget_distribute: assertion 'size >= 0' failed in GtkScrollbar
14:43:36 [2020-08-25T18:43:36.065Z] 
14:43:36 [2020-08-25T18:43:36.065Z] (SWT:1624): Gtk-CRITICAL **: 18:43:35.954: gtk_box_gadget_distribute: assertion 'size >= 0' failed in GtkScrollbar
14:43:36 [2020-08-25T18:43:36.065Z] 
14:43:36 [2020-08-25T18:43:36.066Z] (SWT:1624): Gtk-WARNING **: 18:43:35.971: Negative content width -6 (allocation 1, extents 4x3) while allocating gadget (node toolbar, owner GtkToolbar)
14:43:36 [2020-08-25T18:43:36.630Z] 
14:43:36 [2020-08-25T18:43:36.630Z] (SWT:1624): Gtk-WARNING **: 18:43:36.486: Negative content width -6 (allocation 1, extents 4x3) while allocating gadget (node toolbar, owner GtkToolbar)
14:43:36 [2020-08-25T18:43:36.630Z] 
14:43:36 [2020-08-25T18:43:36.630Z] (SWT:1624): Gtk-WARNING **: 18:43:36.495: Negative content width -6 (allocation 1, extents 4x3) while allocating gadget (node toolbar, owner GtkToolbar)
14:43:37 [2020-08-25T18:43:37.194Z] 
14:43:37 [2020-08-25T18:43:37.195Z] (SWT:1624): Gtk-WARNING **: 18:43:37.080: Negative content width -6 (allocation 1, extents 4x3) while allocating gadget (node toolbar, owner GtkToolbar)
14:43:37 [2020-08-25T18:43:37.452Z] 
14:43:37 [2020-08-25T18:43:37.452Z] (SWT:1624): Gtk-CRITICAL **: 18:43:37.362: gtk_box_gadget_distribute: assertion 'size >= 0' failed in GtkScrollbar
14:43:37 [2020-08-25T18:43:37.452Z] 
14:43:37 [2020-08-25T18:43:37.452Z] (SWT:1624): Gtk-CRITICAL **: 18:43:37.369: gtk_box_gadget_distribute: assertion 'size >= 0' failed in GtkScrollbar
14:43:37 [2020-08-25T18:43:37.452Z] 
14:43:37 [2020-08-25T18:43:37.452Z] (SWT:1624): Gtk-WARNING **: 18:43:37.372: Negative content width -6 (allocation 1, extents 4x3) while allocating gadget (node toolbar, owner GtkToolbar)
14:43:37 [2020-08-25T18:43:37.452Z] 
14:43:37 [2020-08-25T18:43:37.452Z] (SWT:1624): Gtk-CRITICAL **: 18:43:37.380: gtk_box_gadget_distribute: assertion 'size >= 0' failed in GtkScrollbar
14:43:37 [2020-08-25T18:43:37.452Z] 
14:43:37 [2020-08-25T18:43:37.452Z] (SWT:1624): Gtk-CRITICAL **: 18:43:37.386: gtk_box_gadget_distribute: assertion 'size >= 0' failed in GtkScrollbar
14:43:37 [2020-08-25T18:43:37.452Z] 
14:43:37 [2020-08-25T18:43:37.452Z] (SWT:1624): Gtk-CRITICAL **: 18:43:37.387: gtk_box_gadget_distribute: assertion 'size >= 0' failed in GtkScrollbar
14:43:37 [2020-08-25T18:43:37.452Z] 
14:43:37 [2020-08-25T18:43:37.452Z] (SWT:1624): Gtk-CRITICAL **: 18:43:37.387: gtk_box_gadget_distribute: assertion 'size >= 0' failed in GtkScrollbar
14:43:37 [2020-08-25T18:43:37.452Z] 
14:43:37 [2020-08-25T18:43:37.452Z] (SWT:1624): Gtk-CRITICAL **: 18:43:37.394: gtk_box_gadget_distribute: assertion 'size >= 0' failed in GtkScrollbar
14:43:37 [2020-08-25T18:43:37.452Z] 
14:43:37 [2020-08-25T18:43:37.452Z] (SWT:1624): Gtk-CRITICAL **: 18:43:37.394: gtk_box_gadget_distribute: assertion 'size >= 0' failed in GtkScrollbar
14:43:37 [2020-08-25T18:43:37.452Z] 
14:43:37 [2020-08-25T18:43:37.452Z] (SWT:1624): Gtk-CRITICAL **: 18:43:37.408: gtk_box_gadget_distribute: assertion 'size >= 0' failed in GtkScrollbar
14:43:37 [2020-08-25T18:43:37.452Z] 
14:43:37 [2020-08-25T18:43:37.452Z] (SWT:1624): Gtk-CRITICAL **: 18:43:37.416: gtk_box_gadget_distribute: assertion 'size >= 0' failed in GtkScrollbar
14:43:37 [2020-08-25T18:43:37.452Z] 
14:43:37 [2020-08-25T18:43:37.452Z] (SWT:1624): Gtk-CRITICAL **: 18:43:37.416: gtk_box_gadget_distribute: assertion 'size >= 0' failed in GtkScrollbar
14:43:37 [2020-08-25T18:43:37.452Z] 
14:43:37 [2020-08-25T18:43:37.452Z] (SWT:1624): Gtk-CRITICAL **: 18:43:37.432: gtk_box_gadget_distribute: assertion 'size >= 0' failed in GtkScrollbar
14:43:37 [2020-08-25T18:43:37.452Z] 
14:43:37 [2020-08-25T18:43:37.452Z] (SWT:1624): Gtk-CRITICAL **: 18:43:37.432: gtk_box_gadget_distribute: assertion 'size >= 0' failed in GtkScrollbar
14:43:37 [2020-08-25T18:43:37.709Z] 
14:43:37 [2020-08-25T18:43:37.709Z] (SWT:1624): Gtk-CRITICAL **: 18:43:37.449: gtk_box_gadget_distribute: assertion 'size >= 0' failed in GtkScrollbar
14:43:37 [2020-08-25T18:43:37.709Z] 
14:43:37 [2020-08-25T18:43:37.709Z] (SWT:1624): Gtk-CRITICAL **: 18:43:37.449: gtk_box_gadget_distribute: assertion 'size >= 0' failed in GtkScrollbar
14:43:37 [2020-08-25T18:43:37.709Z] 
14:43:37 [2020-08-25T18:43:37.709Z] (SWT:1624): Gtk-CRITICAL **: 18:43:37.465: gtk_box_gadget_distribute: assertion 'size >= 0' failed in GtkScrollbar
14:43:37 [2020-08-25T18:43:37.709Z] 
14:43:37 [2020-08-25T18:43:37.709Z] (SWT:1624): Gtk-CRITICAL **: 18:43:37.465: gtk_box_gadget_distribute: assertion 'size >= 0' failed in GtkScrollbar
14:43:37 [2020-08-25T18:43:37.709Z] 
14:43:37 [2020-08-25T18:43:37.709Z] (SWT:1624): Gtk-CRITICAL **: 18:43:37.483: gtk_box_gadget_distribute: assertion 'size >= 0' failed in GtkScrollbar
14:43:37 [2020-08-25T18:43:37.709Z] 
14:43:37 [2020-08-25T18:43:37.709Z] (SWT:1624): Gtk-CRITICAL **: 18:43:37.483: gtk_box_gadget_distribute: assertion 'size >= 0' failed in GtkScrollbar
14:43:37 [2020-08-25T18:43:37.709Z] 
14:43:37 [2020-08-25T18:43:37.709Z] (SWT:1624): Gtk-CRITICAL **: 18:43:37.499: gtk_box_gadget_distribute: assertion 'size >= 0' failed in GtkScrollbar
14:43:37 [2020-08-25T18:43:37.709Z] 
14:43:37 [2020-08-25T18:43:37.709Z] (SWT:1624): Gtk-CRITICAL **: 18:43:37.499: gtk_box_gadget_distribute: assertion 'size >= 0' failed in GtkScrollbar
14:43:37 [2020-08-25T18:43:37.709Z] 
14:43:37 [2020-08-25T18:43:37.709Z] (SWT:1624): Gtk-CRITICAL **: 18:43:37.510: gtk_box_gadget_distribute: assertion 'size >= 0' failed in GtkScrollbar
14:43:37 [2020-08-25T18:43:37.709Z] 
14:43:37 [2020-08-25T18:43:37.709Z] (SWT:1624): Gtk-CRITICAL **: 18:43:37.510: gtk_box_gadget_distribute: assertion 'size >= 0' failed in GtkScrollbar
14:43:37 [2020-08-25T18:43:37.709Z] 
14:43:37 [2020-08-25T18:43:37.709Z] (SWT:1624): Gtk-CRITICAL **: 18:43:37.514: gtk_box_gadget_distribute: assertion 'size >= 0' failed in GtkScrollbar
14:43:37 [2020-08-25T18:43:37.709Z] 
14:43:37 [2020-08-25T18:43:37.709Z] (SWT:1624): Gtk-CRITICAL **: 18:43:37.515: gtk_box_gadget_distribute: assertion 'size >= 0' failed in GtkScrollbar
14:43:37 [2020-08-25T18:43:37.709Z] 
14:43:37 [2020-08-25T18:43:37.709Z] (SWT:1624): Gtk-CRITICAL **: 18:43:37.515: gtk_box_gadget_distribute: assertion 'size >= 0' failed in GtkScrollbar
14:43:37 [2020-08-25T18:43:37.709Z] 
14:43:37 [2020-08-25T18:43:37.709Z] (SWT:1624): Gtk-CRITICAL **: 18:43:37.519: gtk_box_gadget_distribute: assertion 'size >= 0' failed in GtkScrollbar
14:43:37 [2020-08-25T18:43:37.709Z] 
14:43:37 [2020-08-25T18:43:37.709Z] (SWT:1624): Gtk-CRITICAL **: 18:43:37.520: gtk_box_gadget_distribute: assertion 'size >= 0' failed in GtkScrollbar
14:43:37 [2020-08-25T18:43:37.709Z] 
14:43:37 [2020-08-25T18:43:37.709Z] (SWT:1624): Gtk-CRITICAL **: 18:43:37.524: gtk_box_gadget_distribute: assertion 'size >= 0' failed in GtkScrollbar
14:43:37 [2020-08-25T18:43:37.709Z] 
14:43:37 [2020-08-25T18:43:37.709Z] (SWT:1624): Gtk-CRITICAL **: 18:43:37.532: gtk_box_gadget_distribute: assertion 'size >= 0' failed in GtkScrollbar
14:43:37 [2020-08-25T18:43:37.709Z] 
14:43:37 [2020-08-25T18:43:37.709Z] (SWT:1624): Gtk-CRITICAL **: 18:43:37.532: gtk_box_gadget_distribute: assertion 'size >= 0' failed in GtkScrollbar
14:43:37 [2020-08-25T18:43:37.709Z] 
14:43:37 [2020-08-25T18:43:37.709Z] (SWT:1624): Gtk-CRITICAL **: 18:43:37.536: gtk_box_gadget_distribute: assertion 'size >= 0' failed in GtkScrollbar
14:43:37 [2020-08-25T18:43:37.709Z] 
14:43:37 [2020-08-25T18:43:37.709Z] (SWT:1624): Gtk-CRITICAL **: 18:43:37.537: gtk_box_gadget_distribute: assertion 'size >= 0' failed in GtkScrollbar
14:43:37 [2020-08-25T18:43:37.709Z] 
14:43:37 [2020-08-25T18:43:37.709Z] (SWT:1624): Gtk-CRITICAL **: 18:43:37.541: gtk_box_gadget_distribute: assertion 'size >= 0' failed in GtkScrollbar
14:43:37 [2020-08-25T18:43:37.709Z] 
14:43:37 [2020-08-25T18:43:37.709Z] (SWT:1624): Gtk-CRITICAL **: 18:43:37.560: gtk_box_gadget_distribute: assertion 'size >= 0' failed in GtkScrollbar
14:43:37 [2020-08-25T18:43:37.709Z] 
14:43:37 [2020-08-25T18:43:37.709Z] (SWT:1624): Gtk-WARNING **: 18:43:37.576: Negative content width -6 (allocation 1, extents 4x3) while allocating gadget (node toolbar, owner GtkToolbar)
14:43:38 [2020-08-25T18:43:38.273Z] 
14:43:38 [2020-08-25T18:43:38.273Z] (SWT:1624): Gtk-WARNING **: 18:43:38.108: Negative content width -6 (allocation 1, extents 4x3) while allocating gadget (node toolbar, owner GtkToolbar)
14:43:38 [2020-08-25T18:43:38.273Z] 
14:43:38 [2020-08-25T18:43:38.273Z] (SWT:1624): Gtk-WARNING **: 18:43:38.118: Negative content width -6 (allocation 1, extents 4x3) while allocating gadget (node toolbar, owner GtkToolbar)
14:43:38 [2020-08-25T18:43:38.837Z] 
14:43:38 [2020-08-25T18:43:38.837Z] (SWT:1624): Gtk-WARNING **: 18:43:38.699: Negative content width -6 (allocation 1, extents 4x3) while allocating gadget (node toolbar, owner GtkToolbar)
14:43:39 [2020-08-25T18:43:39.100Z] 
14:43:39 [2020-08-25T18:43:39.100Z] (SWT:1624): Gtk-CRITICAL **: 18:43:38.975: gtk_box_gadget_distribute: assertion 'size >= 0' failed in GtkScrollbar
14:43:39 [2020-08-25T18:43:39.100Z] 
14:43:39 [2020-08-25T18:43:39.100Z] (SWT:1624): Gtk-CRITICAL **: 18:43:38.982: gtk_box_gadget_distribute: assertion 'size >= 0' failed in GtkScrollbar
14:43:39 [2020-08-25T18:43:39.100Z] 
14:43:39 [2020-08-25T18:43:39.100Z] (SWT:1624): Gtk-WARNING **: 18:43:38.985: Negative content width -6 (allocation 1, extents 4x3) while allocating gadget (node toolbar, owner GtkToolbar)
14:43:39 [2020-08-25T18:43:39.100Z] 
14:43:39 [2020-08-25T18:43:39.100Z] (SWT:1624): Gtk-CRITICAL **: 18:43:38.991: gtk_box_gadget_distribute: assertion 'size >= 0' failed in GtkScrollbar
14:43:39 [2020-08-25T18:43:39.100Z] 
14:43:39 [2020-08-25T18:43:39.100Z] (SWT:1624): Gtk-CRITICAL **: 18:43:38.997: gtk_box_gadget_distribute: assertion 'size >= 0' failed in GtkScrollbar
14:43:39 [2020-08-25T18:43:39.100Z] 
14:43:39 [2020-08-25T18:43:39.100Z] (SWT:1624): Gtk-CRITICAL **: 18:43:38.998: gtk_box_gadget_distribute: assertion 'size >= 0' failed in GtkScrollbar
14:43:39 [2020-08-25T18:43:39.100Z] 
14:43:39 [2020-08-25T18:43:39.100Z] (SWT:1624): Gtk-CRITICAL **: 18:43:38.999: gtk_box_gadget_distribute: assertion 'size >= 0' failed in GtkScrollbar
14:43:39 [2020-08-25T18:43:39.100Z] 
14:43:39 [2020-08-25T18:43:39.100Z] (SWT:1624): Gtk-CRITICAL **: 18:43:39.006: gtk_box_gadget_distribute: assertion 'size >= 0' failed in GtkScrollbar
14:43:39 [2020-08-25T18:43:39.100Z] 
14:43:39 [2020-08-25T18:43:39.100Z] (SWT:1624): Gtk-CRITICAL **: 18:43:39.006: gtk_box_gadget_distribute: assertion 'size >= 0' failed in GtkScrollbar
14:43:39 [2020-08-25T18:43:39.100Z] 
14:43:39 [2020-08-25T18:43:39.100Z] (SWT:1624): Gtk-CRITICAL **: 18:43:39.014: gtk_box_gadget_distribute: assertion 'size >= 0' failed in GtkScrollbar
14:43:39 [2020-08-25T18:43:39.100Z] 
14:43:39 [2020-08-25T18:43:39.100Z] (SWT:1624): Gtk-CRITICAL **: 18:43:39.021: gtk_box_gadget_distribute: assertion 'size >= 0' failed in GtkScrollbar
14:43:39 [2020-08-25T18:43:39.100Z] 
14:43:39 [2020-08-25T18:43:39.100Z] (SWT:1624): Gtk-CRITICAL **: 18:43:39.021: gtk_box_gadget_distribute: assertion 'size >= 0' failed in GtkScrollbar
14:43:39 [2020-08-25T18:43:39.100Z] 
14:43:39 [2020-08-25T18:43:39.100Z] (SWT:1624): Gtk-CRITICAL **: 18:43:39.036: gtk_box_gadget_distribute: assertion 'size >= 0' failed in GtkScrollbar
14:43:39 [2020-08-25T18:43:39.100Z] 
14:43:39 [2020-08-25T18:43:39.100Z] (SWT:1624): Gtk-CRITICAL **: 18:43:39.036: gtk_box_gadget_distribute: assertion 'size >= 0' failed in GtkScrollbar
14:43:39 [2020-08-25T18:43:39.100Z] 
14:43:39 [2020-08-25T18:43:39.100Z] (SWT:1624): Gtk-CRITICAL **: 18:43:39.053: gtk_box_gadget_distribute: assertion 'size >= 0' failed in GtkScrollbar
14:43:39 [2020-08-25T18:43:39.100Z] 
14:43:39 [2020-08-25T18:43:39.100Z] (SWT:1624): Gtk-CRITICAL **: 18:43:39.053: gtk_box_gadget_distribute: assertion 'size >= 0' failed in GtkScrollbar
14:43:39 [2020-08-25T18:43:39.100Z] 
14:43:39 [2020-08-25T18:43:39.100Z] (SWT:1624): Gtk-CRITICAL **: 18:43:39.070: gtk_box_gadget_distribute: assertion 'size >= 0' failed in GtkScrollbar
14:43:39 [2020-08-25T18:43:39.100Z] 
14:43:39 [2020-08-25T18:43:39.100Z] (SWT:1624): Gtk-CRITICAL **: 18:43:39.070: gtk_box_gadget_distribute: assertion 'size >= 0' failed in GtkScrollbar
14:43:39 [2020-08-25T18:43:39.100Z] 
14:43:39 [2020-08-25T18:43:39.100Z] (SWT:1624): Gtk-CRITICAL **: 18:43:39.086: gtk_box_gadget_distribute: assertion 'size >= 0' failed in GtkScrollbar
14:43:39 [2020-08-25T18:43:39.100Z] 
14:43:39 [2020-08-25T18:43:39.100Z] (SWT:1624): Gtk-CRITICAL **: 18:43:39.086: gtk_box_gadget_distribute: assertion 'size >= 0' failed in GtkScrollbar
14:43:39 [2020-08-25T18:43:39.371Z] 
14:43:39 [2020-08-25T18:43:39.371Z] (SWT:1624): Gtk-CRITICAL **: 18:43:39.103: gtk_box_gadget_distribute: assertion 'size >= 0' failed in GtkScrollbar
14:43:39 [2020-08-25T18:43:39.371Z] 
14:43:39 [2020-08-25T18:43:39.371Z] (SWT:1624): Gtk-CRITICAL **: 18:43:39.103: gtk_box_gadget_distribute: assertion 'size >= 0' failed in GtkScrollbar
14:43:39 [2020-08-25T18:43:39.371Z] 
14:43:39 [2020-08-25T18:43:39.371Z] (SWT:1624): Gtk-CRITICAL **: 18:43:39.119: gtk_box_gadget_distribute: assertion 'size >= 0' failed in GtkScrollbar
14:43:39 [2020-08-25T18:43:39.371Z] 
14:43:39 [2020-08-25T18:43:39.371Z] (SWT:1624): Gtk-CRITICAL **: 18:43:39.120: gtk_box_gadget_distribute: assertion 'size >= 0' failed in GtkScrollbar
14:43:39 [2020-08-25T18:43:39.371Z] 
14:43:39 [2020-08-25T18:43:39.371Z] (SWT:1624): Gtk-CRITICAL **: 18:43:39.133: gtk_box_gadget_distribute: assertion 'size >= 0' failed in GtkScrollbar
14:43:39 [2020-08-25T18:43:39.371Z] 
14:43:39 [2020-08-25T18:43:39.371Z] (SWT:1624): Gtk-CRITICAL **: 18:43:39.134: gtk_box_gadget_distribute: assertion 'size >= 0' failed in GtkScrollbar
14:43:39 [2020-08-25T18:43:39.371Z] 
14:43:39 [2020-08-25T18:43:39.371Z] (SWT:1624): Gtk-CRITICAL **: 18:43:39.138: gtk_box_gadget_distribute: assertion 'size >= 0' failed in GtkScrollbar
14:43:39 [2020-08-25T18:43:39.371Z] 
14:43:39 [2020-08-25T18:43:39.371Z] (SWT:1624): Gtk-CRITICAL **: 18:43:39.138: gtk_box_gadget_distribute: assertion 'size >= 0' failed in GtkScrollbar
14:43:39 [2020-08-25T18:43:39.371Z] 
14:43:39 [2020-08-25T18:43:39.371Z] (SWT:1624): Gtk-CRITICAL **: 18:43:39.143: gtk_box_gadget_distribute: assertion 'size >= 0' failed in GtkScrollbar
14:43:39 [2020-08-25T18:43:39.371Z] 
14:43:39 [2020-08-25T18:43:39.372Z] (SWT:1624): Gtk-CRITICAL **: 18:43:39.144: gtk_box_gadget_distribute: assertion 'size >= 0' failed in GtkScrollbar
14:43:39 [2020-08-25T18:43:39.372Z] 
14:43:39 [2020-08-25T18:43:39.372Z] (SWT:1624): Gtk-CRITICAL **: 18:43:39.144: gtk_box_gadget_distribute: assertion 'size >= 0' failed in GtkScrollbar
14:43:39 [2020-08-25T18:43:39.372Z] 
14:43:39 [2020-08-25T18:43:39.372Z] (SWT:1624): Gtk-CRITICAL **: 18:43:39.148: gtk_box_gadget_distribute: assertion 'size >= 0' failed in GtkScrollbar
14:43:39 [2020-08-25T18:43:39.372Z] 
14:43:39 [2020-08-25T18:43:39.372Z] (SWT:1624): Gtk-CRITICAL **: 18:43:39.155: gtk_box_gadget_distribute: assertion 'size >= 0' failed in GtkScrollbar
14:43:39 [2020-08-25T18:43:39.372Z] 
14:43:39 [2020-08-25T18:43:39.372Z] (SWT:1624): Gtk-CRITICAL **: 18:43:39.155: gtk_box_gadget_distribute: assertion 'size >= 0' failed in GtkScrollbar
14:43:39 [2020-08-25T18:43:39.372Z] 
14:43:39 [2020-08-25T18:43:39.372Z] (SWT:1624): Gtk-CRITICAL **: 18:43:39.159: gtk_box_gadget_distribute: assertion 'size >= 0' failed in GtkScrollbar
14:43:39 [2020-08-25T18:43:39.372Z] 
14:43:39 [2020-08-25T18:43:39.372Z] (SWT:1624): Gtk-CRITICAL **: 18:43:39.160: gtk_box_gadget_distribute: assertion 'size >= 0' failed in GtkScrollbar
14:43:39 [2020-08-25T18:43:39.372Z] 
14:43:39 [2020-08-25T18:43:39.372Z] (SWT:1624): Gtk-CRITICAL **: 18:43:39.161: gtk_box_gadget_distribute: assertion 'size >= 0' failed in GtkScrollbar
14:43:39 [2020-08-25T18:43:39.372Z] 
14:43:39 [2020-08-25T18:43:39.372Z] (SWT:1624): Gtk-CRITICAL **: 18:43:39.183: gtk_box_gadget_distribute: assertion 'size >= 0' failed in GtkScrollbar
14:43:39 [2020-08-25T18:43:39.372Z] 
14:43:39 [2020-08-25T18:43:39.372Z] (SWT:1624): Gtk-WARNING **: 18:43:39.199: Negative content width -6 (allocation 1, extents 4x3) while allocating gadget (node toolbar, owner GtkToolbar)
14:43:39 [2020-08-25T18:43:39.979Z] 
14:43:39 [2020-08-25T18:43:39.979Z] (SWT:1624): Gtk-WARNING **: 18:43:39.794: Negative content width -6 (allocation 1, extents 4x3) while allocating gadget (node toolbar, owner GtkToolbar)
14:43:39 [2020-08-25T18:43:39.979Z] 
14:43:39 [2020-08-25T18:43:39.979Z] (SWT:1624): Gtk-WARNING **: 18:43:39.803: Negative content width -6 (allocation 1, extents 4x3) while allocating gadget (node toolbar, owner GtkToolbar)
14:43:40 [2020-08-25T18:43:40.545Z] 
14:43:40 [2020-08-25T18:43:40.545Z] (SWT:1624): Gtk-WARNING **: 18:43:40.380: Negative content width -6 (allocation 1, extents 4x3) while allocating gadget (node toolbar, owner GtkToolbar)
14:43:40 [2020-08-25T18:43:40.802Z] 
14:43:40 [2020-08-25T18:43:40.802Z] (SWT:1624): Gtk-CRITICAL **: 18:43:40.658: gtk_box_gadget_distribute: assertion 'size >= 0' failed in GtkScrollbar
14:43:40 [2020-08-25T18:43:40.802Z] 
14:43:40 [2020-08-25T18:43:40.802Z] (SWT:1624): Gtk-CRITICAL **: 18:43:40.665: gtk_box_gadget_distribute: assertion 'size >= 0' failed in GtkScrollbar
14:43:40 [2020-08-25T18:43:40.802Z] 
14:43:40 [2020-08-25T18:43:40.802Z] (SWT:1624): Gtk-WARNING **: 18:43:40.668: Negative content width -6 (allocation 1, extents 4x3) while allocating gadget (node toolbar, owner GtkToolbar)
14:43:40 [2020-08-25T18:43:40.802Z] 
14:43:40 [2020-08-25T18:43:40.802Z] (SWT:1624): Gtk-CRITICAL **: 18:43:40.675: gtk_box_gadget_distribute: assertion 'size >= 0' failed in GtkScrollbar
14:43:40 [2020-08-25T18:43:40.802Z] 
14:43:40 [2020-08-25T18:43:40.802Z] (SWT:1624): Gtk-CRITICAL **: 18:43:40.680: gtk_box_gadget_distribute: assertion 'size >= 0' failed in GtkScrollbar
14:43:40 [2020-08-25T18:43:40.802Z] 
14:43:40 [2020-08-25T18:43:40.802Z] (SWT:1624): Gtk-CRITICAL **: 18:43:40.681: gtk_box_gadget_distribute: assertion 'size >= 0' failed in GtkScrollbar
14:43:40 [2020-08-25T18:43:40.802Z] 
14:43:40 [2020-08-25T18:43:40.802Z] (SWT:1624): Gtk-CRITICAL **: 18:43:40.682: gtk_box_gadget_distribute: assertion 'size >= 0' failed in GtkScrollbar
14:43:40 [2020-08-25T18:43:40.802Z] 
14:43:40 [2020-08-25T18:43:40.802Z] (SWT:1624): Gtk-CRITICAL **: 18:43:40.689: gtk_box_gadget_distribute: assertion 'size >= 0' failed in GtkScrollbar
14:43:40 [2020-08-25T18:43:40.802Z] 
14:43:40 [2020-08-25T18:43:40.802Z] (SWT:1624): Gtk-CRITICAL **: 18:43:40.689: gtk_box_gadget_distribute: assertion 'size >= 0' failed in GtkScrollbar
14:43:40 [2020-08-25T18:43:40.802Z] 
14:43:40 [2020-08-25T18:43:40.802Z] (SWT:1624): Gtk-CRITICAL **: 18:43:40.703: gtk_box_gadget_distribute: assertion 'size >= 0' failed in GtkScrollbar
14:43:40 [2020-08-25T18:43:40.802Z] 
14:43:40 [2020-08-25T18:43:40.802Z] (SWT:1624): Gtk-CRITICAL **: 18:43:40.703: gtk_box_gadget_distribute: assertion 'size >= 0' failed in GtkScrollbar
14:43:40 [2020-08-25T18:43:40.802Z] 
14:43:40 [2020-08-25T18:43:40.802Z] (SWT:1624): Gtk-CRITICAL **: 18:43:40.709: gtk_box_gadget_distribute: assertion 'size >= 0' failed in GtkScrollbar
14:43:40 [2020-08-25T18:43:40.802Z] 
14:43:40 [2020-08-25T18:43:40.802Z] (SWT:1624): Gtk-CRITICAL **: 18:43:40.719: gtk_box_gadget_distribute: assertion 'size >= 0' failed in GtkScrollbar
14:43:40 [2020-08-25T18:43:40.802Z] 
14:43:40 [2020-08-25T18:43:40.802Z] (SWT:1624): Gtk-CRITICAL **: 18:43:40.719: gtk_box_gadget_distribute: assertion 'size >= 0' failed in GtkScrollbar
14:43:40 [2020-08-25T18:43:40.802Z] 
14:43:40 [2020-08-25T18:43:40.802Z] (SWT:1624): Gtk-CRITICAL **: 18:43:40.736: gtk_box_gadget_distribute: assertion 'size >= 0' failed in GtkScrollbar
14:43:40 [2020-08-25T18:43:40.802Z] 
14:43:40 [2020-08-25T18:43:40.802Z] (SWT:1624): Gtk-CRITICAL **: 18:43:40.736: gtk_box_gadget_distribute: assertion 'size >= 0' failed in GtkScrollbar
14:43:40 [2020-08-25T18:43:40.802Z] 
14:43:40 [2020-08-25T18:43:40.802Z] (SWT:1624): Gtk-CRITICAL **: 18:43:40.753: gtk_box_gadget_distribute: assertion 'size >= 0' failed in GtkScrollbar
14:43:40 [2020-08-25T18:43:40.802Z] 
14:43:40 [2020-08-25T18:43:40.802Z] (SWT:1624): Gtk-CRITICAL **: 18:43:40.753: gtk_box_gadget_distribute: assertion 'size >= 0' failed in GtkScrollbar
14:43:40 [2020-08-25T18:43:40.802Z] 
14:43:40 [2020-08-25T18:43:40.803Z] (SWT:1624): Gtk-CRITICAL **: 18:43:40.769: gtk_box_gadget_distribute: assertion 'size >= 0' failed in GtkScrollbar
14:43:40 [2020-08-25T18:43:40.803Z] 
14:43:40 [2020-08-25T18:43:40.803Z] (SWT:1624): Gtk-CRITICAL **: 18:43:40.769: gtk_box_gadget_distribute: assertion 'size >= 0' failed in GtkScrollbar
14:43:40 [2020-08-25T18:43:40.803Z] 
14:43:40 [2020-08-25T18:43:40.803Z] (SWT:1624): Gtk-CRITICAL **: 18:43:40.786: gtk_box_gadget_distribute: assertion 'size >= 0' failed in GtkScrollbar
14:43:40 [2020-08-25T18:43:40.803Z] 
14:43:40 [2020-08-25T18:43:40.803Z] (SWT:1624): Gtk-CRITICAL **: 18:43:40.786: gtk_box_gadget_distribute: assertion 'size >= 0' failed in GtkScrollbar
14:43:41 [2020-08-25T18:43:41.060Z] 
14:43:41 [2020-08-25T18:43:41.060Z] (SWT:1624): Gtk-CRITICAL **: 18:43:40.803: gtk_box_gadget_distribute: assertion 'size >= 0' failed in GtkScrollbar
14:43:41 [2020-08-25T18:43:41.060Z] 
14:43:41 [2020-08-25T18:43:41.060Z] (SWT:1624): Gtk-CRITICAL **: 18:43:40.803: gtk_box_gadget_distribute: assertion 'size >= 0' failed in GtkScrollbar
14:43:41 [2020-08-25T18:43:41.060Z] 
14:43:41 [2020-08-25T18:43:41.060Z] (SWT:1624): Gtk-CRITICAL **: 18:43:40.811: gtk_box_gadget_distribute: assertion 'size >= 0' failed in GtkScrollbar
14:43:41 [2020-08-25T18:43:41.060Z] 
14:43:41 [2020-08-25T18:43:41.060Z] (SWT:1624): Gtk-CRITICAL **: 18:43:40.812: gtk_box_gadget_distribute: assertion 'size >= 0' failed in GtkScrollbar
14:43:41 [2020-08-25T18:43:41.060Z] 
14:43:41 [2020-08-25T18:43:41.060Z] (SWT:1624): Gtk-CRITICAL **: 18:43:40.816: gtk_box_gadget_distribute: assertion 'size >= 0' failed in GtkScrollbar
14:43:41 [2020-08-25T18:43:41.060Z] 
14:43:41 [2020-08-25T18:43:41.060Z] (SWT:1624): Gtk-CRITICAL **: 18:43:40.816: gtk_box_gadget_distribute: assertion 'size >= 0' failed in GtkScrollbar
14:43:41 [2020-08-25T18:43:41.060Z] 
14:43:41 [2020-08-25T18:43:41.060Z] (SWT:1624): Gtk-CRITICAL **: 18:43:40.816: gtk_box_gadget_distribute: assertion 'size >= 0' failed in GtkScrollbar
14:43:41 [2020-08-25T18:43:41.060Z] 
14:43:41 [2020-08-25T18:43:41.060Z] (SWT:1624): Gtk-CRITICAL **: 18:43:40.821: gtk_box_gadget_distribute: assertion 'size >= 0' failed in GtkScrollbar
14:43:41 [2020-08-25T18:43:41.060Z] 
14:43:41 [2020-08-25T18:43:41.060Z] (SWT:1624): Gtk-CRITICAL **: 18:43:40.821: gtk_box_gadget_distribute: assertion 'size >= 0' failed in GtkScrollbar
14:43:41 [2020-08-25T18:43:41.060Z] 
14:43:41 [2020-08-25T18:43:41.060Z] (SWT:1624): Gtk-CRITICAL **: 18:43:40.826: gtk_box_gadget_distribute: assertion 'size >= 0' failed in GtkScrollbar
14:43:41 [2020-08-25T18:43:41.060Z] 
14:43:41 [2020-08-25T18:43:41.060Z] (SWT:1624): Gtk-CRITICAL **: 18:43:40.836: gtk_box_gadget_distribute: assertion 'size >= 0' failed in GtkScrollbar
14:43:41 [2020-08-25T18:43:41.060Z] 
14:43:41 [2020-08-25T18:43:41.060Z] (SWT:1624): Gtk-CRITICAL **: 18:43:40.836: gtk_box_gadget_distribute: assertion 'size >= 0' failed in GtkScrollbar
14:43:41 [2020-08-25T18:43:41.060Z] 
14:43:41 [2020-08-25T18:43:41.060Z] (SWT:1624): Gtk-CRITICAL **: 18:43:40.853: gtk_box_gadget_distribute: assertion 'size >= 0' failed in GtkScrollbar
14:43:41 [2020-08-25T18:43:41.060Z] 
14:43:41 [2020-08-25T18:43:41.060Z] (SWT:1624): Gtk-CRITICAL **: 18:43:40.853: gtk_box_gadget_distribute: assertion 'size >= 0' failed in GtkScrollbar
14:43:41 [2020-08-25T18:43:41.060Z] 
14:43:41 [2020-08-25T18:43:41.060Z] (SWT:1624): Gtk-CRITICAL **: 18:43:40.869: gtk_box_gadget_distribute: assertion 'size >= 0' failed in GtkScrollbar
14:43:41 [2020-08-25T18:43:41.060Z] 
14:43:41 [2020-08-25T18:43:41.060Z] (SWT:1624): Gtk-CRITICAL **: 18:43:40.869: gtk_box_gadget_distribute: assertion 'size >= 0' failed in GtkScrollbar
14:43:41 [2020-08-25T18:43:41.060Z] 
14:43:41 [2020-08-25T18:43:41.060Z] (SWT:1624): Gtk-CRITICAL **: 18:43:40.891: gtk_box_gadget_distribute: assertion 'size >= 0' failed in GtkScrollbar
14:43:41 [2020-08-25T18:43:41.060Z] 
14:43:41 [2020-08-25T18:43:41.060Z] (SWT:1624): Gtk-CRITICAL **: 18:43:40.897: gtk_box_gadget_distribute: assertion 'size >= 0' failed in GtkScrollbar
14:43:41 [2020-08-25T18:43:41.060Z] 
14:43:41 [2020-08-25T18:43:41.060Z] (SWT:1624): Gtk-CRITICAL **: 18:43:40.897: gtk_box_gadget_distribute: assertion 'size >= 0' failed in GtkScrollbar
14:43:41 [2020-08-25T18:43:41.060Z] 
14:43:41 [2020-08-25T18:43:41.060Z] (SWT:1624): Gtk-WARNING **: 18:43:40.965: Negative content width -6 (allocation 1, extents 4x3) while allocating gadget (node toolbar, owner GtkToolbar)
14:43:41 [2020-08-25T18:43:41.624Z] 
14:43:41 [2020-08-25T18:43:41.624Z] (SWT:1624): Gtk-WARNING **: 18:43:41.399: Negative content width -6 (allocation 1, extents 4x3) while allocating gadget (node toolbar, owner GtkToolbar)
14:43:41 [2020-08-25T18:43:41.624Z] 
14:43:41 [2020-08-25T18:43:41.624Z] (SWT:1624): Gtk-WARNING **: 18:43:41.408: Negative content width -6 (allocation 1, extents 4x3) while allocating gadget (node toolbar, owner GtkToolbar)
14:43:42 [2020-08-25T18:43:42.189Z] 
14:43:42 [2020-08-25T18:43:42.189Z] (SWT:1624): Gtk-WARNING **: 18:43:42.007: Negative content width -6 (allocation 1, extents 4x3) while allocating gadget (node toolbar, owner GtkToolbar)
14:43:42 [2020-08-25T18:43:42.754Z] 
14:43:42 [2020-08-25T18:43:42.754Z] (SWT:1624): Gtk-CRITICAL **: 18:43:42.453: gtk_box_gadget_distribute: assertion 'size >= 0' failed in GtkScrollbar
14:43:42 [2020-08-25T18:43:42.754Z] 
14:43:42 [2020-08-25T18:43:42.754Z] (SWT:1624): Gtk-CRITICAL **: 18:43:42.460: gtk_box_gadget_distribute: assertion 'size >= 0' failed in GtkScrollbar
14:43:42 [2020-08-25T18:43:42.754Z] 
14:43:42 [2020-08-25T18:43:42.754Z] (SWT:1624): Gtk-WARNING **: 18:43:42.463: Negative content width -6 (allocation 1, extents 4x3) while allocating gadget (node toolbar, owner GtkToolbar)
14:43:42 [2020-08-25T18:43:42.754Z] 
14:43:42 [2020-08-25T18:43:42.754Z] (SWT:1624): Gtk-CRITICAL **: 18:43:42.470: gtk_box_gadget_distribute: assertion 'size >= 0' failed in GtkScrollbar
14:43:42 [2020-08-25T18:43:42.754Z] 
14:43:42 [2020-08-25T18:43:42.754Z] (SWT:1624): Gtk-CRITICAL **: 18:43:42.475: gtk_box_gadget_distribute: assertion 'size >= 0' failed in GtkScrollbar
14:43:42 [2020-08-25T18:43:42.754Z] 
14:43:42 [2020-08-25T18:43:42.754Z] (SWT:1624): Gtk-CRITICAL **: 18:43:42.476: gtk_box_gadget_distribute: assertion 'size >= 0' failed in GtkScrollbar
14:43:42 [2020-08-25T18:43:42.754Z] 
14:43:42 [2020-08-25T18:43:42.754Z] (SWT:1624): Gtk-CRITICAL **: 18:43:42.476: gtk_box_gadget_distribute: assertion 'size >= 0' failed in GtkScrollbar
14:43:42 [2020-08-25T18:43:42.754Z] 
14:43:42 [2020-08-25T18:43:42.754Z] (SWT:1624): Gtk-CRITICAL **: 18:43:42.483: gtk_box_gadget_distribute: assertion 'size >= 0' failed in GtkScrollbar
14:43:42 [2020-08-25T18:43:42.754Z] 
14:43:42 [2020-08-25T18:43:42.754Z] (SWT:1624): Gtk-CRITICAL **: 18:43:42.484: gtk_box_gadget_distribute: assertion 'size >= 0' failed in GtkScrollbar
14:43:42 [2020-08-25T18:43:42.754Z] 
14:43:42 [2020-08-25T18:43:42.754Z] (SWT:1624): Gtk-CRITICAL **: 18:43:42.497: gtk_box_gadget_distribute: assertion 'size >= 0' failed in GtkScrollbar
14:43:42 [2020-08-25T18:43:42.754Z] 
14:43:42 [2020-08-25T18:43:42.754Z] (SWT:1624): Gtk-CRITICAL **: 18:43:42.508: gtk_box_gadget_distribute: assertion 'size >= 0' failed in GtkScrollbar
14:43:42 [2020-08-25T18:43:42.754Z] 
14:43:42 [2020-08-25T18:43:42.754Z] (SWT:1624): Gtk-CRITICAL **: 18:43:42.508: gtk_box_gadget_distribute: assertion 'size >= 0' failed in GtkScrollbar
14:43:42 [2020-08-25T18:43:42.754Z] 
14:43:42 [2020-08-25T18:43:42.754Z] (SWT:1624): Gtk-CRITICAL **: 18:43:42.525: gtk_box_gadget_distribute: assertion 'size >= 0' failed in GtkScrollbar
14:43:42 [2020-08-25T18:43:42.754Z] 
14:43:42 [2020-08-25T18:43:42.754Z] (SWT:1624): Gtk-CRITICAL **: 18:43:42.525: gtk_box_gadget_distribute: assertion 'size >= 0' failed in GtkScrollbar
14:43:42 [2020-08-25T18:43:42.754Z] 
14:43:42 [2020-08-25T18:43:42.754Z] (SWT:1624): Gtk-CRITICAL **: 18:43:42.541: gtk_box_gadget_distribute: assertion 'size >= 0' failed in GtkScrollbar
14:43:42 [2020-08-25T18:43:42.754Z] 
14:43:42 [2020-08-25T18:43:42.754Z] (SWT:1624): Gtk-CRITICAL **: 18:43:42.541: gtk_box_gadget_distribute: assertion 'size >= 0' failed in GtkScrollbar
14:43:42 [2020-08-25T18:43:42.754Z] 
14:43:42 [2020-08-25T18:43:42.754Z] (SWT:1624): Gtk-CRITICAL **: 18:43:42.558: gtk_box_gadget_distribute: assertion 'size >= 0' failed in GtkScrollbar
14:43:42 [2020-08-25T18:43:42.754Z] 
14:43:42 [2020-08-25T18:43:42.754Z] (SWT:1624): Gtk-CRITICAL **: 18:43:42.558: gtk_box_gadget_distribute: assertion 'size >= 0' failed in GtkScrollbar
14:43:42 [2020-08-25T18:43:42.754Z] 
14:43:42 [2020-08-25T18:43:42.754Z] (SWT:1624): Gtk-CRITICAL **: 18:43:42.574: gtk_box_gadget_distribute: assertion 'size >= 0' failed in GtkScrollbar
14:43:42 [2020-08-25T18:43:42.754Z] 
14:43:42 [2020-08-25T18:43:42.754Z] (SWT:1624): Gtk-CRITICAL **: 18:43:42.574: gtk_box_gadget_distribute: assertion 'size >= 0' failed in GtkScrollbar
14:43:42 [2020-08-25T18:43:42.754Z] 
14:43:42 [2020-08-25T18:43:42.754Z] (SWT:1624): Gtk-CRITICAL **: 18:43:42.591: gtk_box_gadget_distribute: assertion 'size >= 0' failed in GtkScrollbar
14:43:42 [2020-08-25T18:43:42.754Z] 
14:43:42 [2020-08-25T18:43:42.754Z] (SWT:1624): Gtk-CRITICAL **: 18:43:42.591: gtk_box_gadget_distribute: assertion 'size >= 0' failed in GtkScrollbar
14:43:42 [2020-08-25T18:43:42.754Z] 
14:43:42 [2020-08-25T18:43:42.754Z] (SWT:1624): Gtk-CRITICAL **: 18:43:42.599: gtk_box_gadget_distribute: assertion 'size >= 0' failed in GtkScrollbar
14:43:42 [2020-08-25T18:43:42.754Z] 
14:43:42 [2020-08-25T18:43:42.754Z] (SWT:1624): Gtk-CRITICAL **: 18:43:42.600: gtk_box_gadget_distribute: assertion 'size >= 0' failed in GtkScrollbar
14:43:42 [2020-08-25T18:43:42.754Z] 
14:43:42 [2020-08-25T18:43:42.754Z] (SWT:1624): Gtk-CRITICAL **: 18:43:42.604: gtk_box_gadget_distribute: assertion 'size >= 0' failed in GtkScrollbar
14:43:42 [2020-08-25T18:43:42.754Z] 
14:43:42 [2020-08-25T18:43:42.754Z] (SWT:1624): Gtk-CRITICAL **: 18:43:42.604: gtk_box_gadget_distribute: assertion 'size >= 0' failed in GtkScrollbar
14:43:42 [2020-08-25T18:43:42.754Z] 
14:43:42 [2020-08-25T18:43:42.754Z] (SWT:1624): Gtk-CRITICAL **: 18:43:42.605: gtk_box_gadget_distribute: assertion 'size >= 0' failed in GtkScrollbar
14:43:42 [2020-08-25T18:43:42.754Z] 
14:43:42 [2020-08-25T18:43:42.754Z] (SWT:1624): Gtk-CRITICAL **: 18:43:42.609: gtk_box_gadget_distribute: assertion 'size >= 0' failed in GtkScrollbar
14:43:42 [2020-08-25T18:43:42.754Z] 
14:43:42 [2020-08-25T18:43:42.754Z] (SWT:1624): Gtk-CRITICAL **: 18:43:42.609: gtk_box_gadget_distribute: assertion 'size >= 0' failed in GtkScrollbar
14:43:42 [2020-08-25T18:43:42.754Z] 
14:43:42 [2020-08-25T18:43:42.754Z] (SWT:1624): Gtk-CRITICAL **: 18:43:42.614: gtk_box_gadget_distribute: assertion 'size >= 0' failed in GtkScrollbar
14:43:42 [2020-08-25T18:43:42.754Z] 
14:43:42 [2020-08-25T18:43:42.754Z] (SWT:1624): Gtk-CRITICAL **: 18:43:42.624: gtk_box_gadget_distribute: assertion 'size >= 0' failed in GtkScrollbar
14:43:42 [2020-08-25T18:43:42.754Z] 
14:43:42 [2020-08-25T18:43:42.754Z] (SWT:1624): Gtk-CRITICAL **: 18:43:42.625: gtk_box_gadget_distribute: assertion 'size >= 0' failed in GtkScrollbar
14:43:42 [2020-08-25T18:43:42.754Z] 
14:43:42 [2020-08-25T18:43:42.754Z] (SWT:1624): Gtk-CRITICAL **: 18:43:42.629: gtk_box_gadget_distribute: assertion 'size >= 0' failed in GtkScrollbar
14:43:42 [2020-08-25T18:43:42.754Z] 
14:43:42 [2020-08-25T18:43:42.754Z] (SWT:1624): Gtk-CRITICAL **: 18:43:42.630: gtk_box_gadget_distribute: assertion 'size >= 0' failed in GtkScrollbar
14:43:42 [2020-08-25T18:43:42.754Z] 
14:43:42 [2020-08-25T18:43:42.754Z] (SWT:1624): Gtk-CRITICAL **: 18:43:42.634: gtk_box_gadget_distribute: assertion 'size >= 0' failed in GtkScrollbar
14:43:42 [2020-08-25T18:43:42.755Z] 
14:43:42 [2020-08-25T18:43:42.755Z] (SWT:1624): Gtk-CRITICAL **: 18:43:42.656: gtk_box_gadget_distribute: assertion 'size >= 0' failed in GtkScrollbar
14:43:42 [2020-08-25T18:43:42.755Z] 
14:43:42 [2020-08-25T18:43:42.755Z] (SWT:1624): Gtk-WARNING **: 18:43:42.676: Negative content width -6 (allocation 1, extents 4x3) while allocating gadget (node toolbar, owner GtkToolbar)
14:43:43 [2020-08-25T18:43:43.011Z] 
14:43:43 [2020-08-25T18:43:43.011Z] (SWT:1624): Gtk-WARNING **: 18:43:43.002: Negative content width -6 (allocation 1, extents 4x3) while allocating gadget (node toolbar, owner GtkToolbar)
14:43:43 [2020-08-25T18:43:43.269Z] 
14:43:43 [2020-08-25T18:43:43.269Z] (SWT:1624): Gtk-WARNING **: 18:43:43.021: Negative content width -6 (allocation 1, extents 4x3) while allocating gadget (node toolbar, owner GtkToolbar)
14:43:43 [2020-08-25T18:43:43.833Z] 
14:43:43 [2020-08-25T18:43:43.833Z] (SWT:1624): Gtk-WARNING **: 18:43:43.600: Negative content width -6 (allocation 1, extents 4x3) while allocating gadget (node toolbar, owner GtkToolbar)
14:43:44 [2020-08-25T18:43:44.091Z] 
14:43:44 [2020-08-25T18:43:44.091Z] (SWT:1624): Gtk-CRITICAL **: 18:43:44.057: gtk_box_gadget_distribute: assertion 'size >= 0' failed in GtkScrollbar
14:43:44 [2020-08-25T18:43:44.091Z] 
14:43:44 [2020-08-25T18:43:44.091Z] (SWT:1624): Gtk-CRITICAL **: 18:43:44.064: gtk_box_gadget_distribute: assertion 'size >= 0' failed in GtkScrollbar
14:43:44 [2020-08-25T18:43:44.091Z] 
14:43:44 [2020-08-25T18:43:44.091Z] (SWT:1624): Gtk-WARNING **: 18:43:44.067: Negative content width -6 (allocation 1, extents 4x3) while allocating gadget (node toolbar, owner GtkToolbar)
14:43:44 [2020-08-25T18:43:44.091Z] 
14:43:44 [2020-08-25T18:43:44.091Z] (SWT:1624): Gtk-CRITICAL **: 18:43:44.073: gtk_box_gadget_distribute: assertion 'size >= 0' failed in GtkScrollbar
14:43:44 [2020-08-25T18:43:44.091Z] 
14:43:44 [2020-08-25T18:43:44.091Z] (SWT:1624): Gtk-CRITICAL **: 18:43:44.079: gtk_box_gadget_distribute: assertion 'size >= 0' failed in GtkScrollbar
14:43:44 [2020-08-25T18:43:44.091Z] 
14:43:44 [2020-08-25T18:43:44.091Z] (SWT:1624): Gtk-CRITICAL **: 18:43:44.080: gtk_box_gadget_distribute: assertion 'size >= 0' failed in GtkScrollbar
14:43:44 [2020-08-25T18:43:44.091Z] 
14:43:44 [2020-08-25T18:43:44.091Z] (SWT:1624): Gtk-CRITICAL **: 18:43:44.080: gtk_box_gadget_distribute: assertion 'size >= 0' failed in GtkScrollbar
14:43:44 [2020-08-25T18:43:44.348Z] 
14:43:44 [2020-08-25T18:43:44.349Z] (SWT:1624): Gtk-CRITICAL **: 18:43:44.088: gtk_box_gadget_distribute: assertion 'size >= 0' failed in GtkScrollbar
14:43:44 [2020-08-25T18:43:44.349Z] 
14:43:44 [2020-08-25T18:43:44.349Z] (SWT:1624): Gtk-CRITICAL **: 18:43:44.088: gtk_box_gadget_distribute: assertion 'size >= 0' failed in GtkScrollbar
14:43:44 [2020-08-25T18:43:44.349Z] 
14:43:44 [2020-08-25T18:43:44.349Z] (SWT:1624): Gtk-CRITICAL **: 18:43:44.097: gtk_box_gadget_distribute: assertion 'size >= 0' failed in GtkScrollbar
14:43:44 [2020-08-25T18:43:44.349Z] 
14:43:44 [2020-08-25T18:43:44.349Z] (SWT:1624): Gtk-CRITICAL **: 18:43:44.113: gtk_box_gadget_distribute: assertion 'size >= 0' failed in GtkScrollbar
14:43:44 [2020-08-25T18:43:44.349Z] 
14:43:44 [2020-08-25T18:43:44.349Z] (SWT:1624): Gtk-CRITICAL **: 18:43:44.113: gtk_box_gadget_distribute: assertion 'size >= 0' failed in GtkScrollbar
14:43:44 [2020-08-25T18:43:44.349Z] 
14:43:44 [2020-08-25T18:43:44.349Z] (SWT:1624): Gtk-CRITICAL **: 18:43:44.129: gtk_box_gadget_distribute: assertion 'size >= 0' failed in GtkScrollbar
14:43:44 [2020-08-25T18:43:44.349Z] 
14:43:44 [2020-08-25T18:43:44.349Z] (SWT:1624): Gtk-CRITICAL **: 18:43:44.129: gtk_box_gadget_distribute: assertion 'size >= 0' failed in GtkScrollbar
14:43:44 [2020-08-25T18:43:44.349Z] 
14:43:44 [2020-08-25T18:43:44.349Z] (SWT:1624): Gtk-CRITICAL **: 18:43:44.146: gtk_box_gadget_distribute: assertion 'size >= 0' failed in GtkScrollbar
14:43:44 [2020-08-25T18:43:44.349Z] 
14:43:44 [2020-08-25T18:43:44.349Z] (SWT:1624): Gtk-CRITICAL **: 18:43:44.146: gtk_box_gadget_distribute: assertion 'size >= 0' failed in GtkScrollbar
14:43:44 [2020-08-25T18:43:44.349Z] 
14:43:44 [2020-08-25T18:43:44.349Z] (SWT:1624): Gtk-CRITICAL **: 18:43:44.163: gtk_box_gadget_distribute: assertion 'size >= 0' failed in GtkScrollbar
14:43:44 [2020-08-25T18:43:44.349Z] 
14:43:44 [2020-08-25T18:43:44.349Z] (SWT:1624): Gtk-CRITICAL **: 18:43:44.163: gtk_box_gadget_distribute: assertion 'size >= 0' failed in GtkScrollbar
14:43:44 [2020-08-25T18:43:44.349Z] 
14:43:44 [2020-08-25T18:43:44.349Z] (SWT:1624): Gtk-CRITICAL **: 18:43:44.180: gtk_box_gadget_distribute: assertion 'size >= 0' failed in GtkScrollbar
14:43:44 [2020-08-25T18:43:44.349Z] 
14:43:44 [2020-08-25T18:43:44.349Z] (SWT:1624): Gtk-CRITICAL **: 18:43:44.180: gtk_box_gadget_distribute: assertion 'size >= 0' failed in GtkScrollbar
14:43:44 [2020-08-25T18:43:44.349Z] 
14:43:44 [2020-08-25T18:43:44.349Z] (SWT:1624): Gtk-CRITICAL **: 18:43:44.196: gtk_box_gadget_distribute: assertion 'size >= 0' failed in GtkScrollbar
14:43:44 [2020-08-25T18:43:44.349Z] 
14:43:44 [2020-08-25T18:43:44.349Z] (SWT:1624): Gtk-CRITICAL **: 18:43:44.196: gtk_box_gadget_distribute: assertion 'size >= 0' failed in GtkScrollbar
14:43:44 [2020-08-25T18:43:44.349Z] 
14:43:44 [2020-08-25T18:43:44.349Z] (SWT:1624): Gtk-CRITICAL **: 18:43:44.202: gtk_box_gadget_distribute: assertion 'size >= 0' failed in GtkScrollbar
14:43:44 [2020-08-25T18:43:44.349Z] 
14:43:44 [2020-08-25T18:43:44.349Z] (SWT:1624): Gtk-CRITICAL **: 18:43:44.203: gtk_box_gadget_distribute: assertion 'size >= 0' failed in GtkScrollbar
14:43:44 [2020-08-25T18:43:44.349Z] 
14:43:44 [2020-08-25T18:43:44.349Z] (SWT:1624): Gtk-CRITICAL **: 18:43:44.207: gtk_box_gadget_distribute: assertion 'size >= 0' failed in GtkScrollbar
14:43:44 [2020-08-25T18:43:44.349Z] 
14:43:44 [2020-08-25T18:43:44.349Z] (SWT:1624): Gtk-CRITICAL **: 18:43:44.207: gtk_box_gadget_distribute: assertion 'size >= 0' failed in GtkScrollbar
14:43:44 [2020-08-25T18:43:44.349Z] 
14:43:44 [2020-08-25T18:43:44.349Z] (SWT:1624): Gtk-CRITICAL **: 18:43:44.208: gtk_box_gadget_distribute: assertion 'size >= 0' failed in GtkScrollbar
14:43:44 [2020-08-25T18:43:44.349Z] 
14:43:44 [2020-08-25T18:43:44.349Z] (SWT:1624): Gtk-CRITICAL **: 18:43:44.211: gtk_box_gadget_distribute: assertion 'size >= 0' failed in GtkScrollbar
14:43:44 [2020-08-25T18:43:44.349Z] 
14:43:44 [2020-08-25T18:43:44.349Z] (SWT:1624): Gtk-CRITICAL **: 18:43:44.213: gtk_box_gadget_distribute: assertion 'size >= 0' failed in GtkScrollbar
14:43:44 [2020-08-25T18:43:44.349Z] 
14:43:44 [2020-08-25T18:43:44.349Z] (SWT:1624): Gtk-CRITICAL **: 18:43:44.213: gtk_box_gadget_distribute: assertion 'size >= 0' failed in GtkScrollbar
14:43:44 [2020-08-25T18:43:44.349Z] 
14:43:44 [2020-08-25T18:43:44.349Z] (SWT:1624): Gtk-CRITICAL **: 18:43:44.219: gtk_box_gadget_distribute: assertion 'size >= 0' failed in GtkScrollbar
14:43:44 [2020-08-25T18:43:44.349Z] 
14:43:44 [2020-08-25T18:43:44.349Z] (SWT:1624): Gtk-CRITICAL **: 18:43:44.219: gtk_box_gadget_distribute: assertion 'size >= 0' failed in GtkScrollbar
14:43:44 [2020-08-25T18:43:44.349Z] 
14:43:44 [2020-08-25T18:43:44.349Z] (SWT:1624): Gtk-CRITICAL **: 18:43:44.223: gtk_box_gadget_distribute: assertion 'size >= 0' failed in GtkScrollbar
14:43:44 [2020-08-25T18:43:44.349Z] 
14:43:44 [2020-08-25T18:43:44.349Z] (SWT:1624): Gtk-CRITICAL **: 18:43:44.230: gtk_box_gadget_distribute: assertion 'size >= 0' failed in GtkScrollbar
14:43:44 [2020-08-25T18:43:44.349Z] 
14:43:44 [2020-08-25T18:43:44.349Z] (SWT:1624): Gtk-CRITICAL **: 18:43:44.230: gtk_box_gadget_distribute: assertion 'size >= 0' failed in GtkScrollbar
14:43:44 [2020-08-25T18:43:44.349Z] 
14:43:44 [2020-08-25T18:43:44.349Z] (SWT:1624): Gtk-CRITICAL **: 18:43:44.253: gtk_box_gadget_distribute: assertion 'size >= 0' failed in GtkScrollbar
14:43:44 [2020-08-25T18:43:44.349Z] 
14:43:44 [2020-08-25T18:43:44.349Z] (SWT:1624): Gtk-WARNING **: 18:43:44.270: Negative content width -6 (allocation 1, extents 4x3) while allocating gadget (node toolbar, owner GtkToolbar)
14:43:44 [2020-08-25T18:43:44.914Z] 
14:43:44 [2020-08-25T18:43:44.914Z] (SWT:1624): Gtk-WARNING **: 18:43:44.899: Negative content width -6 (allocation 1, extents 4x3) while allocating gadget (node toolbar, owner GtkToolbar)
14:43:44 [2020-08-25T18:43:44.914Z] 
14:43:44 [2020-08-25T18:43:44.914Z] (SWT:1624): Gtk-WARNING **: 18:43:44.909: Negative content width -6 (allocation 1, extents 4x3) while allocating gadget (node toolbar, owner GtkToolbar)
14:43:45 [2020-08-25T18:43:45.846Z] 
14:43:45 [2020-08-25T18:43:45.846Z] (SWT:1624): Gtk-WARNING **: 18:43:45.494: Negative content width -6 (allocation 1, extents 4x3) while allocating gadget (node toolbar, owner GtkToolbar)
14:43:46 [2020-08-25T18:43:46.103Z] 
14:43:46 [2020-08-25T18:43:46.103Z] (SWT:1624): Gtk-CRITICAL **: 18:43:45.940: gtk_box_gadget_distribute: assertion 'size >= 0' failed in GtkScrollbar
14:43:46 [2020-08-25T18:43:46.103Z] 
14:43:46 [2020-08-25T18:43:46.103Z] (SWT:1624): Gtk-CRITICAL **: 18:43:45.947: gtk_box_gadget_distribute: assertion 'size >= 0' failed in GtkScrollbar
14:43:46 [2020-08-25T18:43:46.103Z] 
14:43:46 [2020-08-25T18:43:46.103Z] (SWT:1624): Gtk-WARNING **: 18:43:45.951: Negative content width -6 (allocation 1, extents 4x3) while allocating gadget (node toolbar, owner GtkToolbar)
14:43:46 [2020-08-25T18:43:46.103Z] 
14:43:46 [2020-08-25T18:43:46.103Z] (SWT:1624): Gtk-CRITICAL **: 18:43:45.957: gtk_box_gadget_distribute: assertion 'size >= 0' failed in GtkScrollbar
14:43:46 [2020-08-25T18:43:46.103Z] 
14:43:46 [2020-08-25T18:43:46.103Z] (SWT:1624): Gtk-CRITICAL **: 18:43:45.962: gtk_box_gadget_distribute: assertion 'size >= 0' failed in GtkScrollbar
14:43:46 [2020-08-25T18:43:46.103Z] 
14:43:46 [2020-08-25T18:43:46.103Z] (SWT:1624): Gtk-CRITICAL **: 18:43:45.963: gtk_box_gadget_distribute: assertion 'size >= 0' failed in GtkScrollbar
14:43:46 [2020-08-25T18:43:46.103Z] 
14:43:46 [2020-08-25T18:43:46.103Z] (SWT:1624): Gtk-CRITICAL **: 18:43:45.963: gtk_box_gadget_distribute: assertion 'size >= 0' failed in GtkScrollbar
14:43:46 [2020-08-25T18:43:46.103Z] 
14:43:46 [2020-08-25T18:43:46.103Z] (SWT:1624): Gtk-CRITICAL **: 18:43:45.970: gtk_box_gadget_distribute: assertion 'size >= 0' failed in GtkScrollbar
14:43:46 [2020-08-25T18:43:46.103Z] 
14:43:46 [2020-08-25T18:43:46.103Z] (SWT:1624): Gtk-CRITICAL **: 18:43:45.971: gtk_box_gadget_distribute: assertion 'size >= 0' failed in GtkScrollbar
14:43:46 [2020-08-25T18:43:46.103Z] 
14:43:46 [2020-08-25T18:43:46.103Z] (SWT:1624): Gtk-CRITICAL **: 18:43:45.979: gtk_box_gadget_distribute: assertion 'size >= 0' failed in GtkScrollbar
14:43:46 [2020-08-25T18:43:46.103Z] 
14:43:46 [2020-08-25T18:43:46.103Z] (SWT:1624): Gtk-CRITICAL **: 18:43:45.996: gtk_box_gadget_distribute: assertion 'size >= 0' failed in GtkScrollbar
14:43:46 [2020-08-25T18:43:46.103Z] 
14:43:46 [2020-08-25T18:43:46.103Z] (SWT:1624): Gtk-CRITICAL **: 18:43:45.996: gtk_box_gadget_distribute: assertion 'size >= 0' failed in GtkScrollbar
14:43:46 [2020-08-25T18:43:46.103Z] 
14:43:46 [2020-08-25T18:43:46.103Z] (SWT:1624): Gtk-CRITICAL **: 18:43:46.012: gtk_box_gadget_distribute: assertion 'size >= 0' failed in GtkScrollbar
14:43:46 [2020-08-25T18:43:46.103Z] 
14:43:46 [2020-08-25T18:43:46.103Z] (SWT:1624): Gtk-CRITICAL **: 18:43:46.012: gtk_box_gadget_distribute: assertion 'size >= 0' failed in GtkScrollbar
14:43:46 [2020-08-25T18:43:46.103Z] 
14:43:46 [2020-08-25T18:43:46.103Z] (SWT:1624): Gtk-CRITICAL **: 18:43:46.028: gtk_box_gadget_distribute: assertion 'size >= 0' failed in GtkScrollbar
14:43:46 [2020-08-25T18:43:46.103Z] 
14:43:46 [2020-08-25T18:43:46.103Z] (SWT:1624): Gtk-CRITICAL **: 18:43:46.028: gtk_box_gadget_distribute: assertion 'size >= 0' failed in GtkScrollbar
14:43:46 [2020-08-25T18:43:46.103Z] 
14:43:46 [2020-08-25T18:43:46.103Z] (SWT:1624): Gtk-CRITICAL **: 18:43:46.046: gtk_box_gadget_distribute: assertion 'size >= 0' failed in GtkScrollbar
14:43:46 [2020-08-25T18:43:46.103Z] 
14:43:46 [2020-08-25T18:43:46.103Z] (SWT:1624): Gtk-CRITICAL **: 18:43:46.046: gtk_box_gadget_distribute: assertion 'size >= 0' failed in GtkScrollbar
14:43:46 [2020-08-25T18:43:46.104Z] 
14:43:46 [2020-08-25T18:43:46.104Z] (SWT:1624): Gtk-CRITICAL **: 18:43:46.061: gtk_box_gadget_distribute: assertion 'size >= 0' failed in GtkScrollbar
14:43:46 [2020-08-25T18:43:46.104Z] 
14:43:46 [2020-08-25T18:43:46.104Z] (SWT:1624): Gtk-CRITICAL **: 18:43:46.062: gtk_box_gadget_distribute: assertion 'size >= 0' failed in GtkScrollbar
14:43:46 [2020-08-25T18:43:46.104Z] 
14:43:46 [2020-08-25T18:43:46.104Z] (SWT:1624): Gtk-CRITICAL **: 18:43:46.078: gtk_box_gadget_distribute: assertion 'size >= 0' failed in GtkScrollbar
14:43:46 [2020-08-25T18:43:46.104Z] 
14:43:46 [2020-08-25T18:43:46.104Z] (SWT:1624): Gtk-CRITICAL **: 18:43:46.079: gtk_box_gadget_distribute: assertion 'size >= 0' failed in GtkScrollbar
14:43:46 [2020-08-25T18:43:46.360Z] 
14:43:46 [2020-08-25T18:43:46.360Z] (SWT:1624): Gtk-CRITICAL **: 18:43:46.103: gtk_box_gadget_distribute: assertion 'size >= 0' failed in GtkScrollbar
14:43:46 [2020-08-25T18:43:46.360Z] 
14:43:46 [2020-08-25T18:43:46.360Z] (SWT:1624): Gtk-CRITICAL **: 18:43:46.103: gtk_box_gadget_distribute: assertion 'size >= 0' failed in GtkScrollbar
14:43:46 [2020-08-25T18:43:46.360Z] 
14:43:46 [2020-08-25T18:43:46.360Z] (SWT:1624): Gtk-CRITICAL **: 18:43:46.112: gtk_box_gadget_distribute: assertion 'size >= 0' failed in GtkScrollbar
14:43:46 [2020-08-25T18:43:46.360Z] 
14:43:46 [2020-08-25T18:43:46.360Z] (SWT:1624): Gtk-CRITICAL **: 18:43:46.112: gtk_box_gadget_distribute: assertion 'size >= 0' failed in GtkScrollbar
14:43:46 [2020-08-25T18:43:46.360Z] 
14:43:46 [2020-08-25T18:43:46.360Z] (SWT:1624): Gtk-CRITICAL **: 18:43:46.128: gtk_box_gadget_distribute: assertion 'size >= 0' failed in GtkScrollbar
14:43:46 [2020-08-25T18:43:46.360Z] 
14:43:46 [2020-08-25T18:43:46.360Z] (SWT:1624): Gtk-CRITICAL **: 18:43:46.128: gtk_box_gadget_distribute: assertion 'size >= 0' failed in GtkScrollbar
14:43:46 [2020-08-25T18:43:46.360Z] 
14:43:46 [2020-08-25T18:43:46.360Z] (SWT:1624): Gtk-CRITICAL **: 18:43:46.143: gtk_box_gadget_distribute: assertion 'size >= 0' failed in GtkScrollbar
14:43:46 [2020-08-25T18:43:46.360Z] 
14:43:46 [2020-08-25T18:43:46.360Z] (SWT:1624): Gtk-CRITICAL **: 18:43:46.143: gtk_box_gadget_distribute: assertion 'size >= 0' failed in GtkScrollbar
14:43:46 [2020-08-25T18:43:46.360Z] 
14:43:46 [2020-08-25T18:43:46.360Z] (SWT:1624): Gtk-CRITICAL **: 18:43:46.144: gtk_box_gadget_distribute: assertion 'size >= 0' failed in GtkScrollbar
14:43:46 [2020-08-25T18:43:46.360Z] 
14:43:46 [2020-08-25T18:43:46.360Z] (SWT:1624): Gtk-CRITICAL **: 18:43:46.144: gtk_box_gadget_distribute: assertion 'size >= 0' failed in GtkScrollbar
14:43:46 [2020-08-25T18:43:46.360Z] 
14:43:46 [2020-08-25T18:43:46.360Z] (SWT:1624): Gtk-CRITICAL **: 18:43:46.150: gtk_box_gadget_distribute: assertion 'size >= 0' failed in GtkScrollbar
14:43:46 [2020-08-25T18:43:46.360Z] 
14:43:46 [2020-08-25T18:43:46.360Z] (SWT:1624): Gtk-CRITICAL **: 18:43:46.150: gtk_box_gadget_distribute: assertion 'size >= 0' failed in GtkScrollbar
14:43:46 [2020-08-25T18:43:46.360Z] 
14:43:46 [2020-08-25T18:43:46.360Z] (SWT:1624): Gtk-CRITICAL **: 18:43:46.151: gtk_box_gadget_distribute: assertion 'size >= 0' failed in GtkScrollbar
14:43:46 [2020-08-25T18:43:46.360Z] 
14:43:46 [2020-08-25T18:43:46.360Z] (SWT:1624): Gtk-CRITICAL **: 18:43:46.157: gtk_box_gadget_distribute: assertion 'size >= 0' failed in GtkScrollbar
14:43:46 [2020-08-25T18:43:46.360Z] 
14:43:46 [2020-08-25T18:43:46.360Z] (SWT:1624): Gtk-CRITICAL **: 18:43:46.163: gtk_box_gadget_distribute: assertion 'size >= 0' failed in GtkScrollbar
14:43:46 [2020-08-25T18:43:46.360Z] 
14:43:46 [2020-08-25T18:43:46.360Z] (SWT:1624): Gtk-CRITICAL **: 18:43:46.163: gtk_box_gadget_distribute: assertion 'size >= 0' failed in GtkScrollbar
14:43:46 [2020-08-25T18:43:46.360Z] 
14:43:46 [2020-08-25T18:43:46.360Z] (SWT:1624): Gtk-CRITICAL **: 18:43:46.163: gtk_box_gadget_distribute: assertion 'size >= 0' failed in GtkScrollbar
14:43:46 [2020-08-25T18:43:46.360Z] 
14:43:46 [2020-08-25T18:43:46.360Z] (SWT:1624): Gtk-CRITICAL **: 18:43:46.179: gtk_box_gadget_distribute: assertion 'size >= 0' failed in GtkScrollbar
14:43:46 [2020-08-25T18:43:46.360Z] 
14:43:46 [2020-08-25T18:43:46.360Z] (SWT:1624): Gtk-CRITICAL **: 18:43:46.179: gtk_box_gadget_distribute: assertion 'size >= 0' failed in GtkScrollbar
14:43:46 [2020-08-25T18:43:46.360Z] 
14:43:46 [2020-08-25T18:43:46.360Z] (SWT:1624): Gtk-CRITICAL **: 18:43:46.179: gtk_box_gadget_distribute: assertion 'size >= 0' failed in GtkScrollbar
14:43:46 [2020-08-25T18:43:46.360Z] 
14:43:46 [2020-08-25T18:43:46.360Z] (SWT:1624): Gtk-CRITICAL **: 18:43:46.190: gtk_box_gadget_distribute: assertion 'size >= 0' failed in GtkScrollbar
14:43:46 [2020-08-25T18:43:46.360Z] 
14:43:46 [2020-08-25T18:43:46.360Z] (SWT:1624): Gtk-CRITICAL **: 18:43:46.191: gtk_box_gadget_distribute: assertion 'size >= 0' failed in GtkScrollbar
14:43:46 [2020-08-25T18:43:46.360Z] 
14:43:46 [2020-08-25T18:43:46.360Z] (SWT:1624): Gtk-CRITICAL **: 18:43:46.194: gtk_box_gadget_distribute: assertion 'size >= 0' failed in GtkScrollbar
14:43:46 [2020-08-25T18:43:46.360Z] 
14:43:46 [2020-08-25T18:43:46.360Z] (SWT:1624): Gtk-CRITICAL **: 18:43:46.195: gtk_box_gadget_distribute: assertion 'size >= 0' failed in GtkScrollbar
14:43:46 [2020-08-25T18:43:46.361Z] 
14:43:46 [2020-08-25T18:43:46.361Z] (SWT:1624): Gtk-CRITICAL **: 18:43:46.195: gtk_box_gadget_distribute: assertion 'size >= 0' failed in GtkScrollbar
14:43:46 [2020-08-25T18:43:46.361Z] 
14:43:46 [2020-08-25T18:43:46.361Z] (SWT:1624): Gtk-CRITICAL **: 18:43:46.200: gtk_box_gadget_distribute: assertion 'size >= 0' failed in GtkScrollbar
14:43:46 [2020-08-25T18:43:46.361Z] 
14:43:46 [2020-08-25T18:43:46.361Z] (SWT:1624): Gtk-CRITICAL **: 18:43:46.200: gtk_box_gadget_distribute: assertion 'size >= 0' failed in GtkScrollbar
14:43:46 [2020-08-25T18:43:46.361Z] 
14:43:46 [2020-08-25T18:43:46.361Z] (SWT:1624): Gtk-CRITICAL **: 18:43:46.204: gtk_box_gadget_distribute: assertion 'size >= 0' failed in GtkScrollbar
14:43:46 [2020-08-25T18:43:46.361Z] 
14:43:46 [2020-08-25T18:43:46.361Z] (SWT:1624): Gtk-CRITICAL **: 18:43:46.205: gtk_box_gadget_distribute: assertion 'size >= 0' failed in GtkScrollbar
14:43:46 [2020-08-25T18:43:46.361Z] 
14:43:46 [2020-08-25T18:43:46.361Z] (SWT:1624): Gtk-CRITICAL **: 18:43:46.205: gtk_box_gadget_distribute: assertion 'size >= 0' failed in GtkScrollbar
14:43:46 [2020-08-25T18:43:46.361Z] 
14:43:46 [2020-08-25T18:43:46.361Z] (SWT:1624): Gtk-CRITICAL **: 18:43:46.209: gtk_box_gadget_distribute: assertion 'size >= 0' failed in GtkScrollbar
14:43:46 [2020-08-25T18:43:46.361Z] 
14:43:46 [2020-08-25T18:43:46.361Z] (SWT:1624): Gtk-CRITICAL **: 18:43:46.213: gtk_box_gadget_distribute: assertion 'size >= 0' failed in GtkScrollbar
14:43:46 [2020-08-25T18:43:46.361Z] 
14:43:46 [2020-08-25T18:43:46.361Z] (SWT:1624): Gtk-CRITICAL **: 18:43:46.213: gtk_box_gadget_distribute: assertion 'size >= 0' failed in GtkScrollbar
14:43:46 [2020-08-25T18:43:46.361Z] 
14:43:46 [2020-08-25T18:43:46.361Z] (SWT:1624): Gtk-CRITICAL **: 18:43:46.336: gtk_box_gadget_distribute: assertion 'size >= 0' failed in GtkScrollbar
14:43:46 [2020-08-25T18:43:46.361Z] 
14:43:46 [2020-08-25T18:43:46.361Z] (SWT:1624): Gtk-CRITICAL **: 18:43:46.343: gtk_box_gadget_distribute: assertion 'size >= 0' failed in GtkScrollbar
14:43:46 [2020-08-25T18:43:46.361Z] 
14:43:46 [2020-08-25T18:43:46.361Z] (SWT:1624): Gtk-CRITICAL **: 18:43:46.344: gtk_box_gadget_distribute: assertion 'size >= 0' failed in GtkScrollbar
14:43:46 [2020-08-25T18:43:46.361Z] 
14:43:46 [2020-08-25T18:43:46.361Z] (SWT:1624): Gtk-CRITICAL **: 18:43:46.344: gtk_box_gadget_distribute: assertion 'size >= 0' failed in GtkScrollbar
14:43:46 [2020-08-25T18:43:46.361Z] 
14:43:46 [2020-08-25T18:43:46.361Z] (SWT:1624): Gtk-CRITICAL **: 18:43:46.350: gtk_box_gadget_distribute: assertion 'size >= 0' failed in GtkScrollbar
14:43:46 [2020-08-25T18:43:46.617Z] 
14:43:46 [2020-08-25T18:43:46.617Z] (SWT:1624): Gtk-CRITICAL **: 18:43:46.358: gtk_box_gadget_distribute: assertion 'size >= 0' failed in GtkScrollbar
14:43:46 [2020-08-25T18:43:46.617Z] 
14:43:46 [2020-08-25T18:43:46.617Z] (SWT:1624): Gtk-CRITICAL **: 18:43:46.448: gtk_box_gadget_distribute: assertion 'size >= 0' failed in GtkScrollbar
14:43:46 [2020-08-25T18:43:46.617Z] 
14:43:46 [2020-08-25T18:43:46.617Z] (SWT:1624): Gtk-CRITICAL **: 18:43:46.449: gtk_box_gadget_distribute: assertion 'size >= 0' failed in GtkScrollbar
14:43:46 [2020-08-25T18:43:46.617Z] 
14:43:46 [2020-08-25T18:43:46.617Z] (SWT:1624): Gtk-CRITICAL **: 18:43:46.449: gtk_box_gadget_distribute: assertion 'size >= 0' failed in GtkScrollbar
14:43:46 [2020-08-25T18:43:46.617Z] 
14:43:46 [2020-08-25T18:43:46.617Z] (SWT:1624): Gtk-CRITICAL **: 18:43:46.464: gtk_box_gadget_distribute: assertion 'size >= 0' failed in GtkScrollbar
14:43:46 [2020-08-25T18:43:46.617Z] 
14:43:46 [2020-08-25T18:43:46.617Z] (SWT:1624): Gtk-CRITICAL **: 18:43:46.546: gtk_box_gadget_distribute: assertion 'size >= 0' failed in GtkScrollbar
14:43:46 [2020-08-25T18:43:46.617Z] 
14:43:46 [2020-08-25T18:43:46.617Z] (SWT:1624): Gtk-CRITICAL **: 18:43:46.547: gtk_box_gadget_distribute: assertion 'size >= 0' failed in GtkScrollbar
14:43:46 [2020-08-25T18:43:46.617Z] 
14:43:46 [2020-08-25T18:43:46.617Z] (SWT:1624): Gtk-CRITICAL **: 18:43:46.547: gtk_box_gadget_distribute: assertion 'size >= 0' failed in GtkScrollbar
14:43:46 [2020-08-25T18:43:46.617Z] 
14:43:46 [2020-08-25T18:43:46.617Z] (SWT:1624): Gtk-CRITICAL **: 18:43:46.559: gtk_box_gadget_distribute: assertion 'size >= 0' failed in GtkScrollbar
14:43:47 [2020-08-25T18:43:47.181Z] 
14:43:47 [2020-08-25T18:43:47.181Z] (SWT:1624): Gtk-CRITICAL **: 18:43:46.950: gtk_box_gadget_distribute: assertion 'size >= 0' failed in GtkScrollbar
14:43:47 [2020-08-25T18:43:47.181Z] 
14:43:47 [2020-08-25T18:43:47.181Z] (SWT:1624): Gtk-CRITICAL **: 18:43:46.959: gtk_box_gadget_distribute: assertion 'size >= 0' failed in GtkScrollbar
14:43:47 [2020-08-25T18:43:47.181Z] 
14:43:47 [2020-08-25T18:43:47.181Z] (SWT:1624): Gtk-CRITICAL **: 18:43:46.976: gtk_box_gadget_distribute: assertion 'size >= 0' failed in GtkScrollbar
14:43:47 [2020-08-25T18:43:47.181Z] 
14:43:47 [2020-08-25T18:43:47.181Z] (SWT:1624): Gtk-CRITICAL **: 18:43:46.992: gtk_box_gadget_distribute: assertion 'size >= 0' failed in GtkScrollbar
14:43:47 [2020-08-25T18:43:47.181Z] 
14:43:47 [2020-08-25T18:43:47.181Z] (SWT:1624): Gtk-CRITICAL **: 18:43:47.003: gtk_box_gadget_distribute: assertion 'size >= 0' failed in GtkScrollbar
14:43:47 [2020-08-25T18:43:47.181Z] 
14:43:47 [2020-08-25T18:43:47.181Z] (SWT:1624): Gtk-CRITICAL **: 18:43:47.003: gtk_box_gadget_distribute: assertion 'size >= 0' failed in GtkScrollbar
14:43:47 [2020-08-25T18:43:47.181Z] 
14:43:47 [2020-08-25T18:43:47.181Z] (SWT:1624): Gtk-CRITICAL **: 18:43:47.004: gtk_box_gadget_distribute: assertion 'size >= 0' failed in GtkScrollbar
14:43:47 [2020-08-25T18:43:47.182Z] 
14:43:47 [2020-08-25T18:43:47.182Z] (SWT:1624): Gtk-CRITICAL **: 18:43:47.004: gtk_box_gadget_distribute: assertion 'size >= 0' failed in GtkScrollbar
14:43:47 [2020-08-25T18:43:47.182Z] 
14:43:47 [2020-08-25T18:43:47.182Z] (SWT:1624): Gtk-CRITICAL **: 18:43:47.005: gtk_box_gadget_distribute: assertion 'size >= 0' failed in GtkScrollbar
14:43:47 [2020-08-25T18:43:47.182Z] 
14:43:47 [2020-08-25T18:43:47.182Z] (SWT:1624): Gtk-CRITICAL **: 18:43:47.005: gtk_box_gadget_distribute: assertion 'size >= 0' failed in GtkScrollbar
14:43:47 [2020-08-25T18:43:47.182Z] 
14:43:47 [2020-08-25T18:43:47.182Z] (SWT:1624): Gtk-CRITICAL **: 18:43:47.012: gtk_box_gadget_distribute: assertion 'size >= 0' failed in GtkScrollbar
14:43:47 [2020-08-25T18:43:47.182Z] 
14:43:47 [2020-08-25T18:43:47.182Z] (SWT:1624): Gtk-CRITICAL **: 18:43:47.019: gtk_box_gadget_distribute: assertion 'size >= 0' failed in GtkScrollbar
14:43:47 [2020-08-25T18:43:47.182Z] 
14:43:47 [2020-08-25T18:43:47.182Z] (SWT:1624): Gtk-CRITICAL **: 18:43:47.054: gtk_box_gadget_distribute: assertion 'size >= 0' failed in GtkScrollbar
14:43:47 [2020-08-25T18:43:47.182Z] 
14:43:47 [2020-08-25T18:43:47.182Z] (SWT:1624): Gtk-CRITICAL **: 18:43:47.054: gtk_box_gadget_distribute: assertion 'size >= 0' failed in GtkScrollbar
14:43:47 [2020-08-25T18:43:47.182Z] 
14:43:47 [2020-08-25T18:43:47.182Z] (SWT:1624): Gtk-CRITICAL **: 18:43:47.078: gtk_box_gadget_distribute: assertion 'size >= 0' failed in GtkScrollbar
14:43:47 [2020-08-25T18:43:47.182Z] 
14:43:47 [2020-08-25T18:43:47.182Z] (SWT:1624): Gtk-CRITICAL **: 18:43:47.087: gtk_box_gadget_distribute: assertion 'size >= 0' failed in GtkScrollbar
14:43:47 [2020-08-25T18:43:47.182Z] 
14:43:47 [2020-08-25T18:43:47.182Z] (SWT:1624): Gtk-CRITICAL **: 18:43:47.088: gtk_box_gadget_distribute: assertion 'size >= 0' failed in GtkScrollbar
14:43:47 [2020-08-25T18:43:47.182Z] 
14:43:47 [2020-08-25T18:43:47.182Z] (SWT:1624): Gtk-CRITICAL **: 18:43:47.088: gtk_box_gadget_distribute: assertion 'size >= 0' failed in GtkScrollbar
14:43:47 [2020-08-25T18:43:47.182Z] 
14:43:47 [2020-08-25T18:43:47.182Z] (SWT:1624): Gtk-CRITICAL **: 18:43:47.095: gtk_box_gadget_distribute: assertion 'size >= 0' failed in GtkScrollbar
14:43:47 [2020-08-25T18:43:47.182Z] 
14:43:47 [2020-08-25T18:43:47.182Z] (SWT:1624): Gtk-CRITICAL **: 18:43:47.102: gtk_box_gadget_distribute: assertion 'size >= 0' failed in GtkScrollbar
14:43:47 [2020-08-25T18:43:47.182Z] 
14:43:47 [2020-08-25T18:43:47.182Z] (SWT:1624): Gtk-WARNING **: 18:43:47.177: Negative content width -6 (allocation 1, extents 4x3) while allocating gadget (node toolbar, owner GtkToolbar)
14:43:48 [2020-08-25T18:43:48.114Z] 
14:43:48 [2020-08-25T18:43:48.114Z] (SWT:1624): Gtk-WARNING **: 18:43:47.807: Negative content width -6 (allocation 1, extents 4x3) while allocating gadget (node toolbar, owner GtkToolbar)
14:43:48 [2020-08-25T18:43:48.114Z] 
14:43:48 [2020-08-25T18:43:48.114Z] (SWT:1624): Gtk-WARNING **: 18:43:47.817: Negative content width -6 (allocation 1, extents 4x3) while allocating gadget (node toolbar, owner GtkToolbar)
14:43:48 [2020-08-25T18:43:48.115Z] Tests run: 11, Failures: 0, Errors: 0, Skipped: 0, Time elapsed: 21.736 s - in org.eclipse.egit.ui.test.stagview.StagingViewTest
14:43:48 [2020-08-25T18:43:48.115Z] testAmend(org.eclipse.egit.ui.test.stagview.StagingViewTest)  Time elapsed: 2.444 s
14:43:48 [2020-08-25T18:43:48.115Z] testButtonEnablement(org.eclipse.egit.ui.test.stagview.StagingViewTest)  Time elapsed: 1.636 s
14:43:48 [2020-08-25T18:43:48.115Z] testCommitSingleFile(org.eclipse.egit.ui.test.stagview.StagingViewTest)  Time elapsed: 1.827 s
14:43:48 [2020-08-25T18:43:48.115Z] testMergeConflict(org.eclipse.egit.ui.test.stagview.StagingViewTest)  Time elapsed: 2.709 s
14:43:48 [2020-08-25T18:43:48.115Z] testCommitMessageConfigChangeAmending(org.eclipse.egit.ui.test.stagview.StagingViewTest)  Time elapsed: 1.777 s
14:43:48 [2020-08-25T18:43:48.115Z] testCommitMessageConfigChangeWithAuthor(org.eclipse.egit.ui.test.stagview.StagingViewTest)  Time elapsed: 1.622 s
14:43:48 [2020-08-25T18:43:48.115Z] testCommitMessageConfigChange(org.eclipse.egit.ui.test.stagview.StagingViewTest)  Time elapsed: 1.685 s
14:43:48 [2020-08-25T18:43:48.115Z] testCommitMessageConfigChangeBranchSwitchToNew(org.eclipse.egit.ui.test.stagview.StagingViewTest)  Time elapsed: 1.606 s
14:43:48 [2020-08-25T18:43:48.115Z] testCommitMessageCommitterChangeSignOff(org.eclipse.egit.ui.test.stagview.StagingViewTest)  Time elapsed: 1.613 s
14:43:48 [2020-08-25T18:43:48.115Z] testCommitMessageConfigChangeNoSignOff(org.eclipse.egit.ui.test.stagview.StagingViewTest)  Time elapsed: 1.888 s
14:43:48 [2020-08-25T18:43:48.115Z] testDeleteModifyConflict(org.eclipse.egit.ui.test.stagview.StagingViewTest)  Time elapsed: 2.907 s
14:43:48 [2020-08-25T18:43:48.115Z] Running org.eclipse.egit.ui.test.stagview.CommitMessageProvidersTest
14:43:48 [2020-08-25T18:43:48.681Z] 
14:43:48 [2020-08-25T18:43:48.681Z] (SWT:1624): Gtk-WARNING **: 18:43:48.427: Negative content width -6 (allocation 1, extents 4x3) while allocating gadget (node toolbar, owner GtkToolbar)
14:43:48 [2020-08-25T18:43:48.938Z] 
14:43:48 [2020-08-25T18:43:48.938Z] (SWT:1624): Gtk-CRITICAL **: 18:43:48.892: gtk_box_gadget_distribute: assertion 'size >= 0' failed in GtkScrollbar
14:43:48 [2020-08-25T18:43:48.938Z] 
14:43:48 [2020-08-25T18:43:48.938Z] (SWT:1624): Gtk-CRITICAL **: 18:43:48.899: gtk_box_gadget_distribute: assertion 'size >= 0' failed in GtkScrollbar
14:43:48 [2020-08-25T18:43:48.938Z] 
14:43:48 [2020-08-25T18:43:48.938Z] (SWT:1624): Gtk-WARNING **: 18:43:48.902: Negative content width -6 (allocation 1, extents 4x3) while allocating gadget (node toolbar, owner GtkToolbar)
14:43:48 [2020-08-25T18:43:48.938Z] 
14:43:48 [2020-08-25T18:43:48.938Z] (SWT:1624): Gtk-CRITICAL **: 18:43:48.909: gtk_box_gadget_distribute: assertion 'size >= 0' failed in GtkScrollbar
14:43:48 [2020-08-25T18:43:48.938Z] 
14:43:48 [2020-08-25T18:43:48.938Z] (SWT:1624): Gtk-CRITICAL **: 18:43:48.914: gtk_box_gadget_distribute: assertion 'size >= 0' failed in GtkScrollbar
14:43:48 [2020-08-25T18:43:48.938Z] 
14:43:48 [2020-08-25T18:43:48.938Z] (SWT:1624): Gtk-CRITICAL **: 18:43:48.915: gtk_box_gadget_distribute: assertion 'size >= 0' failed in GtkScrollbar
14:43:48 [2020-08-25T18:43:48.938Z] 
14:43:48 [2020-08-25T18:43:48.938Z] (SWT:1624): Gtk-CRITICAL **: 18:43:48.915: gtk_box_gadget_distribute: assertion 'size >= 0' failed in GtkScrollbar
14:43:48 [2020-08-25T18:43:48.938Z] 
14:43:48 [2020-08-25T18:43:48.938Z] (SWT:1624): Gtk-CRITICAL **: 18:43:48.916: gtk_box_gadget_distribute: assertion 'size >= 0' failed in GtkScrollbar
14:43:48 [2020-08-25T18:43:48.938Z] 
14:43:48 [2020-08-25T18:43:48.938Z] (SWT:1624): Gtk-CRITICAL **: 18:43:48.916: gtk_box_gadget_distribute: assertion 'size >= 0' failed in GtkScrollbar
14:43:48 [2020-08-25T18:43:48.938Z] 
14:43:48 [2020-08-25T18:43:48.938Z] (SWT:1624): Gtk-CRITICAL **: 18:43:48.928: gtk_box_gadget_distribute: assertion 'size >= 0' failed in GtkScrollbar
14:43:48 [2020-08-25T18:43:48.938Z] 
14:43:48 [2020-08-25T18:43:48.938Z] (SWT:1624): Gtk-CRITICAL **: 18:43:48.928: gtk_box_gadget_distribute: assertion 'size >= 0' failed in GtkScrollbar
14:43:49 [2020-08-25T18:43:49.213Z] 
14:43:49 [2020-08-25T18:43:49.213Z] (SWT:1624): Gtk-CRITICAL **: 18:43:48.941: gtk_box_gadget_distribute: assertion 'size >= 0' failed in GtkScrollbar
14:43:49 [2020-08-25T18:43:49.213Z] 
14:43:49 [2020-08-25T18:43:49.213Z] (SWT:1624): Gtk-CRITICAL **: 18:43:48.942: gtk_box_gadget_distribute: assertion 'size >= 0' failed in GtkScrollbar
14:43:49 [2020-08-25T18:43:49.213Z] 
14:43:49 [2020-08-25T18:43:49.213Z] (SWT:1624): Gtk-CRITICAL **: 18:43:48.949: gtk_box_gadget_distribute: assertion 'size >= 0' failed in GtkScrollbar
14:43:49 [2020-08-25T18:43:49.213Z] 
14:43:49 [2020-08-25T18:43:49.213Z] (SWT:1624): Gtk-CRITICAL **: 18:43:48.958: gtk_box_gadget_distribute: assertion 'size >= 0' failed in GtkScrollbar
14:43:49 [2020-08-25T18:43:49.213Z] 
14:43:49 [2020-08-25T18:43:49.213Z] (SWT:1624): Gtk-CRITICAL **: 18:43:48.958: gtk_box_gadget_distribute: assertion 'size >= 0' failed in GtkScrollbar
14:43:49 [2020-08-25T18:43:49.213Z] 
14:43:49 [2020-08-25T18:43:49.213Z] (SWT:1624): Gtk-CRITICAL **: 18:43:48.975: gtk_box_gadget_distribute: assertion 'size >= 0' failed in GtkScrollbar
14:43:49 [2020-08-25T18:43:49.213Z] 
14:43:49 [2020-08-25T18:43:49.213Z] (SWT:1624): Gtk-CRITICAL **: 18:43:48.975: gtk_box_gadget_distribute: assertion 'size >= 0' failed in GtkScrollbar
14:43:49 [2020-08-25T18:43:49.213Z] 
14:43:49 [2020-08-25T18:43:49.213Z] (SWT:1624): Gtk-CRITICAL **: 18:43:48.992: gtk_box_gadget_distribute: assertion 'size >= 0' failed in GtkScrollbar
14:43:49 [2020-08-25T18:43:49.213Z] 
14:43:49 [2020-08-25T18:43:49.213Z] (SWT:1624): Gtk-CRITICAL **: 18:43:48.992: gtk_box_gadget_distribute: assertion 'size >= 0' failed in GtkScrollbar
14:43:49 [2020-08-25T18:43:49.213Z] 
14:43:49 [2020-08-25T18:43:49.213Z] (SWT:1624): Gtk-CRITICAL **: 18:43:49.009: gtk_box_gadget_distribute: assertion 'size >= 0' failed in GtkScrollbar
14:43:49 [2020-08-25T18:43:49.213Z] 
14:43:49 [2020-08-25T18:43:49.213Z] (SWT:1624): Gtk-CRITICAL **: 18:43:49.009: gtk_box_gadget_distribute: assertion 'size >= 0' failed in GtkScrollbar
14:43:49 [2020-08-25T18:43:49.213Z] 
14:43:49 [2020-08-25T18:43:49.213Z] (SWT:1624): Gtk-CRITICAL **: 18:43:49.025: gtk_box_gadget_distribute: assertion 'size >= 0' failed in GtkScrollbar
14:43:49 [2020-08-25T18:43:49.213Z] 
14:43:49 [2020-08-25T18:43:49.213Z] (SWT:1624): Gtk-CRITICAL **: 18:43:49.025: gtk_box_gadget_distribute: assertion 'size >= 0' failed in GtkScrollbar
14:43:49 [2020-08-25T18:43:49.213Z] 
14:43:49 [2020-08-25T18:43:49.213Z] (SWT:1624): Gtk-CRITICAL **: 18:43:49.041: gtk_box_gadget_distribute: assertion 'size >= 0' failed in GtkScrollbar
14:43:49 [2020-08-25T18:43:49.213Z] 
14:43:49 [2020-08-25T18:43:49.213Z] (SWT:1624): Gtk-CRITICAL **: 18:43:49.041: gtk_box_gadget_distribute: assertion 'size >= 0' failed in GtkScrollbar
14:43:49 [2020-08-25T18:43:49.213Z] 
14:43:49 [2020-08-25T18:43:49.213Z] (SWT:1624): Gtk-CRITICAL **: 18:43:49.068: gtk_box_gadget_distribute: assertion 'size >= 0' failed in GtkScrollbar
14:43:49 [2020-08-25T18:43:49.213Z] 
14:43:49 [2020-08-25T18:43:49.213Z] (SWT:1624): Gtk-CRITICAL **: 18:43:49.068: gtk_box_gadget_distribute: assertion 'size >= 0' failed in GtkScrollbar
14:43:49 [2020-08-25T18:43:49.213Z] 
14:43:49 [2020-08-25T18:43:49.213Z] (SWT:1624): Gtk-CRITICAL **: 18:43:49.076: gtk_box_gadget_distribute: assertion 'size >= 0' failed in GtkScrollbar
14:43:49 [2020-08-25T18:43:49.213Z] 
14:43:49 [2020-08-25T18:43:49.213Z] (SWT:1624): Gtk-CRITICAL **: 18:43:49.076: gtk_box_gadget_distribute: assertion 'size >= 0' failed in GtkScrollbar
14:43:49 [2020-08-25T18:43:49.213Z] 
14:43:49 [2020-08-25T18:43:49.213Z] (SWT:1624): Gtk-CRITICAL **: 18:43:49.092: gtk_box_gadget_distribute: assertion 'size >= 0' failed in GtkScrollbar
14:43:49 [2020-08-25T18:43:49.213Z] 
14:43:49 [2020-08-25T18:43:49.213Z] (SWT:1624): Gtk-CRITICAL **: 18:43:49.092: gtk_box_gadget_distribute: assertion 'size >= 0' failed in GtkScrollbar
14:43:49 [2020-08-25T18:43:49.213Z] 
14:43:49 [2020-08-25T18:43:49.213Z] (SWT:1624): Gtk-CRITICAL **: 18:43:49.108: gtk_box_gadget_distribute: assertion 'size >= 0' failed in GtkScrollbar
14:43:49 [2020-08-25T18:43:49.213Z] 
14:43:49 [2020-08-25T18:43:49.213Z] (SWT:1624): Gtk-CRITICAL **: 18:43:49.108: gtk_box_gadget_distribute: assertion 'size >= 0' failed in GtkScrollbar
14:43:49 [2020-08-25T18:43:49.213Z] 
14:43:49 [2020-08-25T18:43:49.213Z] (SWT:1624): Gtk-CRITICAL **: 18:43:49.118: gtk_box_gadget_distribute: assertion 'size >= 0' failed in GtkScrollbar
14:43:49 [2020-08-25T18:43:49.213Z] 
14:43:49 [2020-08-25T18:43:49.213Z] (SWT:1624): Gtk-CRITICAL **: 18:43:49.118: gtk_box_gadget_distribute: assertion 'size >= 0' failed in GtkScrollbar
14:43:49 [2020-08-25T18:43:49.213Z] 
14:43:49 [2020-08-25T18:43:49.213Z] (SWT:1624): Gtk-CRITICAL **: 18:43:49.125: gtk_box_gadget_distribute: assertion 'size >= 0' failed in GtkScrollbar
14:43:49 [2020-08-25T18:43:49.213Z] 
14:43:49 [2020-08-25T18:43:49.213Z] (SWT:1624): Gtk-CRITICAL **: 18:43:49.125: gtk_box_gadget_distribute: assertion 'size >= 0' failed in GtkScrollbar
14:43:49 [2020-08-25T18:43:49.213Z] 
14:43:49 [2020-08-25T18:43:49.213Z] (SWT:1624): Gtk-CRITICAL **: 18:43:49.125: gtk_box_gadget_distribute: assertion 'size >= 0' failed in GtkScrollbar
14:43:49 [2020-08-25T18:43:49.213Z] 
14:43:49 [2020-08-25T18:43:49.213Z] (SWT:1624): Gtk-CRITICAL **: 18:43:49.142: gtk_box_gadget_distribute: assertion 'size >= 0' failed in GtkScrollbar
14:43:49 [2020-08-25T18:43:49.213Z] 
14:43:49 [2020-08-25T18:43:49.213Z] (SWT:1624): Gtk-WARNING **: 18:43:49.184: Negative content width -6 (allocation 1, extents 4x3) while allocating gadget (node toolbar, owner GtkToolbar)
14:43:49 [2020-08-25T18:43:49.808Z] 
14:43:49 [2020-08-25T18:43:49.808Z] (SWT:1624): Gtk-WARNING **: 18:43:49.698: Negative content width -6 (allocation 1, extents 4x3) while allocating gadget (node toolbar, owner GtkToolbar)
14:43:49 [2020-08-25T18:43:49.808Z] 
14:43:49 [2020-08-25T18:43:49.808Z] (SWT:1624): Gtk-WARNING **: 18:43:49.708: Negative content width -6 (allocation 1, extents 4x3) while allocating gadget (node toolbar, owner GtkToolbar)
14:43:50 [2020-08-25T18:43:50.372Z] 
14:43:50 [2020-08-25T18:43:50.372Z] (SWT:1624): Gtk-WARNING **: 18:43:50.292: Negative content width -6 (allocation 1, extents 4x3) while allocating gadget (node toolbar, owner GtkToolbar)
14:43:50 [2020-08-25T18:43:50.631Z] 
14:43:50 [2020-08-25T18:43:50.631Z] (SWT:1624): Gtk-CRITICAL **: 18:43:50.570: gtk_box_gadget_distribute: assertion 'size >= 0' failed in GtkScrollbar
14:43:50 [2020-08-25T18:43:50.631Z] 
14:43:50 [2020-08-25T18:43:50.631Z] (SWT:1624): Gtk-CRITICAL **: 18:43:50.577: gtk_box_gadget_distribute: assertion 'size >= 0' failed in GtkScrollbar
14:43:50 [2020-08-25T18:43:50.631Z] 
14:43:50 [2020-08-25T18:43:50.631Z] (SWT:1624): Gtk-WARNING **: 18:43:50.580: Negative content width -6 (allocation 1, extents 4x3) while allocating gadget (node toolbar, owner GtkToolbar)
14:43:50 [2020-08-25T18:43:50.631Z] 
14:43:50 [2020-08-25T18:43:50.631Z] (SWT:1624): Gtk-CRITICAL **: 18:43:50.587: gtk_box_gadget_distribute: assertion 'size >= 0' failed in GtkScrollbar
14:43:50 [2020-08-25T18:43:50.631Z] 
14:43:50 [2020-08-25T18:43:50.631Z] (SWT:1624): Gtk-CRITICAL **: 18:43:50.593: gtk_box_gadget_distribute: assertion 'size >= 0' failed in GtkScrollbar
14:43:50 [2020-08-25T18:43:50.631Z] 
14:43:50 [2020-08-25T18:43:50.631Z] !ENTRY org.eclipse.egit.ui 2 0 2020-08-25 18:43:50.600
14:43:50 [2020-08-25T18:43:50.631Z] !MESSAGE Found multiple implementations of ICommitMessageProvider2. Ignoring caret positioning for org.eclipse.egit.ui.test.stagview.CommitMessageProvidersTest$TestCommitMessageProvider.
14:43:50 [2020-08-25T18:43:50.631Z] 
14:43:50 [2020-08-25T18:43:50.631Z] (SWT:1624): Gtk-CRITICAL **: 18:43:50.600: gtk_box_gadget_distribute: assertion 'size >= 0' failed in GtkScrollbar
14:43:50 [2020-08-25T18:43:50.631Z] 
14:43:50 [2020-08-25T18:43:50.631Z] (SWT:1624): Gtk-CRITICAL **: 18:43:50.600: gtk_box_gadget_distribute: assertion 'size >= 0' failed in GtkScrollbar
14:43:50 [2020-08-25T18:43:50.631Z] 
14:43:50 [2020-08-25T18:43:50.631Z] (SWT:1624): Gtk-CRITICAL **: 18:43:50.601: gtk_box_gadget_distribute: assertion 'size >= 0' failed in GtkScrollbar
14:43:50 [2020-08-25T18:43:50.631Z] 
14:43:50 [2020-08-25T18:43:50.631Z] (SWT:1624): Gtk-CRITICAL **: 18:43:50.601: gtk_box_gadget_distribute: assertion 'size >= 0' failed in GtkScrollbar
14:43:50 [2020-08-25T18:43:50.631Z] 
14:43:50 [2020-08-25T18:43:50.631Z] (SWT:1624): Gtk-CRITICAL **: 18:43:50.610: gtk_box_gadget_distribute: assertion 'size >= 0' failed in GtkScrollbar
14:43:50 [2020-08-25T18:43:50.631Z] 
14:43:50 [2020-08-25T18:43:50.631Z] (SWT:1624): Gtk-CRITICAL **: 18:43:50.610: gtk_box_gadget_distribute: assertion 'size >= 0' failed in GtkScrollbar
14:43:50 [2020-08-25T18:43:50.631Z] 
14:43:50 [2020-08-25T18:43:50.631Z] (SWT:1624): Gtk-CRITICAL **: 18:43:50.618: gtk_box_gadget_distribute: assertion 'size >= 0' failed in GtkScrollbar
14:43:50 [2020-08-25T18:43:50.888Z] 
14:43:50 [2020-08-25T18:43:50.888Z] (SWT:1624): Gtk-CRITICAL **: 18:43:50.627: gtk_box_gadget_distribute: assertion 'size >= 0' failed in GtkScrollbar
14:43:50 [2020-08-25T18:43:50.888Z] 
14:43:50 [2020-08-25T18:43:50.888Z] (SWT:1624): Gtk-CRITICAL **: 18:43:50.627: gtk_box_gadget_distribute: assertion 'size >= 0' failed in GtkScrollbar
14:43:50 [2020-08-25T18:43:50.888Z] 
14:43:50 [2020-08-25T18:43:50.888Z] (SWT:1624): Gtk-CRITICAL **: 18:43:50.644: gtk_box_gadget_distribute: assertion 'size >= 0' failed in GtkScrollbar
14:43:50 [2020-08-25T18:43:50.888Z] 
14:43:50 [2020-08-25T18:43:50.888Z] (SWT:1624): Gtk-CRITICAL **: 18:43:50.644: gtk_box_gadget_distribute: assertion 'size >= 0' failed in GtkScrollbar
14:43:50 [2020-08-25T18:43:50.888Z] 
14:43:50 [2020-08-25T18:43:50.888Z] (SWT:1624): Gtk-CRITICAL **: 18:43:50.661: gtk_box_gadget_distribute: assertion 'size >= 0' failed in GtkScrollbar
14:43:50 [2020-08-25T18:43:50.888Z] 
14:43:50 [2020-08-25T18:43:50.888Z] (SWT:1624): Gtk-CRITICAL **: 18:43:50.661: gtk_box_gadget_distribute: assertion 'size >= 0' failed in GtkScrollbar
14:43:50 [2020-08-25T18:43:50.888Z] 
14:43:50 [2020-08-25T18:43:50.888Z] (SWT:1624): Gtk-CRITICAL **: 18:43:50.677: gtk_box_gadget_distribute: assertion 'size >= 0' failed in GtkScrollbar
14:43:50 [2020-08-25T18:43:50.888Z] 
14:43:50 [2020-08-25T18:43:50.889Z] (SWT:1624): Gtk-CRITICAL **: 18:43:50.677: gtk_box_gadget_distribute: assertion 'size >= 0' failed in GtkScrollbar
14:43:50 [2020-08-25T18:43:50.889Z] 
14:43:50 [2020-08-25T18:43:50.889Z] (SWT:1624): Gtk-CRITICAL **: 18:43:50.693: gtk_box_gadget_distribute: assertion 'size >= 0' failed in GtkScrollbar
14:43:50 [2020-08-25T18:43:50.889Z] 
14:43:50 [2020-08-25T18:43:50.889Z] (SWT:1624): Gtk-CRITICAL **: 18:43:50.694: gtk_box_gadget_distribute: assertion 'size >= 0' failed in GtkScrollbar
14:43:50 [2020-08-25T18:43:50.889Z] 
14:43:50 [2020-08-25T18:43:50.889Z] (SWT:1624): Gtk-CRITICAL **: 18:43:50.711: gtk_box_gadget_distribute: assertion 'size >= 0' failed in GtkScrollbar
14:43:50 [2020-08-25T18:43:50.889Z] 
14:43:50 [2020-08-25T18:43:50.889Z] (SWT:1624): Gtk-CRITICAL **: 18:43:50.711: gtk_box_gadget_distribute: assertion 'size >= 0' failed in GtkScrollbar
14:43:50 [2020-08-25T18:43:50.889Z] 
14:43:50 [2020-08-25T18:43:50.889Z] (SWT:1624): Gtk-CRITICAL **: 18:43:50.727: gtk_box_gadget_distribute: assertion 'size >= 0' failed in GtkScrollbar
14:43:50 [2020-08-25T18:43:50.889Z] 
14:43:50 [2020-08-25T18:43:50.889Z] (SWT:1624): Gtk-CRITICAL **: 18:43:50.727: gtk_box_gadget_distribute: assertion 'size >= 0' failed in GtkScrollbar
14:43:50 [2020-08-25T18:43:50.889Z] 
14:43:50 [2020-08-25T18:43:50.889Z] (SWT:1624): Gtk-CRITICAL **: 18:43:50.754: gtk_box_gadget_distribute: assertion 'size >= 0' failed in GtkScrollbar
14:43:50 [2020-08-25T18:43:50.889Z] 
14:43:50 [2020-08-25T18:43:50.889Z] (SWT:1624): Gtk-CRITICAL **: 18:43:50.754: gtk_box_gadget_distribute: assertion 'size >= 0' failed in GtkScrollbar
14:43:50 [2020-08-25T18:43:50.889Z] 
14:43:50 [2020-08-25T18:43:50.889Z] (SWT:1624): Gtk-CRITICAL **: 18:43:50.777: gtk_box_gadget_distribute: assertion 'size >= 0' failed in GtkScrollbar
14:43:50 [2020-08-25T18:43:50.889Z] 
14:43:50 [2020-08-25T18:43:50.889Z] (SWT:1624): Gtk-CRITICAL **: 18:43:50.778: gtk_box_gadget_distribute: assertion 'size >= 0' failed in GtkScrollbar
14:43:50 [2020-08-25T18:43:50.889Z] 
14:43:50 [2020-08-25T18:43:50.889Z] (SWT:1624): Gtk-CRITICAL **: 18:43:50.794: gtk_box_gadget_distribute: assertion 'size >= 0' failed in GtkScrollbar
14:43:50 [2020-08-25T18:43:50.889Z] 
14:43:50 [2020-08-25T18:43:50.889Z] (SWT:1624): Gtk-CRITICAL **: 18:43:50.794: gtk_box_gadget_distribute: assertion 'size >= 0' failed in GtkScrollbar
14:43:50 [2020-08-25T18:43:50.889Z] 
14:43:50 [2020-08-25T18:43:50.889Z] (SWT:1624): Gtk-CRITICAL **: 18:43:50.819: gtk_box_gadget_distribute: assertion 'size >= 0' failed in GtkScrollbar
14:43:50 [2020-08-25T18:43:50.889Z] 
14:43:50 [2020-08-25T18:43:50.889Z] (SWT:1624): Gtk-CRITICAL **: 18:43:50.819: gtk_box_gadget_distribute: assertion 'size >= 0' failed in GtkScrollbar
14:43:50 [2020-08-25T18:43:50.889Z] 
14:43:50 [2020-08-25T18:43:50.889Z] (SWT:1624): Gtk-CRITICAL **: 18:43:50.828: gtk_box_gadget_distribute: assertion 'size >= 0' failed in GtkScrollbar
14:43:50 [2020-08-25T18:43:50.889Z] 
14:43:50 [2020-08-25T18:43:50.889Z] (SWT:1624): Gtk-CRITICAL **: 18:43:50.828: gtk_box_gadget_distribute: assertion 'size >= 0' failed in GtkScrollbar
14:43:50 [2020-08-25T18:43:50.889Z] 
14:43:50 [2020-08-25T18:43:50.889Z] (SWT:1624): Gtk-CRITICAL **: 18:43:50.835: gtk_box_gadget_distribute: assertion 'size >= 0' failed in GtkScrollbar
14:43:50 [2020-08-25T18:43:50.889Z] 
14:43:50 [2020-08-25T18:43:50.889Z] (SWT:1624): Gtk-CRITICAL **: 18:43:50.835: gtk_box_gadget_distribute: assertion 'size >= 0' failed in GtkScrollbar
14:43:50 [2020-08-25T18:43:50.889Z] 
14:43:50 [2020-08-25T18:43:50.889Z] (SWT:1624): Gtk-CRITICAL **: 18:43:50.835: gtk_box_gadget_distribute: assertion 'size >= 0' failed in GtkScrollbar
14:43:50 [2020-08-25T18:43:50.889Z] 
14:43:50 [2020-08-25T18:43:50.889Z] (SWT:1624): Gtk-WARNING **: 18:43:50.880: Negative content width -6 (allocation 1, extents 4x3) while allocating gadget (node toolbar, owner GtkToolbar)
14:43:51 [2020-08-25T18:43:51.453Z] 
14:43:51 [2020-08-25T18:43:51.453Z] (SWT:1624): Gtk-WARNING **: 18:43:51.417: Negative content width -6 (allocation 1, extents 4x3) while allocating gadget (node toolbar, owner GtkToolbar)
14:43:51 [2020-08-25T18:43:51.453Z] 
14:43:51 [2020-08-25T18:43:51.453Z] (SWT:1624): Gtk-WARNING **: 18:43:51.426: Negative content width -6 (allocation 1, extents 4x3) while allocating gadget (node toolbar, owner GtkToolbar)
14:43:52 [2020-08-25T18:43:52.018Z] 
14:43:52 [2020-08-25T18:43:52.018Z] (SWT:1624): Gtk-WARNING **: 18:43:52.011: Negative content width -6 (allocation 1, extents 4x3) while allocating gadget (node toolbar, owner GtkToolbar)
14:43:52 [2020-08-25T18:43:52.583Z] 
14:43:52 [2020-08-25T18:43:52.583Z] (SWT:1624): Gtk-CRITICAL **: 18:43:52.454: gtk_box_gadget_distribute: assertion 'size >= 0' failed in GtkScrollbar
14:43:52 [2020-08-25T18:43:52.583Z] 
14:43:52 [2020-08-25T18:43:52.583Z] (SWT:1624): Gtk-CRITICAL **: 18:43:52.461: gtk_box_gadget_distribute: assertion 'size >= 0' failed in GtkScrollbar
14:43:52 [2020-08-25T18:43:52.583Z] 
14:43:52 [2020-08-25T18:43:52.583Z] (SWT:1624): Gtk-WARNING **: 18:43:52.464: Negative content width -6 (allocation 1, extents 4x3) while allocating gadget (node toolbar, owner GtkToolbar)
14:43:52 [2020-08-25T18:43:52.583Z] 
14:43:52 [2020-08-25T18:43:52.583Z] (SWT:1624): Gtk-CRITICAL **: 18:43:52.470: gtk_box_gadget_distribute: assertion 'size >= 0' failed in GtkScrollbar
14:43:52 [2020-08-25T18:43:52.583Z] 
14:43:52 [2020-08-25T18:43:52.583Z] (SWT:1624): Gtk-CRITICAL **: 18:43:52.475: gtk_box_gadget_distribute: assertion 'size >= 0' failed in GtkScrollbar
14:43:52 [2020-08-25T18:43:52.583Z] 
14:43:52 [2020-08-25T18:43:52.583Z] (SWT:1624): Gtk-CRITICAL **: 18:43:52.476: gtk_box_gadget_distribute: assertion 'size >= 0' failed in GtkScrollbar
14:43:52 [2020-08-25T18:43:52.583Z] 
14:43:52 [2020-08-25T18:43:52.583Z] (SWT:1624): Gtk-CRITICAL **: 18:43:52.477: gtk_box_gadget_distribute: assertion 'size >= 0' failed in GtkScrollbar
14:43:52 [2020-08-25T18:43:52.583Z] 
14:43:52 [2020-08-25T18:43:52.583Z] (SWT:1624): Gtk-CRITICAL **: 18:43:52.477: gtk_box_gadget_distribute: assertion 'size >= 0' failed in GtkScrollbar
14:43:52 [2020-08-25T18:43:52.583Z] 
14:43:52 [2020-08-25T18:43:52.583Z] (SWT:1624): Gtk-CRITICAL **: 18:43:52.477: gtk_box_gadget_distribute: assertion 'size >= 0' failed in GtkScrollbar
14:43:52 [2020-08-25T18:43:52.583Z] 
14:43:52 [2020-08-25T18:43:52.583Z] (SWT:1624): Gtk-CRITICAL **: 18:43:52.485: gtk_box_gadget_distribute: assertion 'size >= 0' failed in GtkScrollbar
14:43:52 [2020-08-25T18:43:52.583Z] 
14:43:52 [2020-08-25T18:43:52.583Z] (SWT:1624): Gtk-CRITICAL **: 18:43:52.485: gtk_box_gadget_distribute: assertion 'size >= 0' failed in GtkScrollbar
14:43:52 [2020-08-25T18:43:52.583Z] 
14:43:52 [2020-08-25T18:43:52.583Z] (SWT:1624): Gtk-CRITICAL **: 18:43:52.498: gtk_box_gadget_distribute: assertion 'size >= 0' failed in GtkScrollbar
14:43:52 [2020-08-25T18:43:52.583Z] 
14:43:52 [2020-08-25T18:43:52.583Z] (SWT:1624): Gtk-CRITICAL **: 18:43:52.509: gtk_box_gadget_distribute: assertion 'size >= 0' failed in GtkScrollbar
14:43:52 [2020-08-25T18:43:52.583Z] 
14:43:52 [2020-08-25T18:43:52.583Z] (SWT:1624): Gtk-CRITICAL **: 18:43:52.509: gtk_box_gadget_distribute: assertion 'size >= 0' failed in GtkScrollbar
14:43:52 [2020-08-25T18:43:52.583Z] 
14:43:52 [2020-08-25T18:43:52.583Z] (SWT:1624): Gtk-CRITICAL **: 18:43:52.526: gtk_box_gadget_distribute: assertion 'size >= 0' failed in GtkScrollbar
14:43:52 [2020-08-25T18:43:52.584Z] 
14:43:52 [2020-08-25T18:43:52.584Z] (SWT:1624): Gtk-CRITICAL **: 18:43:52.526: gtk_box_gadget_distribute: assertion 'size >= 0' failed in GtkScrollbar
14:43:52 [2020-08-25T18:43:52.584Z] 
14:43:52 [2020-08-25T18:43:52.584Z] (SWT:1624): Gtk-CRITICAL **: 18:43:52.542: gtk_box_gadget_distribute: assertion 'size >= 0' failed in GtkScrollbar
14:43:52 [2020-08-25T18:43:52.584Z] 
14:43:52 [2020-08-25T18:43:52.584Z] (SWT:1624): Gtk-CRITICAL **: 18:43:52.542: gtk_box_gadget_distribute: assertion 'size >= 0' failed in GtkScrollbar
14:43:52 [2020-08-25T18:43:52.584Z] 
14:43:52 [2020-08-25T18:43:52.584Z] (SWT:1624): Gtk-CRITICAL **: 18:43:52.559: gtk_box_gadget_distribute: assertion 'size >= 0' failed in GtkScrollbar
14:43:52 [2020-08-25T18:43:52.584Z] 
14:43:52 [2020-08-25T18:43:52.584Z] (SWT:1624): Gtk-CRITICAL **: 18:43:52.559: gtk_box_gadget_distribute: assertion 'size >= 0' failed in GtkScrollbar
14:43:52 [2020-08-25T18:43:52.584Z] 
14:43:52 [2020-08-25T18:43:52.584Z] (SWT:1624): Gtk-CRITICAL **: 18:43:52.575: gtk_box_gadget_distribute: assertion 'size >= 0' failed in GtkScrollbar
14:43:52 [2020-08-25T18:43:52.584Z] 
14:43:52 [2020-08-25T18:43:52.584Z] (SWT:1624): Gtk-CRITICAL **: 18:43:52.576: gtk_box_gadget_distribute: assertion 'size >= 0' failed in GtkScrollbar
14:43:52 [2020-08-25T18:43:52.841Z] 
14:43:52 [2020-08-25T18:43:52.841Z] (SWT:1624): Gtk-CRITICAL **: 18:43:52.592: gtk_box_gadget_distribute: assertion 'size >= 0' failed in GtkScrollbar
14:43:52 [2020-08-25T18:43:52.841Z] 
14:43:52 [2020-08-25T18:43:52.841Z] (SWT:1624): Gtk-CRITICAL **: 18:43:52.592: gtk_box_gadget_distribute: assertion 'size >= 0' failed in GtkScrollbar
14:43:52 [2020-08-25T18:43:52.841Z] 
14:43:52 [2020-08-25T18:43:52.841Z] (SWT:1624): Gtk-CRITICAL **: 18:43:52.618: gtk_box_gadget_distribute: assertion 'size >= 0' failed in GtkScrollbar
14:43:52 [2020-08-25T18:43:52.841Z] 
14:43:52 [2020-08-25T18:43:52.841Z] (SWT:1624): Gtk-CRITICAL **: 18:43:52.618: gtk_box_gadget_distribute: assertion 'size >= 0' failed in GtkScrollbar
14:43:52 [2020-08-25T18:43:52.841Z] 
14:43:52 [2020-08-25T18:43:52.841Z] (SWT:1624): Gtk-CRITICAL **: 18:43:52.626: gtk_box_gadget_distribute: assertion 'size >= 0' failed in GtkScrollbar
14:43:52 [2020-08-25T18:43:52.841Z] 
14:43:52 [2020-08-25T18:43:52.841Z] (SWT:1624): Gtk-CRITICAL **: 18:43:52.626: gtk_box_gadget_distribute: assertion 'size >= 0' failed in GtkScrollbar
14:43:52 [2020-08-25T18:43:52.841Z] 
14:43:52 [2020-08-25T18:43:52.841Z] (SWT:1624): Gtk-CRITICAL **: 18:43:52.642: gtk_box_gadget_distribute: assertion 'size >= 0' failed in GtkScrollbar
14:43:52 [2020-08-25T18:43:52.841Z] 
14:43:52 [2020-08-25T18:43:52.841Z] (SWT:1624): Gtk-CRITICAL **: 18:43:52.642: gtk_box_gadget_distribute: assertion 'size >= 0' failed in GtkScrollbar
14:43:52 [2020-08-25T18:43:52.841Z] 
14:43:52 [2020-08-25T18:43:52.841Z] (SWT:1624): Gtk-CRITICAL **: 18:43:52.659: gtk_box_gadget_distribute: assertion 'size >= 0' failed in GtkScrollbar
14:43:52 [2020-08-25T18:43:52.841Z] 
14:43:52 [2020-08-25T18:43:52.841Z] (SWT:1624): Gtk-CRITICAL **: 18:43:52.660: gtk_box_gadget_distribute: assertion 'size >= 0' failed in GtkScrollbar
14:43:52 [2020-08-25T18:43:52.841Z] 
14:43:52 [2020-08-25T18:43:52.841Z] (SWT:1624): Gtk-CRITICAL **: 18:43:52.674: gtk_box_gadget_distribute: assertion 'size >= 0' failed in GtkScrollbar
14:43:52 [2020-08-25T18:43:52.841Z] 
14:43:52 [2020-08-25T18:43:52.841Z] (SWT:1624): Gtk-CRITICAL **: 18:43:52.674: gtk_box_gadget_distribute: assertion 'size >= 0' failed in GtkScrollbar
14:43:52 [2020-08-25T18:43:52.841Z] 
14:43:52 [2020-08-25T18:43:52.841Z] (SWT:1624): Gtk-CRITICAL **: 18:43:52.681: gtk_box_gadget_distribute: assertion 'size >= 0' failed in GtkScrollbar
14:43:52 [2020-08-25T18:43:52.841Z] 
14:43:52 [2020-08-25T18:43:52.841Z] (SWT:1624): Gtk-CRITICAL **: 18:43:52.681: gtk_box_gadget_distribute: assertion 'size >= 0' failed in GtkScrollbar
14:43:52 [2020-08-25T18:43:52.841Z] 
14:43:52 [2020-08-25T18:43:52.841Z] (SWT:1624): Gtk-CRITICAL **: 18:43:52.681: gtk_box_gadget_distribute: assertion 'size >= 0' failed in GtkScrollbar
14:43:52 [2020-08-25T18:43:52.841Z] 
14:43:52 [2020-08-25T18:43:52.841Z] (SWT:1624): Gtk-CRITICAL **: 18:43:52.695: gtk_box_gadget_distribute: assertion 'size >= 0' failed in GtkScrollbar
14:43:52 [2020-08-25T18:43:52.841Z] 
14:43:52 [2020-08-25T18:43:52.841Z] (SWT:1624): Gtk-CRITICAL **: 18:43:52.695: gtk_box_gadget_distribute: assertion 'size >= 0' failed in GtkScrollbar
14:43:52 [2020-08-25T18:43:52.841Z] 
14:43:52 [2020-08-25T18:43:52.841Z] (SWT:1624): Gtk-CRITICAL **: 18:43:52.695: gtk_box_gadget_distribute: assertion 'size >= 0' failed in GtkScrollbar
14:43:52 [2020-08-25T18:43:52.841Z] 
14:43:52 [2020-08-25T18:43:52.841Z] (SWT:1624): Gtk-CRITICAL **: 18:43:52.711: gtk_box_gadget_distribute: assertion 'size >= 0' failed in GtkScrollbar
14:43:52 [2020-08-25T18:43:52.841Z] 
14:43:52 [2020-08-25T18:43:52.841Z] (SWT:1624): Gtk-CRITICAL **: 18:43:52.711: gtk_box_gadget_distribute: assertion 'size >= 0' failed in GtkScrollbar
14:43:52 [2020-08-25T18:43:52.841Z] 
14:43:52 [2020-08-25T18:43:52.841Z] (SWT:1624): Gtk-WARNING **: 18:43:52.734: Negative content width -6 (allocation 1, extents 4x3) while allocating gadget (node toolbar, owner GtkToolbar)
14:43:53 [2020-08-25T18:43:53.406Z] 
14:43:53 [2020-08-25T18:43:53.406Z] (SWT:1624): Gtk-WARNING **: 18:43:53.250: Negative content width -6 (allocation 1, extents 4x3) while allocating gadget (node toolbar, owner GtkToolbar)
14:43:53 [2020-08-25T18:43:53.406Z] 
14:43:53 [2020-08-25T18:43:53.406Z] (SWT:1624): Gtk-WARNING **: 18:43:53.260: Negative content width -6 (allocation 1, extents 4x3) while allocating gadget (node toolbar, owner GtkToolbar)
14:43:53 [2020-08-25T18:43:53.406Z] Tests run: 3, Failures: 0, Errors: 0, Skipped: 0, Time elapsed: 5.44 s - in org.eclipse.egit.ui.test.stagview.CommitMessageProvidersTest
14:43:53 [2020-08-25T18:43:53.406Z] testCaretPosition(org.eclipse.egit.ui.test.stagview.CommitMessageProvidersTest)  Time elapsed: 1.866 s
14:43:53 [2020-08-25T18:43:53.406Z] testTwoProvidersFromSameExtension(org.eclipse.egit.ui.test.stagview.CommitMessageProvidersTest)  Time elapsed: 1.719 s
14:43:53 [2020-08-25T18:43:53.406Z] testCaretPositionUndefined(org.eclipse.egit.ui.test.stagview.CommitMessageProvidersTest)  Time elapsed: 1.849 s
14:43:53 [2020-08-25T18:43:53.406Z] Running org.eclipse.egit.ui.variables.DynamicVariablesTest
14:43:58 [2020-08-25T18:43:58.670Z] Tests run: 4, Failures: 0, Errors: 0, Skipped: 0, Time elapsed: 4.315 s - in org.eclipse.egit.ui.variables.DynamicVariablesTest
14:43:58 [2020-08-25T18:43:58.670Z] testGitBranch(org.eclipse.egit.ui.variables.DynamicVariablesTest)  Time elapsed: 1.104 s
14:43:58 [2020-08-25T18:43:58.670Z] testGitPath(org.eclipse.egit.ui.variables.DynamicVariablesTest)  Time elapsed: 1.072 s
14:43:58 [2020-08-25T18:43:58.670Z] testGitWorkTree(org.eclipse.egit.ui.variables.DynamicVariablesTest)  Time elapsed: 1.071 s
14:43:58 [2020-08-25T18:43:58.670Z] testGitDir(org.eclipse.egit.ui.variables.DynamicVariablesTest)  Time elapsed: 1.068 s
14:43:58 [2020-08-25T18:43:58.670Z] Running org.eclipse.egit.ui.gitflow.FeatureFinishSquashHandlerTest
14:43:58 [2020-08-25T18:43:58.670Z] 
14:43:58 [2020-08-25T18:43:58.670Z] (SWT:1624): Gtk-CRITICAL **: 18:43:58.406: gtk_box_gadget_distribute: assertion 'size >= 0' failed in GtkScrollbar
14:43:58 [2020-08-25T18:43:58.670Z] 
14:43:58 [2020-08-25T18:43:58.670Z] (SWT:1624): Gtk-CRITICAL **: 18:43:58.426: gtk_box_gadget_distribute: assertion 'size >= 0' failed in GtkScrollbar
14:43:58 [2020-08-25T18:43:58.670Z] 
14:43:58 [2020-08-25T18:43:58.670Z] (SWT:1624): Gtk-CRITICAL **: 18:43:58.441: gtk_box_gadget_distribute: assertion 'size >= 0' failed in GtkScrollbar
14:43:58 [2020-08-25T18:43:58.670Z] 
14:43:58 [2020-08-25T18:43:58.670Z] (SWT:1624): Gtk-CRITICAL **: 18:43:58.459: gtk_box_gadget_distribute: assertion 'size >= 0' failed in GtkScrollbar
14:43:58 [2020-08-25T18:43:58.670Z] 
14:43:58 [2020-08-25T18:43:58.670Z] (SWT:1624): Gtk-CRITICAL **: 18:43:58.475: gtk_box_gadget_distribute: assertion 'size >= 0' failed in GtkScrollbar
14:43:58 [2020-08-25T18:43:58.670Z] 
14:43:58 [2020-08-25T18:43:58.670Z] (SWT:1624): Gtk-CRITICAL **: 18:43:58.492: gtk_box_gadget_distribute: assertion 'size >= 0' failed in GtkScrollbar
14:43:58 [2020-08-25T18:43:58.670Z] 
14:43:58 [2020-08-25T18:43:58.670Z] (SWT:1624): Gtk-CRITICAL **: 18:43:58.508: gtk_box_gadget_distribute: assertion 'size >= 0' failed in GtkScrollbar
14:43:58 [2020-08-25T18:43:58.670Z] 
14:43:58 [2020-08-25T18:43:58.670Z] (SWT:1624): Gtk-CRITICAL **: 18:43:58.525: gtk_box_gadget_distribute: assertion 'size >= 0' failed in GtkScrollbar
14:43:58 [2020-08-25T18:43:58.670Z] 
14:43:58 [2020-08-25T18:43:58.670Z] (SWT:1624): Gtk-CRITICAL **: 18:43:58.541: gtk_box_gadget_distribute: assertion 'size >= 0' failed in GtkScrollbar
14:43:58 [2020-08-25T18:43:58.670Z] 
14:43:58 [2020-08-25T18:43:58.670Z] (SWT:1624): Gtk-CRITICAL **: 18:43:58.558: gtk_box_gadget_distribute: assertion 'size >= 0' failed in GtkScrollbar
14:43:58 [2020-08-25T18:43:58.670Z] 
14:43:58 [2020-08-25T18:43:58.670Z] (SWT:1624): Gtk-CRITICAL **: 18:43:58.575: gtk_box_gadget_distribute: assertion 'size >= 0' failed in GtkScrollbar
14:43:58 [2020-08-25T18:43:58.670Z] 
14:43:58 [2020-08-25T18:43:58.670Z] (SWT:1624): Gtk-CRITICAL **: 18:43:58.592: gtk_box_gadget_distribute: assertion 'size >= 0' failed in GtkScrollbar
14:43:58 [2020-08-25T18:43:58.670Z] 
14:43:58 [2020-08-25T18:43:58.670Z] (SWT:1624): Gtk-CRITICAL **: 18:43:58.608: gtk_box_gadget_distribute: assertion 'size >= 0' failed in GtkScrollbar
14:43:58 [2020-08-25T18:43:58.670Z] 
14:43:58 [2020-08-25T18:43:58.670Z] (SWT:1624): Gtk-CRITICAL **: 18:43:58.625: gtk_box_gadget_distribute: assertion 'size >= 0' failed in GtkScrollbar
14:43:59 [2020-08-25T18:43:59.234Z] 
14:43:59 [2020-08-25T18:43:59.234Z] (SWT:1624): Gtk-CRITICAL **: 18:43:59.167: gtk_box_gadget_distribute: assertion 'size >= 0' failed in GtkScrollbar
14:44:00 [2020-08-25T18:44:00.167Z] Tests run: 1, Failures: 0, Errors: 0, Skipped: 0, Time elapsed: 2.097 s - in org.eclipse.egit.ui.gitflow.FeatureFinishSquashHandlerTest
14:44:00 [2020-08-25T18:44:00.167Z] testFeatureFinishSquash(org.eclipse.egit.ui.gitflow.FeatureFinishSquashHandlerTest)  Time elapsed: 2.093 s
14:44:00 [2020-08-25T18:44:00.167Z] Running org.eclipse.egit.ui.gitflow.FeatureStartFinishHandlerTest
14:44:00 [2020-08-25T18:44:00.732Z] 
14:44:00 [2020-08-25T18:44:00.732Z] (SWT:1624): Gtk-CRITICAL **: 18:44:00.428: gtk_box_gadget_distribute: assertion 'size >= 0' failed in GtkScrollbar
14:44:00 [2020-08-25T18:44:00.732Z] 
14:44:00 [2020-08-25T18:44:00.732Z] (SWT:1624): Gtk-CRITICAL **: 18:44:00.441: gtk_box_gadget_distribute: assertion 'size >= 0' failed in GtkScrollbar
14:44:00 [2020-08-25T18:44:00.732Z] 
14:44:00 [2020-08-25T18:44:00.732Z] (SWT:1624): Gtk-CRITICAL **: 18:44:00.457: gtk_box_gadget_distribute: assertion 'size >= 0' failed in GtkScrollbar
14:44:00 [2020-08-25T18:44:00.732Z] 
14:44:00 [2020-08-25T18:44:00.732Z] (SWT:1624): Gtk-CRITICAL **: 18:44:00.475: gtk_box_gadget_distribute: assertion 'size >= 0' failed in GtkScrollbar
14:44:00 [2020-08-25T18:44:00.732Z] 
14:44:00 [2020-08-25T18:44:00.732Z] (SWT:1624): Gtk-CRITICAL **: 18:44:00.491: gtk_box_gadget_distribute: assertion 'size >= 0' failed in GtkScrollbar
14:44:00 [2020-08-25T18:44:00.732Z] 
14:44:00 [2020-08-25T18:44:00.732Z] (SWT:1624): Gtk-CRITICAL **: 18:44:00.508: gtk_box_gadget_distribute: assertion 'size >= 0' failed in GtkScrollbar
14:44:00 [2020-08-25T18:44:00.732Z] 
14:44:00 [2020-08-25T18:44:00.732Z] (SWT:1624): Gtk-CRITICAL **: 18:44:00.524: gtk_box_gadget_distribute: assertion 'size >= 0' failed in GtkScrollbar
14:44:00 [2020-08-25T18:44:00.732Z] 
14:44:00 [2020-08-25T18:44:00.732Z] (SWT:1624): Gtk-CRITICAL **: 18:44:00.541: gtk_box_gadget_distribute: assertion 'size >= 0' failed in GtkScrollbar
14:44:00 [2020-08-25T18:44:00.732Z] 
14:44:00 [2020-08-25T18:44:00.732Z] (SWT:1624): Gtk-CRITICAL **: 18:44:00.558: gtk_box_gadget_distribute: assertion 'size >= 0' failed in GtkScrollbar
14:44:00 [2020-08-25T18:44:00.732Z] 
14:44:00 [2020-08-25T18:44:00.732Z] (SWT:1624): Gtk-CRITICAL **: 18:44:00.575: gtk_box_gadget_distribute: assertion 'size >= 0' failed in GtkScrollbar
14:44:00 [2020-08-25T18:44:00.732Z] 
14:44:00 [2020-08-25T18:44:00.732Z] (SWT:1624): Gtk-CRITICAL **: 18:44:00.591: gtk_box_gadget_distribute: assertion 'size >= 0' failed in GtkScrollbar
14:44:00 [2020-08-25T18:44:00.732Z] 
14:44:00 [2020-08-25T18:44:00.732Z] (SWT:1624): Gtk-CRITICAL **: 18:44:00.607: gtk_box_gadget_distribute: assertion 'size >= 0' failed in GtkScrollbar
14:44:00 [2020-08-25T18:44:00.732Z] 
14:44:00 [2020-08-25T18:44:00.732Z] (SWT:1624): Gtk-CRITICAL **: 18:44:00.624: gtk_box_gadget_distribute: assertion 'size >= 0' failed in GtkScrollbar
14:44:01 [2020-08-25T18:44:01.297Z] 
14:44:01 [2020-08-25T18:44:01.297Z] (SWT:1624): Gtk-CRITICAL **: 18:44:01.140: gtk_box_gadget_distribute: assertion 'size >= 0' failed in GtkScrollbar
14:44:01 [2020-08-25T18:44:01.869Z] Tests run: 1, Failures: 0, Errors: 0, Skipped: 0, Time elapsed: 1.962 s - in org.eclipse.egit.ui.gitflow.FeatureStartFinishHandlerTest
14:44:01 [2020-08-25T18:44:01.869Z] testFeatureStart(org.eclipse.egit.ui.gitflow.FeatureStartFinishHandlerTest)  Time elapsed: 1.959 s
14:44:01 [2020-08-25T18:44:01.869Z] Running org.eclipse.egit.ui.gitflow.InitHandlerTest
14:44:06 [2020-08-25T18:44:06.058Z] Tests run: 3, Failures: 0, Errors: 0, Skipped: 0, Time elapsed: 3.433 s - in org.eclipse.egit.ui.gitflow.InitHandlerTest
14:44:06 [2020-08-25T18:44:06.058Z] testInit(org.eclipse.egit.ui.gitflow.InitHandlerTest)  Time elapsed: 0.729 s
14:44:06 [2020-08-25T18:44:06.058Z] testInitEmptyRepoMissingMaster(org.eclipse.egit.ui.gitflow.InitHandlerTest)  Time elapsed: 1.382 s
14:44:06 [2020-08-25T18:44:06.058Z] testInitMissingMaster(org.eclipse.egit.ui.gitflow.InitHandlerTest)  Time elapsed: 1.316 s
14:44:06 [2020-08-25T18:44:06.058Z] Running org.eclipse.egit.ui.gitflow.FeatureRebaseHandlerTest
14:44:06 [2020-08-25T18:44:06.058Z] 
14:44:06 [2020-08-25T18:44:06.058Z] (SWT:1624): Gtk-WARNING **: 18:44:05.994: Negative content width -6 (allocation 1, extents 4x3) while allocating gadget (node toolbar, owner GtkToolbar)
14:44:06 [2020-08-25T18:44:06.058Z] 
14:44:06 [2020-08-25T18:44:06.058Z] (SWT:1624): Gtk-WARNING **: 18:44:05.999: Negative content width -6 (allocation 1, extents 4x3) while allocating gadget (node toolbar, owner GtkToolbar)
14:44:06 [2020-08-25T18:44:06.058Z] 
14:44:06 [2020-08-25T18:44:06.058Z] (SWT:1624): Gtk-WARNING **: 18:44:06.002: Negative content width -6 (allocation 1, extents 4x3) while allocating gadget (node toolbar, owner GtkToolbar)
14:44:06 [2020-08-25T18:44:06.058Z] 
14:44:06 [2020-08-25T18:44:06.058Z] (SWT:1624): Gtk-WARNING **: 18:44:06.004: Negative content width -6 (allocation 1, extents 4x3) while allocating gadget (node toolbar, owner GtkToolbar)
14:44:06 [2020-08-25T18:44:06.058Z] 
14:44:06 [2020-08-25T18:44:06.058Z] (SWT:1624): Gtk-WARNING **: 18:44:06.004: Negative content width -6 (allocation 1, extents 4x3) while allocating gadget (node toolbar, owner GtkToolbar)
14:44:06 [2020-08-25T18:44:06.058Z] 
14:44:06 [2020-08-25T18:44:06.058Z] (SWT:1624): Gtk-WARNING **: 18:44:06.033: Negative content width -6 (allocation 1, extents 4x3) while allocating gadget (node toolbar, owner GtkToolbar)
14:44:06 [2020-08-25T18:44:06.626Z] 
14:44:06 [2020-08-25T18:44:06.626Z] (SWT:1624): Gtk-WARNING **: 18:44:06.471: Negative content height -1 (allocation 1, extents 1x1) while allocating gadget (node scrolledwindow, owner GtkScrolledWindow)
14:44:06 [2020-08-25T18:44:06.626Z] 
14:44:06 [2020-08-25T18:44:06.626Z] (SWT:1624): Gtk-CRITICAL **: 18:44:06.471: gtk_box_gadget_distribute: assertion 'size >= 0' failed in GtkScrollbar
14:44:06 [2020-08-25T18:44:06.626Z] 
14:44:06 [2020-08-25T18:44:06.626Z] (SWT:1624): Gtk-WARNING **: 18:44:06.519: Negative content width -6 (allocation 1, extents 4x3) while allocating gadget (node toolbar, owner GtkToolbar)
14:44:08 [2020-08-25T18:44:08.004Z] 
14:44:08 [2020-08-25T18:44:08.004Z] (SWT:1624): Gtk-WARNING **: 18:44:07.836: Negative content height -1 (allocation 1, extents 1x1) while allocating gadget (node scrolledwindow, owner GtkScrolledWindow)
14:44:08 [2020-08-25T18:44:08.004Z] 
14:44:08 [2020-08-25T18:44:08.004Z] (SWT:1624): Gtk-CRITICAL **: 18:44:07.836: gtk_box_gadget_distribute: assertion 'size >= 0' failed in GtkScrollbar
14:44:08 [2020-08-25T18:44:08.004Z] Tests run: 2, Failures: 0, Errors: 0, Skipped: 0, Time elapsed: 2.715 s - in org.eclipse.egit.ui.gitflow.FeatureRebaseHandlerTest
14:44:08 [2020-08-25T18:44:08.004Z] testRebaseFailOnConflict(org.eclipse.egit.ui.gitflow.FeatureRebaseHandlerTest)  Time elapsed: 1.373 s
14:44:08 [2020-08-25T18:44:08.004Z] testRebaseFailOnDirtyWorkingDirectory(org.eclipse.egit.ui.gitflow.FeatureRebaseHandlerTest)  Time elapsed: 1.335 s
14:44:08 [2020-08-25T18:44:08.004Z] Running org.eclipse.egit.ui.gitflow.FeatureStartCheckoutConflictTest
14:44:08 [2020-08-25T18:44:08.569Z] 
14:44:08 [2020-08-25T18:44:08.569Z] (SWT:1624): Gtk-CRITICAL **: 18:44:08.550: gtk_box_gadget_distribute: assertion 'size >= 0' failed in GtkScrollbar
14:44:08 [2020-08-25T18:44:08.569Z] 
14:44:08 [2020-08-25T18:44:08.569Z] (SWT:1624): Gtk-CRITICAL **: 18:44:08.559: gtk_box_gadget_distribute: assertion 'size >= 0' failed in GtkScrollbar
14:44:08 [2020-08-25T18:44:08.826Z] Tests run: 1, Failures: 0, Errors: 0, Skipped: 0, Time elapsed: 0.736 s - in org.eclipse.egit.ui.gitflow.FeatureStartCheckoutConflictTest
14:44:08 [2020-08-25T18:44:08.826Z] testFeatureStart(org.eclipse.egit.ui.gitflow.FeatureStartCheckoutConflictTest)  Time elapsed: 0.732 s
14:44:08 [2020-08-25T18:44:08.826Z] Running org.eclipse.egit.ui.gitflow.CommandEnablementTest
14:44:10 [2020-08-25T18:44:10.196Z] 
14:44:10 [2020-08-25T18:44:10.196Z] (SWT:1624): Gtk-WARNING **: 18:44:09.818: Negative content width -6 (allocation 1, extents 4x3) while allocating gadget (node toolbar, owner GtkToolbar)
14:44:10 [2020-08-25T18:44:10.196Z] 
14:44:10 [2020-08-25T18:44:10.196Z] (SWT:1624): Gtk-WARNING **: 18:44:09.970: Negative content width -6 (allocation 1, extents 4x3) while allocating gadget (node toolbar, owner GtkToolbar)
14:44:10 [2020-08-25T18:44:10.196Z] Tests run: 2, Failures: 0, Errors: 0, Skipped: 0, Time elapsed: 1.396 s - in org.eclipse.egit.ui.gitflow.CommandEnablementTest
14:44:10 [2020-08-25T18:44:10.196Z] testPackageExplorerStartFinishEnablement(org.eclipse.egit.ui.gitflow.CommandEnablementTest)  Time elapsed: 0.641 s
14:44:10 [2020-08-25T18:44:10.196Z] testRepositoryViewStartFinishEnablement(org.eclipse.egit.ui.gitflow.CommandEnablementTest)  Time elapsed: 0.749 s
14:44:10 [2020-08-25T18:44:10.196Z] Running org.eclipse.egit.ui.gitflow.FeatureFinishKeepBranchHandlerTest
14:44:11 [2020-08-25T18:44:11.127Z] 
14:44:11 [2020-08-25T18:44:11.127Z] (SWT:1624): Gtk-CRITICAL **: 18:44:11.084: gtk_box_gadget_distribute: assertion 'size >= 0' failed in GtkScrollbar
14:44:11 [2020-08-25T18:44:11.127Z] 
14:44:11 [2020-08-25T18:44:11.127Z] (SWT:1624): Gtk-CRITICAL **: 18:44:11.096: gtk_box_gadget_distribute: assertion 'size >= 0' failed in GtkScrollbar
14:44:11 [2020-08-25T18:44:11.127Z] 
14:44:11 [2020-08-25T18:44:11.127Z] (SWT:1624): Gtk-CRITICAL **: 18:44:11.113: gtk_box_gadget_distribute: assertion 'size >= 0' failed in GtkScrollbar
14:44:11 [2020-08-25T18:44:11.384Z] 
14:44:11 [2020-08-25T18:44:11.384Z] (SWT:1624): Gtk-CRITICAL **: 18:44:11.130: gtk_box_gadget_distribute: assertion 'size >= 0' failed in GtkScrollbar
14:44:11 [2020-08-25T18:44:11.384Z] 
14:44:11 [2020-08-25T18:44:11.384Z] (SWT:1624): Gtk-CRITICAL **: 18:44:11.146: gtk_box_gadget_distribute: assertion 'size >= 0' failed in GtkScrollbar
14:44:11 [2020-08-25T18:44:11.384Z] 
14:44:11 [2020-08-25T18:44:11.384Z] (SWT:1624): Gtk-CRITICAL **: 18:44:11.163: gtk_box_gadget_distribute: assertion 'size >= 0' failed in GtkScrollbar
14:44:11 [2020-08-25T18:44:11.384Z] 
14:44:11 [2020-08-25T18:44:11.384Z] (SWT:1624): Gtk-CRITICAL **: 18:44:11.180: gtk_box_gadget_distribute: assertion 'size >= 0' failed in GtkScrollbar
14:44:11 [2020-08-25T18:44:11.384Z] 
14:44:11 [2020-08-25T18:44:11.384Z] (SWT:1624): Gtk-CRITICAL **: 18:44:11.196: gtk_box_gadget_distribute: assertion 'size >= 0' failed in GtkScrollbar
14:44:11 [2020-08-25T18:44:11.384Z] 
14:44:11 [2020-08-25T18:44:11.384Z] (SWT:1624): Gtk-CRITICAL **: 18:44:11.213: gtk_box_gadget_distribute: assertion 'size >= 0' failed in GtkScrollbar
14:44:11 [2020-08-25T18:44:11.384Z] 
14:44:11 [2020-08-25T18:44:11.384Z] (SWT:1624): Gtk-CRITICAL **: 18:44:11.230: gtk_box_gadget_distribute: assertion 'size >= 0' failed in GtkScrollbar
14:44:11 [2020-08-25T18:44:11.384Z] 
14:44:11 [2020-08-25T18:44:11.384Z] (SWT:1624): Gtk-CRITICAL **: 18:44:11.246: gtk_box_gadget_distribute: assertion 'size >= 0' failed in GtkScrollbar
14:44:11 [2020-08-25T18:44:11.384Z] 
14:44:11 [2020-08-25T18:44:11.384Z] (SWT:1624): Gtk-CRITICAL **: 18:44:11.263: gtk_box_gadget_distribute: assertion 'size >= 0' failed in GtkScrollbar
14:44:11 [2020-08-25T18:44:11.384Z] 
14:44:11 [2020-08-25T18:44:11.384Z] (SWT:1624): Gtk-CRITICAL **: 18:44:11.279: gtk_box_gadget_distribute: assertion 'size >= 0' failed in GtkScrollbar
14:44:11 [2020-08-25T18:44:11.947Z] 
14:44:11 [2020-08-25T18:44:11.947Z] (SWT:1624): Gtk-CRITICAL **: 18:44:11.844: gtk_box_gadget_distribute: assertion 'size >= 0' failed in GtkScrollbar
14:44:12 [2020-08-25T18:44:12.512Z] Tests run: 1, Failures: 0, Errors: 0, Skipped: 0, Time elapsed: 2.32 s - in org.eclipse.egit.ui.gitflow.FeatureFinishKeepBranchHandlerTest
14:44:12 [2020-08-25T18:44:12.512Z] testFeatureFinishKeepBranch(org.eclipse.egit.ui.gitflow.FeatureFinishKeepBranchHandlerTest)  Time elapsed: 2.317 s
14:44:12 [2020-08-25T18:44:12.512Z] Running org.eclipse.egit.ui.wizards.share.SharingWizardTest
14:44:12 [2020-08-25T18:44:12.512Z] 
14:44:12 [2020-08-25T18:44:12.512Z] (SWT:1624): Gtk-CRITICAL **: 18:44:12.460: gtk_box_gadget_distribute: assertion 'size >= 0' failed in GtkScrollbar
14:44:12 [2020-08-25T18:44:12.512Z] 
14:44:12 [2020-08-25T18:44:12.512Z] (SWT:1624): Gtk-WARNING **: 18:44:12.461: Negative content width -13 (allocation 5, extents 9x9) while allocating gadget (node entry, owner GtkEntry)
14:44:12 [2020-08-25T18:44:12.513Z] 
14:44:12 [2020-08-25T18:44:12.513Z] (SWT:1624): Gtk-WARNING **: 18:44:12.461: Negative content height -1 (allocation 1, extents 1x1) while allocating gadget (node scrolledwindow, owner GtkScrolledWindow)
14:44:12 [2020-08-25T18:44:12.513Z] 
14:44:12 [2020-08-25T18:44:12.513Z] (SWT:1624): Gtk-CRITICAL **: 18:44:12.461: gtk_box_gadget_distribute: assertion 'size >= 0' failed in GtkScrollbar
14:44:12 [2020-08-25T18:44:12.513Z] 
14:44:12 [2020-08-25T18:44:12.513Z] (SWT:1624): Gtk-CRITICAL **: 18:44:12.461: gtk_box_gadget_distribute: assertion 'size >= 0' failed in GtkScrollbar
14:44:13 [2020-08-25T18:44:13.077Z] 
14:44:13 [2020-08-25T18:44:13.077Z] (SWT:1624): Gtk-CRITICAL **: 18:44:13.061: gtk_box_gadget_distribute: assertion 'size >= 0' failed in GtkScrollbar
14:44:13 [2020-08-25T18:44:13.077Z] 
14:44:13 [2020-08-25T18:44:13.077Z] (SWT:1624): Gtk-WARNING **: 18:44:13.062: Negative content width -13 (allocation 5, extents 9x9) while allocating gadget (node entry, owner GtkEntry)
14:44:13 [2020-08-25T18:44:13.077Z] 
14:44:13 [2020-08-25T18:44:13.077Z] (SWT:1624): Gtk-WARNING **: 18:44:13.062: Negative content height -1 (allocation 1, extents 1x1) while allocating gadget (node scrolledwindow, owner GtkScrolledWindow)
14:44:13 [2020-08-25T18:44:13.077Z] 
14:44:13 [2020-08-25T18:44:13.077Z] (SWT:1624): Gtk-CRITICAL **: 18:44:13.062: gtk_box_gadget_distribute: assertion 'size >= 0' failed in GtkScrollbar
14:44:13 [2020-08-25T18:44:13.078Z] 
14:44:13 [2020-08-25T18:44:13.078Z] (SWT:1624): Gtk-CRITICAL **: 18:44:13.062: gtk_box_gadget_distribute: assertion 'size >= 0' failed in GtkScrollbar
14:44:14 [2020-08-25T18:44:14.058Z] 
14:44:14 [2020-08-25T18:44:14.058Z] (SWT:1624): Gtk-CRITICAL **: 18:44:13.655: gtk_box_gadget_distribute: assertion 'size >= 0' failed in GtkScrollbar
14:44:14 [2020-08-25T18:44:14.058Z] 
14:44:14 [2020-08-25T18:44:14.058Z] (SWT:1624): Gtk-WARNING **: 18:44:13.656: Negative content width -13 (allocation 5, extents 9x9) while allocating gadget (node entry, owner GtkEntry)
14:44:14 [2020-08-25T18:44:14.058Z] 
14:44:14 [2020-08-25T18:44:14.058Z] (SWT:1624): Gtk-WARNING **: 18:44:13.656: Negative content height -1 (allocation 1, extents 1x1) while allocating gadget (node scrolledwindow, owner GtkScrolledWindow)
14:44:14 [2020-08-25T18:44:14.058Z] 
14:44:14 [2020-08-25T18:44:14.058Z] (SWT:1624): Gtk-CRITICAL **: 18:44:13.656: gtk_box_gadget_distribute: assertion 'size >= 0' failed in GtkScrollbar
14:44:14 [2020-08-25T18:44:14.058Z] 
14:44:14 [2020-08-25T18:44:14.058Z] (SWT:1624): Gtk-CRITICAL **: 18:44:13.656: gtk_box_gadget_distribute: assertion 'size >= 0' failed in GtkScrollbar
14:44:14 [2020-08-25T18:44:14.316Z] 
14:44:14 [2020-08-25T18:44:14.316Z] (SWT:1624): Gtk-CRITICAL **: 18:44:14.241: gtk_box_gadget_distribute: assertion 'size >= 0' failed in GtkScrollbar
14:44:14 [2020-08-25T18:44:14.316Z] 
14:44:14 [2020-08-25T18:44:14.316Z] (SWT:1624): Gtk-WARNING **: 18:44:14.241: Negative content width -13 (allocation 5, extents 9x9) while allocating gadget (node entry, owner GtkEntry)
14:44:14 [2020-08-25T18:44:14.316Z] 
14:44:14 [2020-08-25T18:44:14.316Z] (SWT:1624): Gtk-WARNING **: 18:44:14.241: Negative content height -1 (allocation 1, extents 1x1) while allocating gadget (node scrolledwindow, owner GtkScrolledWindow)
14:44:14 [2020-08-25T18:44:14.316Z] 
14:44:14 [2020-08-25T18:44:14.316Z] (SWT:1624): Gtk-CRITICAL **: 18:44:14.242: gtk_box_gadget_distribute: assertion 'size >= 0' failed in GtkScrollbar
14:44:14 [2020-08-25T18:44:14.316Z] 
14:44:14 [2020-08-25T18:44:14.316Z] (SWT:1624): Gtk-CRITICAL **: 18:44:14.242: gtk_box_gadget_distribute: assertion 'size >= 0' failed in GtkScrollbar
14:44:15 [2020-08-25T18:44:15.688Z] 
14:44:15 [2020-08-25T18:44:15.688Z] (SWT:1624): Gtk-CRITICAL **: 18:44:15.627: gtk_box_gadget_distribute: assertion 'size >= 0' failed in GtkScrollbar
14:44:15 [2020-08-25T18:44:15.688Z] 
14:44:15 [2020-08-25T18:44:15.688Z] (SWT:1624): Gtk-WARNING **: 18:44:15.628: Negative content width -13 (allocation 5, extents 9x9) while allocating gadget (node entry, owner GtkEntry)
14:44:15 [2020-08-25T18:44:15.688Z] 
14:44:15 [2020-08-25T18:44:15.688Z] (SWT:1624): Gtk-WARNING **: 18:44:15.628: Negative content height -1 (allocation 1, extents 1x1) while allocating gadget (node scrolledwindow, owner GtkScrolledWindow)
14:44:15 [2020-08-25T18:44:15.688Z] 
14:44:15 [2020-08-25T18:44:15.688Z] (SWT:1624): Gtk-CRITICAL **: 18:44:15.628: gtk_box_gadget_distribute: assertion 'size >= 0' failed in GtkScrollbar
14:44:15 [2020-08-25T18:44:15.688Z] 
14:44:15 [2020-08-25T18:44:15.688Z] (SWT:1624): Gtk-CRITICAL **: 18:44:15.628: gtk_box_gadget_distribute: assertion 'size >= 0' failed in GtkScrollbar
14:44:16 [2020-08-25T18:44:16.255Z] 
14:44:16 [2020-08-25T18:44:16.255Z] (SWT:1624): Gtk-CRITICAL **: 18:44:16.218: gtk_box_gadget_distribute: assertion 'size >= 0' failed in GtkScrollbar
14:44:16 [2020-08-25T18:44:16.255Z] 
14:44:16 [2020-08-25T18:44:16.255Z] (SWT:1624): Gtk-WARNING **: 18:44:16.219: Negative content width -13 (allocation 5, extents 9x9) while allocating gadget (node entry, owner GtkEntry)
14:44:16 [2020-08-25T18:44:16.255Z] 
14:44:16 [2020-08-25T18:44:16.255Z] (SWT:1624): Gtk-WARNING **: 18:44:16.219: Negative content height -1 (allocation 1, extents 1x1) while allocating gadget (node scrolledwindow, owner GtkScrolledWindow)
14:44:16 [2020-08-25T18:44:16.255Z] 
14:44:16 [2020-08-25T18:44:16.255Z] (SWT:1624): Gtk-CRITICAL **: 18:44:16.219: gtk_box_gadget_distribute: assertion 'size >= 0' failed in GtkScrollbar
14:44:16 [2020-08-25T18:44:16.255Z] 
14:44:16 [2020-08-25T18:44:16.255Z] (SWT:1624): Gtk-CRITICAL **: 18:44:16.219: gtk_box_gadget_distribute: assertion 'size >= 0' failed in GtkScrollbar
14:44:16 [2020-08-25T18:44:16.512Z] 
14:44:16 [2020-08-25T18:44:16.512Z] (SWT:1624): Gtk-CRITICAL **: 18:44:16.352: gtk_box_gadget_distribute: assertion 'size >= 0' failed in GtkScrollbar
14:44:16 [2020-08-25T18:44:16.512Z] 
14:44:16 [2020-08-25T18:44:16.512Z] (SWT:1624): Gtk-WARNING **: 18:44:16.353: Negative content width -13 (allocation 5, extents 9x9) while allocating gadget (node entry, owner GtkEntry)
14:44:16 [2020-08-25T18:44:16.512Z] 
14:44:16 [2020-08-25T18:44:16.512Z] (SWT:1624): Gtk-WARNING **: 18:44:16.353: Negative content height -1 (allocation 1, extents 1x1) while allocating gadget (node scrolledwindow, owner GtkScrolledWindow)
14:44:16 [2020-08-25T18:44:16.512Z] 
14:44:16 [2020-08-25T18:44:16.512Z] (SWT:1624): Gtk-CRITICAL **: 18:44:16.353: gtk_box_gadget_distribute: assertion 'size >= 0' failed in GtkScrollbar
14:44:16 [2020-08-25T18:44:16.512Z] 
14:44:16 [2020-08-25T18:44:16.512Z] (SWT:1624): Gtk-CRITICAL **: 18:44:16.353: gtk_box_gadget_distribute: assertion 'size >= 0' failed in GtkScrollbar
14:44:17 [2020-08-25T18:44:17.884Z] 
14:44:17 [2020-08-25T18:44:17.884Z] (SWT:1624): Gtk-CRITICAL **: 18:44:17.747: gtk_box_gadget_distribute: assertion 'size >= 0' failed in GtkScrollbar
14:44:17 [2020-08-25T18:44:17.884Z] 
14:44:17 [2020-08-25T18:44:17.884Z] (SWT:1624): Gtk-WARNING **: 18:44:17.748: Negative content width -13 (allocation 5, extents 9x9) while allocating gadget (node entry, owner GtkEntry)
14:44:17 [2020-08-25T18:44:17.884Z] 
14:44:17 [2020-08-25T18:44:17.884Z] (SWT:1624): Gtk-WARNING **: 18:44:17.748: Negative content height -1 (allocation 1, extents 1x1) while allocating gadget (node scrolledwindow, owner GtkScrolledWindow)
14:44:17 [2020-08-25T18:44:17.884Z] 
14:44:17 [2020-08-25T18:44:17.884Z] (SWT:1624): Gtk-CRITICAL **: 18:44:17.748: gtk_box_gadget_distribute: assertion 'size >= 0' failed in GtkScrollbar
14:44:17 [2020-08-25T18:44:17.884Z] 
14:44:17 [2020-08-25T18:44:17.884Z] (SWT:1624): Gtk-CRITICAL **: 18:44:17.748: gtk_box_gadget_distribute: assertion 'size >= 0' failed in GtkScrollbar
14:44:19 [2020-08-25T18:44:19.257Z] Tests run: 3, Failures: 0, Errors: 0, Skipped: 0, Time elapsed: 6.679 s - in org.eclipse.egit.ui.wizards.share.SharingWizardTest
14:44:19 [2020-08-25T18:44:19.258Z] shareProjectWithExternalRepo(org.eclipse.egit.ui.wizards.share.SharingWizardTest)  Time elapsed: 3.172 s
14:44:19 [2020-08-25T18:44:19.258Z] shareProjectWithAlreadyCreatedRepos(org.eclipse.egit.ui.wizards.share.SharingWizardTest)  Time elapsed: 2.123 s
14:44:19 [2020-08-25T18:44:19.258Z] shareProjectAndCreateRepo(org.eclipse.egit.ui.wizards.share.SharingWizardTest)  Time elapsed: 1.383 s
14:44:19 [2020-08-25T18:44:19.258Z] Running org.eclipse.egit.ui.wizards.clone.GitCloneSourceProviderExtensionTest
14:44:19 [2020-08-25T18:44:19.258Z] Tests run: 1, Failures: 0, Errors: 0, Skipped: 0, Time elapsed: 0.002 s - in org.eclipse.egit.ui.wizards.clone.GitCloneSourceProviderExtensionTest
14:44:19 [2020-08-25T18:44:19.258Z] testGetRepositoryImports(org.eclipse.egit.ui.wizards.clone.GitCloneSourceProviderExtensionTest)  Time elapsed: 0.001 s
14:44:19 [2020-08-25T18:44:19.258Z] Running org.eclipse.egit.ui.wizards.clone.GitCloneWizardHttpTest
14:44:19 [2020-08-25T18:44:19.516Z] 2020-08-25 18:44:19.416:INFO::WorkbenchTestable: Logging initialized @711456ms to org.eclipse.jetty.util.log.StdErrLog
14:44:19 [2020-08-25T18:44:19.516Z] 2020-08-25 18:44:19.494:INFO:oejs.Server:WorkbenchTestable: jetty-9.4.30.v20200611; built: 2020-06-16T05:54:33.713Z; git: 271836e4c1f4612f12b7bb13ef5a92a927634b0d; jvm 1.8.0_262-b10
14:44:19 [2020-08-25T18:44:19.774Z] 2020-08-25 18:44:19.534:INFO:oejsh.ContextHandler:WorkbenchTestable: Started o.e.j.s.ServletContextHandler@5cb5a281{/sbasic,null,AVAILABLE}
14:44:19 [2020-08-25T18:44:19.774Z] 2020-08-25 18:44:19.596:INFO:oejs.AbstractConnector:WorkbenchTestable: Started ServerConnector@48ca55df{HTTP/1.1, (http/1.1)}{127.0.0.1:44071}
14:44:19 [2020-08-25T18:44:19.774Z] 2020-08-25 18:44:19.597:INFO:oejs.Server:WorkbenchTestable: Started @711637ms
14:44:22 [2020-08-25T18:44:22.316Z] 2020-08-25 18:44:21.691:INFO:oejs.AbstractConnector:WorkbenchTestable: Stopped ServerConnector@48ca55df{HTTP/1.1, (http/1.1)}{127.0.0.1:0}
14:44:22 [2020-08-25T18:44:22.316Z] 2020-08-25 18:44:21.692:INFO:oejsh.ContextHandler:WorkbenchTestable: Stopped o.e.j.s.ServletContextHandler@5cb5a281{/sbasic,null,UNAVAILABLE}
14:44:22 [2020-08-25T18:44:22.316Z] Tests run: 1, Failures: 0, Errors: 0, Skipped: 0, Time elapsed: 2.592 s - in org.eclipse.egit.ui.wizards.clone.GitCloneWizardHttpTest
14:44:22 [2020-08-25T18:44:22.316Z] canCloneARemoteRepo(org.eclipse.egit.ui.wizards.clone.GitCloneWizardHttpTest)  Time elapsed: 2.091 s
14:44:22 [2020-08-25T18:44:22.316Z] Running org.eclipse.egit.ui.wizards.clone.GitCloneWizardHttpsTest
14:44:22 [2020-08-25T18:44:22.892Z] 2020-08-25 18:44:22.606:INFO:oejs.Server:WorkbenchTestable: jetty-9.4.30.v20200611; built: 2020-06-16T05:54:33.713Z; git: 271836e4c1f4612f12b7bb13ef5a92a927634b0d; jvm 1.8.0_262-b10
14:44:22 [2020-08-25T18:44:22.893Z] 2020-08-25 18:44:22.607:INFO:oejsh.ContextHandler:WorkbenchTestable: Started o.e.j.s.ServletContextHandler@40293198{/sbasic,null,AVAILABLE}
14:44:22 [2020-08-25T18:44:22.893Z] 2020-08-25 18:44:22.613:INFO:oejs.AbstractConnector:WorkbenchTestable: Started ServerConnector@77c6fcfe{HTTP/1.1, (http/1.1)}{127.0.0.1:41141}
14:44:22 [2020-08-25T18:44:22.893Z] 2020-08-25 18:44:22.616:INFO:oejus.SslContextFactory:WorkbenchTestable: x509=X509@6160e91c(centos-7-6gvcz,h=[],w=[]) for Client@c9d002e[provider=null,keyStore=file:///tmp/jks5723115156139964686/keystore.jks,trustStore=file:///tmp/jks5723115156139964686/keystore.jks]
14:44:22 [2020-08-25T18:44:22.893Z] 2020-08-25 18:44:22.629:WARN:oejusS.config:WorkbenchTestable: Trusting all certificates configured for Client@c9d002e[provider=null,keyStore=file:///tmp/jks5723115156139964686/keystore.jks,trustStore=file:///tmp/jks5723115156139964686/keystore.jks]
14:44:22 [2020-08-25T18:44:22.893Z] 2020-08-25 18:44:22.629:WARN:oejusS.config:WorkbenchTestable: No Client EndPointIdentificationAlgorithm configured for Client@c9d002e[provider=null,keyStore=file:///tmp/jks5723115156139964686/keystore.jks,trustStore=file:///tmp/jks5723115156139964686/keystore.jks]
14:44:22 [2020-08-25T18:44:22.893Z] 2020-08-25 18:44:22.636:INFO:oejs.AbstractConnector:WorkbenchTestable: Started ServerConnector@6f6730af{SSL, (ssl, http/1.1)}{127.0.0.1:42912}
14:44:22 [2020-08-25T18:44:22.893Z] 2020-08-25 18:44:22.636:INFO:oejs.Server:WorkbenchTestable: Started @714677ms
14:44:25 [2020-08-25T18:44:25.442Z] 2020-08-25 18:44:25.088:INFO:oejs.AbstractConnector:WorkbenchTestable: Stopped ServerConnector@77c6fcfe{HTTP/1.1, (http/1.1)}{127.0.0.1:0}
14:44:25 [2020-08-25T18:44:25.442Z] 2020-08-25 18:44:25.089:INFO:oejs.AbstractConnector:WorkbenchTestable: Stopped ServerConnector@6f6730af{SSL, (ssl, http/1.1)}{127.0.0.1:0}
14:44:25 [2020-08-25T18:44:25.442Z] 2020-08-25 18:44:25.089:INFO:oejsh.ContextHandler:WorkbenchTestable: Stopped o.e.j.s.ServletContextHandler@40293198{/sbasic,null,UNAVAILABLE}
14:44:25 [2020-08-25T18:44:25.442Z] Tests run: 1, Failures: 0, Errors: 0, Skipped: 0, Time elapsed: 3.392 s - in org.eclipse.egit.ui.wizards.clone.GitCloneWizardHttpsTest
14:44:25 [2020-08-25T18:44:25.442Z] canCloneARemoteRepo(org.eclipse.egit.ui.wizards.clone.GitCloneWizardHttpsTest)  Time elapsed: 2.45 s
14:44:25 [2020-08-25T18:44:25.442Z] Running org.eclipse.egit.ui.wizards.clone.GitCloneWizardTest
14:44:32 [2020-08-25T18:44:32.029Z] Tests run: 10, Failures: 0, Errors: 0, Skipped: 2, Time elapsed: 6.155 s - in org.eclipse.egit.ui.wizards.clone.GitCloneWizardTest
14:44:32 [2020-08-25T18:44:32.029Z] canCloneARemoteRepo(org.eclipse.egit.ui.wizards.clone.GitCloneWizardTest)  Time elapsed: 1.023 s
14:44:32 [2020-08-25T18:44:32.029Z] invalidPortFreezesDialog(org.eclipse.egit.ui.wizards.clone.GitCloneWizardTest) skipped
14:44:32 [2020-08-25T18:44:32.029Z] updatesParameterFieldsInImportDialogWhenURIIsUpdated(org.eclipse.egit.ui.wizards.clone.GitCloneWizardTest)  Time elapsed: 0.792 s
14:44:32 [2020-08-25T18:44:32.029Z] clonedRepositoryShouldExistOnFileSystem(org.eclipse.egit.ui.wizards.clone.GitCloneWizardTest)  Time elapsed: 0.871 s
14:44:32 [2020-08-25T18:44:32.029Z] alteringSomeParametersDuringClone(org.eclipse.egit.ui.wizards.clone.GitCloneWizardTest)  Time elapsed: 1.36 s
14:44:32 [2020-08-25T18:44:32.029Z] gitStyleUriSelectsSshProtocol(org.eclipse.egit.ui.wizards.clone.GitCloneWizardTest)  Time elapsed: 0.237 s
14:44:32 [2020-08-25T18:44:32.029Z] invalidHostnameFreezesDialog(org.eclipse.egit.ui.wizards.clone.GitCloneWizardTest) skipped
14:44:32 [2020-08-25T18:44:32.029Z] acceptCloneCommandAsURI(org.eclipse.egit.ui.wizards.clone.GitCloneWizardTest)  Time elapsed: 0.281 s
14:44:32 [2020-08-25T18:44:32.029Z] cloneWithTagOption(org.eclipse.egit.ui.wizards.clone.GitCloneWizardTest)  Time elapsed: 0.945 s
14:44:32 [2020-08-25T18:44:32.029Z] testFileURIWithSpace(org.eclipse.egit.ui.wizards.clone.GitCloneWizardTest)  Time elapsed: 0.314 s
14:44:32 [2020-08-25T18:44:32.029Z] Running org.eclipse.egit.ui.wizards.pull.PullWizardTest
14:44:32 [2020-08-25T18:44:32.029Z] 
14:44:32 [2020-08-25T18:44:32.029Z] (SWT:1624): Gtk-WARNING **: 18:44:31.969: Negative content width -6 (allocation 1, extents 4x3) while allocating gadget (node toolbar, owner GtkToolbar)
14:44:33 [2020-08-25T18:44:33.925Z] 
14:44:33 [2020-08-25T18:44:33.925Z] (SWT:1624): Gtk-WARNING **: 18:44:33.463: Negative content width -6 (allocation 1, extents 4x3) while allocating gadget (node toolbar, owner GtkToolbar)
14:44:33 [2020-08-25T18:44:33.925Z] Tests run: 1, Failures: 0, Errors: 0, Skipped: 0, Time elapsed: 2.322 s - in org.eclipse.egit.ui.wizards.pull.PullWizardTest
14:44:33 [2020-08-25T18:44:33.925Z] pullFromProjectRepo(org.eclipse.egit.ui.wizards.pull.PullWizardTest)  Time elapsed: 2.319 s
14:44:33 [2020-08-25T18:44:33.925Z] Running org.eclipse.egit.ui.search.CommitSearchQueryTest
14:44:38 [2020-08-25T18:44:38.107Z] Tests run: 7, Failures: 0, Errors: 0, Skipped: 0, Time elapsed: 3.963 s - in org.eclipse.egit.ui.search.CommitSearchQueryTest
14:44:38 [2020-08-25T18:44:38.107Z] testQuery(org.eclipse.egit.ui.search.CommitSearchQueryTest)  Time elapsed: 0.557 s
14:44:38 [2020-08-25T18:44:38.107Z] testMatchMessage(org.eclipse.egit.ui.search.CommitSearchQueryTest)  Time elapsed: 0.553 s
14:44:38 [2020-08-25T18:44:38.107Z] testCaseInsensitive(org.eclipse.egit.ui.search.CommitSearchQueryTest)  Time elapsed: 0.576 s
14:44:38 [2020-08-25T18:44:38.107Z] testMatchCommit(org.eclipse.egit.ui.search.CommitSearchQueryTest)  Time elapsed: 0.541 s
14:44:38 [2020-08-25T18:44:38.107Z] testMatchParent(org.eclipse.egit.ui.search.CommitSearchQueryTest)  Time elapsed: 0.551 s
14:44:38 [2020-08-25T18:44:38.107Z] testMatchTree(org.eclipse.egit.ui.search.CommitSearchQueryTest)  Time elapsed: 0.573 s
14:44:38 [2020-08-25T18:44:38.107Z] testEmptyMatches(org.eclipse.egit.ui.search.CommitSearchQueryTest)  Time elapsed: 0.572 s
14:44:38 [2020-08-25T18:44:38.107Z] Running org.eclipse.egit.ui.search.CommitSearchDialogTest
14:44:38 [2020-08-25T18:44:38.365Z] 
14:44:38 [2020-08-25T18:44:38.365Z] (SWT:1624): Gtk-WARNING **: 18:44:38.215: Negative content width -6 (allocation 1, extents 4x3) while allocating gadget (node toolbar, owner GtkToolbar)
14:44:38 [2020-08-25T18:44:38.365Z] 
14:44:38 [2020-08-25T18:44:38.365Z] (SWT:1624): Gtk-WARNING **: 18:44:38.227: Negative content width -6 (allocation 1, extents 4x3) while allocating gadget (node toolbar, owner GtkToolbar)
14:44:38 [2020-08-25T18:44:38.365Z] 
14:44:38 [2020-08-25T18:44:38.365Z] (SWT:1624): Gtk-WARNING **: 18:44:38.270: Negative content width -6 (allocation 1, extents 4x3) while allocating gadget (node toolbar, owner GtkToolbar)
14:44:38 [2020-08-25T18:44:38.365Z] 
14:44:38 [2020-08-25T18:44:38.365Z] (SWT:1624): Gtk-WARNING **: 18:44:38.315: Negative content width -6 (allocation 1, extents 4x3) while allocating gadget (node toolbar, owner GtkToolbar)
14:44:39 [2020-08-25T18:44:39.297Z] 
14:44:39 [2020-08-25T18:44:39.297Z] (SWT:1624): Gtk-WARNING **: 18:44:38.981: Negative content width -6 (allocation 1, extents 4x3) while allocating gadget (node toolbar, owner GtkToolbar)
14:44:39 [2020-08-25T18:44:39.297Z] Tests run: 1, Failures: 0, Errors: 0, Skipped: 0, Time elapsed: 1.538 s - in org.eclipse.egit.ui.search.CommitSearchDialogTest
14:44:39 [2020-08-25T18:44:39.297Z] openCommitTabOnSearchDialog(org.eclipse.egit.ui.search.CommitSearchDialogTest)  Time elapsed: 1.534 s
14:44:39 [2020-08-25T18:44:39.297Z] Running org.eclipse.egit.ui.prefpages.configuration.GlobalConfigurationPageTest
14:44:39 [2020-08-25T18:44:39.297Z] 
14:44:39 [2020-08-25T18:44:39.297Z] !ENTRY org.eclipse.ui 2 2 2020-08-25 18:44:39.105
14:44:39 [2020-08-25T18:44:39.297Z] !MESSAGE Invalid preference category path: org.eclipse.ui.net.NetPreferences (bundle: org.eclipse.jsch.ui, page: org.eclipse.jsch.ui.SSHPreferences)
14:44:39 [2020-08-25T18:44:39.297Z] 
14:44:39 [2020-08-25T18:44:39.297Z] (SWT:1624): Gtk-WARNING **: 18:44:39.114: Negative content width -13 (allocation 5, extents 9x9) while allocating gadget (node entry, owner GtkEntry)
14:44:39 [2020-08-25T18:44:39.297Z] 
14:44:39 [2020-08-25T18:44:39.297Z] (SWT:1624): Gtk-WARNING **: 18:44:39.246: Negative content width -13 (allocation 5, extents 9x9) while allocating gadget (node entry, owner GtkEntry)
14:44:39 [2020-08-25T18:44:39.554Z] 
14:44:39 [2020-08-25T18:44:39.554Z] (SWT:1624): Gtk-WARNING **: 18:44:39.389: Negative content width -13 (allocation 5, extents 9x9) while allocating gadget (node entry, owner GtkEntry)
14:44:39 [2020-08-25T18:44:39.554Z] 
14:44:39 [2020-08-25T18:44:39.554Z] (SWT:1624): Gtk-WARNING **: 18:44:39.518: Negative content width -13 (allocation 5, extents 9x9) while allocating gadget (node entry, owner GtkEntry)
14:44:39 [2020-08-25T18:44:39.812Z] 
14:44:39 [2020-08-25T18:44:39.812Z] (SWT:1624): Gtk-WARNING **: 18:44:39.601: Negative content width -13 (allocation 5, extents 9x9) while allocating gadget (node entry, owner GtkEntry)
14:44:39 [2020-08-25T18:44:39.812Z] 
14:44:39 [2020-08-25T18:44:39.812Z] (SWT:1624): Gtk-WARNING **: 18:44:39.689: Negative content width -13 (allocation 5, extents 9x9) while allocating gadget (node entry, owner GtkEntry)
14:44:39 [2020-08-25T18:44:39.812Z] 
14:44:39 [2020-08-25T18:44:39.812Z] (SWT:1624): Gtk-WARNING **: 18:44:39.802: Negative content width -13 (allocation 5, extents 9x9) while allocating gadget (node entry, owner GtkEntry)
14:44:40 [2020-08-25T18:44:40.070Z] 
14:44:40 [2020-08-25T18:44:40.070Z] (SWT:1624): Gtk-WARNING **: 18:44:39.851: Negative content width -6 (allocation 1, extents 4x3) while allocating gadget (node toolbar, owner GtkToolbar)
14:44:40 [2020-08-25T18:44:40.070Z] 
14:44:40 [2020-08-25T18:44:40.070Z] (SWT:1624): Gtk-WARNING **: 18:44:39.851: Negative content height -3 (allocation 1, extents 2x2) while allocating gadget (node toolbar, owner GtkToolbar)
14:44:40 [2020-08-25T18:44:40.070Z] 
14:44:40 [2020-08-25T18:44:40.070Z] (SWT:1624): Gtk-WARNING **: 18:44:39.851: Negative content width -6 (allocation 1, extents 4x3) while allocating gadget (node toolbar, owner GtkToolbar)
14:44:40 [2020-08-25T18:44:40.070Z] 
14:44:40 [2020-08-25T18:44:40.070Z] (SWT:1624): Gtk-WARNING **: 18:44:39.851: Negative content height -3 (allocation 1, extents 2x2) while allocating gadget (node toolbar, owner GtkToolbar)
14:44:40 [2020-08-25T18:44:40.070Z] 
14:44:40 [2020-08-25T18:44:40.070Z] (SWT:1624): Gtk-WARNING **: 18:44:39.960: Negative content width -13 (allocation 5, extents 9x9) while allocating gadget (node entry, owner GtkEntry)
14:44:40 [2020-08-25T18:44:40.326Z] 
14:44:40 [2020-08-25T18:44:40.327Z] (SWT:1624): Gtk-WARNING **: 18:44:40.082: Negative content width -13 (allocation 5, extents 9x9) while allocating gadget (node entry, owner GtkEntry)
14:44:40 [2020-08-25T18:44:40.327Z] 
14:44:40 [2020-08-25T18:44:40.327Z] (SWT:1624): Gtk-WARNING **: 18:44:40.218: Negative content width -13 (allocation 5, extents 9x9) while allocating gadget (node entry, owner GtkEntry)
14:44:40 [2020-08-25T18:44:40.587Z] 
14:44:40 [2020-08-25T18:44:40.587Z] (SWT:1624): Gtk-WARNING **: 18:44:40.331: Negative content width -13 (allocation 5, extents 9x9) while allocating gadget (node entry, owner GtkEntry)
14:44:40 [2020-08-25T18:44:40.587Z] 
14:44:40 [2020-08-25T18:44:40.587Z] (SWT:1624): Gtk-WARNING **: 18:44:40.452: Negative content width -13 (allocation 5, extents 9x9) while allocating gadget (node entry, owner GtkEntry)
14:44:40 [2020-08-25T18:44:40.587Z] Tests run: 11, Failures: 0, Errors: 0, Skipped: 0, Time elapsed: 1.462 s - in org.eclipse.egit.ui.prefpages.configuration.GlobalConfigurationPageTest
14:44:40 [2020-08-25T18:44:40.587Z] testAddSubSectionEntry(org.eclipse.egit.ui.prefpages.configuration.GlobalConfigurationPageTest)  Time elapsed: 0.147 s
14:44:40 [2020-08-25T18:44:40.587Z] testAddSectionEntry(org.eclipse.egit.ui.prefpages.configuration.GlobalConfigurationPageTest)  Time elapsed: 0.143 s
14:44:40 [2020-08-25T18:44:40.587Z] testCanCreateSameEntryValue(org.eclipse.egit.ui.prefpages.configuration.GlobalConfigurationPageTest)  Time elapsed: 0.129 s
14:44:40 [2020-08-25T18:44:40.587Z] testNodes(org.eclipse.egit.ui.prefpages.configuration.GlobalConfigurationPageTest)  Time elapsed: 0.083 s
14:44:40 [2020-08-25T18:44:40.587Z] testRemoveValue(org.eclipse.egit.ui.prefpages.configuration.GlobalConfigurationPageTest)  Time elapsed: 0.088 s
14:44:40 [2020-08-25T18:44:40.587Z] testAddSubSectionEntryWithSuggestion(org.eclipse.egit.ui.prefpages.configuration.GlobalConfigurationPageTest)  Time elapsed: 0.109 s
14:44:40 [2020-08-25T18:44:40.587Z] testOpenEditor(org.eclipse.egit.ui.prefpages.configuration.GlobalConfigurationPageTest)  Time elapsed: 0.162 s
14:44:40 [2020-08-25T18:44:40.587Z] testSubsectionWithDot(org.eclipse.egit.ui.prefpages.configuration.GlobalConfigurationPageTest)  Time elapsed: 0.122 s
14:44:40 [2020-08-25T18:44:40.587Z] testChecksForKey(org.eclipse.egit.ui.prefpages.configuration.GlobalConfigurationPageTest)  Time elapsed: 0.136 s
14:44:40 [2020-08-25T18:44:40.587Z] testRemoveSubSection(org.eclipse.egit.ui.prefpages.configuration.GlobalConfigurationPageTest)  Time elapsed: 0.113 s
14:44:40 [2020-08-25T18:44:40.587Z] testRemoveSection(org.eclipse.egit.ui.prefpages.configuration.GlobalConfigurationPageTest)  Time elapsed: 0.121 s
14:44:40 [2020-08-25T18:44:40.587Z] Running org.eclipse.egit.ui.submodule.SubmoduleUpdateTest
14:44:41 [2020-08-25T18:44:41.521Z] 
14:44:41 [2020-08-25T18:44:41.521Z] (SWT:1624): Gtk-WARNING **: 18:44:41.266: Negative content width -6 (allocation 1, extents 4x3) while allocating gadget (node toolbar, owner GtkToolbar)
14:44:44 [2020-08-25T18:44:44.046Z] 
14:44:44 [2020-08-25T18:44:44.046Z] (SWT:1624): Gtk-WARNING **: 18:44:43.474: Negative content width -6 (allocation 1, extents 4x3) while allocating gadget (node toolbar, owner GtkToolbar)
14:44:44 [2020-08-25T18:44:44.046Z] Tests run: 1, Failures: 0, Errors: 0, Skipped: 0, Time elapsed: 3.019 s - in org.eclipse.egit.ui.submodule.SubmoduleUpdateTest
14:44:44 [2020-08-25T18:44:44.046Z] updateSubmodule(org.eclipse.egit.ui.submodule.SubmoduleUpdateTest)  Time elapsed: 3.015 s
14:44:44 [2020-08-25T18:44:44.047Z] Running org.eclipse.egit.ui.submodule.SubmoduleSyncTest
14:44:44 [2020-08-25T18:44:44.304Z] 
14:44:44 [2020-08-25T18:44:44.304Z] (SWT:1624): Gtk-WARNING **: 18:44:44.290: Negative content width -6 (allocation 1, extents 4x3) while allocating gadget (node toolbar, owner GtkToolbar)
14:44:46 [2020-08-25T18:44:46.831Z] 
14:44:46 [2020-08-25T18:44:46.831Z] (SWT:1624): Gtk-WARNING **: 18:44:46.663: Negative content width -6 (allocation 1, extents 4x3) while allocating gadget (node toolbar, owner GtkToolbar)
14:44:46 [2020-08-25T18:44:46.831Z] Tests run: 1, Failures: 0, Errors: 0, Skipped: 0, Time elapsed: 3.187 s - in org.eclipse.egit.ui.submodule.SubmoduleSyncTest
14:44:46 [2020-08-25T18:44:46.831Z] syncSubmodule(org.eclipse.egit.ui.submodule.SubmoduleSyncTest)  Time elapsed: 3.184 s
14:44:46 [2020-08-25T18:44:46.831Z] Running org.eclipse.egit.ui.submodule.SubmoduleAddTest
14:44:47 [2020-08-25T18:44:47.763Z] 
14:44:47 [2020-08-25T18:44:47.763Z] (SWT:1624): Gtk-WARNING **: 18:44:47.461: Negative content width -6 (allocation 1, extents 4x3) while allocating gadget (node toolbar, owner GtkToolbar)
14:44:50 [2020-08-25T18:44:50.289Z] 
14:44:50 [2020-08-25T18:44:50.289Z] (SWT:1624): Gtk-WARNING **: 18:44:50.070: Negative content width -6 (allocation 1, extents 4x3) while allocating gadget (node toolbar, owner GtkToolbar)
14:44:50 [2020-08-25T18:44:50.289Z] Tests run: 1, Failures: 0, Errors: 0, Skipped: 0, Time elapsed: 3.403 s - in org.eclipse.egit.ui.submodule.SubmoduleAddTest
14:44:50 [2020-08-25T18:44:50.289Z] addAtRoot(org.eclipse.egit.ui.submodule.SubmoduleAddTest)  Time elapsed: 3.4 s
14:44:50 [2020-08-25T18:44:50.289Z] Running org.eclipse.egit.ui.httpauth.PushTest
14:44:50 [2020-08-25T18:44:50.289Z] 2020-08-25 18:44:50.271:INFO:oejs.Server:WorkbenchTestable: jetty-9.4.30.v20200611; built: 2020-06-16T05:54:33.713Z; git: 271836e4c1f4612f12b7bb13ef5a92a927634b0d; jvm 1.8.0_262-b10
14:44:50 [2020-08-25T18:44:50.289Z] 2020-08-25 18:44:50.272:INFO:oejsh.ContextHandler:WorkbenchTestable: Started o.e.j.s.ServletContextHandler@1dd9430c{/sbasic,null,AVAILABLE}
14:44:50 [2020-08-25T18:44:50.289Z] 2020-08-25 18:44:50.278:INFO:oejs.AbstractConnector:WorkbenchTestable: Started ServerConnector@1d7a9b52{HTTP/1.1, (http/1.1)}{127.0.0.1:41837}
14:44:50 [2020-08-25T18:44:50.289Z] 2020-08-25 18:44:50.278:INFO:oejs.Server:WorkbenchTestable: Started @742319ms
14:44:51 [2020-08-25T18:44:51.220Z] 
14:44:51 [2020-08-25T18:44:51.220Z] (SWT:1624): Gtk-CRITICAL **: 18:44:51.146: gtk_box_gadget_distribute: assertion 'size >= 0' failed in GtkCheckButton
14:44:52 [2020-08-25T18:44:52.153Z] 2020-08-25 18:44:52.002:INFO:oejs.AbstractConnector:WorkbenchTestable: Stopped ServerConnector@1d7a9b52{HTTP/1.1, (http/1.1)}{127.0.0.1:0}
14:44:52 [2020-08-25T18:44:52.153Z] 2020-08-25 18:44:52.002:INFO:oejsh.ContextHandler:WorkbenchTestable: Stopped o.e.j.s.ServletContextHandler@1dd9430c{/sbasic,null,UNAVAILABLE}
14:44:52 [2020-08-25T18:44:52.153Z] Tests run: 1, Failures: 0, Errors: 0, Skipped: 0, Time elapsed: 1.825 s - in org.eclipse.egit.ui.httpauth.PushTest
14:44:52 [2020-08-25T18:44:52.153Z] testPush(org.eclipse.egit.ui.httpauth.PushTest)  Time elapsed: 1.824 s
14:44:52 [2020-08-25T18:44:52.153Z] Running org.eclipse.egit.ui.operations.GitScopeUtilTest
14:44:56 [2020-08-25T18:44:56.330Z] Tests run: 5, Failures: 0, Errors: 0, Skipped: 0, Time elapsed: 3.94 s - in org.eclipse.egit.ui.operations.GitScopeUtilTest
14:44:56 [2020-08-25T18:44:56.330Z] relatedChangesWithPrompt(org.eclipse.egit.ui.operations.GitScopeUtilTest)  Time elapsed: 1.506 s
14:44:56 [2020-08-25T18:44:56.330Z] modelProviderWithExtensionFiles(org.eclipse.egit.ui.operations.GitScopeUtilTest)  Time elapsed: 0.584 s
14:44:56 [2020-08-25T18:44:56.330Z] relatedChangesWithInvalidParams(org.eclipse.egit.ui.operations.GitScopeUtilTest)  Time elapsed: 0.648 s
14:44:56 [2020-08-25T18:44:56.330Z] relatedChangesWithNullResources(org.eclipse.egit.ui.operations.GitScopeUtilTest)  Time elapsed: 0.542 s
14:44:56 [2020-08-25T18:44:56.330Z] relatedChangesWithEmptyResources(org.eclipse.egit.ui.operations.GitScopeUtilTest)  Time elapsed: 0.659 s
14:44:56 [2020-08-25T18:44:56.330Z] 
14:44:56 [2020-08-25T18:44:56.330Z] Results:
14:44:56 [2020-08-25T18:44:56.330Z] 
14:44:56 [2020-08-25T18:44:56.330Z] Errors: 
14:44:56 [2020-08-25T18:44:56.330Z]   SmartImportWizardTest>LocalRepositoryTestCase.afterClassBase:288 » IO Could no...
14:44:56 [2020-08-25T18:44:56.330Z] 
14:44:56 [2020-08-25T18:44:56.330Z] Tests run: 542, Failures: 0, Errors: 1, Skipped: 12
14:44:56 [2020-08-25T18:44:56.330Z] 
14:44:56 [2020-08-25T18:44:56.330Z] 
14:44:56 [2020-08-25T18:44:56.330Z] (SWT:1624): Gtk-WARNING **: 18:44:55.957: Negative content width -6 (allocation 1, extents 4x3) while allocating gadget (node toolbar, owner GtkToolbar)
14:44:57 [2020-08-25T18:44:57.266Z] 
14:44:57 [2020-08-25T18:44:57.266Z] !ENTRY org.eclipse.core.resources 2 10035 2020-08-25 18:44:56.912
14:44:57 [2020-08-25T18:44:57.266Z] !MESSAGE The workspace will exit with unsaved changes in this session.
14:44:58 [2020-08-25T18:44:58.199Z] [INFO] ------------------------------------------------------------------------
14:44:58 [2020-08-25T18:44:58.199Z] [INFO] Reactor Summary for EGit Parent 5.9.0-SNAPSHOT:
14:44:58 [2020-08-25T18:44:58.199Z] [INFO] 
14:44:58 [2020-08-25T18:44:58.199Z] [INFO] EGit Parent ........................................ SUCCESS [ 37.244 s]
14:44:58 [2020-08-25T18:44:58.199Z] [INFO] EGit Target Platform Definition .................... SUCCESS [  1.028 s]
14:44:58 [2020-08-25T18:44:58.199Z] [INFO] Eclipse EGit ....................................... SUCCESS [  5.812 s]
14:44:58 [2020-08-25T18:44:58.199Z] [INFO] Git Team Provider (Core) ........................... SUCCESS [ 17.042 s]
14:44:58 [2020-08-25T18:44:58.199Z] [INFO] Git Team Provider (UI) ............................. SUCCESS [ 44.002 s]
14:44:58 [2020-08-25T18:44:58.199Z] [INFO] EGit Mylyn UI ...................................... SUCCESS [  7.021 s]
14:44:58 [2020-08-25T18:44:58.199Z] [INFO] Git Team Provider (Documentation) .................. SUCCESS [  7.609 s]
14:44:58 [2020-08-25T18:44:58.199Z] [INFO] Eclipse EGit Feature ............................... SUCCESS [  1.262 s]
14:44:58 [2020-08-25T18:44:58.199Z] [INFO] EGit Mylyn Feature ................................. SUCCESS [  1.169 s]
14:44:58 [2020-08-25T18:44:58.199Z] [INFO] Git Flow ........................................... SUCCESS [  6.299 s]
14:44:58 [2020-08-25T18:44:58.199Z] [INFO] Git Flow UI ........................................ SUCCESS [  9.521 s]
14:44:58 [2020-08-25T18:44:58.199Z] [INFO] Eclipse EGit Gitflow Feature ....................... SUCCESS [  1.260 s]
14:44:58 [2020-08-25T18:44:58.199Z] [INFO] EGit JUnit Support ................................. SUCCESS [  6.733 s]
14:44:58 [2020-08-25T18:44:58.199Z] [INFO] GitFlow Test Plug-in ............................... SUCCESS [ 23.209 s]
14:44:58 [2020-08-25T18:44:58.199Z] [INFO] Eclipse EGit Source Feature ........................ SUCCESS [  1.566 s]
14:44:58 [2020-08-25T18:44:58.199Z] [INFO] EGit P2 Repository ................................. SUCCESS [ 16.131 s]
14:44:58 [2020-08-25T18:44:58.199Z] [INFO] EGit Core Test Plug-in ............................. SUCCESS [02:03 min]
14:44:58 [2020-08-25T18:44:58.199Z] [INFO] EGit UI Test Plug-in ............................... FAILURE [12:30 min]
14:44:58 [2020-08-25T18:44:58.199Z] [INFO] EGit Mylyn UI Test Plug-in ......................... SKIPPED
14:44:58 [2020-08-25T18:44:58.199Z] [INFO] ------------------------------------------------------------------------
14:44:58 [2020-08-25T18:44:58.199Z] [INFO] BUILD FAILURE
14:44:58 [2020-08-25T18:44:58.199Z] [INFO] ------------------------------------------------------------------------
14:44:58 [2020-08-25T18:44:58.199Z] [INFO] Total time:  20:34 min
14:44:58 [2020-08-25T18:44:58.199Z] [INFO] Finished at: 2020-08-25T18:44:57Z
14:44:58 [2020-08-25T18:44:58.199Z] [INFO] ------------------------------------------------------------------------
14:44:58 [2020-08-25T18:44:58.199Z] [ERROR] Failed to execute goal org.eclipse.tycho:tycho-surefire-plugin:1.7.0:test (default-test) on project org.eclipse.egit.ui.test: There are test failures.
14:44:58 [2020-08-25T18:44:58.199Z] [ERROR] 
14:44:58 [2020-08-25T18:44:58.199Z] [ERROR] Please refer to /home/jenkins/agent/workspace/egit.gerrit/repo/org.eclipse.egit.ui.test/target/surefire-reports for the individual test results.
14:44:58 [2020-08-25T18:44:58.199Z] [ERROR] -> [Help 1]
14:44:58 [2020-08-25T18:44:58.199Z] org.apache.maven.lifecycle.LifecycleExecutionException: Failed to execute goal org.eclipse.tycho:tycho-surefire-plugin:1.7.0:test (default-test) on project org.eclipse.egit.ui.test: There are test failures.
14:44:58 [2020-08-25T18:44:58.199Z] 
14:44:58 [2020-08-25T18:44:58.199Z] Please refer to /home/jenkins/agent/workspace/egit.gerrit/repo/org.eclipse.egit.ui.test/target/surefire-reports for the individual test results.
14:44:58 [2020-08-25T18:44:58.199Z]     at org.apache.maven.lifecycle.internal.MojoExecutor.execute (MojoExecutor.java:215)
14:44:58 [2020-08-25T18:44:58.199Z]     at org.apache.maven.lifecycle.internal.MojoExecutor.execute (MojoExecutor.java:156)
14:44:58 [2020-08-25T18:44:58.199Z]     at org.apache.maven.lifecycle.internal.MojoExecutor.execute (MojoExecutor.java:148)
14:44:58 [2020-08-25T18:44:58.199Z]     at org.apache.maven.lifecycle.internal.LifecycleModuleBuilder.buildProject (LifecycleModuleBuilder.java:117)
14:44:58 [2020-08-25T18:44:58.199Z]     at org.apache.maven.lifecycle.internal.LifecycleModuleBuilder.buildProject (LifecycleModuleBuilder.java:81)
14:44:58 [2020-08-25T18:44:58.199Z]     at org.apache.maven.lifecycle.internal.builder.singlethreaded.SingleThreadedBuilder.build (SingleThreadedBuilder.java:56)
14:44:58 [2020-08-25T18:44:58.199Z]     at org.apache.maven.lifecycle.internal.LifecycleStarter.execute (LifecycleStarter.java:128)
14:44:58 [2020-08-25T18:44:58.199Z]     at org.apache.maven.DefaultMaven.doExecute (DefaultMaven.java:305)
14:44:58 [2020-08-25T18:44:58.199Z]     at org.apache.maven.DefaultMaven.doExecute (DefaultMaven.java:192)
14:44:58 [2020-08-25T18:44:58.199Z]     at org.apache.maven.DefaultMaven.execute (DefaultMaven.java:105)
14:44:58 [2020-08-25T18:44:58.199Z]     at org.apache.maven.cli.MavenCli.execute (MavenCli.java:957)
14:44:58 [2020-08-25T18:44:58.199Z]     at org.apache.maven.cli.MavenCli.doMain (MavenCli.java:289)
14:44:58 [2020-08-25T18:44:58.199Z]     at org.apache.maven.cli.MavenCli.main (MavenCli.java:193)
14:44:58 [2020-08-25T18:44:58.199Z]     at sun.reflect.NativeMethodAccessorImpl.invoke0 (Native Method)
14:44:58 [2020-08-25T18:44:58.199Z]     at sun.reflect.NativeMethodAccessorImpl.invoke (NativeMethodAccessorImpl.java:62)
14:44:58 [2020-08-25T18:44:58.199Z]     at sun.reflect.DelegatingMethodAccessorImpl.invoke (DelegatingMethodAccessorImpl.java:43)
14:44:58 [2020-08-25T18:44:58.199Z]     at java.lang.reflect.Method.invoke (Method.java:498)
14:44:58 [2020-08-25T18:44:58.199Z]     at org.codehaus.plexus.classworlds.launcher.Launcher.launchEnhanced (Launcher.java:282)
14:44:58 [2020-08-25T18:44:58.199Z]     at org.codehaus.plexus.classworlds.launcher.Launcher.launch (Launcher.java:225)
14:44:58 [2020-08-25T18:44:58.199Z]     at org.codehaus.plexus.classworlds.launcher.Launcher.mainWithExitCode (Launcher.java:406)
14:44:58 [2020-08-25T18:44:58.199Z]     at org.codehaus.plexus.classworlds.launcher.Launcher.main (Launcher.java:347)
14:44:58 [2020-08-25T18:44:58.199Z] Caused by: org.apache.maven.plugin.MojoFailureException: There are test failures.
14:44:58 [2020-08-25T18:44:58.199Z] 
14:44:58 [2020-08-25T18:44:58.199Z] Please refer to /home/jenkins/agent/workspace/egit.gerrit/repo/org.eclipse.egit.ui.test/target/surefire-reports for the individual test results.
14:44:58 [2020-08-25T18:44:58.199Z]     at org.eclipse.tycho.surefire.TestMojo.runTest (TestMojo.java:1063)
14:44:58 [2020-08-25T18:44:58.199Z]     at org.eclipse.tycho.surefire.TestMojo.execute (TestMojo.java:712)
14:44:58 [2020-08-25T18:44:58.199Z]     at org.apache.maven.plugin.DefaultBuildPluginManager.executeMojo (DefaultBuildPluginManager.java:137)
14:44:58 [2020-08-25T18:44:58.199Z]     at org.apache.maven.lifecycle.internal.MojoExecutor.execute (MojoExecutor.java:210)
14:44:58 [2020-08-25T18:44:58.199Z]     at org.apache.maven.lifecycle.internal.MojoExecutor.execute (MojoExecutor.java:156)
14:44:58 [2020-08-25T18:44:58.199Z]     at org.apache.maven.lifecycle.internal.MojoExecutor.execute (MojoExecutor.java:148)
14:44:58 [2020-08-25T18:44:58.199Z]     at org.apache.maven.lifecycle.internal.LifecycleModuleBuilder.buildProject (LifecycleModuleBuilder.java:117)
14:44:58 [2020-08-25T18:44:58.199Z]     at org.apache.maven.lifecycle.internal.LifecycleModuleBuilder.buildProject (LifecycleModuleBuilder.java:81)
14:44:58 [2020-08-25T18:44:58.199Z]     at org.apache.maven.lifecycle.internal.builder.singlethreaded.SingleThreadedBuilder.build (SingleThreadedBuilder.java:56)
14:44:58 [2020-08-25T18:44:58.199Z]     at org.apache.maven.lifecycle.internal.LifecycleStarter.execute (LifecycleStarter.java:128)
14:44:58 [2020-08-25T18:44:58.199Z]     at org.apache.maven.DefaultMaven.doExecute (DefaultMaven.java:305)
14:44:58 [2020-08-25T18:44:58.199Z]     at org.apache.maven.DefaultMaven.doExecute (DefaultMaven.java:192)
14:44:58 [2020-08-25T18:44:58.200Z]     at org.apache.maven.DefaultMaven.execute (DefaultMaven.java:105)
14:44:58 [2020-08-25T18:44:58.200Z]     at org.apache.maven.cli.MavenCli.execute (MavenCli.java:957)
14:44:58 [2020-08-25T18:44:58.200Z]     at org.apache.maven.cli.MavenCli.doMain (MavenCli.java:289)
14:44:58 [2020-08-25T18:44:58.200Z]     at org.apache.maven.cli.MavenCli.main (MavenCli.java:193)
14:44:58 [2020-08-25T18:44:58.200Z]     at sun.reflect.NativeMethodAccessorImpl.invoke0 (Native Method)
14:44:58 [2020-08-25T18:44:58.200Z]     at sun.reflect.NativeMethodAccessorImpl.invoke (NativeMethodAccessorImpl.java:62)
14:44:58 [2020-08-25T18:44:58.200Z]     at sun.reflect.DelegatingMethodAccessorImpl.invoke (DelegatingMethodAccessorImpl.java:43)
14:44:58 [2020-08-25T18:44:58.200Z]     at java.lang.reflect.Method.invoke (Method.java:498)
14:44:58 [2020-08-25T18:44:58.200Z]     at org.codehaus.plexus.classworlds.launcher.Launcher.launchEnhanced (Launcher.java:282)
14:44:58 [2020-08-25T18:44:58.200Z]     at org.codehaus.plexus.classworlds.launcher.Launcher.launch (Launcher.java:225)
14:44:58 [2020-08-25T18:44:58.200Z]     at org.codehaus.plexus.classworlds.launcher.Launcher.mainWithExitCode (Launcher.java:406)
14:44:58 [2020-08-25T18:44:58.200Z]     at org.codehaus.plexus.classworlds.launcher.Launcher.main (Launcher.java:347)
14:44:58 [2020-08-25T18:44:58.200Z] [ERROR] 
14:44:58 [2020-08-25T18:44:58.200Z] [ERROR] Re-run Maven using the -X switch to enable full debug logging.
14:44:58 [2020-08-25T18:44:58.200Z] [ERROR] 
14:44:58 [2020-08-25T18:44:58.200Z] [ERROR] For more information about the errors and possible solutions, please read the following articles:
14:44:58 [2020-08-25T18:44:58.200Z] [ERROR] [Help 1] http://cwiki.apache.org/confluence/display/MAVEN/MojoFailureException
14:44:58 [2020-08-25T18:44:58.200Z] [ERROR] 
14:44:58 [2020-08-25T18:44:58.200Z] [ERROR] After correcting the problems, you can resume the build with the command
14:44:58 [2020-08-25T18:44:58.200Z] [ERROR]   mvn <args> -rf :org.eclipse.egit.ui.test
[Pipeline] }
[Pipeline] // stage
[Pipeline] stage
[Pipeline] { (Results)
[Pipeline] junit
14:44:59 [2020-08-25T18:44:59.593Z] Recording test results
[Pipeline] archiveArtifacts
14:45:00 [2020-08-25T18:45:00.496Z] Archiving artifacts
[Pipeline] findbugs
14:45:03 [2020-08-25T18:45:03.592Z] [FINDBUGS] Collecting findbugs analysis files...
14:45:07 [2020-08-25T18:45:07.376Z] [FINDBUGS] Searching for all files in /home/jenkins/agent/workspace/egit.gerrit/repo that match the pattern */target/*bugsXml.xml
14:45:07 [2020-08-25T18:45:07.376Z] [FINDBUGS] Parsing 8 files in /home/jenkins/agent/workspace/egit.gerrit/repo
14:45:07 [2020-08-25T18:45:07.376Z] [FINDBUGS] Successfully parsed file /home/jenkins/agent/workspace/egit.gerrit/repo/org.eclipse.egit.core.junit/target/spotbugsXml.xml with 4 unique warnings and 0 duplicates.
14:45:07 [2020-08-25T18:45:07.376Z] [FINDBUGS] Successfully parsed file /home/jenkins/agent/workspace/egit.gerrit/repo/org.eclipse.egit.core.test/target/spotbugsXml.xml with 9 unique warnings and 0 duplicates.
14:45:07 [2020-08-25T18:45:07.376Z] [FINDBUGS] Successfully parsed file /home/jenkins/agent/workspace/egit.gerrit/repo/org.eclipse.egit.core/target/spotbugsXml.xml with 20 unique warnings and 0 duplicates.
14:45:07 [2020-08-25T18:45:07.376Z] [FINDBUGS] Successfully parsed file /home/jenkins/agent/workspace/egit.gerrit/repo/org.eclipse.egit.gitflow.test/target/spotbugsXml.xml with 20 unique warnings and 0 duplicates.
14:45:07 [2020-08-25T18:45:07.376Z] [FINDBUGS] Successfully parsed file /home/jenkins/agent/workspace/egit.gerrit/repo/org.eclipse.egit.gitflow.ui/target/spotbugsXml.xml with 20 unique warnings and 0 duplicates.
14:45:07 [2020-08-25T18:45:07.376Z] [FINDBUGS] Successfully parsed file /home/jenkins/agent/workspace/egit.gerrit/repo/org.eclipse.egit.gitflow/target/spotbugsXml.xml with 22 unique warnings and 0 duplicates.
14:45:07 [2020-08-25T18:45:07.376Z] [FINDBUGS] Successfully parsed file /home/jenkins/agent/workspace/egit.gerrit/repo/org.eclipse.egit.mylyn.ui/target/spotbugsXml.xml with 22 unique warnings and 0 duplicates.
14:45:07 [2020-08-25T18:45:07.376Z] [FINDBUGS] Successfully parsed file /home/jenkins/agent/workspace/egit.gerrit/repo/org.eclipse.egit.ui/target/spotbugsXml.xml with 59 unique warnings and 0 duplicates.
14:45:07 [2020-08-25T18:45:07.376Z] Skipping warnings blame since pipelines do not have an SCM link.%n
14:45:07 [2020-08-25T18:45:07.492Z] [FINDBUGS] Computing warning deltas based on reference build #1647
[Pipeline] dry
14:45:07 [2020-08-25T18:45:07.982Z] [DRY] Collecting duplicate code analysis files...
14:45:08 [2020-08-25T18:45:08.222Z] [DRY] Searching for all files in /home/jenkins/agent/workspace/egit.gerrit/repo that match the pattern **/cpd.xml
14:45:08 [2020-08-25T18:45:08.222Z] [DRY] Parsing 15 files in /home/jenkins/agent/workspace/egit.gerrit/repo
14:45:08 [2020-08-25T18:45:08.222Z] [DRY] Successfully parsed file /home/jenkins/agent/workspace/egit.gerrit/repo/org.eclipse.egit-feature/target/cpd.xml with 0 unique warnings and 0 duplicates.
14:45:08 [2020-08-25T18:45:08.222Z] [DRY] Successfully parsed file /home/jenkins/agent/workspace/egit.gerrit/repo/org.eclipse.egit.core.junit/target/cpd.xml with 0 unique warnings and 0 duplicates.
14:45:08 [2020-08-25T18:45:08.222Z] [DRY] Successfully parsed file /home/jenkins/agent/workspace/egit.gerrit/repo/org.eclipse.egit.core.test/target/cpd.xml with 0 unique warnings and 0 duplicates.
14:45:08 [2020-08-25T18:45:08.222Z] [DRY] Successfully parsed file /home/jenkins/agent/workspace/egit.gerrit/repo/org.eclipse.egit.core/target/cpd.xml with 4 unique warnings and 0 duplicates.
14:45:08 [2020-08-25T18:45:08.222Z] [DRY] Successfully parsed file /home/jenkins/agent/workspace/egit.gerrit/repo/org.eclipse.egit.doc/target/cpd.xml with 4 unique warnings and 0 duplicates.
14:45:08 [2020-08-25T18:45:08.222Z] [DRY] Successfully parsed file /home/jenkins/agent/workspace/egit.gerrit/repo/org.eclipse.egit.gitflow-feature/target/cpd.xml with 4 unique warnings and 0 duplicates.
14:45:08 [2020-08-25T18:45:08.222Z] [DRY] Successfully parsed file /home/jenkins/agent/workspace/egit.gerrit/repo/org.eclipse.egit.gitflow.test/target/cpd.xml with 4 unique warnings and 0 duplicates.
14:45:08 [2020-08-25T18:45:08.222Z] [DRY] Successfully parsed file /home/jenkins/agent/workspace/egit.gerrit/repo/org.eclipse.egit.gitflow.ui/target/cpd.xml with 4 unique warnings and 0 duplicates.
14:45:08 [2020-08-25T18:45:08.222Z] [DRY] Successfully parsed file /home/jenkins/agent/workspace/egit.gerrit/repo/org.eclipse.egit.gitflow/target/cpd.xml with 4 unique warnings and 0 duplicates.
14:45:08 [2020-08-25T18:45:08.222Z] [DRY] Successfully parsed file /home/jenkins/agent/workspace/egit.gerrit/repo/org.eclipse.egit.mylyn-feature/target/cpd.xml with 4 unique warnings and 0 duplicates.
14:45:08 [2020-08-25T18:45:08.222Z] [DRY] Successfully parsed file /home/jenkins/agent/workspace/egit.gerrit/repo/org.eclipse.egit.mylyn.ui/target/cpd.xml with 4 unique warnings and 0 duplicates.
14:45:08 [2020-08-25T18:45:08.222Z] [DRY] Successfully parsed file /home/jenkins/agent/workspace/egit.gerrit/repo/org.eclipse.egit.repository/target/cpd.xml with 4 unique warnings and 0 duplicates.
14:45:08 [2020-08-25T18:45:08.222Z] [DRY] Successfully parsed file /home/jenkins/agent/workspace/egit.gerrit/repo/org.eclipse.egit.source-feature/target/cpd.xml with 4 unique warnings and 0 duplicates.
14:45:08 [2020-08-25T18:45:08.222Z] [DRY] Successfully parsed file /home/jenkins/agent/workspace/egit.gerrit/repo/org.eclipse.egit.ui/target/cpd.xml with 37 unique warnings and 0 duplicates.
14:45:08 [2020-08-25T18:45:08.222Z] [DRY] Successfully parsed file /home/jenkins/agent/workspace/egit.gerrit/repo/org.eclipse.egit/target/cpd.xml with 37 unique warnings and 0 duplicates.
14:45:08 [2020-08-25T18:45:08.222Z] Skipping warnings blame since pipelines do not have an SCM link.%n
14:45:08 [2020-08-25T18:45:08.269Z] [DRY] Computing warning deltas based on reference build #1647
[Pipeline] }
[Pipeline] // stage
[Pipeline] }
[Pipeline] // dir
[Pipeline] }
14:45:09 [2020-08-25T18:45:09.173Z] Terminating xvnc.
[Pipeline] // wrap
[Pipeline] }
[Pipeline] // timeout
[Pipeline] }
[Pipeline] // node
[Pipeline] }
[Pipeline] // timestamps
[Pipeline] End of Pipeline
ERROR: script returned exit code 1
Finished: FAILURE