FailedConsole Output

Skipping 910 KB.. Full Log
15:19:53 [2020-08-24T19:19:53.683Z] (SWT:1598): Gtk-CRITICAL **: 19:19:53.585: gtk_box_gadget_distribute: assertion 'size >= 0' failed in GtkScrollbar
15:19:53 [2020-08-24T19:19:53.683Z] 
15:19:53 [2020-08-24T19:19:53.683Z] (SWT:1598): Gtk-CRITICAL **: 19:19:53.602: gtk_box_gadget_distribute: assertion 'size >= 0' failed in GtkScrollbar
15:19:53 [2020-08-24T19:19:53.683Z] 
15:19:53 [2020-08-24T19:19:53.683Z] (SWT:1598): Gtk-CRITICAL **: 19:19:53.602: gtk_box_gadget_distribute: assertion 'size >= 0' failed in GtkScrollbar
15:19:53 [2020-08-24T19:19:53.683Z] 
15:19:53 [2020-08-24T19:19:53.683Z] (SWT:1598): Gtk-CRITICAL **: 19:19:53.618: gtk_box_gadget_distribute: assertion 'size >= 0' failed in GtkScrollbar
15:19:53 [2020-08-24T19:19:53.683Z] 
15:19:53 [2020-08-24T19:19:53.683Z] (SWT:1598): Gtk-CRITICAL **: 19:19:53.618: gtk_box_gadget_distribute: assertion 'size >= 0' failed in GtkScrollbar
15:19:53 [2020-08-24T19:19:53.683Z] 
15:19:53 [2020-08-24T19:19:53.683Z] (SWT:1598): Gtk-CRITICAL **: 19:19:53.622: gtk_box_gadget_distribute: assertion 'size >= 0' failed in GtkScrollbar
15:19:53 [2020-08-24T19:19:53.683Z] 
15:19:53 [2020-08-24T19:19:53.683Z] (SWT:1598): Gtk-CRITICAL **: 19:19:53.623: gtk_box_gadget_distribute: assertion 'size >= 0' failed in GtkScrollbar
15:19:53 [2020-08-24T19:19:53.683Z] 
15:19:53 [2020-08-24T19:19:53.683Z] (SWT:1598): Gtk-CRITICAL **: 19:19:53.627: gtk_box_gadget_distribute: assertion 'size >= 0' failed in GtkScrollbar
15:19:53 [2020-08-24T19:19:53.683Z] 
15:19:53 [2020-08-24T19:19:53.683Z] (SWT:1598): Gtk-CRITICAL **: 19:19:53.628: gtk_box_gadget_distribute: assertion 'size >= 0' failed in GtkScrollbar
15:19:53 [2020-08-24T19:19:53.683Z] 
15:19:53 [2020-08-24T19:19:53.683Z] (SWT:1598): Gtk-CRITICAL **: 19:19:53.628: gtk_box_gadget_distribute: assertion 'size >= 0' failed in GtkScrollbar
15:19:53 [2020-08-24T19:19:53.683Z] 
15:19:53 [2020-08-24T19:19:53.683Z] (SWT:1598): Gtk-CRITICAL **: 19:19:53.631: gtk_box_gadget_distribute: assertion 'size >= 0' failed in GtkScrollbar
15:19:53 [2020-08-24T19:19:53.683Z] 
15:19:53 [2020-08-24T19:19:53.683Z] (SWT:1598): Gtk-CRITICAL **: 19:19:53.634: gtk_box_gadget_distribute: assertion 'size >= 0' failed in GtkScrollbar
15:19:53 [2020-08-24T19:19:53.683Z] 
15:19:53 [2020-08-24T19:19:53.683Z] (SWT:1598): Gtk-CRITICAL **: 19:19:53.634: gtk_box_gadget_distribute: assertion 'size >= 0' failed in GtkScrollbar
15:19:53 [2020-08-24T19:19:53.683Z] 
15:19:53 [2020-08-24T19:19:53.683Z] (SWT:1598): Gtk-CRITICAL **: 19:19:53.639: gtk_box_gadget_distribute: assertion 'size >= 0' failed in GtkScrollbar
15:19:53 [2020-08-24T19:19:53.683Z] 
15:19:53 [2020-08-24T19:19:53.683Z] (SWT:1598): Gtk-CRITICAL **: 19:19:53.639: gtk_box_gadget_distribute: assertion 'size >= 0' failed in GtkScrollbar
15:19:53 [2020-08-24T19:19:53.683Z] 
15:19:53 [2020-08-24T19:19:53.683Z] (SWT:1598): Gtk-CRITICAL **: 19:19:53.644: gtk_box_gadget_distribute: assertion 'size >= 0' failed in GtkScrollbar
15:19:53 [2020-08-24T19:19:53.683Z] 
15:19:53 [2020-08-24T19:19:53.683Z] (SWT:1598): Gtk-CRITICAL **: 19:19:53.654: gtk_box_gadget_distribute: assertion 'size >= 0' failed in GtkScrollbar
15:19:53 [2020-08-24T19:19:53.683Z] 
15:19:53 [2020-08-24T19:19:53.683Z] (SWT:1598): Gtk-CRITICAL **: 19:19:53.655: gtk_box_gadget_distribute: assertion 'size >= 0' failed in GtkScrollbar
15:19:53 [2020-08-24T19:19:53.683Z] 
15:19:53 [2020-08-24T19:19:53.683Z] (SWT:1598): Gtk-WARNING **: 19:19:53.677: Negative content width -6 (allocation 1, extents 4x3) while allocating gadget (node toolbar, owner GtkToolbar)
15:19:54 [2020-08-24T19:19:54.248Z] 
15:19:54 [2020-08-24T19:19:54.248Z] (SWT:1598): Gtk-WARNING **: 19:19:54.191: Negative content width -6 (allocation 1, extents 4x3) while allocating gadget (node toolbar, owner GtkToolbar)
15:19:54 [2020-08-24T19:19:54.248Z] 
15:19:54 [2020-08-24T19:19:54.248Z] (SWT:1598): Gtk-WARNING **: 19:19:54.200: Negative content width -6 (allocation 1, extents 4x3) while allocating gadget (node toolbar, owner GtkToolbar)
15:19:54 [2020-08-24T19:19:54.812Z] 
15:19:54 [2020-08-24T19:19:54.812Z] (SWT:1598): Gtk-WARNING **: 19:19:54.773: Negative content width -6 (allocation 1, extents 4x3) while allocating gadget (node toolbar, owner GtkToolbar)
15:19:55 [2020-08-24T19:19:55.376Z] 
15:19:55 [2020-08-24T19:19:55.376Z] (SWT:1598): Gtk-CRITICAL **: 19:19:55.224: gtk_box_gadget_distribute: assertion 'size >= 0' failed in GtkScrollbar
15:19:55 [2020-08-24T19:19:55.376Z] 
15:19:55 [2020-08-24T19:19:55.376Z] (SWT:1598): Gtk-CRITICAL **: 19:19:55.231: gtk_box_gadget_distribute: assertion 'size >= 0' failed in GtkScrollbar
15:19:55 [2020-08-24T19:19:55.376Z] 
15:19:55 [2020-08-24T19:19:55.376Z] (SWT:1598): Gtk-WARNING **: 19:19:55.234: Negative content width -6 (allocation 1, extents 4x3) while allocating gadget (node toolbar, owner GtkToolbar)
15:19:55 [2020-08-24T19:19:55.376Z] 
15:19:55 [2020-08-24T19:19:55.376Z] (SWT:1598): Gtk-CRITICAL **: 19:19:55.240: gtk_box_gadget_distribute: assertion 'size >= 0' failed in GtkScrollbar
15:19:55 [2020-08-24T19:19:55.376Z] 
15:19:55 [2020-08-24T19:19:55.376Z] (SWT:1598): Gtk-CRITICAL **: 19:19:55.245: gtk_box_gadget_distribute: assertion 'size >= 0' failed in GtkScrollbar
15:19:55 [2020-08-24T19:19:55.376Z] 
15:19:55 [2020-08-24T19:19:55.376Z] (SWT:1598): Gtk-CRITICAL **: 19:19:55.246: gtk_box_gadget_distribute: assertion 'size >= 0' failed in GtkScrollbar
15:19:55 [2020-08-24T19:19:55.376Z] 
15:19:55 [2020-08-24T19:19:55.376Z] (SWT:1598): Gtk-CRITICAL **: 19:19:55.250: gtk_box_gadget_distribute: assertion 'size >= 0' failed in GtkScrollbar
15:19:55 [2020-08-24T19:19:55.376Z] 
15:19:55 [2020-08-24T19:19:55.376Z] (SWT:1598): Gtk-CRITICAL **: 19:19:55.253: gtk_box_gadget_distribute: assertion 'size >= 0' failed in GtkScrollbar
15:19:55 [2020-08-24T19:19:55.376Z] 
15:19:55 [2020-08-24T19:19:55.376Z] (SWT:1598): Gtk-CRITICAL **: 19:19:55.254: gtk_box_gadget_distribute: assertion 'size >= 0' failed in GtkScrollbar
15:19:55 [2020-08-24T19:19:55.376Z] 
15:19:55 [2020-08-24T19:19:55.376Z] (SWT:1598): Gtk-CRITICAL **: 19:19:55.261: gtk_box_gadget_distribute: assertion 'size >= 0' failed in GtkScrollbar
15:19:55 [2020-08-24T19:19:55.376Z] 
15:19:55 [2020-08-24T19:19:55.376Z] (SWT:1598): Gtk-CRITICAL **: 19:19:55.268: gtk_box_gadget_distribute: assertion 'size >= 0' failed in GtkScrollbar
15:19:55 [2020-08-24T19:19:55.376Z] 
15:19:55 [2020-08-24T19:19:55.376Z] (SWT:1598): Gtk-CRITICAL **: 19:19:55.268: gtk_box_gadget_distribute: assertion 'size >= 0' failed in GtkScrollbar
15:19:55 [2020-08-24T19:19:55.376Z] 
15:19:55 [2020-08-24T19:19:55.376Z] (SWT:1598): Gtk-CRITICAL **: 19:19:55.285: gtk_box_gadget_distribute: assertion 'size >= 0' failed in GtkScrollbar
15:19:55 [2020-08-24T19:19:55.376Z] 
15:19:55 [2020-08-24T19:19:55.376Z] (SWT:1598): Gtk-CRITICAL **: 19:19:55.285: gtk_box_gadget_distribute: assertion 'size >= 0' failed in GtkScrollbar
15:19:55 [2020-08-24T19:19:55.376Z] 
15:19:55 [2020-08-24T19:19:55.376Z] (SWT:1598): Gtk-CRITICAL **: 19:19:55.302: gtk_box_gadget_distribute: assertion 'size >= 0' failed in GtkScrollbar
15:19:55 [2020-08-24T19:19:55.376Z] 
15:19:55 [2020-08-24T19:19:55.376Z] (SWT:1598): Gtk-CRITICAL **: 19:19:55.302: gtk_box_gadget_distribute: assertion 'size >= 0' failed in GtkScrollbar
15:19:55 [2020-08-24T19:19:55.376Z] 
15:19:55 [2020-08-24T19:19:55.376Z] (SWT:1598): Gtk-CRITICAL **: 19:19:55.318: gtk_box_gadget_distribute: assertion 'size >= 0' failed in GtkScrollbar
15:19:55 [2020-08-24T19:19:55.376Z] 
15:19:55 [2020-08-24T19:19:55.376Z] (SWT:1598): Gtk-CRITICAL **: 19:19:55.318: gtk_box_gadget_distribute: assertion 'size >= 0' failed in GtkScrollbar
15:19:55 [2020-08-24T19:19:55.376Z] 
15:19:55 [2020-08-24T19:19:55.376Z] (SWT:1598): Gtk-CRITICAL **: 19:19:55.335: gtk_box_gadget_distribute: assertion 'size >= 0' failed in GtkScrollbar
15:19:55 [2020-08-24T19:19:55.376Z] 
15:19:55 [2020-08-24T19:19:55.376Z] (SWT:1598): Gtk-CRITICAL **: 19:19:55.335: gtk_box_gadget_distribute: assertion 'size >= 0' failed in GtkScrollbar
15:19:55 [2020-08-24T19:19:55.376Z] 
15:19:55 [2020-08-24T19:19:55.376Z] (SWT:1598): Gtk-CRITICAL **: 19:19:55.352: gtk_box_gadget_distribute: assertion 'size >= 0' failed in GtkScrollbar
15:19:55 [2020-08-24T19:19:55.376Z] 
15:19:55 [2020-08-24T19:19:55.376Z] (SWT:1598): Gtk-CRITICAL **: 19:19:55.352: gtk_box_gadget_distribute: assertion 'size >= 0' failed in GtkScrollbar
15:19:55 [2020-08-24T19:19:55.376Z] 
15:19:55 [2020-08-24T19:19:55.376Z] (SWT:1598): Gtk-CRITICAL **: 19:19:55.364: gtk_box_gadget_distribute: assertion 'size >= 0' failed in GtkScrollbar
15:19:55 [2020-08-24T19:19:55.376Z] 
15:19:55 [2020-08-24T19:19:55.376Z] (SWT:1598): Gtk-CRITICAL **: 19:19:55.364: gtk_box_gadget_distribute: assertion 'size >= 0' failed in GtkScrollbar
15:19:55 [2020-08-24T19:19:55.376Z] 
15:19:55 [2020-08-24T19:19:55.376Z] (SWT:1598): Gtk-CRITICAL **: 19:19:55.369: gtk_box_gadget_distribute: assertion 'size >= 0' failed in GtkScrollbar
15:19:55 [2020-08-24T19:19:55.376Z] 
15:19:55 [2020-08-24T19:19:55.376Z] (SWT:1598): Gtk-CRITICAL **: 19:19:55.369: gtk_box_gadget_distribute: assertion 'size >= 0' failed in GtkScrollbar
15:19:55 [2020-08-24T19:19:55.633Z] 
15:19:55 [2020-08-24T19:19:55.633Z] (SWT:1598): Gtk-CRITICAL **: 19:19:55.374: gtk_box_gadget_distribute: assertion 'size >= 0' failed in GtkScrollbar
15:19:55 [2020-08-24T19:19:55.633Z] 
15:19:55 [2020-08-24T19:19:55.633Z] (SWT:1598): Gtk-CRITICAL **: 19:19:55.374: gtk_box_gadget_distribute: assertion 'size >= 0' failed in GtkScrollbar
15:19:55 [2020-08-24T19:19:55.633Z] 
15:19:55 [2020-08-24T19:19:55.633Z] (SWT:1598): Gtk-CRITICAL **: 19:19:55.375: gtk_box_gadget_distribute: assertion 'size >= 0' failed in GtkScrollbar
15:19:55 [2020-08-24T19:19:55.633Z] 
15:19:55 [2020-08-24T19:19:55.633Z] (SWT:1598): Gtk-CRITICAL **: 19:19:55.378: gtk_box_gadget_distribute: assertion 'size >= 0' failed in GtkScrollbar
15:19:55 [2020-08-24T19:19:55.633Z] 
15:19:55 [2020-08-24T19:19:55.633Z] (SWT:1598): Gtk-CRITICAL **: 19:19:55.387: gtk_box_gadget_distribute: assertion 'size >= 0' failed in GtkScrollbar
15:19:55 [2020-08-24T19:19:55.633Z] 
15:19:55 [2020-08-24T19:19:55.633Z] (SWT:1598): Gtk-CRITICAL **: 19:19:55.387: gtk_box_gadget_distribute: assertion 'size >= 0' failed in GtkScrollbar
15:19:55 [2020-08-24T19:19:55.633Z] 
15:19:55 [2020-08-24T19:19:55.633Z] (SWT:1598): Gtk-CRITICAL **: 19:19:55.392: gtk_box_gadget_distribute: assertion 'size >= 0' failed in GtkScrollbar
15:19:55 [2020-08-24T19:19:55.633Z] 
15:19:55 [2020-08-24T19:19:55.633Z] (SWT:1598): Gtk-CRITICAL **: 19:19:55.392: gtk_box_gadget_distribute: assertion 'size >= 0' failed in GtkScrollbar
15:19:55 [2020-08-24T19:19:55.633Z] 
15:19:55 [2020-08-24T19:19:55.633Z] (SWT:1598): Gtk-CRITICAL **: 19:19:55.396: gtk_box_gadget_distribute: assertion 'size >= 0' failed in GtkScrollbar
15:19:55 [2020-08-24T19:19:55.633Z] 
15:19:55 [2020-08-24T19:19:55.633Z] (SWT:1598): Gtk-CRITICAL **: 19:19:55.405: gtk_box_gadget_distribute: assertion 'size >= 0' failed in GtkScrollbar
15:19:55 [2020-08-24T19:19:55.633Z] 
15:19:55 [2020-08-24T19:19:55.633Z] (SWT:1598): Gtk-CRITICAL **: 19:19:55.406: gtk_box_gadget_distribute: assertion 'size >= 0' failed in GtkScrollbar
15:19:55 [2020-08-24T19:19:55.633Z] 
15:19:55 [2020-08-24T19:19:55.633Z] (SWT:1598): Gtk-WARNING **: 19:19:55.429: Negative content width -6 (allocation 1, extents 4x3) while allocating gadget (node toolbar, owner GtkToolbar)
15:19:56 [2020-08-24T19:19:56.197Z] 
15:19:56 [2020-08-24T19:19:56.197Z] (SWT:1598): Gtk-WARNING **: 19:19:56.011: Negative content width -6 (allocation 1, extents 4x3) while allocating gadget (node toolbar, owner GtkToolbar)
15:19:56 [2020-08-24T19:19:56.197Z] 
15:19:56 [2020-08-24T19:19:56.197Z] (SWT:1598): Gtk-WARNING **: 19:19:56.021: Negative content width -6 (allocation 1, extents 4x3) while allocating gadget (node toolbar, owner GtkToolbar)
15:19:56 [2020-08-24T19:19:56.761Z] 
15:19:56 [2020-08-24T19:19:56.761Z] (SWT:1598): Gtk-WARNING **: 19:19:56.612: Negative content width -6 (allocation 1, extents 4x3) while allocating gadget (node toolbar, owner GtkToolbar)
15:19:57 [2020-08-24T19:19:57.018Z] 
15:19:57 [2020-08-24T19:19:57.019Z] (SWT:1598): Gtk-CRITICAL **: 19:19:56.888: gtk_box_gadget_distribute: assertion 'size >= 0' failed in GtkScrollbar
15:19:57 [2020-08-24T19:19:57.019Z] 
15:19:57 [2020-08-24T19:19:57.019Z] (SWT:1598): Gtk-CRITICAL **: 19:19:56.895: gtk_box_gadget_distribute: assertion 'size >= 0' failed in GtkScrollbar
15:19:57 [2020-08-24T19:19:57.019Z] 
15:19:57 [2020-08-24T19:19:57.019Z] (SWT:1598): Gtk-WARNING **: 19:19:56.899: Negative content width -6 (allocation 1, extents 4x3) while allocating gadget (node toolbar, owner GtkToolbar)
15:19:57 [2020-08-24T19:19:57.019Z] 
15:19:57 [2020-08-24T19:19:57.019Z] (SWT:1598): Gtk-CRITICAL **: 19:19:56.906: gtk_box_gadget_distribute: assertion 'size >= 0' failed in GtkScrollbar
15:19:57 [2020-08-24T19:19:57.019Z] 
15:19:57 [2020-08-24T19:19:57.019Z] (SWT:1598): Gtk-CRITICAL **: 19:19:56.911: gtk_box_gadget_distribute: assertion 'size >= 0' failed in GtkScrollbar
15:19:57 [2020-08-24T19:19:57.019Z] 
15:19:57 [2020-08-24T19:19:57.019Z] (SWT:1598): Gtk-CRITICAL **: 19:19:56.911: gtk_box_gadget_distribute: assertion 'size >= 0' failed in GtkScrollbar
15:19:57 [2020-08-24T19:19:57.019Z] 
15:19:57 [2020-08-24T19:19:57.019Z] (SWT:1598): Gtk-CRITICAL **: 19:19:56.916: gtk_box_gadget_distribute: assertion 'size >= 0' failed in GtkScrollbar
15:19:57 [2020-08-24T19:19:57.019Z] 
15:19:57 [2020-08-24T19:19:57.019Z] (SWT:1598): Gtk-CRITICAL **: 19:19:56.919: gtk_box_gadget_distribute: assertion 'size >= 0' failed in GtkScrollbar
15:19:57 [2020-08-24T19:19:57.019Z] 
15:19:57 [2020-08-24T19:19:57.019Z] (SWT:1598): Gtk-CRITICAL **: 19:19:56.919: gtk_box_gadget_distribute: assertion 'size >= 0' failed in GtkScrollbar
15:19:57 [2020-08-24T19:19:57.019Z] 
15:19:57 [2020-08-24T19:19:57.019Z] (SWT:1598): Gtk-CRITICAL **: 19:19:56.927: gtk_box_gadget_distribute: assertion 'size >= 0' failed in GtkScrollbar
15:19:57 [2020-08-24T19:19:57.019Z] 
15:19:57 [2020-08-24T19:19:57.019Z] (SWT:1598): Gtk-CRITICAL **: 19:19:56.932: gtk_box_gadget_distribute: assertion 'size >= 0' failed in GtkScrollbar
15:19:57 [2020-08-24T19:19:57.019Z] 
15:19:57 [2020-08-24T19:19:57.019Z] (SWT:1598): Gtk-CRITICAL **: 19:19:56.943: gtk_box_gadget_distribute: assertion 'size >= 0' failed in GtkScrollbar
15:19:57 [2020-08-24T19:19:57.019Z] 
15:19:57 [2020-08-24T19:19:57.019Z] (SWT:1598): Gtk-CRITICAL **: 19:19:56.944: gtk_box_gadget_distribute: assertion 'size >= 0' failed in GtkScrollbar
15:19:57 [2020-08-24T19:19:57.019Z] 
15:19:57 [2020-08-24T19:19:57.019Z] (SWT:1598): Gtk-CRITICAL **: 19:19:56.959: gtk_box_gadget_distribute: assertion 'size >= 0' failed in GtkScrollbar
15:19:57 [2020-08-24T19:19:57.019Z] 
15:19:57 [2020-08-24T19:19:57.019Z] (SWT:1598): Gtk-CRITICAL **: 19:19:56.959: gtk_box_gadget_distribute: assertion 'size >= 0' failed in GtkScrollbar
15:19:57 [2020-08-24T19:19:57.019Z] 
15:19:57 [2020-08-24T19:19:57.019Z] (SWT:1598): Gtk-CRITICAL **: 19:19:56.976: gtk_box_gadget_distribute: assertion 'size >= 0' failed in GtkScrollbar
15:19:57 [2020-08-24T19:19:57.019Z] 
15:19:57 [2020-08-24T19:19:57.019Z] (SWT:1598): Gtk-CRITICAL **: 19:19:56.976: gtk_box_gadget_distribute: assertion 'size >= 0' failed in GtkScrollbar
15:19:57 [2020-08-24T19:19:57.019Z] 
15:19:57 [2020-08-24T19:19:57.019Z] (SWT:1598): Gtk-CRITICAL **: 19:19:56.993: gtk_box_gadget_distribute: assertion 'size >= 0' failed in GtkScrollbar
15:19:57 [2020-08-24T19:19:57.019Z] 
15:19:57 [2020-08-24T19:19:57.019Z] (SWT:1598): Gtk-CRITICAL **: 19:19:56.993: gtk_box_gadget_distribute: assertion 'size >= 0' failed in GtkScrollbar
15:19:57 [2020-08-24T19:19:57.019Z] 
15:19:57 [2020-08-24T19:19:57.019Z] (SWT:1598): Gtk-CRITICAL **: 19:19:57.010: gtk_box_gadget_distribute: assertion 'size >= 0' failed in GtkScrollbar
15:19:57 [2020-08-24T19:19:57.019Z] 
15:19:57 [2020-08-24T19:19:57.019Z] (SWT:1598): Gtk-CRITICAL **: 19:19:57.010: gtk_box_gadget_distribute: assertion 'size >= 0' failed in GtkScrollbar
15:19:57 [2020-08-24T19:19:57.277Z] 
15:19:57 [2020-08-24T19:19:57.277Z] (SWT:1598): Gtk-CRITICAL **: 19:19:57.026: gtk_box_gadget_distribute: assertion 'size >= 0' failed in GtkScrollbar
15:19:57 [2020-08-24T19:19:57.277Z] 
15:19:57 [2020-08-24T19:19:57.277Z] (SWT:1598): Gtk-CRITICAL **: 19:19:57.027: gtk_box_gadget_distribute: assertion 'size >= 0' failed in GtkScrollbar
15:19:57 [2020-08-24T19:19:57.277Z] 
15:19:57 [2020-08-24T19:19:57.277Z] (SWT:1598): Gtk-CRITICAL **: 19:19:57.034: gtk_box_gadget_distribute: assertion 'size >= 0' failed in GtkScrollbar
15:19:57 [2020-08-24T19:19:57.277Z] 
15:19:57 [2020-08-24T19:19:57.277Z] (SWT:1598): Gtk-CRITICAL **: 19:19:57.035: gtk_box_gadget_distribute: assertion 'size >= 0' failed in GtkScrollbar
15:19:57 [2020-08-24T19:19:57.277Z] 
15:19:57 [2020-08-24T19:19:57.277Z] (SWT:1598): Gtk-CRITICAL **: 19:19:57.038: gtk_box_gadget_distribute: assertion 'size >= 0' failed in GtkScrollbar
15:19:57 [2020-08-24T19:19:57.277Z] 
15:19:57 [2020-08-24T19:19:57.277Z] (SWT:1598): Gtk-CRITICAL **: 19:19:57.039: gtk_box_gadget_distribute: assertion 'size >= 0' failed in GtkScrollbar
15:19:57 [2020-08-24T19:19:57.277Z] 
15:19:57 [2020-08-24T19:19:57.277Z] (SWT:1598): Gtk-CRITICAL **: 19:19:57.039: gtk_box_gadget_distribute: assertion 'size >= 0' failed in GtkScrollbar
15:19:57 [2020-08-24T19:19:57.277Z] 
15:19:57 [2020-08-24T19:19:57.277Z] (SWT:1598): Gtk-CRITICAL **: 19:19:57.044: gtk_box_gadget_distribute: assertion 'size >= 0' failed in GtkScrollbar
15:19:57 [2020-08-24T19:19:57.277Z] 
15:19:57 [2020-08-24T19:19:57.277Z] (SWT:1598): Gtk-CRITICAL **: 19:19:57.044: gtk_box_gadget_distribute: assertion 'size >= 0' failed in GtkScrollbar
15:19:57 [2020-08-24T19:19:57.277Z] 
15:19:57 [2020-08-24T19:19:57.277Z] (SWT:1598): Gtk-CRITICAL **: 19:19:57.048: gtk_box_gadget_distribute: assertion 'size >= 0' failed in GtkScrollbar
15:19:57 [2020-08-24T19:19:57.277Z] 
15:19:57 [2020-08-24T19:19:57.277Z] (SWT:1598): Gtk-CRITICAL **: 19:19:57.056: gtk_box_gadget_distribute: assertion 'size >= 0' failed in GtkScrollbar
15:19:57 [2020-08-24T19:19:57.277Z] 
15:19:57 [2020-08-24T19:19:57.277Z] (SWT:1598): Gtk-CRITICAL **: 19:19:57.056: gtk_box_gadget_distribute: assertion 'size >= 0' failed in GtkScrollbar
15:19:57 [2020-08-24T19:19:57.277Z] 
15:19:57 [2020-08-24T19:19:57.277Z] (SWT:1598): Gtk-CRITICAL **: 19:19:57.061: gtk_box_gadget_distribute: assertion 'size >= 0' failed in GtkScrollbar
15:19:57 [2020-08-24T19:19:57.277Z] 
15:19:57 [2020-08-24T19:19:57.277Z] (SWT:1598): Gtk-CRITICAL **: 19:19:57.061: gtk_box_gadget_distribute: assertion 'size >= 0' failed in GtkScrollbar
15:19:57 [2020-08-24T19:19:57.277Z] 
15:19:57 [2020-08-24T19:19:57.277Z] (SWT:1598): Gtk-CRITICAL **: 19:19:57.065: gtk_box_gadget_distribute: assertion 'size >= 0' failed in GtkScrollbar
15:19:57 [2020-08-24T19:19:57.277Z] 
15:19:57 [2020-08-24T19:19:57.277Z] (SWT:1598): Gtk-CRITICAL **: 19:19:57.082: gtk_box_gadget_distribute: assertion 'size >= 0' failed in GtkScrollbar
15:19:57 [2020-08-24T19:19:57.277Z] 
15:19:57 [2020-08-24T19:19:57.277Z] (SWT:1598): Gtk-WARNING **: 19:19:57.100: Negative content width -6 (allocation 1, extents 4x3) while allocating gadget (node toolbar, owner GtkToolbar)
15:19:57 [2020-08-24T19:19:57.842Z] 
15:19:57 [2020-08-24T19:19:57.842Z] (SWT:1598): Gtk-WARNING **: 19:19:57.728: Negative content width -6 (allocation 1, extents 4x3) while allocating gadget (node toolbar, owner GtkToolbar)
15:19:57 [2020-08-24T19:19:57.842Z] 
15:19:57 [2020-08-24T19:19:57.842Z] (SWT:1598): Gtk-WARNING **: 19:19:57.736: Negative content width -6 (allocation 1, extents 4x3) while allocating gadget (node toolbar, owner GtkToolbar)
15:19:58 [2020-08-24T19:19:58.406Z] 
15:19:58 [2020-08-24T19:19:58.406Z] (SWT:1598): Gtk-WARNING **: 19:19:58.316: Negative content width -6 (allocation 1, extents 4x3) while allocating gadget (node toolbar, owner GtkToolbar)
15:19:58 [2020-08-24T19:19:58.971Z] 
15:19:58 [2020-08-24T19:19:58.971Z] (SWT:1598): Gtk-CRITICAL **: 19:19:58.760: gtk_box_gadget_distribute: assertion 'size >= 0' failed in GtkScrollbar
15:19:58 [2020-08-24T19:19:58.971Z] 
15:19:58 [2020-08-24T19:19:58.971Z] (SWT:1598): Gtk-CRITICAL **: 19:19:58.767: gtk_box_gadget_distribute: assertion 'size >= 0' failed in GtkScrollbar
15:19:58 [2020-08-24T19:19:58.971Z] 
15:19:58 [2020-08-24T19:19:58.971Z] (SWT:1598): Gtk-WARNING **: 19:19:58.770: Negative content width -6 (allocation 1, extents 4x3) while allocating gadget (node toolbar, owner GtkToolbar)
15:19:58 [2020-08-24T19:19:58.971Z] 
15:19:58 [2020-08-24T19:19:58.971Z] (SWT:1598): Gtk-CRITICAL **: 19:19:58.776: gtk_box_gadget_distribute: assertion 'size >= 0' failed in GtkScrollbar
15:19:58 [2020-08-24T19:19:58.971Z] 
15:19:58 [2020-08-24T19:19:58.971Z] (SWT:1598): Gtk-CRITICAL **: 19:19:58.781: gtk_box_gadget_distribute: assertion 'size >= 0' failed in GtkScrollbar
15:19:58 [2020-08-24T19:19:58.971Z] 
15:19:58 [2020-08-24T19:19:58.971Z] (SWT:1598): Gtk-CRITICAL **: 19:19:58.781: gtk_box_gadget_distribute: assertion 'size >= 0' failed in GtkScrollbar
15:19:58 [2020-08-24T19:19:58.972Z] 
15:19:58 [2020-08-24T19:19:58.972Z] (SWT:1598): Gtk-CRITICAL **: 19:19:58.786: gtk_box_gadget_distribute: assertion 'size >= 0' failed in GtkScrollbar
15:19:58 [2020-08-24T19:19:58.972Z] 
15:19:58 [2020-08-24T19:19:58.972Z] (SWT:1598): Gtk-CRITICAL **: 19:19:58.791: gtk_box_gadget_distribute: assertion 'size >= 0' failed in GtkScrollbar
15:19:58 [2020-08-24T19:19:58.972Z] 
15:19:58 [2020-08-24T19:19:58.972Z] (SWT:1598): Gtk-CRITICAL **: 19:19:58.792: gtk_box_gadget_distribute: assertion 'size >= 0' failed in GtkScrollbar
15:19:58 [2020-08-24T19:19:58.972Z] 
15:19:58 [2020-08-24T19:19:58.972Z] (SWT:1598): Gtk-CRITICAL **: 19:19:58.802: gtk_box_gadget_distribute: assertion 'size >= 0' failed in GtkScrollbar
15:19:58 [2020-08-24T19:19:58.972Z] 
15:19:58 [2020-08-24T19:19:58.972Z] (SWT:1598): Gtk-CRITICAL **: 19:19:58.811: gtk_box_gadget_distribute: assertion 'size >= 0' failed in GtkScrollbar
15:19:58 [2020-08-24T19:19:58.972Z] 
15:19:58 [2020-08-24T19:19:58.972Z] (SWT:1598): Gtk-CRITICAL **: 19:19:58.818: gtk_box_gadget_distribute: assertion 'size >= 0' failed in GtkScrollbar
15:19:58 [2020-08-24T19:19:58.972Z] 
15:19:58 [2020-08-24T19:19:58.972Z] (SWT:1598): Gtk-CRITICAL **: 19:19:58.818: gtk_box_gadget_distribute: assertion 'size >= 0' failed in GtkScrollbar
15:19:58 [2020-08-24T19:19:58.972Z] 
15:19:58 [2020-08-24T19:19:58.972Z] (SWT:1598): Gtk-CRITICAL **: 19:19:58.834: gtk_box_gadget_distribute: assertion 'size >= 0' failed in GtkScrollbar
15:19:58 [2020-08-24T19:19:58.972Z] 
15:19:58 [2020-08-24T19:19:58.972Z] (SWT:1598): Gtk-CRITICAL **: 19:19:58.834: gtk_box_gadget_distribute: assertion 'size >= 0' failed in GtkScrollbar
15:19:58 [2020-08-24T19:19:58.972Z] 
15:19:58 [2020-08-24T19:19:58.972Z] (SWT:1598): Gtk-CRITICAL **: 19:19:58.851: gtk_box_gadget_distribute: assertion 'size >= 0' failed in GtkScrollbar
15:19:58 [2020-08-24T19:19:58.972Z] 
15:19:58 [2020-08-24T19:19:58.972Z] (SWT:1598): Gtk-CRITICAL **: 19:19:58.851: gtk_box_gadget_distribute: assertion 'size >= 0' failed in GtkScrollbar
15:19:58 [2020-08-24T19:19:58.972Z] 
15:19:58 [2020-08-24T19:19:58.972Z] (SWT:1598): Gtk-CRITICAL **: 19:19:58.867: gtk_box_gadget_distribute: assertion 'size >= 0' failed in GtkScrollbar
15:19:58 [2020-08-24T19:19:58.972Z] 
15:19:58 [2020-08-24T19:19:58.972Z] (SWT:1598): Gtk-CRITICAL **: 19:19:58.867: gtk_box_gadget_distribute: assertion 'size >= 0' failed in GtkScrollbar
15:19:58 [2020-08-24T19:19:58.972Z] 
15:19:58 [2020-08-24T19:19:58.972Z] (SWT:1598): Gtk-CRITICAL **: 19:19:58.884: gtk_box_gadget_distribute: assertion 'size >= 0' failed in GtkScrollbar
15:19:58 [2020-08-24T19:19:58.972Z] 
15:19:58 [2020-08-24T19:19:58.972Z] (SWT:1598): Gtk-CRITICAL **: 19:19:58.884: gtk_box_gadget_distribute: assertion 'size >= 0' failed in GtkScrollbar
15:19:58 [2020-08-24T19:19:58.972Z] 
15:19:58 [2020-08-24T19:19:58.972Z] (SWT:1598): Gtk-CRITICAL **: 19:19:58.901: gtk_box_gadget_distribute: assertion 'size >= 0' failed in GtkScrollbar
15:19:58 [2020-08-24T19:19:58.972Z] 
15:19:58 [2020-08-24T19:19:58.972Z] (SWT:1598): Gtk-CRITICAL **: 19:19:58.901: gtk_box_gadget_distribute: assertion 'size >= 0' failed in GtkScrollbar
15:19:58 [2020-08-24T19:19:58.972Z] 
15:19:58 [2020-08-24T19:19:58.972Z] (SWT:1598): Gtk-CRITICAL **: 19:19:58.913: gtk_box_gadget_distribute: assertion 'size >= 0' failed in GtkScrollbar
15:19:58 [2020-08-24T19:19:58.972Z] 
15:19:58 [2020-08-24T19:19:58.972Z] (SWT:1598): Gtk-CRITICAL **: 19:19:58.913: gtk_box_gadget_distribute: assertion 'size >= 0' failed in GtkScrollbar
15:19:58 [2020-08-24T19:19:58.972Z] 
15:19:58 [2020-08-24T19:19:58.972Z] (SWT:1598): Gtk-CRITICAL **: 19:19:58.918: gtk_box_gadget_distribute: assertion 'size >= 0' failed in GtkScrollbar
15:19:58 [2020-08-24T19:19:58.972Z] 
15:19:58 [2020-08-24T19:19:58.972Z] (SWT:1598): Gtk-CRITICAL **: 19:19:58.918: gtk_box_gadget_distribute: assertion 'size >= 0' failed in GtkScrollbar
15:19:58 [2020-08-24T19:19:58.972Z] 
15:19:58 [2020-08-24T19:19:58.972Z] (SWT:1598): Gtk-CRITICAL **: 19:19:58.922: gtk_box_gadget_distribute: assertion 'size >= 0' failed in GtkScrollbar
15:19:58 [2020-08-24T19:19:58.972Z] 
15:19:58 [2020-08-24T19:19:58.972Z] (SWT:1598): Gtk-CRITICAL **: 19:19:58.923: gtk_box_gadget_distribute: assertion 'size >= 0' failed in GtkScrollbar
15:19:58 [2020-08-24T19:19:58.972Z] 
15:19:58 [2020-08-24T19:19:58.972Z] (SWT:1598): Gtk-CRITICAL **: 19:19:58.924: gtk_box_gadget_distribute: assertion 'size >= 0' failed in GtkScrollbar
15:19:58 [2020-08-24T19:19:58.972Z] 
15:19:58 [2020-08-24T19:19:58.972Z] (SWT:1598): Gtk-CRITICAL **: 19:19:58.927: gtk_box_gadget_distribute: assertion 'size >= 0' failed in GtkScrollbar
15:19:58 [2020-08-24T19:19:58.972Z] 
15:19:58 [2020-08-24T19:19:58.972Z] (SWT:1598): Gtk-CRITICAL **: 19:19:58.938: gtk_box_gadget_distribute: assertion 'size >= 0' failed in GtkScrollbar
15:19:58 [2020-08-24T19:19:58.972Z] 
15:19:58 [2020-08-24T19:19:58.972Z] (SWT:1598): Gtk-CRITICAL **: 19:19:58.938: gtk_box_gadget_distribute: assertion 'size >= 0' failed in GtkScrollbar
15:19:58 [2020-08-24T19:19:58.972Z] 
15:19:58 [2020-08-24T19:19:58.972Z] (SWT:1598): Gtk-CRITICAL **: 19:19:58.950: gtk_box_gadget_distribute: assertion 'size >= 0' failed in GtkScrollbar
15:19:58 [2020-08-24T19:19:58.972Z] 
15:19:58 [2020-08-24T19:19:58.972Z] (SWT:1598): Gtk-CRITICAL **: 19:19:58.950: gtk_box_gadget_distribute: assertion 'size >= 0' failed in GtkScrollbar
15:19:59 [2020-08-24T19:19:59.229Z] 
15:19:59 [2020-08-24T19:19:59.229Z] (SWT:1598): Gtk-CRITICAL **: 19:19:58.967: gtk_box_gadget_distribute: assertion 'size >= 0' failed in GtkScrollbar
15:19:59 [2020-08-24T19:19:59.229Z] 
15:19:59 [2020-08-24T19:19:59.229Z] (SWT:1598): Gtk-CRITICAL **: 19:19:58.967: gtk_box_gadget_distribute: assertion 'size >= 0' failed in GtkScrollbar
15:19:59 [2020-08-24T19:19:59.229Z] 
15:19:59 [2020-08-24T19:19:59.229Z] (SWT:1598): Gtk-CRITICAL **: 19:19:58.985: gtk_box_gadget_distribute: assertion 'size >= 0' failed in GtkScrollbar
15:19:59 [2020-08-24T19:19:59.229Z] 
15:19:59 [2020-08-24T19:19:59.229Z] (SWT:1598): Gtk-CRITICAL **: 19:19:58.985: gtk_box_gadget_distribute: assertion 'size >= 0' failed in GtkScrollbar
15:19:59 [2020-08-24T19:19:59.229Z] 
15:19:59 [2020-08-24T19:19:59.229Z] (SWT:1598): Gtk-CRITICAL **: 19:19:58.996: gtk_box_gadget_distribute: assertion 'size >= 0' failed in GtkScrollbar
15:19:59 [2020-08-24T19:19:59.229Z] 
15:19:59 [2020-08-24T19:19:59.229Z] (SWT:1598): Gtk-CRITICAL **: 19:19:59.009: gtk_box_gadget_distribute: assertion 'size >= 0' failed in GtkScrollbar
15:19:59 [2020-08-24T19:19:59.229Z] 
15:19:59 [2020-08-24T19:19:59.229Z] (SWT:1598): Gtk-WARNING **: 19:19:59.064: Negative content width -6 (allocation 1, extents 4x3) while allocating gadget (node toolbar, owner GtkToolbar)
15:19:59 [2020-08-24T19:19:59.795Z] 
15:19:59 [2020-08-24T19:19:59.795Z] (SWT:1598): Gtk-WARNING **: 19:19:59.491: Negative content width -6 (allocation 1, extents 4x3) while allocating gadget (node toolbar, owner GtkToolbar)
15:19:59 [2020-08-24T19:19:59.795Z] 
15:19:59 [2020-08-24T19:19:59.795Z] (SWT:1598): Gtk-WARNING **: 19:19:59.501: Negative content width -6 (allocation 1, extents 4x3) while allocating gadget (node toolbar, owner GtkToolbar)
15:20:00 [2020-08-24T19:20:00.370Z] 
15:20:00 [2020-08-24T19:20:00.370Z] (SWT:1598): Gtk-WARNING **: 19:20:00.075: Negative content width -6 (allocation 1, extents 4x3) while allocating gadget (node toolbar, owner GtkToolbar)
15:20:00 [2020-08-24T19:20:00.628Z] 
15:20:00 [2020-08-24T19:20:00.628Z] (SWT:1598): Gtk-CRITICAL **: 19:20:00.424: gtk_box_gadget_distribute: assertion 'size >= 0' failed in GtkScrollbar
15:20:00 [2020-08-24T19:20:00.628Z] 
15:20:00 [2020-08-24T19:20:00.628Z] (SWT:1598): Gtk-CRITICAL **: 19:20:00.431: gtk_box_gadget_distribute: assertion 'size >= 0' failed in GtkScrollbar
15:20:00 [2020-08-24T19:20:00.628Z] 
15:20:00 [2020-08-24T19:20:00.628Z] (SWT:1598): Gtk-WARNING **: 19:20:00.434: Negative content width -6 (allocation 1, extents 4x3) while allocating gadget (node toolbar, owner GtkToolbar)
15:20:00 [2020-08-24T19:20:00.628Z] 
15:20:00 [2020-08-24T19:20:00.628Z] (SWT:1598): Gtk-CRITICAL **: 19:20:00.440: gtk_box_gadget_distribute: assertion 'size >= 0' failed in GtkScrollbar
15:20:00 [2020-08-24T19:20:00.628Z] 
15:20:00 [2020-08-24T19:20:00.628Z] (SWT:1598): Gtk-CRITICAL **: 19:20:00.445: gtk_box_gadget_distribute: assertion 'size >= 0' failed in GtkScrollbar
15:20:00 [2020-08-24T19:20:00.628Z] 
15:20:00 [2020-08-24T19:20:00.628Z] (SWT:1598): Gtk-CRITICAL **: 19:20:00.445: gtk_box_gadget_distribute: assertion 'size >= 0' failed in GtkScrollbar
15:20:00 [2020-08-24T19:20:00.628Z] 
15:20:00 [2020-08-24T19:20:00.628Z] (SWT:1598): Gtk-CRITICAL **: 19:20:00.450: gtk_box_gadget_distribute: assertion 'size >= 0' failed in GtkScrollbar
15:20:00 [2020-08-24T19:20:00.628Z] 
15:20:00 [2020-08-24T19:20:00.628Z] (SWT:1598): Gtk-CRITICAL **: 19:20:00.452: gtk_box_gadget_distribute: assertion 'size >= 0' failed in GtkScrollbar
15:20:00 [2020-08-24T19:20:00.628Z] 
15:20:00 [2020-08-24T19:20:00.628Z] (SWT:1598): Gtk-CRITICAL **: 19:20:00.455: gtk_box_gadget_distribute: assertion 'size >= 0' failed in GtkScrollbar
15:20:00 [2020-08-24T19:20:00.628Z] 
15:20:00 [2020-08-24T19:20:00.628Z] (SWT:1598): Gtk-CRITICAL **: 19:20:00.456: gtk_box_gadget_distribute: assertion 'size >= 0' failed in GtkScrollbar
15:20:00 [2020-08-24T19:20:00.628Z] 
15:20:00 [2020-08-24T19:20:00.628Z] (SWT:1598): Gtk-CRITICAL **: 19:20:00.464: gtk_box_gadget_distribute: assertion 'size >= 0' failed in GtkScrollbar
15:20:00 [2020-08-24T19:20:00.628Z] 
15:20:00 [2020-08-24T19:20:00.628Z] (SWT:1598): Gtk-CRITICAL **: 19:20:00.467: gtk_box_gadget_distribute: assertion 'size >= 0' failed in GtkScrollbar
15:20:00 [2020-08-24T19:20:00.628Z] 
15:20:00 [2020-08-24T19:20:00.628Z] (SWT:1598): Gtk-CRITICAL **: 19:20:00.469: gtk_box_gadget_distribute: assertion 'size >= 0' failed in GtkScrollbar
15:20:00 [2020-08-24T19:20:00.628Z] 
15:20:00 [2020-08-24T19:20:00.628Z] (SWT:1598): Gtk-CRITICAL **: 19:20:00.469: gtk_box_gadget_distribute: assertion 'size >= 0' failed in GtkScrollbar
15:20:00 [2020-08-24T19:20:00.628Z] 
15:20:00 [2020-08-24T19:20:00.628Z] (SWT:1598): Gtk-CRITICAL **: 19:20:00.486: gtk_box_gadget_distribute: assertion 'size >= 0' failed in GtkScrollbar
15:20:00 [2020-08-24T19:20:00.628Z] 
15:20:00 [2020-08-24T19:20:00.628Z] (SWT:1598): Gtk-CRITICAL **: 19:20:00.486: gtk_box_gadget_distribute: assertion 'size >= 0' failed in GtkScrollbar
15:20:00 [2020-08-24T19:20:00.628Z] 
15:20:00 [2020-08-24T19:20:00.628Z] (SWT:1598): Gtk-CRITICAL **: 19:20:00.502: gtk_box_gadget_distribute: assertion 'size >= 0' failed in GtkScrollbar
15:20:00 [2020-08-24T19:20:00.628Z] 
15:20:00 [2020-08-24T19:20:00.628Z] (SWT:1598): Gtk-CRITICAL **: 19:20:00.502: gtk_box_gadget_distribute: assertion 'size >= 0' failed in GtkScrollbar
15:20:00 [2020-08-24T19:20:00.628Z] 
15:20:00 [2020-08-24T19:20:00.628Z] (SWT:1598): Gtk-CRITICAL **: 19:20:00.519: gtk_box_gadget_distribute: assertion 'size >= 0' failed in GtkScrollbar
15:20:00 [2020-08-24T19:20:00.628Z] 
15:20:00 [2020-08-24T19:20:00.628Z] (SWT:1598): Gtk-CRITICAL **: 19:20:00.519: gtk_box_gadget_distribute: assertion 'size >= 0' failed in GtkScrollbar
15:20:00 [2020-08-24T19:20:00.628Z] 
15:20:00 [2020-08-24T19:20:00.628Z] (SWT:1598): Gtk-CRITICAL **: 19:20:00.536: gtk_box_gadget_distribute: assertion 'size >= 0' failed in GtkScrollbar
15:20:00 [2020-08-24T19:20:00.628Z] 
15:20:00 [2020-08-24T19:20:00.628Z] (SWT:1598): Gtk-CRITICAL **: 19:20:00.536: gtk_box_gadget_distribute: assertion 'size >= 0' failed in GtkScrollbar
15:20:00 [2020-08-24T19:20:00.628Z] 
15:20:00 [2020-08-24T19:20:00.628Z] (SWT:1598): Gtk-CRITICAL **: 19:20:00.552: gtk_box_gadget_distribute: assertion 'size >= 0' failed in GtkScrollbar
15:20:00 [2020-08-24T19:20:00.628Z] 
15:20:00 [2020-08-24T19:20:00.628Z] (SWT:1598): Gtk-CRITICAL **: 19:20:00.552: gtk_box_gadget_distribute: assertion 'size >= 0' failed in GtkScrollbar
15:20:00 [2020-08-24T19:20:00.628Z] 
15:20:00 [2020-08-24T19:20:00.628Z] (SWT:1598): Gtk-CRITICAL **: 19:20:00.569: gtk_box_gadget_distribute: assertion 'size >= 0' failed in GtkScrollbar
15:20:00 [2020-08-24T19:20:00.628Z] 
15:20:00 [2020-08-24T19:20:00.628Z] (SWT:1598): Gtk-CRITICAL **: 19:20:00.569: gtk_box_gadget_distribute: assertion 'size >= 0' failed in GtkScrollbar
15:20:00 [2020-08-24T19:20:00.628Z] 
15:20:00 [2020-08-24T19:20:00.628Z] (SWT:1598): Gtk-CRITICAL **: 19:20:00.573: gtk_box_gadget_distribute: assertion 'size >= 0' failed in GtkScrollbar
15:20:00 [2020-08-24T19:20:00.628Z] 
15:20:00 [2020-08-24T19:20:00.628Z] (SWT:1598): Gtk-CRITICAL **: 19:20:00.574: gtk_box_gadget_distribute: assertion 'size >= 0' failed in GtkScrollbar
15:20:00 [2020-08-24T19:20:00.628Z] 
15:20:00 [2020-08-24T19:20:00.628Z] (SWT:1598): Gtk-CRITICAL **: 19:20:00.579: gtk_box_gadget_distribute: assertion 'size >= 0' failed in GtkScrollbar
15:20:00 [2020-08-24T19:20:00.628Z] 
15:20:00 [2020-08-24T19:20:00.628Z] (SWT:1598): Gtk-CRITICAL **: 19:20:00.580: gtk_box_gadget_distribute: assertion 'size >= 0' failed in GtkScrollbar
15:20:00 [2020-08-24T19:20:00.628Z] 
15:20:00 [2020-08-24T19:20:00.628Z] (SWT:1598): Gtk-CRITICAL **: 19:20:00.580: gtk_box_gadget_distribute: assertion 'size >= 0' failed in GtkScrollbar
15:20:00 [2020-08-24T19:20:00.628Z] 
15:20:00 [2020-08-24T19:20:00.628Z] (SWT:1598): Gtk-CRITICAL **: 19:20:00.585: gtk_box_gadget_distribute: assertion 'size >= 0' failed in GtkScrollbar
15:20:00 [2020-08-24T19:20:00.628Z] 
15:20:00 [2020-08-24T19:20:00.628Z] (SWT:1598): Gtk-CRITICAL **: 19:20:00.586: gtk_box_gadget_distribute: assertion 'size >= 0' failed in GtkScrollbar
15:20:00 [2020-08-24T19:20:00.628Z] 
15:20:00 [2020-08-24T19:20:00.628Z] (SWT:1598): Gtk-CRITICAL **: 19:20:00.586: gtk_box_gadget_distribute: assertion 'size >= 0' failed in GtkScrollbar
15:20:00 [2020-08-24T19:20:00.628Z] 
15:20:00 [2020-08-24T19:20:00.628Z] (SWT:1598): Gtk-CRITICAL **: 19:20:00.599: gtk_box_gadget_distribute: assertion 'size >= 0' failed in GtkScrollbar
15:20:00 [2020-08-24T19:20:00.628Z] 
15:20:00 [2020-08-24T19:20:00.628Z] (SWT:1598): Gtk-CRITICAL **: 19:20:00.599: gtk_box_gadget_distribute: assertion 'size >= 0' failed in GtkScrollbar
15:20:00 [2020-08-24T19:20:00.628Z] 
15:20:00 [2020-08-24T19:20:00.628Z] (SWT:1598): Gtk-CRITICAL **: 19:20:00.604: gtk_box_gadget_distribute: assertion 'size >= 0' failed in GtkScrollbar
15:20:00 [2020-08-24T19:20:00.628Z] 
15:20:00 [2020-08-24T19:20:00.628Z] (SWT:1598): Gtk-CRITICAL **: 19:20:00.604: gtk_box_gadget_distribute: assertion 'size >= 0' failed in GtkScrollbar
15:20:00 [2020-08-24T19:20:00.628Z] 
15:20:00 [2020-08-24T19:20:00.628Z] (SWT:1598): Gtk-CRITICAL **: 19:20:00.608: gtk_box_gadget_distribute: assertion 'size >= 0' failed in GtkScrollbar
15:20:00 [2020-08-24T19:20:00.628Z] 
15:20:00 [2020-08-24T19:20:00.628Z] (SWT:1598): Gtk-CRITICAL **: 19:20:00.622: gtk_box_gadget_distribute: assertion 'size >= 0' failed in GtkScrollbar
15:20:00 [2020-08-24T19:20:00.628Z] 
15:20:00 [2020-08-24T19:20:00.628Z] (SWT:1598): Gtk-CRITICAL **: 19:20:00.622: gtk_box_gadget_distribute: assertion 'size >= 0' failed in GtkScrollbar
15:20:00 [2020-08-24T19:20:00.886Z] 
15:20:00 [2020-08-24T19:20:00.886Z] (SWT:1598): Gtk-CRITICAL **: 19:20:00.636: gtk_box_gadget_distribute: assertion 'size >= 0' failed in GtkScrollbar
15:20:00 [2020-08-24T19:20:00.886Z] 
15:20:00 [2020-08-24T19:20:00.886Z] (SWT:1598): Gtk-WARNING **: 19:20:00.650: Negative content width -6 (allocation 1, extents 4x3) while allocating gadget (node toolbar, owner GtkToolbar)
15:20:01 [2020-08-24T19:20:01.144Z] 
15:20:01 [2020-08-24T19:20:01.144Z] (SWT:1598): Gtk-WARNING **: 19:20:00.966: Negative content width -6 (allocation 1, extents 4x3) while allocating gadget (node toolbar, owner GtkToolbar)
15:20:01 [2020-08-24T19:20:01.144Z] 
15:20:01 [2020-08-24T19:20:01.144Z] (SWT:1598): Gtk-WARNING **: 19:20:00.983: Negative content width -6 (allocation 1, extents 4x3) while allocating gadget (node toolbar, owner GtkToolbar)
15:20:01 [2020-08-24T19:20:01.708Z] 
15:20:01 [2020-08-24T19:20:01.708Z] (SWT:1598): Gtk-WARNING **: 19:20:01.559: Negative content width -6 (allocation 1, extents 4x3) while allocating gadget (node toolbar, owner GtkToolbar)
15:20:01 [2020-08-24T19:20:01.965Z] 
15:20:01 [2020-08-24T19:20:01.965Z] (SWT:1598): Gtk-CRITICAL **: 19:20:01.918: gtk_box_gadget_distribute: assertion 'size >= 0' failed in GtkScrollbar
15:20:01 [2020-08-24T19:20:01.965Z] 
15:20:01 [2020-08-24T19:20:01.965Z] (SWT:1598): Gtk-CRITICAL **: 19:20:01.925: gtk_box_gadget_distribute: assertion 'size >= 0' failed in GtkScrollbar
15:20:01 [2020-08-24T19:20:01.965Z] 
15:20:01 [2020-08-24T19:20:01.965Z] (SWT:1598): Gtk-WARNING **: 19:20:01.928: Negative content width -6 (allocation 1, extents 4x3) while allocating gadget (node toolbar, owner GtkToolbar)
15:20:01 [2020-08-24T19:20:01.965Z] 
15:20:01 [2020-08-24T19:20:01.965Z] (SWT:1598): Gtk-CRITICAL **: 19:20:01.935: gtk_box_gadget_distribute: assertion 'size >= 0' failed in GtkScrollbar
15:20:01 [2020-08-24T19:20:01.965Z] 
15:20:01 [2020-08-24T19:20:01.965Z] (SWT:1598): Gtk-CRITICAL **: 19:20:01.941: gtk_box_gadget_distribute: assertion 'size >= 0' failed in GtkScrollbar
15:20:01 [2020-08-24T19:20:01.965Z] 
15:20:01 [2020-08-24T19:20:01.965Z] (SWT:1598): Gtk-CRITICAL **: 19:20:01.941: gtk_box_gadget_distribute: assertion 'size >= 0' failed in GtkScrollbar
15:20:01 [2020-08-24T19:20:01.965Z] 
15:20:01 [2020-08-24T19:20:01.965Z] (SWT:1598): Gtk-CRITICAL **: 19:20:01.946: gtk_box_gadget_distribute: assertion 'size >= 0' failed in GtkScrollbar
15:20:01 [2020-08-24T19:20:01.965Z] 
15:20:01 [2020-08-24T19:20:01.965Z] (SWT:1598): Gtk-CRITICAL **: 19:20:01.949: gtk_box_gadget_distribute: assertion 'size >= 0' failed in GtkScrollbar
15:20:01 [2020-08-24T19:20:01.965Z] 
15:20:01 [2020-08-24T19:20:01.965Z] (SWT:1598): Gtk-CRITICAL **: 19:20:01.949: gtk_box_gadget_distribute: assertion 'size >= 0' failed in GtkScrollbar
15:20:01 [2020-08-24T19:20:01.965Z] 
15:20:01 [2020-08-24T19:20:01.965Z] (SWT:1598): Gtk-CRITICAL **: 19:20:01.958: gtk_box_gadget_distribute: assertion 'size >= 0' failed in GtkScrollbar
15:20:02 [2020-08-24T19:20:02.223Z] 
15:20:02 [2020-08-24T19:20:02.223Z] (SWT:1598): Gtk-CRITICAL **: 19:20:01.974: gtk_box_gadget_distribute: assertion 'size >= 0' failed in GtkScrollbar
15:20:02 [2020-08-24T19:20:02.223Z] 
15:20:02 [2020-08-24T19:20:02.223Z] (SWT:1598): Gtk-CRITICAL **: 19:20:01.974: gtk_box_gadget_distribute: assertion 'size >= 0' failed in GtkScrollbar
15:20:02 [2020-08-24T19:20:02.223Z] 
15:20:02 [2020-08-24T19:20:02.223Z] (SWT:1598): Gtk-CRITICAL **: 19:20:01.991: gtk_box_gadget_distribute: assertion 'size >= 0' failed in GtkScrollbar
15:20:02 [2020-08-24T19:20:02.223Z] 
15:20:02 [2020-08-24T19:20:02.223Z] (SWT:1598): Gtk-CRITICAL **: 19:20:01.991: gtk_box_gadget_distribute: assertion 'size >= 0' failed in GtkScrollbar
15:20:02 [2020-08-24T19:20:02.223Z] 
15:20:02 [2020-08-24T19:20:02.223Z] (SWT:1598): Gtk-CRITICAL **: 19:20:02.008: gtk_box_gadget_distribute: assertion 'size >= 0' failed in GtkScrollbar
15:20:02 [2020-08-24T19:20:02.223Z] 
15:20:02 [2020-08-24T19:20:02.223Z] (SWT:1598): Gtk-CRITICAL **: 19:20:02.008: gtk_box_gadget_distribute: assertion 'size >= 0' failed in GtkScrollbar
15:20:02 [2020-08-24T19:20:02.223Z] 
15:20:02 [2020-08-24T19:20:02.223Z] (SWT:1598): Gtk-CRITICAL **: 19:20:02.024: gtk_box_gadget_distribute: assertion 'size >= 0' failed in GtkScrollbar
15:20:02 [2020-08-24T19:20:02.223Z] 
15:20:02 [2020-08-24T19:20:02.223Z] (SWT:1598): Gtk-CRITICAL **: 19:20:02.024: gtk_box_gadget_distribute: assertion 'size >= 0' failed in GtkScrollbar
15:20:02 [2020-08-24T19:20:02.223Z] 
15:20:02 [2020-08-24T19:20:02.223Z] (SWT:1598): Gtk-CRITICAL **: 19:20:02.041: gtk_box_gadget_distribute: assertion 'size >= 0' failed in GtkScrollbar
15:20:02 [2020-08-24T19:20:02.223Z] 
15:20:02 [2020-08-24T19:20:02.223Z] (SWT:1598): Gtk-CRITICAL **: 19:20:02.041: gtk_box_gadget_distribute: assertion 'size >= 0' failed in GtkScrollbar
15:20:02 [2020-08-24T19:20:02.223Z] 
15:20:02 [2020-08-24T19:20:02.223Z] (SWT:1598): Gtk-CRITICAL **: 19:20:02.057: gtk_box_gadget_distribute: assertion 'size >= 0' failed in GtkScrollbar
15:20:02 [2020-08-24T19:20:02.223Z] 
15:20:02 [2020-08-24T19:20:02.223Z] (SWT:1598): Gtk-CRITICAL **: 19:20:02.057: gtk_box_gadget_distribute: assertion 'size >= 0' failed in GtkScrollbar
15:20:02 [2020-08-24T19:20:02.223Z] 
15:20:02 [2020-08-24T19:20:02.223Z] (SWT:1598): Gtk-CRITICAL **: 19:20:02.063: gtk_box_gadget_distribute: assertion 'size >= 0' failed in GtkScrollbar
15:20:02 [2020-08-24T19:20:02.223Z] 
15:20:02 [2020-08-24T19:20:02.223Z] (SWT:1598): Gtk-CRITICAL **: 19:20:02.063: gtk_box_gadget_distribute: assertion 'size >= 0' failed in GtkScrollbar
15:20:02 [2020-08-24T19:20:02.223Z] 
15:20:02 [2020-08-24T19:20:02.223Z] (SWT:1598): Gtk-CRITICAL **: 19:20:02.067: gtk_box_gadget_distribute: assertion 'size >= 0' failed in GtkScrollbar
15:20:02 [2020-08-24T19:20:02.223Z] 
15:20:02 [2020-08-24T19:20:02.223Z] (SWT:1598): Gtk-CRITICAL **: 19:20:02.067: gtk_box_gadget_distribute: assertion 'size >= 0' failed in GtkScrollbar
15:20:02 [2020-08-24T19:20:02.223Z] 
15:20:02 [2020-08-24T19:20:02.223Z] (SWT:1598): Gtk-CRITICAL **: 19:20:02.068: gtk_box_gadget_distribute: assertion 'size >= 0' failed in GtkScrollbar
15:20:02 [2020-08-24T19:20:02.223Z] 
15:20:02 [2020-08-24T19:20:02.223Z] (SWT:1598): Gtk-CRITICAL **: 19:20:02.071: gtk_box_gadget_distribute: assertion 'size >= 0' failed in GtkScrollbar
15:20:02 [2020-08-24T19:20:02.223Z] 
15:20:02 [2020-08-24T19:20:02.223Z] (SWT:1598): Gtk-CRITICAL **: 19:20:02.073: gtk_box_gadget_distribute: assertion 'size >= 0' failed in GtkScrollbar
15:20:02 [2020-08-24T19:20:02.223Z] 
15:20:02 [2020-08-24T19:20:02.223Z] (SWT:1598): Gtk-CRITICAL **: 19:20:02.073: gtk_box_gadget_distribute: assertion 'size >= 0' failed in GtkScrollbar
15:20:02 [2020-08-24T19:20:02.223Z] 
15:20:02 [2020-08-24T19:20:02.223Z] (SWT:1598): Gtk-CRITICAL **: 19:20:02.077: gtk_box_gadget_distribute: assertion 'size >= 0' failed in GtkScrollbar
15:20:02 [2020-08-24T19:20:02.223Z] 
15:20:02 [2020-08-24T19:20:02.223Z] (SWT:1598): Gtk-CRITICAL **: 19:20:02.077: gtk_box_gadget_distribute: assertion 'size >= 0' failed in GtkScrollbar
15:20:02 [2020-08-24T19:20:02.223Z] 
15:20:02 [2020-08-24T19:20:02.223Z] (SWT:1598): Gtk-CRITICAL **: 19:20:02.081: gtk_box_gadget_distribute: assertion 'size >= 0' failed in GtkScrollbar
15:20:02 [2020-08-24T19:20:02.223Z] 
15:20:02 [2020-08-24T19:20:02.223Z] (SWT:1598): Gtk-CRITICAL **: 19:20:02.091: gtk_box_gadget_distribute: assertion 'size >= 0' failed in GtkScrollbar
15:20:02 [2020-08-24T19:20:02.223Z] 
15:20:02 [2020-08-24T19:20:02.223Z] (SWT:1598): Gtk-CRITICAL **: 19:20:02.091: gtk_box_gadget_distribute: assertion 'size >= 0' failed in GtkScrollbar
15:20:02 [2020-08-24T19:20:02.223Z] 
15:20:02 [2020-08-24T19:20:02.223Z] (SWT:1598): Gtk-CRITICAL **: 19:20:02.109: gtk_box_gadget_distribute: assertion 'size >= 0' failed in GtkScrollbar
15:20:02 [2020-08-24T19:20:02.223Z] 
15:20:02 [2020-08-24T19:20:02.223Z] (SWT:1598): Gtk-WARNING **: 19:20:02.127: Negative content width -6 (allocation 1, extents 4x3) while allocating gadget (node toolbar, owner GtkToolbar)
15:20:02 [2020-08-24T19:20:02.788Z] 
15:20:02 [2020-08-24T19:20:02.788Z] (SWT:1598): Gtk-WARNING **: 19:20:02.751: Negative content width -6 (allocation 1, extents 4x3) while allocating gadget (node toolbar, owner GtkToolbar)
15:20:02 [2020-08-24T19:20:02.788Z] 
15:20:02 [2020-08-24T19:20:02.788Z] (SWT:1598): Gtk-WARNING **: 19:20:02.760: Negative content width -6 (allocation 1, extents 4x3) while allocating gadget (node toolbar, owner GtkToolbar)
15:20:03 [2020-08-24T19:20:03.351Z] 
15:20:03 [2020-08-24T19:20:03.351Z] (SWT:1598): Gtk-WARNING **: 19:20:03.333: Negative content width -6 (allocation 1, extents 4x3) while allocating gadget (node toolbar, owner GtkToolbar)
15:20:04 [2020-08-24T19:20:04.281Z] 
15:20:04 [2020-08-24T19:20:04.281Z] (SWT:1598): Gtk-CRITICAL **: 19:20:03.969: gtk_box_gadget_distribute: assertion 'size >= 0' failed in GtkScrollbar
15:20:04 [2020-08-24T19:20:04.281Z] 
15:20:04 [2020-08-24T19:20:04.281Z] (SWT:1598): Gtk-CRITICAL **: 19:20:03.976: gtk_box_gadget_distribute: assertion 'size >= 0' failed in GtkScrollbar
15:20:04 [2020-08-24T19:20:04.281Z] 
15:20:04 [2020-08-24T19:20:04.281Z] (SWT:1598): Gtk-WARNING **: 19:20:03.979: Negative content width -6 (allocation 1, extents 4x3) while allocating gadget (node toolbar, owner GtkToolbar)
15:20:04 [2020-08-24T19:20:04.281Z] 
15:20:04 [2020-08-24T19:20:04.281Z] (SWT:1598): Gtk-CRITICAL **: 19:20:03.985: gtk_box_gadget_distribute: assertion 'size >= 0' failed in GtkScrollbar
15:20:04 [2020-08-24T19:20:04.281Z] 
15:20:04 [2020-08-24T19:20:04.281Z] (SWT:1598): Gtk-CRITICAL **: 19:20:03.990: gtk_box_gadget_distribute: assertion 'size >= 0' failed in GtkScrollbar
15:20:04 [2020-08-24T19:20:04.281Z] 
15:20:04 [2020-08-24T19:20:04.281Z] (SWT:1598): Gtk-CRITICAL **: 19:20:03.991: gtk_box_gadget_distribute: assertion 'size >= 0' failed in GtkScrollbar
15:20:04 [2020-08-24T19:20:04.281Z] 
15:20:04 [2020-08-24T19:20:04.281Z] (SWT:1598): Gtk-CRITICAL **: 19:20:03.995: gtk_box_gadget_distribute: assertion 'size >= 0' failed in GtkScrollbar
15:20:04 [2020-08-24T19:20:04.281Z] 
15:20:04 [2020-08-24T19:20:04.281Z] (SWT:1598): Gtk-CRITICAL **: 19:20:03.998: gtk_box_gadget_distribute: assertion 'size >= 0' failed in GtkScrollbar
15:20:04 [2020-08-24T19:20:04.281Z] 
15:20:04 [2020-08-24T19:20:04.281Z] (SWT:1598): Gtk-CRITICAL **: 19:20:03.999: gtk_box_gadget_distribute: assertion 'size >= 0' failed in GtkScrollbar
15:20:04 [2020-08-24T19:20:04.281Z] 
15:20:04 [2020-08-24T19:20:04.281Z] (SWT:1598): Gtk-CRITICAL **: 19:20:04.007: gtk_box_gadget_distribute: assertion 'size >= 0' failed in GtkScrollbar
15:20:04 [2020-08-24T19:20:04.281Z] 
15:20:04 [2020-08-24T19:20:04.281Z] (SWT:1598): Gtk-CRITICAL **: 19:20:04.013: gtk_box_gadget_distribute: assertion 'size >= 0' failed in GtkScrollbar
15:20:04 [2020-08-24T19:20:04.281Z] 
15:20:04 [2020-08-24T19:20:04.281Z] (SWT:1598): Gtk-CRITICAL **: 19:20:04.013: gtk_box_gadget_distribute: assertion 'size >= 0' failed in GtkScrollbar
15:20:04 [2020-08-24T19:20:04.281Z] 
15:20:04 [2020-08-24T19:20:04.281Z] (SWT:1598): Gtk-CRITICAL **: 19:20:04.030: gtk_box_gadget_distribute: assertion 'size >= 0' failed in GtkScrollbar
15:20:04 [2020-08-24T19:20:04.281Z] 
15:20:04 [2020-08-24T19:20:04.281Z] (SWT:1598): Gtk-CRITICAL **: 19:20:04.030: gtk_box_gadget_distribute: assertion 'size >= 0' failed in GtkScrollbar
15:20:04 [2020-08-24T19:20:04.281Z] 
15:20:04 [2020-08-24T19:20:04.281Z] (SWT:1598): Gtk-CRITICAL **: 19:20:04.047: gtk_box_gadget_distribute: assertion 'size >= 0' failed in GtkScrollbar
15:20:04 [2020-08-24T19:20:04.281Z] 
15:20:04 [2020-08-24T19:20:04.281Z] (SWT:1598): Gtk-CRITICAL **: 19:20:04.047: gtk_box_gadget_distribute: assertion 'size >= 0' failed in GtkScrollbar
15:20:04 [2020-08-24T19:20:04.281Z] 
15:20:04 [2020-08-24T19:20:04.281Z] (SWT:1598): Gtk-CRITICAL **: 19:20:04.064: gtk_box_gadget_distribute: assertion 'size >= 0' failed in GtkScrollbar
15:20:04 [2020-08-24T19:20:04.281Z] 
15:20:04 [2020-08-24T19:20:04.281Z] (SWT:1598): Gtk-CRITICAL **: 19:20:04.064: gtk_box_gadget_distribute: assertion 'size >= 0' failed in GtkScrollbar
15:20:04 [2020-08-24T19:20:04.281Z] 
15:20:04 [2020-08-24T19:20:04.281Z] (SWT:1598): Gtk-CRITICAL **: 19:20:04.080: gtk_box_gadget_distribute: assertion 'size >= 0' failed in GtkScrollbar
15:20:04 [2020-08-24T19:20:04.281Z] 
15:20:04 [2020-08-24T19:20:04.281Z] (SWT:1598): Gtk-CRITICAL **: 19:20:04.080: gtk_box_gadget_distribute: assertion 'size >= 0' failed in GtkScrollbar
15:20:04 [2020-08-24T19:20:04.281Z] 
15:20:04 [2020-08-24T19:20:04.281Z] (SWT:1598): Gtk-CRITICAL **: 19:20:04.097: gtk_box_gadget_distribute: assertion 'size >= 0' failed in GtkScrollbar
15:20:04 [2020-08-24T19:20:04.281Z] 
15:20:04 [2020-08-24T19:20:04.281Z] (SWT:1598): Gtk-CRITICAL **: 19:20:04.097: gtk_box_gadget_distribute: assertion 'size >= 0' failed in GtkScrollbar
15:20:04 [2020-08-24T19:20:04.281Z] 
15:20:04 [2020-08-24T19:20:04.281Z] (SWT:1598): Gtk-CRITICAL **: 19:20:04.120: gtk_box_gadget_distribute: assertion 'size >= 0' failed in GtkScrollbar
15:20:04 [2020-08-24T19:20:04.281Z] 
15:20:04 [2020-08-24T19:20:04.281Z] (SWT:1598): Gtk-CRITICAL **: 19:20:04.120: gtk_box_gadget_distribute: assertion 'size >= 0' failed in GtkScrollbar
15:20:04 [2020-08-24T19:20:04.281Z] 
15:20:04 [2020-08-24T19:20:04.281Z] (SWT:1598): Gtk-CRITICAL **: 19:20:04.131: gtk_box_gadget_distribute: assertion 'size >= 0' failed in GtkScrollbar
15:20:04 [2020-08-24T19:20:04.281Z] 
15:20:04 [2020-08-24T19:20:04.281Z] (SWT:1598): Gtk-CRITICAL **: 19:20:04.131: gtk_box_gadget_distribute: assertion 'size >= 0' failed in GtkScrollbar
15:20:04 [2020-08-24T19:20:04.281Z] 
15:20:04 [2020-08-24T19:20:04.281Z] (SWT:1598): Gtk-CRITICAL **: 19:20:04.148: gtk_box_gadget_distribute: assertion 'size >= 0' failed in GtkScrollbar
15:20:04 [2020-08-24T19:20:04.281Z] 
15:20:04 [2020-08-24T19:20:04.281Z] (SWT:1598): Gtk-CRITICAL **: 19:20:04.148: gtk_box_gadget_distribute: assertion 'size >= 0' failed in GtkScrollbar
15:20:04 [2020-08-24T19:20:04.281Z] 
15:20:04 [2020-08-24T19:20:04.281Z] (SWT:1598): Gtk-CRITICAL **: 19:20:04.164: gtk_box_gadget_distribute: assertion 'size >= 0' failed in GtkScrollbar
15:20:04 [2020-08-24T19:20:04.281Z] 
15:20:04 [2020-08-24T19:20:04.281Z] (SWT:1598): Gtk-CRITICAL **: 19:20:04.165: gtk_box_gadget_distribute: assertion 'size >= 0' failed in GtkScrollbar
15:20:04 [2020-08-24T19:20:04.281Z] 
15:20:04 [2020-08-24T19:20:04.282Z] (SWT:1598): Gtk-CRITICAL **: 19:20:04.180: gtk_box_gadget_distribute: assertion 'size >= 0' failed in GtkScrollbar
15:20:04 [2020-08-24T19:20:04.282Z] 
15:20:04 [2020-08-24T19:20:04.282Z] (SWT:1598): Gtk-CRITICAL **: 19:20:04.180: gtk_box_gadget_distribute: assertion 'size >= 0' failed in GtkScrollbar
15:20:04 [2020-08-24T19:20:04.282Z] 
15:20:04 [2020-08-24T19:20:04.282Z] (SWT:1598): Gtk-CRITICAL **: 19:20:04.192: gtk_box_gadget_distribute: assertion 'size >= 0' failed in GtkScrollbar
15:20:04 [2020-08-24T19:20:04.282Z] 
15:20:04 [2020-08-24T19:20:04.282Z] (SWT:1598): Gtk-CRITICAL **: 19:20:04.193: gtk_box_gadget_distribute: assertion 'size >= 0' failed in GtkScrollbar
15:20:04 [2020-08-24T19:20:04.282Z] 
15:20:04 [2020-08-24T19:20:04.282Z] (SWT:1598): Gtk-CRITICAL **: 19:20:04.193: gtk_box_gadget_distribute: assertion 'size >= 0' failed in GtkScrollbar
15:20:04 [2020-08-24T19:20:04.282Z] 
15:20:04 [2020-08-24T19:20:04.282Z] (SWT:1598): Gtk-CRITICAL **: 19:20:04.197: gtk_box_gadget_distribute: assertion 'size >= 0' failed in GtkScrollbar
15:20:04 [2020-08-24T19:20:04.282Z] 
15:20:04 [2020-08-24T19:20:04.282Z] (SWT:1598): Gtk-CRITICAL **: 19:20:04.199: gtk_box_gadget_distribute: assertion 'size >= 0' failed in GtkScrollbar
15:20:04 [2020-08-24T19:20:04.282Z] 
15:20:04 [2020-08-24T19:20:04.282Z] (SWT:1598): Gtk-CRITICAL **: 19:20:04.200: gtk_box_gadget_distribute: assertion 'size >= 0' failed in GtkScrollbar
15:20:04 [2020-08-24T19:20:04.282Z] 
15:20:04 [2020-08-24T19:20:04.282Z] (SWT:1598): Gtk-CRITICAL **: 19:20:04.200: gtk_box_gadget_distribute: assertion 'size >= 0' failed in GtkScrollbar
15:20:04 [2020-08-24T19:20:04.282Z] 
15:20:04 [2020-08-24T19:20:04.282Z] (SWT:1598): Gtk-CRITICAL **: 19:20:04.207: gtk_box_gadget_distribute: assertion 'size >= 0' failed in GtkScrollbar
15:20:04 [2020-08-24T19:20:04.282Z] 
15:20:04 [2020-08-24T19:20:04.282Z] (SWT:1598): Gtk-CRITICAL **: 19:20:04.215: gtk_box_gadget_distribute: assertion 'size >= 0' failed in GtkScrollbar
15:20:04 [2020-08-24T19:20:04.282Z] 
15:20:04 [2020-08-24T19:20:04.282Z] (SWT:1598): Gtk-CRITICAL **: 19:20:04.215: gtk_box_gadget_distribute: assertion 'size >= 0' failed in GtkScrollbar
15:20:04 [2020-08-24T19:20:04.282Z] 
15:20:04 [2020-08-24T19:20:04.282Z] (SWT:1598): Gtk-CRITICAL **: 19:20:04.216: gtk_box_gadget_distribute: assertion 'size >= 0' failed in GtkScrollbar
15:20:04 [2020-08-24T19:20:04.282Z] 
15:20:04 [2020-08-24T19:20:04.282Z] (SWT:1598): Gtk-CRITICAL **: 19:20:04.218: gtk_box_gadget_distribute: assertion 'size >= 0' failed in GtkScrollbar
15:20:04 [2020-08-24T19:20:04.282Z] 
15:20:04 [2020-08-24T19:20:04.282Z] (SWT:1598): Gtk-CRITICAL **: 19:20:04.219: gtk_box_gadget_distribute: assertion 'size >= 0' failed in GtkScrollbar
15:20:04 [2020-08-24T19:20:04.282Z] 
15:20:04 [2020-08-24T19:20:04.282Z] (SWT:1598): Gtk-CRITICAL **: 19:20:04.220: gtk_box_gadget_distribute: assertion 'size >= 0' failed in GtkScrollbar
15:20:04 [2020-08-24T19:20:04.282Z] 
15:20:04 [2020-08-24T19:20:04.282Z] (SWT:1598): Gtk-CRITICAL **: 19:20:04.223: gtk_box_gadget_distribute: assertion 'size >= 0' failed in GtkScrollbar
15:20:04 [2020-08-24T19:20:04.282Z] 
15:20:04 [2020-08-24T19:20:04.282Z] (SWT:1598): Gtk-CRITICAL **: 19:20:04.224: gtk_box_gadget_distribute: assertion 'size >= 0' failed in GtkScrollbar
15:20:04 [2020-08-24T19:20:04.282Z] 
15:20:04 [2020-08-24T19:20:04.282Z] (SWT:1598): Gtk-CRITICAL **: 19:20:04.229: gtk_box_gadget_distribute: assertion 'size >= 0' failed in GtkScrollbar
15:20:04 [2020-08-24T19:20:04.282Z] 
15:20:04 [2020-08-24T19:20:04.282Z] (SWT:1598): Gtk-CRITICAL **: 19:20:04.229: gtk_box_gadget_distribute: assertion 'size >= 0' failed in GtkScrollbar
15:20:04 [2020-08-24T19:20:04.282Z] 
15:20:04 [2020-08-24T19:20:04.282Z] (SWT:1598): Gtk-CRITICAL **: 19:20:04.233: gtk_box_gadget_distribute: assertion 'size >= 0' failed in GtkScrollbar
15:20:04 [2020-08-24T19:20:04.282Z] 
15:20:04 [2020-08-24T19:20:04.282Z] (SWT:1598): Gtk-CRITICAL **: 19:20:04.242: gtk_box_gadget_distribute: assertion 'size >= 0' failed in GtkScrollbar
15:20:04 [2020-08-24T19:20:04.282Z] 
15:20:04 [2020-08-24T19:20:04.282Z] (SWT:1598): Gtk-CRITICAL **: 19:20:04.242: gtk_box_gadget_distribute: assertion 'size >= 0' failed in GtkScrollbar
15:20:04 [2020-08-24T19:20:04.282Z] 
15:20:04 [2020-08-24T19:20:04.282Z] (SWT:1598): Gtk-CRITICAL **: 19:20:04.274: gtk_box_gadget_distribute: assertion 'size >= 0' failed in GtkScrollbar
15:20:04 [2020-08-24T19:20:04.539Z] 
15:20:04 [2020-08-24T19:20:04.539Z] (SWT:1598): Gtk-CRITICAL **: 19:20:04.278: gtk_box_gadget_distribute: assertion 'size >= 0' failed in GtkScrollbar
15:20:04 [2020-08-24T19:20:04.539Z] 
15:20:04 [2020-08-24T19:20:04.539Z] (SWT:1598): Gtk-CRITICAL **: 19:20:04.278: gtk_box_gadget_distribute: assertion 'size >= 0' failed in GtkScrollbar
15:20:04 [2020-08-24T19:20:04.539Z] 
15:20:04 [2020-08-24T19:20:04.539Z] (SWT:1598): Gtk-CRITICAL **: 19:20:04.290: gtk_box_gadget_distribute: assertion 'size >= 0' failed in GtkScrollbar
15:20:04 [2020-08-24T19:20:04.539Z] 
15:20:04 [2020-08-24T19:20:04.539Z] (SWT:1598): Gtk-CRITICAL **: 19:20:04.291: gtk_box_gadget_distribute: assertion 'size >= 0' failed in GtkScrollbar
15:20:04 [2020-08-24T19:20:04.539Z] 
15:20:04 [2020-08-24T19:20:04.539Z] (SWT:1598): Gtk-CRITICAL **: 19:20:04.292: gtk_box_gadget_distribute: assertion 'size >= 0' failed in GtkScrollbar
15:20:04 [2020-08-24T19:20:04.539Z] 
15:20:04 [2020-08-24T19:20:04.539Z] (SWT:1598): Gtk-CRITICAL **: 19:20:04.297: gtk_box_gadget_distribute: assertion 'size >= 0' failed in GtkScrollbar
15:20:04 [2020-08-24T19:20:04.539Z] 
15:20:04 [2020-08-24T19:20:04.539Z] (SWT:1598): Gtk-CRITICAL **: 19:20:04.377: gtk_box_gadget_distribute: assertion 'size >= 0' failed in GtkScrollbar
15:20:04 [2020-08-24T19:20:04.539Z] 
15:20:04 [2020-08-24T19:20:04.539Z] (SWT:1598): Gtk-CRITICAL **: 19:20:04.378: gtk_box_gadget_distribute: assertion 'size >= 0' failed in GtkScrollbar
15:20:04 [2020-08-24T19:20:04.539Z] 
15:20:04 [2020-08-24T19:20:04.539Z] (SWT:1598): Gtk-CRITICAL **: 19:20:04.378: gtk_box_gadget_distribute: assertion 'size >= 0' failed in GtkScrollbar
15:20:04 [2020-08-24T19:20:04.539Z] 
15:20:04 [2020-08-24T19:20:04.539Z] (SWT:1598): Gtk-CRITICAL **: 19:20:04.385: gtk_box_gadget_distribute: assertion 'size >= 0' failed in GtkScrollbar
15:20:04 [2020-08-24T19:20:04.539Z] 
15:20:04 [2020-08-24T19:20:04.539Z] (SWT:1598): Gtk-CRITICAL **: 19:20:04.474: gtk_box_gadget_distribute: assertion 'size >= 0' failed in GtkScrollbar
15:20:04 [2020-08-24T19:20:04.539Z] 
15:20:04 [2020-08-24T19:20:04.539Z] (SWT:1598): Gtk-CRITICAL **: 19:20:04.475: gtk_box_gadget_distribute: assertion 'size >= 0' failed in GtkScrollbar
15:20:04 [2020-08-24T19:20:04.539Z] 
15:20:04 [2020-08-24T19:20:04.539Z] (SWT:1598): Gtk-CRITICAL **: 19:20:04.475: gtk_box_gadget_distribute: assertion 'size >= 0' failed in GtkScrollbar
15:20:04 [2020-08-24T19:20:04.539Z] 
15:20:04 [2020-08-24T19:20:04.539Z] (SWT:1598): Gtk-CRITICAL **: 19:20:04.489: gtk_box_gadget_distribute: assertion 'size >= 0' failed in GtkScrollbar
15:20:04 [2020-08-24T19:20:04.796Z] 
15:20:04 [2020-08-24T19:20:04.796Z] (SWT:1598): Gtk-CRITICAL **: 19:20:04.573: gtk_box_gadget_distribute: assertion 'size >= 0' failed in GtkScrollbar
15:20:04 [2020-08-24T19:20:04.796Z] 
15:20:04 [2020-08-24T19:20:04.796Z] (SWT:1598): Gtk-CRITICAL **: 19:20:04.588: gtk_box_gadget_distribute: assertion 'size >= 0' failed in GtkScrollbar
15:20:04 [2020-08-24T19:20:04.796Z] 
15:20:04 [2020-08-24T19:20:04.796Z] (SWT:1598): Gtk-CRITICAL **: 19:20:04.605: gtk_box_gadget_distribute: assertion 'size >= 0' failed in GtkScrollbar
15:20:04 [2020-08-24T19:20:04.796Z] 
15:20:04 [2020-08-24T19:20:04.796Z] (SWT:1598): Gtk-CRITICAL **: 19:20:04.624: gtk_box_gadget_distribute: assertion 'size >= 0' failed in GtkScrollbar
15:20:04 [2020-08-24T19:20:04.796Z] 
15:20:04 [2020-08-24T19:20:04.796Z] (SWT:1598): Gtk-CRITICAL **: 19:20:04.637: gtk_box_gadget_distribute: assertion 'size >= 0' failed in GtkScrollbar
15:20:04 [2020-08-24T19:20:04.796Z] 
15:20:04 [2020-08-24T19:20:04.796Z] (SWT:1598): Gtk-CRITICAL **: 19:20:04.637: gtk_box_gadget_distribute: assertion 'size >= 0' failed in GtkScrollbar
15:20:04 [2020-08-24T19:20:04.796Z] 
15:20:04 [2020-08-24T19:20:04.796Z] (SWT:1598): Gtk-CRITICAL **: 19:20:04.638: gtk_box_gadget_distribute: assertion 'size >= 0' failed in GtkScrollbar
15:20:04 [2020-08-24T19:20:04.796Z] 
15:20:04 [2020-08-24T19:20:04.796Z] (SWT:1598): Gtk-CRITICAL **: 19:20:04.639: gtk_box_gadget_distribute: assertion 'size >= 0' failed in GtkScrollbar
15:20:04 [2020-08-24T19:20:04.796Z] 
15:20:04 [2020-08-24T19:20:04.796Z] (SWT:1598): Gtk-CRITICAL **: 19:20:04.639: gtk_box_gadget_distribute: assertion 'size >= 0' failed in GtkScrollbar
15:20:04 [2020-08-24T19:20:04.796Z] 
15:20:04 [2020-08-24T19:20:04.796Z] (SWT:1598): Gtk-CRITICAL **: 19:20:04.639: gtk_box_gadget_distribute: assertion 'size >= 0' failed in GtkScrollbar
15:20:04 [2020-08-24T19:20:04.796Z] 
15:20:04 [2020-08-24T19:20:04.796Z] (SWT:1598): Gtk-CRITICAL **: 19:20:04.646: gtk_box_gadget_distribute: assertion 'size >= 0' failed in GtkScrollbar
15:20:04 [2020-08-24T19:20:04.796Z] 
15:20:04 [2020-08-24T19:20:04.796Z] (SWT:1598): Gtk-CRITICAL **: 19:20:04.654: gtk_box_gadget_distribute: assertion 'size >= 0' failed in GtkScrollbar
15:20:04 [2020-08-24T19:20:04.796Z] 
15:20:04 [2020-08-24T19:20:04.796Z] (SWT:1598): Gtk-CRITICAL **: 19:20:04.673: gtk_box_gadget_distribute: assertion 'size >= 0' failed in GtkScrollbar
15:20:04 [2020-08-24T19:20:04.796Z] 
15:20:04 [2020-08-24T19:20:04.796Z] (SWT:1598): Gtk-CRITICAL **: 19:20:04.673: gtk_box_gadget_distribute: assertion 'size >= 0' failed in GtkScrollbar
15:20:04 [2020-08-24T19:20:04.796Z] 
15:20:04 [2020-08-24T19:20:04.796Z] (SWT:1598): Gtk-CRITICAL **: 19:20:04.719: gtk_box_gadget_distribute: assertion 'size >= 0' failed in GtkScrollbar
15:20:04 [2020-08-24T19:20:04.796Z] 
15:20:04 [2020-08-24T19:20:04.796Z] (SWT:1598): Gtk-CRITICAL **: 19:20:04.726: gtk_box_gadget_distribute: assertion 'size >= 0' failed in GtkScrollbar
15:20:04 [2020-08-24T19:20:04.796Z] 
15:20:04 [2020-08-24T19:20:04.796Z] (SWT:1598): Gtk-CRITICAL **: 19:20:04.726: gtk_box_gadget_distribute: assertion 'size >= 0' failed in GtkScrollbar
15:20:04 [2020-08-24T19:20:04.796Z] 
15:20:04 [2020-08-24T19:20:04.796Z] (SWT:1598): Gtk-CRITICAL **: 19:20:04.727: gtk_box_gadget_distribute: assertion 'size >= 0' failed in GtkScrollbar
15:20:04 [2020-08-24T19:20:04.796Z] 
15:20:04 [2020-08-24T19:20:04.796Z] (SWT:1598): Gtk-CRITICAL **: 19:20:04.732: gtk_box_gadget_distribute: assertion 'size >= 0' failed in GtkScrollbar
15:20:04 [2020-08-24T19:20:04.796Z] 
15:20:04 [2020-08-24T19:20:04.796Z] (SWT:1598): Gtk-CRITICAL **: 19:20:04.739: gtk_box_gadget_distribute: assertion 'size >= 0' failed in GtkScrollbar
15:20:05 [2020-08-24T19:20:05.056Z] 
15:20:05 [2020-08-24T19:20:05.056Z] (SWT:1598): Gtk-WARNING **: 19:20:04.815: Negative content width -6 (allocation 1, extents 4x3) while allocating gadget (node toolbar, owner GtkToolbar)
15:20:05 [2020-08-24T19:20:05.313Z] 
15:20:05 [2020-08-24T19:20:05.313Z] (SWT:1598): Gtk-WARNING **: 19:20:05.265: Negative content width -6 (allocation 1, extents 4x3) while allocating gadget (node toolbar, owner GtkToolbar)
15:20:05 [2020-08-24T19:20:05.313Z] 
15:20:05 [2020-08-24T19:20:05.313Z] (SWT:1598): Gtk-WARNING **: 19:20:05.274: Negative content width -6 (allocation 1, extents 4x3) while allocating gadget (node toolbar, owner GtkToolbar)
15:20:05 [2020-08-24T19:20:05.571Z] Tests run: 11, Failures: 0, Errors: 0, Skipped: 0, Time elapsed: 22.581 s - in org.eclipse.egit.ui.test.stagview.StagingViewTest
15:20:05 [2020-08-24T19:20:05.571Z] testAmend(org.eclipse.egit.ui.test.stagview.StagingViewTest)  Time elapsed: 2.202 s
15:20:05 [2020-08-24T19:20:05.571Z] testButtonEnablement(org.eclipse.egit.ui.test.stagview.StagingViewTest)  Time elapsed: 2.171 s
15:20:05 [2020-08-24T19:20:05.571Z] testCommitSingleFile(org.eclipse.egit.ui.test.stagview.StagingViewTest)  Time elapsed: 1.889 s
15:20:05 [2020-08-24T19:20:05.571Z] testMergeConflict(org.eclipse.egit.ui.test.stagview.StagingViewTest)  Time elapsed: 3.464 s
15:20:05 [2020-08-24T19:20:05.571Z] testCommitMessageConfigChangeAmending(org.eclipse.egit.ui.test.stagview.StagingViewTest)  Time elapsed: 1.759 s
15:20:05 [2020-08-24T19:20:05.571Z] testCommitMessageConfigChangeWithAuthor(org.eclipse.egit.ui.test.stagview.StagingViewTest)  Time elapsed: 1.82 s
15:20:05 [2020-08-24T19:20:05.571Z] testCommitMessageConfigChange(org.eclipse.egit.ui.test.stagview.StagingViewTest)  Time elapsed: 1.717 s
15:20:05 [2020-08-24T19:20:05.571Z] testCommitMessageConfigChangeBranchSwitchToNew(org.eclipse.egit.ui.test.stagview.StagingViewTest)  Time elapsed: 1.764 s
15:20:05 [2020-08-24T19:20:05.571Z] testCommitMessageCommitterChangeSignOff(org.eclipse.egit.ui.test.stagview.StagingViewTest)  Time elapsed: 1.481 s
15:20:05 [2020-08-24T19:20:05.571Z] testCommitMessageConfigChangeNoSignOff(org.eclipse.egit.ui.test.stagview.StagingViewTest)  Time elapsed: 1.778 s
15:20:05 [2020-08-24T19:20:05.571Z] testDeleteModifyConflict(org.eclipse.egit.ui.test.stagview.StagingViewTest)  Time elapsed: 2.513 s
15:20:05 [2020-08-24T19:20:05.571Z] Running org.eclipse.egit.ui.test.stagview.CommitMessageProvidersTest
15:20:06 [2020-08-24T19:20:06.135Z] 
15:20:06 [2020-08-24T19:20:06.135Z] (SWT:1598): Gtk-WARNING **: 19:20:05.874: Negative content width -6 (allocation 1, extents 4x3) while allocating gadget (node toolbar, owner GtkToolbar)
15:20:06 [2020-08-24T19:20:06.394Z] 
15:20:06 [2020-08-24T19:20:06.394Z] (SWT:1598): Gtk-CRITICAL **: 19:20:06.337: gtk_box_gadget_distribute: assertion 'size >= 0' failed in GtkScrollbar
15:20:06 [2020-08-24T19:20:06.394Z] 
15:20:06 [2020-08-24T19:20:06.394Z] (SWT:1598): Gtk-CRITICAL **: 19:20:06.344: gtk_box_gadget_distribute: assertion 'size >= 0' failed in GtkScrollbar
15:20:06 [2020-08-24T19:20:06.394Z] 
15:20:06 [2020-08-24T19:20:06.394Z] (SWT:1598): Gtk-WARNING **: 19:20:06.347: Negative content width -6 (allocation 1, extents 4x3) while allocating gadget (node toolbar, owner GtkToolbar)
15:20:06 [2020-08-24T19:20:06.394Z] 
15:20:06 [2020-08-24T19:20:06.394Z] (SWT:1598): Gtk-CRITICAL **: 19:20:06.353: gtk_box_gadget_distribute: assertion 'size >= 0' failed in GtkScrollbar
15:20:06 [2020-08-24T19:20:06.394Z] 
15:20:06 [2020-08-24T19:20:06.394Z] (SWT:1598): Gtk-CRITICAL **: 19:20:06.358: gtk_box_gadget_distribute: assertion 'size >= 0' failed in GtkScrollbar
15:20:06 [2020-08-24T19:20:06.394Z] 
15:20:06 [2020-08-24T19:20:06.394Z] (SWT:1598): Gtk-CRITICAL **: 19:20:06.358: gtk_box_gadget_distribute: assertion 'size >= 0' failed in GtkScrollbar
15:20:06 [2020-08-24T19:20:06.394Z] 
15:20:06 [2020-08-24T19:20:06.394Z] (SWT:1598): Gtk-CRITICAL **: 19:20:06.359: gtk_box_gadget_distribute: assertion 'size >= 0' failed in GtkScrollbar
15:20:06 [2020-08-24T19:20:06.394Z] 
15:20:06 [2020-08-24T19:20:06.394Z] (SWT:1598): Gtk-CRITICAL **: 19:20:06.359: gtk_box_gadget_distribute: assertion 'size >= 0' failed in GtkScrollbar
15:20:06 [2020-08-24T19:20:06.394Z] 
15:20:06 [2020-08-24T19:20:06.394Z] (SWT:1598): Gtk-CRITICAL **: 19:20:06.364: gtk_box_gadget_distribute: assertion 'size >= 0' failed in GtkScrollbar
15:20:06 [2020-08-24T19:20:06.394Z] 
15:20:06 [2020-08-24T19:20:06.394Z] (SWT:1598): Gtk-CRITICAL **: 19:20:06.367: gtk_box_gadget_distribute: assertion 'size >= 0' failed in GtkScrollbar
15:20:06 [2020-08-24T19:20:06.394Z] 
15:20:06 [2020-08-24T19:20:06.394Z] (SWT:1598): Gtk-CRITICAL **: 19:20:06.371: gtk_box_gadget_distribute: assertion 'size >= 0' failed in GtkScrollbar
15:20:06 [2020-08-24T19:20:06.394Z] 
15:20:06 [2020-08-24T19:20:06.394Z] (SWT:1598): Gtk-CRITICAL **: 19:20:06.371: gtk_box_gadget_distribute: assertion 'size >= 0' failed in GtkScrollbar
15:20:06 [2020-08-24T19:20:06.394Z] 
15:20:06 [2020-08-24T19:20:06.394Z] (SWT:1598): Gtk-CRITICAL **: 19:20:06.379: gtk_box_gadget_distribute: assertion 'size >= 0' failed in GtkScrollbar
15:20:06 [2020-08-24T19:20:06.394Z] 
15:20:06 [2020-08-24T19:20:06.394Z] (SWT:1598): Gtk-CRITICAL **: 19:20:06.383: gtk_box_gadget_distribute: assertion 'size >= 0' failed in GtkScrollbar
15:20:06 [2020-08-24T19:20:06.394Z] 
15:20:06 [2020-08-24T19:20:06.394Z] (SWT:1598): Gtk-CRITICAL **: 19:20:06.386: gtk_box_gadget_distribute: assertion 'size >= 0' failed in GtkScrollbar
15:20:06 [2020-08-24T19:20:06.394Z] 
15:20:06 [2020-08-24T19:20:06.394Z] (SWT:1598): Gtk-CRITICAL **: 19:20:06.386: gtk_box_gadget_distribute: assertion 'size >= 0' failed in GtkScrollbar
15:20:06 [2020-08-24T19:20:06.651Z] 
15:20:06 [2020-08-24T19:20:06.651Z] (SWT:1598): Gtk-CRITICAL **: 19:20:06.403: gtk_box_gadget_distribute: assertion 'size >= 0' failed in GtkScrollbar
15:20:06 [2020-08-24T19:20:06.651Z] 
15:20:06 [2020-08-24T19:20:06.651Z] (SWT:1598): Gtk-CRITICAL **: 19:20:06.403: gtk_box_gadget_distribute: assertion 'size >= 0' failed in GtkScrollbar
15:20:06 [2020-08-24T19:20:06.651Z] 
15:20:06 [2020-08-24T19:20:06.651Z] (SWT:1598): Gtk-CRITICAL **: 19:20:06.419: gtk_box_gadget_distribute: assertion 'size >= 0' failed in GtkScrollbar
15:20:06 [2020-08-24T19:20:06.651Z] 
15:20:06 [2020-08-24T19:20:06.651Z] (SWT:1598): Gtk-CRITICAL **: 19:20:06.419: gtk_box_gadget_distribute: assertion 'size >= 0' failed in GtkScrollbar
15:20:06 [2020-08-24T19:20:06.651Z] 
15:20:06 [2020-08-24T19:20:06.651Z] (SWT:1598): Gtk-CRITICAL **: 19:20:06.436: gtk_box_gadget_distribute: assertion 'size >= 0' failed in GtkScrollbar
15:20:06 [2020-08-24T19:20:06.651Z] 
15:20:06 [2020-08-24T19:20:06.651Z] (SWT:1598): Gtk-CRITICAL **: 19:20:06.436: gtk_box_gadget_distribute: assertion 'size >= 0' failed in GtkScrollbar
15:20:06 [2020-08-24T19:20:06.651Z] 
15:20:06 [2020-08-24T19:20:06.651Z] (SWT:1598): Gtk-CRITICAL **: 19:20:06.453: gtk_box_gadget_distribute: assertion 'size >= 0' failed in GtkScrollbar
15:20:06 [2020-08-24T19:20:06.651Z] 
15:20:06 [2020-08-24T19:20:06.651Z] (SWT:1598): Gtk-CRITICAL **: 19:20:06.453: gtk_box_gadget_distribute: assertion 'size >= 0' failed in GtkScrollbar
15:20:06 [2020-08-24T19:20:06.651Z] 
15:20:06 [2020-08-24T19:20:06.651Z] (SWT:1598): Gtk-CRITICAL **: 19:20:06.470: gtk_box_gadget_distribute: assertion 'size >= 0' failed in GtkScrollbar
15:20:06 [2020-08-24T19:20:06.651Z] 
15:20:06 [2020-08-24T19:20:06.651Z] (SWT:1598): Gtk-CRITICAL **: 19:20:06.470: gtk_box_gadget_distribute: assertion 'size >= 0' failed in GtkScrollbar
15:20:06 [2020-08-24T19:20:06.651Z] 
15:20:06 [2020-08-24T19:20:06.651Z] (SWT:1598): Gtk-CRITICAL **: 19:20:06.493: gtk_box_gadget_distribute: assertion 'size >= 0' failed in GtkScrollbar
15:20:06 [2020-08-24T19:20:06.651Z] 
15:20:06 [2020-08-24T19:20:06.651Z] (SWT:1598): Gtk-CRITICAL **: 19:20:06.493: gtk_box_gadget_distribute: assertion 'size >= 0' failed in GtkScrollbar
15:20:06 [2020-08-24T19:20:06.651Z] 
15:20:06 [2020-08-24T19:20:06.651Z] (SWT:1598): Gtk-CRITICAL **: 19:20:06.516: gtk_box_gadget_distribute: assertion 'size >= 0' failed in GtkScrollbar
15:20:06 [2020-08-24T19:20:06.651Z] 
15:20:06 [2020-08-24T19:20:06.651Z] (SWT:1598): Gtk-CRITICAL **: 19:20:06.520: gtk_box_gadget_distribute: assertion 'size >= 0' failed in GtkScrollbar
15:20:06 [2020-08-24T19:20:06.651Z] 
15:20:06 [2020-08-24T19:20:06.651Z] (SWT:1598): Gtk-CRITICAL **: 19:20:06.523: gtk_box_gadget_distribute: assertion 'size >= 0' failed in GtkScrollbar
15:20:06 [2020-08-24T19:20:06.651Z] 
15:20:06 [2020-08-24T19:20:06.651Z] (SWT:1598): Gtk-CRITICAL **: 19:20:06.523: gtk_box_gadget_distribute: assertion 'size >= 0' failed in GtkScrollbar
15:20:06 [2020-08-24T19:20:06.651Z] 
15:20:06 [2020-08-24T19:20:06.651Z] (SWT:1598): Gtk-CRITICAL **: 19:20:06.523: gtk_box_gadget_distribute: assertion 'size >= 0' failed in GtkScrollbar
15:20:06 [2020-08-24T19:20:06.651Z] 
15:20:06 [2020-08-24T19:20:06.651Z] (SWT:1598): Gtk-CRITICAL **: 19:20:06.547: gtk_box_gadget_distribute: assertion 'size >= 0' failed in GtkScrollbar
15:20:06 [2020-08-24T19:20:06.651Z] 
15:20:06 [2020-08-24T19:20:06.651Z] (SWT:1598): Gtk-CRITICAL **: 19:20:06.547: gtk_box_gadget_distribute: assertion 'size >= 0' failed in GtkScrollbar
15:20:06 [2020-08-24T19:20:06.651Z] 
15:20:06 [2020-08-24T19:20:06.651Z] (SWT:1598): Gtk-CRITICAL **: 19:20:06.547: gtk_box_gadget_distribute: assertion 'size >= 0' failed in GtkScrollbar
15:20:06 [2020-08-24T19:20:06.651Z] 
15:20:06 [2020-08-24T19:20:06.651Z] (SWT:1598): Gtk-CRITICAL **: 19:20:06.564: gtk_box_gadget_distribute: assertion 'size >= 0' failed in GtkScrollbar
15:20:06 [2020-08-24T19:20:06.651Z] 
15:20:06 [2020-08-24T19:20:06.651Z] (SWT:1598): Gtk-CRITICAL **: 19:20:06.564: gtk_box_gadget_distribute: assertion 'size >= 0' failed in GtkScrollbar
15:20:06 [2020-08-24T19:20:06.651Z] 
15:20:06 [2020-08-24T19:20:06.651Z] (SWT:1598): Gtk-CRITICAL **: 19:20:06.579: gtk_box_gadget_distribute: assertion 'size >= 0' failed in GtkScrollbar
15:20:06 [2020-08-24T19:20:06.651Z] 
15:20:06 [2020-08-24T19:20:06.651Z] (SWT:1598): Gtk-WARNING **: 19:20:06.633: Negative content width -6 (allocation 1, extents 4x3) while allocating gadget (node toolbar, owner GtkToolbar)
15:20:07 [2020-08-24T19:20:07.214Z] 
15:20:07 [2020-08-24T19:20:07.214Z] (SWT:1598): Gtk-WARNING **: 19:20:07.196: Negative content width -6 (allocation 1, extents 4x3) while allocating gadget (node toolbar, owner GtkToolbar)
15:20:07 [2020-08-24T19:20:07.214Z] 
15:20:07 [2020-08-24T19:20:07.214Z] (SWT:1598): Gtk-WARNING **: 19:20:07.206: Negative content width -6 (allocation 1, extents 4x3) while allocating gadget (node toolbar, owner GtkToolbar)
15:20:08 [2020-08-24T19:20:08.145Z] 
15:20:08 [2020-08-24T19:20:08.145Z] (SWT:1598): Gtk-WARNING **: 19:20:07.784: Negative content width -6 (allocation 1, extents 4x3) while allocating gadget (node toolbar, owner GtkToolbar)
15:20:08 [2020-08-24T19:20:08.145Z] 
15:20:08 [2020-08-24T19:20:08.145Z] (SWT:1598): Gtk-CRITICAL **: 19:20:08.065: gtk_box_gadget_distribute: assertion 'size >= 0' failed in GtkScrollbar
15:20:08 [2020-08-24T19:20:08.145Z] 
15:20:08 [2020-08-24T19:20:08.145Z] (SWT:1598): Gtk-CRITICAL **: 19:20:08.072: gtk_box_gadget_distribute: assertion 'size >= 0' failed in GtkScrollbar
15:20:08 [2020-08-24T19:20:08.145Z] 
15:20:08 [2020-08-24T19:20:08.145Z] (SWT:1598): Gtk-WARNING **: 19:20:08.075: Negative content width -6 (allocation 1, extents 4x3) while allocating gadget (node toolbar, owner GtkToolbar)
15:20:08 [2020-08-24T19:20:08.145Z] 
15:20:08 [2020-08-24T19:20:08.145Z] (SWT:1598): Gtk-CRITICAL **: 19:20:08.082: gtk_box_gadget_distribute: assertion 'size >= 0' failed in GtkScrollbar
15:20:08 [2020-08-24T19:20:08.145Z] 
15:20:08 [2020-08-24T19:20:08.145Z] !ENTRY org.eclipse.egit.ui 2 0 2020-08-24 19:20:08.093
15:20:08 [2020-08-24T19:20:08.145Z] !MESSAGE Found multiple implementations of ICommitMessageProvider2. Ignoring caret positioning for org.eclipse.egit.ui.test.stagview.CommitMessageProvidersTest$TestCommitMessageProvider.
15:20:08 [2020-08-24T19:20:08.145Z] 
15:20:08 [2020-08-24T19:20:08.145Z] (SWT:1598): Gtk-CRITICAL **: 19:20:08.093: gtk_box_gadget_distribute: assertion 'size >= 0' failed in GtkScrollbar
15:20:08 [2020-08-24T19:20:08.145Z] 
15:20:08 [2020-08-24T19:20:08.145Z] (SWT:1598): Gtk-CRITICAL **: 19:20:08.094: gtk_box_gadget_distribute: assertion 'size >= 0' failed in GtkScrollbar
15:20:08 [2020-08-24T19:20:08.145Z] 
15:20:08 [2020-08-24T19:20:08.145Z] (SWT:1598): Gtk-CRITICAL **: 19:20:08.095: gtk_box_gadget_distribute: assertion 'size >= 0' failed in GtkScrollbar
15:20:08 [2020-08-24T19:20:08.145Z] 
15:20:08 [2020-08-24T19:20:08.145Z] (SWT:1598): Gtk-CRITICAL **: 19:20:08.095: gtk_box_gadget_distribute: assertion 'size >= 0' failed in GtkScrollbar
15:20:08 [2020-08-24T19:20:08.145Z] 
15:20:08 [2020-08-24T19:20:08.145Z] (SWT:1598): Gtk-CRITICAL **: 19:20:08.101: gtk_box_gadget_distribute: assertion 'size >= 0' failed in GtkScrollbar
15:20:08 [2020-08-24T19:20:08.145Z] 
15:20:08 [2020-08-24T19:20:08.145Z] (SWT:1598): Gtk-CRITICAL **: 19:20:08.104: gtk_box_gadget_distribute: assertion 'size >= 0' failed in GtkScrollbar
15:20:08 [2020-08-24T19:20:08.145Z] 
15:20:08 [2020-08-24T19:20:08.145Z] (SWT:1598): Gtk-CRITICAL **: 19:20:08.105: gtk_box_gadget_distribute: assertion 'size >= 0' failed in GtkScrollbar
15:20:08 [2020-08-24T19:20:08.145Z] 
15:20:08 [2020-08-24T19:20:08.145Z] (SWT:1598): Gtk-CRITICAL **: 19:20:08.112: gtk_box_gadget_distribute: assertion 'size >= 0' failed in GtkScrollbar
15:20:08 [2020-08-24T19:20:08.145Z] 
15:20:08 [2020-08-24T19:20:08.145Z] (SWT:1598): Gtk-CRITICAL **: 19:20:08.120: gtk_box_gadget_distribute: assertion 'size >= 0' failed in GtkScrollbar
15:20:08 [2020-08-24T19:20:08.145Z] 
15:20:08 [2020-08-24T19:20:08.145Z] (SWT:1598): Gtk-CRITICAL **: 19:20:08.129: gtk_box_gadget_distribute: assertion 'size >= 0' failed in GtkScrollbar
15:20:08 [2020-08-24T19:20:08.145Z] 
15:20:08 [2020-08-24T19:20:08.145Z] (SWT:1598): Gtk-CRITICAL **: 19:20:08.129: gtk_box_gadget_distribute: assertion 'size >= 0' failed in GtkScrollbar
15:20:08 [2020-08-24T19:20:08.402Z] 
15:20:08 [2020-08-24T19:20:08.402Z] (SWT:1598): Gtk-CRITICAL **: 19:20:08.145: gtk_box_gadget_distribute: assertion 'size >= 0' failed in GtkScrollbar
15:20:08 [2020-08-24T19:20:08.402Z] 
15:20:08 [2020-08-24T19:20:08.402Z] (SWT:1598): Gtk-CRITICAL **: 19:20:08.145: gtk_box_gadget_distribute: assertion 'size >= 0' failed in GtkScrollbar
15:20:08 [2020-08-24T19:20:08.402Z] 
15:20:08 [2020-08-24T19:20:08.402Z] (SWT:1598): Gtk-CRITICAL **: 19:20:08.162: gtk_box_gadget_distribute: assertion 'size >= 0' failed in GtkScrollbar
15:20:08 [2020-08-24T19:20:08.402Z] 
15:20:08 [2020-08-24T19:20:08.402Z] (SWT:1598): Gtk-CRITICAL **: 19:20:08.162: gtk_box_gadget_distribute: assertion 'size >= 0' failed in GtkScrollbar
15:20:08 [2020-08-24T19:20:08.402Z] 
15:20:08 [2020-08-24T19:20:08.402Z] (SWT:1598): Gtk-CRITICAL **: 19:20:08.179: gtk_box_gadget_distribute: assertion 'size >= 0' failed in GtkScrollbar
15:20:08 [2020-08-24T19:20:08.402Z] 
15:20:08 [2020-08-24T19:20:08.402Z] (SWT:1598): Gtk-CRITICAL **: 19:20:08.179: gtk_box_gadget_distribute: assertion 'size >= 0' failed in GtkScrollbar
15:20:08 [2020-08-24T19:20:08.402Z] 
15:20:08 [2020-08-24T19:20:08.402Z] (SWT:1598): Gtk-CRITICAL **: 19:20:08.195: gtk_box_gadget_distribute: assertion 'size >= 0' failed in GtkScrollbar
15:20:08 [2020-08-24T19:20:08.402Z] 
15:20:08 [2020-08-24T19:20:08.402Z] (SWT:1598): Gtk-CRITICAL **: 19:20:08.195: gtk_box_gadget_distribute: assertion 'size >= 0' failed in GtkScrollbar
15:20:08 [2020-08-24T19:20:08.402Z] 
15:20:08 [2020-08-24T19:20:08.402Z] (SWT:1598): Gtk-CRITICAL **: 19:20:08.212: gtk_box_gadget_distribute: assertion 'size >= 0' failed in GtkScrollbar
15:20:08 [2020-08-24T19:20:08.402Z] 
15:20:08 [2020-08-24T19:20:08.402Z] (SWT:1598): Gtk-CRITICAL **: 19:20:08.212: gtk_box_gadget_distribute: assertion 'size >= 0' failed in GtkScrollbar
15:20:08 [2020-08-24T19:20:08.402Z] 
15:20:08 [2020-08-24T19:20:08.402Z] (SWT:1598): Gtk-CRITICAL **: 19:20:08.240: gtk_box_gadget_distribute: assertion 'size >= 0' failed in GtkScrollbar
15:20:08 [2020-08-24T19:20:08.402Z] 
15:20:08 [2020-08-24T19:20:08.402Z] (SWT:1598): Gtk-CRITICAL **: 19:20:08.240: gtk_box_gadget_distribute: assertion 'size >= 0' failed in GtkScrollbar
15:20:08 [2020-08-24T19:20:08.402Z] 
15:20:08 [2020-08-24T19:20:08.402Z] (SWT:1598): Gtk-CRITICAL **: 19:20:08.246: gtk_box_gadget_distribute: assertion 'size >= 0' failed in GtkScrollbar
15:20:08 [2020-08-24T19:20:08.402Z] 
15:20:08 [2020-08-24T19:20:08.402Z] (SWT:1598): Gtk-CRITICAL **: 19:20:08.246: gtk_box_gadget_distribute: assertion 'size >= 0' failed in GtkScrollbar
15:20:08 [2020-08-24T19:20:08.402Z] 
15:20:08 [2020-08-24T19:20:08.402Z] (SWT:1598): Gtk-CRITICAL **: 19:20:08.255: gtk_box_gadget_distribute: assertion 'size >= 0' failed in GtkScrollbar
15:20:08 [2020-08-24T19:20:08.402Z] 
15:20:08 [2020-08-24T19:20:08.402Z] (SWT:1598): Gtk-CRITICAL **: 19:20:08.260: gtk_box_gadget_distribute: assertion 'size >= 0' failed in GtkScrollbar
15:20:08 [2020-08-24T19:20:08.402Z] 
15:20:08 [2020-08-24T19:20:08.402Z] (SWT:1598): Gtk-CRITICAL **: 19:20:08.263: gtk_box_gadget_distribute: assertion 'size >= 0' failed in GtkScrollbar
15:20:08 [2020-08-24T19:20:08.402Z] 
15:20:08 [2020-08-24T19:20:08.402Z] (SWT:1598): Gtk-CRITICAL **: 19:20:08.263: gtk_box_gadget_distribute: assertion 'size >= 0' failed in GtkScrollbar
15:20:08 [2020-08-24T19:20:08.402Z] 
15:20:08 [2020-08-24T19:20:08.402Z] (SWT:1598): Gtk-CRITICAL **: 19:20:08.263: gtk_box_gadget_distribute: assertion 'size >= 0' failed in GtkScrollbar
15:20:08 [2020-08-24T19:20:08.402Z] 
15:20:08 [2020-08-24T19:20:08.403Z] (SWT:1598): Gtk-CRITICAL **: 19:20:08.280: gtk_box_gadget_distribute: assertion 'size >= 0' failed in GtkScrollbar
15:20:08 [2020-08-24T19:20:08.403Z] 
15:20:08 [2020-08-24T19:20:08.403Z] (SWT:1598): Gtk-CRITICAL **: 19:20:08.280: gtk_box_gadget_distribute: assertion 'size >= 0' failed in GtkScrollbar
15:20:08 [2020-08-24T19:20:08.403Z] 
15:20:08 [2020-08-24T19:20:08.403Z] (SWT:1598): Gtk-CRITICAL **: 19:20:08.280: gtk_box_gadget_distribute: assertion 'size >= 0' failed in GtkScrollbar
15:20:08 [2020-08-24T19:20:08.403Z] 
15:20:08 [2020-08-24T19:20:08.403Z] (SWT:1598): Gtk-CRITICAL **: 19:20:08.296: gtk_box_gadget_distribute: assertion 'size >= 0' failed in GtkScrollbar
15:20:08 [2020-08-24T19:20:08.403Z] 
15:20:08 [2020-08-24T19:20:08.403Z] (SWT:1598): Gtk-CRITICAL **: 19:20:08.296: gtk_box_gadget_distribute: assertion 'size >= 0' failed in GtkScrollbar
15:20:08 [2020-08-24T19:20:08.403Z] 
15:20:08 [2020-08-24T19:20:08.403Z] (SWT:1598): Gtk-CRITICAL **: 19:20:08.296: gtk_box_gadget_distribute: assertion 'size >= 0' failed in GtkScrollbar
15:20:08 [2020-08-24T19:20:08.403Z] 
15:20:08 [2020-08-24T19:20:08.403Z] (SWT:1598): Gtk-CRITICAL **: 19:20:08.312: gtk_box_gadget_distribute: assertion 'size >= 0' failed in GtkScrollbar
15:20:08 [2020-08-24T19:20:08.403Z] 
15:20:08 [2020-08-24T19:20:08.403Z] (SWT:1598): Gtk-CRITICAL **: 19:20:08.312: gtk_box_gadget_distribute: assertion 'size >= 0' failed in GtkScrollbar
15:20:08 [2020-08-24T19:20:08.403Z] 
15:20:08 [2020-08-24T19:20:08.403Z] (SWT:1598): Gtk-CRITICAL **: 19:20:08.312: gtk_box_gadget_distribute: assertion 'size >= 0' failed in GtkScrollbar
15:20:08 [2020-08-24T19:20:08.403Z] 
15:20:08 [2020-08-24T19:20:08.403Z] (SWT:1598): Gtk-CRITICAL **: 19:20:08.328: gtk_box_gadget_distribute: assertion 'size >= 0' failed in GtkScrollbar
15:20:08 [2020-08-24T19:20:08.403Z] 
15:20:08 [2020-08-24T19:20:08.403Z] (SWT:1598): Gtk-WARNING **: 19:20:08.365: Negative content width -6 (allocation 1, extents 4x3) while allocating gadget (node toolbar, owner GtkToolbar)
15:20:08 [2020-08-24T19:20:08.971Z] 
15:20:08 [2020-08-24T19:20:08.971Z] (SWT:1598): Gtk-WARNING **: 19:20:08.907: Negative content width -6 (allocation 1, extents 4x3) while allocating gadget (node toolbar, owner GtkToolbar)
15:20:08 [2020-08-24T19:20:08.971Z] 
15:20:08 [2020-08-24T19:20:08.971Z] (SWT:1598): Gtk-WARNING **: 19:20:08.917: Negative content width -6 (allocation 1, extents 4x3) while allocating gadget (node toolbar, owner GtkToolbar)
15:20:09 [2020-08-24T19:20:09.553Z] 
15:20:09 [2020-08-24T19:20:09.553Z] (SWT:1598): Gtk-WARNING **: 19:20:09.490: Negative content width -6 (allocation 1, extents 4x3) while allocating gadget (node toolbar, owner GtkToolbar)
15:20:10 [2020-08-24T19:20:10.119Z] 
15:20:10 [2020-08-24T19:20:10.119Z] (SWT:1598): Gtk-CRITICAL **: 19:20:09.942: gtk_box_gadget_distribute: assertion 'size >= 0' failed in GtkScrollbar
15:20:10 [2020-08-24T19:20:10.119Z] 
15:20:10 [2020-08-24T19:20:10.119Z] (SWT:1598): Gtk-CRITICAL **: 19:20:09.948: gtk_box_gadget_distribute: assertion 'size >= 0' failed in GtkScrollbar
15:20:10 [2020-08-24T19:20:10.119Z] 
15:20:10 [2020-08-24T19:20:10.119Z] (SWT:1598): Gtk-WARNING **: 19:20:09.952: Negative content width -6 (allocation 1, extents 4x3) while allocating gadget (node toolbar, owner GtkToolbar)
15:20:10 [2020-08-24T19:20:10.119Z] 
15:20:10 [2020-08-24T19:20:10.119Z] (SWT:1598): Gtk-CRITICAL **: 19:20:09.957: gtk_box_gadget_distribute: assertion 'size >= 0' failed in GtkScrollbar
15:20:10 [2020-08-24T19:20:10.119Z] 
15:20:10 [2020-08-24T19:20:10.119Z] (SWT:1598): Gtk-CRITICAL **: 19:20:09.962: gtk_box_gadget_distribute: assertion 'size >= 0' failed in GtkScrollbar
15:20:10 [2020-08-24T19:20:10.119Z] 
15:20:10 [2020-08-24T19:20:10.119Z] (SWT:1598): Gtk-CRITICAL **: 19:20:09.963: gtk_box_gadget_distribute: assertion 'size >= 0' failed in GtkScrollbar
15:20:10 [2020-08-24T19:20:10.119Z] 
15:20:10 [2020-08-24T19:20:10.119Z] (SWT:1598): Gtk-CRITICAL **: 19:20:09.963: gtk_box_gadget_distribute: assertion 'size >= 0' failed in GtkScrollbar
15:20:10 [2020-08-24T19:20:10.119Z] 
15:20:10 [2020-08-24T19:20:10.119Z] (SWT:1598): Gtk-CRITICAL **: 19:20:09.964: gtk_box_gadget_distribute: assertion 'size >= 0' failed in GtkScrollbar
15:20:10 [2020-08-24T19:20:10.119Z] 
15:20:10 [2020-08-24T19:20:10.119Z] (SWT:1598): Gtk-CRITICAL **: 19:20:09.969: gtk_box_gadget_distribute: assertion 'size >= 0' failed in GtkScrollbar
15:20:10 [2020-08-24T19:20:10.119Z] 
15:20:10 [2020-08-24T19:20:10.119Z] (SWT:1598): Gtk-CRITICAL **: 19:20:09.972: gtk_box_gadget_distribute: assertion 'size >= 0' failed in GtkScrollbar
15:20:10 [2020-08-24T19:20:10.119Z] 
15:20:10 [2020-08-24T19:20:10.119Z] (SWT:1598): Gtk-CRITICAL **: 19:20:09.972: gtk_box_gadget_distribute: assertion 'size >= 0' failed in GtkScrollbar
15:20:10 [2020-08-24T19:20:10.119Z] 
15:20:10 [2020-08-24T19:20:10.119Z] (SWT:1598): Gtk-CRITICAL **: 19:20:09.980: gtk_box_gadget_distribute: assertion 'size >= 0' failed in GtkScrollbar
15:20:10 [2020-08-24T19:20:10.119Z] 
15:20:10 [2020-08-24T19:20:10.119Z] (SWT:1598): Gtk-CRITICAL **: 19:20:09.985: gtk_box_gadget_distribute: assertion 'size >= 0' failed in GtkScrollbar
15:20:10 [2020-08-24T19:20:10.119Z] 
15:20:10 [2020-08-24T19:20:10.119Z] (SWT:1598): Gtk-CRITICAL **: 19:20:09.987: gtk_box_gadget_distribute: assertion 'size >= 0' failed in GtkScrollbar
15:20:10 [2020-08-24T19:20:10.119Z] 
15:20:10 [2020-08-24T19:20:10.119Z] (SWT:1598): Gtk-CRITICAL **: 19:20:09.987: gtk_box_gadget_distribute: assertion 'size >= 0' failed in GtkScrollbar
15:20:10 [2020-08-24T19:20:10.119Z] 
15:20:10 [2020-08-24T19:20:10.119Z] (SWT:1598): Gtk-CRITICAL **: 19:20:10.004: gtk_box_gadget_distribute: assertion 'size >= 0' failed in GtkScrollbar
15:20:10 [2020-08-24T19:20:10.119Z] 
15:20:10 [2020-08-24T19:20:10.119Z] (SWT:1598): Gtk-CRITICAL **: 19:20:10.004: gtk_box_gadget_distribute: assertion 'size >= 0' failed in GtkScrollbar
15:20:10 [2020-08-24T19:20:10.119Z] 
15:20:10 [2020-08-24T19:20:10.119Z] (SWT:1598): Gtk-CRITICAL **: 19:20:10.020: gtk_box_gadget_distribute: assertion 'size >= 0' failed in GtkScrollbar
15:20:10 [2020-08-24T19:20:10.119Z] 
15:20:10 [2020-08-24T19:20:10.119Z] (SWT:1598): Gtk-CRITICAL **: 19:20:10.020: gtk_box_gadget_distribute: assertion 'size >= 0' failed in GtkScrollbar
15:20:10 [2020-08-24T19:20:10.119Z] 
15:20:10 [2020-08-24T19:20:10.119Z] (SWT:1598): Gtk-CRITICAL **: 19:20:10.037: gtk_box_gadget_distribute: assertion 'size >= 0' failed in GtkScrollbar
15:20:10 [2020-08-24T19:20:10.119Z] 
15:20:10 [2020-08-24T19:20:10.119Z] (SWT:1598): Gtk-CRITICAL **: 19:20:10.037: gtk_box_gadget_distribute: assertion 'size >= 0' failed in GtkScrollbar
15:20:10 [2020-08-24T19:20:10.119Z] 
15:20:10 [2020-08-24T19:20:10.119Z] (SWT:1598): Gtk-CRITICAL **: 19:20:10.054: gtk_box_gadget_distribute: assertion 'size >= 0' failed in GtkScrollbar
15:20:10 [2020-08-24T19:20:10.119Z] 
15:20:10 [2020-08-24T19:20:10.119Z] (SWT:1598): Gtk-CRITICAL **: 19:20:10.054: gtk_box_gadget_distribute: assertion 'size >= 0' failed in GtkScrollbar
15:20:10 [2020-08-24T19:20:10.119Z] 
15:20:10 [2020-08-24T19:20:10.119Z] (SWT:1598): Gtk-CRITICAL **: 19:20:10.070: gtk_box_gadget_distribute: assertion 'size >= 0' failed in GtkScrollbar
15:20:10 [2020-08-24T19:20:10.119Z] 
15:20:10 [2020-08-24T19:20:10.119Z] (SWT:1598): Gtk-CRITICAL **: 19:20:10.070: gtk_box_gadget_distribute: assertion 'size >= 0' failed in GtkScrollbar
15:20:10 [2020-08-24T19:20:10.119Z] 
15:20:10 [2020-08-24T19:20:10.119Z] (SWT:1598): Gtk-CRITICAL **: 19:20:10.087: gtk_box_gadget_distribute: assertion 'size >= 0' failed in GtkScrollbar
15:20:10 [2020-08-24T19:20:10.119Z] 
15:20:10 [2020-08-24T19:20:10.119Z] (SWT:1598): Gtk-CRITICAL **: 19:20:10.087: gtk_box_gadget_distribute: assertion 'size >= 0' failed in GtkScrollbar
15:20:10 [2020-08-24T19:20:10.119Z] 
15:20:10 [2020-08-24T19:20:10.119Z] (SWT:1598): Gtk-CRITICAL **: 19:20:10.111: gtk_box_gadget_distribute: assertion 'size >= 0' failed in GtkScrollbar
15:20:10 [2020-08-24T19:20:10.119Z] 
15:20:10 [2020-08-24T19:20:10.119Z] (SWT:1598): Gtk-CRITICAL **: 19:20:10.111: gtk_box_gadget_distribute: assertion 'size >= 0' failed in GtkScrollbar
15:20:10 [2020-08-24T19:20:10.377Z] 
15:20:10 [2020-08-24T19:20:10.377Z] (SWT:1598): Gtk-CRITICAL **: 19:20:10.121: gtk_box_gadget_distribute: assertion 'size >= 0' failed in GtkScrollbar
15:20:10 [2020-08-24T19:20:10.377Z] 
15:20:10 [2020-08-24T19:20:10.377Z] (SWT:1598): Gtk-CRITICAL **: 19:20:10.121: gtk_box_gadget_distribute: assertion 'size >= 0' failed in GtkScrollbar
15:20:10 [2020-08-24T19:20:10.377Z] 
15:20:10 [2020-08-24T19:20:10.377Z] (SWT:1598): Gtk-CRITICAL **: 19:20:10.137: gtk_box_gadget_distribute: assertion 'size >= 0' failed in GtkScrollbar
15:20:10 [2020-08-24T19:20:10.377Z] 
15:20:10 [2020-08-24T19:20:10.377Z] (SWT:1598): Gtk-CRITICAL **: 19:20:10.137: gtk_box_gadget_distribute: assertion 'size >= 0' failed in GtkScrollbar
15:20:10 [2020-08-24T19:20:10.377Z] 
15:20:10 [2020-08-24T19:20:10.377Z] (SWT:1598): Gtk-CRITICAL **: 19:20:10.147: gtk_box_gadget_distribute: assertion 'size >= 0' failed in GtkScrollbar
15:20:10 [2020-08-24T19:20:10.377Z] 
15:20:10 [2020-08-24T19:20:10.377Z] (SWT:1598): Gtk-CRITICAL **: 19:20:10.152: gtk_box_gadget_distribute: assertion 'size >= 0' failed in GtkScrollbar
15:20:10 [2020-08-24T19:20:10.377Z] 
15:20:10 [2020-08-24T19:20:10.377Z] (SWT:1598): Gtk-CRITICAL **: 19:20:10.155: gtk_box_gadget_distribute: assertion 'size >= 0' failed in GtkScrollbar
15:20:10 [2020-08-24T19:20:10.377Z] 
15:20:10 [2020-08-24T19:20:10.377Z] (SWT:1598): Gtk-CRITICAL **: 19:20:10.155: gtk_box_gadget_distribute: assertion 'size >= 0' failed in GtkScrollbar
15:20:10 [2020-08-24T19:20:10.377Z] 
15:20:10 [2020-08-24T19:20:10.377Z] (SWT:1598): Gtk-CRITICAL **: 19:20:10.155: gtk_box_gadget_distribute: assertion 'size >= 0' failed in GtkScrollbar
15:20:10 [2020-08-24T19:20:10.377Z] 
15:20:10 [2020-08-24T19:20:10.377Z] (SWT:1598): Gtk-CRITICAL **: 19:20:10.171: gtk_box_gadget_distribute: assertion 'size >= 0' failed in GtkScrollbar
15:20:10 [2020-08-24T19:20:10.377Z] 
15:20:10 [2020-08-24T19:20:10.377Z] (SWT:1598): Gtk-CRITICAL **: 19:20:10.171: gtk_box_gadget_distribute: assertion 'size >= 0' failed in GtkScrollbar
15:20:10 [2020-08-24T19:20:10.377Z] 
15:20:10 [2020-08-24T19:20:10.377Z] (SWT:1598): Gtk-CRITICAL **: 19:20:10.171: gtk_box_gadget_distribute: assertion 'size >= 0' failed in GtkScrollbar
15:20:10 [2020-08-24T19:20:10.377Z] 
15:20:10 [2020-08-24T19:20:10.377Z] (SWT:1598): Gtk-CRITICAL **: 19:20:10.188: gtk_box_gadget_distribute: assertion 'size >= 0' failed in GtkScrollbar
15:20:10 [2020-08-24T19:20:10.377Z] 
15:20:10 [2020-08-24T19:20:10.377Z] (SWT:1598): Gtk-CRITICAL **: 19:20:10.188: gtk_box_gadget_distribute: assertion 'size >= 0' failed in GtkScrollbar
15:20:10 [2020-08-24T19:20:10.377Z] 
15:20:10 [2020-08-24T19:20:10.377Z] (SWT:1598): Gtk-CRITICAL **: 19:20:10.205: gtk_box_gadget_distribute: assertion 'size >= 0' failed in GtkScrollbar
15:20:10 [2020-08-24T19:20:10.377Z] 
15:20:10 [2020-08-24T19:20:10.377Z] (SWT:1598): Gtk-WARNING **: 19:20:10.230: Negative content width -6 (allocation 1, extents 4x3) while allocating gadget (node toolbar, owner GtkToolbar)
15:20:10 [2020-08-24T19:20:10.942Z] 
15:20:10 [2020-08-24T19:20:10.942Z] (SWT:1598): Gtk-WARNING **: 19:20:10.669: Negative content width -6 (allocation 1, extents 4x3) while allocating gadget (node toolbar, owner GtkToolbar)
15:20:10 [2020-08-24T19:20:10.942Z] 
15:20:10 [2020-08-24T19:20:10.942Z] (SWT:1598): Gtk-WARNING **: 19:20:10.679: Negative content width -6 (allocation 1, extents 4x3) while allocating gadget (node toolbar, owner GtkToolbar)
15:20:10 [2020-08-24T19:20:10.942Z] Tests run: 3, Failures: 0, Errors: 0, Skipped: 0, Time elapsed: 5.387 s - in org.eclipse.egit.ui.test.stagview.CommitMessageProvidersTest
15:20:10 [2020-08-24T19:20:10.942Z] testCaretPosition(org.eclipse.egit.ui.test.stagview.CommitMessageProvidersTest)  Time elapsed: 1.909 s
15:20:10 [2020-08-24T19:20:10.942Z] testTwoProvidersFromSameExtension(org.eclipse.egit.ui.test.stagview.CommitMessageProvidersTest)  Time elapsed: 1.71 s
15:20:10 [2020-08-24T19:20:10.942Z] testCaretPositionUndefined(org.eclipse.egit.ui.test.stagview.CommitMessageProvidersTest)  Time elapsed: 1.761 s
15:20:10 [2020-08-24T19:20:10.942Z] Running org.eclipse.egit.ui.variables.DynamicVariablesTest
15:20:15 [2020-08-24T19:20:15.120Z] Tests run: 4, Failures: 0, Errors: 0, Skipped: 0, Time elapsed: 4.301 s - in org.eclipse.egit.ui.variables.DynamicVariablesTest
15:20:15 [2020-08-24T19:20:15.120Z] testGitBranch(org.eclipse.egit.ui.variables.DynamicVariablesTest)  Time elapsed: 1.096 s
15:20:15 [2020-08-24T19:20:15.120Z] testGitPath(org.eclipse.egit.ui.variables.DynamicVariablesTest)  Time elapsed: 1.065 s
15:20:15 [2020-08-24T19:20:15.120Z] testGitWorkTree(org.eclipse.egit.ui.variables.DynamicVariablesTest)  Time elapsed: 1.071 s
15:20:15 [2020-08-24T19:20:15.120Z] testGitDir(org.eclipse.egit.ui.variables.DynamicVariablesTest)  Time elapsed: 1.068 s
15:20:15 [2020-08-24T19:20:15.120Z] Running org.eclipse.egit.ui.gitflow.FeatureFinishSquashHandlerTest
15:20:16 [2020-08-24T19:20:16.051Z] 
15:20:16 [2020-08-24T19:20:16.051Z] (SWT:1598): Gtk-CRITICAL **: 19:20:15.756: gtk_box_gadget_distribute: assertion 'size >= 0' failed in GtkScrollbar
15:20:16 [2020-08-24T19:20:16.051Z] 
15:20:16 [2020-08-24T19:20:16.051Z] (SWT:1598): Gtk-CRITICAL **: 19:20:15.775: gtk_box_gadget_distribute: assertion 'size >= 0' failed in GtkScrollbar
15:20:16 [2020-08-24T19:20:16.051Z] 
15:20:16 [2020-08-24T19:20:16.051Z] (SWT:1598): Gtk-CRITICAL **: 19:20:15.792: gtk_box_gadget_distribute: assertion 'size >= 0' failed in GtkScrollbar
15:20:16 [2020-08-24T19:20:16.051Z] 
15:20:16 [2020-08-24T19:20:16.051Z] (SWT:1598): Gtk-CRITICAL **: 19:20:15.808: gtk_box_gadget_distribute: assertion 'size >= 0' failed in GtkScrollbar
15:20:16 [2020-08-24T19:20:16.051Z] 
15:20:16 [2020-08-24T19:20:16.051Z] (SWT:1598): Gtk-CRITICAL **: 19:20:15.825: gtk_box_gadget_distribute: assertion 'size >= 0' failed in GtkScrollbar
15:20:16 [2020-08-24T19:20:16.051Z] 
15:20:16 [2020-08-24T19:20:16.051Z] (SWT:1598): Gtk-CRITICAL **: 19:20:15.842: gtk_box_gadget_distribute: assertion 'size >= 0' failed in GtkScrollbar
15:20:16 [2020-08-24T19:20:16.051Z] 
15:20:16 [2020-08-24T19:20:16.051Z] (SWT:1598): Gtk-CRITICAL **: 19:20:15.858: gtk_box_gadget_distribute: assertion 'size >= 0' failed in GtkScrollbar
15:20:16 [2020-08-24T19:20:16.051Z] 
15:20:16 [2020-08-24T19:20:16.051Z] (SWT:1598): Gtk-CRITICAL **: 19:20:15.874: gtk_box_gadget_distribute: assertion 'size >= 0' failed in GtkScrollbar
15:20:16 [2020-08-24T19:20:16.051Z] 
15:20:16 [2020-08-24T19:20:16.051Z] (SWT:1598): Gtk-CRITICAL **: 19:20:15.892: gtk_box_gadget_distribute: assertion 'size >= 0' failed in GtkScrollbar
15:20:16 [2020-08-24T19:20:16.051Z] 
15:20:16 [2020-08-24T19:20:16.051Z] (SWT:1598): Gtk-CRITICAL **: 19:20:15.908: gtk_box_gadget_distribute: assertion 'size >= 0' failed in GtkScrollbar
15:20:16 [2020-08-24T19:20:16.051Z] 
15:20:16 [2020-08-24T19:20:16.051Z] (SWT:1598): Gtk-CRITICAL **: 19:20:15.924: gtk_box_gadget_distribute: assertion 'size >= 0' failed in GtkScrollbar
15:20:16 [2020-08-24T19:20:16.051Z] 
15:20:16 [2020-08-24T19:20:16.051Z] (SWT:1598): Gtk-CRITICAL **: 19:20:15.941: gtk_box_gadget_distribute: assertion 'size >= 0' failed in GtkScrollbar
15:20:16 [2020-08-24T19:20:16.051Z] 
15:20:16 [2020-08-24T19:20:16.051Z] (SWT:1598): Gtk-CRITICAL **: 19:20:15.958: gtk_box_gadget_distribute: assertion 'size >= 0' failed in GtkScrollbar
15:20:16 [2020-08-24T19:20:16.051Z] 
15:20:16 [2020-08-24T19:20:16.051Z] (SWT:1598): Gtk-CRITICAL **: 19:20:15.974: gtk_box_gadget_distribute: assertion 'size >= 0' failed in GtkScrollbar
15:20:16 [2020-08-24T19:20:16.614Z] 
15:20:16 [2020-08-24T19:20:16.614Z] (SWT:1598): Gtk-CRITICAL **: 19:20:16.467: gtk_box_gadget_distribute: assertion 'size >= 0' failed in GtkScrollbar
15:20:17 [2020-08-24T19:20:17.544Z] Tests run: 1, Failures: 0, Errors: 0, Skipped: 0, Time elapsed: 2.072 s - in org.eclipse.egit.ui.gitflow.FeatureFinishSquashHandlerTest
15:20:17 [2020-08-24T19:20:17.544Z] testFeatureFinishSquash(org.eclipse.egit.ui.gitflow.FeatureFinishSquashHandlerTest)  Time elapsed: 2.068 s
15:20:17 [2020-08-24T19:20:17.544Z] Running org.eclipse.egit.ui.gitflow.FeatureStartFinishHandlerTest
15:20:17 [2020-08-24T19:20:17.802Z] 
15:20:17 [2020-08-24T19:20:17.802Z] (SWT:1598): Gtk-CRITICAL **: 19:20:17.760: gtk_box_gadget_distribute: assertion 'size >= 0' failed in GtkScrollbar
15:20:17 [2020-08-24T19:20:17.802Z] 
15:20:17 [2020-08-24T19:20:17.802Z] (SWT:1598): Gtk-CRITICAL **: 19:20:17.774: gtk_box_gadget_distribute: assertion 'size >= 0' failed in GtkScrollbar
15:20:17 [2020-08-24T19:20:17.802Z] 
15:20:17 [2020-08-24T19:20:17.802Z] (SWT:1598): Gtk-CRITICAL **: 19:20:17.791: gtk_box_gadget_distribute: assertion 'size >= 0' failed in GtkScrollbar
15:20:18 [2020-08-24T19:20:18.059Z] 
15:20:18 [2020-08-24T19:20:18.059Z] (SWT:1598): Gtk-CRITICAL **: 19:20:17.807: gtk_box_gadget_distribute: assertion 'size >= 0' failed in GtkScrollbar
15:20:18 [2020-08-24T19:20:18.059Z] 
15:20:18 [2020-08-24T19:20:18.059Z] (SWT:1598): Gtk-CRITICAL **: 19:20:17.825: gtk_box_gadget_distribute: assertion 'size >= 0' failed in GtkScrollbar
15:20:18 [2020-08-24T19:20:18.059Z] 
15:20:18 [2020-08-24T19:20:18.059Z] (SWT:1598): Gtk-CRITICAL **: 19:20:17.841: gtk_box_gadget_distribute: assertion 'size >= 0' failed in GtkScrollbar
15:20:18 [2020-08-24T19:20:18.059Z] 
15:20:18 [2020-08-24T19:20:18.059Z] (SWT:1598): Gtk-CRITICAL **: 19:20:17.857: gtk_box_gadget_distribute: assertion 'size >= 0' failed in GtkScrollbar
15:20:18 [2020-08-24T19:20:18.059Z] 
15:20:18 [2020-08-24T19:20:18.059Z] (SWT:1598): Gtk-CRITICAL **: 19:20:17.874: gtk_box_gadget_distribute: assertion 'size >= 0' failed in GtkScrollbar
15:20:18 [2020-08-24T19:20:18.059Z] 
15:20:18 [2020-08-24T19:20:18.059Z] (SWT:1598): Gtk-CRITICAL **: 19:20:17.891: gtk_box_gadget_distribute: assertion 'size >= 0' failed in GtkScrollbar
15:20:18 [2020-08-24T19:20:18.059Z] 
15:20:18 [2020-08-24T19:20:18.059Z] (SWT:1598): Gtk-CRITICAL **: 19:20:17.907: gtk_box_gadget_distribute: assertion 'size >= 0' failed in GtkScrollbar
15:20:18 [2020-08-24T19:20:18.059Z] 
15:20:18 [2020-08-24T19:20:18.059Z] (SWT:1598): Gtk-CRITICAL **: 19:20:17.925: gtk_box_gadget_distribute: assertion 'size >= 0' failed in GtkScrollbar
15:20:18 [2020-08-24T19:20:18.059Z] 
15:20:18 [2020-08-24T19:20:18.059Z] (SWT:1598): Gtk-CRITICAL **: 19:20:17.941: gtk_box_gadget_distribute: assertion 'size >= 0' failed in GtkScrollbar
15:20:18 [2020-08-24T19:20:18.059Z] 
15:20:18 [2020-08-24T19:20:18.059Z] (SWT:1598): Gtk-CRITICAL **: 19:20:17.957: gtk_box_gadget_distribute: assertion 'size >= 0' failed in GtkScrollbar
15:20:18 [2020-08-24T19:20:18.059Z] 
15:20:18 [2020-08-24T19:20:18.059Z] (SWT:1598): Gtk-CRITICAL **: 19:20:17.974: gtk_box_gadget_distribute: assertion 'size >= 0' failed in GtkScrollbar
15:20:18 [2020-08-24T19:20:18.059Z] 
15:20:18 [2020-08-24T19:20:18.059Z] (SWT:1598): Gtk-CRITICAL **: 19:20:17.990: gtk_box_gadget_distribute: assertion 'size >= 0' failed in GtkScrollbar
15:20:18 [2020-08-24T19:20:18.059Z] 
15:20:18 [2020-08-24T19:20:18.059Z] (SWT:1598): Gtk-CRITICAL **: 19:20:18.007: gtk_box_gadget_distribute: assertion 'size >= 0' failed in GtkScrollbar
15:20:18 [2020-08-24T19:20:18.623Z] 
15:20:18 [2020-08-24T19:20:18.623Z] (SWT:1598): Gtk-CRITICAL **: 19:20:18.520: gtk_box_gadget_distribute: assertion 'size >= 0' failed in GtkScrollbar
15:20:19 [2020-08-24T19:20:19.187Z] Tests run: 1, Failures: 0, Errors: 0, Skipped: 0, Time elapsed: 1.931 s - in org.eclipse.egit.ui.gitflow.FeatureStartFinishHandlerTest
15:20:19 [2020-08-24T19:20:19.187Z] testFeatureStart(org.eclipse.egit.ui.gitflow.FeatureStartFinishHandlerTest)  Time elapsed: 1.927 s
15:20:19 [2020-08-24T19:20:19.187Z] Running org.eclipse.egit.ui.gitflow.InitHandlerTest
15:20:22 [2020-08-24T19:20:22.517Z] Tests run: 3, Failures: 0, Errors: 0, Skipped: 0, Time elapsed: 3.326 s - in org.eclipse.egit.ui.gitflow.InitHandlerTest
15:20:22 [2020-08-24T19:20:22.517Z] testInit(org.eclipse.egit.ui.gitflow.InitHandlerTest)  Time elapsed: 0.742 s
15:20:22 [2020-08-24T19:20:22.517Z] testInitEmptyRepoMissingMaster(org.eclipse.egit.ui.gitflow.InitHandlerTest)  Time elapsed: 1.378 s
15:20:22 [2020-08-24T19:20:22.517Z] testInitMissingMaster(org.eclipse.egit.ui.gitflow.InitHandlerTest)  Time elapsed: 1.2 s
15:20:22 [2020-08-24T19:20:22.518Z] Running org.eclipse.egit.ui.gitflow.FeatureRebaseHandlerTest
15:20:23 [2020-08-24T19:20:23.449Z] 
15:20:23 [2020-08-24T19:20:23.450Z] (SWT:1598): Gtk-WARNING **: 19:20:23.185: Negative content width -6 (allocation 1, extents 4x3) while allocating gadget (node toolbar, owner GtkToolbar)
15:20:23 [2020-08-24T19:20:23.450Z] 
15:20:23 [2020-08-24T19:20:23.450Z] (SWT:1598): Gtk-WARNING **: 19:20:23.189: Negative content width -6 (allocation 1, extents 4x3) while allocating gadget (node toolbar, owner GtkToolbar)
15:20:23 [2020-08-24T19:20:23.450Z] 
15:20:23 [2020-08-24T19:20:23.450Z] (SWT:1598): Gtk-WARNING **: 19:20:23.193: Negative content width -6 (allocation 1, extents 4x3) while allocating gadget (node toolbar, owner GtkToolbar)
15:20:23 [2020-08-24T19:20:23.450Z] 
15:20:23 [2020-08-24T19:20:23.450Z] (SWT:1598): Gtk-WARNING **: 19:20:23.194: Negative content width -6 (allocation 1, extents 4x3) while allocating gadget (node toolbar, owner GtkToolbar)
15:20:23 [2020-08-24T19:20:23.450Z] 
15:20:23 [2020-08-24T19:20:23.450Z] (SWT:1598): Gtk-WARNING **: 19:20:23.194: Negative content width -6 (allocation 1, extents 4x3) while allocating gadget (node toolbar, owner GtkToolbar)
15:20:23 [2020-08-24T19:20:23.450Z] 
15:20:23 [2020-08-24T19:20:23.450Z] (SWT:1598): Gtk-WARNING **: 19:20:23.223: Negative content width -6 (allocation 1, extents 4x3) while allocating gadget (node toolbar, owner GtkToolbar)
15:20:23 [2020-08-24T19:20:23.707Z] 
15:20:23 [2020-08-24T19:20:23.707Z] (SWT:1598): Gtk-WARNING **: 19:20:23.663: Negative content height -1 (allocation 1, extents 1x1) while allocating gadget (node scrolledwindow, owner GtkScrolledWindow)
15:20:23 [2020-08-24T19:20:23.707Z] 
15:20:23 [2020-08-24T19:20:23.707Z] (SWT:1598): Gtk-CRITICAL **: 19:20:23.663: gtk_box_gadget_distribute: assertion 'size >= 0' failed in GtkScrollbar
15:20:23 [2020-08-24T19:20:23.964Z] 
15:20:23 [2020-08-24T19:20:23.964Z] (SWT:1598): Gtk-WARNING **: 19:20:23.713: Negative content width -6 (allocation 1, extents 4x3) while allocating gadget (node toolbar, owner GtkToolbar)
15:20:24 [2020-08-24T19:20:24.894Z] 
15:20:24 [2020-08-24T19:20:24.894Z] (SWT:1598): Gtk-WARNING **: 19:20:24.872: Negative content height -1 (allocation 1, extents 1x1) while allocating gadget (node scrolledwindow, owner GtkScrolledWindow)
15:20:24 [2020-08-24T19:20:24.894Z] 
15:20:24 [2020-08-24T19:20:24.894Z] (SWT:1598): Gtk-CRITICAL **: 19:20:24.872: gtk_box_gadget_distribute: assertion 'size >= 0' failed in GtkScrollbar
15:20:25 [2020-08-24T19:20:25.152Z] Tests run: 2, Failures: 0, Errors: 0, Skipped: 0, Time elapsed: 2.567 s - in org.eclipse.egit.ui.gitflow.FeatureRebaseHandlerTest
15:20:25 [2020-08-24T19:20:25.152Z] testRebaseFailOnConflict(org.eclipse.egit.ui.gitflow.FeatureRebaseHandlerTest)  Time elapsed: 1.382 s
15:20:25 [2020-08-24T19:20:25.152Z] testRebaseFailOnDirtyWorkingDirectory(org.eclipse.egit.ui.gitflow.FeatureRebaseHandlerTest)  Time elapsed: 1.177 s
15:20:25 [2020-08-24T19:20:25.152Z] Running org.eclipse.egit.ui.gitflow.FeatureStartCheckoutConflictTest
15:20:25 [2020-08-24T19:20:25.717Z] 
15:20:25 [2020-08-24T19:20:25.717Z] (SWT:1598): Gtk-CRITICAL **: 19:20:25.565: gtk_box_gadget_distribute: assertion 'size >= 0' failed in GtkScrollbar
15:20:25 [2020-08-24T19:20:25.717Z] 
15:20:25 [2020-08-24T19:20:25.717Z] (SWT:1598): Gtk-CRITICAL **: 19:20:25.574: gtk_box_gadget_distribute: assertion 'size >= 0' failed in GtkScrollbar
15:20:25 [2020-08-24T19:20:25.974Z] Tests run: 1, Failures: 0, Errors: 0, Skipped: 0, Time elapsed: 0.714 s - in org.eclipse.egit.ui.gitflow.FeatureStartCheckoutConflictTest
15:20:25 [2020-08-24T19:20:25.974Z] testFeatureStart(org.eclipse.egit.ui.gitflow.FeatureStartCheckoutConflictTest)  Time elapsed: 0.711 s
15:20:25 [2020-08-24T19:20:25.974Z] Running org.eclipse.egit.ui.gitflow.CommandEnablementTest
15:20:26 [2020-08-24T19:20:26.905Z] 
15:20:26 [2020-08-24T19:20:26.905Z] (SWT:1598): Gtk-WARNING **: 19:20:26.877: Negative content width -6 (allocation 1, extents 4x3) while allocating gadget (node toolbar, owner GtkToolbar)
15:20:27 [2020-08-24T19:20:27.162Z] 
15:20:27 [2020-08-24T19:20:27.162Z] (SWT:1598): Gtk-WARNING **: 19:20:27.146: Negative content width -6 (allocation 1, extents 4x3) while allocating gadget (node toolbar, owner GtkToolbar)
15:20:27 [2020-08-24T19:20:27.420Z] Tests run: 2, Failures: 1, Errors: 0, Skipped: 0, Time elapsed: 1.537 s <<< FAILURE! - in org.eclipse.egit.ui.gitflow.CommandEnablementTest
15:20:27 [2020-08-24T19:20:27.420Z] testPackageExplorerStartFinishEnablement(org.eclipse.egit.ui.gitflow.CommandEnablementTest)  Time elapsed: 0.682 s
15:20:27 [2020-08-24T19:20:27.420Z] testRepositoryViewStartFinishEnablement(org.eclipse.egit.ui.gitflow.CommandEnablementTest)  Time elapsed: 0.85 s  <<< FAILURE!
15:20:27 [2020-08-24T19:20:27.420Z] java.lang.AssertionError
15:20:27 [2020-08-24T19:20:27.420Z] 	at org.junit.Assert.fail(Assert.java:87)
15:20:27 [2020-08-24T19:20:27.420Z] 	at org.junit.Assert.assertTrue(Assert.java:42)
15:20:27 [2020-08-24T19:20:27.420Z] 	at org.junit.Assert.assertTrue(Assert.java:53)
15:20:27 [2020-08-24T19:20:27.420Z] 	at org.eclipse.egit.ui.gitflow.CommandEnablementTest.assertCommandEnablement(CommandEnablementTest.java:137)
15:20:27 [2020-08-24T19:20:27.420Z] 	at org.eclipse.egit.ui.gitflow.CommandEnablementTest.testCommand(CommandEnablementTest.java:105)
15:20:27 [2020-08-24T19:20:27.420Z] 	at org.eclipse.egit.ui.gitflow.CommandEnablementTest.assertAllCommandsEnabledAndExecutable(CommandEnablementTest.java:80)
15:20:27 [2020-08-24T19:20:27.420Z] 	at org.eclipse.egit.ui.gitflow.CommandEnablementTest.testRepositoryViewStartFinishEnablement(CommandEnablementTest.java:64)
15:20:27 [2020-08-24T19:20:27.420Z] 	at sun.reflect.NativeMethodAccessorImpl.invoke0(Native Method)
15:20:27 [2020-08-24T19:20:27.420Z] 	at sun.reflect.NativeMethodAccessorImpl.invoke(NativeMethodAccessorImpl.java:62)
15:20:27 [2020-08-24T19:20:27.420Z] 	at sun.reflect.DelegatingMethodAccessorImpl.invoke(DelegatingMethodAccessorImpl.java:43)
15:20:27 [2020-08-24T19:20:27.420Z] 	at java.lang.reflect.Method.invoke(Method.java:498)
15:20:27 [2020-08-24T19:20:27.420Z] 	at org.junit.runners.model.FrameworkMethod$1.runReflectiveCall(FrameworkMethod.java:59)
15:20:27 [2020-08-24T19:20:27.420Z] 	at org.junit.internal.runners.model.ReflectiveCallable.run(ReflectiveCallable.java:12)
15:20:27 [2020-08-24T19:20:27.420Z] 	at org.junit.runners.model.FrameworkMethod.invokeExplosively(FrameworkMethod.java:56)
15:20:27 [2020-08-24T19:20:27.420Z] 	at org.eclipse.swtbot.swt.finder.junit.internal.CapturingFrameworkMethod.invokeExplosively(CapturingFrameworkMethod.java:49)
15:20:27 [2020-08-24T19:20:27.420Z] 	at org.junit.internal.runners.statements.InvokeMethod.evaluate(InvokeMethod.java:17)
15:20:27 [2020-08-24T19:20:27.420Z] 	at org.junit.internal.runners.statements.RunBefores.evaluate(RunBefores.java:26)
15:20:27 [2020-08-24T19:20:27.420Z] 	at org.junit.internal.runners.statements.RunAfters.evaluate(RunAfters.java:27)
15:20:27 [2020-08-24T19:20:27.420Z] 	at org.junit.rules.TestWatcher$1.evaluate(TestWatcher.java:61)
15:20:27 [2020-08-24T19:20:27.420Z] 	at org.junit.runners.ParentRunner$3.evaluate(ParentRunner.java:306)
15:20:27 [2020-08-24T19:20:27.420Z] 	at org.junit.runners.ParentRunner.runLeaf(ParentRunner.java:366)
15:20:27 [2020-08-24T19:20:27.420Z] 	at org.eclipse.swtbot.swt.finder.junit.SWTBotJunit4ClassRunner.runChild(SWTBotJunit4ClassRunner.java:77)
15:20:27 [2020-08-24T19:20:27.420Z] 	at org.junit.runners.BlockJUnit4ClassRunner.runChild(BlockJUnit4ClassRunner.java:63)
15:20:27 [2020-08-24T19:20:27.420Z] 	at org.junit.runners.ParentRunner$4.run(ParentRunner.java:331)
15:20:27 [2020-08-24T19:20:27.420Z] 	at org.junit.runners.ParentRunner$1.schedule(ParentRunner.java:79)
15:20:27 [2020-08-24T19:20:27.420Z] 	at org.junit.runners.ParentRunner.runChildren(ParentRunner.java:329)
15:20:27 [2020-08-24T19:20:27.420Z] 	at org.junit.runners.ParentRunner.access$100(ParentRunner.java:66)
15:20:27 [2020-08-24T19:20:27.420Z] 	at org.junit.runners.ParentRunner$2.evaluate(ParentRunner.java:293)
15:20:27 [2020-08-24T19:20:27.420Z] 	at org.junit.internal.runners.statements.RunBefores.evaluate(RunBefores.java:26)
15:20:27 [2020-08-24T19:20:27.420Z] 	at org.junit.internal.runners.statements.RunAfters.evaluate(RunAfters.java:27)
15:20:27 [2020-08-24T19:20:27.420Z] 	at org.junit.runners.ParentRunner$3.evaluate(ParentRunner.java:306)
15:20:27 [2020-08-24T19:20:27.420Z] 	at org.junit.runners.ParentRunner.run(ParentRunner.java:413)
15:20:27 [2020-08-24T19:20:27.420Z] 	at org.eclipse.swtbot.swt.finder.junit.SWTBotJunit4ClassRunner.run(SWTBotJunit4ClassRunner.java:62)
15:20:27 [2020-08-24T19:20:27.420Z] 	at org.apache.maven.surefire.junit4.JUnit4Provider.execute(JUnit4Provider.java:365)
15:20:27 [2020-08-24T19:20:27.420Z] 	at org.apache.maven.surefire.junit4.JUnit4Provider.executeWithRerun(JUnit4Provider.java:273)
15:20:27 [2020-08-24T19:20:27.420Z] 	at org.apache.maven.surefire.junit4.JUnit4Provider.executeTestSet(JUnit4Provider.java:238)
15:20:27 [2020-08-24T19:20:27.420Z] 	at org.apache.maven.surefire.junit4.JUnit4Provider.invoke(JUnit4Provider.java:159)
15:20:27 [2020-08-24T19:20:27.420Z] 	at sun.reflect.NativeMethodAccessorImpl.invoke0(Native Method)
15:20:27 [2020-08-24T19:20:27.420Z] 	at sun.reflect.NativeMethodAccessorImpl.invoke(NativeMethodAccessorImpl.java:62)
15:20:27 [2020-08-24T19:20:27.420Z] 	at sun.reflect.DelegatingMethodAccessorImpl.invoke(DelegatingMethodAccessorImpl.java:43)
15:20:27 [2020-08-24T19:20:27.420Z] 	at java.lang.reflect.Method.invoke(Method.java:498)
15:20:27 [2020-08-24T19:20:27.420Z] 	at org.apache.maven.surefire.util.ReflectionUtils.invokeMethodWithArray2(ReflectionUtils.java:206)
15:20:27 [2020-08-24T19:20:27.420Z] 	at org.apache.maven.surefire.booter.ProviderFactory$ProviderProxy.invoke(ProviderFactory.java:161)
15:20:27 [2020-08-24T19:20:27.420Z] 	at org.apache.maven.surefire.booter.ProviderFactory.invokeProvider(ProviderFactory.java:84)
15:20:27 [2020-08-24T19:20:27.420Z] 	at org.eclipse.tycho.surefire.osgibooter.OsgiSurefireBooter.run(OsgiSurefireBooter.java:113)
15:20:27 [2020-08-24T19:20:27.420Z] 	at org.eclipse.tycho.surefire.osgibooter.AbstractUITestApplication.runTests(AbstractUITestApplication.java:44)
15:20:27 [2020-08-24T19:20:27.420Z] 	at org.eclipse.e4.ui.internal.workbench.swt.E4Testable$1.run(E4Testable.java:73)
15:20:27 [2020-08-24T19:20:27.420Z] 	at java.lang.Thread.run(Thread.java:748)
15:20:27 [2020-08-24T19:20:27.420Z] 
15:20:27 [2020-08-24T19:20:27.420Z] Running org.eclipse.egit.ui.gitflow.FeatureFinishKeepBranchHandlerTest
15:20:28 [2020-08-24T19:20:28.351Z] 
15:20:28 [2020-08-24T19:20:28.351Z] (SWT:1598): Gtk-CRITICAL **: 19:20:28.245: gtk_box_gadget_distribute: assertion 'size >= 0' failed in GtkScrollbar
15:20:28 [2020-08-24T19:20:28.351Z] 
15:20:28 [2020-08-24T19:20:28.351Z] (SWT:1598): Gtk-CRITICAL **: 19:20:28.260: gtk_box_gadget_distribute: assertion 'size >= 0' failed in GtkScrollbar
15:20:28 [2020-08-24T19:20:28.351Z] 
15:20:28 [2020-08-24T19:20:28.351Z] (SWT:1598): Gtk-CRITICAL **: 19:20:28.276: gtk_box_gadget_distribute: assertion 'size >= 0' failed in GtkScrollbar
15:20:28 [2020-08-24T19:20:28.351Z] 
15:20:28 [2020-08-24T19:20:28.351Z] (SWT:1598): Gtk-CRITICAL **: 19:20:28.293: gtk_box_gadget_distribute: assertion 'size >= 0' failed in GtkScrollbar
15:20:28 [2020-08-24T19:20:28.351Z] 
15:20:28 [2020-08-24T19:20:28.351Z] (SWT:1598): Gtk-CRITICAL **: 19:20:28.310: gtk_box_gadget_distribute: assertion 'size >= 0' failed in GtkScrollbar
15:20:28 [2020-08-24T19:20:28.351Z] 
15:20:28 [2020-08-24T19:20:28.351Z] (SWT:1598): Gtk-CRITICAL **: 19:20:28.327: gtk_box_gadget_distribute: assertion 'size >= 0' failed in GtkScrollbar
15:20:28 [2020-08-24T19:20:28.351Z] 
15:20:28 [2020-08-24T19:20:28.351Z] (SWT:1598): Gtk-CRITICAL **: 19:20:28.344: gtk_box_gadget_distribute: assertion 'size >= 0' failed in GtkScrollbar
15:20:28 [2020-08-24T19:20:28.608Z] 
15:20:28 [2020-08-24T19:20:28.608Z] (SWT:1598): Gtk-CRITICAL **: 19:20:28.360: gtk_box_gadget_distribute: assertion 'size >= 0' failed in GtkScrollbar
15:20:28 [2020-08-24T19:20:28.608Z] 
15:20:28 [2020-08-24T19:20:28.608Z] (SWT:1598): Gtk-CRITICAL **: 19:20:28.376: gtk_box_gadget_distribute: assertion 'size >= 0' failed in GtkScrollbar
15:20:28 [2020-08-24T19:20:28.608Z] 
15:20:28 [2020-08-24T19:20:28.608Z] (SWT:1598): Gtk-CRITICAL **: 19:20:28.394: gtk_box_gadget_distribute: assertion 'size >= 0' failed in GtkScrollbar
15:20:28 [2020-08-24T19:20:28.608Z] 
15:20:28 [2020-08-24T19:20:28.608Z] (SWT:1598): Gtk-CRITICAL **: 19:20:28.410: gtk_box_gadget_distribute: assertion 'size >= 0' failed in GtkScrollbar
15:20:28 [2020-08-24T19:20:28.608Z] 
15:20:28 [2020-08-24T19:20:28.608Z] (SWT:1598): Gtk-CRITICAL **: 19:20:28.426: gtk_box_gadget_distribute: assertion 'size >= 0' failed in GtkScrollbar
15:20:28 [2020-08-24T19:20:28.609Z] 
15:20:28 [2020-08-24T19:20:28.609Z] (SWT:1598): Gtk-CRITICAL **: 19:20:28.443: gtk_box_gadget_distribute: assertion 'size >= 0' failed in GtkScrollbar
15:20:28 [2020-08-24T19:20:28.609Z] 
15:20:28 [2020-08-24T19:20:28.609Z] (SWT:1598): Gtk-CRITICAL **: 19:20:28.460: gtk_box_gadget_distribute: assertion 'size >= 0' failed in GtkScrollbar
15:20:29 [2020-08-24T19:20:29.174Z] 
15:20:29 [2020-08-24T19:20:29.174Z] (SWT:1598): Gtk-CRITICAL **: 19:20:29.005: gtk_box_gadget_distribute: assertion 'size >= 0' failed in GtkScrollbar
15:20:29 [2020-08-24T19:20:29.738Z] Tests run: 1, Failures: 0, Errors: 0, Skipped: 0, Time elapsed: 2.325 s - in org.eclipse.egit.ui.gitflow.FeatureFinishKeepBranchHandlerTest
15:20:29 [2020-08-24T19:20:29.738Z] testFeatureFinishKeepBranch(org.eclipse.egit.ui.gitflow.FeatureFinishKeepBranchHandlerTest)  Time elapsed: 2.322 s
15:20:29 [2020-08-24T19:20:29.738Z] Running org.eclipse.egit.ui.wizards.share.SharingWizardTest
15:20:29 [2020-08-24T19:20:29.738Z] 
15:20:29 [2020-08-24T19:20:29.738Z] (SWT:1598): Gtk-CRITICAL **: 19:20:29.614: gtk_box_gadget_distribute: assertion 'size >= 0' failed in GtkScrollbar
15:20:29 [2020-08-24T19:20:29.738Z] 
15:20:29 [2020-08-24T19:20:29.738Z] (SWT:1598): Gtk-WARNING **: 19:20:29.614: Negative content width -13 (allocation 5, extents 9x9) while allocating gadget (node entry, owner GtkEntry)
15:20:29 [2020-08-24T19:20:29.738Z] 
15:20:29 [2020-08-24T19:20:29.738Z] (SWT:1598): Gtk-WARNING **: 19:20:29.615: Negative content height -1 (allocation 1, extents 1x1) while allocating gadget (node scrolledwindow, owner GtkScrolledWindow)
15:20:29 [2020-08-24T19:20:29.738Z] 
15:20:29 [2020-08-24T19:20:29.738Z] (SWT:1598): Gtk-CRITICAL **: 19:20:29.615: gtk_box_gadget_distribute: assertion 'size >= 0' failed in GtkScrollbar
15:20:29 [2020-08-24T19:20:29.738Z] 
15:20:29 [2020-08-24T19:20:29.738Z] (SWT:1598): Gtk-CRITICAL **: 19:20:29.615: gtk_box_gadget_distribute: assertion 'size >= 0' failed in GtkScrollbar
15:20:30 [2020-08-24T19:20:30.303Z] 
15:20:30 [2020-08-24T19:20:30.303Z] (SWT:1598): Gtk-CRITICAL **: 19:20:30.234: gtk_box_gadget_distribute: assertion 'size >= 0' failed in GtkScrollbar
15:20:30 [2020-08-24T19:20:30.303Z] 
15:20:30 [2020-08-24T19:20:30.303Z] (SWT:1598): Gtk-WARNING **: 19:20:30.235: Negative content width -13 (allocation 5, extents 9x9) while allocating gadget (node entry, owner GtkEntry)
15:20:30 [2020-08-24T19:20:30.303Z] 
15:20:30 [2020-08-24T19:20:30.303Z] (SWT:1598): Gtk-WARNING **: 19:20:30.235: Negative content height -1 (allocation 1, extents 1x1) while allocating gadget (node scrolledwindow, owner GtkScrolledWindow)
15:20:30 [2020-08-24T19:20:30.303Z] 
15:20:30 [2020-08-24T19:20:30.303Z] (SWT:1598): Gtk-CRITICAL **: 19:20:30.235: gtk_box_gadget_distribute: assertion 'size >= 0' failed in GtkScrollbar
15:20:30 [2020-08-24T19:20:30.303Z] 
15:20:30 [2020-08-24T19:20:30.303Z] (SWT:1598): Gtk-CRITICAL **: 19:20:30.235: gtk_box_gadget_distribute: assertion 'size >= 0' failed in GtkScrollbar
15:20:30 [2020-08-24T19:20:30.869Z] 
15:20:30 [2020-08-24T19:20:30.869Z] (SWT:1598): Gtk-CRITICAL **: 19:20:30.820: gtk_box_gadget_distribute: assertion 'size >= 0' failed in GtkScrollbar
15:20:30 [2020-08-24T19:20:30.869Z] 
15:20:30 [2020-08-24T19:20:30.869Z] (SWT:1598): Gtk-WARNING **: 19:20:30.820: Negative content width -13 (allocation 5, extents 9x9) while allocating gadget (node entry, owner GtkEntry)
15:20:30 [2020-08-24T19:20:30.869Z] 
15:20:30 [2020-08-24T19:20:30.869Z] (SWT:1598): Gtk-WARNING **: 19:20:30.821: Negative content height -1 (allocation 1, extents 1x1) while allocating gadget (node scrolledwindow, owner GtkScrolledWindow)
15:20:30 [2020-08-24T19:20:30.869Z] 
15:20:30 [2020-08-24T19:20:30.869Z] (SWT:1598): Gtk-CRITICAL **: 19:20:30.821: gtk_box_gadget_distribute: assertion 'size >= 0' failed in GtkScrollbar
15:20:30 [2020-08-24T19:20:30.869Z] 
15:20:30 [2020-08-24T19:20:30.869Z] (SWT:1598): Gtk-CRITICAL **: 19:20:30.821: gtk_box_gadget_distribute: assertion 'size >= 0' failed in GtkScrollbar
15:20:31 [2020-08-24T19:20:31.435Z] 
15:20:31 [2020-08-24T19:20:31.435Z] (SWT:1598): Gtk-CRITICAL **: 19:20:31.403: gtk_box_gadget_distribute: assertion 'size >= 0' failed in GtkScrollbar
15:20:31 [2020-08-24T19:20:31.435Z] 
15:20:31 [2020-08-24T19:20:31.435Z] (SWT:1598): Gtk-WARNING **: 19:20:31.403: Negative content width -13 (allocation 5, extents 9x9) while allocating gadget (node entry, owner GtkEntry)
15:20:31 [2020-08-24T19:20:31.435Z] 
15:20:31 [2020-08-24T19:20:31.435Z] (SWT:1598): Gtk-WARNING **: 19:20:31.403: Negative content height -1 (allocation 1, extents 1x1) while allocating gadget (node scrolledwindow, owner GtkScrolledWindow)
15:20:31 [2020-08-24T19:20:31.435Z] 
15:20:31 [2020-08-24T19:20:31.435Z] (SWT:1598): Gtk-CRITICAL **: 19:20:31.404: gtk_box_gadget_distribute: assertion 'size >= 0' failed in GtkScrollbar
15:20:31 [2020-08-24T19:20:31.435Z] 
15:20:31 [2020-08-24T19:20:31.435Z] (SWT:1598): Gtk-CRITICAL **: 19:20:31.404: gtk_box_gadget_distribute: assertion 'size >= 0' failed in GtkScrollbar
15:20:32 [2020-08-24T19:20:32.855Z] 
15:20:32 [2020-08-24T19:20:32.855Z] (SWT:1598): Gtk-CRITICAL **: 19:20:32.799: gtk_box_gadget_distribute: assertion 'size >= 0' failed in GtkScrollbar
15:20:32 [2020-08-24T19:20:32.855Z] 
15:20:32 [2020-08-24T19:20:32.855Z] (SWT:1598): Gtk-WARNING **: 19:20:32.800: Negative content width -13 (allocation 5, extents 9x9) while allocating gadget (node entry, owner GtkEntry)
15:20:32 [2020-08-24T19:20:32.855Z] 
15:20:32 [2020-08-24T19:20:32.855Z] (SWT:1598): Gtk-WARNING **: 19:20:32.800: Negative content height -1 (allocation 1, extents 1x1) while allocating gadget (node scrolledwindow, owner GtkScrolledWindow)
15:20:32 [2020-08-24T19:20:32.855Z] 
15:20:32 [2020-08-24T19:20:32.855Z] (SWT:1598): Gtk-CRITICAL **: 19:20:32.800: gtk_box_gadget_distribute: assertion 'size >= 0' failed in GtkScrollbar
15:20:32 [2020-08-24T19:20:32.855Z] 
15:20:32 [2020-08-24T19:20:32.855Z] (SWT:1598): Gtk-CRITICAL **: 19:20:32.800: gtk_box_gadget_distribute: assertion 'size >= 0' failed in GtkScrollbar
15:20:33 [2020-08-24T19:20:33.112Z] 
15:20:33 [2020-08-24T19:20:33.112Z] (SWT:1598): Gtk-CRITICAL **: 19:20:32.927: gtk_box_gadget_distribute: assertion 'size >= 0' failed in GtkScrollbar
15:20:33 [2020-08-24T19:20:33.112Z] 
15:20:33 [2020-08-24T19:20:33.112Z] (SWT:1598): Gtk-WARNING **: 19:20:32.928: Negative content width -13 (allocation 5, extents 9x9) while allocating gadget (node entry, owner GtkEntry)
15:20:33 [2020-08-24T19:20:33.112Z] 
15:20:33 [2020-08-24T19:20:33.112Z] (SWT:1598): Gtk-WARNING **: 19:20:32.928: Negative content height -1 (allocation 1, extents 1x1) while allocating gadget (node scrolledwindow, owner GtkScrolledWindow)
15:20:33 [2020-08-24T19:20:33.112Z] 
15:20:33 [2020-08-24T19:20:33.112Z] (SWT:1598): Gtk-CRITICAL **: 19:20:32.928: gtk_box_gadget_distribute: assertion 'size >= 0' failed in GtkScrollbar
15:20:33 [2020-08-24T19:20:33.112Z] 
15:20:33 [2020-08-24T19:20:33.112Z] (SWT:1598): Gtk-CRITICAL **: 19:20:32.928: gtk_box_gadget_distribute: assertion 'size >= 0' failed in GtkScrollbar
15:20:33 [2020-08-24T19:20:33.676Z] 
15:20:33 [2020-08-24T19:20:33.676Z] (SWT:1598): Gtk-CRITICAL **: 19:20:33.509: gtk_box_gadget_distribute: assertion 'size >= 0' failed in GtkScrollbar
15:20:33 [2020-08-24T19:20:33.676Z] 
15:20:33 [2020-08-24T19:20:33.676Z] (SWT:1598): Gtk-WARNING **: 19:20:33.510: Negative content width -13 (allocation 5, extents 9x9) while allocating gadget (node entry, owner GtkEntry)
15:20:33 [2020-08-24T19:20:33.676Z] 
15:20:33 [2020-08-24T19:20:33.677Z] (SWT:1598): Gtk-WARNING **: 19:20:33.510: Negative content height -1 (allocation 1, extents 1x1) while allocating gadget (node scrolledwindow, owner GtkScrolledWindow)
15:20:33 [2020-08-24T19:20:33.677Z] 
15:20:33 [2020-08-24T19:20:33.677Z] (SWT:1598): Gtk-CRITICAL **: 19:20:33.510: gtk_box_gadget_distribute: assertion 'size >= 0' failed in GtkScrollbar
15:20:33 [2020-08-24T19:20:33.677Z] 
15:20:33 [2020-08-24T19:20:33.677Z] (SWT:1598): Gtk-CRITICAL **: 19:20:33.510: gtk_box_gadget_distribute: assertion 'size >= 0' failed in GtkScrollbar
15:20:34 [2020-08-24T19:20:34.609Z] 
15:20:34 [2020-08-24T19:20:34.609Z] (SWT:1598): Gtk-CRITICAL **: 19:20:34.419: gtk_box_gadget_distribute: assertion 'size >= 0' failed in GtkScrollbar
15:20:34 [2020-08-24T19:20:34.609Z] 
15:20:34 [2020-08-24T19:20:34.609Z] (SWT:1598): Gtk-WARNING **: 19:20:34.420: Negative content width -13 (allocation 5, extents 9x9) while allocating gadget (node entry, owner GtkEntry)
15:20:34 [2020-08-24T19:20:34.609Z] 
15:20:34 [2020-08-24T19:20:34.609Z] (SWT:1598): Gtk-WARNING **: 19:20:34.420: Negative content height -1 (allocation 1, extents 1x1) while allocating gadget (node scrolledwindow, owner GtkScrolledWindow)
15:20:34 [2020-08-24T19:20:34.609Z] 
15:20:34 [2020-08-24T19:20:34.609Z] (SWT:1598): Gtk-CRITICAL **: 19:20:34.420: gtk_box_gadget_distribute: assertion 'size >= 0' failed in GtkScrollbar
15:20:34 [2020-08-24T19:20:34.609Z] 
15:20:34 [2020-08-24T19:20:34.609Z] (SWT:1598): Gtk-CRITICAL **: 19:20:34.420: gtk_box_gadget_distribute: assertion 'size >= 0' failed in GtkScrollbar
15:20:35 [2020-08-24T19:20:35.542Z] Tests run: 3, Failures: 0, Errors: 0, Skipped: 0, Time elapsed: 5.699 s - in org.eclipse.egit.ui.wizards.share.SharingWizardTest
15:20:35 [2020-08-24T19:20:35.542Z] shareProjectWithExternalRepo(org.eclipse.egit.ui.wizards.share.SharingWizardTest)  Time elapsed: 3.189 s
15:20:35 [2020-08-24T19:20:35.542Z] shareProjectWithAlreadyCreatedRepos(org.eclipse.egit.ui.wizards.share.SharingWizardTest)  Time elapsed: 1.622 s
15:20:35 [2020-08-24T19:20:35.542Z] shareProjectAndCreateRepo(org.eclipse.egit.ui.wizards.share.SharingWizardTest)  Time elapsed: 0.885 s
15:20:35 [2020-08-24T19:20:35.542Z] Running org.eclipse.egit.ui.wizards.clone.GitCloneSourceProviderExtensionTest
15:20:35 [2020-08-24T19:20:35.542Z] Tests run: 1, Failures: 0, Errors: 0, Skipped: 0, Time elapsed: 0.001 s - in org.eclipse.egit.ui.wizards.clone.GitCloneSourceProviderExtensionTest
15:20:35 [2020-08-24T19:20:35.542Z] testGetRepositoryImports(org.eclipse.egit.ui.wizards.clone.GitCloneSourceProviderExtensionTest)  Time elapsed: 0.001 s
15:20:35 [2020-08-24T19:20:35.542Z] Running org.eclipse.egit.ui.wizards.clone.GitCloneWizardHttpTest
15:20:35 [2020-08-24T19:20:35.800Z] 2020-08-24 19:20:35.637:INFO::WorkbenchTestable: Logging initialized @701525ms to org.eclipse.jetty.util.log.StdErrLog
15:20:35 [2020-08-24T19:20:35.800Z] 2020-08-24 19:20:35.725:INFO:oejs.Server:WorkbenchTestable: jetty-9.4.30.v20200611; built: 2020-06-16T05:54:33.713Z; git: 271836e4c1f4612f12b7bb13ef5a92a927634b0d; jvm 1.8.0_262-b10
15:20:35 [2020-08-24T19:20:35.800Z] 2020-08-24 19:20:35.766:INFO:oejsh.ContextHandler:WorkbenchTestable: Started o.e.j.s.ServletContextHandler@523c88cd{/sbasic,null,AVAILABLE}
15:20:36 [2020-08-24T19:20:36.058Z] 2020-08-24 19:20:35.828:INFO:oejs.AbstractConnector:WorkbenchTestable: Started ServerConnector@1a060183{HTTP/1.1, (http/1.1)}{127.0.0.1:45656}
15:20:36 [2020-08-24T19:20:36.058Z] 2020-08-24 19:20:35.829:INFO:oejs.Server:WorkbenchTestable: Started @701717ms
15:20:37 [2020-08-24T19:20:37.955Z] 2020-08-24 19:20:37.921:INFO:oejs.AbstractConnector:WorkbenchTestable: Stopped ServerConnector@1a060183{HTTP/1.1, (http/1.1)}{127.0.0.1:0}
15:20:37 [2020-08-24T19:20:37.955Z] 2020-08-24 19:20:37.928:INFO:oejsh.ContextHandler:WorkbenchTestable: Stopped o.e.j.s.ServletContextHandler@523c88cd{/sbasic,null,UNAVAILABLE}
15:20:38 [2020-08-24T19:20:38.212Z] Tests run: 1, Failures: 0, Errors: 0, Skipped: 0, Time elapsed: 2.649 s - in org.eclipse.egit.ui.wizards.clone.GitCloneWizardHttpTest
15:20:38 [2020-08-24T19:20:38.212Z] canCloneARemoteRepo(org.eclipse.egit.ui.wizards.clone.GitCloneWizardHttpTest)  Time elapsed: 2.089 s
15:20:38 [2020-08-24T19:20:38.212Z] Running org.eclipse.egit.ui.wizards.clone.GitCloneWizardHttpsTest
15:20:38 [2020-08-24T19:20:38.781Z] 2020-08-24 19:20:38.591:INFO:oejs.Server:WorkbenchTestable: jetty-9.4.30.v20200611; built: 2020-06-16T05:54:33.713Z; git: 271836e4c1f4612f12b7bb13ef5a92a927634b0d; jvm 1.8.0_262-b10
15:20:38 [2020-08-24T19:20:38.781Z] 2020-08-24 19:20:38.592:INFO:oejsh.ContextHandler:WorkbenchTestable: Started o.e.j.s.ServletContextHandler@3c3c759b{/sbasic,null,AVAILABLE}
15:20:38 [2020-08-24T19:20:38.781Z] 2020-08-24 19:20:38.597:INFO:oejs.AbstractConnector:WorkbenchTestable: Started ServerConnector@5063c703{HTTP/1.1, (http/1.1)}{127.0.0.1:35082}
15:20:38 [2020-08-24T19:20:38.781Z] 2020-08-24 19:20:38.600:INFO:oejus.SslContextFactory:WorkbenchTestable: x509=X509@a5ffdea(centos-7-q07f2,h=[],w=[]) for Client@425debb6[provider=null,keyStore=file:///tmp/jks1482624994897922560/keystore.jks,trustStore=file:///tmp/jks1482624994897922560/keystore.jks]
15:20:38 [2020-08-24T19:20:38.781Z] 2020-08-24 19:20:38.621:WARN:oejusS.config:WorkbenchTestable: Trusting all certificates configured for Client@425debb6[provider=null,keyStore=file:///tmp/jks1482624994897922560/keystore.jks,trustStore=file:///tmp/jks1482624994897922560/keystore.jks]
15:20:38 [2020-08-24T19:20:38.781Z] 2020-08-24 19:20:38.621:WARN:oejusS.config:WorkbenchTestable: No Client EndPointIdentificationAlgorithm configured for Client@425debb6[provider=null,keyStore=file:///tmp/jks1482624994897922560/keystore.jks,trustStore=file:///tmp/jks1482624994897922560/keystore.jks]
15:20:38 [2020-08-24T19:20:38.781Z] 2020-08-24 19:20:38.628:INFO:oejs.AbstractConnector:WorkbenchTestable: Started ServerConnector@41dacd6f{SSL, (ssl, http/1.1)}{127.0.0.1:42305}
15:20:38 [2020-08-24T19:20:38.781Z] 2020-08-24 19:20:38.628:INFO:oejs.Server:WorkbenchTestable: Started @704516ms
15:20:41 [2020-08-24T19:20:41.304Z] 2020-08-24 19:20:41.180:INFO:oejs.AbstractConnector:WorkbenchTestable: Stopped ServerConnector@5063c703{HTTP/1.1, (http/1.1)}{127.0.0.1:0}
15:20:41 [2020-08-24T19:20:41.304Z] 2020-08-24 19:20:41.181:INFO:oejs.AbstractConnector:WorkbenchTestable: Stopped ServerConnector@41dacd6f{SSL, (ssl, http/1.1)}{127.0.0.1:0}
15:20:41 [2020-08-24T19:20:41.304Z] 2020-08-24 19:20:41.182:INFO:oejsh.ContextHandler:WorkbenchTestable: Stopped o.e.j.s.ServletContextHandler@3c3c759b{/sbasic,null,UNAVAILABLE}
15:20:41 [2020-08-24T19:20:41.304Z] Tests run: 1, Failures: 0, Errors: 0, Skipped: 0, Time elapsed: 3.242 s - in org.eclipse.egit.ui.wizards.clone.GitCloneWizardHttpsTest
15:20:41 [2020-08-24T19:20:41.304Z] canCloneARemoteRepo(org.eclipse.egit.ui.wizards.clone.GitCloneWizardHttpsTest)  Time elapsed: 2.552 s
15:20:41 [2020-08-24T19:20:41.305Z] Running org.eclipse.egit.ui.wizards.clone.GitCloneWizardTest
15:20:47 [2020-08-24T19:20:47.858Z] Tests run: 10, Failures: 0, Errors: 0, Skipped: 2, Time elapsed: 5.691 s - in org.eclipse.egit.ui.wizards.clone.GitCloneWizardTest
15:20:47 [2020-08-24T19:20:47.858Z] canCloneARemoteRepo(org.eclipse.egit.ui.wizards.clone.GitCloneWizardTest)  Time elapsed: 0.917 s
15:20:47 [2020-08-24T19:20:47.858Z] invalidPortFreezesDialog(org.eclipse.egit.ui.wizards.clone.GitCloneWizardTest) skipped
15:20:47 [2020-08-24T19:20:47.858Z] updatesParameterFieldsInImportDialogWhenURIIsUpdated(org.eclipse.egit.ui.wizards.clone.GitCloneWizardTest)  Time elapsed: 0.723 s
15:20:47 [2020-08-24T19:20:47.858Z] clonedRepositoryShouldExistOnFileSystem(org.eclipse.egit.ui.wizards.clone.GitCloneWizardTest)  Time elapsed: 0.895 s
15:20:47 [2020-08-24T19:20:47.858Z] alteringSomeParametersDuringClone(org.eclipse.egit.ui.wizards.clone.GitCloneWizardTest)  Time elapsed: 0.854 s
15:20:47 [2020-08-24T19:20:47.858Z] gitStyleUriSelectsSshProtocol(org.eclipse.egit.ui.wizards.clone.GitCloneWizardTest)  Time elapsed: 0.239 s
15:20:47 [2020-08-24T19:20:47.858Z] invalidHostnameFreezesDialog(org.eclipse.egit.ui.wizards.clone.GitCloneWizardTest) skipped
15:20:47 [2020-08-24T19:20:47.858Z] acceptCloneCommandAsURI(org.eclipse.egit.ui.wizards.clone.GitCloneWizardTest)  Time elapsed: 0.267 s
15:20:47 [2020-08-24T19:20:47.858Z] cloneWithTagOption(org.eclipse.egit.ui.wizards.clone.GitCloneWizardTest)  Time elapsed: 1.348 s
15:20:47 [2020-08-24T19:20:47.858Z] testFileURIWithSpace(org.eclipse.egit.ui.wizards.clone.GitCloneWizardTest)  Time elapsed: 0.241 s
15:20:47 [2020-08-24T19:20:47.858Z] Running org.eclipse.egit.ui.wizards.pull.PullWizardTest
15:20:47 [2020-08-24T19:20:47.858Z] 
15:20:47 [2020-08-24T19:20:47.858Z] (SWT:1598): Gtk-WARNING **: 19:20:47.541: Negative content width -6 (allocation 1, extents 4x3) while allocating gadget (node toolbar, owner GtkToolbar)
15:20:49 [2020-08-24T19:20:49.226Z] 
15:20:49 [2020-08-24T19:20:49.226Z] (SWT:1598): Gtk-WARNING **: 19:20:48.900: Negative content width -6 (allocation 1, extents 4x3) while allocating gadget (node toolbar, owner GtkToolbar)
15:20:49 [2020-08-24T19:20:49.226Z] Tests run: 1, Failures: 0, Errors: 0, Skipped: 0, Time elapsed: 2.12 s - in org.eclipse.egit.ui.wizards.pull.PullWizardTest
15:20:49 [2020-08-24T19:20:49.226Z] pullFromProjectRepo(org.eclipse.egit.ui.wizards.pull.PullWizardTest)  Time elapsed: 2.117 s
15:20:49 [2020-08-24T19:20:49.226Z] Running org.eclipse.egit.ui.search.CommitSearchQueryTest
15:20:53 [2020-08-24T19:20:53.404Z] Tests run: 7, Failures: 0, Errors: 0, Skipped: 0, Time elapsed: 4.074 s - in org.eclipse.egit.ui.search.CommitSearchQueryTest
15:20:53 [2020-08-24T19:20:53.404Z] testQuery(org.eclipse.egit.ui.search.CommitSearchQueryTest)  Time elapsed: 0.546 s
15:20:53 [2020-08-24T19:20:53.404Z] testMatchMessage(org.eclipse.egit.ui.search.CommitSearchQueryTest)  Time elapsed: 0.559 s
15:20:53 [2020-08-24T19:20:53.404Z] testCaseInsensitive(org.eclipse.egit.ui.search.CommitSearchQueryTest)  Time elapsed: 0.536 s
15:20:53 [2020-08-24T19:20:53.404Z] testMatchCommit(org.eclipse.egit.ui.search.CommitSearchQueryTest)  Time elapsed: 0.535 s
15:20:53 [2020-08-24T19:20:53.404Z] testMatchParent(org.eclipse.egit.ui.search.CommitSearchQueryTest)  Time elapsed: 0.537 s
15:20:53 [2020-08-24T19:20:53.404Z] testMatchTree(org.eclipse.egit.ui.search.CommitSearchQueryTest)  Time elapsed: 0.565 s
15:20:53 [2020-08-24T19:20:53.404Z] testEmptyMatches(org.eclipse.egit.ui.search.CommitSearchQueryTest)  Time elapsed: 0.742 s
15:20:53 [2020-08-24T19:20:53.404Z] Running org.eclipse.egit.ui.search.CommitSearchDialogTest
15:20:53 [2020-08-24T19:20:53.968Z] 
15:20:53 [2020-08-24T19:20:53.968Z] (SWT:1598): Gtk-WARNING **: 19:20:53.717: Negative content width -6 (allocation 1, extents 4x3) while allocating gadget (node toolbar, owner GtkToolbar)
15:20:53 [2020-08-24T19:20:53.968Z] 
15:20:53 [2020-08-24T19:20:53.968Z] (SWT:1598): Gtk-WARNING **: 19:20:53.734: Negative content width -6 (allocation 1, extents 4x3) while allocating gadget (node toolbar, owner GtkToolbar)
15:20:53 [2020-08-24T19:20:53.968Z] 
15:20:53 [2020-08-24T19:20:53.968Z] (SWT:1598): Gtk-WARNING **: 19:20:53.794: Negative content width -6 (allocation 1, extents 4x3) while allocating gadget (node toolbar, owner GtkToolbar)
15:20:53 [2020-08-24T19:20:53.968Z] 
15:20:53 [2020-08-24T19:20:53.968Z] (SWT:1598): Gtk-WARNING **: 19:20:53.832: Negative content width -6 (allocation 1, extents 4x3) while allocating gadget (node toolbar, owner GtkToolbar)
15:20:54 [2020-08-24T19:20:54.532Z] 
15:20:54 [2020-08-24T19:20:54.532Z] (SWT:1598): Gtk-WARNING **: 19:20:54.472: Negative content width -6 (allocation 1, extents 4x3) while allocating gadget (node toolbar, owner GtkToolbar)
15:20:54 [2020-08-24T19:20:54.789Z] Tests run: 1, Failures: 0, Errors: 0, Skipped: 0, Time elapsed: 1.471 s - in org.eclipse.egit.ui.search.CommitSearchDialogTest
15:20:54 [2020-08-24T19:20:54.789Z] openCommitTabOnSearchDialog(org.eclipse.egit.ui.search.CommitSearchDialogTest)  Time elapsed: 1.469 s
15:20:54 [2020-08-24T19:20:54.789Z] Running org.eclipse.egit.ui.prefpages.configuration.GlobalConfigurationPageTest
15:20:54 [2020-08-24T19:20:54.789Z] 
15:20:54 [2020-08-24T19:20:54.789Z] !ENTRY org.eclipse.ui 2 2 2020-08-24 19:20:54.595
15:20:54 [2020-08-24T19:20:54.789Z] !MESSAGE Invalid preference category path: org.eclipse.ui.net.NetPreferences (bundle: org.eclipse.jsch.ui, page: org.eclipse.jsch.ui.SSHPreferences)
15:20:54 [2020-08-24T19:20:54.789Z] 
15:20:54 [2020-08-24T19:20:54.789Z] (SWT:1598): Gtk-WARNING **: 19:20:54.604: Negative content width -13 (allocation 5, extents 9x9) while allocating gadget (node entry, owner GtkEntry)
15:20:54 [2020-08-24T19:20:54.789Z] 
15:20:54 [2020-08-24T19:20:54.789Z] (SWT:1598): Gtk-WARNING **: 19:20:54.737: Negative content width -13 (allocation 5, extents 9x9) while allocating gadget (node entry, owner GtkEntry)
15:20:55 [2020-08-24T19:20:55.046Z] 
15:20:55 [2020-08-24T19:20:55.047Z] (SWT:1598): Gtk-WARNING **: 19:20:54.865: Negative content width -13 (allocation 5, extents 9x9) while allocating gadget (node entry, owner GtkEntry)
15:20:55 [2020-08-24T19:20:55.047Z] 
15:20:55 [2020-08-24T19:20:55.047Z] (SWT:1598): Gtk-WARNING **: 19:20:55.004: Negative content width -13 (allocation 5, extents 9x9) while allocating gadget (node entry, owner GtkEntry)
15:20:55 [2020-08-24T19:20:55.303Z] 
15:20:55 [2020-08-24T19:20:55.303Z] (SWT:1598): Gtk-WARNING **: 19:20:55.076: Negative content width -13 (allocation 5, extents 9x9) while allocating gadget (node entry, owner GtkEntry)
15:20:55 [2020-08-24T19:20:55.303Z] 
15:20:55 [2020-08-24T19:20:55.303Z] (SWT:1598): Gtk-WARNING **: 19:20:55.154: Negative content width -13 (allocation 5, extents 9x9) while allocating gadget (node entry, owner GtkEntry)
15:20:55 [2020-08-24T19:20:55.303Z] 
15:20:55 [2020-08-24T19:20:55.303Z] (SWT:1598): Gtk-WARNING **: 19:20:55.267: Negative content width -13 (allocation 5, extents 9x9) while allocating gadget (node entry, owner GtkEntry)
15:20:55 [2020-08-24T19:20:55.561Z] 
15:20:55 [2020-08-24T19:20:55.561Z] (SWT:1598): Gtk-WARNING **: 19:20:55.326: Negative content width -6 (allocation 1, extents 4x3) while allocating gadget (node toolbar, owner GtkToolbar)
15:20:55 [2020-08-24T19:20:55.561Z] 
15:20:55 [2020-08-24T19:20:55.561Z] (SWT:1598): Gtk-WARNING **: 19:20:55.326: Negative content height -3 (allocation 1, extents 2x2) while allocating gadget (node toolbar, owner GtkToolbar)
15:20:55 [2020-08-24T19:20:55.561Z] 
15:20:55 [2020-08-24T19:20:55.561Z] (SWT:1598): Gtk-WARNING **: 19:20:55.326: Negative content width -6 (allocation 1, extents 4x3) while allocating gadget (node toolbar, owner GtkToolbar)
15:20:55 [2020-08-24T19:20:55.561Z] 
15:20:55 [2020-08-24T19:20:55.561Z] (SWT:1598): Gtk-WARNING **: 19:20:55.326: Negative content height -3 (allocation 1, extents 2x2) while allocating gadget (node toolbar, owner GtkToolbar)
15:20:55 [2020-08-24T19:20:55.561Z] 
15:20:55 [2020-08-24T19:20:55.561Z] (SWT:1598): Gtk-WARNING **: 19:20:55.440: Negative content width -13 (allocation 5, extents 9x9) while allocating gadget (node entry, owner GtkEntry)
15:20:55 [2020-08-24T19:20:55.818Z] 
15:20:55 [2020-08-24T19:20:55.818Z] (SWT:1598): Gtk-WARNING **: 19:20:55.566: Negative content width -13 (allocation 5, extents 9x9) while allocating gadget (node entry, owner GtkEntry)
15:20:55 [2020-08-24T19:20:55.818Z] 
15:20:55 [2020-08-24T19:20:55.818Z] (SWT:1598): Gtk-WARNING **: 19:20:55.722: Negative content width -13 (allocation 5, extents 9x9) while allocating gadget (node entry, owner GtkEntry)
15:20:56 [2020-08-24T19:20:56.075Z] 
15:20:56 [2020-08-24T19:20:56.075Z] (SWT:1598): Gtk-WARNING **: 19:20:55.839: Negative content width -13 (allocation 5, extents 9x9) while allocating gadget (node entry, owner GtkEntry)
15:20:56 [2020-08-24T19:20:56.075Z] 
15:20:56 [2020-08-24T19:20:56.075Z] (SWT:1598): Gtk-WARNING **: 19:20:55.968: Negative content width -13 (allocation 5, extents 9x9) while allocating gadget (node entry, owner GtkEntry)
15:20:56 [2020-08-24T19:20:56.332Z] Tests run: 11, Failures: 0, Errors: 0, Skipped: 0, Time elapsed: 1.496 s - in org.eclipse.egit.ui.prefpages.configuration.GlobalConfigurationPageTest
15:20:56 [2020-08-24T19:20:56.332Z] testAddSubSectionEntry(org.eclipse.egit.ui.prefpages.configuration.GlobalConfigurationPageTest)  Time elapsed: 0.15 s
15:20:56 [2020-08-24T19:20:56.332Z] testAddSectionEntry(org.eclipse.egit.ui.prefpages.configuration.GlobalConfigurationPageTest)  Time elapsed: 0.125 s
15:20:56 [2020-08-24T19:20:56.332Z] testCanCreateSameEntryValue(org.eclipse.egit.ui.prefpages.configuration.GlobalConfigurationPageTest)  Time elapsed: 0.131 s
15:20:56 [2020-08-24T19:20:56.332Z] testNodes(org.eclipse.egit.ui.prefpages.configuration.GlobalConfigurationPageTest)  Time elapsed: 0.08 s
15:20:56 [2020-08-24T19:20:56.332Z] testRemoveValue(org.eclipse.egit.ui.prefpages.configuration.GlobalConfigurationPageTest)  Time elapsed: 0.079 s
15:20:56 [2020-08-24T19:20:56.332Z] testAddSubSectionEntryWithSuggestion(org.eclipse.egit.ui.prefpages.configuration.GlobalConfigurationPageTest)  Time elapsed: 0.113 s
15:20:56 [2020-08-24T19:20:56.332Z] testOpenEditor(org.eclipse.egit.ui.prefpages.configuration.GlobalConfigurationPageTest)  Time elapsed: 0.174 s
15:20:56 [2020-08-24T19:20:56.332Z] testSubsectionWithDot(org.eclipse.egit.ui.prefpages.configuration.GlobalConfigurationPageTest)  Time elapsed: 0.125 s
15:20:56 [2020-08-24T19:20:56.332Z] testChecksForKey(org.eclipse.egit.ui.prefpages.configuration.GlobalConfigurationPageTest)  Time elapsed: 0.156 s
15:20:56 [2020-08-24T19:20:56.332Z] testRemoveSubSection(org.eclipse.egit.ui.prefpages.configuration.GlobalConfigurationPageTest)  Time elapsed: 0.118 s
15:20:56 [2020-08-24T19:20:56.332Z] testRemoveSection(org.eclipse.egit.ui.prefpages.configuration.GlobalConfigurationPageTest)  Time elapsed: 0.127 s
15:20:56 [2020-08-24T19:20:56.332Z] Running org.eclipse.egit.ui.submodule.SubmoduleUpdateTest
15:20:56 [2020-08-24T19:20:56.896Z] 
15:20:56 [2020-08-24T19:20:56.896Z] (SWT:1598): Gtk-WARNING **: 19:20:56.813: Negative content width -6 (allocation 1, extents 4x3) while allocating gadget (node toolbar, owner GtkToolbar)
15:20:59 [2020-08-24T19:20:59.420Z] 
15:20:59 [2020-08-24T19:20:59.420Z] (SWT:1598): Gtk-WARNING **: 19:20:59.194: Negative content width -6 (allocation 1, extents 4x3) while allocating gadget (node toolbar, owner GtkToolbar)
15:20:59 [2020-08-24T19:20:59.420Z] Tests run: 1, Failures: 0, Errors: 0, Skipped: 0, Time elapsed: 3.216 s - in org.eclipse.egit.ui.submodule.SubmoduleUpdateTest
15:20:59 [2020-08-24T19:20:59.420Z] updateSubmodule(org.eclipse.egit.ui.submodule.SubmoduleUpdateTest)  Time elapsed: 3.212 s
15:20:59 [2020-08-24T19:20:59.420Z] Running org.eclipse.egit.ui.submodule.SubmoduleSyncTest
15:21:00 [2020-08-24T19:21:00.381Z] 
15:21:00 [2020-08-24T19:21:00.381Z] (SWT:1598): Gtk-WARNING **: 19:21:00.032: Negative content width -6 (allocation 1, extents 4x3) while allocating gadget (node toolbar, owner GtkToolbar)
15:21:02 [2020-08-24T19:21:02.904Z] 
15:21:02 [2020-08-24T19:21:02.904Z] (SWT:1598): Gtk-WARNING **: 19:21:02.348: Negative content width -6 (allocation 1, extents 4x3) while allocating gadget (node toolbar, owner GtkToolbar)
15:21:02 [2020-08-24T19:21:02.904Z] Tests run: 1, Failures: 0, Errors: 0, Skipped: 0, Time elapsed: 3.152 s - in org.eclipse.egit.ui.submodule.SubmoduleSyncTest
15:21:02 [2020-08-24T19:21:02.904Z] syncSubmodule(org.eclipse.egit.ui.submodule.SubmoduleSyncTest)  Time elapsed: 3.148 s
15:21:02 [2020-08-24T19:21:02.904Z] Running org.eclipse.egit.ui.submodule.SubmoduleAddTest
15:21:03 [2020-08-24T19:21:03.161Z] 
15:21:03 [2020-08-24T19:21:03.161Z] (SWT:1598): Gtk-WARNING **: 19:21:03.145: Negative content width -6 (allocation 1, extents 4x3) while allocating gadget (node toolbar, owner GtkToolbar)
15:21:06 [2020-08-24T19:21:06.439Z] 
15:21:06 [2020-08-24T19:21:06.440Z] (SWT:1598): Gtk-WARNING **: 19:21:05.788: Negative content width -6 (allocation 1, extents 4x3) while allocating gadget (node toolbar, owner GtkToolbar)
15:21:06 [2020-08-24T19:21:06.440Z] Tests run: 1, Failures: 0, Errors: 0, Skipped: 0, Time elapsed: 3.438 s - in org.eclipse.egit.ui.submodule.SubmoduleAddTest
15:21:06 [2020-08-24T19:21:06.440Z] addAtRoot(org.eclipse.egit.ui.submodule.SubmoduleAddTest)  Time elapsed: 3.434 s
15:21:06 [2020-08-24T19:21:06.440Z] Running org.eclipse.egit.ui.httpauth.PushTest
15:21:06 [2020-08-24T19:21:06.440Z] 2020-08-24 19:21:05.971:INFO:oejs.Server:WorkbenchTestable: jetty-9.4.30.v20200611; built: 2020-06-16T05:54:33.713Z; git: 271836e4c1f4612f12b7bb13ef5a92a927634b0d; jvm 1.8.0_262-b10
15:21:06 [2020-08-24T19:21:06.440Z] 2020-08-24 19:21:05.972:INFO:oejsh.ContextHandler:WorkbenchTestable: Started o.e.j.s.ServletContextHandler@2e2c0b4b{/sbasic,null,AVAILABLE}
15:21:06 [2020-08-24T19:21:06.440Z] 2020-08-24 19:21:05.978:INFO:oejs.AbstractConnector:WorkbenchTestable: Started ServerConnector@dced4e3{HTTP/1.1, (http/1.1)}{127.0.0.1:45720}
15:21:06 [2020-08-24T19:21:06.440Z] 2020-08-24 19:21:05.978:INFO:oejs.Server:WorkbenchTestable: Started @731867ms
15:21:06 [2020-08-24T19:21:06.440Z] 
15:21:06 [2020-08-24T19:21:06.440Z] (SWT:1598): Gtk-CRITICAL **: 19:21:06.314: gtk_box_gadget_distribute: assertion 'size >= 0' failed in GtkCheckButton
15:21:07 [2020-08-24T19:21:07.374Z] 2020-08-24 19:21:07.166:INFO:oejs.AbstractConnector:WorkbenchTestable: Stopped ServerConnector@dced4e3{HTTP/1.1, (http/1.1)}{127.0.0.1:0}
15:21:07 [2020-08-24T19:21:07.374Z] 2020-08-24 19:21:07.166:INFO:oejsh.ContextHandler:WorkbenchTestable: Stopped o.e.j.s.ServletContextHandler@2e2c0b4b{/sbasic,null,UNAVAILABLE}
15:21:07 [2020-08-24T19:21:07.374Z] Tests run: 1, Failures: 0, Errors: 0, Skipped: 0, Time elapsed: 1.273 s - in org.eclipse.egit.ui.httpauth.PushTest
15:21:07 [2020-08-24T19:21:07.374Z] testPush(org.eclipse.egit.ui.httpauth.PushTest)  Time elapsed: 1.273 s
15:21:07 [2020-08-24T19:21:07.374Z] Running org.eclipse.egit.ui.operations.GitScopeUtilTest
15:21:11 [2020-08-24T19:21:11.549Z] Tests run: 5, Failures: 0, Errors: 0, Skipped: 0, Time elapsed: 3.956 s - in org.eclipse.egit.ui.operations.GitScopeUtilTest
15:21:11 [2020-08-24T19:21:11.549Z] relatedChangesWithPrompt(org.eclipse.egit.ui.operations.GitScopeUtilTest)  Time elapsed: 1.544 s
15:21:11 [2020-08-24T19:21:11.549Z] modelProviderWithExtensionFiles(org.eclipse.egit.ui.operations.GitScopeUtilTest)  Time elapsed: 0.623 s
15:21:11 [2020-08-24T19:21:11.549Z] relatedChangesWithInvalidParams(org.eclipse.egit.ui.operations.GitScopeUtilTest)  Time elapsed: 0.544 s
15:21:11 [2020-08-24T19:21:11.549Z] relatedChangesWithNullResources(org.eclipse.egit.ui.operations.GitScopeUtilTest)  Time elapsed: 0.645 s
15:21:11 [2020-08-24T19:21:11.549Z] relatedChangesWithEmptyResources(org.eclipse.egit.ui.operations.GitScopeUtilTest)  Time elapsed: 0.598 s
15:21:11 [2020-08-24T19:21:11.549Z] 
15:21:11 [2020-08-24T19:21:11.549Z] Results:
15:21:11 [2020-08-24T19:21:11.549Z] 
15:21:11 [2020-08-24T19:21:11.549Z] Failures: 
15:21:11 [2020-08-24T19:21:11.549Z]   CommandEnablementTest.testRepositoryViewStartFinishEnablement:64->assertAllCommandsEnabledAndExecutable:80->testCommand:105->assertCommandEnablement:137
15:21:11 [2020-08-24T19:21:11.549Z] 
15:21:11 [2020-08-24T19:21:11.549Z] Tests run: 541, Failures: 1, Errors: 0, Skipped: 12
15:21:11 [2020-08-24T19:21:11.549Z] 
15:21:11 [2020-08-24T19:21:11.549Z] 
15:21:11 [2020-08-24T19:21:11.549Z] (SWT:1598): Gtk-WARNING **: 19:21:11.136: Negative content width -6 (allocation 1, extents 4x3) while allocating gadget (node toolbar, owner GtkToolbar)
15:21:12 [2020-08-24T19:21:12.114Z] 
15:21:12 [2020-08-24T19:21:12.114Z] !ENTRY org.eclipse.core.resources 2 10035 2020-08-24 19:21:12.052
15:21:12 [2020-08-24T19:21:12.114Z] !MESSAGE The workspace will exit with unsaved changes in this session.
15:21:13 [2020-08-24T19:21:13.046Z] [INFO] ------------------------------------------------------------------------
15:21:13 [2020-08-24T19:21:13.046Z] [INFO] Reactor Summary for EGit Parent 5.9.0-SNAPSHOT:
15:21:13 [2020-08-24T19:21:13.046Z] [INFO] 
15:21:13 [2020-08-24T19:21:13.046Z] [INFO] EGit Parent ........................................ SUCCESS [ 30.314 s]
15:21:13 [2020-08-24T19:21:13.046Z] [INFO] EGit Target Platform Definition .................... SUCCESS [  1.486 s]
15:21:13 [2020-08-24T19:21:13.046Z] [INFO] Eclipse EGit ....................................... SUCCESS [  6.267 s]
15:21:13 [2020-08-24T19:21:13.046Z] [INFO] Git Team Provider (Core) ........................... SUCCESS [ 16.939 s]
15:21:13 [2020-08-24T19:21:13.046Z] [INFO] Git Team Provider (UI) ............................. SUCCESS [ 43.625 s]
15:21:13 [2020-08-24T19:21:13.046Z] [INFO] EGit Mylyn UI ...................................... SUCCESS [  6.764 s]
15:21:13 [2020-08-24T19:21:13.046Z] [INFO] Git Team Provider (Documentation) .................. SUCCESS [  4.357 s]
15:21:13 [2020-08-24T19:21:13.046Z] [INFO] Eclipse EGit Feature ............................... SUCCESS [  1.301 s]
15:21:13 [2020-08-24T19:21:13.046Z] [INFO] EGit Mylyn Feature ................................. SUCCESS [  0.966 s]
15:21:13 [2020-08-24T19:21:13.046Z] [INFO] Git Flow ........................................... SUCCESS [  6.408 s]
15:21:13 [2020-08-24T19:21:13.046Z] [INFO] Git Flow UI ........................................ SUCCESS [  8.252 s]
15:21:13 [2020-08-24T19:21:13.046Z] [INFO] Eclipse EGit Gitflow Feature ....................... SUCCESS [  1.317 s]
15:21:13 [2020-08-24T19:21:13.046Z] [INFO] EGit JUnit Support ................................. SUCCESS [  6.448 s]
15:21:13 [2020-08-24T19:21:13.046Z] [INFO] GitFlow Test Plug-in ............................... SUCCESS [ 27.219 s]
15:21:13 [2020-08-24T19:21:13.046Z] [INFO] Eclipse EGit Source Feature ........................ SUCCESS [  1.161 s]
15:21:13 [2020-08-24T19:21:13.046Z] [INFO] EGit P2 Repository ................................. SUCCESS [ 15.259 s]
15:21:13 [2020-08-24T19:21:13.046Z] [INFO] EGit Core Test Plug-in ............................. SUCCESS [02:13 min]
15:21:13 [2020-08-24T19:21:13.046Z] [INFO] EGit UI Test Plug-in ............................... FAILURE [12:20 min]
15:21:13 [2020-08-24T19:21:13.046Z] [INFO] EGit Mylyn UI Test Plug-in ......................... SKIPPED
15:21:13 [2020-08-24T19:21:13.046Z] [INFO] ------------------------------------------------------------------------
15:21:13 [2020-08-24T19:21:13.046Z] [INFO] BUILD FAILURE
15:21:13 [2020-08-24T19:21:13.046Z] [INFO] ------------------------------------------------------------------------
15:21:13 [2020-08-24T19:21:13.046Z] [INFO] Total time:  20:10 min
15:21:13 [2020-08-24T19:21:13.046Z] [INFO] Finished at: 2020-08-24T19:21:12Z
15:21:13 [2020-08-24T19:21:13.046Z] [INFO] ------------------------------------------------------------------------
15:21:13 [2020-08-24T19:21:13.046Z] [ERROR] Failed to execute goal org.eclipse.tycho:tycho-surefire-plugin:1.7.0:test (default-test) on project org.eclipse.egit.ui.test: There are test failures.
15:21:13 [2020-08-24T19:21:13.046Z] [ERROR] 
15:21:13 [2020-08-24T19:21:13.046Z] [ERROR] Please refer to /home/jenkins/agent/workspace/egit.gerrit/repo/org.eclipse.egit.ui.test/target/surefire-reports for the individual test results.
15:21:13 [2020-08-24T19:21:13.046Z] [ERROR] -> [Help 1]
15:21:13 [2020-08-24T19:21:13.046Z] org.apache.maven.lifecycle.LifecycleExecutionException: Failed to execute goal org.eclipse.tycho:tycho-surefire-plugin:1.7.0:test (default-test) on project org.eclipse.egit.ui.test: There are test failures.
15:21:13 [2020-08-24T19:21:13.046Z] 
15:21:13 [2020-08-24T19:21:13.046Z] Please refer to /home/jenkins/agent/workspace/egit.gerrit/repo/org.eclipse.egit.ui.test/target/surefire-reports for the individual test results.
15:21:13 [2020-08-24T19:21:13.046Z]     at org.apache.maven.lifecycle.internal.MojoExecutor.execute (MojoExecutor.java:215)
15:21:13 [2020-08-24T19:21:13.046Z]     at org.apache.maven.lifecycle.internal.MojoExecutor.execute (MojoExecutor.java:156)
15:21:13 [2020-08-24T19:21:13.046Z]     at org.apache.maven.lifecycle.internal.MojoExecutor.execute (MojoExecutor.java:148)
15:21:13 [2020-08-24T19:21:13.046Z]     at org.apache.maven.lifecycle.internal.LifecycleModuleBuilder.buildProject (LifecycleModuleBuilder.java:117)
15:21:13 [2020-08-24T19:21:13.046Z]     at org.apache.maven.lifecycle.internal.LifecycleModuleBuilder.buildProject (LifecycleModuleBuilder.java:81)
15:21:13 [2020-08-24T19:21:13.046Z]     at org.apache.maven.lifecycle.internal.builder.singlethreaded.SingleThreadedBuilder.build (SingleThreadedBuilder.java:56)
15:21:13 [2020-08-24T19:21:13.046Z]     at org.apache.maven.lifecycle.internal.LifecycleStarter.execute (LifecycleStarter.java:128)
15:21:13 [2020-08-24T19:21:13.046Z]     at org.apache.maven.DefaultMaven.doExecute (DefaultMaven.java:305)
15:21:13 [2020-08-24T19:21:13.046Z]     at org.apache.maven.DefaultMaven.doExecute (DefaultMaven.java:192)
15:21:13 [2020-08-24T19:21:13.047Z]     at org.apache.maven.DefaultMaven.execute (DefaultMaven.java:105)
15:21:13 [2020-08-24T19:21:13.047Z]     at org.apache.maven.cli.MavenCli.execute (MavenCli.java:957)
15:21:13 [2020-08-24T19:21:13.047Z]     at org.apache.maven.cli.MavenCli.doMain (MavenCli.java:289)
15:21:13 [2020-08-24T19:21:13.047Z]     at org.apache.maven.cli.MavenCli.main (MavenCli.java:193)
15:21:13 [2020-08-24T19:21:13.047Z]     at sun.reflect.NativeMethodAccessorImpl.invoke0 (Native Method)
15:21:13 [2020-08-24T19:21:13.047Z]     at sun.reflect.NativeMethodAccessorImpl.invoke (NativeMethodAccessorImpl.java:62)
15:21:13 [2020-08-24T19:21:13.047Z]     at sun.reflect.DelegatingMethodAccessorImpl.invoke (DelegatingMethodAccessorImpl.java:43)
15:21:13 [2020-08-24T19:21:13.047Z]     at java.lang.reflect.Method.invoke (Method.java:498)
15:21:13 [2020-08-24T19:21:13.047Z]     at org.codehaus.plexus.classworlds.launcher.Launcher.launchEnhanced (Launcher.java:282)
15:21:13 [2020-08-24T19:21:13.047Z]     at org.codehaus.plexus.classworlds.launcher.Launcher.launch (Launcher.java:225)
15:21:13 [2020-08-24T19:21:13.047Z]     at org.codehaus.plexus.classworlds.launcher.Launcher.mainWithExitCode (Launcher.java:406)
15:21:13 [2020-08-24T19:21:13.047Z]     at org.codehaus.plexus.classworlds.launcher.Launcher.main (Launcher.java:347)
15:21:13 [2020-08-24T19:21:13.047Z] Caused by: org.apache.maven.plugin.MojoFailureException: There are test failures.
15:21:13 [2020-08-24T19:21:13.047Z] 
15:21:13 [2020-08-24T19:21:13.047Z] Please refer to /home/jenkins/agent/workspace/egit.gerrit/repo/org.eclipse.egit.ui.test/target/surefire-reports for the individual test results.
15:21:13 [2020-08-24T19:21:13.047Z]     at org.eclipse.tycho.surefire.TestMojo.runTest (TestMojo.java:1063)
15:21:13 [2020-08-24T19:21:13.047Z]     at org.eclipse.tycho.surefire.TestMojo.execute (TestMojo.java:712)
15:21:13 [2020-08-24T19:21:13.047Z]     at org.apache.maven.plugin.DefaultBuildPluginManager.executeMojo (DefaultBuildPluginManager.java:137)
15:21:13 [2020-08-24T19:21:13.047Z]     at org.apache.maven.lifecycle.internal.MojoExecutor.execute (MojoExecutor.java:210)
15:21:13 [2020-08-24T19:21:13.047Z]     at org.apache.maven.lifecycle.internal.MojoExecutor.execute (MojoExecutor.java:156)
15:21:13 [2020-08-24T19:21:13.047Z]     at org.apache.maven.lifecycle.internal.MojoExecutor.execute (MojoExecutor.java:148)
15:21:13 [2020-08-24T19:21:13.047Z]     at org.apache.maven.lifecycle.internal.LifecycleModuleBuilder.buildProject (LifecycleModuleBuilder.java:117)
15:21:13 [2020-08-24T19:21:13.047Z]     at org.apache.maven.lifecycle.internal.LifecycleModuleBuilder.buildProject (LifecycleModuleBuilder.java:81)
15:21:13 [2020-08-24T19:21:13.047Z]     at org.apache.maven.lifecycle.internal.builder.singlethreaded.SingleThreadedBuilder.build (SingleThreadedBuilder.java:56)
15:21:13 [2020-08-24T19:21:13.047Z]     at org.apache.maven.lifecycle.internal.LifecycleStarter.execute (LifecycleStarter.java:128)
15:21:13 [2020-08-24T19:21:13.047Z]     at org.apache.maven.DefaultMaven.doExecute (DefaultMaven.java:305)
15:21:13 [2020-08-24T19:21:13.047Z]     at org.apache.maven.DefaultMaven.doExecute (DefaultMaven.java:192)
15:21:13 [2020-08-24T19:21:13.047Z]     at org.apache.maven.DefaultMaven.execute (DefaultMaven.java:105)
15:21:13 [2020-08-24T19:21:13.047Z]     at org.apache.maven.cli.MavenCli.execute (MavenCli.java:957)
15:21:13 [2020-08-24T19:21:13.047Z]     at org.apache.maven.cli.MavenCli.doMain (MavenCli.java:289)
15:21:13 [2020-08-24T19:21:13.047Z]     at org.apache.maven.cli.MavenCli.main (MavenCli.java:193)
15:21:13 [2020-08-24T19:21:13.047Z]     at sun.reflect.NativeMethodAccessorImpl.invoke0 (Native Method)
15:21:13 [2020-08-24T19:21:13.047Z]     at sun.reflect.NativeMethodAccessorImpl.invoke (NativeMethodAccessorImpl.java:62)
15:21:13 [2020-08-24T19:21:13.047Z]     at sun.reflect.DelegatingMethodAccessorImpl.invoke (DelegatingMethodAccessorImpl.java:43)
15:21:13 [2020-08-24T19:21:13.047Z]     at java.lang.reflect.Method.invoke (Method.java:498)
15:21:13 [2020-08-24T19:21:13.047Z]     at org.codehaus.plexus.classworlds.launcher.Launcher.launchEnhanced (Launcher.java:282)
15:21:13 [2020-08-24T19:21:13.047Z]     at org.codehaus.plexus.classworlds.launcher.Launcher.launch (Launcher.java:225)
15:21:13 [2020-08-24T19:21:13.047Z]     at org.codehaus.plexus.classworlds.launcher.Launcher.mainWithExitCode (Launcher.java:406)
15:21:13 [2020-08-24T19:21:13.047Z]     at org.codehaus.plexus.classworlds.launcher.Launcher.main (Launcher.java:347)
15:21:13 [2020-08-24T19:21:13.047Z] [ERROR] 
15:21:13 [2020-08-24T19:21:13.047Z] [ERROR] Re-run Maven using the -X switch to enable full debug logging.
15:21:13 [2020-08-24T19:21:13.047Z] [ERROR] 
15:21:13 [2020-08-24T19:21:13.047Z] [ERROR] For more information about the errors and possible solutions, please read the following articles:
15:21:13 [2020-08-24T19:21:13.047Z] [ERROR] [Help 1] http://cwiki.apache.org/confluence/display/MAVEN/MojoFailureException
15:21:13 [2020-08-24T19:21:13.047Z] [ERROR] 
15:21:13 [2020-08-24T19:21:13.047Z] [ERROR] After correcting the problems, you can resume the build with the command
15:21:13 [2020-08-24T19:21:13.047Z] [ERROR]   mvn <args> -rf :org.eclipse.egit.ui.test
[Pipeline] }
[Pipeline] // stage
[Pipeline] stage
[Pipeline] { (Results)
[Pipeline] junit
15:21:14 [2020-08-24T19:21:14.908Z] Recording test results
[Pipeline] archiveArtifacts
15:21:15 [2020-08-24T19:21:15.746Z] Archiving artifacts
[Pipeline] findbugs
15:21:18 [2020-08-24T19:21:18.676Z] [FINDBUGS] Collecting findbugs analysis files...
15:21:22 [2020-08-24T19:21:22.063Z] [FINDBUGS] Searching for all files in /home/jenkins/agent/workspace/egit.gerrit/repo that match the pattern */target/*bugsXml.xml
15:21:22 [2020-08-24T19:21:22.063Z] [FINDBUGS] Parsing 8 files in /home/jenkins/agent/workspace/egit.gerrit/repo
15:21:22 [2020-08-24T19:21:22.063Z] [FINDBUGS] Successfully parsed file /home/jenkins/agent/workspace/egit.gerrit/repo/org.eclipse.egit.core.junit/target/spotbugsXml.xml with 4 unique warnings and 0 duplicates.
15:21:22 [2020-08-24T19:21:22.063Z] [FINDBUGS] Successfully parsed file /home/jenkins/agent/workspace/egit.gerrit/repo/org.eclipse.egit.core.test/target/spotbugsXml.xml with 9 unique warnings and 0 duplicates.
15:21:22 [2020-08-24T19:21:22.063Z] [FINDBUGS] Successfully parsed file /home/jenkins/agent/workspace/egit.gerrit/repo/org.eclipse.egit.core/target/spotbugsXml.xml with 20 unique warnings and 0 duplicates.
15:21:22 [2020-08-24T19:21:22.063Z] [FINDBUGS] Successfully parsed file /home/jenkins/agent/workspace/egit.gerrit/repo/org.eclipse.egit.gitflow.test/target/spotbugsXml.xml with 20 unique warnings and 0 duplicates.
15:21:22 [2020-08-24T19:21:22.063Z] [FINDBUGS] Successfully parsed file /home/jenkins/agent/workspace/egit.gerrit/repo/org.eclipse.egit.gitflow.ui/target/spotbugsXml.xml with 20 unique warnings and 0 duplicates.
15:21:22 [2020-08-24T19:21:22.063Z] [FINDBUGS] Successfully parsed file /home/jenkins/agent/workspace/egit.gerrit/repo/org.eclipse.egit.gitflow/target/spotbugsXml.xml with 22 unique warnings and 0 duplicates.
15:21:22 [2020-08-24T19:21:22.063Z] [FINDBUGS] Successfully parsed file /home/jenkins/agent/workspace/egit.gerrit/repo/org.eclipse.egit.mylyn.ui/target/spotbugsXml.xml with 22 unique warnings and 0 duplicates.
15:21:22 [2020-08-24T19:21:22.063Z] [FINDBUGS] Successfully parsed file /home/jenkins/agent/workspace/egit.gerrit/repo/org.eclipse.egit.ui/target/spotbugsXml.xml with 59 unique warnings and 0 duplicates.
15:21:22 [2020-08-24T19:21:22.063Z] Skipping warnings blame since pipelines do not have an SCM link.%n
15:21:22 [2020-08-24T19:21:22.130Z] [FINDBUGS] Computing warning deltas based on reference build #1643
[Pipeline] dry
15:21:22 [2020-08-24T19:21:22.368Z] [DRY] Collecting duplicate code analysis files...
15:21:22 [2020-08-24T19:21:22.600Z] [DRY] Searching for all files in /home/jenkins/agent/workspace/egit.gerrit/repo that match the pattern **/cpd.xml
15:21:22 [2020-08-24T19:21:22.600Z] [DRY] Parsing 15 files in /home/jenkins/agent/workspace/egit.gerrit/repo
15:21:22 [2020-08-24T19:21:22.600Z] [DRY] Successfully parsed file /home/jenkins/agent/workspace/egit.gerrit/repo/org.eclipse.egit-feature/target/cpd.xml with 0 unique warnings and 0 duplicates.
15:21:22 [2020-08-24T19:21:22.600Z] [DRY] Successfully parsed file /home/jenkins/agent/workspace/egit.gerrit/repo/org.eclipse.egit.core.junit/target/cpd.xml with 0 unique warnings and 0 duplicates.
15:21:22 [2020-08-24T19:21:22.601Z] [DRY] Successfully parsed file /home/jenkins/agent/workspace/egit.gerrit/repo/org.eclipse.egit.core.test/target/cpd.xml with 0 unique warnings and 0 duplicates.
15:21:22 [2020-08-24T19:21:22.601Z] [DRY] Successfully parsed file /home/jenkins/agent/workspace/egit.gerrit/repo/org.eclipse.egit.core/target/cpd.xml with 4 unique warnings and 0 duplicates.
15:21:22 [2020-08-24T19:21:22.601Z] [DRY] Successfully parsed file /home/jenkins/agent/workspace/egit.gerrit/repo/org.eclipse.egit.doc/target/cpd.xml with 4 unique warnings and 0 duplicates.
15:21:22 [2020-08-24T19:21:22.601Z] [DRY] Successfully parsed file /home/jenkins/agent/workspace/egit.gerrit/repo/org.eclipse.egit.gitflow-feature/target/cpd.xml with 4 unique warnings and 0 duplicates.
15:21:22 [2020-08-24T19:21:22.601Z] [DRY] Successfully parsed file /home/jenkins/agent/workspace/egit.gerrit/repo/org.eclipse.egit.gitflow.test/target/cpd.xml with 4 unique warnings and 0 duplicates.
15:21:22 [2020-08-24T19:21:22.601Z] [DRY] Successfully parsed file /home/jenkins/agent/workspace/egit.gerrit/repo/org.eclipse.egit.gitflow.ui/target/cpd.xml with 4 unique warnings and 0 duplicates.
15:21:22 [2020-08-24T19:21:22.601Z] [DRY] Successfully parsed file /home/jenkins/agent/workspace/egit.gerrit/repo/org.eclipse.egit.gitflow/target/cpd.xml with 4 unique warnings and 0 duplicates.
15:21:22 [2020-08-24T19:21:22.601Z] [DRY] Successfully parsed file /home/jenkins/agent/workspace/egit.gerrit/repo/org.eclipse.egit.mylyn-feature/target/cpd.xml with 4 unique warnings and 0 duplicates.
15:21:22 [2020-08-24T19:21:22.601Z] [DRY] Successfully parsed file /home/jenkins/agent/workspace/egit.gerrit/repo/org.eclipse.egit.mylyn.ui/target/cpd.xml with 4 unique warnings and 0 duplicates.
15:21:22 [2020-08-24T19:21:22.601Z] [DRY] Successfully parsed file /home/jenkins/agent/workspace/egit.gerrit/repo/org.eclipse.egit.repository/target/cpd.xml with 4 unique warnings and 0 duplicates.
15:21:22 [2020-08-24T19:21:22.601Z] [DRY] Successfully parsed file /home/jenkins/agent/workspace/egit.gerrit/repo/org.eclipse.egit.source-feature/target/cpd.xml with 4 unique warnings and 0 duplicates.
15:21:22 [2020-08-24T19:21:22.601Z] [DRY] Successfully parsed file /home/jenkins/agent/workspace/egit.gerrit/repo/org.eclipse.egit.ui/target/cpd.xml with 37 unique warnings and 0 duplicates.
15:21:22 [2020-08-24T19:21:22.601Z] [DRY] Successfully parsed file /home/jenkins/agent/workspace/egit.gerrit/repo/org.eclipse.egit/target/cpd.xml with 37 unique warnings and 0 duplicates.
15:21:22 [2020-08-24T19:21:22.601Z] Skipping warnings blame since pipelines do not have an SCM link.%n
15:21:22 [2020-08-24T19:21:22.640Z] [DRY] Computing warning deltas based on reference build #1643
[Pipeline] }
[Pipeline] // stage
[Pipeline] }
[Pipeline] // dir
[Pipeline] }
15:21:23 [2020-08-24T19:21:23.336Z] Terminating xvnc.
[Pipeline] // wrap
[Pipeline] }
[Pipeline] // timeout
[Pipeline] }
[Pipeline] // node
[Pipeline] }
[Pipeline] // timestamps
[Pipeline] End of Pipeline
ERROR: script returned exit code 1
Finished: FAILURE