AbortedConsole Output

Skipping 1,546 KB.. Full Log
ocating gadget (node toolbar, owner GtkToolbar)
16:01:59 
16:01:59 (SWT:1256): Gtk-WARNING **: 20:01:59.405: Negative content height -3 (allocation 1, extents 2x2) while allocating gadget (node toolbar, owner GtkToolbar)
16:02:00 
16:02:00 (SWT:1256): Gtk-WARNING **: 20:02:00.937: Negative content width -6 (allocation 1, extents 4x3) while allocating gadget (node toolbar, owner GtkToolbar)
16:02:00 
16:02:00 (SWT:1256): Gtk-WARNING **: 20:02:00.953: Negative content width -1 (allocation 1, extents 1x1) while allocating gadget (node trough, owner GtkProgressBar)
16:02:00 
16:02:00 (SWT:1256): Gtk-WARNING **: 20:02:00.957: Negative content height -1 (allocation 1, extents 1x1) while allocating gadget (node scrolledwindow, owner GtkScrolledWindow)
16:02:01 
16:02:01 (SWT:1256): Gtk-WARNING **: 20:02:01.157: Negative content width -6 (allocation 1, extents 4x3) while allocating gadget (node toolbar, owner GtkToolbar)
16:02:01 
16:02:01 (SWT:1256): Gtk-WARNING **: 20:02:01.157: Negative content height -3 (allocation 1, extents 2x2) while allocating gadget (node toolbar, owner GtkToolbar)
16:02:01 
16:02:01 (SWT:1256): Gtk-WARNING **: 20:02:01.157: Negative content width -6 (allocation 1, extents 4x3) while allocating gadget (node toolbar, owner GtkToolbar)
16:02:01 
16:02:01 (SWT:1256): Gtk-WARNING **: 20:02:01.157: Negative content height -3 (allocation 1, extents 2x2) while allocating gadget (node toolbar, owner GtkToolbar)
16:02:01 
16:02:01 (SWT:1256): Gtk-WARNING **: 20:02:01.503: Negative content width -6 (allocation 1, extents 4x3) while allocating gadget (node toolbar, owner GtkToolbar)
16:02:01 
16:02:01 (SWT:1256): Gtk-WARNING **: 20:02:01.507: Negative content width -6 (allocation 1, extents 4x3) while allocating gadget (node toolbar, owner GtkToolbar)
16:02:01 
16:02:01 (SWT:1256): Gtk-WARNING **: 20:02:01.512: Negative content width -6 (allocation 1, extents 4x3) while allocating gadget (node toolbar, owner GtkToolbar)
16:02:01 
16:02:01 (SWT:1256): Gtk-WARNING **: 20:02:01.518: Negative content width -6 (allocation 1, extents 4x3) while allocating gadget (node toolbar, owner GtkToolbar)
16:02:01 
16:02:01 (SWT:1256): Gtk-WARNING **: 20:02:01.538: Negative content width -6 (allocation 1, extents 4x3) while allocating gadget (node toolbar, owner GtkToolbar)
16:02:01 
16:02:01 (SWT:1256): Gtk-WARNING **: 20:02:01.539: Negative content width -6 (allocation 1, extents 4x3) while allocating gadget (node toolbar, owner GtkToolbar)
16:02:01 
16:02:01 (SWT:1256): Gtk-WARNING **: 20:02:01.576: Negative content width -6 (allocation 1, extents 4x3) while allocating gadget (node toolbar, owner GtkToolbar)
16:02:01 
16:02:01 (SWT:1256): Gtk-WARNING **: 20:02:01.577: Negative content width -6 (allocation 1, extents 4x3) while allocating gadget (node toolbar, owner GtkToolbar)
16:02:01 
16:02:01 (SWT:1256): Gtk-WARNING **: 20:02:01.694: Negative content width -6 (allocation 1, extents 4x3) while allocating gadget (node toolbar, owner GtkToolbar)
16:02:02 
16:02:02 (SWT:1256): Gtk-WARNING **: 20:02:02.002: Negative content width -1 (allocation 1, extents 1x1) while allocating gadget (node trough, owner GtkProgressBar)
16:02:02 
16:02:02 (SWT:1256): Gtk-WARNING **: 20:02:02.025: Negative content width -1 (allocation 1, extents 1x1) while allocating gadget (node trough, owner GtkProgressBar)
16:02:02 
16:02:02 (SWT:1256): Gtk-WARNING **: 20:02:02.031: Negative content width -1 (allocation 1, extents 1x1) while allocating gadget (node trough, owner GtkProgressBar)
16:02:02 
16:02:02 (SWT:1256): Gtk-WARNING **: 20:02:02.098: Negative content width -1 (allocation 1, extents 1x1) while allocating gadget (node trough, owner GtkProgressBar)
16:02:02 
16:02:02 (SWT:1256): Gtk-WARNING **: 20:02:02.101: Negative content height -1 (allocation 1, extents 1x1) while allocating gadget (node scrolledwindow, owner GtkScrolledWindow)
16:02:02 
16:02:02 (SWT:1256): Gtk-WARNING **: 20:02:02.396: Negative content width -6 (allocation 1, extents 4x3) while allocating gadget (node toolbar, owner GtkToolbar)
16:02:02 
16:02:02 (SWT:1256): Gtk-WARNING **: 20:02:02.396: Negative content height -3 (allocation 1, extents 2x2) while allocating gadget (node toolbar, owner GtkToolbar)
16:02:02 
16:02:02 (SWT:1256): Gtk-WARNING **: 20:02:02.396: Negative content width -6 (allocation 1, extents 4x3) while allocating gadget (node toolbar, owner GtkToolbar)
16:02:02 
16:02:02 (SWT:1256): Gtk-WARNING **: 20:02:02.396: Negative content height -3 (allocation 1, extents 2x2) while allocating gadget (node toolbar, owner GtkToolbar)
16:02:02 
16:02:02 (SWT:1256): Gtk-WARNING **: 20:02:02.729: Negative content width -6 (allocation 1, extents 4x3) while allocating gadget (node toolbar, owner GtkToolbar)
16:02:02 
16:02:02 (SWT:1256): Gtk-WARNING **: 20:02:02.734: Negative content width -6 (allocation 1, extents 4x3) while allocating gadget (node toolbar, owner GtkToolbar)
16:02:02 
16:02:02 (SWT:1256): Gtk-WARNING **: 20:02:02.738: Negative content width -6 (allocation 1, extents 4x3) while allocating gadget (node toolbar, owner GtkToolbar)
16:02:02 
16:02:02 (SWT:1256): Gtk-WARNING **: 20:02:02.744: Negative content width -6 (allocation 1, extents 4x3) while allocating gadget (node toolbar, owner GtkToolbar)
16:02:02 
16:02:02 (SWT:1256): Gtk-WARNING **: 20:02:02.764: Negative content width -6 (allocation 1, extents 4x3) while allocating gadget (node toolbar, owner GtkToolbar)
16:02:02 
16:02:02 (SWT:1256): Gtk-WARNING **: 20:02:02.765: Negative content width -6 (allocation 1, extents 4x3) while allocating gadget (node toolbar, owner GtkToolbar)
16:02:02 
16:02:02 (SWT:1256): Gtk-WARNING **: 20:02:02.806: Negative content width -6 (allocation 1, extents 4x3) while allocating gadget (node toolbar, owner GtkToolbar)
16:02:02 
16:02:02 (SWT:1256): Gtk-WARNING **: 20:02:02.807: Negative content width -6 (allocation 1, extents 4x3) while allocating gadget (node toolbar, owner GtkToolbar)
16:02:02 
16:02:02 (SWT:1256): Gtk-WARNING **: 20:02:02.842: Negative content width -6 (allocation 1, extents 4x3) while allocating gadget (node toolbar, owner GtkToolbar)
16:02:02 
16:02:02 (SWT:1256): Gtk-WARNING **: 20:02:02.855: Negative content width -6 (allocation 1, extents 4x3) while allocating gadget (node toolbar, owner GtkToolbar)
16:02:03 
16:02:03 (SWT:1256): Gtk-WARNING **: 20:02:03.681: Negative content width -6 (allocation 1, extents 4x3) while allocating gadget (node toolbar, owner GtkToolbar)
16:02:03 
16:02:03 (SWT:1256): Gtk-WARNING **: 20:02:03.681: Negative content height -3 (allocation 1, extents 2x2) while allocating gadget (node toolbar, owner GtkToolbar)
16:02:03 
16:02:03 (SWT:1256): Gtk-WARNING **: 20:02:03.681: Negative content width -6 (allocation 1, extents 4x3) while allocating gadget (node toolbar, owner GtkToolbar)
16:02:03 
16:02:03 (SWT:1256): Gtk-WARNING **: 20:02:03.681: Negative content height -3 (allocation 1, extents 2x2) while allocating gadget (node toolbar, owner GtkToolbar)
16:02:03 
16:02:03 (SWT:1256): Gtk-WARNING **: 20:02:03.800: Negative content width -6 (allocation 1, extents 4x3) while allocating gadget (node toolbar, owner GtkToolbar)
16:02:03 
16:02:03 (SWT:1256): Gtk-WARNING **: 20:02:03.800: Negative content height -3 (allocation 1, extents 2x2) while allocating gadget (node toolbar, owner GtkToolbar)
16:02:03 
16:02:03 (SWT:1256): Gtk-WARNING **: 20:02:03.800: Negative content width -6 (allocation 1, extents 4x3) while allocating gadget (node toolbar, owner GtkToolbar)
16:02:03 
16:02:03 (SWT:1256): Gtk-WARNING **: 20:02:03.800: Negative content height -3 (allocation 1, extents 2x2) while allocating gadget (node toolbar, owner GtkToolbar)
16:02:05 
16:02:05 (SWT:1256): Gtk-WARNING **: 20:02:05.322: Negative content width -6 (allocation 1, extents 4x3) while allocating gadget (node toolbar, owner GtkToolbar)
16:02:05 
16:02:05 (SWT:1256): Gtk-WARNING **: 20:02:05.338: Negative content width -1 (allocation 1, extents 1x1) while allocating gadget (node trough, owner GtkProgressBar)
16:02:05 
16:02:05 (SWT:1256): Gtk-WARNING **: 20:02:05.342: Negative content height -1 (allocation 1, extents 1x1) while allocating gadget (node scrolledwindow, owner GtkScrolledWindow)
16:02:05 
16:02:05 (SWT:1256): Gtk-WARNING **: 20:02:05.510: Negative content width -6 (allocation 1, extents 4x3) while allocating gadget (node toolbar, owner GtkToolbar)
16:02:06 
16:02:06 (SWT:1256): Gtk-WARNING **: 20:02:06.726: Negative content width -1 (allocation 1, extents 1x1) while allocating gadget (node trough, owner GtkProgressBar)
16:02:06 
16:02:06 (SWT:1256): Gtk-WARNING **: 20:02:06.734: Negative content width -1 (allocation 1, extents 1x1) while allocating gadget (node trough, owner GtkProgressBar)
16:02:06 
16:02:06 (SWT:1256): Gtk-WARNING **: 20:02:06.821: Negative content width -6 (allocation 1, extents 4x3) while allocating gadget (node toolbar, owner GtkToolbar)
16:02:06 
16:02:06 (SWT:1256): Gtk-WARNING **: 20:02:06.840: Negative content width -1 (allocation 1, extents 1x1) while allocating gadget (node trough, owner GtkProgressBar)
16:02:06 
16:02:06 (SWT:1256): Gtk-WARNING **: 20:02:06.845: Negative content height -1 (allocation 1, extents 1x1) while allocating gadget (node scrolledwindow, owner GtkScrolledWindow)
16:02:07 
16:02:07 (SWT:1256): Gtk-WARNING **: 20:02:07.058: Negative content width -6 (allocation 1, extents 4x3) while allocating gadget (node toolbar, owner GtkToolbar)
16:02:08 
16:02:08 (SWT:1256): Gtk-WARNING **: 20:02:08.284: Negative content width -6 (allocation 1, extents 4x3) while allocating gadget (node toolbar, owner GtkToolbar)
16:02:08 
16:02:08 (SWT:1256): Gtk-WARNING **: 20:02:08.284: Negative content height -3 (allocation 1, extents 2x2) while allocating gadget (node toolbar, owner GtkToolbar)
16:02:08 
16:02:08 (SWT:1256): Gtk-WARNING **: 20:02:08.284: Negative content width -6 (allocation 1, extents 4x3) while allocating gadget (node toolbar, owner GtkToolbar)
16:02:08 
16:02:08 (SWT:1256): Gtk-WARNING **: 20:02:08.284: Negative content height -3 (allocation 1, extents 2x2) while allocating gadget (node toolbar, owner GtkToolbar)
16:02:08 
16:02:08 (SWT:1256): Gtk-WARNING **: 20:02:08.398: Negative content width -6 (allocation 1, extents 4x3) while allocating gadget (node toolbar, owner GtkToolbar)
16:02:08 
16:02:08 (SWT:1256): Gtk-WARNING **: 20:02:08.398: Negative content height -3 (allocation 1, extents 2x2) while allocating gadget (node toolbar, owner GtkToolbar)
16:02:08 
16:02:08 (SWT:1256): Gtk-WARNING **: 20:02:08.398: Negative content width -6 (allocation 1, extents 4x3) while allocating gadget (node toolbar, owner GtkToolbar)
16:02:08 
16:02:08 (SWT:1256): Gtk-WARNING **: 20:02:08.398: Negative content height -3 (allocation 1, extents 2x2) while allocating gadget (node toolbar, owner GtkToolbar)
16:02:09 
16:02:09 (SWT:1256): Gtk-WARNING **: 20:02:09.397: Negative content width -1 (allocation 1, extents 1x1) while allocating gadget (node trough, owner GtkProgressBar)
16:02:09 
16:02:09 (SWT:1256): Gtk-WARNING **: 20:02:09.783: Negative content width -1 (allocation 1, extents 1x1) while allocating gadget (node trough, owner GtkProgressBar)
16:02:09 
16:02:09 (SWT:1256): Gtk-WARNING **: 20:02:09.814: Negative content width -1 (allocation 1, extents 1x1) while allocating gadget (node trough, owner GtkProgressBar)
16:02:09 
16:02:09 (SWT:1256): Gtk-WARNING **: 20:02:09.896: Negative content width -6 (allocation 1, extents 4x3) while allocating gadget (node toolbar, owner GtkToolbar)
16:02:09 
16:02:09 (SWT:1256): Gtk-WARNING **: 20:02:09.940: Negative content width -6 (allocation 1, extents 4x3) while allocating gadget (node toolbar, owner GtkToolbar)
16:02:10 
16:02:10 (SWT:1256): Gtk-WARNING **: 20:02:10.324: Negative content width -1 (allocation 1, extents 1x1) while allocating gadget (node trough, owner GtkProgressBar)
16:02:10 
16:02:10 (SWT:1256): Gtk-WARNING **: 20:02:10.865: Negative content width -6 (allocation 1, extents 4x3) while allocating gadget (node toolbar, owner GtkToolbar)
16:02:10 
16:02:10 (SWT:1256): Gtk-WARNING **: 20:02:10.865: Negative content height -3 (allocation 1, extents 2x2) while allocating gadget (node toolbar, owner GtkToolbar)
16:02:10 
16:02:10 (SWT:1256): Gtk-WARNING **: 20:02:10.865: Negative content width -6 (allocation 1, extents 4x3) while allocating gadget (node toolbar, owner GtkToolbar)
16:02:10 
16:02:10 (SWT:1256): Gtk-WARNING **: 20:02:10.865: Negative content height -3 (allocation 1, extents 2x2) while allocating gadget (node toolbar, owner GtkToolbar)
16:02:10 
16:02:10 (SWT:1256): Gtk-WARNING **: 20:02:10.981: Negative content width -6 (allocation 1, extents 4x3) while allocating gadget (node toolbar, owner GtkToolbar)
16:02:10 
16:02:10 (SWT:1256): Gtk-WARNING **: 20:02:10.982: Negative content height -3 (allocation 1, extents 2x2) while allocating gadget (node toolbar, owner GtkToolbar)
16:02:10 
16:02:10 (SWT:1256): Gtk-WARNING **: 20:02:10.982: Negative content width -6 (allocation 1, extents 4x3) while allocating gadget (node toolbar, owner GtkToolbar)
16:02:10 
16:02:10 (SWT:1256): Gtk-WARNING **: 20:02:10.982: Negative content height -3 (allocation 1, extents 2x2) while allocating gadget (node toolbar, owner GtkToolbar)
16:02:11 
16:02:11 (SWT:1256): Gtk-WARNING **: 20:02:11.506: Negative content width -6 (allocation 1, extents 4x3) while allocating gadget (node toolbar, owner GtkToolbar)
16:02:11 
16:02:11 (SWT:1256): Gtk-WARNING **: 20:02:11.523: Negative content width -1 (allocation 1, extents 1x1) while allocating gadget (node trough, owner GtkProgressBar)
16:02:11 
16:02:11 (SWT:1256): Gtk-WARNING **: 20:02:11.527: Negative content height -1 (allocation 1, extents 1x1) while allocating gadget (node scrolledwindow, owner GtkScrolledWindow)
16:02:11 
16:02:11 (SWT:1256): Gtk-WARNING **: 20:02:11.732: Negative content width -6 (allocation 1, extents 4x3) while allocating gadget (node toolbar, owner GtkToolbar)
16:02:11 
16:02:11 (SWT:1256): Gtk-WARNING **: 20:02:11.732: Negative content height -3 (allocation 1, extents 2x2) while allocating gadget (node toolbar, owner GtkToolbar)
16:02:11 
16:02:11 (SWT:1256): Gtk-WARNING **: 20:02:11.732: Negative content width -6 (allocation 1, extents 4x3) while allocating gadget (node toolbar, owner GtkToolbar)
16:02:11 
16:02:11 (SWT:1256): Gtk-WARNING **: 20:02:11.732: Negative content height -3 (allocation 1, extents 2x2) while allocating gadget (node toolbar, owner GtkToolbar)
16:02:12 
16:02:12 (SWT:1256): Gtk-WARNING **: 20:02:12.107: Negative content width -6 (allocation 1, extents 4x3) while allocating gadget (node toolbar, owner GtkToolbar)
16:02:12 
16:02:12 (SWT:1256): Gtk-WARNING **: 20:02:12.111: Negative content width -6 (allocation 1, extents 4x3) while allocating gadget (node toolbar, owner GtkToolbar)
16:02:12 
16:02:12 (SWT:1256): Gtk-WARNING **: 20:02:12.116: Negative content width -6 (allocation 1, extents 4x3) while allocating gadget (node toolbar, owner GtkToolbar)
16:02:12 
16:02:12 (SWT:1256): Gtk-WARNING **: 20:02:12.122: Negative content width -6 (allocation 1, extents 4x3) while allocating gadget (node toolbar, owner GtkToolbar)
16:02:12 
16:02:12 (SWT:1256): Gtk-WARNING **: 20:02:12.146: Negative content width -6 (allocation 1, extents 4x3) while allocating gadget (node toolbar, owner GtkToolbar)
16:02:12 
16:02:12 (SWT:1256): Gtk-WARNING **: 20:02:12.147: Negative content width -6 (allocation 1, extents 4x3) while allocating gadget (node toolbar, owner GtkToolbar)
16:02:12 
16:02:12 (SWT:1256): Gtk-WARNING **: 20:02:12.182: Negative content width -6 (allocation 1, extents 4x3) while allocating gadget (node toolbar, owner GtkToolbar)
16:02:12 
16:02:12 (SWT:1256): Gtk-WARNING **: 20:02:12.183: Negative content width -6 (allocation 1, extents 4x3) while allocating gadget (node toolbar, owner GtkToolbar)
16:02:12 
16:02:12 (SWT:1256): Gtk-WARNING **: 20:02:12.342: Negative content width -6 (allocation 1, extents 4x3) while allocating gadget (node toolbar, owner GtkToolbar)
16:02:13 
16:02:13 (SWT:1256): Gtk-WARNING **: 20:02:13.733: Negative content width -1 (allocation 1, extents 1x1) while allocating gadget (node trough, owner GtkProgressBar)
16:02:13 
16:02:13 (SWT:1256): Gtk-WARNING **: 20:02:13.741: Negative content width -1 (allocation 1, extents 1x1) while allocating gadget (node trough, owner GtkProgressBar)
16:02:13 
16:02:13 (SWT:1256): Gtk-WARNING **: 20:02:13.813: Negative content width -6 (allocation 1, extents 4x3) while allocating gadget (node toolbar, owner GtkToolbar)
16:02:13 
16:02:13 (SWT:1256): Gtk-WARNING **: 20:02:13.825: Negative content width -1 (allocation 1, extents 1x1) while allocating gadget (node trough, owner GtkProgressBar)
16:02:13 
16:02:13 (SWT:1256): Gtk-WARNING **: 20:02:13.829: Negative content height -1 (allocation 1, extents 1x1) while allocating gadget (node scrolledwindow, owner GtkScrolledWindow)
16:02:13 
16:02:13 (SWT:1256): Gtk-WARNING **: 20:02:13.841: Negative content height -1 (allocation 1, extents 1x1) while allocating gadget (node scrolledwindow, owner GtkScrolledWindow)
16:02:14 
16:02:14 (SWT:1256): Gtk-WARNING **: 20:02:14.199: Negative content width -6 (allocation 1, extents 4x3) while allocating gadget (node toolbar, owner GtkToolbar)
16:02:15 
16:02:15 (SWT:1256): Gtk-WARNING **: 20:02:15.686: Negative content width -6 (allocation 1, extents 4x3) while allocating gadget (node toolbar, owner GtkToolbar)
16:02:15 
16:02:15 (SWT:1256): Gtk-WARNING **: 20:02:15.686: Negative content height -3 (allocation 1, extents 2x2) while allocating gadget (node toolbar, owner GtkToolbar)
16:02:15 
16:02:15 (SWT:1256): Gtk-WARNING **: 20:02:15.686: Negative content width -6 (allocation 1, extents 4x3) while allocating gadget (node toolbar, owner GtkToolbar)
16:02:15 
16:02:15 (SWT:1256): Gtk-WARNING **: 20:02:15.686: Negative content height -3 (allocation 1, extents 2x2) while allocating gadget (node toolbar, owner GtkToolbar)
16:02:15 
16:02:15 (SWT:1256): Gtk-WARNING **: 20:02:15.813: Negative content width -6 (allocation 1, extents 4x3) while allocating gadget (node toolbar, owner GtkToolbar)
16:02:15 
16:02:15 (SWT:1256): Gtk-WARNING **: 20:02:15.813: Negative content height -3 (allocation 1, extents 2x2) while allocating gadget (node toolbar, owner GtkToolbar)
16:02:15 
16:02:15 (SWT:1256): Gtk-WARNING **: 20:02:15.813: Negative content width -6 (allocation 1, extents 4x3) while allocating gadget (node toolbar, owner GtkToolbar)
16:02:15 
16:02:15 (SWT:1256): Gtk-WARNING **: 20:02:15.813: Negative content height -3 (allocation 1, extents 2x2) while allocating gadget (node toolbar, owner GtkToolbar)
16:02:16 
16:02:16 (SWT:1256): Gtk-WARNING **: 20:02:16.377: Negative content width -6 (allocation 1, extents 4x3) while allocating gadget (node toolbar, owner GtkToolbar)
16:02:16 
16:02:16 (SWT:1256): Gtk-WARNING **: 20:02:16.392: Negative content width -1 (allocation 1, extents 1x1) while allocating gadget (node trough, owner GtkProgressBar)
16:02:16 
16:02:16 (SWT:1256): Gtk-WARNING **: 20:02:16.399: Negative content height -1 (allocation 1, extents 1x1) while allocating gadget (node scrolledwindow, owner GtkScrolledWindow)
16:02:16 
16:02:16 (SWT:1256): Gtk-WARNING **: 20:02:16.613: Negative content width -6 (allocation 1, extents 4x3) while allocating gadget (node toolbar, owner GtkToolbar)
16:02:16 Tests run: 16, Failures: 0, Errors: 0, Skipped: 1, Time elapsed: 39.741 s - in org.eclipse.egit.ui.view.synchronize.SynchronizeViewGitChangeSetModelTest
16:02:16 shouldListFileDeletedChange(org.eclipse.egit.ui.view.synchronize.SynchronizeViewGitChangeSetModelTest)  Time elapsed: 2.463 s
16:02:16 shouldReturnListOfChanges(org.eclipse.egit.ui.view.synchronize.SynchronizeViewGitChangeSetModelTest)  Time elapsed: 1.88 s
16:02:16 shouldShowNonWorkspaceFileInSynchronization(org.eclipse.egit.ui.view.synchronize.SynchronizeViewGitChangeSetModelTest)  Time elapsed: 2.92 s
16:02:16 shouldRefreshSyncResultAfterRepositoryChange(org.eclipse.egit.ui.view.synchronize.SynchronizeViewGitChangeSetModelTest)  Time elapsed: 3.499 s
16:02:16 shouldOpenCompareEditor(org.eclipse.egit.ui.view.synchronize.SynchronizeViewGitChangeSetModelTest)  Time elapsed: 3.444 s
16:02:16 shouldLaunchSynchronizationFromGitRepositories(org.eclipse.egit.ui.view.synchronize.SynchronizeViewGitChangeSetModelTest) skipped
16:02:16 shouldShowCompareEditorForNonWorkspaceFileFromSynchronization(org.eclipse.egit.ui.view.synchronize.SynchronizeViewGitChangeSetModelTest)  Time elapsed: 1.98 s
16:02:16 shouldSynchronizeInEmptyRepository(org.eclipse.egit.ui.view.synchronize.SynchronizeViewGitChangeSetModelTest)  Time elapsed: 2.929 s
16:02:16 shouldUnStagePartialChangeInCompareEditor(org.eclipse.egit.ui.view.synchronize.SynchronizeViewGitChangeSetModelTest)  Time elapsed: 2.385 s
16:02:16 shouldExchangeCompareEditorSidesBetweenIncomingAndOutgoingChanges(org.eclipse.egit.ui.view.synchronize.SynchronizeViewGitChangeSetModelTest)  Time elapsed: 4.419 s
16:02:16 shouldCompareBranchAgainstTag(org.eclipse.egit.ui.view.synchronize.SynchronizeViewGitChangeSetModelTest)  Time elapsed: 2.638 s
16:02:16 shouldNotShowIgnoredFiles(org.eclipse.egit.ui.view.synchronize.SynchronizeViewGitChangeSetModelTest)  Time elapsed: 1.766 s
16:02:16 shouldCompareTagAgainstTag(org.eclipse.egit.ui.view.synchronize.SynchronizeViewGitChangeSetModelTest)  Time elapsed: 2.672 s
16:02:16 shouldStagePartialChangeInCompareEditor(org.eclipse.egit.ui.view.synchronize.SynchronizeViewGitChangeSetModelTest)  Time elapsed: 2.518 s
16:02:16 shouldRefreshSyncResultAfterWorkspaceChange(org.eclipse.egit.ui.view.synchronize.SynchronizeViewGitChangeSetModelTest)  Time elapsed: 1.711 s
16:02:16 shouldReturnNoChanges(org.eclipse.egit.ui.view.synchronize.SynchronizeViewGitChangeSetModelTest)  Time elapsed: 2.449 s
16:02:16 Running org.eclipse.egit.ui.view.synchronize.SynchronizeViewPushTest
16:02:17 
16:02:17 (SWT:1256): Gtk-WARNING **: 20:02:17.552: Negative content width -6 (allocation 1, extents 4x3) while allocating gadget (node toolbar, owner GtkToolbar)
16:02:17 
16:02:17 (SWT:1256): Gtk-WARNING **: 20:02:17.552: Negative content height -3 (allocation 1, extents 2x2) while allocating gadget (node toolbar, owner GtkToolbar)
16:02:17 
16:02:17 (SWT:1256): Gtk-WARNING **: 20:02:17.552: Negative content width -6 (allocation 1, extents 4x3) while allocating gadget (node toolbar, owner GtkToolbar)
16:02:17 
16:02:17 (SWT:1256): Gtk-WARNING **: 20:02:17.552: Negative content height -3 (allocation 1, extents 2x2) while allocating gadget (node toolbar, owner GtkToolbar)
16:02:17 
16:02:17 (SWT:1256): Gtk-WARNING **: 20:02:17.701: Negative content width -6 (allocation 1, extents 4x3) while allocating gadget (node toolbar, owner GtkToolbar)
16:02:17 
16:02:17 (SWT:1256): Gtk-WARNING **: 20:02:17.701: Negative content height -3 (allocation 1, extents 2x2) while allocating gadget (node toolbar, owner GtkToolbar)
16:02:17 
16:02:17 (SWT:1256): Gtk-WARNING **: 20:02:17.701: Negative content width -6 (allocation 1, extents 4x3) while allocating gadget (node toolbar, owner GtkToolbar)
16:02:17 
16:02:17 (SWT:1256): Gtk-WARNING **: 20:02:17.701: Negative content height -3 (allocation 1, extents 2x2) while allocating gadget (node toolbar, owner GtkToolbar)
16:02:19 
16:02:19 (SWT:1256): Gtk-WARNING **: 20:02:19.213: Negative content width -6 (allocation 1, extents 4x3) while allocating gadget (node toolbar, owner GtkToolbar)
16:02:19 
16:02:19 (SWT:1256): Gtk-WARNING **: 20:02:19.231: Negative content width -1 (allocation 1, extents 1x1) while allocating gadget (node trough, owner GtkProgressBar)
16:02:19 
16:02:19 (SWT:1256): Gtk-WARNING **: 20:02:19.236: Negative content height -1 (allocation 1, extents 1x1) while allocating gadget (node scrolledwindow, owner GtkScrolledWindow)
16:02:19 
16:02:19 (SWT:1256): Gtk-WARNING **: 20:02:19.750: Negative content width -1 (allocation 1, extents 1x1) while allocating gadget (node trough, owner GtkProgressBar)
16:02:19 
16:02:19 (SWT:1256): Gtk-WARNING **: 20:02:19.885: Negative content width -6 (allocation 1, extents 4x3) while allocating gadget (node toolbar, owner GtkToolbar)
16:02:20 Tests run: 1, Failures: 0, Errors: 0, Skipped: 0, Time elapsed: 3.233 s - in org.eclipse.egit.ui.view.synchronize.SynchronizeViewPushTest
16:02:20 shouldUpdateTrackingBranchOnPush(org.eclipse.egit.ui.view.synchronize.SynchronizeViewPushTest)  Time elapsed: 3.226 s
16:02:20 Running org.eclipse.egit.ui.wizards.clone.GitCloneSourceProviderExtensionTest
16:02:20 Tests run: 1, Failures: 0, Errors: 0, Skipped: 0, Time elapsed: 0.001 s - in org.eclipse.egit.ui.wizards.clone.GitCloneSourceProviderExtensionTest
16:02:20 testGetRepositoryImports(org.eclipse.egit.ui.wizards.clone.GitCloneSourceProviderExtensionTest)  Time elapsed: 0.001 s
16:02:20 Running org.eclipse.egit.ui.wizards.clone.GitCloneWizardHttpTest
16:02:20 2019-03-21 20:02:20.404:INFO:oejs.Server:WorkbenchTestable: jetty-9.4.14.v20181114; built: 2019-01-14T17:18:45.591Z; git: c4550056e785fb5665914545889f21dc136ad9e6; jvm 1.8.0_202-b08
16:02:20 2019-03-21 20:02:20.405:INFO:oejsh.ContextHandler:WorkbenchTestable: Started o.e.j.s.ServletContextHandler@5ebf8dfa{/sbasic,null,AVAILABLE}
16:02:20 2019-03-21 20:02:20.409:INFO:oejs.AbstractConnector:WorkbenchTestable: Started ServerConnector@3fb550a5{HTTP/1.1,[http/1.1]}{127.0.0.1:42386}
16:02:20 2019-03-21 20:02:20.409:INFO:oejs.Server:WorkbenchTestable: Started @783452ms
16:02:21 2019-03-21 20:02:21.986:INFO:oejs.AbstractConnector:WorkbenchTestable: Stopped ServerConnector@3fb550a5{HTTP/1.1,[http/1.1]}{127.0.0.1:0}
16:02:21 2019-03-21 20:02:21.987:INFO:oejsh.ContextHandler:WorkbenchTestable: Stopped o.e.j.s.ServletContextHandler@5ebf8dfa{/sbasic,null,UNAVAILABLE}
16:02:22 Tests run: 1, Failures: 0, Errors: 0, Skipped: 0, Time elapsed: 1.93 s - in org.eclipse.egit.ui.wizards.clone.GitCloneWizardHttpTest
16:02:22 canCloneARemoteRepo(org.eclipse.egit.ui.wizards.clone.GitCloneWizardHttpTest)  Time elapsed: 1.576 s
16:02:22 Running org.eclipse.egit.ui.wizards.clone.GitCloneWizardTest
16:02:29 Tests run: 9, Failures: 0, Errors: 0, Skipped: 2, Time elapsed: 7.714 s - in org.eclipse.egit.ui.wizards.clone.GitCloneWizardTest
16:02:29 canCloneARemoteRepo(org.eclipse.egit.ui.wizards.clone.GitCloneWizardTest)  Time elapsed: 2.427 s
16:02:29 invalidPortFreezesDialog(org.eclipse.egit.ui.wizards.clone.GitCloneWizardTest) skipped
16:02:29 updatesParameterFieldsInImportDialogWhenURIIsUpdated(org.eclipse.egit.ui.wizards.clone.GitCloneWizardTest)  Time elapsed: 0.83 s
16:02:29 clonedRepositoryShouldExistOnFileSystem(org.eclipse.egit.ui.wizards.clone.GitCloneWizardTest)  Time elapsed: 1.529 s
16:02:29 alteringSomeParametersDuringClone(org.eclipse.egit.ui.wizards.clone.GitCloneWizardTest)  Time elapsed: 1.448 s
16:02:29 gitStyleUriSelectsSshProtocol(org.eclipse.egit.ui.wizards.clone.GitCloneWizardTest)  Time elapsed: 0.305 s
16:02:29 invalidHostnameFreezesDialog(org.eclipse.egit.ui.wizards.clone.GitCloneWizardTest) skipped
16:02:29 acceptCloneCommandAsURI(org.eclipse.egit.ui.wizards.clone.GitCloneWizardTest)  Time elapsed: 0.356 s
16:02:29 testFileURIWithSpace(org.eclipse.egit.ui.wizards.clone.GitCloneWizardTest)  Time elapsed: 0.323 s
16:02:29 Running org.eclipse.egit.ui.wizards.clone.GitCloneWizardHttpsTest
16:02:30 2019-03-21 20:02:30.422:INFO:oejs.Server:WorkbenchTestable: jetty-9.4.14.v20181114; built: 2019-01-14T17:18:45.591Z; git: c4550056e785fb5665914545889f21dc136ad9e6; jvm 1.8.0_202-b08
16:02:30 2019-03-21 20:02:30.423:INFO:oejsh.ContextHandler:WorkbenchTestable: Started o.e.j.s.ServletContextHandler@7096b80c{/sbasic,null,AVAILABLE}
16:02:30 2019-03-21 20:02:30.427:INFO:oejs.AbstractConnector:WorkbenchTestable: Started ServerConnector@270b3d8e{HTTP/1.1,[http/1.1]}{127.0.0.1:38904}
16:02:30 2019-03-21 20:02:30.434:INFO:oejus.SslContextFactory:WorkbenchTestable: x509=X509@6d085b99(migration-agent-l4lrk,h=[],w=[]) for SslContextFactory@2289a5c7[provider=null,keyStore=file:///tmp/jks8915298544864740835/keystore.jks,trustStore=file:///tmp/jks8915298544864740835/keystore.jks]
16:02:30 2019-03-21 20:02:30.536:WARN:oejusS.config:WorkbenchTestable: Trusting all certificates configured for SslContextFactory@2289a5c7[provider=null,keyStore=file:///tmp/jks8915298544864740835/keystore.jks,trustStore=file:///tmp/jks8915298544864740835/keystore.jks]
16:02:30 2019-03-21 20:02:30.537:WARN:oejusS.config:WorkbenchTestable: No Client EndPointIdentificationAlgorithm configured for SslContextFactory@2289a5c7[provider=null,keyStore=file:///tmp/jks8915298544864740835/keystore.jks,trustStore=file:///tmp/jks8915298544864740835/keystore.jks]
16:02:30 2019-03-21 20:02:30.542:INFO:oejs.AbstractConnector:WorkbenchTestable: Started ServerConnector@6a4957ff{SSL,[ssl, http/1.1]}{127.0.0.1:40520}
16:02:30 2019-03-21 20:02:30.543:INFO:oejs.Server:WorkbenchTestable: Started @793585ms
16:02:33 2019-03-21 20:02:33.054:INFO:oejs.AbstractConnector:WorkbenchTestable: Stopped ServerConnector@270b3d8e{HTTP/1.1,[http/1.1]}{127.0.0.1:0}
16:02:33 2019-03-21 20:02:33.055:INFO:oejs.AbstractConnector:WorkbenchTestable: Stopped ServerConnector@6a4957ff{SSL,[ssl, http/1.1]}{127.0.0.1:0}
16:02:33 2019-03-21 20:02:33.055:INFO:oejsh.ContextHandler:WorkbenchTestable: Stopped o.e.j.s.ServletContextHandler@7096b80c{/sbasic,null,UNAVAILABLE}
16:02:33 Tests run: 1, Failures: 0, Errors: 0, Skipped: 0, Time elapsed: 3.349 s - in org.eclipse.egit.ui.wizards.clone.GitCloneWizardHttpsTest
16:02:33 canCloneARemoteRepo(org.eclipse.egit.ui.wizards.clone.GitCloneWizardHttpsTest)  Time elapsed: 2.511 s
16:02:33 Running org.eclipse.egit.ui.wizards.pull.PullWizardTest
16:02:33 
16:02:33 (SWT:1256): Gtk-WARNING **: 20:02:33.830: Negative content width -6 (allocation 1, extents 4x3) while allocating gadget (node toolbar, owner GtkToolbar)
16:02:36 
16:02:36 (SWT:1256): Gtk-WARNING **: 20:02:36.305: Negative content width -6 (allocation 1, extents 4x3) while allocating gadget (node toolbar, owner GtkToolbar)
16:02:36 Tests run: 1, Failures: 0, Errors: 0, Skipped: 0, Time elapsed: 3.309 s - in org.eclipse.egit.ui.wizards.pull.PullWizardTest
16:02:36 pullFromProjectRepo(org.eclipse.egit.ui.wizards.pull.PullWizardTest)  Time elapsed: 3.301 s
16:02:36 Running org.eclipse.egit.ui.wizards.share.SharingWizardTest
16:02:36 
16:02:36 (SWT:1256): Gtk-CRITICAL **: 20:02:36.479: gtk_box_gadget_distribute: assertion 'size >= 0' failed in GtkScrollbar
16:02:36 
16:02:36 (SWT:1256): Gtk-WARNING **: 20:02:36.480: Negative content width -13 (allocation 5, extents 9x9) while allocating gadget (node entry, owner GtkEntry)
16:02:36 
16:02:36 (SWT:1256): Gtk-WARNING **: 20:02:36.480: Negative content height -1 (allocation 1, extents 1x1) while allocating gadget (node scrolledwindow, owner GtkScrolledWindow)
16:02:36 
16:02:36 (SWT:1256): Gtk-CRITICAL **: 20:02:36.480: gtk_box_gadget_distribute: assertion 'size >= 0' failed in GtkScrollbar
16:02:36 
16:02:36 (SWT:1256): Gtk-CRITICAL **: 20:02:36.481: gtk_box_gadget_distribute: assertion 'size >= 0' failed in GtkScrollbar
16:02:37 
16:02:37 (SWT:1256): Gtk-CRITICAL **: 20:02:37.106: gtk_box_gadget_distribute: assertion 'size >= 0' failed in GtkScrollbar
16:02:37 
16:02:37 (SWT:1256): Gtk-WARNING **: 20:02:37.107: Negative content width -13 (allocation 5, extents 9x9) while allocating gadget (node entry, owner GtkEntry)
16:02:37 
16:02:37 (SWT:1256): Gtk-WARNING **: 20:02:37.107: Negative content height -1 (allocation 1, extents 1x1) while allocating gadget (node scrolledwindow, owner GtkScrolledWindow)
16:02:37 
16:02:37 (SWT:1256): Gtk-CRITICAL **: 20:02:37.107: gtk_box_gadget_distribute: assertion 'size >= 0' failed in GtkScrollbar
16:02:37 
16:02:37 (SWT:1256): Gtk-CRITICAL **: 20:02:37.107: gtk_box_gadget_distribute: assertion 'size >= 0' failed in GtkScrollbar
16:02:37 
16:02:37 (SWT:1256): Gtk-CRITICAL **: 20:02:37.714: gtk_box_gadget_distribute: assertion 'size >= 0' failed in GtkScrollbar
16:02:37 
16:02:37 (SWT:1256): Gtk-WARNING **: 20:02:37.714: Negative content width -13 (allocation 5, extents 9x9) while allocating gadget (node entry, owner GtkEntry)
16:02:37 
16:02:37 (SWT:1256): Gtk-WARNING **: 20:02:37.715: Negative content height -1 (allocation 1, extents 1x1) while allocating gadget (node scrolledwindow, owner GtkScrolledWindow)
16:02:37 
16:02:37 (SWT:1256): Gtk-CRITICAL **: 20:02:37.715: gtk_box_gadget_distribute: assertion 'size >= 0' failed in GtkScrollbar
16:02:37 
16:02:37 (SWT:1256): Gtk-CRITICAL **: 20:02:37.715: gtk_box_gadget_distribute: assertion 'size >= 0' failed in GtkScrollbar
16:02:37 
16:02:37 (SWT:1256): Gtk-CRITICAL **: 20:02:37.894: gtk_box_gadget_distribute: assertion 'size >= 0' failed in GtkScrollbar
16:02:37 
16:02:37 (SWT:1256): Gtk-WARNING **: 20:02:37.895: Negative content width -13 (allocation 5, extents 9x9) while allocating gadget (node entry, owner GtkEntry)
16:02:37 
16:02:37 (SWT:1256): Gtk-WARNING **: 20:02:37.895: Negative content height -1 (allocation 1, extents 1x1) while allocating gadget (node scrolledwindow, owner GtkScrolledWindow)
16:02:37 
16:02:37 (SWT:1256): Gtk-CRITICAL **: 20:02:37.895: gtk_box_gadget_distribute: assertion 'size >= 0' failed in GtkScrollbar
16:02:37 
16:02:37 (SWT:1256): Gtk-CRITICAL **: 20:02:37.895: gtk_box_gadget_distribute: assertion 'size >= 0' failed in GtkScrollbar
16:02:39 
16:02:39 (SWT:1256): Gtk-CRITICAL **: 20:02:39.098: gtk_box_gadget_distribute: assertion 'size >= 0' failed in GtkScrollbar
16:02:39 
16:02:39 (SWT:1256): Gtk-WARNING **: 20:02:39.099: Negative content width -13 (allocation 5, extents 9x9) while allocating gadget (node entry, owner GtkEntry)
16:02:39 
16:02:39 (SWT:1256): Gtk-WARNING **: 20:02:39.099: Negative content height -1 (allocation 1, extents 1x1) while allocating gadget (node scrolledwindow, owner GtkScrolledWindow)
16:02:39 
16:02:39 (SWT:1256): Gtk-CRITICAL **: 20:02:39.099: gtk_box_gadget_distribute: assertion 'size >= 0' failed in GtkScrollbar
16:02:39 
16:02:39 (SWT:1256): Gtk-CRITICAL **: 20:02:39.099: gtk_box_gadget_distribute: assertion 'size >= 0' failed in GtkScrollbar
16:02:39 
16:02:39 (SWT:1256): Gtk-CRITICAL **: 20:02:39.235: gtk_box_gadget_distribute: assertion 'size >= 0' failed in GtkScrollbar
16:02:39 
16:02:39 (SWT:1256): Gtk-WARNING **: 20:02:39.236: Negative content width -13 (allocation 5, extents 9x9) while allocating gadget (node entry, owner GtkEntry)
16:02:39 
16:02:39 (SWT:1256): Gtk-WARNING **: 20:02:39.236: Negative content height -1 (allocation 1, extents 1x1) while allocating gadget (node scrolledwindow, owner GtkScrolledWindow)
16:02:39 
16:02:39 (SWT:1256): Gtk-CRITICAL **: 20:02:39.236: gtk_box_gadget_distribute: assertion 'size >= 0' failed in GtkScrollbar
16:02:39 
16:02:39 (SWT:1256): Gtk-CRITICAL **: 20:02:39.236: gtk_box_gadget_distribute: assertion 'size >= 0' failed in GtkScrollbar
16:02:39 
16:02:39 (SWT:1256): Gtk-CRITICAL **: 20:02:39.382: gtk_box_gadget_distribute: assertion 'size >= 0' failed in GtkScrollbar
16:02:39 
16:02:39 (SWT:1256): Gtk-WARNING **: 20:02:39.382: Negative content width -13 (allocation 5, extents 9x9) while allocating gadget (node entry, owner GtkEntry)
16:02:39 
16:02:39 (SWT:1256): Gtk-WARNING **: 20:02:39.383: Negative content height -1 (allocation 1, extents 1x1) while allocating gadget (node scrolledwindow, owner GtkScrolledWindow)
16:02:39 
16:02:39 (SWT:1256): Gtk-CRITICAL **: 20:02:39.383: gtk_box_gadget_distribute: assertion 'size >= 0' failed in GtkScrollbar
16:02:39 
16:02:39 (SWT:1256): Gtk-CRITICAL **: 20:02:39.383: gtk_box_gadget_distribute: assertion 'size >= 0' failed in GtkScrollbar
16:02:40 
16:02:40 (SWT:1256): Gtk-CRITICAL **: 20:02:40.403: gtk_box_gadget_distribute: assertion 'size >= 0' failed in GtkScrollbar
16:02:40 
16:02:40 (SWT:1256): Gtk-WARNING **: 20:02:40.404: Negative content width -13 (allocation 5, extents 9x9) while allocating gadget (node entry, owner GtkEntry)
16:02:40 
16:02:40 (SWT:1256): Gtk-WARNING **: 20:02:40.404: Negative content height -1 (allocation 1, extents 1x1) while allocating gadget (node scrolledwindow, owner GtkScrolledWindow)
16:02:40 
16:02:40 (SWT:1256): Gtk-CRITICAL **: 20:02:40.404: gtk_box_gadget_distribute: assertion 'size >= 0' failed in GtkScrollbar
16:02:40 
16:02:40 (SWT:1256): Gtk-CRITICAL **: 20:02:40.404: gtk_box_gadget_distribute: assertion 'size >= 0' failed in GtkScrollbar
16:02:41 Tests run: 3, Failures: 0, Errors: 0, Skipped: 0, Time elapsed: 5.428 s - in org.eclipse.egit.ui.wizards.share.SharingWizardTest
16:02:41 shareProjectWithExternalRepo(org.eclipse.egit.ui.wizards.share.SharingWizardTest)  Time elapsed: 2.645 s
16:02:41 shareProjectWithAlreadyCreatedRepos(org.eclipse.egit.ui.wizards.share.SharingWizardTest)  Time elapsed: 1.299 s
16:02:41 shareProjectAndCreateRepo(org.eclipse.egit.ui.wizards.share.SharingWizardTest)  Time elapsed: 1.479 s
16:02:41 Running org.eclipse.egit.ui.search.CommitSearchQueryTest
16:02:46 Tests run: 7, Failures: 0, Errors: 0, Skipped: 0, Time elapsed: 4.26 s - in org.eclipse.egit.ui.search.CommitSearchQueryTest
16:02:46 testQuery(org.eclipse.egit.ui.search.CommitSearchQueryTest)  Time elapsed: 0.589 s
16:02:46 testMatchMessage(org.eclipse.egit.ui.search.CommitSearchQueryTest)  Time elapsed: 0.609 s
16:02:46 testCaseInsensitive(org.eclipse.egit.ui.search.CommitSearchQueryTest)  Time elapsed: 0.59 s
16:02:46 testMatchCommit(org.eclipse.egit.ui.search.CommitSearchQueryTest)  Time elapsed: 0.594 s
16:02:46 testMatchParent(org.eclipse.egit.ui.search.CommitSearchQueryTest)  Time elapsed: 0.591 s
16:02:46 testMatchTree(org.eclipse.egit.ui.search.CommitSearchQueryTest)  Time elapsed: 0.659 s
16:02:46 testEmptyMatches(org.eclipse.egit.ui.search.CommitSearchQueryTest)  Time elapsed: 0.578 s
16:02:46 Running org.eclipse.egit.ui.search.CommitSearchDialogTest
16:02:46 
16:02:46 (SWT:1256): Gtk-WARNING **: 20:02:46.861: Negative content width -6 (allocation 1, extents 4x3) while allocating gadget (node toolbar, owner GtkToolbar)
16:02:46 
16:02:46 (SWT:1256): Gtk-WARNING **: 20:02:46.877: Negative content width -6 (allocation 1, extents 4x3) while allocating gadget (node toolbar, owner GtkToolbar)
16:02:46 
16:02:46 (SWT:1256): Gtk-WARNING **: 20:02:46.973: Negative content width -6 (allocation 1, extents 4x3) while allocating gadget (node toolbar, owner GtkToolbar)
16:02:47 
16:02:47 (SWT:1256): Gtk-WARNING **: 20:02:47.018: Negative content width -6 (allocation 1, extents 4x3) while allocating gadget (node toolbar, owner GtkToolbar)
16:02:47 
16:02:47 (SWT:1256): Gtk-WARNING **: 20:02:47.718: Negative content width -6 (allocation 1, extents 4x3) while allocating gadget (node toolbar, owner GtkToolbar)
16:02:47 Tests run: 1, Failures: 0, Errors: 0, Skipped: 0, Time elapsed: 1.783 s - in org.eclipse.egit.ui.search.CommitSearchDialogTest
16:02:47 openCommitTabOnSearchDialog(org.eclipse.egit.ui.search.CommitSearchDialogTest)  Time elapsed: 1.779 s
16:02:47 Running org.eclipse.egit.ui.prefpages.configuration.GlobalConfigurationPageTest
16:02:47 
16:02:47 !ENTRY org.eclipse.ui 2 2 2019-03-21 20:02:47.923
16:02:47 !MESSAGE Invalid preference category path: org.eclipse.ui.net.NetPreferences (bundle: org.eclipse.jsch.ui, page: org.eclipse.jsch.ui.SSHPreferences)
16:02:47 
16:02:47 (SWT:1256): Gtk-WARNING **: 20:02:47.936: Negative content width -13 (allocation 5, extents 9x9) while allocating gadget (node entry, owner GtkEntry)
16:02:48 
16:02:48 (SWT:1256): Gtk-WARNING **: 20:02:48.106: Negative content width -13 (allocation 5, extents 9x9) while allocating gadget (node entry, owner GtkEntry)
16:02:48 
16:02:48 (SWT:1256): Gtk-WARNING **: 20:02:48.276: Negative content width -13 (allocation 5, extents 9x9) while allocating gadget (node entry, owner GtkEntry)
16:02:48 
16:02:48 (SWT:1256): Gtk-WARNING **: 20:02:48.441: Negative content width -13 (allocation 5, extents 9x9) while allocating gadget (node entry, owner GtkEntry)
16:02:48 
16:02:48 (SWT:1256): Gtk-WARNING **: 20:02:48.536: Negative content width -13 (allocation 5, extents 9x9) while allocating gadget (node entry, owner GtkEntry)
16:02:48 
16:02:48 (SWT:1256): Gtk-WARNING **: 20:02:48.640: Negative content width -13 (allocation 5, extents 9x9) while allocating gadget (node entry, owner GtkEntry)
16:02:48 
16:02:48 (SWT:1256): Gtk-WARNING **: 20:02:48.797: Negative content width -13 (allocation 5, extents 9x9) while allocating gadget (node entry, owner GtkEntry)
16:02:48 
16:02:48 (SWT:1256): Gtk-WARNING **: 20:02:48.862: Negative content width -6 (allocation 1, extents 4x3) while allocating gadget (node toolbar, owner GtkToolbar)
16:02:48 
16:02:48 (SWT:1256): Gtk-WARNING **: 20:02:48.862: Negative content height -3 (allocation 1, extents 2x2) while allocating gadget (node toolbar, owner GtkToolbar)
16:02:48 
16:02:48 (SWT:1256): Gtk-WARNING **: 20:02:48.862: Negative content width -6 (allocation 1, extents 4x3) while allocating gadget (node toolbar, owner GtkToolbar)
16:02:48 
16:02:48 (SWT:1256): Gtk-WARNING **: 20:02:48.862: Negative content height -3 (allocation 1, extents 2x2) while allocating gadget (node toolbar, owner GtkToolbar)
16:02:49 
16:02:49 (SWT:1256): Gtk-WARNING **: 20:02:48.999: Negative content width -13 (allocation 5, extents 9x9) while allocating gadget (node entry, owner GtkEntry)
16:02:49 
16:02:49 (SWT:1256): Gtk-WARNING **: 20:02:49.154: Negative content width -13 (allocation 5, extents 9x9) while allocating gadget (node entry, owner GtkEntry)
16:02:49 
16:02:49 (SWT:1256): Gtk-WARNING **: 20:02:49.341: Negative content width -13 (allocation 5, extents 9x9) while allocating gadget (node entry, owner GtkEntry)
16:02:49 
16:02:49 (SWT:1256): Gtk-WARNING **: 20:02:49.497: Negative content width -13 (allocation 5, extents 9x9) while allocating gadget (node entry, owner GtkEntry)
16:02:49 
16:02:49 (SWT:1256): Gtk-WARNING **: 20:02:49.653: Negative content width -13 (allocation 5, extents 9x9) while allocating gadget (node entry, owner GtkEntry)
16:02:49 Tests run: 11, Failures: 0, Errors: 0, Skipped: 0, Time elapsed: 1.92 s - in org.eclipse.egit.ui.prefpages.configuration.GlobalConfigurationPageTest
16:02:49 testAddSubSectionEntry(org.eclipse.egit.ui.prefpages.configuration.GlobalConfigurationPageTest)  Time elapsed: 0.196 s
16:02:49 testAddSectionEntry(org.eclipse.egit.ui.prefpages.configuration.GlobalConfigurationPageTest)  Time elapsed: 0.169 s
16:02:49 testCanCreateSameEntryValue(org.eclipse.egit.ui.prefpages.configuration.GlobalConfigurationPageTest)  Time elapsed: 0.164 s
16:02:49 testNodes(org.eclipse.egit.ui.prefpages.configuration.GlobalConfigurationPageTest)  Time elapsed: 0.097 s
16:02:49 testRemoveValue(org.eclipse.egit.ui.prefpages.configuration.GlobalConfigurationPageTest)  Time elapsed: 0.103 s
16:02:49 testAddSubSectionEntryWithSuggestion(org.eclipse.egit.ui.prefpages.configuration.GlobalConfigurationPageTest)  Time elapsed: 0.157 s
16:02:49 testOpenEditor(org.eclipse.egit.ui.prefpages.configuration.GlobalConfigurationPageTest)  Time elapsed: 0.202 s
16:02:49 testSubsectionWithDot(org.eclipse.egit.ui.prefpages.configuration.GlobalConfigurationPageTest)  Time elapsed: 0.155 s
16:02:49 testChecksForKey(org.eclipse.egit.ui.prefpages.configuration.GlobalConfigurationPageTest)  Time elapsed: 0.185 s
16:02:49 testRemoveSubSection(org.eclipse.egit.ui.prefpages.configuration.GlobalConfigurationPageTest)  Time elapsed: 0.158 s
16:02:49 testRemoveSection(org.eclipse.egit.ui.prefpages.configuration.GlobalConfigurationPageTest)  Time elapsed: 0.155 s
16:02:49 Running org.eclipse.egit.ui.operations.GitScopeUtilTest
16:02:54 Tests run: 5, Failures: 0, Errors: 0, Skipped: 0, Time elapsed: 4.875 s - in org.eclipse.egit.ui.operations.GitScopeUtilTest
16:02:54 relatedChangesWithPrompt(org.eclipse.egit.ui.operations.GitScopeUtilTest)  Time elapsed: 1.865 s
16:02:54 modelProviderWithExtensionFiles(org.eclipse.egit.ui.operations.GitScopeUtilTest)  Time elapsed: 0.654 s
16:02:54 relatedChangesWithInvalidParams(org.eclipse.egit.ui.operations.GitScopeUtilTest)  Time elapsed: 0.582 s
16:02:54 relatedChangesWithNullResources(org.eclipse.egit.ui.operations.GitScopeUtilTest)  Time elapsed: 0.581 s
16:02:54 relatedChangesWithEmptyResources(org.eclipse.egit.ui.operations.GitScopeUtilTest)  Time elapsed: 1.19 s
16:02:54 Running org.eclipse.egit.ui.variables.DynamicVariablesTest
16:02:59 Tests run: 4, Failures: 0, Errors: 0, Skipped: 0, Time elapsed: 4.433 s - in org.eclipse.egit.ui.variables.DynamicVariablesTest
16:02:59 testGitBranch(org.eclipse.egit.ui.variables.DynamicVariablesTest)  Time elapsed: 1.11 s
16:02:59 testGitPath(org.eclipse.egit.ui.variables.DynamicVariablesTest)  Time elapsed: 1.058 s
16:02:59 testGitWorkTree(org.eclipse.egit.ui.variables.DynamicVariablesTest)  Time elapsed: 1.065 s
16:02:59 testGitDir(org.eclipse.egit.ui.variables.DynamicVariablesTest)  Time elapsed: 1.198 s
16:02:59 
16:02:59 Results:
16:02:59 
16:02:59 Tests run: 467, Failures: 0, Errors: 0, Skipped: 12
16:02:59 
16:03:00 
16:03:00 !ENTRY org.eclipse.core.jobs 4 2 2019-03-21 20:03:00.293
16:03:00 !MESSAGE An internal error occurred during: "Git decorator updates (Git resource decorations).".
16:03:00 !STACK 0
16:03:00 org.eclipse.swt.SWTException: Device is disposed
16:03:00 	at org.eclipse.swt.SWT.error(SWT.java:4533)
16:03:00 	at org.eclipse.swt.SWT.error(SWT.java:4448)
16:03:00 	at org.eclipse.swt.SWT.error(SWT.java:4419)
16:03:00 	at org.eclipse.swt.widgets.Display.error(Display.java:1236)
16:03:00 	at org.eclipse.swt.widgets.Display.asyncExec(Display.java:775)
16:03:00 	at org.eclipse.egit.ui.internal.decorators.GitDecorator.fireLabelEvent(GitDecorator.java:79)
16:03:00 	at org.eclipse.egit.ui.internal.decorators.GitDecorator$EventJob.run(GitDecorator.java:125)
16:03:00 	at org.eclipse.core.internal.jobs.Worker.run(Worker.java:55)
16:03:00 
16:03:00 !ENTRY org.eclipse.core.jobs 4 2 2019-03-21 20:03:00.293
16:03:00 !MESSAGE An internal error occurred during: "Git decorator updates (Git resource decorations).".
16:03:00 !STACK 0
16:03:00 org.eclipse.swt.SWTException: Device is disposed
16:03:00 	at org.eclipse.swt.SWT.error(SWT.java:4533)
16:03:00 	at org.eclipse.swt.SWT.error(SWT.java:4448)
16:03:00 	at org.eclipse.swt.SWT.error(SWT.java:4419)
16:03:00 	at org.eclipse.swt.widgets.Display.error(Display.java:1236)
16:03:00 	at org.eclipse.swt.widgets.Display.asyncExec(Display.java:775)
16:03:00 	at org.eclipse.egit.ui.internal.decorators.GitDecorator.fireLabelEvent(GitDecorator.java:79)
16:03:00 	at org.eclipse.egit.ui.internal.decorators.GitDecorator$EventJob.run(GitDecorator.java:125)
16:03:00 	at org.eclipse.core.internal.jobs.Worker.run(Worker.java:55)
16:03:00 
16:03:00 !ENTRY org.eclipse.core.jobs 4 2 2019-03-21 20:03:00.294
16:03:00 !MESSAGE An internal error occurred during: "Git decorator updates (Git object decorations).".
16:03:00 !STACK 0
16:03:00 org.eclipse.swt.SWTException: Device is disposed
16:03:00 	at org.eclipse.swt.SWT.error(SWT.java:4533)
16:03:00 	at org.eclipse.swt.SWT.error(SWT.java:4448)
16:03:00 	at org.eclipse.swt.SWT.error(SWT.java:4419)
16:03:00 	at org.eclipse.swt.widgets.Display.error(Display.java:1236)
16:03:00 	at org.eclipse.swt.widgets.Display.asyncExec(Display.java:775)
16:03:00 	at org.eclipse.egit.ui.internal.decorators.GitDecorator.fireLabelEvent(GitDecorator.java:79)
16:03:00 	at org.eclipse.egit.ui.internal.decorators.GitDecorator$EventJob.run(GitDecorator.java:125)
16:03:00 	at org.eclipse.core.internal.jobs.Worker.run(Worker.java:55)
16:03:01 
16:03:01 !ENTRY org.eclipse.core.resources 2 10035 2019-03-21 20:03:01.069
16:03:01 !MESSAGE The workspace will exit with unsaved changes in this session.
16:03:02 [INFO] All tests passed!
16:03:02 [INFO] 
16:03:02 [INFO] >>> spotbugs-maven-plugin:3.1.11:check (default) > :spotbugs @ org.eclipse.egit.ui.test >>>
16:03:02 [INFO] 
16:03:02 [INFO] --- spotbugs-maven-plugin:3.1.11:spotbugs (spotbugs) @ org.eclipse.egit.ui.test ---
16:03:02 [INFO] Fork Value is true
16:03:02      [java] Picked up JAVA_TOOL_OPTIONS: -XX:+IgnoreUnrecognizedVMOptions -XX:+UseContainerSupport -XX:+UnlockExperimentalVMOptions -XX:+UseCGroupMemoryLimitForHeap
16:03:02      [java] Picked up _JAVA_OPTIONS: -XX:MaxRAMPercentage=64.0
16:03:14      [java] Warnings generated: 22
16:03:14 [INFO] Done SpotBugs Analysis....
16:03:15 [INFO] 
16:03:15 [INFO] <<< spotbugs-maven-plugin:3.1.11:check (default) < :spotbugs @ org.eclipse.egit.ui.test <<<
16:03:15 [INFO] 
16:03:15 [INFO] 
16:03:15 [INFO] --- spotbugs-maven-plugin:3.1.11:check (default) @ org.eclipse.egit.ui.test ---
16:03:15 [INFO] BugInstance size is 22
16:03:15 [INFO] Error size is 0
16:03:15 [INFO] Total bugs: 22
16:03:15 [ERROR] Possible null pointer dereference in org.eclipse.egit.ui.common.LocalRepositoryTestCase.shareProjects(File) due to return value of called method [org.eclipse.egit.ui.common.LocalRepositoryTestCase, org.eclipse.egit.ui.common.LocalRepositoryTestCase] Dereferenced at LocalRepositoryTestCase.java:[line 607]Known null at LocalRepositoryTestCase.java:[line 607] NP_NULL_ON_SOME_PATH_FROM_RETURN_VALUE
16:03:15 [ERROR] Possible null pointer dereference in org.eclipse.egit.ui.common.LocalRepositoryTestCase.shareProjects(File) due to return value of called method [org.eclipse.egit.ui.common.LocalRepositoryTestCase, org.eclipse.egit.ui.common.LocalRepositoryTestCase] Dereferenced at LocalRepositoryTestCase.java:[line 609]Known null at LocalRepositoryTestCase.java:[line 609] NP_NULL_ON_SOME_PATH_FROM_RETURN_VALUE
16:03:15 [ERROR] Write to static field org.eclipse.egit.ui.common.LocalRepositoryTestCase.testMethodNumber from instance method org.eclipse.egit.ui.common.LocalRepositoryTestCase.initNewTestDirectory() [org.eclipse.egit.ui.common.LocalRepositoryTestCase] At LocalRepositoryTestCase.java:[line 190] ST_WRITE_TO_STATIC_FROM_INSTANCE_METHOD
16:03:15 [ERROR] Exceptional return value of java.io.File.delete() ignored in org.eclipse.egit.ui.internal.actions.SwitchToMenuTest.multipleSelectionWithMultipleRepositoriesAndNoCommonBranches() [org.eclipse.egit.ui.internal.actions.SwitchToMenuTest, org.eclipse.egit.ui.internal.actions.SwitchToMenuTest] At SwitchToMenuTest.java:[line 250]Another occurrence at SwitchToMenuTest.java:[line 251] RV_RETURN_VALUE_IGNORED_BAD_PRACTICE
16:03:15 [ERROR] Exceptional return value of java.io.File.delete() ignored in org.eclipse.egit.ui.internal.actions.SwitchToMenuTest.selectionWithProj1AndReflog() [org.eclipse.egit.ui.internal.actions.SwitchToMenuTest] At SwitchToMenuTest.java:[line 108] RV_RETURN_VALUE_IGNORED_BAD_PRACTICE
16:03:15 [ERROR] Call to org.eclipse.egit.ui.internal.decorators.TestDecoratableResource.equals(org.eclipse.egit.ui.internal.decorators.DecoratableResourceAdapter) in org.eclipse.egit.ui.internal.decorators.DecoratableResourceAdapterTest.testDecorationDeletedFile() [org.eclipse.egit.ui.internal.decorators.DecoratableResourceAdapterTest] At DecoratableResourceAdapterTest.java:[line 384] EC_UNRELATED_TYPES
16:03:15 [ERROR] Call to org.eclipse.egit.ui.internal.synchronize.model.GitModelCommit.equals(org.eclipse.egit.ui.internal.synchronize.model.GitModelBlob) in org.eclipse.egit.ui.internal.synchronize.model.GitModelBlobTest.shouldBeSymmetric1() [org.eclipse.egit.ui.internal.synchronize.model.GitModelBlobTest] At GitModelBlobTest.java:[line 123] EC_UNRELATED_TYPES
16:03:15 [ERROR] Call to org.eclipse.egit.ui.internal.synchronize.model.GitModelBlob.equals(org.eclipse.egit.ui.internal.synchronize.model.GitModelCommit) in org.eclipse.egit.ui.internal.synchronize.model.GitModelBlobTest.shouldBeSymmetric1() [org.eclipse.egit.ui.internal.synchronize.model.GitModelBlobTest] At GitModelBlobTest.java:[line 122] EC_UNRELATED_TYPES
16:03:15 [ERROR] Call to org.eclipse.egit.ui.internal.synchronize.model.GitModelBlob.equals(org.eclipse.egit.ui.internal.synchronize.model.GitModelCommit) in org.eclipse.egit.ui.internal.synchronize.model.GitModelBlobTest.shouldReturnNotEqualForBlobAndCommit() [org.eclipse.egit.ui.internal.synchronize.model.GitModelBlobTest] At GitModelBlobTest.java:[line 199] EC_UNRELATED_TYPES
16:03:15 [ERROR] Write to static field org.eclipse.egit.ui.internal.synchronize.model.GitModelRootTest.repo1 from instance method org.eclipse.egit.ui.internal.synchronize.model.GitModelRootTest.setupEnvironment() [org.eclipse.egit.ui.internal.synchronize.model.GitModelRootTest] At GitModelRootTest.java:[line 32] ST_WRITE_TO_STATIC_FROM_INSTANCE_METHOD
16:03:15 [ERROR] Write to static field org.eclipse.egit.ui.internal.synchronize.model.GitModelRootTest.repo2 from instance method org.eclipse.egit.ui.internal.synchronize.model.GitModelRootTest.setupEnvironment() [org.eclipse.egit.ui.internal.synchronize.model.GitModelRootTest] At GitModelRootTest.java:[line 35] ST_WRITE_TO_STATIC_FROM_INSTANCE_METHOD
16:03:15 [ERROR] Exceptional return value of java.io.File.delete() ignored in org.eclipse.egit.ui.prefpages.configuration.GlobalConfigurationPageTest.afterTest() [org.eclipse.egit.ui.prefpages.configuration.GlobalConfigurationPageTest] At GlobalConfigurationPageTest.java:[line 124] RV_RETURN_VALUE_IGNORED_BAD_PRACTICE
16:03:15 [ERROR] Return value of org.eclipse.swtbot.eclipse.finder.waits.Conditions.waitForView(Matcher) ignored, but method has no side effect [org.eclipse.egit.ui.test.TestUtil] At TestUtil.java:[line 752] RV_RETURN_VALUE_IGNORED_NO_SIDE_EFFECT
16:03:15 [ERROR] Return value of org.eclipse.swtbot.eclipse.finder.waits.Conditions.waitForView(Matcher) ignored, but method has no side effect [org.eclipse.egit.ui.test.TestUtil] At TestUtil.java:[line 768] RV_RETURN_VALUE_IGNORED_NO_SIDE_EFFECT
16:03:15 [ERROR] Write to static field org.eclipse.egit.ui.test.team.actions.BranchAndResetActionTest.LOCAL_BRANCHES from instance method org.eclipse.egit.ui.test.team.actions.BranchAndResetActionTest.setup() [org.eclipse.egit.ui.test.team.actions.BranchAndResetActionTest] At BranchAndResetActionTest.java:[line 99] ST_WRITE_TO_STATIC_FROM_INSTANCE_METHOD
16:03:15 [ERROR] Write to static field org.eclipse.egit.ui.test.team.actions.BranchAndResetActionTest.TAGS from instance method org.eclipse.egit.ui.test.team.actions.BranchAndResetActionTest.setup() [org.eclipse.egit.ui.test.team.actions.BranchAndResetActionTest] At BranchAndResetActionTest.java:[line 100] ST_WRITE_TO_STATIC_FROM_INSTANCE_METHOD
16:03:15 [ERROR] Write to static field org.eclipse.egit.ui.test.team.actions.CompareActionsTest.TAGS from instance method org.eclipse.egit.ui.test.team.actions.CompareActionsTest.setup() [org.eclipse.egit.ui.test.team.actions.CompareActionsTest] At CompareActionsTest.java:[line 94] ST_WRITE_TO_STATIC_FROM_INSTANCE_METHOD
16:03:15 [ERROR] Write to static field org.eclipse.egit.ui.test.team.actions.CompareActionsTest.commitOfTag from instance method org.eclipse.egit.ui.test.team.actions.CompareActionsTest.setup() [org.eclipse.egit.ui.test.team.actions.CompareActionsTest] At CompareActionsTest.java:[line 89] ST_WRITE_TO_STATIC_FROM_INSTANCE_METHOD
16:03:15 [ERROR] VERY confusing to have methods org.eclipse.egit.ui.view.repositories.GitRepositoriesViewBranchHandlingTest.setUp() and org.eclipse.egit.ui.view.repositories.GitRepositoriesViewTestBase.setup() [org.eclipse.egit.ui.view.repositories.GitRepositoriesViewBranchHandlingTest] At GitRepositoriesViewBranchHandlingTest.java:[lines 84-103] NM_VERY_CONFUSING
16:03:15 [ERROR] Possible null pointer dereference in org.eclipse.egit.ui.view.repositories.GitRepositoriesViewTest.testExpandWorkDir() due to return value of called method [org.eclipse.egit.ui.view.repositories.GitRepositoriesViewTest, org.eclipse.egit.ui.view.repositories.GitRepositoriesViewTest] Method invoked at GitRepositoriesViewTest.java:[line 192]Known null at GitRepositoriesViewTest.java:[line 192] NP_NULL_ON_SOME_PATH_FROM_RETURN_VALUE
16:03:15 [ERROR] org.eclipse.egit.ui.view.repositories.GitRepositoriesViewTestBase.myRepoViewUtil isn't final and can't be protected from malicious code  [org.eclipse.egit.ui.view.repositories.GitRepositoriesViewTestBase] In GitRepositoriesViewTestBase.java MS_CANNOT_BE_FINAL
16:03:15 [ERROR] VERY confusing to have methods org.eclipse.egit.ui.wizards.pull.PullWizardTest.setUp() and org.eclipse.egit.ui.view.repositories.GitRepositoriesViewTestBase.setup() [org.eclipse.egit.ui.wizards.pull.PullWizardTest] At PullWizardTest.java:[lines 80-88] NM_VERY_CONFUSING
16:03:15 [INFO] 
16:03:15 
16:03:15 
16:03:15 To see bug detail using the Spotbugs GUI, use the following command "mvn spotbugs:gui"
16:03:15 
16:03:15 
16:03:15 
16:03:15 [INFO] 
16:03:15 [INFO] >>> maven-pmd-plugin:3.11.0:cpd-check (default) > :cpd @ org.eclipse.egit.ui.test >>>
16:03:15 [INFO] 
16:03:15 [INFO] --- maven-pmd-plugin:3.11.0:cpd (cpd) @ org.eclipse.egit.ui.test ---
16:03:15 [INFO] 
16:03:15 [INFO] <<< maven-pmd-plugin:3.11.0:cpd-check (default) < :cpd @ org.eclipse.egit.ui.test <<<
16:03:15 [INFO] 
16:03:15 [INFO] 
16:03:15 [INFO] --- maven-pmd-plugin:3.11.0:cpd-check (default) @ org.eclipse.egit.ui.test ---
16:03:15 [INFO] 
16:03:15 [INFO] 
16:03:15 [INFO] --- tycho-pack200a-plugin:1.3.0:normalize (pack200-normalize) @ org.eclipse.egit.ui.test ---
16:03:15 [INFO] Pack200 normalizing jar /home/jenkins/workspace/egit/repo/org.eclipse.egit.ui.test/target/org.eclipse.egit.ui.test-5.4.0-SNAPSHOT.jar
16:03:15 [INFO] 
16:03:15 [INFO] --- eclipse-jarsigner-plugin:1.1.5:sign (sign) @ org.eclipse.egit.ui.test ---
16:03:16 [INFO] Signing jar: /home/jenkins/workspace/egit/repo/org.eclipse.egit.ui.test/target/org.eclipse.egit.ui.test-5.4.0-SNAPSHOT.jar
16:03:18 [INFO] 
16:03:18 [INFO] --- tycho-pack200b-plugin:1.3.0:pack (pack200-pack) @ org.eclipse.egit.ui.test ---
16:03:18 [INFO] Pack200 packing jar /home/jenkins/workspace/egit/repo/org.eclipse.egit.ui.test/target/org.eclipse.egit.ui.test-5.4.0-SNAPSHOT.jar
16:03:18 [INFO] 
16:03:18 [INFO] --- tycho-p2-plugin:1.3.0:p2-metadata (p2-metadata) @ org.eclipse.egit.ui.test ---
16:03:18 [INFO] 
16:03:18 [INFO] --- maven-install-plugin:2.3.1:install (default-install) @ org.eclipse.egit.ui.test ---
16:03:18 [INFO] Installing /home/jenkins/workspace/egit/repo/org.eclipse.egit.ui.test/target/org.eclipse.egit.ui.test-5.4.0-SNAPSHOT.jar to /home/jenkins/workspace/egit/.repository/org/eclipse/egit/org.eclipse.egit.ui.test/5.4.0-SNAPSHOT/org.eclipse.egit.ui.test-5.4.0-SNAPSHOT.jar
16:03:18 [INFO] Installing /home/jenkins/workspace/egit/repo/org.eclipse.egit.ui.test/pom.xml to /home/jenkins/workspace/egit/.repository/org/eclipse/egit/org.eclipse.egit.ui.test/5.4.0-SNAPSHOT/org.eclipse.egit.ui.test-5.4.0-SNAPSHOT.pom
16:03:18 [INFO] Installing /home/jenkins/workspace/egit/repo/org.eclipse.egit.ui.test/target/org.eclipse.egit.ui.test-5.4.0-SNAPSHOT.jar.pack.gz to /home/jenkins/workspace/egit/.repository/org/eclipse/egit/org.eclipse.egit.ui.test/5.4.0-SNAPSHOT/org.eclipse.egit.ui.test-5.4.0-SNAPSHOT-pack200.jar.pack.gz
16:03:18 [INFO] Installing /home/jenkins/workspace/egit/repo/org.eclipse.egit.ui.test/target/p2content.xml to /home/jenkins/workspace/egit/.repository/org/eclipse/egit/org.eclipse.egit.ui.test/5.4.0-SNAPSHOT/org.eclipse.egit.ui.test-5.4.0-SNAPSHOT-p2metadata.xml
16:03:18 [INFO] Installing /home/jenkins/workspace/egit/repo/org.eclipse.egit.ui.test/target/p2artifacts.xml to /home/jenkins/workspace/egit/.repository/org/eclipse/egit/org.eclipse.egit.ui.test/5.4.0-SNAPSHOT/org.eclipse.egit.ui.test-5.4.0-SNAPSHOT-p2artifacts.xml
16:03:18 [INFO] 
16:03:18 [INFO] --- tycho-p2-plugin:1.3.0:update-local-index (default-update-local-index) @ org.eclipse.egit.ui.test ---
16:03:18 [INFO] 
16:03:18 [INFO] ----------< org.eclipse.egit:org.eclipse.egit.mylyn.ui.test >-----------
16:03:18 [INFO] Building EGit Mylyn UI Test Plug-in 5.4.0-SNAPSHOT               [20/21]
16:03:18 [INFO] ------------------------[ eclipse-test-plugin ]-------------------------
16:03:18 [INFO] 
16:03:18 [INFO] --- maven-clean-plugin:2.5:clean (default-clean) @ org.eclipse.egit.mylyn.ui.test ---
16:03:18 [INFO] 
16:03:18 [INFO] --- tycho-packaging-plugin:1.3.0:build-qualifier (default-build-qualifier) @ org.eclipse.egit.mylyn.ui.test ---
16:03:18 [INFO] The project's OSGi version is 5.4.0.201903211937
16:03:18 [INFO] 
16:03:18 [INFO] --- tycho-packaging-plugin:1.3.0:validate-id (default-validate-id) @ org.eclipse.egit.mylyn.ui.test ---
16:03:18 [INFO] 
16:03:18 [INFO] --- tycho-packaging-plugin:1.3.0:validate-version (default-validate-version) @ org.eclipse.egit.mylyn.ui.test ---
16:03:18 [INFO] 
16:03:18 [INFO] --- maven-enforcer-plugin:3.0.0-M2:enforce (enforce-maven) @ org.eclipse.egit.mylyn.ui.test ---
16:03:18 [INFO] 
16:03:18 [INFO] --- maven-resources-plugin:2.4.3:resources (default-resources) @ org.eclipse.egit.mylyn.ui.test ---
16:03:18 [INFO] Using 'UTF-8' encoding to copy filtered resources.
16:03:18 [INFO] skip non existing resourceDirectory /home/jenkins/workspace/egit/repo/org.eclipse.egit.mylyn.ui.test/src/main/resources
16:03:18 [INFO] 
16:03:18 [INFO] --- tycho-compiler-plugin:1.3.0:compile (default-compile) @ org.eclipse.egit.mylyn.ui.test ---
16:03:18 [INFO] Compiling 1 source file to /home/jenkins/workspace/egit/repo/org.eclipse.egit.mylyn.ui.test/target/classes
16:03:18 [INFO] 
16:03:18 [INFO] --- maven-resources-plugin:2.4.3:testResources (default-testResources) @ org.eclipse.egit.mylyn.ui.test ---
16:03:18 [INFO] Using 'UTF-8' encoding to copy filtered resources.
16:03:18 [INFO] skip non existing resourceDirectory /home/jenkins/workspace/egit/repo/org.eclipse.egit.mylyn.ui.test/src/test/resources
16:03:18 [INFO] 
16:03:18 [INFO] --- target-platform-configuration:1.3.0:target-platform (default-target-platform) @ org.eclipse.egit.mylyn.ui.test ---
16:03:18 [INFO] 
16:03:18 [INFO] --- tycho-packaging-plugin:1.3.0:package-plugin (default-package-plugin) @ org.eclipse.egit.mylyn.ui.test ---
16:03:18 [INFO] Building jar: /home/jenkins/workspace/egit/repo/org.eclipse.egit.mylyn.ui.test/target/org.eclipse.egit.mylyn.ui.test-5.4.0-SNAPSHOT.jar
16:03:18 [INFO] 
16:03:18 [INFO] --- tycho-p2-plugin:1.3.0:p2-metadata-default (default-p2-metadata-default) @ org.eclipse.egit.mylyn.ui.test ---
16:03:18 [INFO] 
16:03:18 [INFO] --- tycho-surefire-plugin:1.3.0:test (default-test) @ org.eclipse.egit.mylyn.ui.test ---
16:03:19 [INFO] Expected eclipse log file: /home/jenkins/workspace/egit/repo/org.eclipse.egit.mylyn.ui.test/target/work/data/.metadata/.log
16:03:19 [INFO] Command line:
16:03:19 	[/opt/tools/java/oracle/jdk-8/1.8.0_202/jre/bin/java, -Dosgi.noShutdown=false, -Dosgi.os=linux, -Dosgi.ws=gtk, -Dosgi.arch=x86_64, -Declipse.consoleLog=true, -Degit.test.tmpdir=/home/jenkins/workspace/egit/tmp/egit.tmp/, -Dorg.eclipse.swtbot.search.timeout=30000, -Xmx1536m, -Dosgi.clean=true, -jar, /home/jenkins/workspace/egit/.repository/p2/osgi/bundle/org.eclipse.equinox.launcher/1.3.201.v20161025-1711/org.eclipse.equinox.launcher-1.3.201.v20161025-1711.jar, -data, /home/jenkins/workspace/egit/repo/org.eclipse.egit.mylyn.ui.test/target/work/data, -install, /home/jenkins/workspace/egit/repo/org.eclipse.egit.mylyn.ui.test/target/work, -configuration, /home/jenkins/workspace/egit/repo/org.eclipse.egit.mylyn.ui.test/target/work/configuration, -application, org.eclipse.tycho.surefire.osgibooter.uitest, -testproperties, /home/jenkins/workspace/egit/repo/org.eclipse.egit.mylyn.ui.test/target/surefire.properties, -testApplication, org.eclipse.ui.ide.workbench]
16:03:19 Picked up JAVA_TOOL_OPTIONS: -XX:+IgnoreUnrecognizedVMOptions -XX:+UseContainerSupport -XX:+UnlockExperimentalVMOptions -XX:+UseCGroupMemoryLimitForHeap
16:03:19 Picked up _JAVA_OPTIONS: -XX:MaxRAMPercentage=64.0
16:03:21 !SESSION 2019-03-21 20:03:19.581 -----------------------------------------------
16:03:21 eclipse.buildId=unknown
16:03:21 java.version=1.8.0_202
16:03:21 java.vendor=Oracle Corporation
16:03:21 BootLoader constants: OS=linux, ARCH=x86_64, WS=gtk, NL=en_US
16:03:21 Framework arguments:  -application org.eclipse.tycho.surefire.osgibooter.uitest -testproperties /home/jenkins/workspace/egit/repo/org.eclipse.egit.mylyn.ui.test/target/surefire.properties -testApplication org.eclipse.ui.ide.workbench
16:03:21 Command-line arguments:  -data /home/jenkins/workspace/egit/repo/org.eclipse.egit.mylyn.ui.test/target/work/data -application org.eclipse.tycho.surefire.osgibooter.uitest -testproperties /home/jenkins/workspace/egit/repo/org.eclipse.egit.mylyn.ui.test/target/surefire.properties -testApplication org.eclipse.ui.ide.workbench
16:03:21 
16:03:21 !ENTRY org.eclipse.jdt.launching.macosx 4 0 2019-03-21 20:03:21.651
16:03:21 !MESSAGE FrameworkEvent ERROR
16:03:21 !STACK 0
16:03:21 org.osgi.framework.BundleException: Could not resolve module: org.eclipse.jdt.launching.macosx [246]
16:03:21   Unresolved requirement: Require-Capability: eclipse.platform; filter:="(osgi.os=macosx)"
16:03:21 
16:03:21 	at org.eclipse.osgi.container.Module.start(Module.java:444)
16:03:21 	at org.eclipse.osgi.container.ModuleContainer$ContainerStartLevel.incStartLevel(ModuleContainer.java:1620)
16:03:21 	at org.eclipse.osgi.container.ModuleContainer$ContainerStartLevel.incStartLevel(ModuleContainer.java:1599)
16:03:21 	at org.eclipse.osgi.container.ModuleContainer$ContainerStartLevel.doContainerStartLevel(ModuleContainer.java:1571)
16:03:21 	at org.eclipse.osgi.container.ModuleContainer$ContainerStartLevel.dispatchEvent(ModuleContainer.java:1514)
16:03:21 	at org.eclipse.osgi.container.ModuleContainer$ContainerStartLevel.dispatchEvent(ModuleContainer.java:1)
16:03:21 	at org.eclipse.osgi.framework.eventmgr.EventManager.dispatchEvent(EventManager.java:230)
16:03:21 	at org.eclipse.osgi.framework.eventmgr.EventManager$EventThread.run(EventManager.java:340)
16:03:21 
16:03:21 !ENTRY org.eclipse.jdt.launching.ui.macosx 4 0 2019-03-21 20:03:21.652
16:03:21 !MESSAGE FrameworkEvent ERROR
16:03:21 !STACK 0
16:03:21 org.osgi.framework.BundleException: Could not resolve module: org.eclipse.jdt.launching.ui.macosx [247]
16:03:21   Unresolved requirement: Require-Capability: eclipse.platform; filter:="(osgi.os=macosx)"
16:03:21 
16:03:21 	at org.eclipse.osgi.container.Module.start(Module.java:444)
16:03:21 	at org.eclipse.osgi.container.ModuleContainer$ContainerStartLevel.incStartLevel(ModuleContainer.java:1620)
16:03:21 	at org.eclipse.osgi.container.ModuleContainer$ContainerStartLevel.incStartLevel(ModuleContainer.java:1599)
16:03:21 	at org.eclipse.osgi.container.ModuleContainer$ContainerStartLevel.doContainerStartLevel(ModuleContainer.java:1571)
16:03:21 	at org.eclipse.osgi.container.ModuleContainer$ContainerStartLevel.dispatchEvent(ModuleContainer.java:1514)
16:03:21 	at org.eclipse.osgi.container.ModuleContainer$ContainerStartLevel.dispatchEvent(ModuleContainer.java:1)
16:03:21 	at org.eclipse.osgi.framework.eventmgr.EventManager.dispatchEvent(EventManager.java:230)
16:03:21 	at org.eclipse.osgi.framework.eventmgr.EventManager$EventThread.run(EventManager.java:340)
16:03:21 Launching application org.eclipse.ui.ide.workbench...
16:03:23 
16:03:23 !ENTRY org.eclipse.egit.core 1 0 2019-03-21 20:03:23.809
16:03:23 !MESSAGE Using Apache MINA sshd as ssh client.
16:03:24 
16:03:24 (SWT:2264): Gtk-WARNING **: 20:03:24.469: Negative content width -6 (allocation 1, extents 4x3) while allocating gadget (node toolbar, owner GtkToolbar)
16:03:24 
16:03:24 (SWT:2264): Gtk-WARNING **: 20:03:24.469: Negative content height -3 (allocation 1, extents 2x2) while allocating gadget (node toolbar, owner GtkToolbar)
16:03:24 
16:03:24 (SWT:2264): Gtk-WARNING **: 20:03:24.469: Negative content width -6 (allocation 1, extents 4x3) while allocating gadget (node toolbar, owner GtkToolbar)
16:03:24 
16:03:24 (SWT:2264): Gtk-WARNING **: 20:03:24.469: Negative content height -3 (allocation 1, extents 2x2) while allocating gadget (node toolbar, owner GtkToolbar)
16:03:24 
16:03:24 (SWT:2264): Gtk-WARNING **: 20:03:24.475: Negative content width -6 (allocation 1, extents 4x3) while allocating gadget (node toolbar, owner GtkToolbar)
16:03:24 
16:03:24 (SWT:2264): Gtk-WARNING **: 20:03:24.475: Negative content height -3 (allocation 1, extents 2x2) while allocating gadget (node toolbar, owner GtkToolbar)
16:03:24 
16:03:24 (SWT:2264): Gtk-WARNING **: 20:03:24.475: Negative content width -6 (allocation 1, extents 4x3) while allocating gadget (node toolbar, owner GtkToolbar)
16:03:24 
16:03:24 (SWT:2264): Gtk-WARNING **: 20:03:24.475: Negative content height -3 (allocation 1, extents 2x2) while allocating gadget (node toolbar, owner GtkToolbar)
16:03:24 
16:03:24 (SWT:2264): Gtk-WARNING **: 20:03:24.898: Negative content width -6 (allocation 1, extents 4x3) while allocating gadget (node toolbar, owner GtkToolbar)
16:03:24 
16:03:24 (SWT:2264): Gtk-WARNING **: 20:03:24.898: Negative content height -3 (allocation 1, extents 2x2) while allocating gadget (node toolbar, owner GtkToolbar)
16:03:24 
16:03:24 (SWT:2264): Gtk-WARNING **: 20:03:24.898: Negative content width -6 (allocation 1, extents 4x3) while allocating gadget (node toolbar, owner GtkToolbar)
16:03:24 
16:03:24 (SWT:2264): Gtk-WARNING **: 20:03:24.898: Negative content height -3 (allocation 1, extents 2x2) while allocating gadget (node toolbar, owner GtkToolbar)
16:03:24 
16:03:24 (SWT:2264): Gtk-WARNING **: 20:03:24.907: gtk_widget_size_allocate(): attempt to allocate widget with width -3 and height -3
16:03:25 
16:03:25 (SWT:2264): Gtk-WARNING **: 20:03:25.206: Negative content width -6 (allocation 1, extents 4x3) while allocating gadget (node toolbar, owner GtkToolbar)
16:03:25 
16:03:25 (SWT:2264): Gtk-WARNING **: 20:03:25.206: Negative content height -3 (allocation 1, extents 2x2) while allocating gadget (node toolbar, owner GtkToolbar)
16:03:25 
16:03:25 (SWT:2264): Gtk-WARNING **: 20:03:25.206: Negative content width -6 (allocation 1, extents 4x3) while allocating gadget (node toolbar, owner GtkToolbar)
16:03:25 
16:03:25 (SWT:2264): Gtk-WARNING **: 20:03:25.206: Negative content height -3 (allocation 1, extents 2x2) while allocating gadget (node toolbar, owner GtkToolbar)
16:03:25 
16:03:25 (SWT:2264): Gtk-WARNING **: 20:03:25.221: Negative content width -6 (allocation 1, extents 4x3) while allocating gadget (node toolbar, owner GtkToolbar)
16:03:25 
16:03:25 (SWT:2264): Gtk-WARNING **: 20:03:25.221: Negative content height -3 (allocation 1, extents 2x2) while allocating gadget (node toolbar, owner GtkToolbar)
16:03:25 
16:03:25 (SWT:2264): Gtk-WARNING **: 20:03:25.221: Negative content width -6 (allocation 1, extents 4x3) while allocating gadget (node toolbar, owner GtkToolbar)
16:03:25 
16:03:25 (SWT:2264): Gtk-WARNING **: 20:03:25.221: Negative content height -3 (allocation 1, extents 2x2) while allocating gadget (node toolbar, owner GtkToolbar)
16:03:25 
16:03:25 (SWT:2264): Gtk-WARNING **: 20:03:25.224: Negative content width -6 (allocation 1, extents 4x3) while allocating gadget (node toolbar, owner GtkToolbar)
16:03:25 
16:03:25 (SWT:2264): Gtk-WARNING **: 20:03:25.224: Negative content height -3 (allocation 1, extents 2x2) while allocating gadget (node toolbar, owner GtkToolbar)
16:03:25 
16:03:25 (SWT:2264): Gtk-WARNING **: 20:03:25.224: Negative content width -6 (allocation 1, extents 4x3) while allocating gadget (node toolbar, owner GtkToolbar)
16:03:25 
16:03:25 (SWT:2264): Gtk-WARNING **: 20:03:25.224: Negative content height -3 (allocation 1, extents 2x2) while allocating gadget (node toolbar, owner GtkToolbar)
16:03:25 
16:03:25 (SWT:2264): Gtk-WARNING **: 20:03:25.229: Negative content width -6 (allocation 1, extents 4x3) while allocating gadget (node toolbar, owner GtkToolbar)
16:03:25 
16:03:25 (SWT:2264): Gtk-WARNING **: 20:03:25.229: Negative content height -3 (allocation 1, extents 2x2) while allocating gadget (node toolbar, owner GtkToolbar)
16:03:25 
16:03:25 (SWT:2264): Gtk-WARNING **: 20:03:25.229: Negative content width -6 (allocation 1, extents 4x3) while allocating gadget (node toolbar, owner GtkToolbar)
16:03:25 
16:03:25 (SWT:2264): Gtk-WARNING **: 20:03:25.229: Negative content height -3 (allocation 1, extents 2x2) while allocating gadget (node toolbar, owner GtkToolbar)
16:03:25 
16:03:25 (SWT:2264): Gtk-WARNING **: 20:03:25.689: Negative content width -6 (allocation 1, extents 4x3) while allocating gadget (node toolbar, owner GtkToolbar)
16:03:25 
16:03:25 (SWT:2264): Gtk-WARNING **: 20:03:25.689: Negative content height -3 (allocation 1, extents 2x2) while allocating gadget (node toolbar, owner GtkToolbar)
16:03:25 
16:03:25 (SWT:2264): Gtk-WARNING **: 20:03:25.689: Negative content width -6 (allocation 1, extents 4x3) while allocating gadget (node toolbar, owner GtkToolbar)
16:03:25 
16:03:25 (SWT:2264): Gtk-WARNING **: 20:03:25.689: Negative content height -3 (allocation 1, extents 2x2) while allocating gadget (node toolbar, owner GtkToolbar)
16:03:25 
16:03:25 (SWT:2264): Gtk-WARNING **: 20:03:25.698: Negative content width -6 (allocation 1, extents 4x3) while allocating gadget (node toolbar, owner GtkToolbar)
16:03:25 
16:03:25 (SWT:2264): Gtk-WARNING **: 20:03:25.698: Negative content height -3 (allocation 1, extents 2x2) while allocating gadget (node toolbar, owner GtkToolbar)
16:03:25 
16:03:25 (SWT:2264): Gtk-WARNING **: 20:03:25.698: Negative content width -6 (allocation 1, extents 4x3) while allocating gadget (node toolbar, owner GtkToolbar)
16:03:25 
16:03:25 (SWT:2264): Gtk-WARNING **: 20:03:25.698: Negative content height -3 (allocation 1, extents 2x2) while allocating gadget (node toolbar, owner GtkToolbar)
16:03:26 
16:03:26 (SWT:2264): Gtk-WARNING **: 20:03:26.072: Negative content height -9 (allocation 1, extents 5x5) while allocating gadget (node button, owner GtkButton)
16:03:26 
16:03:26 (SWT:2264): Gtk-WARNING **: 20:03:26.140: Negative content width -6 (allocation 1, extents 4x3) while allocating gadget (node toolbar, owner GtkToolbar)
16:03:26 
16:03:26 (SWT:2264): Gtk-WARNING **: 20:03:26.143: Negative content width -6 (allocation 1, extents 4x3) while allocating gadget (node toolbar, owner GtkToolbar)
16:03:26 
16:03:26 (SWT:2264): Gtk-WARNING **: 20:03:26.149: Negative content width -6 (allocation 1, extents 4x3) while allocating gadget (node toolbar, owner GtkToolbar)
16:03:26 
16:03:26 (SWT:2264): Gtk-WARNING **: 20:03:26.151: Negative content width -6 (allocation 1, extents 4x3) while allocating gadget (node toolbar, owner GtkToolbar)
16:03:26 
16:03:26 (SWT:2264): Gtk-WARNING **: 20:03:26.153: Negative content width -6 (allocation 1, extents 4x3) while allocating gadget (node toolbar, owner GtkToolbar)
16:03:26 
16:03:26 (SWT:2264): Gtk-WARNING **: 20:03:26.154: Negative content width -1 (allocation 1, extents 1x1) while allocating gadget (node trough, owner GtkProgressBar)
16:03:26 
16:03:26 (SWT:2264): Gtk-WARNING **: 20:03:26.154: Negative content width -1 (allocation 1, extents 1x1) while allocating gadget (node trough, owner GtkProgressBar)
16:03:26 
16:03:26 (SWT:2264): Gtk-WARNING **: 20:03:26.203: Negative content width -6 (allocation 1, extents 4x3) while allocating gadget (node toolbar, owner GtkToolbar)
16:03:26 
16:03:26 (SWT:2264): Gtk-WARNING **: 20:03:26.204: Negative content width -6 (allocation 1, extents 4x3) while allocating gadget (node toolbar, owner GtkToolbar)
16:03:26 
16:03:26 (SWT:2264): Gtk-WARNING **: 20:03:26.208: Negative content width -6 (allocation 1, extents 4x3) while allocating gadget (node toolbar, owner GtkToolbar)
16:03:26 
16:03:26 (SWT:2264): Gtk-WARNING **: 20:03:26.208: Negative content width -6 (allocation 1, extents 4x3) while allocating gadget (node toolbar, owner GtkToolbar)
16:03:26 
16:03:26 (SWT:2264): Gtk-WARNING **: 20:03:26.212: Negative content width -6 (allocation 1, extents 4x3) while allocating gadget (node toolbar, owner GtkToolbar)
16:03:26 
16:03:26 (SWT:2264): Gtk-WARNING **: 20:03:26.212: Negative content width -6 (allocation 1, extents 4x3) while allocating gadget (node toolbar, owner GtkToolbar)
16:03:26 Running org.eclipse.egit.internal.mylyn.CommitHyperlinkDetectorTest
16:03:26 Tests run: 14, Failures: 0, Errors: 0, Skipped: 0, Time elapsed: 0.116 s - in org.eclipse.egit.internal.mylyn.CommitHyperlinkDetectorTest
16:03:26 testEndLine(org.eclipse.egit.internal.mylyn.CommitHyperlinkDetectorTest)  Time elapsed: 0.052 s
16:03:26 testGerritId(org.eclipse.egit.internal.mylyn.CommitHyperlinkDetectorTest)  Time elapsed: 0.004 s
16:03:26 testMiddleLine(org.eclipse.egit.internal.mylyn.CommitHyperlinkDetectorTest)  Time elapsed: 0.003 s
16:03:26 testOffsetOff(org.eclipse.egit.internal.mylyn.CommitHyperlinkDetectorTest)  Time elapsed: 0.003 s
16:03:26 testEmpty(org.eclipse.egit.internal.mylyn.CommitHyperlinkDetectorTest)  Time elapsed: 0.003 s
16:03:26 testBadLocation(org.eclipse.egit.internal.mylyn.CommitHyperlinkDetectorTest)  Time elapsed: 0.003 s
16:03:26 testEndSentence(org.eclipse.egit.internal.mylyn.CommitHyperlinkDetectorTest)  Time elapsed: 0.003 s
16:03:26 testMultiLine(org.eclipse.egit.internal.mylyn.CommitHyperlinkDetectorTest)  Time elapsed: 0.003 s
16:03:26 testBeginSentence(org.eclipse.egit.internal.mylyn.CommitHyperlinkDetectorTest)  Time elapsed: 0.003 s
16:03:26 testGerritIdWithinText(org.eclipse.egit.internal.mylyn.CommitHyperlinkDetectorTest)  Time elapsed: 0.003 s
16:03:26 testMultiId(org.eclipse.egit.internal.mylyn.CommitHyperlinkDetectorTest)  Time elapsed: 0.003 s
16:03:26 testSimpleId(org.eclipse.egit.internal.mylyn.CommitHyperlinkDetectorTest)  Time elapsed: 0.003 s
16:03:26 testNoDocument(org.eclipse.egit.internal.mylyn.CommitHyperlinkDetectorTest)  Time elapsed: 0.003 s
16:03:26 testOffsetMiddle(org.eclipse.egit.internal.mylyn.CommitHyperlinkDetectorTest)  Time elapsed: 0.003 s
16:03:26 
16:03:26 Results:
16:03:26 
16:03:26 Tests run: 14, Failures: 0, Errors: 0, Skipped: 0
16:03:26 
16:03:26 
16:03:26 (SWT:2264): Gtk-WARNING **: 20:03:26.515: Negative content width -6 (allocation 1, extents 4x3) while allocating gadget (node toolbar, owner GtkToolbar)
16:03:26 
16:03:26 (SWT:2264): Gtk-WARNING **: 20:03:26.516: Negative content width -6 (allocation 1, extents 4x3) while allocating gadget (node toolbar, owner GtkToolbar)
16:03:29 [INFO] All tests passed!
16:03:29 [INFO] 
16:03:29 [INFO] >>> spotbugs-maven-plugin:3.1.11:check (default) > :spotbugs @ org.eclipse.egit.mylyn.ui.test >>>
16:03:29 [INFO] 
16:03:29 [INFO] --- spotbugs-maven-plugin:3.1.11:spotbugs (spotbugs) @ org.eclipse.egit.mylyn.ui.test ---
16:03:29 [INFO] Fork Value is true
16:03:29      [java] Picked up JAVA_TOOL_OPTIONS: -XX:+IgnoreUnrecognizedVMOptions -XX:+UseContainerSupport -XX:+UnlockExperimentalVMOptions -XX:+UseCGroupMemoryLimitForHeap
16:03:29      [java] Picked up _JAVA_OPTIONS: -XX:MaxRAMPercentage=64.0
16:03:32 [INFO] Done SpotBugs Analysis....
16:03:32 [INFO] 
16:03:32 [INFO] <<< spotbugs-maven-plugin:3.1.11:check (default) < :spotbugs @ org.eclipse.egit.mylyn.ui.test <<<
16:03:32 [INFO] 
16:03:32 [INFO] 
16:03:32 [INFO] --- spotbugs-maven-plugin:3.1.11:check (default) @ org.eclipse.egit.mylyn.ui.test ---
16:03:32 [INFO] BugInstance size is 0
16:03:32 [INFO] Error size is 0
16:03:32 [INFO] No errors/warnings found
16:03:32 [INFO] 
16:03:32 [INFO] >>> maven-pmd-plugin:3.11.0:cpd-check (default) > :cpd @ org.eclipse.egit.mylyn.ui.test >>>
16:03:32 [INFO] 
16:03:32 [INFO] --- maven-pmd-plugin:3.11.0:cpd (cpd) @ org.eclipse.egit.mylyn.ui.test ---
16:03:32 [INFO] 
16:03:32 [INFO] <<< maven-pmd-plugin:3.11.0:cpd-check (default) < :cpd @ org.eclipse.egit.mylyn.ui.test <<<
16:03:32 [INFO] 
16:03:32 [INFO] 
16:03:32 [INFO] --- maven-pmd-plugin:3.11.0:cpd-check (default) @ org.eclipse.egit.mylyn.ui.test ---
16:03:32 [INFO] 
16:03:32 [INFO] 
16:03:32 [INFO] --- tycho-pack200a-plugin:1.3.0:normalize (pack200-normalize) @ org.eclipse.egit.mylyn.ui.test ---
16:03:32 [INFO] Pack200 normalizing jar /home/jenkins/workspace/egit/repo/org.eclipse.egit.mylyn.ui.test/target/org.eclipse.egit.mylyn.ui.test-5.4.0-SNAPSHOT.jar
16:03:32 [INFO] 
16:03:32 [INFO] --- eclipse-jarsigner-plugin:1.1.5:sign (sign) @ org.eclipse.egit.mylyn.ui.test ---
16:03:32 [INFO] Signing jar: /home/jenkins/workspace/egit/repo/org.eclipse.egit.mylyn.ui.test/target/org.eclipse.egit.mylyn.ui.test-5.4.0-SNAPSHOT.jar
16:03:33 [INFO] 
16:03:33 [INFO] --- tycho-pack200b-plugin:1.3.0:pack (pack200-pack) @ org.eclipse.egit.mylyn.ui.test ---
16:03:33 [INFO] Pack200 packing jar /home/jenkins/workspace/egit/repo/org.eclipse.egit.mylyn.ui.test/target/org.eclipse.egit.mylyn.ui.test-5.4.0-SNAPSHOT.jar
16:03:33 [INFO] 
16:03:33 [INFO] --- tycho-p2-plugin:1.3.0:p2-metadata (p2-metadata) @ org.eclipse.egit.mylyn.ui.test ---
16:03:33 [INFO] 
16:03:33 [INFO] --- maven-install-plugin:2.3.1:install (default-install) @ org.eclipse.egit.mylyn.ui.test ---
16:03:33 [INFO] Installing /home/jenkins/workspace/egit/repo/org.eclipse.egit.mylyn.ui.test/target/org.eclipse.egit.mylyn.ui.test-5.4.0-SNAPSHOT.jar to /home/jenkins/workspace/egit/.repository/org/eclipse/egit/org.eclipse.egit.mylyn.ui.test/5.4.0-SNAPSHOT/org.eclipse.egit.mylyn.ui.test-5.4.0-SNAPSHOT.jar
16:03:33 [INFO] Installing /home/jenkins/workspace/egit/repo/org.eclipse.egit.mylyn.ui.test/pom.xml to /home/jenkins/workspace/egit/.repository/org/eclipse/egit/org.eclipse.egit.mylyn.ui.test/5.4.0-SNAPSHOT/org.eclipse.egit.mylyn.ui.test-5.4.0-SNAPSHOT.pom
16:03:33 [INFO] Installing /home/jenkins/workspace/egit/repo/org.eclipse.egit.mylyn.ui.test/target/org.eclipse.egit.mylyn.ui.test-5.4.0-SNAPSHOT.jar.pack.gz to /home/jenkins/workspace/egit/.repository/org/eclipse/egit/org.eclipse.egit.mylyn.ui.test/5.4.0-SNAPSHOT/org.eclipse.egit.mylyn.ui.test-5.4.0-SNAPSHOT-pack200.jar.pack.gz
16:03:33 [INFO] Installing /home/jenkins/workspace/egit/repo/org.eclipse.egit.mylyn.ui.test/target/p2content.xml to /home/jenkins/workspace/egit/.repository/org/eclipse/egit/org.eclipse.egit.mylyn.ui.test/5.4.0-SNAPSHOT/org.eclipse.egit.mylyn.ui.test-5.4.0-SNAPSHOT-p2metadata.xml
16:03:33 [INFO] Installing /home/jenkins/workspace/egit/repo/org.eclipse.egit.mylyn.ui.test/target/p2artifacts.xml to /home/jenkins/workspace/egit/.repository/org/eclipse/egit/org.eclipse.egit.mylyn.ui.test/5.4.0-SNAPSHOT/org.eclipse.egit.mylyn.ui.test-5.4.0-SNAPSHOT-p2artifacts.xml
16:03:33 [INFO] 
16:03:33 [INFO] --- tycho-p2-plugin:1.3.0:update-local-index (default-update-local-index) @ org.eclipse.egit.mylyn.ui.test ---
16:03:33 [INFO] 
16:03:33 [INFO] --------< org.eclipse.egit:org.eclipse.egit.ui.importer.tests >---------
16:03:33 [INFO] Building Git Team Provider (experimental auto-import wizard, incubation) 5.4.0-SNAPSHOT [21/21]
16:03:33 [INFO] ------------------------[ eclipse-test-plugin ]-------------------------
16:03:33 [INFO] 
16:03:33 [INFO] --- maven-clean-plugin:2.5:clean (default-clean) @ org.eclipse.egit.ui.importer.tests ---
16:03:33 [INFO] 
16:03:33 [INFO] --- tycho-packaging-plugin:1.3.0:build-qualifier (default-build-qualifier) @ org.eclipse.egit.ui.importer.tests ---
16:03:33 [INFO] The project's OSGi version is 5.4.0.201903211937
16:03:33 [INFO] 
16:03:33 [INFO] --- tycho-packaging-plugin:1.3.0:validate-id (default-validate-id) @ org.eclipse.egit.ui.importer.tests ---
16:03:33 [INFO] 
16:03:33 [INFO] --- tycho-packaging-plugin:1.3.0:validate-version (default-validate-version) @ org.eclipse.egit.ui.importer.tests ---
16:03:33 [INFO] 
16:03:33 [INFO] --- maven-enforcer-plugin:3.0.0-M2:enforce (enforce-maven) @ org.eclipse.egit.ui.importer.tests ---
16:03:33 [INFO] 
16:03:33 [INFO] --- maven-resources-plugin:2.4.3:resources (default-resources) @ org.eclipse.egit.ui.importer.tests ---
16:03:33 [INFO] Using 'UTF-8' encoding to copy filtered resources.
16:03:33 [INFO] skip non existing resourceDirectory /home/jenkins/workspace/egit/repo/org.eclipse.egit.ui.importer.tests/src/main/resources
16:03:33 [INFO] 
16:03:33 [INFO] --- tycho-compiler-plugin:1.3.0:compile (default-compile) @ org.eclipse.egit.ui.importer.tests ---
16:03:33 [INFO] Compiling 1 source file to /home/jenkins/workspace/egit/repo/org.eclipse.egit.ui.importer.tests/target/classes
16:03:33 [INFO] 
16:03:33 [INFO] --- maven-resources-plugin:2.4.3:testResources (default-testResources) @ org.eclipse.egit.ui.importer.tests ---
16:03:33 [INFO] Using 'UTF-8' encoding to copy filtered resources.
16:03:33 [INFO] skip non existing resourceDirectory /home/jenkins/workspace/egit/repo/org.eclipse.egit.ui.importer.tests/src/test/resources
16:03:33 [INFO] 
16:03:33 [INFO] --- tycho-source-plugin:1.3.0:plugin-source (attach-source) @ org.eclipse.egit.ui.importer.tests ---
16:03:33 [INFO] Building jar: /home/jenkins/workspace/egit/repo/org.eclipse.egit.ui.importer.tests/target/org.eclipse.egit.ui.importer.tests-5.4.0-SNAPSHOT-sources.jar
16:03:33 [INFO] 
16:03:33 [INFO] --- target-platform-configuration:1.3.0:target-platform (default-target-platform) @ org.eclipse.egit.ui.importer.tests ---
16:03:33 [INFO] 
16:03:33 [INFO] --- tycho-packaging-plugin:1.3.0:package-plugin (default-package-plugin) @ org.eclipse.egit.ui.importer.tests ---
16:03:33 [INFO] Building jar: /home/jenkins/workspace/egit/repo/org.eclipse.egit.ui.importer.tests/target/org.eclipse.egit.ui.importer.tests-5.4.0-SNAPSHOT.jar
16:03:33 [INFO] 
16:03:33 [INFO] --- tycho-p2-plugin:1.3.0:p2-metadata-default (default-p2-metadata-default) @ org.eclipse.egit.ui.importer.tests ---
16:03:33 [INFO] 
16:03:33 [INFO] --- tycho-surefire-plugin:1.3.0:test (default-test) @ org.eclipse.egit.ui.importer.tests ---
16:03:34 [INFO] Expected eclipse log file: /home/jenkins/workspace/egit/repo/org.eclipse.egit.ui.importer.tests/target/work/data/.metadata/.log
16:03:34 [INFO] Command line:
16:03:34 	[/opt/tools/java/oracle/jdk-8/1.8.0_202/jre/bin/java, -Dosgi.noShutdown=false, -Dosgi.os=linux, -Dosgi.ws=gtk, -Dosgi.arch=x86_64, -Declipse.consoleLog=true, -Degit.test.tmpdir=/home/jenkins/workspace/egit/tmp/egit.tmp/, -Dorg.eclipse.swtbot.search.timeout=30000, -Xmx1536m, -Dosgi.clean=true, -jar, /home/jenkins/workspace/egit/.repository/p2/osgi/bundle/org.eclipse.equinox.launcher/1.3.201.v20161025-1711/org.eclipse.equinox.launcher-1.3.201.v20161025-1711.jar, -data, /home/jenkins/workspace/egit/repo/org.eclipse.egit.ui.importer.tests/target/work/data, -install, /home/jenkins/workspace/egit/repo/org.eclipse.egit.ui.importer.tests/target/work, -configuration, /home/jenkins/workspace/egit/repo/org.eclipse.egit.ui.importer.tests/target/work/configuration, -application, org.eclipse.tycho.surefire.osgibooter.uitest, -testproperties, /home/jenkins/workspace/egit/repo/org.eclipse.egit.ui.importer.tests/target/surefire.properties, -testApplication, org.eclipse.ui.ide.workbench, -nouithread]
16:03:34 Picked up JAVA_TOOL_OPTIONS: -XX:+IgnoreUnrecognizedVMOptions -XX:+UseContainerSupport -XX:+UnlockExperimentalVMOptions -XX:+UseCGroupMemoryLimitForHeap
16:03:34 Picked up _JAVA_OPTIONS: -XX:MaxRAMPercentage=64.0
16:03:35 Launching application org.eclipse.ui.ide.workbench...
16:03:37 !SESSION 2019-03-21 20:03:34.230 -----------------------------------------------
16:03:37 eclipse.buildId=unknown
16:03:37 java.version=1.8.0_202
16:03:37 java.vendor=Oracle Corporation
16:03:37 BootLoader constants: OS=linux, ARCH=x86_64, WS=gtk, NL=en_US
16:03:37 Framework arguments:  -application org.eclipse.tycho.surefire.osgibooter.uitest -testproperties /home/jenkins/workspace/egit/repo/org.eclipse.egit.ui.importer.tests/target/surefire.properties -testApplication org.eclipse.ui.ide.workbench -nouithread
16:03:37 Command-line arguments:  -data /home/jenkins/workspace/egit/repo/org.eclipse.egit.ui.importer.tests/target/work/data -application org.eclipse.tycho.surefire.osgibooter.uitest -testproperties /home/jenkins/workspace/egit/repo/org.eclipse.egit.ui.importer.tests/target/surefire.properties -testApplication org.eclipse.ui.ide.workbench -nouithread
16:03:37 
16:03:37 !ENTRY org.eclipse.osgi 4 0 2019-03-21 20:03:37.421
16:03:37 !MESSAGE An error occurred while automatically activating bundle org.eclipse.egit.ui (81).
16:03:37 !STACK 0
16:03:37 org.osgi.framework.BundleException: Exception in org.eclipse.egit.ui.Activator.start() of bundle org.eclipse.egit.ui.
16:03:37 	at org.eclipse.osgi.internal.framework.BundleContextImpl.startActivator(BundleContextImpl.java:795)
16:03:37 	at org.eclipse.osgi.internal.framework.BundleContextImpl.start(BundleContextImpl.java:724)
16:03:37 	at org.eclipse.osgi.internal.framework.EquinoxBundle.startWorker0(EquinoxBundle.java:932)
16:03:37 	at org.eclipse.osgi.internal.framework.EquinoxBundle$EquinoxModule.startWorker(EquinoxBundle.java:309)
16:03:37 	at org.eclipse.osgi.container.Module.doStart(Module.java:581)
16:03:37 	at org.eclipse.osgi.container.Module.start(Module.java:449)
16:03:37 	at org.eclipse.osgi.framework.util.SecureAction.start(SecureAction.java:470)
16:03:37 	at org.eclipse.osgi.internal.hooks.EclipseLazyStarter.postFindLocalClass(EclipseLazyStarter.java:107)
16:03:37 	at org.eclipse.osgi.internal.loader.classpath.ClasspathManager.findLocalClass(ClasspathManager.java:529)
16:03:37 	at org.eclipse.osgi.internal.loader.ModuleClassLoader.findLocalClass(ModuleClassLoader.java:325)
16:03:37 	at org.eclipse.osgi.internal.loader.BundleLoader.findLocalClass(BundleLoader.java:345)
16:03:37 	at org.eclipse.osgi.internal.loader.BundleLoader.findClassInternal(BundleLoader.java:423)
16:03:37 	at org.eclipse.osgi.internal.loader.BundleLoader.findClass(BundleLoader.java:372)
16:03:37 	at org.eclipse.osgi.internal.loader.BundleLoader.findClass(BundleLoader.java:364)
16:03:37 	at org.eclipse.osgi.internal.loader.ModuleClassLoader.loadClass(ModuleClassLoader.java:161)
16:03:37 	at java.lang.ClassLoader.loadClass(ClassLoader.java:357)
16:03:37 	at org.eclipse.osgi.internal.framework.EquinoxBundle.loadClass(EquinoxBundle.java:564)
16:03:37 	at org.eclipse.core.internal.registry.osgi.RegistryStrategyOSGI.createExecutableExtension(RegistryStrategyOSGI.java:174)
16:03:37 	at org.eclipse.core.internal.registry.ExtensionRegistry.createExecutableExtension(ExtensionRegistry.java:905)
16:03:37 	at org.eclipse.core.internal.registry.ConfigurationElement.createExecutableExtension(ConfigurationElement.java:243)
16:03:37 	at org.eclipse.core.internal.registry.ConfigurationElementHandle.createExecutableExtension(ConfigurationElementHandle.java:55)
16:03:37 	at org.eclipse.ui.internal.services.WorkbenchServiceRegistry.getSourceProviders(WorkbenchServiceRegistry.java:177)
16:03:37 	at org.eclipse.ui.internal.services.SourceProviderService.readRegistry(SourceProviderService.java:108)
16:03:37 	at org.eclipse.ui.internal.Workbench$47.runWithException(Workbench.java:2447)
16:03:37 	at org.eclipse.ui.internal.StartupThreading$StartupRunnable.run(StartupThreading.java:32)
16:03:37 	at org.eclipse.swt.widgets.Synchronizer.syncExec(Synchronizer.java:233)
16:03:37 	at org.eclipse.ui.internal.UISynchronizer.syncExec(UISynchronizer.java:145)
16:03:37 	at org.eclipse.swt.widgets.Display.syncExec(Display.java:5414)
16:03:37 	at org.eclipse.ui.internal.StartupThreading.runWithoutExceptions(StartupThreading.java:95)
16:03:37 	at org.eclipse.ui.internal.Workbench.initializeDefaultServices(Workbench.java:2442)
16:03:37 	at org.eclipse.ui.internal.Workbench.init(Workbench.java:1678)
16:03:37 	at org.eclipse.ui.internal.Workbench.runUI(Workbench.java:2944)
16:03:37 	at org.eclipse.ui.internal.Workbench.access$9(Workbench.java:2875)
16:03:37 	at org.eclipse.ui.internal.Workbench$5.run(Workbench.java:684)
16:03:37 	at org.eclipse.core.databinding.observable.Realm.runWithDefault(Realm.java:336)
16:03:37 	at org.eclipse.ui.internal.Workbench.createAndRunWorkbench(Workbench.java:610)
16:03:37 	at org.eclipse.ui.PlatformUI.createAndRunWorkbench(PlatformUI.java:148)
16:03:37 	at org.eclipse.ui.internal.ide.application.IDEApplication.start(IDEApplication.java:138)
16:03:37 	at org.eclipse.tycho.surefire.osgibooter.UITestApplication.runApplication(UITestApplication.java:31)
16:03:37 	at org.eclipse.tycho.surefire.osgibooter.AbstractUITestApplication.run(AbstractUITestApplication.java:120)
16:03:37 	at org.eclipse.tycho.surefire.osgibooter.UITestApplication.start(UITestApplication.java:37)
16:03:37 	at org.eclipse.equinox.internal.app.EclipseAppHandle.run(EclipseAppHandle.java:196)
16:03:37 	at org.eclipse.core.runtime.internal.adaptor.EclipseAppLauncher.runApplication(EclipseAppLauncher.java:134)
16:03:37 	at org.eclipse.core.runtime.internal.adaptor.EclipseAppLauncher.start(EclipseAppLauncher.java:104)
16:03:37 	at org.eclipse.core.runtime.adaptor.EclipseStarter.run(EclipseStarter.java:388)
16:03:37 	at org.eclipse.core.runtime.adaptor.EclipseStarter.run(EclipseStarter.java:243)
16:03:37 	at sun.reflect.NativeMethodAccessorImpl.invoke0(Native Method)
16:03:37 	at sun.reflect.NativeMethodAccessorImpl.invoke(NativeMethodAccessorImpl.java:62)
16:03:37 	at sun.reflect.DelegatingMethodAccessorImpl.invoke(DelegatingMethodAccessorImpl.java:43)
16:03:37 	at java.lang.reflect.Method.invoke(Method.java:498)
16:03:37 	at org.eclipse.equinox.launcher.Main.invokeFramework(Main.java:673)
16:03:37 	at org.eclipse.equinox.launcher.Main.basicRun(Main.java:610)
16:03:37 	at org.eclipse.equinox.launcher.Main.run(Main.java:1519)
16:03:37 	at org.eclipse.equinox.launcher.Main.main(Main.java:1492)
16:03:37 Caused by: java.lang.NoClassDefFoundError: org/eclipse/core/resources/IResource
16:03:37 	at org.eclipse.egit.ui.Activator.setupRepoChangeScanner(Activator.java:1081)
16:03:37 	at org.eclipse.egit.ui.Activator.start(Activator.java:355)
16:03:37 	at org.eclipse.osgi.internal.framework.BundleContextImpl$3.run(BundleContextImpl.java:774)
16:03:37 	at org.eclipse.osgi.internal.framework.BundleContextImpl$3.run(BundleContextImpl.java:1)
16:03:37 	at java.security.AccessController.doPrivileged(Native Method)
16:03:37 	at org.eclipse.osgi.internal.framework.BundleContextImpl.startActivator(BundleContextImpl.java:767)
16:03:37 	... 53 more
16:03:37 Caused by: java.lang.ClassNotFoundException: org.eclipse.core.resources.IResource cannot be found by org.eclipse.egit.ui_5.4.0.201903211937
16:03:37 	at org.eclipse.osgi.internal.loader.BundleLoader.findClassInternal(BundleLoader.java:461)
16:03:37 	at org.eclipse.osgi.internal.loader.BundleLoader.findClass(BundleLoader.java:372)
16:03:37 	at org.eclipse.osgi.internal.loader.BundleLoader.findClass(BundleLoader.java:364)
16:03:37 	at org.eclipse.osgi.internal.loader.ModuleClassLoader.loadClass(ModuleClassLoader.java:161)
16:03:37 	at java.lang.ClassLoader.loadClass(ClassLoader.java:357)
16:03:37 	... 59 more
16:03:37 Root exception:
16:03:37 java.lang.NoClassDefFoundError: org/eclipse/core/resources/IResource
16:03:37 	at org.eclipse.egit.ui.Activator.setupRepoChangeScanner(Activator.java:1081)
16:03:37 	at org.eclipse.egit.ui.Activator.start(Activator.java:355)
16:03:37 	at org.eclipse.osgi.internal.framework.BundleContextImpl$3.run(BundleContextImpl.java:774)
16:03:37 	at org.eclipse.osgi.internal.framework.BundleContextImpl$3.run(BundleContextImpl.java:1)
16:03:37 	at java.security.AccessController.doPrivileged(Native Method)
16:03:37 	at org.eclipse.osgi.internal.framework.BundleContextImpl.startActivator(BundleContextImpl.java:767)
16:03:37 	at org.eclipse.osgi.internal.framework.BundleContextImpl.start(BundleContextImpl.java:724)
16:03:37 	at org.eclipse.osgi.internal.framework.EquinoxBundle.startWorker0(EquinoxBundle.java:932)
16:03:37 	at org.eclipse.osgi.internal.framework.EquinoxBundle$EquinoxModule.startWorker(EquinoxBundle.java:309)
16:03:37 	at org.eclipse.osgi.container.Module.doStart(Module.java:581)
16:03:37 	at org.eclipse.osgi.container.Module.start(Module.java:449)
16:03:37 	at org.eclipse.osgi.framework.util.SecureAction.start(SecureAction.java:470)
16:03:37 	at org.eclipse.osgi.internal.hooks.EclipseLazyStarter.postFindLocalClass(EclipseLazyStarter.java:107)
16:03:37 	at org.eclipse.osgi.internal.loader.classpath.ClasspathManager.findLocalClass(ClasspathManager.java:529)
16:03:37 	at org.eclipse.osgi.internal.loader.ModuleClassLoader.findLocalClass(ModuleClassLoader.java:325)
16:03:37 	at org.eclipse.osgi.internal.loader.BundleLoader.findLocalClass(BundleLoader.java:345)
16:03:37 	at org.eclipse.osgi.internal.loader.BundleLoader.findClassInternal(BundleLoader.java:423)
16:03:37 	at org.eclipse.osgi.internal.loader.BundleLoader.findClass(BundleLoader.java:372)
16:03:37 	at org.eclipse.osgi.internal.loader.BundleLoader.findClass(BundleLoader.java:364)
16:03:37 	at org.eclipse.osgi.internal.loader.ModuleClassLoader.loadClass(ModuleClassLoader.java:161)
16:03:37 	at java.lang.ClassLoader.loadClass(ClassLoader.java:357)
16:03:37 	at org.eclipse.osgi.internal.framework.EquinoxBundle.loadClass(EquinoxBundle.java:564)
16:03:37 	at org.eclipse.core.internal.registry.osgi.RegistryStrategyOSGI.createExecutableExtension(RegistryStrategyOSGI.java:174)
16:03:37 	at org.eclipse.core.internal.registry.ExtensionRegistry.createExecutableExtension(ExtensionRegistry.java:905)
16:03:37 	at org.eclipse.core.internal.registry.ConfigurationElement.createExecutableExtension(ConfigurationElement.java:243)
16:03:37 	at org.eclipse.core.internal.registry.ConfigurationElementHandle.createExecutableExtension(ConfigurationElementHandle.java:55)
16:03:37 	at org.eclipse.ui.internal.services.WorkbenchServiceRegistry.getSourceProviders(WorkbenchServiceRegistry.java:177)
16:03:37 	at org.eclipse.ui.internal.services.SourceProviderService.readRegistry(SourceProviderService.java:108)
16:03:37 	at org.eclipse.ui.internal.Workbench$47.runWithException(Workbench.java:2447)
16:03:37 	at org.eclipse.ui.internal.StartupThreading$StartupRunnable.run(StartupThreading.java:32)
16:03:37 	at org.eclipse.swt.widgets.Synchronizer.syncExec(Synchronizer.java:233)
16:03:37 	at org.eclipse.ui.internal.UISynchronizer.syncExec(UISynchronizer.java:145)
16:03:37 	at org.eclipse.swt.widgets.Display.syncExec(Display.java:5414)
16:03:37 	at org.eclipse.ui.internal.StartupThreading.runWithoutExceptions(StartupThreading.java:95)
16:03:37 	at org.eclipse.ui.internal.Workbench.initializeDefaultServices(Workbench.java:2442)
16:03:37 	at org.eclipse.ui.internal.Workbench.init(Workbench.java:1678)
16:03:37 	at org.eclipse.ui.internal.Workbench.runUI(Workbench.java:2944)
16:03:37 	at org.eclipse.ui.internal.Workbench.access$9(Workbench.java:2875)
16:03:37 	at org.eclipse.ui.internal.Workbench$5.run(Workbench.java:684)
16:03:37 	at org.eclipse.core.databinding.observable.Realm.runWithDefault(Realm.java:336)
16:03:37 	at org.eclipse.ui.internal.Workbench.createAndRunWorkbench(Workbench.java:610)
16:03:37 	at org.eclipse.ui.PlatformUI.createAndRunWorkbench(PlatformUI.java:148)
16:03:37 	at org.eclipse.ui.internal.ide.application.IDEApplication.start(IDEApplication.java:138)
16:03:37 	at org.eclipse.tycho.surefire.osgibooter.UITestApplication.runApplication(UITestApplication.java:31)
16:03:37 	at org.eclipse.tycho.surefire.osgibooter.AbstractUITestApplication.run(AbstractUITestApplication.java:120)
16:03:37 	at org.eclipse.tycho.surefire.osgibooter.UITestApplication.start(UITestApplication.java:37)
16:03:37 	at org.eclipse.equinox.internal.app.EclipseAppHandle.run(EclipseAppHandle.java:196)
16:03:37 	at org.eclipse.core.runtime.internal.adaptor.EclipseAppLauncher.runApplication(EclipseAppLauncher.java:134)
16:03:37 	at org.eclipse.core.runtime.internal.adaptor.EclipseAppLauncher.start(EclipseAppLauncher.java:104)
16:03:37 	at org.eclipse.core.runtime.adaptor.EclipseStarter.run(EclipseStarter.java:388)
16:03:37 	at org.eclipse.core.runtime.adaptor.EclipseStarter.run(EclipseStarter.java:243)
16:03:37 	at sun.reflect.NativeMethodAccessorImpl.invoke0(Native Method)
16:03:37 	at sun.reflect.NativeMethodAccessorImpl.invoke(NativeMethodAccessorImpl.java:62)
16:03:37 	at sun.reflect.DelegatingMethodAccessorImpl.invoke(DelegatingMethodAccessorImpl.java:43)
16:03:37 	at java.lang.reflect.Method.invoke(Method.java:498)
16:03:37 	at org.eclipse.equinox.launcher.Main.invokeFramework(Main.java:673)
16:03:37 	at org.eclipse.equinox.launcher.Main.basicRun(Main.java:610)
16:03:37 	at org.eclipse.equinox.launcher.Main.run(Main.java:1519)
16:03:37 	at org.eclipse.equinox.launcher.Main.main(Main.java:1492)
16:03:37 Caused by: java.lang.ClassNotFoundException: org.eclipse.core.resources.IResource cannot be found by org.eclipse.egit.ui_5.4.0.201903211937
16:03:37 	at org.eclipse.osgi.internal.loader.BundleLoader.findClassInternal(BundleLoader.java:461)
16:03:37 	at org.eclipse.osgi.internal.loader.BundleLoader.findClass(BundleLoader.java:372)
16:03:37 	at org.eclipse.osgi.internal.loader.BundleLoader.findClass(BundleLoader.java:364)
16:03:37 	at org.eclipse.osgi.internal.loader.ModuleClassLoader.loadClass(ModuleClassLoader.java:161)
16:03:37 	at java.lang.ClassLoader.loadClass(ClassLoader.java:357)
16:03:37 	... 59 more
16:03:37 
16:03:37 !ENTRY org.eclipse.equinox.registry 4 1 2019-03-21 20:03:37.432
16:03:37 !MESSAGE Plug-in org.eclipse.egit.ui was unable to load class org.eclipse.egit.ui.internal.selection.RepositorySourceProvider.
16:03:37 !STACK 0
16:03:37 java.lang.ClassNotFoundException: An error occurred while automatically activating bundle org.eclipse.egit.ui (81).
16:03:37 	at org.eclipse.osgi.internal.hooks.EclipseLazyStarter.postFindLocalClass(EclipseLazyStarter.java:116)
16:03:37 	at org.eclipse.osgi.internal.loader.classpath.ClasspathManager.findLocalClass(ClasspathManager.java:529)
16:03:37 	at org.eclipse.osgi.internal.loader.ModuleClassLoader.findLocalClass(ModuleClassLoader.java:325)
16:03:37 	at org.eclipse.osgi.internal.loader.BundleLoader.findLocalClass(BundleLoader.java:345)
16:03:37 	at org.eclipse.osgi.internal.loader.BundleLoader.findClassInternal(BundleLoader.java:423)
16:03:37 	at org.eclipse.osgi.internal.loader.BundleLoader.findClass(BundleLoader.java:372)
16:03:37 	at org.eclipse.osgi.internal.loader.BundleLoader.findClass(BundleLoader.java:364)
16:03:37 	at org.eclipse.osgi.internal.loader.ModuleClassLoader.loadClass(ModuleClassLoader.java:161)
16:03:37 	at java.lang.ClassLoader.loadClass(ClassLoader.java:357)
16:03:37 	at org.eclipse.osgi.internal.framework.EquinoxBundle.loadClass(EquinoxBundle.java:564)
16:03:37 	at org.eclipse.core.internal.registry.osgi.RegistryStrategyOSGI.createExecutableExtension(RegistryStrategyOSGI.java:174)
16:03:37 	at org.eclipse.core.internal.registry.ExtensionRegistry.createExecutableExtension(ExtensionRegistry.java:905)
16:03:37 	at org.eclipse.core.internal.registry.ConfigurationElement.createExecutableExtension(ConfigurationElement.java:243)
16:03:37 	at org.eclipse.core.internal.registry.ConfigurationElementHandle.createExecutableExtension(ConfigurationElementHandle.java:55)
16:03:37 	at org.eclipse.ui.internal.services.WorkbenchServiceRegistry.getSourceProviders(WorkbenchServiceRegistry.java:177)
16:03:37 	at org.eclipse.ui.internal.services.SourceProviderService.readRegistry(SourceProviderService.java:108)
16:03:37 	at org.eclipse.ui.internal.Workbench$47.runWithException(Workbench.java:2447)
16:03:37 	at org.eclipse.ui.internal.StartupThreading$StartupRunnable.run(StartupThreading.java:32)
16:03:37 	at org.eclipse.swt.widgets.Synchronizer.syncExec(Synchronizer.java:233)
16:03:37 	at org.eclipse.ui.internal.UISynchronizer.syncExec(UISynchronizer.java:145)
16:03:37 	at org.eclipse.swt.widgets.Display.syncExec(Display.java:5414)
16:03:37 	at org.eclipse.ui.internal.StartupThreading.runWithoutExceptions(StartupThreading.java:95)
16:03:37 	at org.eclipse.ui.internal.Workbench.initializeDefaultServices(Workbench.java:2442)
16:03:37 	at org.eclipse.ui.internal.Workbench.init(Workbench.java:1678)
16:03:37 	at org.eclipse.ui.internal.Workbench.runUI(Workbench.java:2944)
16:03:37 	at org.eclipse.ui.internal.Workbench.access$9(Workbench.java:2875)
16:03:37 	at org.eclipse.ui.internal.Workbench$5.run(Workbench.java:684)
16:03:37 	at org.eclipse.core.databinding.observable.Realm.runWithDefault(Realm.java:336)
16:03:37 	at org.eclipse.ui.internal.Workbench.createAndRunWorkbench(Workbench.java:610)
16:03:37 	at org.eclipse.ui.PlatformUI.createAndRunWorkbench(PlatformUI.java:148)
16:03:37 	at org.eclipse.ui.internal.ide.application.IDEApplication.start(IDEApplication.java:138)
16:03:37 	at org.eclipse.tycho.surefire.osgibooter.UITestApplication.runApplication(UITestApplication.java:31)
16:03:37 	at org.eclipse.tycho.surefire.osgibooter.AbstractUITestApplication.run(AbstractUITestApplication.java:120)
16:03:37 	at org.eclipse.tycho.surefire.osgibooter.UITestApplication.start(UITestApplication.java:37)
16:03:37 	at org.eclipse.equinox.internal.app.EclipseAppHandle.run(EclipseAppHandle.java:196)
16:03:37 	at org.eclipse.core.runtime.internal.adaptor.EclipseAppLauncher.runApplication(EclipseAppLauncher.java:134)
16:03:37 	at org.eclipse.core.runtime.internal.adaptor.EclipseAppLauncher.start(EclipseAppLauncher.java:104)
16:03:37 	at org.eclipse.core.runtime.adaptor.EclipseStarter.run(EclipseStarter.java:388)
16:03:37 	at org.eclipse.core.runtime.adaptor.EclipseStarter.run(EclipseStarter.java:243)
16:03:37 	at sun.reflect.NativeMethodAccessorImpl.invoke0(Native Method)
16:03:37 	at sun.reflect.NativeMethodAccessorImpl.invoke(NativeMethodAccessorImpl.java:62)
16:03:37 	at sun.reflect.DelegatingMethodAccessorImpl.invoke(DelegatingMethodAccessorImpl.java:43)
16:03:37 	at java.lang.reflect.Method.invoke(Method.java:498)
16:03:37 	at org.eclipse.equinox.launcher.Main.invokeFramework(Main.java:673)
16:03:37 	at org.eclipse.equinox.launcher.Main.basicRun(Main.java:610)
16:03:37 	at org.eclipse.equinox.launcher.Main.run(Main.java:1519)
16:03:37 	at org.eclipse.equinox.launcher.Main.main(Main.java:1492)
16:03:37 Caused by: org.osgi.framework.BundleException: Exception in org.eclipse.egit.ui.Activator.start() of bundle org.eclipse.egit.ui.
16:03:37 	at org.eclipse.osgi.internal.framework.BundleContextImpl.startActivator(BundleContextImpl.java:795)
16:03:37 	at org.eclipse.osgi.internal.framework.BundleContextImpl.start(BundleContextImpl.java:724)
16:03:37 	at org.eclipse.osgi.internal.framework.EquinoxBundle.startWorker0(EquinoxBundle.java:932)
16:03:37 	at org.eclipse.osgi.internal.framework.EquinoxBundle$EquinoxModule.startWorker(EquinoxBundle.java:309)
16:03:37 	at org.eclipse.osgi.container.Module.doStart(Module.java:581)
16:03:37 	at org.eclipse.osgi.container.Module.start(Module.java:449)
16:03:37 	at org.eclipse.osgi.framework.util.SecureAction.start(SecureAction.java:470)
16:03:37 	at org.eclipse.osgi.internal.hooks.EclipseLazyStarter.postFindLocalClass(EclipseLazyStarter.java:107)
16:03:37 	... 46 more
16:03:37 Caused by: java.lang.NoClassDefFoundError: org/eclipse/core/resources/IResource
16:03:37 	at org.eclipse.egit.ui.Activator.setupRepoChangeScanner(Activator.java:1081)
16:03:37 	at org.eclipse.egit.ui.Activator.start(Activator.java:355)
16:03:37 	at org.eclipse.osgi.internal.framework.BundleContextImpl$3.run(BundleContextImpl.java:774)
16:03:37 	at org.eclipse.osgi.internal.framework.BundleContextImpl$3.run(BundleContextImpl.java:1)
16:03:37 	at java.security.AccessController.doPrivileged(Native Method)
16:03:37 	at org.eclipse.osgi.internal.framework.BundleContextImpl.startActivator(BundleContextImpl.java:767)
16:03:37 	... 53 more
16:03:37 Caused by: java.lang.ClassNotFoundException: org.eclipse.core.resources.IResource cannot be found by org.eclipse.egit.ui_5.4.0.201903211937
16:03:37 	at org.eclipse.osgi.internal.loader.BundleLoader.findClassInternal(BundleLoader.java:461)
16:03:37 	at org.eclipse.osgi.internal.loader.BundleLoader.findClass(BundleLoader.java:372)
16:03:37 	at org.eclipse.osgi.internal.loader.BundleLoader.findClass(BundleLoader.java:364)
16:03:37 	at org.eclipse.osgi.internal.loader.ModuleClassLoader.loadClass(ModuleClassLoader.java:161)
16:03:37 	at java.lang.ClassLoader.loadClass(ClassLoader.java:357)
16:03:37 	... 59 more
16:03:37 
16:03:37 !ENTRY org.eclipse.ui.workbench 4 2 2019-03-21 20:03:37.821
16:03:37 !MESSAGE Problems occurred when invoking code from plug-in: "org.eclipse.ui.workbench".
16:03:37 !STACK 1
16:03:37 org.eclipse.core.runtime.CoreException: Plug-in org.eclipse.egit.ui was unable to load class org.eclipse.egit.ui.internal.clone.GitCloneDropAdapter.
16:03:37 	at org.eclipse.core.internal.registry.osgi.RegistryStrategyOSGI.throwException(RegistryStrategyOSGI.java:194)
16:03:37 	at org.eclipse.core.internal.registry.osgi.RegistryStrategyOSGI.createExecutableExtension(RegistryStrategyOSGI.java:176)
16:03:37 	at org.eclipse.core.internal.registry.ExtensionRegistry.createExecutableExtension(ExtensionRegistry.java:905)
16:03:37 	at org.eclipse.core.internal.registry.ConfigurationElement.createExecutableExtension(ConfigurationElement.java:243)
16:03:37 	at org.eclipse.core.internal.registry.ConfigurationElementHandle.createExecutableExtension(ConfigurationElementHandle.java:55)
16:03:37 	at org.eclipse.ui.internal.WorkbenchPlugin$1.run(WorkbenchPlugin.java:291)
16:03:37 	at org.eclipse.swt.custom.BusyIndicator.showWhile(BusyIndicator.java:52)
16:03:37 	at org.eclipse.ui.internal.WorkbenchPlugin.createExtension(WorkbenchPlugin.java:286)
16:03:37 	at org.eclipse.ui.internal.EarlyStartupRunnable.run(EarlyStartupRunnable.java:53)
16:03:37 	at org.eclipse.core.runtime.SafeRunner.run(SafeRunner.java:42)
16:03:37 	at org.eclipse.ui.internal.Workbench$55.run(Workbench.java:2835)
16:03:37 	at org.eclipse.core.internal.jobs.Worker.run(Worker.java:55)
16:03:37 Caused by: java.lang.ClassNotFoundException: An error occurred while automatically activating bundle org.eclipse.egit.ui (81).
16:03:37 	at org.eclipse.osgi.internal.hooks.EclipseLazyStarter.postFindLocalClass(EclipseLazyStarter.java:116)
16:03:37 	at org.eclipse.osgi.internal.loader.classpath.ClasspathManager.findLocalClass(ClasspathManager.java:529)
16:03:37 	at org.eclipse.osgi.internal.loader.ModuleClassLoader.findLocalClass(ModuleClassLoader.java:325)
16:03:37 	at org.eclipse.osgi.internal.loader.BundleLoader.findLocalClass(BundleLoader.java:345)
16:03:37 	at org.eclipse.osgi.internal.loader.BundleLoader.findClassInternal(BundleLoader.java:423)
16:03:37 	at org.eclipse.osgi.internal.loader.BundleLoader.findClass(BundleLoader.java:372)
16:03:37 	at org.eclipse.osgi.internal.loader.BundleLoader.findClass(BundleLoader.java:364)
16:03:37 	at org.eclipse.osgi.internal.loader.ModuleClassLoader.loadClass(ModuleClassLoader.java:161)
16:03:37 	at java.lang.ClassLoader.loadClass(ClassLoader.java:357)
16:03:37 	at org.eclipse.osgi.internal.framework.EquinoxBundle.loadClass(EquinoxBundle.java:564)
16:03:37 	at org.eclipse.core.internal.registry.osgi.RegistryStrategyOSGI.createExecutableExtension(RegistryStrategyOSGI.java:174)
16:03:37 	at org.eclipse.core.internal.registry.ExtensionRegistry.createExecutableExtension(ExtensionRegistry.java:905)
16:03:37 	at org.eclipse.core.internal.registry.ConfigurationElement.createExecutableExtension(ConfigurationElement.java:243)
16:03:37 	at org.eclipse.core.internal.registry.ConfigurationElementHandle.createExecutableExtension(ConfigurationElementHandle.java:55)
16:03:37 	at org.eclipse.ui.internal.services.WorkbenchServiceRegistry.getSourceProviders(WorkbenchServiceRegistry.java:177)
16:03:37 	at org.eclipse.ui.internal.services.SourceProviderService.readRegistry(SourceProviderService.java:108)
16:03:37 	at org.eclipse.ui.internal.Workbench$47.runWithException(Workbench.java:2447)
16:03:37 	at org.eclipse.ui.internal.StartupThreading$StartupRunnable.run(StartupThreading.java:32)
16:03:37 	at org.eclipse.swt.widgets.Synchronizer.syncExec(Synchronizer.java:233)
16:03:37 	at org.eclipse.ui.internal.UISynchronizer.syncExec(UISynchronizer.java:145)
16:03:37 	at org.eclipse.swt.widgets.Display.syncExec(Display.java:5414)
16:03:37 	at org.eclipse.ui.internal.StartupThreading.runWithoutExceptions(StartupThreading.java:95)
16:03:37 	at org.eclipse.ui.internal.Workbench.initializeDefaultServices(Workbench.java:2442)
16:03:37 	at org.eclipse.ui.internal.Workbench.init(Workbench.java:1678)
16:03:37 	at org.eclipse.ui.internal.Workbench.runUI(Workbench.java:2944)
16:03:37 	at org.eclipse.ui.internal.Workbench.access$9(Workbench.java:2875)
16:03:37 	at org.eclipse.ui.internal.Workbench$5.run(Workbench.java:684)
16:03:37 	at org.eclipse.core.databinding.observable.Realm.runWithDefault(Realm.java:336)
16:03:37 	at org.eclipse.ui.internal.Workbench.createAndRunWorkbench(Workbench.java:610)
16:03:37 	at org.eclipse.ui.PlatformUI.createAndRunWorkbench(PlatformUI.java:148)
16:03:37 	at org.eclipse.ui.internal.ide.application.IDEApplication.start(IDEApplication.java:138)
16:03:37 	at org.eclipse.tycho.surefire.osgibooter.UITestApplication.runApplication(UITestApplication.java:31)
16:03:37 	at org.eclipse.tycho.surefire.osgibooter.AbstractUITestApplication.run(AbstractUITestApplication.java:120)
16:03:37 	at org.eclipse.tycho.surefire.osgibooter.UITestApplication.start(UITestApplication.java:37)
16:03:37 	at org.eclipse.equinox.internal.app.EclipseAppHandle.run(EclipseAppHandle.java:196)
16:03:37 	at org.eclipse.core.runtime.internal.adaptor.EclipseAppLauncher.runApplication(EclipseAppLauncher.java:134)
16:03:37 	at org.eclipse.core.runtime.internal.adaptor.EclipseAppLauncher.start(EclipseAppLauncher.java:104)
16:03:37 	at org.eclipse.core.runtime.adaptor.EclipseStarter.run(EclipseStarter.java:388)
16:03:37 	at org.eclipse.core.runtime.adaptor.EclipseStarter.run(EclipseStarter.java:243)
16:03:37 	at sun.reflect.NativeMethodAccessorImpl.invoke0(Native Method)
16:03:37 	at sun.reflect.NativeMethodAccessorImpl.invoke(NativeMethodAccessorImpl.java:62)
16:03:37 	at sun.reflect.DelegatingMethodAccessorImpl.invoke(DelegatingMethodAccessorImpl.java:43)
16:03:37 	at java.lang.reflect.Method.invoke(Method.java:498)
16:03:37 	at org.eclipse.equinox.launcher.Main.invokeFramework(Main.java:673)
16:03:37 	at org.eclipse.equinox.launcher.Main.basicRun(Main.java:610)
16:03:37 	at org.eclipse.equinox.launcher.Main.run(Main.java:1519)
16:03:37 	at org.eclipse.equinox.launcher.Main.main(Main.java:1492)
16:03:37 Caused by: org.osgi.framework.BundleException: Exception in org.eclipse.egit.ui.Activator.start() of bundle org.eclipse.egit.ui.
16:03:37 	at org.eclipse.osgi.internal.framework.BundleContextImpl.startActivator(BundleContextImpl.java:795)
16:03:37 	at org.eclipse.osgi.internal.framework.BundleContextImpl.start(BundleContextImpl.java:724)
16:03:37 	at org.eclipse.osgi.internal.framework.EquinoxBundle.startWorker0(EquinoxBundle.java:932)
16:03:37 	at org.eclipse.osgi.internal.framework.EquinoxBundle$EquinoxModule.startWorker(EquinoxBundle.java:309)
16:03:37 	at org.eclipse.osgi.container.Module.doStart(Module.java:581)
16:03:37 	at org.eclipse.osgi.container.Module.start(Module.java:449)
16:03:37 	at org.eclipse.osgi.framework.util.SecureAction.start(SecureAction.java:470)
16:03:37 	at org.eclipse.osgi.internal.hooks.EclipseLazyStarter.postFindLocalClass(EclipseLazyStarter.java:107)
16:03:37 	... 46 more
16:03:37 Caused by: java.lang.NoClassDefFoundError: org/eclipse/core/resources/IResource
16:03:37 	at org.eclipse.egit.ui.Activator.setupRepoChangeScanner(Activator.java:1081)
16:03:37 	at org.eclipse.egit.ui.Activator.start(Activator.java:355)
16:03:37 	at org.eclipse.osgi.internal.framework.BundleContextImpl$3.run(BundleContextImpl.java:774)
16:03:37 	at org.eclipse.osgi.internal.framework.BundleContextImpl$3.run(BundleContextImpl.java:1)
16:03:37 	at java.security.AccessController.doPrivileged(Native Method)
16:03:37 	at org.eclipse.osgi.internal.framework.BundleContextImpl.startActivator(BundleContextImpl.java:767)
16:03:37 	... 53 more
16:03:37 Caused by: java.lang.ClassNotFoundException: org.eclipse.core.resources.IResource cannot be found by org.eclipse.egit.ui_5.4.0.201903211937
16:03:37 	at org.eclipse.osgi.internal.loader.BundleLoader.findClassInternal(BundleLoader.java:461)
16:03:37 	at org.eclipse.osgi.internal.loader.BundleLoader.findClass(BundleLoader.java:372)
16:03:37 	at org.eclipse.osgi.internal.loader.BundleLoader.findClass(BundleLoader.java:364)
16:03:37 	at org.eclipse.osgi.internal.loader.ModuleClassLoader.loadClass(ModuleClassLoader.java:161)
16:03:37 	at java.lang.ClassLoader.loadClass(ClassLoader.java:357)
16:03:37 	... 59 more
16:03:37 !SUBENTRY 1 org.eclipse.equinox.registry 4 1 2019-03-21 20:03:37.822
16:03:37 !MESSAGE Plug-in org.eclipse.egit.ui was unable to load class org.eclipse.egit.ui.internal.clone.GitCloneDropAdapter.
16:03:37 !STACK 0
16:03:37 java.lang.ClassNotFoundException: An error occurred while automatically activating bundle org.eclipse.egit.ui (81).
16:03:37 	at org.eclipse.osgi.internal.hooks.EclipseLazyStarter.postFindLocalClass(EclipseLazyStarter.java:116)
16:03:37 	at org.eclipse.osgi.internal.loader.classpath.ClasspathManager.findLocalClass(ClasspathManager.java:529)
16:03:37 	at org.eclipse.osgi.internal.loader.ModuleClassLoader.findLocalClass(ModuleClassLoader.java:325)
16:03:37 	at org.eclipse.osgi.internal.loader.BundleLoader.findLocalClass(BundleLoader.java:345)
16:03:37 	at org.eclipse.osgi.internal.loader.BundleLoader.findClassInternal(BundleLoader.java:423)
16:03:37 	at org.eclipse.osgi.internal.loader.BundleLoader.findClass(BundleLoader.java:372)
16:03:37 	at org.eclipse.osgi.internal.loader.BundleLoader.findClass(BundleLoader.java:364)
16:03:37 	at org.eclipse.osgi.internal.loader.ModuleClassLoader.loadClass(ModuleClassLoader.java:161)
16:03:37 	at java.lang.ClassLoader.loadClass(ClassLoader.java:357)
16:03:37 	at org.eclipse.osgi.internal.framework.EquinoxBundle.loadClass(EquinoxBundle.java:564)
16:03:37 	at org.eclipse.core.internal.registry.osgi.RegistryStrategyOSGI.createExecutableExtension(RegistryStrategyOSGI.java:174)
16:03:37 	at org.eclipse.core.internal.registry.ExtensionRegistry.createExecutableExtension(ExtensionRegistry.java:905)
16:03:37 	at org.eclipse.core.internal.registry.ConfigurationElement.createExecutableExtension(ConfigurationElement.java:243)
16:03:37 	at org.eclipse.core.internal.registry.ConfigurationElementHandle.createExecutableExtension(ConfigurationElementHandle.java:55)
16:03:37 	at org.eclipse.ui.internal.services.WorkbenchServiceRegistry.getSourceProviders(WorkbenchServiceRegistry.java:177)
16:03:37 	at org.eclipse.ui.internal.services.SourceProviderService.readRegistry(SourceProviderService.java:108)
16:03:37 	at org.eclipse.ui.internal.Workbench$47.runWithException(Workbench.java:2447)
16:03:37 	at org.eclipse.ui.internal.StartupThreading$StartupRunnable.run(StartupThreading.java:32)
16:03:37 	at org.eclipse.swt.widgets.Synchronizer.syncExec(Synchronizer.java:233)
16:03:37 	at org.eclipse.ui.internal.UISynchronizer.syncExec(UISynchronizer.java:145)
16:03:37 	at org.eclipse.swt.widgets.Display.syncExec(Display.java:5414)
16:03:37 	at org.eclipse.ui.internal.StartupThreading.runWithoutExceptions(StartupThreading.java:95)
16:03:37 	at org.eclipse.ui.internal.Workbench.initializeDefaultServices(Workbench.java:2442)
16:03:37 	at org.eclipse.ui.internal.Workbench.init(Workbench.java:1678)
16:03:37 	at org.eclipse.ui.internal.Workbench.runUI(Workbench.java:2944)
16:03:37 	at org.eclipse.ui.internal.Workbench.access$9(Workbench.java:2875)
16:03:37 	at org.eclipse.ui.internal.Workbench$5.run(Workbench.java:684)
16:03:37 	at org.eclipse.core.databinding.observable.Realm.runWithDefault(Realm.java:336)
16:03:37 	at org.eclipse.ui.internal.Workbench.createAndRunWorkbench(Workbench.java:610)
16:03:37 	at org.eclipse.ui.PlatformUI.createAndRunWorkbench(PlatformUI.java:148)
16:03:37 	at org.eclipse.ui.internal.ide.application.IDEApplication.start(IDEApplication.java:138)
16:03:37 	at org.eclipse.tycho.surefire.osgibooter.UITestApplication.runApplication(UITestApplication.java:31)
16:03:37 	at org.eclipse.tycho.surefire.osgibooter.AbstractUITestApplication.run(AbstractUITestApplication.java:120)
16:03:37 	at org.eclipse.tycho.surefire.osgibooter.UITestApplication.start(UITestApplication.java:37)
16:03:37 	at org.eclipse.equinox.internal.app.EclipseAppHandle.run(EclipseAppHandle.java:196)
16:03:37 	at org.eclipse.core.runtime.internal.adaptor.EclipseAppLauncher.runApplication(EclipseAppLauncher.java:134)
16:03:37 	at org.eclipse.core.runtime.internal.adaptor.EclipseAppLauncher.start(EclipseAppLauncher.java:104)
16:03:37 	at org.eclipse.core.runtime.adaptor.EclipseStarter.run(EclipseStarter.java:388)
16:03:37 	at org.eclipse.core.runtime.adaptor.EclipseStarter.run(EclipseStarter.java:243)
16:03:37 	at sun.reflect.NativeMethodAccessorImpl.invoke0(Native Method)
16:03:37 	at sun.reflect.NativeMethodAccessorImpl.invoke(NativeMethodAccessorImpl.java:62)
16:03:37 	at sun.reflect.DelegatingMethodAccessorImpl.invoke(DelegatingMethodAccessorImpl.java:43)
16:03:37 	at java.lang.reflect.Method.invoke(Method.java:498)
16:03:37 	at org.eclipse.equinox.launcher.Main.invokeFramework(Main.java:673)
16:03:37 	at org.eclipse.equinox.launcher.Main.basicRun(Main.java:610)
16:03:37 	at org.eclipse.equinox.launcher.Main.run(Main.java:1519)
16:03:37 	at org.eclipse.equinox.launcher.Main.main(Main.java:1492)
16:03:37 Caused by: org.osgi.framework.BundleException: Exception in org.eclipse.egit.ui.Activator.start() of bundle org.eclipse.egit.ui.
16:03:37 	at org.eclipse.osgi.internal.framework.BundleContextImpl.startActivator(BundleContextImpl.java:795)
16:03:37 	at org.eclipse.osgi.internal.framework.BundleContextImpl.start(BundleContextImpl.java:724)
16:03:37 	at org.eclipse.osgi.internal.framework.EquinoxBundle.startWorker0(EquinoxBundle.java:932)
16:03:37 	at org.eclipse.osgi.internal.framework.EquinoxBundle$EquinoxModule.startWorker(EquinoxBundle.java:309)
16:03:37 	at org.eclipse.osgi.container.Module.doStart(Module.java:581)
16:03:37 	at org.eclipse.osgi.container.Module.start(Module.java:449)
16:03:37 	at org.eclipse.osgi.framework.util.SecureAction.start(SecureAction.java:470)
16:03:37 	at org.eclipse.osgi.internal.hooks.EclipseLazyStarter.postFindLocalClass(EclipseLazyStarter.java:107)
16:03:37 	... 46 more
16:03:37 Caused by: java.lang.NoClassDefFoundError: org/eclipse/core/resources/IResource
16:03:37 	at org.eclipse.egit.ui.Activator.setupRepoChangeScanner(Activator.java:1081)
16:03:37 	at org.eclipse.egit.ui.Activator.start(Activator.java:355)
16:03:37 	at org.eclipse.osgi.internal.framework.BundleContextImpl$3.run(BundleContextImpl.java:774)
16:03:37 	at org.eclipse.osgi.internal.framework.BundleContextImpl$3.run(BundleContextImpl.java:1)
16:03:37 	at java.security.AccessController.doPrivileged(Native Method)
16:03:37 	at org.eclipse.osgi.internal.framework.BundleContextImpl.startActivator(BundleContextImpl.java:767)
16:03:37 	... 53 more
16:03:37 Caused by: java.lang.ClassNotFoundException: org.eclipse.core.resources.IResource cannot be found by org.eclipse.egit.ui_5.4.0.201903211937
16:03:37 	at org.eclipse.osgi.internal.loader.BundleLoader.findClassInternal(BundleLoader.java:461)
16:03:37 	at org.eclipse.osgi.internal.loader.BundleLoader.findClass(BundleLoader.java:372)
16:03:37 	at org.eclipse.osgi.internal.loader.BundleLoader.findClass(BundleLoader.java:364)
16:03:37 	at org.eclipse.osgi.internal.loader.ModuleClassLoader.loadClass(ModuleClassLoader.java:161)
16:03:37 	at java.lang.ClassLoader.loadClass(ClassLoader.java:357)
16:03:37 	... 59 more
16:03:37 !SUBENTRY 1 org.eclipse.equinox.registry 4 1 2019-03-21 20:03:37.823
16:03:37 !MESSAGE Plug-in org.eclipse.egit.ui was unable to load class org.eclipse.egit.ui.internal.clone.GitCloneDropAdapter.
16:03:37 !STACK 0
16:03:37 java.lang.ClassNotFoundException: An error occurred while automatically activating bundle org.eclipse.egit.ui (81).
16:03:37 	at org.eclipse.osgi.internal.hooks.EclipseLazyStarter.postFindLocalClass(EclipseLazyStarter.java:116)
16:03:37 	at org.eclipse.osgi.internal.loader.classpath.ClasspathManager.findLocalClass(ClasspathManager.java:529)
16:03:37 	at org.eclipse.osgi.internal.loader.ModuleClassLoader.findLocalClass(ModuleClassLoader.java:325)
16:03:37 	at org.eclipse.osgi.internal.loader.BundleLoader.findLocalClass(BundleLoader.java:345)
16:03:37 	at org.eclipse.osgi.internal.loader.BundleLoader.findClassInternal(BundleLoader.java:423)
16:03:37 	at org.eclipse.osgi.internal.loader.BundleLoader.findClass(BundleLoader.java:372)
16:03:37 	at org.eclipse.osgi.internal.loader.BundleLoader.findClass(BundleLoader.java:364)
16:03:37 	at org.eclipse.osgi.internal.loader.ModuleClassLoader.loadClass(ModuleClassLoader.java:161)
16:03:37 	at java.lang.ClassLoader.loadClass(ClassLoader.java:357)
16:03:37 	at org.eclipse.osgi.internal.framework.EquinoxBundle.loadClass(EquinoxBundle.java:564)
16:03:37 	at org.eclipse.core.internal.registry.osgi.RegistryStrategyOSGI.createExecutableExtension(RegistryStrategyOSGI.java:174)
16:03:37 	at org.eclipse.core.internal.registry.ExtensionRegistry.createExecutableExtension(ExtensionRegistry.java:905)
16:03:37 	at org.eclipse.core.internal.registry.ConfigurationElement.createExecutableExtension(ConfigurationElement.java:243)
16:03:37 	at org.eclipse.core.internal.registry.ConfigurationElementHandle.createExecutableExtension(ConfigurationElementHandle.java:55)
16:03:37 	at org.eclipse.ui.internal.services.WorkbenchServiceRegistry.getSourceProviders(WorkbenchServiceRegistry.java:177)
16:03:37 	at org.eclipse.ui.internal.services.SourceProviderService.readRegistry(SourceProviderService.java:108)
16:03:37 	at org.eclipse.ui.internal.Workbench$47.runWithException(Workbench.java:2447)
16:03:37 	at org.eclipse.ui.internal.StartupThreading$StartupRunnable.run(StartupThreading.java:32)
16:03:37 	at org.eclipse.swt.widgets.Synchronizer.syncExec(Synchronizer.java:233)
16:03:37 	at org.eclipse.ui.internal.UISynchronizer.syncExec(UISynchronizer.java:145)
16:03:37 	at org.eclipse.swt.widgets.Display.syncExec(Display.java:5414)
16:03:37 	at org.eclipse.ui.internal.StartupThreading.runWithoutExceptions(StartupThreading.java:95)
16:03:37 	at org.eclipse.ui.internal.Workbench.initializeDefaultServices(Workbench.java:2442)
16:03:37 	at org.eclipse.ui.internal.Workbench.init(Workbench.java:1678)
16:03:37 	at org.eclipse.ui.internal.Workbench.runUI(Workbench.java:2944)
16:03:37 	at org.eclipse.ui.internal.Workbench.access$9(Workbench.java:2875)
16:03:37 	at org.eclipse.ui.internal.Workbench$5.run(Workbench.java:684)
16:03:37 	at org.eclipse.core.databinding.observable.Realm.runWithDefault(Realm.java:336)
16:03:37 	at org.eclipse.ui.internal.Workbench.createAndRunWorkbench(Workbench.java:610)
16:03:37 	at org.eclipse.ui.PlatformUI.createAndRunWorkbench(PlatformUI.java:148)
16:03:37 	at org.eclipse.ui.internal.ide.application.IDEApplication.start(IDEApplication.java:138)
16:03:37 	at org.eclipse.tycho.surefire.osgibooter.UITestApplication.runApplication(UITestApplication.java:31)
16:03:37 	at org.eclipse.tycho.surefire.osgibooter.AbstractUITestApplication.run(AbstractUITestApplication.java:120)
16:03:37 	at org.eclipse.tycho.surefire.osgibooter.UITestApplication.start(UITestApplication.java:37)
16:03:37 	at org.eclipse.equinox.internal.app.EclipseAppHandle.run(EclipseAppHandle.java:196)
16:03:37 	at org.eclipse.core.runtime.internal.adaptor.EclipseAppLauncher.runApplication(EclipseAppLauncher.java:134)
16:03:37 	at org.eclipse.core.runtime.internal.adaptor.EclipseAppLauncher.start(EclipseAppLauncher.java:104)
16:03:37 	at org.eclipse.core.runtime.adaptor.EclipseStarter.run(EclipseStarter.java:388)
16:03:37 	at org.eclipse.core.runtime.adaptor.EclipseStarter.run(EclipseStarter.java:243)
16:03:37 	at sun.reflect.NativeMethodAccessorImpl.invoke0(Native Method)
16:03:37 	at sun.reflect.NativeMethodAccessorImpl.invoke(NativeMethodAccessorImpl.java:62)
16:03:37 	at sun.reflect.DelegatingMethodAccessorImpl.invoke(DelegatingMethodAccessorImpl.java:43)
16:03:37 	at java.lang.reflect.Method.invoke(Method.java:498)
16:03:37 	at org.eclipse.equinox.launcher.Main.invokeFramework(Main.java:673)
16:03:37 	at org.eclipse.equinox.launcher.Main.basicRun(Main.java:610)
16:03:37 	at org.eclipse.equinox.launcher.Main.run(Main.java:1519)
16:03:37 	at org.eclipse.equinox.launcher.Main.main(Main.java:1492)
16:03:37 Caused by: org.osgi.framework.BundleException: Exception in org.eclipse.egit.ui.Activator.start() of bundle org.eclipse.egit.ui.
16:03:37 	at org.eclipse.osgi.internal.framework.BundleContextImpl.startActivator(BundleContextImpl.java:795)
16:03:37 	at org.eclipse.osgi.internal.framework.BundleContextImpl.start(BundleContextImpl.java:724)
16:03:37 	at org.eclipse.osgi.internal.framework.EquinoxBundle.startWorker0(EquinoxBundle.java:932)
16:03:37 	at org.eclipse.osgi.internal.framework.EquinoxBundle$EquinoxModule.startWorker(EquinoxBundle.java:309)
16:03:37 	at org.eclipse.osgi.container.Module.doStart(Module.java:581)
16:03:37 	at org.eclipse.osgi.container.Module.start(Module.java:449)
16:03:37 	at org.eclipse.osgi.framework.util.SecureAction.start(SecureAction.java:470)
16:03:37 	at org.eclipse.osgi.internal.hooks.EclipseLazyStarter.postFindLocalClass(EclipseLazyStarter.java:107)
16:03:37 	... 46 more
16:03:37 Caused by: java.lang.NoClassDefFoundError: org/eclipse/core/resources/IResource
16:03:37 	at org.eclipse.egit.ui.Activator.setupRepoChangeScanner(Activator.java:1081)
16:03:37 	at org.eclipse.egit.ui.Activator.start(Activator.java:355)
16:03:37 	at org.eclipse.osgi.internal.framework.BundleContextImpl$3.run(BundleContextImpl.java:774)
16:03:37 	at org.eclipse.osgi.internal.framework.BundleContextImpl$3.run(BundleContextImpl.java:1)
16:03:37 	at java.security.AccessController.doPrivileged(Native Method)
16:03:37 	at org.eclipse.osgi.internal.framework.BundleContextImpl.startActivator(BundleContextImpl.java:767)
16:03:37 	... 53 more
16:03:37 Caused by: java.lang.ClassNotFoundException: org.eclipse.core.resources.IResource cannot be found by org.eclipse.egit.ui_5.4.0.201903211937
16:03:37 	at org.eclipse.osgi.internal.loader.BundleLoader.findClassInternal(BundleLoader.java:461)
16:03:37 	at org.eclipse.osgi.internal.loader.BundleLoader.findClass(BundleLoader.java:372)
16:03:37 	at org.eclipse.osgi.internal.loader.BundleLoader.findClass(BundleLoader.java:364)
16:03:37 	at org.eclipse.osgi.internal.loader.ModuleClassLoader.loadClass(ModuleClassLoader.java:161)
16:03:37 	at java.lang.ClassLoader.loadClass(ClassLoader.java:357)
16:03:37 	... 59 more
16:03:37 
16:03:37 !ENTRY org.eclipse.ui 4 0 2019-03-21 20:03:37.824
16:03:37 !MESSAGE Unable to execute early startup code for the org.eclipse.ui.IStartup extension contributed by the 'org.eclipse.egit.ui' plug-in.
16:03:37 !STACK 1
16:03:37 org.eclipse.core.runtime.CoreException: Plug-in org.eclipse.egit.ui was unable to load class org.eclipse.egit.ui.internal.clone.GitCloneDropAdapter.
16:03:37 	at org.eclipse.core.internal.registry.osgi.RegistryStrategyOSGI.throwException(RegistryStrategyOSGI.java:194)
16:03:37 	at org.eclipse.core.internal.registry.osgi.RegistryStrategyOSGI.createExecutableExtension(RegistryStrategyOSGI.java:176)
16:03:37 	at org.eclipse.core.internal.registry.ExtensionRegistry.createExecutableExtension(ExtensionRegistry.java:905)
16:03:37 	at org.eclipse.core.internal.registry.ConfigurationElement.createExecutableExtension(ConfigurationElement.java:243)
16:03:37 	at org.eclipse.core.internal.registry.ConfigurationElementHandle.createExecutableExtension(ConfigurationElementHandle.java:55)
16:03:37 	at org.eclipse.ui.internal.WorkbenchPlugin$1.run(WorkbenchPlugin.java:291)
16:03:37 	at org.eclipse.swt.custom.BusyIndicator.showWhile(BusyIndicator.java:52)
16:03:37 	at org.eclipse.ui.internal.WorkbenchPlugin.createExtension(WorkbenchPlugin.java:286)
16:03:37 	at org.eclipse.ui.internal.EarlyStartupRunnable.run(EarlyStartupRunnable.java:53)
16:03:37 	at org.eclipse.core.runtime.SafeRunner.run(SafeRunner.java:42)
16:03:37 	at org.eclipse.ui.internal.Workbench$55.run(Workbench.java:2835)
16:03:37 	at org.eclipse.core.internal.jobs.Worker.run(Worker.java:55)
16:03:37 Caused by: java.lang.ClassNotFoundException: An error occurred while automatically activating bundle org.eclipse.egit.ui (81).
16:03:37 	at org.eclipse.osgi.internal.hooks.EclipseLazyStarter.postFindLocalClass(EclipseLazyStarter.java:116)
16:03:37 	at org.eclipse.osgi.internal.loader.classpath.ClasspathManager.findLocalClass(ClasspathManager.java:529)
16:03:37 	at org.eclipse.osgi.internal.loader.ModuleClassLoader.findLocalClass(ModuleClassLoader.java:325)
16:03:37 	at org.eclipse.osgi.internal.loader.BundleLoader.findLocalClass(BundleLoader.java:345)
16:03:37 	at org.eclipse.osgi.internal.loader.BundleLoader.findClassInternal(BundleLoader.java:423)
16:03:37 	at org.eclipse.osgi.internal.loader.BundleLoader.findClass(BundleLoader.java:372)
16:03:37 	at org.eclipse.osgi.internal.loader.BundleLoader.findClass(BundleLoader.java:364)
16:03:37 	at org.eclipse.osgi.internal.loader.ModuleClassLoader.loadClass(ModuleClassLoader.java:161)
16:03:37 	at java.lang.ClassLoader.loadClass(ClassLoader.java:357)
16:03:37 	at org.eclipse.osgi.internal.framework.EquinoxBundle.loadClass(EquinoxBundle.java:564)
16:03:37 	at org.eclipse.core.internal.registry.osgi.RegistryStrategyOSGI.createExecutableExtension(RegistryStrategyOSGI.java:174)
16:03:37 	at org.eclipse.core.internal.registry.ExtensionRegistry.createExecutableExtension(ExtensionRegistry.java:905)
16:03:37 	at org.eclipse.core.internal.registry.ConfigurationElement.createExecutableExtension(ConfigurationElement.java:243)
16:03:37 	at org.eclipse.core.internal.registry.ConfigurationElementHandle.createExecutableExtension(ConfigurationElementHandle.java:55)
16:03:37 	at org.eclipse.ui.internal.services.WorkbenchServiceRegistry.getSourceProviders(WorkbenchServiceRegistry.java:177)
16:03:37 	at org.eclipse.ui.internal.services.SourceProviderService.readRegistry(SourceProviderService.java:108)
16:03:37 	at org.eclipse.ui.internal.Workbench$47.runWithException(Workbench.java:2447)
16:03:37 	at org.eclipse.ui.internal.StartupThreading$StartupRunnable.run(StartupThreading.java:32)
16:03:37 	at org.eclipse.swt.widgets.Synchronizer.syncExec(Synchronizer.java:233)
16:03:37 	at org.eclipse.ui.internal.UISynchronizer.syncExec(UISynchronizer.java:145)
16:03:37 	at org.eclipse.swt.widgets.Display.syncExec(Display.java:5414)
16:03:37 	at org.eclipse.ui.internal.StartupThreading.runWithoutExceptions(StartupThreading.java:95)
16:03:37 	at org.eclipse.ui.internal.Workbench.initializeDefaultServices(Workbench.java:2442)
16:03:37 	at org.eclipse.ui.internal.Workbench.init(Workbench.java:1678)
16:03:37 	at org.eclipse.ui.internal.Workbench.runUI(Workbench.java:2944)
16:03:37 	at org.eclipse.ui.internal.Workbench.access$9(Workbench.java:2875)
16:03:37 	at org.eclipse.ui.internal.Workbench$5.run(Workbench.java:684)
16:03:37 	at org.eclipse.core.databinding.observable.Realm.runWithDefault(Realm.java:336)
16:03:37 	at org.eclipse.ui.internal.Workbench.createAndRunWorkbench(Workbench.java:610)
16:03:37 	at org.eclipse.ui.PlatformUI.createAndRunWorkbench(PlatformUI.java:148)
16:03:37 	at org.eclipse.ui.internal.ide.application.IDEApplication.start(IDEApplication.java:138)
16:03:37 	at org.eclipse.tycho.surefire.osgibooter.UITestApplication.runApplication(UITestApplication.java:31)
16:03:37 	at org.eclipse.tycho.surefire.osgibooter.AbstractUITestApplication.run(AbstractUITestApplication.java:120)
16:03:37 	at org.eclipse.tycho.surefire.osgibooter.UITestApplication.start(UITestApplication.java:37)
16:03:37 	at org.eclipse.equinox.internal.app.EclipseAppHandle.run(EclipseAppHandle.java:196)
16:03:37 	at org.eclipse.core.runtime.internal.adaptor.EclipseAppLauncher.runApplication(EclipseAppLauncher.java:134)
16:03:37 	at org.eclipse.core.runtime.internal.adaptor.EclipseAppLauncher.start(EclipseAppLauncher.java:104)
16:03:37 	at org.eclipse.core.runtime.adaptor.EclipseStarter.run(EclipseStarter.java:388)
16:03:37 	at org.eclipse.core.runtime.adaptor.EclipseStarter.run(EclipseStarter.java:243)
16:03:37 	at sun.reflect.NativeMethodAccessorImpl.invoke0(Native Method)
16:03:37 	at sun.reflect.NativeMethodAccessorImpl.invoke(NativeMethodAccessorImpl.java:62)
16:03:37 	at sun.reflect.DelegatingMethodAccessorImpl.invoke(DelegatingMethodAccessorImpl.java:43)
16:03:37 	at java.lang.reflect.Method.invoke(Method.java:498)
16:03:37 	at org.eclipse.equinox.launcher.Main.invokeFramework(Main.java:673)
16:03:37 	at org.eclipse.equinox.launcher.Main.basicRun(Main.java:610)
16:03:37 	at org.eclipse.equinox.launcher.Main.run(Main.java:1519)
16:03:37 	at org.eclipse.equinox.launcher.Main.main(Main.java:1492)
16:03:37 Caused by: org.osgi.framework.BundleException: Exception in org.eclipse.egit.ui.Activator.start() of bundle org.eclipse.egit.ui.
16:03:37 	at org.eclipse.osgi.internal.framework.BundleContextImpl.startActivator(BundleContextImpl.java:795)
16:03:37 	at org.eclipse.osgi.internal.framework.BundleContextImpl.start(BundleContextImpl.java:724)
16:03:37 	at org.eclipse.osgi.internal.framework.EquinoxBundle.startWorker0(EquinoxBundle.java:932)
16:03:37 	at org.eclipse.osgi.internal.framework.EquinoxBundle$EquinoxModule.startWorker(EquinoxBundle.java:309)
16:03:37 	at org.eclipse.osgi.container.Module.doStart(Module.java:581)
16:03:37 	at org.eclipse.osgi.container.Module.start(Module.java:449)
16:03:37 	at org.eclipse.osgi.framework.util.SecureAction.start(SecureAction.java:470)
16:03:37 	at org.eclipse.osgi.internal.hooks.EclipseLazyStarter.postFindLocalClass(EclipseLazyStarter.java:107)
16:03:37 	... 46 more
16:03:37 Caused by: java.lang.NoClassDefFoundError: org/eclipse/core/resources/IResource
16:03:37 	at org.eclipse.egit.ui.Activator.setupRepoChangeScanner(Activator.java:1081)
16:03:37 	at org.eclipse.egit.ui.Activator.start(Activator.java:355)
16:03:37 	at org.eclipse.osgi.internal.framework.BundleContextImpl$3.run(BundleContextImpl.java:774)
16:03:37 	at org.eclipse.osgi.internal.framework.BundleContextImpl$3.run(BundleContextImpl.java:1)
16:03:37 	at java.security.AccessController.doPrivileged(Native Method)
16:03:37 	at org.eclipse.osgi.internal.framework.BundleContextImpl.startActivator(BundleContextImpl.java:767)
16:03:37 	... 53 more
16:03:37 Caused by: java.lang.ClassNotFoundException: org.eclipse.core.resources.IResource cannot be found by org.eclipse.egit.ui_5.4.0.201903211937
16:03:37 	at org.eclipse.osgi.internal.loader.BundleLoader.findClassInternal(BundleLoader.java:461)
16:03:37 	at org.eclipse.osgi.internal.loader.BundleLoader.findClass(BundleLoader.java:372)
16:03:37 	at org.eclipse.osgi.internal.loader.BundleLoader.findClass(BundleLoader.java:364)
16:03:37 	at org.eclipse.osgi.internal.loader.ModuleClassLoader.loadClass(ModuleClassLoader.java:161)
16:03:37 	at java.lang.ClassLoader.loadClass(ClassLoader.java:357)
16:03:37 	... 59 more
16:03:37 !SUBENTRY 1 org.eclipse.equinox.registry 4 1 2019-03-21 20:03:37.825
16:03:37 !MESSAGE Plug-in org.eclipse.egit.ui was unable to load class org.eclipse.egit.ui.internal.clone.GitCloneDropAdapter.
16:03:37 !STACK 0
16:03:37 java.lang.ClassNotFoundException: An error occurred while automatically activating bundle org.eclipse.egit.ui (81).
16:03:37 	at org.eclipse.osgi.internal.hooks.EclipseLazyStarter.postFindLocalClass(EclipseLazyStarter.java:116)
16:03:37 	at org.eclipse.osgi.internal.loader.classpath.ClasspathManager.findLocalClass(ClasspathManager.java:529)
16:03:37 	at org.eclipse.osgi.internal.loader.ModuleClassLoader.findLocalClass(ModuleClassLoader.java:325)
16:03:37 	at org.eclipse.osgi.internal.loader.BundleLoader.findLocalClass(BundleLoader.java:345)
16:03:37 	at org.eclipse.osgi.internal.loader.BundleLoader.findClassInternal(BundleLoader.java:423)
16:03:37 	at org.eclipse.osgi.internal.loader.BundleLoader.findClass(BundleLoader.java:372)
16:03:37 	at org.eclipse.osgi.internal.loader.BundleLoader.findClass(BundleLoader.java:364)
16:03:37 	at org.eclipse.osgi.internal.loader.ModuleClassLoader.loadClass(ModuleClassLoader.java:161)
16:03:37 	at java.lang.ClassLoader.loadClass(ClassLoader.java:357)
16:03:37 	at org.eclipse.osgi.internal.framework.EquinoxBundle.loadClass(EquinoxBundle.java:564)
16:03:37 	at org.eclipse.core.internal.registry.osgi.RegistryStrategyOSGI.createExecutableExtension(RegistryStrategyOSGI.java:174)
16:03:37 	at org.eclipse.core.internal.registry.ExtensionRegistry.createExecutableExtension(ExtensionRegistry.java:905)
16:03:37 	at org.eclipse.core.internal.registry.ConfigurationElement.createExecutableExtension(ConfigurationElement.java:243)
16:03:37 	at org.eclipse.core.internal.registry.ConfigurationElementHandle.createExecutableExtension(ConfigurationElementHandle.java:55)
16:03:37 	at org.eclipse.ui.internal.services.WorkbenchServiceRegistry.getSourceProviders(WorkbenchServiceRegistry.java:177)
16:03:37 	at org.eclipse.ui.internal.services.SourceProviderService.readRegistry(SourceProviderService.java:108)
16:03:37 	at org.eclipse.ui.internal.Workbench$47.runWithException(Workbench.java:2447)
16:03:37 	at org.eclipse.ui.internal.StartupThreading$StartupRunnable.run(StartupThreading.java:32)
16:03:37 	at org.eclipse.swt.widgets.Synchronizer.syncExec(Synchronizer.java:233)
16:03:37 	at org.eclipse.ui.internal.UISynchronizer.syncExec(UISynchronizer.java:145)
16:03:37 	at org.eclipse.swt.widgets.Display.syncExec(Display.java:5414)
16:03:37 	at org.eclipse.ui.internal.StartupThreading.runWithoutExceptions(StartupThreading.java:95)
16:03:37 	at org.eclipse.ui.internal.Workbench.initializeDefaultServices(Workbench.java:2442)
16:03:37 	at org.eclipse.ui.internal.Workbench.init(Workbench.java:1678)
16:03:37 	at org.eclipse.ui.internal.Workbench.runUI(Workbench.java:2944)
16:03:37 	at org.eclipse.ui.internal.Workbench.access$9(Workbench.java:2875)
16:03:37 	at org.eclipse.ui.internal.Workbench$5.run(Workbench.java:684)
16:03:37 	at org.eclipse.core.databinding.observable.Realm.runWithDefault(Realm.java:336)
16:03:37 	at org.eclipse.ui.internal.Workbench.createAndRunWorkbench(Workbench.java:610)
16:03:37 	at org.eclipse.ui.PlatformUI.createAndRunWorkbench(PlatformUI.java:148)
16:03:37 	at org.eclipse.ui.internal.ide.application.IDEApplication.start(IDEApplication.java:138)
16:03:37 	at org.eclipse.tycho.surefire.osgibooter.UITestApplication.runApplication(UITestApplication.java:31)
16:03:37 	at org.eclipse.tycho.surefire.osgibooter.AbstractUITestApplication.run(AbstractUITestApplication.java:120)
16:03:37 	at org.eclipse.tycho.surefire.osgibooter.UITestApplication.start(UITestApplication.java:37)
16:03:37 	at org.eclipse.equinox.internal.app.EclipseAppHandle.run(EclipseAppHandle.java:196)
16:03:37 	at org.eclipse.core.runtime.internal.adaptor.EclipseAppLauncher.runApplication(EclipseAppLauncher.java:134)
16:03:37 	at org.eclipse.core.runtime.internal.adaptor.EclipseAppLauncher.start(EclipseAppLauncher.java:104)
16:03:37 	at org.eclipse.core.runtime.adaptor.EclipseStarter.run(EclipseStarter.java:388)
16:03:37 	at org.eclipse.core.runtime.adaptor.EclipseStarter.run(EclipseStarter.java:243)
16:03:37 	at sun.reflect.NativeMethodAccessorImpl.invoke0(Native Method)
16:03:37 	at sun.reflect.NativeMethodAccessorImpl.invoke(NativeMethodAccessorImpl.java:62)
16:03:37 	at sun.reflect.DelegatingMethodAccessorImpl.invoke(DelegatingMethodAccessorImpl.java:43)
16:03:37 	at java.lang.reflect.Method.invoke(Method.java:498)
16:03:37 	at org.eclipse.equinox.launcher.Main.invokeFramework(Main.java:673)
16:03:37 	at org.eclipse.equinox.launcher.Main.basicRun(Main.java:610)
16:03:37 	at org.eclipse.equinox.launcher.Main.run(Main.java:1519)
16:03:37 	at org.eclipse.equinox.launcher.Main.main(Main.java:1492)
16:03:37 Caused by: org.osgi.framework.BundleException: Exception in org.eclipse.egit.ui.Activator.start() of bundle org.eclipse.egit.ui.
16:03:37 	at org.eclipse.osgi.internal.framework.BundleContextImpl.startActivator(BundleContextImpl.java:795)
16:03:37 	at org.eclipse.osgi.internal.framework.BundleContextImpl.start(BundleContextImpl.java:724)
16:03:37 	at org.eclipse.osgi.internal.framework.EquinoxBundle.startWorker0(EquinoxBundle.java:932)
16:03:37 	at org.eclipse.osgi.internal.framework.EquinoxBundle$EquinoxModule.startWorker(EquinoxBundle.java:309)
16:03:37 	at org.eclipse.osgi.container.Module.doStart(Module.java:581)
16:03:37 	at org.eclipse.osgi.container.Module.start(Module.java:449)
16:03:37 	at org.eclipse.osgi.framework.util.SecureAction.start(SecureAction.java:470)
16:03:37 	at org.eclipse.osgi.internal.hooks.EclipseLazyStarter.postFindLocalClass(EclipseLazyStarter.java:107)
16:03:37 	... 46 more
16:03:37 Caused by: java.lang.NoClassDefFoundError: org/eclipse/core/resources/IResource
16:03:37 	at org.eclipse.egit.ui.Activator.setupRepoChangeScanner(Activator.java:1081)
16:03:37 	at org.eclipse.egit.ui.Activator.start(Activator.java:355)
16:03:37 	at org.eclipse.osgi.internal.framework.BundleContextImpl$3.run(BundleContextImpl.java:774)
16:03:37 	at org.eclipse.osgi.internal.framework.BundleContextImpl$3.run(BundleContextImpl.java:1)
16:03:37 	at java.security.AccessController.doPrivileged(Native Method)
16:03:37 	at org.eclipse.osgi.internal.framework.BundleContextImpl.startActivator(BundleContextImpl.java:767)
16:03:37 	... 53 more
16:03:37 Caused by: java.lang.ClassNotFoundException: org.eclipse.core.resources.IResource cannot be found by org.eclipse.egit.ui_5.4.0.201903211937
16:03:37 	at org.eclipse.osgi.internal.loader.BundleLoader.findClassInternal(BundleLoader.java:461)
16:03:37 	at org.eclipse.osgi.internal.loader.BundleLoader.findClass(BundleLoader.java:372)
16:03:37 	at org.eclipse.osgi.internal.loader.BundleLoader.findClass(BundleLoader.java:364)
16:03:37 	at org.eclipse.osgi.internal.loader.ModuleClassLoader.loadClass(ModuleClassLoader.java:161)
16:03:37 	at java.lang.ClassLoader.loadClass(ClassLoader.java:357)
16:03:37 	... 59 more
16:03:37 Running org.eclipse.egit.ui.importer.tests.SmartImportWizardTest
16:03:38 Tests run: 1, Failures: 0, Errors: 0, Skipped: 1, Time elapsed: 0.006 s - in org.eclipse.egit.ui.importer.tests.SmartImportWizardTest
16:03:38 org.eclipse.egit.ui.importer.tests.SmartImportWizardTest skipped
16:03:38 
16:03:38 Results:
16:03:38 
16:03:38 Tests run: 1, Failures: 0, Errors: 0, Skipped: 1
16:03:38 
16:03:38 [INFO] All tests passed!
16:03:38 [INFO] 
16:03:38 [INFO] >>> spotbugs-maven-plugin:3.1.11:check (default) > :spotbugs @ org.eclipse.egit.ui.importer.tests >>>
16:03:38 [INFO] 
16:03:38 [INFO] --- spotbugs-maven-plugin:3.1.11:spotbugs (spotbugs) @ org.eclipse.egit.ui.importer.tests ---
16:03:38 [INFO] Fork Value is true
16:03:38      [java] Picked up JAVA_TOOL_OPTIONS: -XX:+IgnoreUnrecognizedVMOptions -XX:+UseContainerSupport -XX:+UnlockExperimentalVMOptions -XX:+UseCGroupMemoryLimitForHeap
16:03:38      [java] Picked up _JAVA_OPTIONS: -XX:MaxRAMPercentage=64.0
16:03:41 [INFO] Done SpotBugs Analysis....
16:03:41 [INFO] 
16:03:41 [INFO] <<< spotbugs-maven-plugin:3.1.11:check (default) < :spotbugs @ org.eclipse.egit.ui.importer.tests <<<
16:03:41 [INFO] 
16:03:41 [INFO] 
16:03:41 [INFO] --- spotbugs-maven-plugin:3.1.11:check (default) @ org.eclipse.egit.ui.importer.tests ---
16:03:41 [INFO] BugInstance size is 0
16:03:41 [INFO] Error size is 0
16:03:41 [INFO] No errors/warnings found
16:03:41 [INFO] 
16:03:41 [INFO] >>> maven-pmd-plugin:3.11.0:cpd-check (default) > :cpd @ org.eclipse.egit.ui.importer.tests >>>
16:03:41 [INFO] 
16:03:41 [INFO] --- maven-pmd-plugin:3.11.0:cpd (cpd) @ org.eclipse.egit.ui.importer.tests ---
16:03:41 [INFO] 
16:03:41 [INFO] <<< maven-pmd-plugin:3.11.0:cpd-check (default) < :cpd @ org.eclipse.egit.ui.importer.tests <<<
16:03:41 [INFO] 
16:03:41 [INFO] 
16:03:41 [INFO] --- maven-pmd-plugin:3.11.0:cpd-check (default) @ org.eclipse.egit.ui.importer.tests ---
16:03:41 [INFO] 
16:03:41 [INFO] 
16:03:41 [INFO] --- tycho-pack200a-plugin:1.3.0:normalize (pack200-normalize) @ org.eclipse.egit.ui.importer.tests ---
16:03:41 [INFO] Pack200 normalizing jar /home/jenkins/workspace/egit/repo/org.eclipse.egit.ui.importer.tests/target/org.eclipse.egit.ui.importer.tests-5.4.0-SNAPSHOT.jar
16:03:41 [INFO] 
16:03:41 [INFO] --- eclipse-jarsigner-plugin:1.1.5:sign (sign) @ org.eclipse.egit.ui.importer.tests ---
16:03:41 [INFO] Signing jar: /home/jenkins/workspace/egit/repo/org.eclipse.egit.ui.importer.tests/target/org.eclipse.egit.ui.importer.tests-5.4.0-SNAPSHOT.jar
16:03:43 [INFO] Signing jar: /home/jenkins/workspace/egit/repo/org.eclipse.egit.ui.importer.tests/target/org.eclipse.egit.ui.importer.tests-5.4.0-SNAPSHOT-sources.jar
16:03:44 [INFO] 
16:03:44 [INFO] --- tycho-pack200b-plugin:1.3.0:pack (pack200-pack) @ org.eclipse.egit.ui.importer.tests ---
16:03:44 [INFO] Pack200 packing jar /home/jenkins/workspace/egit/repo/org.eclipse.egit.ui.importer.tests/target/org.eclipse.egit.ui.importer.tests-5.4.0-SNAPSHOT.jar
16:03:44 [INFO] 
16:03:44 [INFO] --- tycho-p2-plugin:1.3.0:p2-metadata (p2-metadata) @ org.eclipse.egit.ui.importer.tests ---
16:03:44 [INFO] 
16:03:44 [INFO] --- maven-install-plugin:2.3.1:install (default-install) @ org.eclipse.egit.ui.importer.tests ---
16:03:44 [INFO] Installing /home/jenkins/workspace/egit/repo/org.eclipse.egit.ui.importer.tests/target/org.eclipse.egit.ui.importer.tests-5.4.0-SNAPSHOT.jar to /home/jenkins/workspace/egit/.repository/org/eclipse/egit/org.eclipse.egit.ui.importer.tests/5.4.0-SNAPSHOT/org.eclipse.egit.ui.importer.tests-5.4.0-SNAPSHOT.jar
16:03:44 [INFO] Installing /home/jenkins/workspace/egit/repo/org.eclipse.egit.ui.importer.tests/pom.xml to /home/jenkins/workspace/egit/.repository/org/eclipse/egit/org.eclipse.egit.ui.importer.tests/5.4.0-SNAPSHOT/org.eclipse.egit.ui.importer.tests-5.4.0-SNAPSHOT.pom
16:03:44 [INFO] Installing /home/jenkins/workspace/egit/repo/org.eclipse.egit.ui.importer.tests/target/org.eclipse.egit.ui.importer.tests-5.4.0-SNAPSHOT-sources.jar to /home/jenkins/workspace/egit/.repository/org/eclipse/egit/org.eclipse.egit.ui.importer.tests/5.4.0-SNAPSHOT/org.eclipse.egit.ui.importer.tests-5.4.0-SNAPSHOT-sources.jar
16:03:44 [INFO] Installing /home/jenkins/workspace/egit/repo/org.eclipse.egit.ui.importer.tests/target/org.eclipse.egit.ui.importer.tests-5.4.0-SNAPSHOT.jar.pack.gz to /home/jenkins/workspace/egit/.repository/org/eclipse/egit/org.eclipse.egit.ui.importer.tests/5.4.0-SNAPSHOT/org.eclipse.egit.ui.importer.tests-5.4.0-SNAPSHOT-pack200.jar.pack.gz
16:03:44 [INFO] Installing /home/jenkins/workspace/egit/repo/org.eclipse.egit.ui.importer.tests/target/p2content.xml to /home/jenkins/workspace/egit/.repository/org/eclipse/egit/org.eclipse.egit.ui.importer.tests/5.4.0-SNAPSHOT/org.eclipse.egit.ui.importer.tests-5.4.0-SNAPSHOT-p2metadata.xml
16:03:44 [INFO] Installing /home/jenkins/workspace/egit/repo/org.eclipse.egit.ui.importer.tests/target/p2artifacts.xml to /home/jenkins/workspace/egit/.repository/org/eclipse/egit/org.eclipse.egit.ui.importer.tests/5.4.0-SNAPSHOT/org.eclipse.egit.ui.importer.tests-5.4.0-SNAPSHOT-p2artifacts.xml
16:03:44 [INFO] 
16:03:44 [INFO] --- tycho-p2-plugin:1.3.0:update-local-index (default-update-local-index) @ org.eclipse.egit.ui.importer.tests ---
16:03:44 [INFO] ------------------------------------------------------------------------
16:03:44 [INFO] Reactor Summary:
16:03:44 [INFO] 
16:03:44 [INFO] EGit Parent 5.4.0-SNAPSHOT ......................... SUCCESS [ 43.293 s]
16:03:44 [INFO] EGit Target Platform Definition .................... SUCCESS [  1.161 s]
16:03:44 [INFO] Eclipse EGit ....................................... SUCCESS [  5.354 s]
16:03:44 [INFO] Git Team Provider (Core) ........................... SUCCESS [ 19.744 s]
16:03:44 [INFO] Git Team Provider (UI) ............................. SUCCESS [ 55.485 s]
16:03:44 [INFO] Git Team Provider (auto-import wizard) ............. SUCCESS [  6.851 s]
16:03:44 [INFO] EGit Mylyn UI ...................................... SUCCESS [  7.847 s]
16:03:44 [INFO] Git Team Provider (Documentation) .................. SUCCESS [  7.066 s]
16:03:44 [INFO] Eclipse EGit Feature ............................... SUCCESS [  1.230 s]
16:03:44 [INFO] EGit Mylyn Feature ................................. SUCCESS [  1.210 s]
16:03:44 [INFO] Git Flow ........................................... SUCCESS [  7.376 s]
16:03:44 [INFO] Git Flow UI ........................................ SUCCESS [  9.306 s]
16:03:44 [INFO] Eclipse EGit Gitflow Feature ....................... SUCCESS [  1.267 s]
16:03:44 [INFO] EGit JUnit Support ................................. SUCCESS [  7.334 s]
16:03:44 [INFO] GitFlow Test Plug-in ............................... SUCCESS [ 52.143 s]
16:03:44 [INFO] Eclipse EGit Source Feature ........................ SUCCESS [  1.291 s]
16:03:44 [INFO] EGit P2 Repository ................................. SUCCESS [ 26.168 s]
16:03:44 [INFO] EGit Core Test Plug-in ............................. SUCCESS [03:26 min]
16:03:44 [INFO] EGit UI Test Plug-in ............................... SUCCESS [14:03 min]
16:03:44 [INFO] EGit Mylyn UI Test Plug-in ......................... SUCCESS [ 14.923 s]
16:03:44 [INFO] Git Team Provider (experimental auto-import wizard, incubation) 5.4.0-SNAPSHOT SUCCESS [ 10.601 s]
16:03:44 [INFO] ------------------------------------------------------------------------
16:03:44 [INFO] BUILD SUCCESS
16:03:44 [INFO] ------------------------------------------------------------------------
16:03:44 [INFO] Total time: 25:55 min
16:03:44 [INFO] Finished at: 2019-03-21T20:03:44Z
16:03:44 [INFO] ------------------------------------------------------------------------
16:03:45 [egit] $ /bin/sh -xe /tmp/jenkins4700060923471449615.sh
16:03:45 + ssh genie.egit@projects-storage.eclipse.org rm -rf /home/data/httpd/download.eclipse.org/egit/updates-nightly
16:37:47 Build timed out (after 60 minutes). Marking the build as aborted.
16:37:47 Terminating xvnc.
16:37:48 /tmp/jenkins4700060923471449615.sh: line 2:  2395 Terminated              ssh genie.egit@projects-storage.eclipse.org rm -rf $PUBLISH_PATH
16:41:49 $ ssh-agent -k
16:41:49 unset SSH_AUTH_SOCK;
16:41:49 unset SSH_AGENT_PID;
16:41:49 echo Agent pid 49 killed;
16:41:49 [ssh-agent] Stopped.
16:41:49 Build was aborted
16:41:49 [FINDBUGS] Skipping publisher since build result is ABORTED
16:41:49 [DRY] Skipping publisher since build result is ABORTED
16:41:49 Recording test results
16:41:50 Archiving artifacts
16:41:57 Finished: ABORTED