UnstableConsole Output

Skipping 1,494 KB.. Full Log
tents 4x3) while allocating gadget (node toolbar, owner GtkToolbar)
17:20:43 
17:20:43 (SWT:1369): Gtk-CRITICAL **: 21:20:43.340: gtk_box_gadget_distribute: assertion 'size >= 0' failed in GtkScrollbar
17:20:43 
17:20:43 (SWT:1369): Gtk-WARNING **: 21:20:43.347: Negative content width -6 (allocation 1, extents 4x3) while allocating gadget (node toolbar, owner GtkToolbar)
17:20:43 
17:20:43 (SWT:1369): Gtk-WARNING **: 21:20:43.386: Negative content width -6 (allocation 1, extents 4x3) while allocating gadget (node toolbar, owner GtkToolbar)
17:20:43 
17:20:43 (SWT:1369): Gtk-CRITICAL **: 21:20:43.479: gtk_box_gadget_distribute: assertion 'size >= 0' failed in GtkScrollbar
17:20:43 
17:20:43 (SWT:1369): Gtk-WARNING **: 21:20:43.485: Negative content width -6 (allocation 1, extents 4x3) while allocating gadget (node toolbar, owner GtkToolbar)
17:20:43 
17:20:43 (SWT:1369): Gtk-WARNING **: 21:20:43.522: Negative content width -6 (allocation 1, extents 4x3) while allocating gadget (node toolbar, owner GtkToolbar)
17:20:43 
17:20:43 (SWT:1369): Gtk-CRITICAL **: 21:20:43.614: gtk_box_gadget_distribute: assertion 'size >= 0' failed in GtkScrollbar
17:20:43 
17:20:43 (SWT:1369): Gtk-WARNING **: 21:20:43.621: Negative content width -6 (allocation 1, extents 4x3) while allocating gadget (node toolbar, owner GtkToolbar)
17:20:43 
17:20:43 (SWT:1369): Gtk-WARNING **: 21:20:43.661: Negative content width -6 (allocation 1, extents 4x3) while allocating gadget (node toolbar, owner GtkToolbar)
17:20:43 
17:20:43 (SWT:1369): Gtk-CRITICAL **: 21:20:43.752: gtk_box_gadget_distribute: assertion 'size >= 0' failed in GtkScrollbar
17:20:43 
17:20:43 (SWT:1369): Gtk-WARNING **: 21:20:43.758: Negative content width -6 (allocation 1, extents 4x3) while allocating gadget (node toolbar, owner GtkToolbar)
17:20:43 
17:20:43 (SWT:1369): Gtk-WARNING **: 21:20:43.821: Negative content width -6 (allocation 1, extents 4x3) while allocating gadget (node toolbar, owner GtkToolbar)
17:20:44 
17:20:44 (SWT:1369): Gtk-WARNING **: 21:20:44.658: Negative content width -6 (allocation 1, extents 4x3) while allocating gadget (node toolbar, owner GtkToolbar)
17:20:44 
17:20:44 (SWT:1369): Gtk-WARNING **: 21:20:44.659: Negative content width -6 (allocation 1, extents 4x3) while allocating gadget (node toolbar, owner GtkToolbar)
17:20:44 
17:20:44 (SWT:1369): Gtk-WARNING **: 21:20:44.673: Negative content width -6 (allocation 1, extents 4x3) while allocating gadget (node toolbar, owner GtkToolbar)
17:20:44 
17:20:44 (SWT:1369): Gtk-CRITICAL **: 21:20:44.700: gtk_box_gadget_distribute: assertion 'size >= 0' failed in GtkScrollbar
17:20:44 
17:20:44 (SWT:1369): Gtk-CRITICAL **: 21:20:44.728: gtk_box_gadget_distribute: assertion 'size >= 0' failed in GtkScrollbar
17:20:44 
17:20:44 (SWT:1369): Gtk-CRITICAL **: 21:20:44.744: gtk_box_gadget_distribute: assertion 'size >= 0' failed in GtkScrollbar
17:20:44 
17:20:44 (SWT:1369): Gtk-CRITICAL **: 21:20:44.760: gtk_box_gadget_distribute: assertion 'size >= 0' failed in GtkScrollbar
17:20:44 
17:20:44 (SWT:1369): Gtk-CRITICAL **: 21:20:44.777: gtk_box_gadget_distribute: assertion 'size >= 0' failed in GtkScrollbar
17:20:44 
17:20:44 (SWT:1369): Gtk-CRITICAL **: 21:20:44.795: gtk_box_gadget_distribute: assertion 'size >= 0' failed in GtkScrollbar
17:20:44 
17:20:44 (SWT:1369): Gtk-WARNING **: 21:20:44.825: Negative content width -6 (allocation 1, extents 4x3) while allocating gadget (node toolbar, owner GtkToolbar)
17:20:44 
17:20:44 (SWT:1369): Gtk-CRITICAL **: 21:20:44.963: gtk_box_gadget_distribute: assertion 'size >= 0' failed in GtkScrollbar
17:20:44 
17:20:44 (SWT:1369): Gtk-CRITICAL **: 21:20:44.968: gtk_box_gadget_distribute: assertion 'size >= 0' failed in GtkScrollbar
17:20:44 
17:20:44 (SWT:1369): Gtk-WARNING **: 21:20:44.970: Negative content width -6 (allocation 1, extents 4x3) while allocating gadget (node toolbar, owner GtkToolbar)
17:20:45 
17:20:45 (SWT:1369): Gtk-WARNING **: 21:20:45.009: Negative content width -6 (allocation 1, extents 4x3) while allocating gadget (node toolbar, owner GtkToolbar)
17:20:45 
17:20:45 (SWT:1369): Gtk-CRITICAL **: 21:20:45.139: gtk_box_gadget_distribute: assertion 'size >= 0' failed in GtkScrollbar
17:20:45 
17:20:45 (SWT:1369): Gtk-WARNING **: 21:20:45.146: Negative content width -6 (allocation 1, extents 4x3) while allocating gadget (node toolbar, owner GtkToolbar)
17:20:45 
17:20:45 (SWT:1369): Gtk-WARNING **: 21:20:45.189: Negative content width -6 (allocation 1, extents 4x3) while allocating gadget (node toolbar, owner GtkToolbar)
17:20:45 
17:20:45 (SWT:1369): Gtk-CRITICAL **: 21:20:45.281: gtk_box_gadget_distribute: assertion 'size >= 0' failed in GtkScrollbar
17:20:45 
17:20:45 (SWT:1369): Gtk-WARNING **: 21:20:45.287: Negative content width -6 (allocation 1, extents 4x3) while allocating gadget (node toolbar, owner GtkToolbar)
17:20:45 
17:20:45 (SWT:1369): Gtk-WARNING **: 21:20:45.325: Negative content width -6 (allocation 1, extents 4x3) while allocating gadget (node toolbar, owner GtkToolbar)
17:20:45 
17:20:45 (SWT:1369): Gtk-CRITICAL **: 21:20:45.416: gtk_box_gadget_distribute: assertion 'size >= 0' failed in GtkScrollbar
17:20:45 
17:20:45 (SWT:1369): Gtk-WARNING **: 21:20:45.424: Negative content width -6 (allocation 1, extents 4x3) while allocating gadget (node toolbar, owner GtkToolbar)
17:20:45 
17:20:45 (SWT:1369): Gtk-WARNING **: 21:20:45.465: Negative content width -6 (allocation 1, extents 4x3) while allocating gadget (node toolbar, owner GtkToolbar)
17:20:45 
17:20:45 (SWT:1369): Gtk-CRITICAL **: 21:20:45.552: gtk_box_gadget_distribute: assertion 'size >= 0' failed in GtkScrollbar
17:20:45 
17:20:45 (SWT:1369): Gtk-WARNING **: 21:20:45.558: Negative content width -6 (allocation 1, extents 4x3) while allocating gadget (node toolbar, owner GtkToolbar)
17:20:45 
17:20:45 (SWT:1369): Gtk-WARNING **: 21:20:45.593: Negative content width -6 (allocation 1, extents 4x3) while allocating gadget (node toolbar, owner GtkToolbar)
17:20:45 
17:20:45 (SWT:1369): Gtk-CRITICAL **: 21:20:45.685: gtk_box_gadget_distribute: assertion 'size >= 0' failed in GtkScrollbar
17:20:45 
17:20:45 (SWT:1369): Gtk-WARNING **: 21:20:45.691: Negative content width -6 (allocation 1, extents 4x3) while allocating gadget (node toolbar, owner GtkToolbar)
17:20:45 
17:20:45 (SWT:1369): Gtk-WARNING **: 21:20:45.732: Negative content width -6 (allocation 1, extents 4x3) while allocating gadget (node toolbar, owner GtkToolbar)
17:20:45 
17:20:45 (SWT:1369): Gtk-CRITICAL **: 21:20:45.816: gtk_box_gadget_distribute: assertion 'size >= 0' failed in GtkScrollbar
17:20:45 
17:20:45 (SWT:1369): Gtk-WARNING **: 21:20:45.823: Negative content width -6 (allocation 1, extents 4x3) while allocating gadget (node toolbar, owner GtkToolbar)
17:20:45 
17:20:45 (SWT:1369): Gtk-WARNING **: 21:20:45.876: Negative content width -6 (allocation 1, extents 4x3) while allocating gadget (node toolbar, owner GtkToolbar)
17:20:46 
17:20:46 (SWT:1369): Gtk-WARNING **: 21:20:46.687: Negative content width -6 (allocation 1, extents 4x3) while allocating gadget (node toolbar, owner GtkToolbar)
17:20:46 
17:20:46 (SWT:1369): Gtk-WARNING **: 21:20:46.688: Negative content width -6 (allocation 1, extents 4x3) while allocating gadget (node toolbar, owner GtkToolbar)
17:20:46 
17:20:46 (SWT:1369): Gtk-WARNING **: 21:20:46.701: Negative content width -6 (allocation 1, extents 4x3) while allocating gadget (node toolbar, owner GtkToolbar)
17:20:46 
17:20:46 (SWT:1369): Gtk-CRITICAL **: 21:20:46.731: gtk_box_gadget_distribute: assertion 'size >= 0' failed in GtkScrollbar
17:20:46 
17:20:46 (SWT:1369): Gtk-CRITICAL **: 21:20:46.732: gtk_box_gadget_distribute: assertion 'size >= 0' failed in GtkScrollbar
17:20:46 
17:20:46 (SWT:1369): Gtk-CRITICAL **: 21:20:46.749: gtk_box_gadget_distribute: assertion 'size >= 0' failed in GtkScrollbar
17:20:46 
17:20:46 (SWT:1369): Gtk-CRITICAL **: 21:20:46.766: gtk_box_gadget_distribute: assertion 'size >= 0' failed in GtkScrollbar
17:20:46 
17:20:46 (SWT:1369): Gtk-CRITICAL **: 21:20:46.783: gtk_box_gadget_distribute: assertion 'size >= 0' failed in GtkScrollbar
17:20:46 
17:20:46 (SWT:1369): Gtk-CRITICAL **: 21:20:46.798: gtk_box_gadget_distribute: assertion 'size >= 0' failed in GtkScrollbar
17:20:46 
17:20:46 (SWT:1369): Gtk-CRITICAL **: 21:20:46.822: gtk_box_gadget_distribute: assertion 'size >= 0' failed in GtkScrollbar
17:20:46 
17:20:46 (SWT:1369): Gtk-CRITICAL **: 21:20:46.882: gtk_box_gadget_distribute: assertion 'size >= 0' failed in GtkScrollbar
17:20:46 
17:20:46 (SWT:1369): Gtk-CRITICAL **: 21:20:46.929: gtk_box_gadget_distribute: assertion 'size >= 0' failed in GtkScrollbar
17:20:46 
17:20:46 (SWT:1369): Gtk-CRITICAL **: 21:20:46.948: gtk_box_gadget_distribute: assertion 'size >= 0' failed in GtkScrollbar
17:20:47 
17:20:47 (SWT:1369): Gtk-WARNING **: 21:20:47.378: Negative content width -6 (allocation 1, extents 4x3) while allocating gadget (node toolbar, owner GtkToolbar)
17:20:48 
17:20:48 (SWT:1369): Gtk-WARNING **: 21:20:48.169: Negative content width -6 (allocation 1, extents 4x3) while allocating gadget (node toolbar, owner GtkToolbar)
17:20:48 
17:20:48 (SWT:1369): Gtk-WARNING **: 21:20:48.170: Negative content width -6 (allocation 1, extents 4x3) while allocating gadget (node toolbar, owner GtkToolbar)
17:20:48 
17:20:48 (SWT:1369): Gtk-WARNING **: 21:20:48.183: Negative content width -6 (allocation 1, extents 4x3) while allocating gadget (node toolbar, owner GtkToolbar)
17:20:48 
17:20:48 (SWT:1369): Gtk-CRITICAL **: 21:20:48.209: gtk_box_gadget_distribute: assertion 'size >= 0' failed in GtkScrollbar
17:20:48 
17:20:48 (SWT:1369): Gtk-CRITICAL **: 21:20:48.237: gtk_box_gadget_distribute: assertion 'size >= 0' failed in GtkScrollbar
17:20:48 
17:20:48 (SWT:1369): Gtk-CRITICAL **: 21:20:48.252: gtk_box_gadget_distribute: assertion 'size >= 0' failed in GtkScrollbar
17:20:48 
17:20:48 (SWT:1369): Gtk-CRITICAL **: 21:20:48.270: gtk_box_gadget_distribute: assertion 'size >= 0' failed in GtkScrollbar
17:20:48 
17:20:48 (SWT:1369): Gtk-CRITICAL **: 21:20:48.286: gtk_box_gadget_distribute: assertion 'size >= 0' failed in GtkScrollbar
17:20:48 
17:20:48 (SWT:1369): Gtk-CRITICAL **: 21:20:48.304: gtk_box_gadget_distribute: assertion 'size >= 0' failed in GtkScrollbar
17:20:48 
17:20:48 (SWT:1369): Gtk-WARNING **: 21:20:48.335: Negative content width -6 (allocation 1, extents 4x3) while allocating gadget (node toolbar, owner GtkToolbar)
17:20:48 
17:20:48 (SWT:1369): Gtk-CRITICAL **: 21:20:48.426: gtk_box_gadget_distribute: assertion 'size >= 0' failed in GtkScrollbar
17:20:48 
17:20:48 (SWT:1369): Gtk-CRITICAL **: 21:20:48.431: gtk_box_gadget_distribute: assertion 'size >= 0' failed in GtkScrollbar
17:20:48 
17:20:48 (SWT:1369): Gtk-WARNING **: 21:20:48.434: Negative content width -6 (allocation 1, extents 4x3) while allocating gadget (node toolbar, owner GtkToolbar)
17:20:48 
17:20:48 (SWT:1369): Gtk-WARNING **: 21:20:48.478: Negative content width -6 (allocation 1, extents 4x3) while allocating gadget (node toolbar, owner GtkToolbar)
17:20:48 
17:20:48 (SWT:1369): Gtk-CRITICAL **: 21:20:48.573: gtk_box_gadget_distribute: assertion 'size >= 0' failed in GtkScrollbar
17:20:48 
17:20:48 (SWT:1369): Gtk-WARNING **: 21:20:48.582: Negative content width -6 (allocation 1, extents 4x3) while allocating gadget (node toolbar, owner GtkToolbar)
17:20:48 
17:20:48 (SWT:1369): Gtk-CRITICAL **: 21:20:48.598: gtk_box_gadget_distribute: assertion 'size >= 0' failed in GtkScrollbar
17:20:48 
17:20:48 (SWT:1369): Gtk-CRITICAL **: 21:20:48.599: gtk_box_gadget_distribute: assertion 'size >= 0' failed in GtkScrollbar
17:20:48 
17:20:48 (SWT:1369): Gtk-WARNING **: 21:20:48.635: Negative content width -6 (allocation 1, extents 4x3) while allocating gadget (node toolbar, owner GtkToolbar)
17:20:48 
17:20:48 (SWT:1369): Gtk-CRITICAL **: 21:20:48.727: gtk_box_gadget_distribute: assertion 'size >= 0' failed in GtkScrollbar
17:20:48 
17:20:48 (SWT:1369): Gtk-WARNING **: 21:20:48.733: Negative content width -6 (allocation 1, extents 4x3) while allocating gadget (node toolbar, owner GtkToolbar)
17:20:48 
17:20:48 (SWT:1369): Gtk-WARNING **: 21:20:48.769: Negative content width -6 (allocation 1, extents 4x3) while allocating gadget (node toolbar, owner GtkToolbar)
17:20:48 
17:20:48 (SWT:1369): Gtk-CRITICAL **: 21:20:48.862: gtk_box_gadget_distribute: assertion 'size >= 0' failed in GtkScrollbar
17:20:48 
17:20:48 (SWT:1369): Gtk-WARNING **: 21:20:48.868: Negative content width -6 (allocation 1, extents 4x3) while allocating gadget (node toolbar, owner GtkToolbar)
17:20:48 
17:20:48 (SWT:1369): Gtk-WARNING **: 21:20:48.905: Negative content width -6 (allocation 1, extents 4x3) while allocating gadget (node toolbar, owner GtkToolbar)
17:20:49 
17:20:49 (SWT:1369): Gtk-WARNING **: 21:20:48.999: Negative content width -6 (allocation 1, extents 4x3) while allocating gadget (node toolbar, owner GtkToolbar)
17:20:49 
17:20:49 (SWT:1369): Gtk-WARNING **: 21:20:49.037: Negative content width -6 (allocation 1, extents 4x3) while allocating gadget (node toolbar, owner GtkToolbar)
17:20:49 
17:20:49 (SWT:1369): Gtk-WARNING **: 21:20:49.185: Negative content width -6 (allocation 1, extents 4x3) while allocating gadget (node toolbar, owner GtkToolbar)
17:20:49 
17:20:49 (SWT:1369): Gtk-WARNING **: 21:20:49.247: Negative content width -6 (allocation 1, extents 4x3) while allocating gadget (node toolbar, owner GtkToolbar)
17:20:49 
17:20:49 (SWT:1369): Gtk-WARNING **: 21:20:49.391: Negative content width -6 (allocation 1, extents 4x3) while allocating gadget (node toolbar, owner GtkToolbar)
17:20:49 
17:20:49 (SWT:1369): Gtk-WARNING **: 21:20:49.439: Negative content width -6 (allocation 1, extents 4x3) while allocating gadget (node toolbar, owner GtkToolbar)
17:20:49 
17:20:49 (SWT:1369): Gtk-WARNING **: 21:20:49.531: Negative content width -6 (allocation 1, extents 4x3) while allocating gadget (node toolbar, owner GtkToolbar)
17:20:49 
17:20:49 (SWT:1369): Gtk-WARNING **: 21:20:49.579: Negative content width -6 (allocation 1, extents 4x3) while allocating gadget (node toolbar, owner GtkToolbar)
17:20:49 
17:20:49 (SWT:1369): Gtk-WARNING **: 21:20:49.679: Negative content width -6 (allocation 1, extents 4x3) while allocating gadget (node toolbar, owner GtkToolbar)
17:20:49 
17:20:49 (SWT:1369): Gtk-WARNING **: 21:20:49.739: Negative content width -6 (allocation 1, extents 4x3) while allocating gadget (node toolbar, owner GtkToolbar)
17:20:50 
17:20:50 (SWT:1369): Gtk-WARNING **: 21:20:50.645: Negative content width -6 (allocation 1, extents 4x3) while allocating gadget (node toolbar, owner GtkToolbar)
17:20:50 
17:20:50 (SWT:1369): Gtk-WARNING **: 21:20:50.646: Negative content width -6 (allocation 1, extents 4x3) while allocating gadget (node toolbar, owner GtkToolbar)
17:20:50 
17:20:50 (SWT:1369): Gtk-WARNING **: 21:20:50.659: Negative content width -6 (allocation 1, extents 4x3) while allocating gadget (node toolbar, owner GtkToolbar)
17:20:50 
17:20:50 (SWT:1369): Gtk-CRITICAL **: 21:20:50.685: gtk_box_gadget_distribute: assertion 'size >= 0' failed in GtkScrollbar
17:20:50 
17:20:50 (SWT:1369): Gtk-CRITICAL **: 21:20:50.716: gtk_box_gadget_distribute: assertion 'size >= 0' failed in GtkScrollbar
17:20:50 
17:20:50 (SWT:1369): Gtk-CRITICAL **: 21:20:50.731: gtk_box_gadget_distribute: assertion 'size >= 0' failed in GtkScrollbar
17:20:50 
17:20:50 (SWT:1369): Gtk-CRITICAL **: 21:20:50.748: gtk_box_gadget_distribute: assertion 'size >= 0' failed in GtkScrollbar
17:20:50 
17:20:50 (SWT:1369): Gtk-CRITICAL **: 21:20:50.764: gtk_box_gadget_distribute: assertion 'size >= 0' failed in GtkScrollbar
17:20:50 
17:20:50 (SWT:1369): Gtk-CRITICAL **: 21:20:50.789: gtk_box_gadget_distribute: assertion 'size >= 0' failed in GtkScrollbar
17:20:50 
17:20:50 (SWT:1369): Gtk-CRITICAL **: 21:20:50.801: gtk_box_gadget_distribute: assertion 'size >= 0' failed in GtkScrollbar
17:20:50 
17:20:50 (SWT:1369): Gtk-CRITICAL **: 21:20:50.814: gtk_box_gadget_distribute: assertion 'size >= 0' failed in GtkScrollbar
17:20:50 
17:20:50 (SWT:1369): Gtk-CRITICAL **: 21:20:50.831: gtk_box_gadget_distribute: assertion 'size >= 0' failed in GtkScrollbar
17:20:50 
17:20:50 (SWT:1369): Gtk-CRITICAL **: 21:20:50.848: gtk_box_gadget_distribute: assertion 'size >= 0' failed in GtkScrollbar
17:20:50 
17:20:50 (SWT:1369): Gtk-CRITICAL **: 21:20:50.864: gtk_box_gadget_distribute: assertion 'size >= 0' failed in GtkScrollbar
17:20:50 
17:20:50 (SWT:1369): Gtk-CRITICAL **: 21:20:50.890: gtk_box_gadget_distribute: assertion 'size >= 0' failed in GtkScrollbar
17:20:50 
17:20:50 (SWT:1369): Gtk-CRITICAL **: 21:20:50.902: gtk_box_gadget_distribute: assertion 'size >= 0' failed in GtkScrollbar
17:20:50 
17:20:50 (SWT:1369): Gtk-WARNING **: 21:20:50.916: Negative content width -6 (allocation 1, extents 4x3) while allocating gadget (node toolbar, owner GtkToolbar)
17:20:50 
17:20:50 (SWT:1369): Gtk-WARNING **: 21:20:50.916: Negative content height -3 (allocation 1, extents 2x2) while allocating gadget (node toolbar, owner GtkToolbar)
17:20:50 
17:20:50 (SWT:1369): Gtk-WARNING **: 21:20:50.916: Negative content width -6 (allocation 1, extents 4x3) while allocating gadget (node toolbar, owner GtkToolbar)
17:20:50 
17:20:50 (SWT:1369): Gtk-WARNING **: 21:20:50.916: Negative content height -3 (allocation 1, extents 2x2) while allocating gadget (node toolbar, owner GtkToolbar)
17:20:51 
17:20:51 (SWT:1369): Gtk-WARNING **: 21:20:51.065: Negative content width -6 (allocation 1, extents 4x3) while allocating gadget (node toolbar, owner GtkToolbar)
17:20:51 Tests run: 13, Failures: 0, Errors: 0, Skipped: 1, Time elapsed: 20.868 s - in org.eclipse.egit.ui.test.history.HistoryViewTest
17:20:51 testShowAllBranches(org.eclipse.egit.ui.test.history.HistoryViewTest)  Time elapsed: 2.184 s
17:20:51 testOpenHistoryOnFileFolderFilter(org.eclipse.egit.ui.test.history.HistoryViewTest)  Time elapsed: 2.141 s
17:20:51 testCheckOut(org.eclipse.egit.ui.test.history.HistoryViewTest)  Time elapsed: 1.293 s
17:20:51 testOpenHistoryOnProject(org.eclipse.egit.ui.test.history.HistoryViewTest)  Time elapsed: 0.973 s
17:20:51 testRevertFailure(org.eclipse.egit.ui.test.history.HistoryViewTest)  Time elapsed: 1.891 s
17:20:51 testRebaseAlreadyUpToDate(org.eclipse.egit.ui.test.history.HistoryViewTest) skipped
17:20:51 testAddBranch(org.eclipse.egit.ui.test.history.HistoryViewTest)  Time elapsed: 1.315 s
17:20:51 testAddCommit(org.eclipse.egit.ui.test.history.HistoryViewTest)  Time elapsed: 1.807 s
17:20:51 testOpenHistoryOnFileProjectFilter(org.eclipse.egit.ui.test.history.HistoryViewTest)  Time elapsed: 1.998 s
17:20:51 testOpenHistoryOnFileRepoFilter(org.eclipse.egit.ui.test.history.HistoryViewTest)  Time elapsed: 2.056 s
17:20:51 testAddTag(org.eclipse.egit.ui.test.history.HistoryViewTest)  Time elapsed: 1.482 s
17:20:51 testOpenHistoryOnFileNoFilter(org.eclipse.egit.ui.test.history.HistoryViewTest)  Time elapsed: 2.363 s
17:20:51 testOpenOfDeletedFile(org.eclipse.egit.ui.test.history.HistoryViewTest)  Time elapsed: 1.323 s
17:20:51 Running org.eclipse.egit.ui.test.trace.TraceConfigurationDialogTest
17:20:51 
17:20:51 (SWT:1369): Gtk-CRITICAL **: 21:20:51.263: gtk_box_gadget_distribute: assertion 'size >= 0' failed in GtkScrollbar
17:20:51 
17:20:51 (SWT:1369): Gtk-CRITICAL **: 21:20:51.327: gtk_box_gadget_distribute: assertion 'size >= 0' failed in GtkScrollbar
17:20:51 
17:20:51 (SWT:1369): Gtk-CRITICAL **: 21:20:51.391: gtk_box_gadget_distribute: assertion 'size >= 0' failed in GtkScrollbar
17:20:51 
17:20:51 (SWT:1369): Gtk-CRITICAL **: 21:20:51.455: gtk_box_gadget_distribute: assertion 'size >= 0' failed in GtkScrollbar
17:20:51 
17:20:51 (SWT:1369): Gtk-CRITICAL **: 21:20:51.516: gtk_box_gadget_distribute: assertion 'size >= 0' failed in GtkScrollbar
17:20:51 
17:20:51 (SWT:1369): Gtk-CRITICAL **: 21:20:51.586: gtk_box_gadget_distribute: assertion 'size >= 0' failed in GtkScrollbar
17:20:51 
17:20:51 (SWT:1369): Gtk-CRITICAL **: 21:20:51.599: gtk_box_gadget_distribute: assertion 'size >= 0' failed in GtkScrollbar
17:20:51 Tests run: 2, Failures: 0, Errors: 0, Skipped: 0, Time elapsed: 0.415 s - in org.eclipse.egit.ui.test.trace.TraceConfigurationDialogTest
17:20:51 testMainSwitch(org.eclipse.egit.ui.test.trace.TraceConfigurationDialogTest)  Time elapsed: 0.202 s
17:20:51 testTreeNode(org.eclipse.egit.ui.test.trace.TraceConfigurationDialogTest)  Time elapsed: 0.212 s
17:20:51 Running org.eclipse.egit.ui.internal.dialogs.HyperlinkTokenScannerTest
17:20:51 Tests run: 10, Failures: 0, Errors: 0, Skipped: 0, Time elapsed: 0.214 s - in org.eclipse.egit.ui.internal.dialogs.HyperlinkTokenScannerTest
17:20:51 tokenizeEmbeddedHyperlink(org.eclipse.egit.ui.internal.dialogs.HyperlinkTokenScannerTest)  Time elapsed: 0.003 s
17:20:51 tokenizeWithFailingDetector(org.eclipse.egit.ui.internal.dialogs.HyperlinkTokenScannerTest)  Time elapsed: 0 s
17:20:51 tokenizeWithoutDetectors(org.eclipse.egit.ui.internal.dialogs.HyperlinkTokenScannerTest)  Time elapsed: 0 s
17:20:51 tokenizeHyperlinksOutsideRegion(org.eclipse.egit.ui.internal.dialogs.HyperlinkTokenScannerTest)  Time elapsed: 0.001 s
17:20:51 tokenizeMultipleHyperlinksSimple(org.eclipse.egit.ui.internal.dialogs.HyperlinkTokenScannerTest)  Time elapsed: 0 s
17:20:51 tokenizeMultipleHyperlinksMultiline(org.eclipse.egit.ui.internal.dialogs.HyperlinkTokenScannerTest)  Time elapsed: 0.001 s
17:20:51 tokenizeLeadingHyperlink(org.eclipse.egit.ui.internal.dialogs.HyperlinkTokenScannerTest)  Time elapsed: 0.001 s
17:20:51 tokenizeEmpty(org.eclipse.egit.ui.internal.dialogs.HyperlinkTokenScannerTest)  Time elapsed: 0 s
17:20:51 tokenizeHyperlinksCutByRegion(org.eclipse.egit.ui.internal.dialogs.HyperlinkTokenScannerTest)  Time elapsed: 0.001 s
17:20:51 tokenizeNoHyperlinks(org.eclipse.egit.ui.internal.dialogs.HyperlinkTokenScannerTest)  Time elapsed: 0.001 s
17:20:51 Running org.eclipse.egit.ui.internal.dialogs.CommitMessageComponentTest
17:20:51 Tests run: 5, Failures: 0, Errors: 0, Skipped: 0, Time elapsed: 0.001 s - in org.eclipse.egit.ui.internal.dialogs.CommitMessageComponentTest
17:20:51 commitFormat_MultipleLines_notOk2(org.eclipse.egit.ui.internal.dialogs.CommitMessageComponentTest)  Time elapsed: 0 s
17:20:51 commitFormat_simple(org.eclipse.egit.ui.internal.dialogs.CommitMessageComponentTest)  Time elapsed: 0 s
17:20:51 commitFormat_MultipleLines_ok(org.eclipse.egit.ui.internal.dialogs.CommitMessageComponentTest)  Time elapsed: 0 s
17:20:51 commitFormat_trailingWhitespace_ok(org.eclipse.egit.ui.internal.dialogs.CommitMessageComponentTest)  Time elapsed: 0 s
17:20:51 commitFormat_MultipleLines_notOk(org.eclipse.egit.ui.internal.dialogs.CommitMessageComponentTest)  Time elapsed: 0 s
17:20:51 Running org.eclipse.egit.ui.internal.dialogs.CommitMessageBuilderTest
17:20:51 
17:20:51 !ENTRY org.eclipse.egit.ui 4 0 2019-03-28 21:20:51.977
17:20:51 !MESSAGE CrashingCommitMessageProvider fails on purpose.
17:20:51 !STACK 0
17:20:51 java.lang.IllegalStateException: CrashingCommitMessageProvider fails on purpose.
17:20:51 	at org.eclipse.egit.ui.internal.dialogs.CommitMessageBuilderTest$CrashingCommitMessageProvider.getMessage(CommitMessageBuilderTest.java:474)
17:20:51 	at org.eclipse.egit.ui.internal.dialogs.CommitMessageBuilder.build(CommitMessageBuilder.java:90)
17:20:51 	at org.eclipse.egit.ui.internal.dialogs.CommitMessageBuilderTest.commitMessageProvider_oneCrashingProvider(CommitMessageBuilderTest.java:99)
17:20:51 	at sun.reflect.NativeMethodAccessorImpl.invoke0(Native Method)
17:20:51 	at sun.reflect.NativeMethodAccessorImpl.invoke(NativeMethodAccessorImpl.java:62)
17:20:51 	at sun.reflect.DelegatingMethodAccessorImpl.invoke(DelegatingMethodAccessorImpl.java:43)
17:20:51 	at java.lang.reflect.Method.invoke(Method.java:498)
17:20:51 	at org.junit.runners.model.FrameworkMethod$1.runReflectiveCall(FrameworkMethod.java:50)
17:20:51 	at org.junit.internal.runners.model.ReflectiveCallable.run(ReflectiveCallable.java:12)
17:20:51 	at org.junit.runners.model.FrameworkMethod.invokeExplosively(FrameworkMethod.java:47)
17:20:51 	at org.junit.internal.runners.statements.InvokeMethod.evaluate(InvokeMethod.java:17)
17:20:51 	at org.junit.internal.runners.statements.RunBefores.evaluate(RunBefores.java:26)
17:20:51 	at org.junit.internal.runners.statements.RunAfters.evaluate(RunAfters.java:27)
17:20:51 	at org.junit.runners.ParentRunner.runLeaf(ParentRunner.java:325)
17:20:51 	at org.junit.runners.BlockJUnit4ClassRunner.runChild(BlockJUnit4ClassRunner.java:78)
17:20:51 	at org.junit.runners.BlockJUnit4ClassRunner.runChild(BlockJUnit4ClassRunner.java:57)
17:20:51 	at org.junit.runners.ParentRunner$3.run(ParentRunner.java:290)
17:20:51 	at org.junit.runners.ParentRunner$1.schedule(ParentRunner.java:71)
17:20:51 	at org.junit.runners.ParentRunner.runChildren(ParentRunner.java:288)
17:20:51 	at org.junit.runners.ParentRunner.access$000(ParentRunner.java:58)
17:20:51 	at org.junit.runners.ParentRunner$2.evaluate(ParentRunner.java:268)
17:20:51 	at org.junit.internal.runners.statements.RunBefores.evaluate(RunBefores.java:26)
17:20:51 	at org.junit.runners.ParentRunner.run(ParentRunner.java:363)
17:20:51 	at org.apache.maven.surefire.junit4.JUnit4Provider.execute(JUnit4Provider.java:365)
17:20:51 	at org.apache.maven.surefire.junit4.JUnit4Provider.executeWithRerun(JUnit4Provider.java:273)
17:20:51 	at org.apache.maven.surefire.junit4.JUnit4Provider.executeTestSet(JUnit4Provider.java:238)
17:20:51 	at org.apache.maven.surefire.junit4.JUnit4Provider.invoke(JUnit4Provider.java:159)
17:20:51 	at sun.reflect.NativeMethodAccessorImpl.invoke0(Native Method)
17:20:51 	at sun.reflect.NativeMethodAccessorImpl.invoke(NativeMethodAccessorImpl.java:62)
17:20:51 	at sun.reflect.DelegatingMethodAccessorImpl.invoke(DelegatingMethodAccessorImpl.java:43)
17:20:51 	at java.lang.reflect.Method.invoke(Method.java:498)
17:20:51 	at org.apache.maven.surefire.util.ReflectionUtils.invokeMethodWithArray2(ReflectionUtils.java:206)
17:20:51 	at org.apache.maven.surefire.booter.ProviderFactory$ProviderProxy.invoke(ProviderFactory.java:161)
17:20:51 	at org.apache.maven.surefire.booter.ProviderFactory.invokeProvider(ProviderFactory.java:84)
17:20:51 	at org.eclipse.tycho.surefire.osgibooter.OsgiSurefireBooter.run(OsgiSurefireBooter.java:110)
17:20:51 	at org.eclipse.tycho.surefire.osgibooter.AbstractUITestApplication.runTests(AbstractUITestApplication.java:44)
17:20:51 	at org.eclipse.e4.ui.internal.workbench.swt.E4Testable$1.run(E4Testable.java:73)
17:20:51 	at java.lang.Thread.run(Thread.java:748)
17:20:54 
17:20:54 !ENTRY org.eclipse.egit.ui 4 0 2019-03-28 21:20:54.041
17:20:54 !MESSAGE CrashingCommitMessageProviderWithCaretPositioning fails on purpose.
17:20:54 !STACK 0
17:20:54 java.lang.IllegalStateException: CrashingCommitMessageProviderWithCaretPositioning fails on purpose.
17:20:54 	at org.eclipse.egit.ui.internal.dialogs.CommitMessageBuilderTest$CrashingCommitMessageProviderWithCaretPositioning.getCommitMessageWithPosition(CommitMessageBuilderTest.java:491)
17:20:54 	at org.eclipse.egit.ui.internal.dialogs.CommitMessageBuilder.build(CommitMessageBuilder.java:81)
17:20:54 	at org.eclipse.egit.ui.internal.dialogs.CommitMessageBuilderTest.commitMessageProvider_oneCrashingProviderWithCaretPosition(CommitMessageBuilderTest.java:112)
17:20:54 	at sun.reflect.NativeMethodAccessorImpl.invoke0(Native Method)
17:20:54 	at sun.reflect.NativeMethodAccessorImpl.invoke(NativeMethodAccessorImpl.java:62)
17:20:54 	at sun.reflect.DelegatingMethodAccessorImpl.invoke(DelegatingMethodAccessorImpl.java:43)
17:20:54 	at java.lang.reflect.Method.invoke(Method.java:498)
17:20:54 	at org.junit.runners.model.FrameworkMethod$1.runReflectiveCall(FrameworkMethod.java:50)
17:20:54 	at org.junit.internal.runners.model.ReflectiveCallable.run(ReflectiveCallable.java:12)
17:20:54 	at org.junit.runners.model.FrameworkMethod.invokeExplosively(FrameworkMethod.java:47)
17:20:54 	at org.junit.internal.runners.statements.InvokeMethod.evaluate(InvokeMethod.java:17)
17:20:54 	at org.junit.internal.runners.statements.RunBefores.evaluate(RunBefores.java:26)
17:20:54 	at org.junit.internal.runners.statements.RunAfters.evaluate(RunAfters.java:27)
17:20:54 	at org.junit.runners.ParentRunner.runLeaf(ParentRunner.java:325)
17:20:54 	at org.junit.runners.BlockJUnit4ClassRunner.runChild(BlockJUnit4ClassRunner.java:78)
17:20:54 	at org.junit.runners.BlockJUnit4ClassRunner.runChild(BlockJUnit4ClassRunner.java:57)
17:20:54 	at org.junit.runners.ParentRunner$3.run(ParentRunner.java:290)
17:20:54 	at org.junit.runners.ParentRunner$1.schedule(ParentRunner.java:71)
17:20:54 	at org.junit.runners.ParentRunner.runChildren(ParentRunner.java:288)
17:20:54 	at org.junit.runners.ParentRunner.access$000(ParentRunner.java:58)
17:20:54 	at org.junit.runners.ParentRunner$2.evaluate(ParentRunner.java:268)
17:20:54 	at org.junit.internal.runners.statements.RunBefores.evaluate(RunBefores.java:26)
17:20:54 	at org.junit.runners.ParentRunner.run(ParentRunner.java:363)
17:20:54 	at org.apache.maven.surefire.junit4.JUnit4Provider.execute(JUnit4Provider.java:365)
17:20:54 	at org.apache.maven.surefire.junit4.JUnit4Provider.executeWithRerun(JUnit4Provider.java:273)
17:20:54 	at org.apache.maven.surefire.junit4.JUnit4Provider.executeTestSet(JUnit4Provider.java:238)
17:20:54 	at org.apache.maven.surefire.junit4.JUnit4Provider.invoke(JUnit4Provider.java:159)
17:20:54 	at sun.reflect.NativeMethodAccessorImpl.invoke0(Native Method)
17:20:54 	at sun.reflect.NativeMethodAccessorImpl.invoke(NativeMethodAccessorImpl.java:62)
17:20:54 	at sun.reflect.DelegatingMethodAccessorImpl.invoke(DelegatingMethodAccessorImpl.java:43)
17:20:54 	at java.lang.reflect.Method.invoke(Method.java:498)
17:20:54 	at org.apache.maven.surefire.util.ReflectionUtils.invokeMethodWithArray2(ReflectionUtils.java:206)
17:20:54 	at org.apache.maven.surefire.booter.ProviderFactory$ProviderProxy.invoke(ProviderFactory.java:161)
17:20:54 	at org.apache.maven.surefire.booter.ProviderFactory.invokeProvider(ProviderFactory.java:84)
17:20:54 	at org.eclipse.tycho.surefire.osgibooter.OsgiSurefireBooter.run(OsgiSurefireBooter.java:110)
17:20:54 	at org.eclipse.tycho.surefire.osgibooter.AbstractUITestApplication.runTests(AbstractUITestApplication.java:44)
17:20:54 	at org.eclipse.e4.ui.internal.workbench.swt.E4Testable$1.run(E4Testable.java:73)
17:20:54 	at java.lang.Thread.run(Thread.java:748)
17:20:54 
17:20:54 !ENTRY org.eclipse.egit.ui 4 0 2019-03-28 21:20:54.201
17:20:54 !MESSAGE CrashingCommitMessageProvider fails on purpose.
17:20:54 !STACK 0
17:20:54 java.lang.IllegalStateException: CrashingCommitMessageProvider fails on purpose.
17:20:54 	at org.eclipse.egit.ui.internal.dialogs.CommitMessageBuilderTest$CrashingCommitMessageProvider.getMessage(CommitMessageBuilderTest.java:474)
17:20:54 	at org.eclipse.egit.ui.internal.dialogs.CommitMessageBuilder.build(CommitMessageBuilder.java:90)
17:20:54 	at org.eclipse.egit.ui.internal.dialogs.CommitMessageBuilderTest.commitMessageProvider_twoProvidersFirstOneCrashing(CommitMessageBuilderTest.java:146)
17:20:54 	at sun.reflect.NativeMethodAccessorImpl.invoke0(Native Method)
17:20:54 	at sun.reflect.NativeMethodAccessorImpl.invoke(NativeMethodAccessorImpl.java:62)
17:20:54 	at sun.reflect.DelegatingMethodAccessorImpl.invoke(DelegatingMethodAccessorImpl.java:43)
17:20:54 	at java.lang.reflect.Method.invoke(Method.java:498)
17:20:54 	at org.junit.runners.model.FrameworkMethod$1.runReflectiveCall(FrameworkMethod.java:50)
17:20:54 	at org.junit.internal.runners.model.ReflectiveCallable.run(ReflectiveCallable.java:12)
17:20:54 	at org.junit.runners.model.FrameworkMethod.invokeExplosively(FrameworkMethod.java:47)
17:20:54 	at org.junit.internal.runners.statements.InvokeMethod.evaluate(InvokeMethod.java:17)
17:20:54 	at org.junit.internal.runners.statements.RunBefores.evaluate(RunBefores.java:26)
17:20:54 	at org.junit.internal.runners.statements.RunAfters.evaluate(RunAfters.java:27)
17:20:54 	at org.junit.runners.ParentRunner.runLeaf(ParentRunner.java:325)
17:20:54 	at org.junit.runners.BlockJUnit4ClassRunner.runChild(BlockJUnit4ClassRunner.java:78)
17:20:54 	at org.junit.runners.BlockJUnit4ClassRunner.runChild(BlockJUnit4ClassRunner.java:57)
17:20:54 	at org.junit.runners.ParentRunner$3.run(ParentRunner.java:290)
17:20:54 	at org.junit.runners.ParentRunner$1.schedule(ParentRunner.java:71)
17:20:54 	at org.junit.runners.ParentRunner.runChildren(ParentRunner.java:288)
17:20:54 	at org.junit.runners.ParentRunner.access$000(ParentRunner.java:58)
17:20:54 	at org.junit.runners.ParentRunner$2.evaluate(ParentRunner.java:268)
17:20:54 	at org.junit.internal.runners.statements.RunBefores.evaluate(RunBefores.java:26)
17:20:54 	at org.junit.runners.ParentRunner.run(ParentRunner.java:363)
17:20:54 	at org.apache.maven.surefire.junit4.JUnit4Provider.execute(JUnit4Provider.java:365)
17:20:54 	at org.apache.maven.surefire.junit4.JUnit4Provider.executeWithRerun(JUnit4Provider.java:273)
17:20:54 	at org.apache.maven.surefire.junit4.JUnit4Provider.executeTestSet(JUnit4Provider.java:238)
17:20:54 	at org.apache.maven.surefire.junit4.JUnit4Provider.invoke(JUnit4Provider.java:159)
17:20:54 	at sun.reflect.NativeMethodAccessorImpl.invoke0(Native Method)
17:20:54 	at sun.reflect.NativeMethodAccessorImpl.invoke(NativeMethodAccessorImpl.java:62)
17:20:54 	at sun.reflect.DelegatingMethodAccessorImpl.invoke(DelegatingMethodAccessorImpl.java:43)
17:20:54 	at java.lang.reflect.Method.invoke(Method.java:498)
17:20:54 	at org.apache.maven.surefire.util.ReflectionUtils.invokeMethodWithArray2(ReflectionUtils.java:206)
17:20:54 	at org.apache.maven.surefire.booter.ProviderFactory$ProviderProxy.invoke(ProviderFactory.java:161)
17:20:54 	at org.apache.maven.surefire.booter.ProviderFactory.invokeProvider(ProviderFactory.java:84)
17:20:54 	at org.eclipse.tycho.surefire.osgibooter.OsgiSurefireBooter.run(OsgiSurefireBooter.java:110)
17:20:54 	at org.eclipse.tycho.surefire.osgibooter.AbstractUITestApplication.runTests(AbstractUITestApplication.java:44)
17:20:54 	at org.eclipse.e4.ui.internal.workbench.swt.E4Testable$1.run(E4Testable.java:73)
17:20:54 	at java.lang.Thread.run(Thread.java:748)
17:20:55 
17:20:55 !ENTRY org.eclipse.egit.ui 4 0 2019-03-28 21:20:55.452
17:20:55 !MESSAGE CrashingCommitMessageProvider fails on purpose.
17:20:55 !STACK 0
17:20:55 java.lang.IllegalStateException: CrashingCommitMessageProvider fails on purpose.
17:20:55 	at org.eclipse.egit.ui.internal.dialogs.CommitMessageBuilderTest$CrashingCommitMessageProvider.getMessage(CommitMessageBuilderTest.java:474)
17:20:55 	at org.eclipse.egit.ui.internal.dialogs.CommitMessageBuilder.build(CommitMessageBuilder.java:90)
17:20:55 	at org.eclipse.egit.ui.internal.dialogs.CommitMessageBuilderTest.commitMessageProvider_multipleProvidersWithCrashAndNull(CommitMessageBuilderTest.java:165)
17:20:55 	at sun.reflect.NativeMethodAccessorImpl.invoke0(Native Method)
17:20:55 	at sun.reflect.NativeMethodAccessorImpl.invoke(NativeMethodAccessorImpl.java:62)
17:20:55 	at sun.reflect.DelegatingMethodAccessorImpl.invoke(DelegatingMethodAccessorImpl.java:43)
17:20:55 	at java.lang.reflect.Method.invoke(Method.java:498)
17:20:55 	at org.junit.runners.model.FrameworkMethod$1.runReflectiveCall(FrameworkMethod.java:50)
17:20:55 	at org.junit.internal.runners.model.ReflectiveCallable.run(ReflectiveCallable.java:12)
17:20:55 	at org.junit.runners.model.FrameworkMethod.invokeExplosively(FrameworkMethod.java:47)
17:20:55 	at org.junit.internal.runners.statements.InvokeMethod.evaluate(InvokeMethod.java:17)
17:20:55 	at org.junit.internal.runners.statements.RunBefores.evaluate(RunBefores.java:26)
17:20:55 	at org.junit.internal.runners.statements.RunAfters.evaluate(RunAfters.java:27)
17:20:55 	at org.junit.runners.ParentRunner.runLeaf(ParentRunner.java:325)
17:20:55 	at org.junit.runners.BlockJUnit4ClassRunner.runChild(BlockJUnit4ClassRunner.java:78)
17:20:55 	at org.junit.runners.BlockJUnit4ClassRunner.runChild(BlockJUnit4ClassRunner.java:57)
17:20:55 	at org.junit.runners.ParentRunner$3.run(ParentRunner.java:290)
17:20:55 	at org.junit.runners.ParentRunner$1.schedule(ParentRunner.java:71)
17:20:55 	at org.junit.runners.ParentRunner.runChildren(ParentRunner.java:288)
17:20:55 	at org.junit.runners.ParentRunner.access$000(ParentRunner.java:58)
17:20:55 	at org.junit.runners.ParentRunner$2.evaluate(ParentRunner.java:268)
17:20:55 	at org.junit.internal.runners.statements.RunBefores.evaluate(RunBefores.java:26)
17:20:55 	at org.junit.runners.ParentRunner.run(ParentRunner.java:363)
17:20:55 	at org.apache.maven.surefire.junit4.JUnit4Provider.execute(JUnit4Provider.java:365)
17:20:55 	at org.apache.maven.surefire.junit4.JUnit4Provider.executeWithRerun(JUnit4Provider.java:273)
17:20:55 	at org.apache.maven.surefire.junit4.JUnit4Provider.executeTestSet(JUnit4Provider.java:238)
17:20:55 	at org.apache.maven.surefire.junit4.JUnit4Provider.invoke(JUnit4Provider.java:159)
17:20:55 	at sun.reflect.NativeMethodAccessorImpl.invoke0(Native Method)
17:20:55 	at sun.reflect.NativeMethodAccessorImpl.invoke(NativeMethodAccessorImpl.java:62)
17:20:55 	at sun.reflect.DelegatingMethodAccessorImpl.invoke(DelegatingMethodAccessorImpl.java:43)
17:20:55 	at java.lang.reflect.Method.invoke(Method.java:498)
17:20:55 	at org.apache.maven.surefire.util.ReflectionUtils.invokeMethodWithArray2(ReflectionUtils.java:206)
17:20:55 	at org.apache.maven.surefire.booter.ProviderFactory$ProviderProxy.invoke(ProviderFactory.java:161)
17:20:55 	at org.apache.maven.surefire.booter.ProviderFactory.invokeProvider(ProviderFactory.java:84)
17:20:55 	at org.eclipse.tycho.surefire.osgibooter.OsgiSurefireBooter.run(OsgiSurefireBooter.java:110)
17:20:55 	at org.eclipse.tycho.surefire.osgibooter.AbstractUITestApplication.runTests(AbstractUITestApplication.java:44)
17:20:55 	at org.eclipse.e4.ui.internal.workbench.swt.E4Testable$1.run(E4Testable.java:73)
17:20:55 	at java.lang.Thread.run(Thread.java:748)
17:20:55 
17:20:55 !ENTRY org.eclipse.egit.ui 4 0 2019-03-28 21:20:55.453
17:20:55 !MESSAGE CrashingCommitMessageProvider fails on purpose.
17:20:55 !STACK 0
17:20:55 java.lang.IllegalStateException: CrashingCommitMessageProvider fails on purpose.
17:20:55 	at org.eclipse.egit.ui.internal.dialogs.CommitMessageBuilderTest$CrashingCommitMessageProvider.getMessage(CommitMessageBuilderTest.java:474)
17:20:55 	at org.eclipse.egit.ui.internal.dialogs.CommitMessageBuilder.build(CommitMessageBuilder.java:90)
17:20:55 	at org.eclipse.egit.ui.internal.dialogs.CommitMessageBuilderTest.commitMessageProvider_multipleProvidersWithCrashAndNull(CommitMessageBuilderTest.java:165)
17:20:55 	at sun.reflect.NativeMethodAccessorImpl.invoke0(Native Method)
17:20:55 	at sun.reflect.NativeMethodAccessorImpl.invoke(NativeMethodAccessorImpl.java:62)
17:20:55 	at sun.reflect.DelegatingMethodAccessorImpl.invoke(DelegatingMethodAccessorImpl.java:43)
17:20:55 	at java.lang.reflect.Method.invoke(Method.java:498)
17:20:55 	at org.junit.runners.model.FrameworkMethod$1.runReflectiveCall(FrameworkMethod.java:50)
17:20:55 	at org.junit.internal.runners.model.ReflectiveCallable.run(ReflectiveCallable.java:12)
17:20:55 	at org.junit.runners.model.FrameworkMethod.invokeExplosively(FrameworkMethod.java:47)
17:20:55 	at org.junit.internal.runners.statements.InvokeMethod.evaluate(InvokeMethod.java:17)
17:20:55 	at org.junit.internal.runners.statements.RunBefores.evaluate(RunBefores.java:26)
17:20:55 	at org.junit.internal.runners.statements.RunAfters.evaluate(RunAfters.java:27)
17:20:55 	at org.junit.runners.ParentRunner.runLeaf(ParentRunner.java:325)
17:20:55 	at org.junit.runners.BlockJUnit4ClassRunner.runChild(BlockJUnit4ClassRunner.java:78)
17:20:55 	at org.junit.runners.BlockJUnit4ClassRunner.runChild(BlockJUnit4ClassRunner.java:57)
17:20:55 	at org.junit.runners.ParentRunner$3.run(ParentRunner.java:290)
17:20:55 	at org.junit.runners.ParentRunner$1.schedule(ParentRunner.java:71)
17:20:55 	at org.junit.runners.ParentRunner.runChildren(ParentRunner.java:288)
17:20:55 	at org.junit.runners.ParentRunner.access$000(ParentRunner.java:58)
17:20:55 	at org.junit.runners.ParentRunner$2.evaluate(ParentRunner.java:268)
17:20:55 	at org.junit.internal.runners.statements.RunBefores.evaluate(RunBefores.java:26)
17:20:55 	at org.junit.runners.ParentRunner.run(ParentRunner.java:363)
17:20:55 	at org.apache.maven.surefire.junit4.JUnit4Provider.execute(JUnit4Provider.java:365)
17:20:55 	at org.apache.maven.surefire.junit4.JUnit4Provider.executeWithRerun(JUnit4Provider.java:273)
17:20:55 	at org.apache.maven.surefire.junit4.JUnit4Provider.executeTestSet(JUnit4Provider.java:238)
17:20:55 	at org.apache.maven.surefire.junit4.JUnit4Provider.invoke(JUnit4Provider.java:159)
17:20:55 	at sun.reflect.NativeMethodAccessorImpl.invoke0(Native Method)
17:20:55 	at sun.reflect.NativeMethodAccessorImpl.invoke(NativeMethodAccessorImpl.java:62)
17:20:55 	at sun.reflect.DelegatingMethodAccessorImpl.invoke(DelegatingMethodAccessorImpl.java:43)
17:20:55 	at java.lang.reflect.Method.invoke(Method.java:498)
17:20:55 	at org.apache.maven.surefire.util.ReflectionUtils.invokeMethodWithArray2(ReflectionUtils.java:206)
17:20:55 	at org.apache.maven.surefire.booter.ProviderFactory$ProviderProxy.invoke(ProviderFactory.java:161)
17:20:55 	at org.apache.maven.surefire.booter.ProviderFactory.invokeProvider(ProviderFactory.java:84)
17:20:55 	at org.eclipse.tycho.surefire.osgibooter.OsgiSurefireBooter.run(OsgiSurefireBooter.java:110)
17:20:55 	at org.eclipse.tycho.surefire.osgibooter.AbstractUITestApplication.runTests(AbstractUITestApplication.java:44)
17:20:55 	at org.eclipse.e4.ui.internal.workbench.swt.E4Testable$1.run(E4Testable.java:73)
17:20:55 	at java.lang.Thread.run(Thread.java:748)
17:20:55 
17:20:55 !ENTRY org.eclipse.egit.ui 2 0 2019-03-28 21:20:55.569
17:20:55 !MESSAGE The ICommitMessageProvider2 implementation org.eclipse.egit.ui.internal.dialogs.CommitMessageBuilderTest$3 provided the caret position -42, which exceeds the length of the commit message or is negative. The caret position is ignored.
17:20:57 
17:20:57 !ENTRY org.eclipse.egit.ui 2 0 2019-03-28 21:20:57.271
17:20:57 !MESSAGE Found multiple implementations of ICommitMessageProvider2. Ignoring caret positioning for org.eclipse.egit.ui.internal.dialogs.CommitMessageBuilderTest$3.
17:20:58 
17:20:58 !ENTRY org.eclipse.egit.ui 4 0 2019-03-28 21:20:58.889
17:20:58 !MESSAGE CrashingCommitMessageProvider fails on purpose.
17:20:58 !STACK 0
17:20:58 java.lang.IllegalStateException: CrashingCommitMessageProvider fails on purpose.
17:20:58 	at org.eclipse.egit.ui.internal.dialogs.CommitMessageBuilderTest$CrashingCommitMessageProvider.getMessage(CommitMessageBuilderTest.java:474)
17:20:58 	at org.eclipse.egit.ui.internal.dialogs.CommitMessageBuilder.build(CommitMessageBuilder.java:90)
17:20:58 	at org.eclipse.egit.ui.internal.dialogs.CommitMessageBuilderTest.commitMessageProvider_twoProvidersSecondOneCrashing(CommitMessageBuilderTest.java:130)
17:20:58 	at sun.reflect.NativeMethodAccessorImpl.invoke0(Native Method)
17:20:58 	at sun.reflect.NativeMethodAccessorImpl.invoke(NativeMethodAccessorImpl.java:62)
17:20:58 	at sun.reflect.DelegatingMethodAccessorImpl.invoke(DelegatingMethodAccessorImpl.java:43)
17:20:58 	at java.lang.reflect.Method.invoke(Method.java:498)
17:20:58 	at org.junit.runners.model.FrameworkMethod$1.runReflectiveCall(FrameworkMethod.java:50)
17:20:58 	at org.junit.internal.runners.model.ReflectiveCallable.run(ReflectiveCallable.java:12)
17:20:58 	at org.junit.runners.model.FrameworkMethod.invokeExplosively(FrameworkMethod.java:47)
17:20:58 	at org.junit.internal.runners.statements.InvokeMethod.evaluate(InvokeMethod.java:17)
17:20:58 	at org.junit.internal.runners.statements.RunBefores.evaluate(RunBefores.java:26)
17:20:58 	at org.junit.internal.runners.statements.RunAfters.evaluate(RunAfters.java:27)
17:20:58 	at org.junit.runners.ParentRunner.runLeaf(ParentRunner.java:325)
17:20:58 	at org.junit.runners.BlockJUnit4ClassRunner.runChild(BlockJUnit4ClassRunner.java:78)
17:20:58 	at org.junit.runners.BlockJUnit4ClassRunner.runChild(BlockJUnit4ClassRunner.java:57)
17:20:58 	at org.junit.runners.ParentRunner$3.run(ParentRunner.java:290)
17:20:58 	at org.junit.runners.ParentRunner$1.schedule(ParentRunner.java:71)
17:20:58 	at org.junit.runners.ParentRunner.runChildren(ParentRunner.java:288)
17:20:58 	at org.junit.runners.ParentRunner.access$000(ParentRunner.java:58)
17:20:58 	at org.junit.runners.ParentRunner$2.evaluate(ParentRunner.java:268)
17:20:58 	at org.junit.internal.runners.statements.RunBefores.evaluate(RunBefores.java:26)
17:20:58 	at org.junit.runners.ParentRunner.run(ParentRunner.java:363)
17:20:58 	at org.apache.maven.surefire.junit4.JUnit4Provider.execute(JUnit4Provider.java:365)
17:20:58 	at org.apache.maven.surefire.junit4.JUnit4Provider.executeWithRerun(JUnit4Provider.java:273)
17:20:58 	at org.apache.maven.surefire.junit4.JUnit4Provider.executeTestSet(JUnit4Provider.java:238)
17:20:58 	at org.apache.maven.surefire.junit4.JUnit4Provider.invoke(JUnit4Provider.java:159)
17:20:58 	at sun.reflect.NativeMethodAccessorImpl.invoke0(Native Method)
17:20:58 	at sun.reflect.NativeMethodAccessorImpl.invoke(NativeMethodAccessorImpl.java:62)
17:20:58 	at sun.reflect.DelegatingMethodAccessorImpl.invoke(DelegatingMethodAccessorImpl.java:43)
17:20:58 	at java.lang.reflect.Method.invoke(Method.java:498)
17:20:58 	at org.apache.maven.surefire.util.ReflectionUtils.invokeMethodWithArray2(ReflectionUtils.java:206)
17:20:58 	at org.apache.maven.surefire.booter.ProviderFactory$ProviderProxy.invoke(ProviderFactory.java:161)
17:20:58 	at org.apache.maven.surefire.booter.ProviderFactory.invokeProvider(ProviderFactory.java:84)
17:20:58 	at org.eclipse.tycho.surefire.osgibooter.OsgiSurefireBooter.run(OsgiSurefireBooter.java:110)
17:20:58 	at org.eclipse.tycho.surefire.osgibooter.AbstractUITestApplication.runTests(AbstractUITestApplication.java:44)
17:20:58 	at org.eclipse.e4.ui.internal.workbench.swt.E4Testable$1.run(E4Testable.java:73)
17:20:58 	at java.lang.Thread.run(Thread.java:748)
17:20:58 
17:20:58 !ENTRY org.eclipse.egit.ui 4 0 2019-03-28 21:20:58.989
17:20:58 !MESSAGE CrashingCommitMessageProvider fails on purpose.
17:20:58 !STACK 0
17:20:58 java.lang.IllegalStateException: CrashingCommitMessageProvider fails on purpose.
17:20:58 	at org.eclipse.egit.ui.internal.dialogs.CommitMessageBuilderTest$CrashingCommitMessageProvider.getMessage(CommitMessageBuilderTest.java:474)
17:20:58 	at org.eclipse.egit.ui.internal.dialogs.CommitMessageBuilder.build(CommitMessageBuilder.java:90)
17:20:58 	at org.eclipse.egit.ui.internal.dialogs.CommitMessageBuilderTest.commitMessageProvider_multipleProvidersWithCrashingAndNullAndOneCaretPositioning(CommitMessageBuilderTest.java:414)
17:20:58 	at sun.reflect.NativeMethodAccessorImpl.invoke0(Native Method)
17:20:58 	at sun.reflect.NativeMethodAccessorImpl.invoke(NativeMethodAccessorImpl.java:62)
17:20:58 	at sun.reflect.DelegatingMethodAccessorImpl.invoke(DelegatingMethodAccessorImpl.java:43)
17:20:58 	at java.lang.reflect.Method.invoke(Method.java:498)
17:20:58 	at org.junit.runners.model.FrameworkMethod$1.runReflectiveCall(FrameworkMethod.java:50)
17:20:58 	at org.junit.internal.runners.model.ReflectiveCallable.run(ReflectiveCallable.java:12)
17:20:58 	at org.junit.runners.model.FrameworkMethod.invokeExplosively(FrameworkMethod.java:47)
17:20:58 	at org.junit.internal.runners.statements.InvokeMethod.evaluate(InvokeMethod.java:17)
17:20:58 	at org.junit.internal.runners.statements.RunBefores.evaluate(RunBefores.java:26)
17:20:58 	at org.junit.internal.runners.statements.RunAfters.evaluate(RunAfters.java:27)
17:20:58 	at org.junit.runners.ParentRunner.runLeaf(ParentRunner.java:325)
17:20:58 	at org.junit.runners.BlockJUnit4ClassRunner.runChild(BlockJUnit4ClassRunner.java:78)
17:20:58 	at org.junit.runners.BlockJUnit4ClassRunner.runChild(BlockJUnit4ClassRunner.java:57)
17:20:58 	at org.junit.runners.ParentRunner$3.run(ParentRunner.java:290)
17:20:58 	at org.junit.runners.ParentRunner$1.schedule(ParentRunner.java:71)
17:20:58 	at org.junit.runners.ParentRunner.runChildren(ParentRunner.java:288)
17:20:58 	at org.junit.runners.ParentRunner.access$000(ParentRunner.java:58)
17:20:58 	at org.junit.runners.ParentRunner$2.evaluate(ParentRunner.java:268)
17:20:58 	at org.junit.internal.runners.statements.RunBefores.evaluate(RunBefores.java:26)
17:20:58 	at org.junit.runners.ParentRunner.run(ParentRunner.java:363)
17:20:58 	at org.apache.maven.surefire.junit4.JUnit4Provider.execute(JUnit4Provider.java:365)
17:20:58 	at org.apache.maven.surefire.junit4.JUnit4Provider.executeWithRerun(JUnit4Provider.java:273)
17:20:58 	at org.apache.maven.surefire.junit4.JUnit4Provider.executeTestSet(JUnit4Provider.java:238)
17:20:58 	at org.apache.maven.surefire.junit4.JUnit4Provider.invoke(JUnit4Provider.java:159)
17:20:58 	at sun.reflect.NativeMethodAccessorImpl.invoke0(Native Method)
17:20:58 	at sun.reflect.NativeMethodAccessorImpl.invoke(NativeMethodAccessorImpl.java:62)
17:20:58 	at sun.reflect.DelegatingMethodAccessorImpl.invoke(DelegatingMethodAccessorImpl.java:43)
17:20:58 	at java.lang.reflect.Method.invoke(Method.java:498)
17:20:58 	at org.apache.maven.surefire.util.ReflectionUtils.invokeMethodWithArray2(ReflectionUtils.java:206)
17:20:58 	at org.apache.maven.surefire.booter.ProviderFactory$ProviderProxy.invoke(ProviderFactory.java:161)
17:20:58 	at org.apache.maven.surefire.booter.ProviderFactory.invokeProvider(ProviderFactory.java:84)
17:20:58 	at org.eclipse.tycho.surefire.osgibooter.OsgiSurefireBooter.run(OsgiSurefireBooter.java:110)
17:20:58 	at org.eclipse.tycho.surefire.osgibooter.AbstractUITestApplication.runTests(AbstractUITestApplication.java:44)
17:20:58 	at org.eclipse.e4.ui.internal.workbench.swt.E4Testable$1.run(E4Testable.java:73)
17:20:58 	at java.lang.Thread.run(Thread.java:748)
17:20:58 
17:20:58 !ENTRY org.eclipse.egit.ui 4 0 2019-03-28 21:20:58.989
17:20:58 !MESSAGE CrashingCommitMessageProvider fails on purpose.
17:20:58 !STACK 0
17:20:58 java.lang.IllegalStateException: CrashingCommitMessageProvider fails on purpose.
17:20:58 	at org.eclipse.egit.ui.internal.dialogs.CommitMessageBuilderTest$CrashingCommitMessageProvider.getMessage(CommitMessageBuilderTest.java:474)
17:20:58 	at org.eclipse.egit.ui.internal.dialogs.CommitMessageBuilder.build(CommitMessageBuilder.java:90)
17:20:58 	at org.eclipse.egit.ui.internal.dialogs.CommitMessageBuilderTest.commitMessageProvider_multipleProvidersWithCrashingAndNullAndOneCaretPositioning(CommitMessageBuilderTest.java:414)
17:20:58 	at sun.reflect.NativeMethodAccessorImpl.invoke0(Native Method)
17:20:58 	at sun.reflect.NativeMethodAccessorImpl.invoke(NativeMethodAccessorImpl.java:62)
17:20:58 	at sun.reflect.DelegatingMethodAccessorImpl.invoke(DelegatingMethodAccessorImpl.java:43)
17:20:58 	at java.lang.reflect.Method.invoke(Method.java:498)
17:20:58 	at org.junit.runners.model.FrameworkMethod$1.runReflectiveCall(FrameworkMethod.java:50)
17:20:58 	at org.junit.internal.runners.model.ReflectiveCallable.run(ReflectiveCallable.java:12)
17:20:58 	at org.junit.runners.model.FrameworkMethod.invokeExplosively(FrameworkMethod.java:47)
17:20:58 	at org.junit.internal.runners.statements.InvokeMethod.evaluate(InvokeMethod.java:17)
17:20:58 	at org.junit.internal.runners.statements.RunBefores.evaluate(RunBefores.java:26)
17:20:58 	at org.junit.internal.runners.statements.RunAfters.evaluate(RunAfters.java:27)
17:20:58 	at org.junit.runners.ParentRunner.runLeaf(ParentRunner.java:325)
17:20:58 	at org.junit.runners.BlockJUnit4ClassRunner.runChild(BlockJUnit4ClassRunner.java:78)
17:20:58 	at org.junit.runners.BlockJUnit4ClassRunner.runChild(BlockJUnit4ClassRunner.java:57)
17:20:58 	at org.junit.runners.ParentRunner$3.run(ParentRunner.java:290)
17:20:58 	at org.junit.runners.ParentRunner$1.schedule(ParentRunner.java:71)
17:20:58 	at org.junit.runners.ParentRunner.runChildren(ParentRunner.java:288)
17:20:58 	at org.junit.runners.ParentRunner.access$000(ParentRunner.java:58)
17:20:58 	at org.junit.runners.ParentRunner$2.evaluate(ParentRunner.java:268)
17:20:58 	at org.junit.internal.runners.statements.RunBefores.evaluate(RunBefores.java:26)
17:20:58 	at org.junit.runners.ParentRunner.run(ParentRunner.java:363)
17:20:58 	at org.apache.maven.surefire.junit4.JUnit4Provider.execute(JUnit4Provider.java:365)
17:20:58 	at org.apache.maven.surefire.junit4.JUnit4Provider.executeWithRerun(JUnit4Provider.java:273)
17:20:58 	at org.apache.maven.surefire.junit4.JUnit4Provider.executeTestSet(JUnit4Provider.java:238)
17:20:58 	at org.apache.maven.surefire.junit4.JUnit4Provider.invoke(JUnit4Provider.java:159)
17:20:58 	at sun.reflect.NativeMethodAccessorImpl.invoke0(Native Method)
17:20:58 	at sun.reflect.NativeMethodAccessorImpl.invoke(NativeMethodAccessorImpl.java:62)
17:20:58 	at sun.reflect.DelegatingMethodAccessorImpl.invoke(DelegatingMethodAccessorImpl.java:43)
17:20:58 	at java.lang.reflect.Method.invoke(Method.java:498)
17:20:58 	at org.apache.maven.surefire.util.ReflectionUtils.invokeMethodWithArray2(ReflectionUtils.java:206)
17:20:58 	at org.apache.maven.surefire.booter.ProviderFactory$ProviderProxy.invoke(ProviderFactory.java:161)
17:20:58 	at org.apache.maven.surefire.booter.ProviderFactory.invokeProvider(ProviderFactory.java:84)
17:20:58 	at org.eclipse.tycho.surefire.osgibooter.OsgiSurefireBooter.run(OsgiSurefireBooter.java:110)
17:20:58 	at org.eclipse.tycho.surefire.osgibooter.AbstractUITestApplication.runTests(AbstractUITestApplication.java:44)
17:20:58 	at org.eclipse.e4.ui.internal.workbench.swt.E4Testable$1.run(E4Testable.java:73)
17:20:58 	at java.lang.Thread.run(Thread.java:748)
17:21:00 
17:21:00 !ENTRY org.eclipse.egit.ui 2 0 2019-03-28 21:21:00.044
17:21:00 !MESSAGE Found multiple implementations of ICommitMessageProvider2. Ignoring caret positioning for org.eclipse.egit.ui.internal.dialogs.CommitMessageBuilderTest$3.
17:21:00 
17:21:00 !ENTRY org.eclipse.egit.ui 2 0 2019-03-28 21:21:00.319
17:21:00 !MESSAGE The ICommitMessageProvider2 implementation org.eclipse.egit.ui.internal.dialogs.CommitMessageBuilderTest$3 provided the caret position 14, which exceeds the length of the commit message or is negative. The caret position is ignored.
17:21:00 Tests run: 20, Failures: 0, Errors: 0, Skipped: 0, Time elapsed: 8.467 s - in org.eclipse.egit.ui.internal.dialogs.CommitMessageBuilderTest
17:21:00 commitMessageProvider_oneCrashingProvider(org.eclipse.egit.ui.internal.dialogs.CommitMessageBuilderTest)  Time elapsed: 0.735 s
17:21:00 commitMessageProvider_twoProvidersSecondWithCaretPositioning(org.eclipse.egit.ui.internal.dialogs.CommitMessageBuilderTest)  Time elapsed: 1.333 s
17:21:00 commitMessageProvider_oneCrashingProviderWithCaretPosition(org.eclipse.egit.ui.internal.dialogs.CommitMessageBuilderTest)  Time elapsed: 0.135 s
17:21:00 commitMessageProvider_twoProvidersFirstOneCrashing(org.eclipse.egit.ui.internal.dialogs.CommitMessageBuilderTest)  Time elapsed: 0.144 s
17:21:00 commitMessageProvider_noProvider(org.eclipse.egit.ui.internal.dialogs.CommitMessageBuilderTest)  Time elapsed: 0.101 s
17:21:00 commitMessageProvider_oneProvider(org.eclipse.egit.ui.internal.dialogs.CommitMessageBuilderTest)  Time elapsed: 0.097 s
17:21:00 commitMessageProvider_multipleProvidersWithCrashAndNull(org.eclipse.egit.ui.internal.dialogs.CommitMessageBuilderTest)  Time elapsed: 1.06 s
17:21:00 commitMessageProvider_oneProviderWithInvalidNegativeCaretPosition(org.eclipse.egit.ui.internal.dialogs.CommitMessageBuilderTest)  Time elapsed: 0.125 s
17:21:00 commitMessageProvider_twoProvidersSecondWithUndefinedCaretPosition(org.eclipse.egit.ui.internal.dialogs.CommitMessageBuilderTest)  Time elapsed: 0.117 s
17:21:00 commitMessageProvider_twoProvidersWithCaretPositioningFirstWithUndefinedCaretPosition(org.eclipse.egit.ui.internal.dialogs.CommitMessageBuilderTest)  Time elapsed: 0.102 s
17:21:00 commitMessageProvider_oneProviderWithCaretPositionEqualsMessageLength(org.eclipse.egit.ui.internal.dialogs.CommitMessageBuilderTest)  Time elapsed: 0.122 s
17:21:00 commitMessageProvider_twoProvidersFirstWithCaretPositioning(org.eclipse.egit.ui.internal.dialogs.CommitMessageBuilderTest)  Time elapsed: 1.052 s
17:21:00 commitMessageProvider_twoProvidersWithCaretPositioningSecondWithUndefinedCaretPosition(org.eclipse.egit.ui.internal.dialogs.CommitMessageBuilderTest)  Time elapsed: 0.298 s
17:21:00 commitMessageProvider_oneProviderWithCaretPositioning(org.eclipse.egit.ui.internal.dialogs.CommitMessageBuilderTest)  Time elapsed: 0.103 s
17:21:00 commitMessageProvider_twoProvidersSecondWithCaretPositionZero(org.eclipse.egit.ui.internal.dialogs.CommitMessageBuilderTest)  Time elapsed: 1.124 s
17:21:00 commitMessageProvider_twoProviders(org.eclipse.egit.ui.internal.dialogs.CommitMessageBuilderTest)  Time elapsed: 0.282 s
17:21:00 commitMessageProvider_twoProvidersSecondOneCrashing(org.eclipse.egit.ui.internal.dialogs.CommitMessageBuilderTest)  Time elapsed: 0.102 s
17:21:00 commitMessageProvider_multipleProvidersWithCrashingAndNullAndOneCaretPositioning(org.eclipse.egit.ui.internal.dialogs.CommitMessageBuilderTest)  Time elapsed: 0.099 s
17:21:00 commitMessageProvider_twoProvidersWithCaretPositioning(org.eclipse.egit.ui.internal.dialogs.CommitMessageBuilderTest)  Time elapsed: 1.06 s
17:21:00 commitMessageProvider_oneProviderWithInvalidCaretPositionExceedingMessageLength(org.eclipse.egit.ui.internal.dialogs.CommitMessageBuilderTest)  Time elapsed: 0.27 s
17:21:00 Running org.eclipse.egit.ui.internal.dialogs.SpellcheckableMessageAreaTest
17:21:00 Tests run: 25, Failures: 0, Errors: 0, Skipped: 0, Time elapsed: 0.004 s - in org.eclipse.egit.ui.internal.dialogs.SpellcheckableMessageAreaTest
17:21:00 testWrappingLongWords(org.eclipse.egit.ui.internal.dialogs.SpellcheckableMessageAreaTest)  Time elapsed: 0 s
17:21:00 wrapOnlyCommitMessageBody(org.eclipse.egit.ui.internal.dialogs.SpellcheckableMessageAreaTest)  Time elapsed: 0 s
17:21:00 dontWrapMaximumLengthText(org.eclipse.egit.ui.internal.dialogs.SpellcheckableMessageAreaTest)  Time elapsed: 0 s
17:21:00 keepTrailingSpace(org.eclipse.egit.ui.internal.dialogs.SpellcheckableMessageAreaTest)  Time elapsed: 0 s
17:21:00 dontWrapShortMessage(org.eclipse.egit.ui.internal.dialogs.SpellcheckableMessageAreaTest)  Time elapsed: 0 s
17:21:00 lineAfterWrappedWordShouldNotBeJoined(org.eclipse.egit.ui.internal.dialogs.SpellcheckableMessageAreaTest)  Time elapsed: 0.001 s
17:21:00 lineAfterWrappedWordShouldNotBeJoined2(org.eclipse.egit.ui.internal.dialogs.SpellcheckableMessageAreaTest)  Time elapsed: 0 s
17:21:00 lineAfterWrappedWordShouldNotBeJoined3(org.eclipse.egit.ui.internal.dialogs.SpellcheckableMessageAreaTest)  Time elapsed: 0 s
17:21:00 dontWrapWordLongerThanOneLine(org.eclipse.egit.ui.internal.dialogs.SpellcheckableMessageAreaTest)  Time elapsed: 0 s
17:21:00 keepExistingNewlines(org.eclipse.egit.ui.internal.dialogs.SpellcheckableMessageAreaTest)  Time elapsed: 0 s
17:21:00 dontWrapShortText(org.eclipse.egit.ui.internal.dialogs.SpellcheckableMessageAreaTest)  Time elapsed: 0 s
17:21:00 dontWrapWordLongerThanOneLineAtStart(org.eclipse.egit.ui.internal.dialogs.SpellcheckableMessageAreaTest)  Time elapsed: 0 s
17:21:00 dontWrapAlreadyWrappedText(org.eclipse.egit.ui.internal.dialogs.SpellcheckableMessageAreaTest)  Time elapsed: 0 s
17:21:00 wrapOverlengthText2(org.eclipse.egit.ui.internal.dialogs.SpellcheckableMessageAreaTest)  Time elapsed: 0 s
17:21:00 lineAfterWrappedWordShouldNotBeJoinedIfItStartsWithASymbol(org.eclipse.egit.ui.internal.dialogs.SpellcheckableMessageAreaTest)  Time elapsed: 0 s
17:21:00 wrapAlternatingBlankNonBlank(org.eclipse.egit.ui.internal.dialogs.SpellcheckableMessageAreaTest)  Time elapsed: 0 s
17:21:00 keepWhitespace(org.eclipse.egit.ui.internal.dialogs.SpellcheckableMessageAreaTest)  Time elapsed: 0 s
17:21:00 lineAfterWrappedWordShouldNotBeJoinedIfItsEmpty(org.eclipse.egit.ui.internal.dialogs.SpellcheckableMessageAreaTest)  Time elapsed: 0 s
17:21:00 dontWrapLongCommitMessageFooter(org.eclipse.egit.ui.internal.dialogs.SpellcheckableMessageAreaTest)  Time elapsed: 0 s
17:21:00 lineAfterWrappedLineShouldBeJoinedAndFollowingLineWrappedCorrectly(org.eclipse.egit.ui.internal.dialogs.SpellcheckableMessageAreaTest)  Time elapsed: 0 s
17:21:00 wrapOverlengthText(org.eclipse.egit.ui.internal.dialogs.SpellcheckableMessageAreaTest)  Time elapsed: 0 s
17:21:00 dontWrapWordLongerThanOneLineAndKeepSpaceAtFront(org.eclipse.egit.ui.internal.dialogs.SpellcheckableMessageAreaTest)  Time elapsed: 0 s
17:21:00 wrapSecondLongLine(org.eclipse.egit.ui.internal.dialogs.SpellcheckableMessageAreaTest)  Time elapsed: 0 s
17:21:00 wrapOverlengthTextByOne(org.eclipse.egit.ui.internal.dialogs.SpellcheckableMessageAreaTest)  Time elapsed: 0 s
17:21:00 keepNewlineAtEnd(org.eclipse.egit.ui.internal.dialogs.SpellcheckableMessageAreaTest)  Time elapsed: 0 s
17:21:00 Running org.eclipse.egit.ui.internal.synchronize.model.GitModelRootTest
17:21:02 Tests run: 1, Failures: 0, Errors: 0, Skipped: 0, Time elapsed: 2.332 s - in org.eclipse.egit.ui.internal.synchronize.model.GitModelRootTest
17:21:02 shouldIgnoreEmptyRepositories(org.eclipse.egit.ui.internal.synchronize.model.GitModelRootTest)  Time elapsed: 2.323 s
17:21:02 Running org.eclipse.egit.ui.internal.synchronize.model.GitModelCommitTest
17:21:07 Tests run: 7, Failures: 0, Errors: 0, Skipped: 0, Time elapsed: 4.712 s - in org.eclipse.egit.ui.internal.synchronize.model.GitModelCommitTest
17:21:07 shouldReturnNotEqualForDifferentCommits(org.eclipse.egit.ui.internal.synchronize.model.GitModelCommitTest)  Time elapsed: 0.605 s
17:21:07 shouldReturnNotEqualWhenCommitTreeAndBlob(org.eclipse.egit.ui.internal.synchronize.model.GitModelCommitTest)  Time elapsed: 0.611 s
17:21:07 shouldReturnNotEqualWhenCommitTreeAndTree(org.eclipse.egit.ui.internal.synchronize.model.GitModelCommitTest)  Time elapsed: 0.62 s
17:21:07 shouldReturnNotEqualWhenCommitTreeAndCache(org.eclipse.egit.ui.internal.synchronize.model.GitModelCommitTest)  Time elapsed: 0.591 s
17:21:07 shouldReturnEqualForSameInstance(org.eclipse.egit.ui.internal.synchronize.model.GitModelCommitTest)  Time elapsed: 0.557 s
17:21:07 shouldReturnNotEqualForDifferentParents(org.eclipse.egit.ui.internal.synchronize.model.GitModelCommitTest)  Time elapsed: 1.153 s
17:21:07 shouldReturnEqualForSameCommits(org.eclipse.egit.ui.internal.synchronize.model.GitModelCommitTest)  Time elapsed: 0.555 s
17:21:07 Running org.eclipse.egit.ui.internal.synchronize.model.GitModelBlobTest
17:21:15 Tests run: 15, Failures: 0, Errors: 0, Skipped: 2, Time elapsed: 7.642 s - in org.eclipse.egit.ui.internal.synchronize.model.GitModelBlobTest
17:21:15 shouldReturnEqualSameData1(org.eclipse.egit.ui.internal.synchronize.model.GitModelBlobTest) skipped
17:21:15 shouldReturnNotEqualForDifferentLocation(org.eclipse.egit.ui.internal.synchronize.model.GitModelBlobTest)  Time elapsed: 0.579 s
17:21:15 shouldReturnNotEqualForBlobAndCommit(org.eclipse.egit.ui.internal.synchronize.model.GitModelBlobTest)  Time elapsed: 0.551 s
17:21:15 shouldReturnEqualForSameData(org.eclipse.egit.ui.internal.synchronize.model.GitModelBlobTest) skipped
17:21:15 shouldReturnNotEqualForDifferentFiles(org.eclipse.egit.ui.internal.synchronize.model.GitModelBlobTest)  Time elapsed: 0.566 s
17:21:15 shouldReturnNotEqualForBlobAndCacheFile(org.eclipse.egit.ui.internal.synchronize.model.GitModelBlobTest)  Time elapsed: 0.598 s
17:21:15 shouldReturnNotEqualForBlobAndTree(org.eclipse.egit.ui.internal.synchronize.model.GitModelBlobTest)  Time elapsed: 0.564 s
17:21:15 shouldBeSymmetric1(org.eclipse.egit.ui.internal.synchronize.model.GitModelBlobTest)  Time elapsed: 0.647 s
17:21:15 shouldBeSymmetric(org.eclipse.egit.ui.internal.synchronize.model.GitModelBlobTest)  Time elapsed: 0.566 s
17:21:15 shouldReturnEqualForSameInstance(org.eclipse.egit.ui.internal.synchronize.model.GitModelBlobTest)  Time elapsed: 0.643 s
17:21:15 shouldActAsResourceProvider(org.eclipse.egit.ui.internal.synchronize.model.GitModelBlobTest)  Time elapsed: 0.563 s
17:21:15 shouldReturnNotEqualForDifferentBaseObjectId2(org.eclipse.egit.ui.internal.synchronize.model.GitModelBlobTest)  Time elapsed: 0.644 s
17:21:15 shouldReturnNotEqualForDifferentBaseObjectId3(org.eclipse.egit.ui.internal.synchronize.model.GitModelBlobTest)  Time elapsed: 0.552 s
17:21:15 shouldReturnNotEqualForBlobAndWorkingFile(org.eclipse.egit.ui.internal.synchronize.model.GitModelBlobTest)  Time elapsed: 0.585 s
17:21:15 shouldReturnNotEqualForDifferentBaseObjectId(org.eclipse.egit.ui.internal.synchronize.model.GitModelBlobTest)  Time elapsed: 0.552 s
17:21:15 Running org.eclipse.egit.ui.internal.synchronize.model.GitModelTreeTest
17:21:18 Tests run: 6, Failures: 0, Errors: 0, Skipped: 0, Time elapsed: 3.567 s - in org.eclipse.egit.ui.internal.synchronize.model.GitModelTreeTest
17:21:18 shouldReturnNotEqualForDifferentLocation(org.eclipse.egit.ui.internal.synchronize.model.GitModelTreeTest)  Time elapsed: 0.548 s
17:21:18 shouldReturnNotEqualForTreeAndCacheTree(org.eclipse.egit.ui.internal.synchronize.model.GitModelTreeTest)  Time elapsed: 0.579 s
17:21:18 shouldReturnNotEqualForTreeAndCommit(org.eclipse.egit.ui.internal.synchronize.model.GitModelTreeTest)  Time elapsed: 0.576 s
17:21:18 shouldReturnEqualForSameBaseCommit(org.eclipse.egit.ui.internal.synchronize.model.GitModelTreeTest)  Time elapsed: 0.644 s
17:21:18 shouldReturnEqualForSameInstance(org.eclipse.egit.ui.internal.synchronize.model.GitModelTreeTest)  Time elapsed: 0.554 s
17:21:18 shouldReturnNotEqualForTreeAndBlob(org.eclipse.egit.ui.internal.synchronize.model.GitModelTreeTest)  Time elapsed: 0.649 s
17:21:18 Running org.eclipse.egit.ui.internal.synchronize.model.GitModelCacheFileTest
17:21:21 Tests run: 7, Failures: 0, Errors: 0, Skipped: 2, Time elapsed: 2.782 s - in org.eclipse.egit.ui.internal.synchronize.model.GitModelCacheFileTest
17:21:21 shouldReturnEqualForSameObjectIdsAndLocation(org.eclipse.egit.ui.internal.synchronize.model.GitModelCacheFileTest)  Time elapsed: 0.553 s
17:21:21 shouldReturnNotEqualWhenComparingCacheFileAndBlob(org.eclipse.egit.ui.internal.synchronize.model.GitModelCacheFileTest)  Time elapsed: 0.555 s
17:21:21 shouldReturnNotEqualForDifferentCacheIds(org.eclipse.egit.ui.internal.synchronize.model.GitModelCacheFileTest) skipped
17:21:21 shouldReturnEqualForSameInstance(org.eclipse.egit.ui.internal.synchronize.model.GitModelCacheFileTest)  Time elapsed: 0.543 s
17:21:21 shouldReturnNotEqualWhenComparingCacheFileAndWorkingFile(org.eclipse.egit.ui.internal.synchronize.model.GitModelCacheFileTest)  Time elapsed: 0.563 s
17:21:21 shouldReturnNotEqualForDifferentBaseIds(org.eclipse.egit.ui.internal.synchronize.model.GitModelCacheFileTest)  Time elapsed: 0.552 s
17:21:21 shouldReturnNotEqualForDifferentLocations(org.eclipse.egit.ui.internal.synchronize.model.GitModelCacheFileTest) skipped
17:21:21 Running org.eclipse.egit.ui.internal.synchronize.model.GitModelCacheTreeTest
17:21:24 Tests run: 4, Failures: 0, Errors: 0, Skipped: 0, Time elapsed: 2.63 s - in org.eclipse.egit.ui.internal.synchronize.model.GitModelCacheTreeTest
17:21:24 shouldReturnEqualForSameData(org.eclipse.egit.ui.internal.synchronize.model.GitModelCacheTreeTest)  Time elapsed: 0.557 s
17:21:24 shouldReturnNotEqualForDifferetnLocation(org.eclipse.egit.ui.internal.synchronize.model.GitModelCacheTreeTest)  Time elapsed: 0.83 s
17:21:24 shouldReturnEqualForSameInstance(org.eclipse.egit.ui.internal.synchronize.model.GitModelCacheTreeTest)  Time elapsed: 0.661 s
17:21:24 shouldReturnNotEqualWhenComparingCacheTreeAndTree(org.eclipse.egit.ui.internal.synchronize.model.GitModelCacheTreeTest)  Time elapsed: 0.572 s
17:21:24 Running org.eclipse.egit.ui.internal.synchronize.model.GitModelRepositoryTest
17:21:26 Tests run: 3, Failures: 0, Errors: 0, Skipped: 0, Time elapsed: 2.174 s - in org.eclipse.egit.ui.internal.synchronize.model.GitModelRepositoryTest
17:21:26 shouldReturnEqual(org.eclipse.egit.ui.internal.synchronize.model.GitModelRepositoryTest)  Time elapsed: 0.675 s
17:21:26 shouldReturnNotEqual(org.eclipse.egit.ui.internal.synchronize.model.GitModelRepositoryTest)  Time elapsed: 0.742 s
17:21:26 shouldReturnEqualForSameInstance(org.eclipse.egit.ui.internal.synchronize.model.GitModelRepositoryTest)  Time elapsed: 0.744 s
17:21:26 Running org.eclipse.egit.ui.internal.synchronize.model.GitModelWorkingTreeTest
17:21:27 Tests run: 2, Failures: 0, Errors: 0, Skipped: 0, Time elapsed: 1.107 s - in org.eclipse.egit.ui.internal.synchronize.model.GitModelWorkingTreeTest
17:21:27 shouldReturnNotEqualsWhenComparingWorkingTreeAndCache(org.eclipse.egit.ui.internal.synchronize.model.GitModelWorkingTreeTest)  Time elapsed: 0.55 s
17:21:27 shouldReturnEqualsForTheSameInstance(org.eclipse.egit.ui.internal.synchronize.model.GitModelWorkingTreeTest)  Time elapsed: 0.55 s
17:21:27 Running org.eclipse.egit.ui.internal.synchronize.model.GitModelWorkingFileTest
17:21:30 Tests run: 5, Failures: 0, Errors: 0, Skipped: 0, Time elapsed: 2.88 s - in org.eclipse.egit.ui.internal.synchronize.model.GitModelWorkingFileTest
17:21:30 shouldReturnNotEqualForDifferentLocation(org.eclipse.egit.ui.internal.synchronize.model.GitModelWorkingFileTest)  Time elapsed: 0.563 s
17:21:30 shouldReturnNotEqualWhenComparingWorkingFileAndCacheFile(org.eclipse.egit.ui.internal.synchronize.model.GitModelWorkingFileTest)  Time elapsed: 0.553 s
17:21:30 shouldReturnEqualForSameInstance(org.eclipse.egit.ui.internal.synchronize.model.GitModelWorkingFileTest)  Time elapsed: 0.547 s
17:21:30 shouldReturnNotEqualWhenComparingWorkingFileAndBlob(org.eclipse.egit.ui.internal.synchronize.model.GitModelWorkingFileTest)  Time elapsed: 0.561 s
17:21:30 shouldReturnEqualForSameLocation(org.eclipse.egit.ui.internal.synchronize.model.GitModelWorkingFileTest)  Time elapsed: 0.642 s
17:21:30 Running org.eclipse.egit.ui.internal.synchronize.model.GitModelCacheTest
17:21:34 Tests run: 6, Failures: 0, Errors: 0, Skipped: 0, Time elapsed: 3.983 s - in org.eclipse.egit.ui.internal.synchronize.model.GitModelCacheTest
17:21:34 shouldReturnChildren(org.eclipse.egit.ui.internal.synchronize.model.GitModelCacheTest)  Time elapsed: 0.55 s
17:21:34 shouldReturnNotEqualWhenCacheTreeAndCommit(org.eclipse.egit.ui.internal.synchronize.model.GitModelCacheTest)  Time elapsed: 0.559 s
17:21:34 shouldReturnEqualForSameInstance(org.eclipse.egit.ui.internal.synchronize.model.GitModelCacheTest)  Time elapsed: 0.544 s
17:21:34 shouldReturnEqualForSameCommits(org.eclipse.egit.ui.internal.synchronize.model.GitModelCacheTest)  Time elapsed: 0.545 s
17:21:34 shouldReturnNotEqualWhenComparingCacheAndWorkingTree(org.eclipse.egit.ui.internal.synchronize.model.GitModelCacheTest)  Time elapsed: 0.617 s
17:21:34 shouldReturnNotEqualForDifferentRepositories(org.eclipse.egit.ui.internal.synchronize.model.GitModelCacheTest)  Time elapsed: 1.148 s
17:21:34 Running org.eclipse.egit.ui.internal.synchronize.mapping.GitChangeSetSorterTest
17:21:34 Tests run: 23, Failures: 0, Errors: 0, Skipped: 0, Time elapsed: 0.378 s - in org.eclipse.egit.ui.internal.synchronize.mapping.GitChangeSetSorterTest
17:21:34 commitTreeShouldBeLessThanBlob(org.eclipse.egit.ui.internal.synchronize.mapping.GitChangeSetSorterTest)  Time elapsed: 0.033 s
17:21:34 commitTreeShouldBeLessThanTree(org.eclipse.egit.ui.internal.synchronize.mapping.GitChangeSetSorterTest)  Time elapsed: 0.001 s
17:21:34 blobShouldBeGreaterThanTree(org.eclipse.egit.ui.internal.synchronize.mapping.GitChangeSetSorterTest)  Time elapsed: 0 s
17:21:34 cacheTreeShouldBeLessThanCommit(org.eclipse.egit.ui.internal.synchronize.mapping.GitChangeSetSorterTest)  Time elapsed: 0 s
17:21:34 shouldOrderTreesAlphabetically(org.eclipse.egit.ui.internal.synchronize.mapping.GitChangeSetSorterTest)  Time elapsed: 0.341 s
17:21:34 commitTreeShouldBeGreaterThanCache(org.eclipse.egit.ui.internal.synchronize.mapping.GitChangeSetSorterTest)  Time elapsed: 0 s
17:21:34 blobShouldBeGreaterThanWorkingTree(org.eclipse.egit.ui.internal.synchronize.mapping.GitChangeSetSorterTest)  Time elapsed: 0 s
17:21:34 treeShouldBeGreaterThanCache(org.eclipse.egit.ui.internal.synchronize.mapping.GitChangeSetSorterTest)  Time elapsed: 0 s
17:21:34 treeShouldBeGreaterThanCommit(org.eclipse.egit.ui.internal.synchronize.mapping.GitChangeSetSorterTest)  Time elapsed: 0 s
17:21:34 workingTreeShouldBeLessThanCacheTree(org.eclipse.egit.ui.internal.synchronize.mapping.GitChangeSetSorterTest)  Time elapsed: 0 s
17:21:34 treeShouldBeGreaterThanWorkingTree(org.eclipse.egit.ui.internal.synchronize.mapping.GitChangeSetSorterTest)  Time elapsed: 0 s
17:21:34 blobShouldBeGreaterThanCache(org.eclipse.egit.ui.internal.synchronize.mapping.GitChangeSetSorterTest)  Time elapsed: 0 s
17:21:34 cacheTreeShouldBeLessThanBlob(org.eclipse.egit.ui.internal.synchronize.mapping.GitChangeSetSorterTest)  Time elapsed: 0 s
17:21:34 cacheTreeShouldBeLessThanTree(org.eclipse.egit.ui.internal.synchronize.mapping.GitChangeSetSorterTest)  Time elapsed: 0.001 s
17:21:34 shouldOrderBlobsAlphabetically(org.eclipse.egit.ui.internal.synchronize.mapping.GitChangeSetSorterTest)  Time elapsed: 0 s
17:21:34 commitTreeShouldBeGreaterThanWorkingTree(org.eclipse.egit.ui.internal.synchronize.mapping.GitChangeSetSorterTest)  Time elapsed: 0.001 s
17:21:34 treeShouldBeLessThanBlob(org.eclipse.egit.ui.internal.synchronize.mapping.GitChangeSetSorterTest)  Time elapsed: 0 s
17:21:34 cacheTreeShouldBeGreaterThanWorkingTree(org.eclipse.egit.ui.internal.synchronize.mapping.GitChangeSetSorterTest)  Time elapsed: 0 s
17:21:34 workingTreeShouldBeLessThanBlob(org.eclipse.egit.ui.internal.synchronize.mapping.GitChangeSetSorterTest)  Time elapsed: 0 s
17:21:34 workingTreeShouldBeLessThanTree(org.eclipse.egit.ui.internal.synchronize.mapping.GitChangeSetSorterTest)  Time elapsed: 0 s
17:21:34 shouldOrderCommitsByCommitDate(org.eclipse.egit.ui.internal.synchronize.mapping.GitChangeSetSorterTest)  Time elapsed: 0.001 s
17:21:34 workingTreeShouldBeLessThanCommit(org.eclipse.egit.ui.internal.synchronize.mapping.GitChangeSetSorterTest)  Time elapsed: 0 s
17:21:34 blobShouldBeGreaterThanCommit(org.eclipse.egit.ui.internal.synchronize.mapping.GitChangeSetSorterTest)  Time elapsed: 0 s
17:21:34 Running org.eclipse.egit.ui.internal.decorators.DecoratableWorkingSetTest
17:21:41 Tests run: 7, Failures: 0, Errors: 0, Skipped: 0, Time elapsed: 6.715 s - in org.eclipse.egit.ui.internal.decorators.DecoratableWorkingSetTest
17:21:41 testAnyConflictsIsConflicts(org.eclipse.egit.ui.internal.decorators.DecoratableWorkingSetTest)  Time elapsed: 1.162 s
17:21:41 testUntrackedContentIsUndecorated(org.eclipse.egit.ui.internal.decorators.DecoratableWorkingSetTest)  Time elapsed: 0.735 s
17:21:41 testAnyDirtyIsDirty(org.eclipse.egit.ui.internal.decorators.DecoratableWorkingSetTest)  Time elapsed: 1.046 s
17:21:41 testDecorationConflictingOverDirty(org.eclipse.egit.ui.internal.decorators.DecoratableWorkingSetTest)  Time elapsed: 1.353 s
17:21:41 testEmptyWorkingSetIsUndecorated(org.eclipse.egit.ui.internal.decorators.DecoratableWorkingSetTest)  Time elapsed: 0.788 s
17:21:41 testStagingStateHasNoInfluence_Modified(org.eclipse.egit.ui.internal.decorators.DecoratableWorkingSetTest)  Time elapsed: 0.735 s
17:21:41 testAnyTrackedIsTracked(org.eclipse.egit.ui.internal.decorators.DecoratableWorkingSetTest)  Time elapsed: 0.892 s
17:21:41 Running org.eclipse.egit.ui.internal.decorators.DecoratableResourceMappingTest
17:21:49 Tests run: 9, Failures: 0, Errors: 0, Skipped: 0, Time elapsed: 8.097 s - in org.eclipse.egit.ui.internal.decorators.DecoratableResourceMappingTest
17:21:49 testAnyConflictsIsConflicts(org.eclipse.egit.ui.internal.decorators.DecoratableResourceMappingTest)  Time elapsed: 0.997 s
17:21:49 testSameStagingStateIsState_Added(org.eclipse.egit.ui.internal.decorators.DecoratableResourceMappingTest)  Time elapsed: 0.763 s
17:21:49 testAnyDirtyIsDirty(org.eclipse.egit.ui.internal.decorators.DecoratableResourceMappingTest)  Time elapsed: 1.024 s
17:21:49 testMixedStagingStateIsModified_RemovedAdded(org.eclipse.egit.ui.internal.decorators.DecoratableResourceMappingTest)  Time elapsed: 0.777 s
17:21:49 testAllIgnoredIsUnstaged(org.eclipse.egit.ui.internal.decorators.DecoratableResourceMappingTest)  Time elapsed: 0.767 s
17:21:49 testDecorationConflictingOverDirty(org.eclipse.egit.ui.internal.decorators.DecoratableResourceMappingTest)  Time elapsed: 1.128 s
17:21:49 testMixedStagingStateIsModified_AddedNotStaged(org.eclipse.egit.ui.internal.decorators.DecoratableResourceMappingTest)  Time elapsed: 1.064 s
17:21:49 testNewResourceMappingIsUnstaged(org.eclipse.egit.ui.internal.decorators.DecoratableResourceMappingTest)  Time elapsed: 0.761 s
17:21:49 testAnyTrackedIsTracked(org.eclipse.egit.ui.internal.decorators.DecoratableResourceMappingTest)  Time elapsed: 0.77 s
17:21:49 Running org.eclipse.egit.ui.internal.decorators.DecoratableResourceAdapterTest
17:22:01 Tests run: 13, Failures: 0, Errors: 0, Skipped: 0, Time elapsed: 11.484 s - in org.eclipse.egit.ui.internal.decorators.DecoratableResourceAdapterTest
17:22:01 testDecorationDeletedFile(org.eclipse.egit.ui.internal.decorators.DecoratableResourceAdapterTest)  Time elapsed: 0.763 s
17:22:01 testDecorationModifiedFile(org.eclipse.egit.ui.internal.decorators.DecoratableResourceAdapterTest)  Time elapsed: 0.764 s
17:22:01 testDecorationEmptyProject(org.eclipse.egit.ui.internal.decorators.DecoratableResourceAdapterTest)  Time elapsed: 0.844 s
17:22:01 testDecorationConflictingFile(org.eclipse.egit.ui.internal.decorators.DecoratableResourceAdapterTest)  Time elapsed: 1.42 s
17:22:01 testDecorationNewEmptyFolder(org.eclipse.egit.ui.internal.decorators.DecoratableResourceAdapterTest)  Time elapsed: 0.755 s
17:22:01 testDecorationFolderPrefixOfOtherFolder(org.eclipse.egit.ui.internal.decorators.DecoratableResourceAdapterTest)  Time elapsed: 0.762 s
17:22:01 testDecorationNewFileInOneSubfolder(org.eclipse.egit.ui.internal.decorators.DecoratableResourceAdapterTest)  Time elapsed: 0.749 s
17:22:01 testDecorationNewFile(org.eclipse.egit.ui.internal.decorators.DecoratableResourceAdapterTest)  Time elapsed: 0.844 s
17:22:01 testDecorationNewFileInSubfolder(org.eclipse.egit.ui.internal.decorators.DecoratableResourceAdapterTest)  Time elapsed: 1.192 s
17:22:01 testDecorationCommittedFile(org.eclipse.egit.ui.internal.decorators.DecoratableResourceAdapterTest)  Time elapsed: 0.914 s
17:22:01 testDecorationFileInIgnoredFolder(org.eclipse.egit.ui.internal.decorators.DecoratableResourceAdapterTest)  Time elapsed: 0.848 s
17:22:01 testDecorationIgnoredFile(org.eclipse.egit.ui.internal.decorators.DecoratableResourceAdapterTest)  Time elapsed: 0.833 s
17:22:01 testDecorationAddedFile(org.eclipse.egit.ui.internal.decorators.DecoratableResourceAdapterTest)  Time elapsed: 0.759 s
17:22:01 Running org.eclipse.egit.ui.internal.push.PushToUpstreamTest
17:22:03 Tests run: 3, Failures: 0, Errors: 0, Skipped: 0, Time elapsed: 2.852 s - in org.eclipse.egit.ui.internal.push.PushToUpstreamTest
17:22:03 pushWithExistingUpstreamConfiguration(org.eclipse.egit.ui.internal.push.PushToUpstreamTest)  Time elapsed: 1.012 s
17:22:03 pushWithoutConfig(org.eclipse.egit.ui.internal.push.PushToUpstreamTest)  Time elapsed: 0.844 s
17:22:03 pushWithDefaultRemoteWithPushRefSpecs(org.eclipse.egit.ui.internal.push.PushToUpstreamTest)  Time elapsed: 0.983 s
17:22:03 Running org.eclipse.egit.ui.internal.push.PushBranchWizardTest
17:22:04 
17:22:04 (SWT:1369): Gtk-CRITICAL **: 21:22:04.723: gtk_box_gadget_distribute: assertion 'size >= 0' failed in GtkScrollbar
17:22:04 
17:22:04 (SWT:1369): Gtk-CRITICAL **: 21:22:04.724: gtk_box_gadget_distribute: assertion 'size >= 0' failed in GtkScrollbar
17:22:04 
17:22:04 (SWT:1369): Gtk-CRITICAL **: 21:22:04.728: gtk_box_gadget_distribute: assertion 'size >= 0' failed in GtkScrollbar
17:22:04 
17:22:04 (SWT:1369): Gtk-CRITICAL **: 21:22:04.733: gtk_box_gadget_distribute: assertion 'size >= 0' failed in GtkScrollbar
17:22:14 Tests run: 9, Failures: 0, Errors: 0, Skipped: 0, Time elapsed: 10.834 s - in org.eclipse.egit.ui.internal.push.PushBranchWizardTest
17:22:14 pushHeadToExistingRemote(org.eclipse.egit.ui.internal.push.PushBranchWizardTest)  Time elapsed: 1.308 s
17:22:14 pushWithRemoteUpstreamConfiguration(org.eclipse.egit.ui.internal.push.PushBranchWizardTest)  Time elapsed: 1.175 s
17:22:14 pushWithDifferentBranchName(org.eclipse.egit.ui.internal.push.PushBranchWizardTest)  Time elapsed: 1.177 s
17:22:14 pushToExistingRemoteAndSetRebase(org.eclipse.egit.ui.internal.push.PushBranchWizardTest)  Time elapsed: 1.131 s
17:22:14 pushToNewRemote(org.eclipse.egit.ui.internal.push.PushBranchWizardTest)  Time elapsed: 1.212 s
17:22:14 pushToExistingRemoteWithoutConfiguringUpstream(org.eclipse.egit.ui.internal.push.PushBranchWizardTest)  Time elapsed: 1.066 s
17:22:14 pushToExistingRemote(org.eclipse.egit.ui.internal.push.PushBranchWizardTest)  Time elapsed: 1.417 s
17:22:14 pushWhenNoRemoteExistsYet(org.eclipse.egit.ui.internal.push.PushBranchWizardTest)  Time elapsed: 1.213 s
17:22:14 pushWithLocalUpstreamConfiguration(org.eclipse.egit.ui.internal.push.PushBranchWizardTest)  Time elapsed: 1.104 s
17:22:14 Running org.eclipse.egit.ui.internal.push.PushTagsWizardTest
17:22:15 Tests run: 1, Failures: 0, Errors: 0, Skipped: 0, Time elapsed: 1.153 s - in org.eclipse.egit.ui.internal.push.PushTagsWizardTest
17:22:15 pushTag(org.eclipse.egit.ui.internal.push.PushTagsWizardTest)  Time elapsed: 1.148 s
17:22:15 Running org.eclipse.egit.ui.internal.branch.BranchProjectTrackerTest
17:22:16 Tests run: 1, Failures: 0, Errors: 0, Skipped: 0, Time elapsed: 1.027 s - in org.eclipse.egit.ui.internal.branch.BranchProjectTrackerTest
17:22:16 twoProjectsWithOnlyOneOnBranch(org.eclipse.egit.ui.internal.branch.BranchProjectTrackerTest)  Time elapsed: 1.022 s
17:22:16 Running org.eclipse.egit.ui.internal.actions.StashesMenuTest
17:22:18 
17:22:18 (SWT:1369): Gtk-WARNING **: 21:22:18.244: Negative content width -6 (allocation 1, extents 4x3) while allocating gadget (node toolbar, owner GtkToolbar)
17:22:18 
17:22:18 (SWT:1369): Gtk-WARNING **: 21:22:18.244: Negative content height -3 (allocation 1, extents 2x2) while allocating gadget (node toolbar, owner GtkToolbar)
17:22:18 
17:22:18 (SWT:1369): Gtk-WARNING **: 21:22:18.244: Negative content width -6 (allocation 1, extents 4x3) while allocating gadget (node toolbar, owner GtkToolbar)
17:22:18 
17:22:18 (SWT:1369): Gtk-WARNING **: 21:22:18.244: Negative content height -3 (allocation 1, extents 2x2) while allocating gadget (node toolbar, owner GtkToolbar)
17:22:18 
17:22:18 (SWT:1369): Gtk-WARNING **: 21:22:18.332: Negative content width -6 (allocation 1, extents 4x3) while allocating gadget (node toolbar, owner GtkToolbar)
17:22:18 
17:22:18 (SWT:1369): Gtk-WARNING **: 21:22:18.350: Negative content width -6 (allocation 1, extents 4x3) while allocating gadget (node toolbar, owner GtkToolbar)
17:22:18 Tests run: 2, Failures: 0, Errors: 0, Skipped: 0, Time elapsed: 1.865 s - in org.eclipse.egit.ui.internal.actions.StashesMenuTest
17:22:18 menuWithoutStashes(org.eclipse.egit.ui.internal.actions.StashesMenuTest)  Time elapsed: 0.7 s
17:22:18 stashAndApplyChanges(org.eclipse.egit.ui.internal.actions.StashesMenuTest)  Time elapsed: 1.157 s
17:22:18 Running org.eclipse.egit.ui.internal.actions.LinkedResourcesTest
17:22:20 Tests run: 2, Failures: 0, Errors: 0, Skipped: 0, Time elapsed: 1.636 s - in org.eclipse.egit.ui.internal.actions.LinkedResourcesTest
17:22:20 testSomeActionsWithoutLinkedResources(org.eclipse.egit.ui.internal.actions.LinkedResourcesTest)  Time elapsed: 1.072 s
17:22:20 testNoActionOnLinkedResources(org.eclipse.egit.ui.internal.actions.LinkedResourcesTest)  Time elapsed: 0.556 s
17:22:20 Running org.eclipse.egit.ui.internal.actions.SwitchToMenuTest
17:22:28 Tests run: 8, Failures: 0, Errors: 0, Skipped: 0, Time elapsed: 8.605 s - in org.eclipse.egit.ui.internal.actions.SwitchToMenuTest
17:22:28 multipleSelectionWithMultipleRepositoriesAndNoCommonBranches(org.eclipse.egit.ui.internal.actions.SwitchToMenuTest)  Time elapsed: 0.872 s
17:22:28 selectionWithProj1(org.eclipse.egit.ui.internal.actions.SwitchToMenuTest)  Time elapsed: 0.563 s
17:22:28 selectionNotAdaptableToRepository(org.eclipse.egit.ui.internal.actions.SwitchToMenuTest)  Time elapsed: 0.068 s
17:22:28 selectionWithProj1AndReflog(org.eclipse.egit.ui.internal.actions.SwitchToMenuTest)  Time elapsed: 1.084 s
17:22:28 validateMenuEntriesForMultiSelectionWithMultipleRepositories(org.eclipse.egit.ui.internal.actions.SwitchToMenuTest)  Time elapsed: 2.851 s
17:22:28 validateBranchSwitchingForForMultiSelectionWithMultipleRepositories(org.eclipse.egit.ui.internal.actions.SwitchToMenuTest)  Time elapsed: 1.453 s
17:22:28 selectionWithRepositoryHavingOver20Branches(org.eclipse.egit.ui.internal.actions.SwitchToMenuTest)  Time elapsed: 1.623 s
17:22:28 emptySelection(org.eclipse.egit.ui.internal.actions.SwitchToMenuTest)  Time elapsed: 0.065 s
17:22:28 Running org.eclipse.egit.ui.internal.clone.SmartImportWizardTest
17:22:29 Tests run: 1, Failures: 0, Errors: 0, Skipped: 0, Time elapsed: 1.096 s - in org.eclipse.egit.ui.internal.clone.SmartImportWizardTest
17:22:29 test(org.eclipse.egit.ui.internal.clone.SmartImportWizardTest)  Time elapsed: 1.09 s
17:22:29 Running org.eclipse.egit.ui.internal.fetch.FetchGerritChangeTest
17:22:29 Tests run: 15, Failures: 0, Errors: 0, Skipped: 0, Time elapsed: 0.006 s - in org.eclipse.egit.ui.internal.fetch.FetchGerritChangeTest
17:22:29 testChangeStringNoDigits(org.eclipse.egit.ui.internal.fetch.FetchGerritChangeTest)  Time elapsed: 0.003 s
17:22:29 testChangeStringOverflow(org.eclipse.egit.ui.internal.fetch.FetchGerritChangeTest)  Time elapsed: 0 s
17:22:29 testChangeStringTwoNumbers(org.eclipse.egit.ui.internal.fetch.FetchGerritChangeTest)  Time elapsed: 0 s
17:22:29 testFromRef(org.eclipse.egit.ui.internal.fetch.FetchGerritChangeTest)  Time elapsed: 0 s
17:22:29 testChangeStringNegative(org.eclipse.egit.ui.internal.fetch.FetchGerritChangeTest)  Time elapsed: 0 s
17:22:29 testChangeStringUri(org.eclipse.egit.ui.internal.fetch.FetchGerritChangeTest)  Time elapsed: 0.001 s
17:22:29 testRefFromChange(org.eclipse.egit.ui.internal.fetch.FetchGerritChangeTest)  Time elapsed: 0 s
17:22:29 testChangeStringUriNonsense(org.eclipse.egit.ui.internal.fetch.FetchGerritChangeTest)  Time elapsed: 0 s
17:22:29 testChangeStringThreeNumbers(org.eclipse.egit.ui.internal.fetch.FetchGerritChangeTest)  Time elapsed: 0 s
17:22:29 testChangeStringMultiline(org.eclipse.egit.ui.internal.fetch.FetchGerritChangeTest)  Time elapsed: 0 s
17:22:29 testChangeStringSingleNumber(org.eclipse.egit.ui.internal.fetch.FetchGerritChangeTest)  Time elapsed: 0 s
17:22:29 testChangeRefs(org.eclipse.egit.ui.internal.fetch.FetchGerritChangeTest)  Time elapsed: 0 s
17:22:29 testChangeStringEmpty(org.eclipse.egit.ui.internal.fetch.FetchGerritChangeTest)  Time elapsed: 0 s
17:22:29 testChangeStringNull(org.eclipse.egit.ui.internal.fetch.FetchGerritChangeTest)  Time elapsed: 0 s
17:22:29 testChangeStringZero(org.eclipse.egit.ui.internal.fetch.FetchGerritChangeTest)  Time elapsed: 0 s
17:22:29 Running org.eclipse.egit.ui.internal.submodules.SubmoduleFolderTest
17:22:31 
17:22:31 (SWT:1369): Gtk-WARNING **: 21:22:31.404: Negative content width -6 (allocation 1, extents 4x3) while allocating gadget (node toolbar, owner GtkToolbar)
17:22:31 
17:22:31 (SWT:1369): Gtk-WARNING **: 21:22:31.404: Negative content height -3 (allocation 1, extents 2x2) while allocating gadget (node toolbar, owner GtkToolbar)
17:22:31 
17:22:31 (SWT:1369): Gtk-WARNING **: 21:22:31.404: Negative content width -6 (allocation 1, extents 4x3) while allocating gadget (node toolbar, owner GtkToolbar)
17:22:31 
17:22:31 (SWT:1369): Gtk-WARNING **: 21:22:31.404: Negative content height -3 (allocation 1, extents 2x2) while allocating gadget (node toolbar, owner GtkToolbar)
17:22:31 
17:22:31 (SWT:1369): Gtk-WARNING **: 21:22:31.742: Negative content width -6 (allocation 1, extents 4x3) while allocating gadget (node toolbar, owner GtkToolbar)
17:22:31 
17:22:31 (SWT:1369): Gtk-WARNING **: 21:22:31.746: Negative content width -6 (allocation 1, extents 4x3) while allocating gadget (node toolbar, owner GtkToolbar)
17:22:31 
17:22:31 (SWT:1369): Gtk-WARNING **: 21:22:31.751: Negative content width -6 (allocation 1, extents 4x3) while allocating gadget (node toolbar, owner GtkToolbar)
17:22:31 
17:22:31 (SWT:1369): Gtk-WARNING **: 21:22:31.757: Negative content width -6 (allocation 1, extents 4x3) while allocating gadget (node toolbar, owner GtkToolbar)
17:22:31 
17:22:31 (SWT:1369): Gtk-WARNING **: 21:22:31.778: Negative content width -6 (allocation 1, extents 4x3) while allocating gadget (node toolbar, owner GtkToolbar)
17:22:31 
17:22:31 (SWT:1369): Gtk-WARNING **: 21:22:31.779: Negative content width -6 (allocation 1, extents 4x3) while allocating gadget (node toolbar, owner GtkToolbar)
17:22:31 
17:22:31 (SWT:1369): Gtk-WARNING **: 21:22:31.813: Negative content width -6 (allocation 1, extents 4x3) while allocating gadget (node toolbar, owner GtkToolbar)
17:22:31 
17:22:31 (SWT:1369): Gtk-WARNING **: 21:22:31.814: Negative content width -6 (allocation 1, extents 4x3) while allocating gadget (node toolbar, owner GtkToolbar)
17:22:39 
17:22:39 (SWT:1369): Gtk-WARNING **: 21:22:39.220: Negative content width -6 (allocation 1, extents 4x3) while allocating gadget (node toolbar, owner GtkToolbar)
17:22:39 
17:22:39 (SWT:1369): Gtk-WARNING **: 21:22:39.244: Negative content width -6 (allocation 1, extents 4x3) while allocating gadget (node toolbar, owner GtkToolbar)
17:22:39 
17:22:39 (SWT:1369): Gtk-WARNING **: 21:22:39.298: Negative content width -6 (allocation 1, extents 4x3) while allocating gadget (node toolbar, owner GtkToolbar)
17:22:39 
17:22:39 (SWT:1369): Gtk-WARNING **: 21:22:39.299: Negative content width -6 (allocation 1, extents 4x3) while allocating gadget (node toolbar, owner GtkToolbar)
17:22:39 
17:22:39 (SWT:1369): Gtk-CRITICAL **: 21:22:39.337: gtk_box_gadget_distribute: assertion 'size >= 0' failed in GtkScrollbar
17:22:39 
17:22:39 (SWT:1369): Gtk-CRITICAL **: 21:22:39.343: gtk_box_gadget_distribute: assertion 'size >= 0' failed in GtkScrollbar
17:22:39 
17:22:39 (SWT:1369): Gtk-CRITICAL **: 21:22:39.358: gtk_box_gadget_distribute: assertion 'size >= 0' failed in GtkScrollbar
17:22:39 
17:22:39 (SWT:1369): Gtk-CRITICAL **: 21:22:39.374: gtk_box_gadget_distribute: assertion 'size >= 0' failed in GtkScrollbar
17:22:39 
17:22:39 (SWT:1369): Gtk-CRITICAL **: 21:22:39.390: gtk_box_gadget_distribute: assertion 'size >= 0' failed in GtkScrollbar
17:22:39 
17:22:39 (SWT:1369): Gtk-CRITICAL **: 21:22:39.407: gtk_box_gadget_distribute: assertion 'size >= 0' failed in GtkScrollbar
17:22:39 
17:22:39 (SWT:1369): Gtk-CRITICAL **: 21:22:39.425: gtk_box_gadget_distribute: assertion 'size >= 0' failed in GtkScrollbar
17:22:39 
17:22:39 (SWT:1369): Gtk-WARNING **: 21:22:39.438: Negative content width -6 (allocation 1, extents 4x3) while allocating gadget (node toolbar, owner GtkToolbar)
17:22:39 
17:22:39 (SWT:1369): Gtk-WARNING **: 21:22:39.454: Negative content width -6 (allocation 1, extents 4x3) while allocating gadget (node toolbar, owner GtkToolbar)
17:22:39 
17:22:39 (SWT:1369): Gtk-WARNING **: 21:22:39.498: Negative content width -6 (allocation 1, extents 4x3) while allocating gadget (node toolbar, owner GtkToolbar)
17:22:39 
17:22:39 (SWT:1369): Gtk-CRITICAL **: 21:22:39.503: gtk_box_gadget_distribute: assertion 'size >= 0' failed in GtkScrollbar
17:22:39 
17:22:39 (SWT:1369): Gtk-CRITICAL **: 21:22:39.504: gtk_box_gadget_distribute: assertion 'size >= 0' failed in GtkScrollbar
17:22:39 
17:22:39 (SWT:1369): Gtk-WARNING **: 21:22:39.552: Negative content width -6 (allocation 1, extents 4x3) while allocating gadget (node toolbar, owner GtkToolbar)
17:22:47 Tests run: 9, Failures: 0, Errors: 0, Skipped: 0, Time elapsed: 17.329 s - in org.eclipse.egit.ui.internal.submodules.SubmoduleFolderTest
17:22:47 compareWithHeadInSubmoduleFolder(org.eclipse.egit.ui.internal.submodules.SubmoduleFolderTest)  Time elapsed: 2.037 s
17:22:47 testStageUnstageInSubRepo(org.eclipse.egit.ui.internal.submodules.SubmoduleFolderTest)  Time elapsed: 3.117 s
17:22:47 testDecoration(org.eclipse.egit.ui.internal.submodules.SubmoduleFolderTest)  Time elapsed: 2.422 s
17:22:47 testHistoryFromProjectExplorerIsFromSubRepository(org.eclipse.egit.ui.internal.submodules.SubmoduleFolderTest)  Time elapsed: 2.165 s
17:22:47 testParentFolderMapsToParentRepo(org.eclipse.egit.ui.internal.submodules.SubmoduleFolderTest)  Time elapsed: 1.607 s
17:22:47 testDisconnect(org.eclipse.egit.ui.internal.submodules.SubmoduleFolderTest)  Time elapsed: 1.978 s
17:22:47 testRepoRemoval(org.eclipse.egit.ui.internal.submodules.SubmoduleFolderTest)  Time elapsed: 1.266 s
17:22:47 testChildProjectMapsToSubRepo(org.eclipse.egit.ui.internal.submodules.SubmoduleFolderTest)  Time elapsed: 1.283 s
17:22:47 testChildFolderMapsToSubRepo(org.eclipse.egit.ui.internal.submodules.SubmoduleFolderTest)  Time elapsed: 1.385 s
17:22:47 Running org.eclipse.egit.ui.internal.CommonUtilsTest
17:22:47 Tests run: 10, Failures: 0, Errors: 0, Skipped: 0, Time elapsed: 0.068 s - in org.eclipse.egit.ui.internal.CommonUtilsTest
17:22:47 sortingShouldWorkForBigNumbers(org.eclipse.egit.ui.internal.CommonUtilsTest)  Time elapsed: 0 s
17:22:47 sortingShouldWorkForMixedParts(org.eclipse.egit.ui.internal.CommonUtilsTest)  Time elapsed: 0 s
17:22:47 sortingShouldWorkForNumbers(org.eclipse.egit.ui.internal.CommonUtilsTest)  Time elapsed: 0 s
17:22:47 testFooterOffset(org.eclipse.egit.ui.internal.CommonUtilsTest)  Time elapsed: 0.001 s
17:22:47 sortingShouldWorkForEqualAndEmptyStrings(org.eclipse.egit.ui.internal.CommonUtilsTest)  Time elapsed: 0 s
17:22:47 sortingShouldIgnoreCase(org.eclipse.egit.ui.internal.CommonUtilsTest)  Time elapsed: 0 s
17:22:47 testFooterOffsetNoFooter(org.eclipse.egit.ui.internal.CommonUtilsTest)  Time elapsed: 0 s
17:22:47 sortingShouldIgnoreLeadingZeros(org.eclipse.egit.ui.internal.CommonUtilsTest)  Time elapsed: 0 s
17:22:47 testResourceCompare(org.eclipse.egit.ui.internal.CommonUtilsTest)  Time elapsed: 0.066 s
17:22:47 sortingShouldWorkForEasyStrings(org.eclipse.egit.ui.internal.CommonUtilsTest)  Time elapsed: 0 s
17:22:47 Running org.eclipse.egit.ui.internal.selection.SelectionUtilsTest
17:22:47 Tests run: 1, Failures: 0, Errors: 0, Skipped: 0, Time elapsed: 0.083 s - in org.eclipse.egit.ui.internal.selection.SelectionUtilsTest
17:22:47 getSelectedResourcesShouldUseAllTraversals(org.eclipse.egit.ui.internal.selection.SelectionUtilsTest)  Time elapsed: 0.082 s
17:22:47 Running org.eclipse.egit.ui.internal.selection.SelectionForViewsTest
17:22:49 
17:22:49 (SWT:1369): Gtk-WARNING **: 21:22:49.198: Negative content width -9 (allocation 9, extents 9x9) while allocating gadget (node entry, owner GtkEntry)
17:22:49 
17:22:49 (SWT:1369): Gtk-CRITICAL **: 21:22:49.246: gtk_box_gadget_distribute: assertion 'size >= 0' failed in GtkScrollbar
17:22:49 
17:22:49 (SWT:1369): Gtk-CRITICAL **: 21:22:49.261: gtk_box_gadget_distribute: assertion 'size >= 0' failed in GtkScrollbar
17:22:49 
17:22:49 (SWT:1369): Gtk-WARNING **: 21:22:49.268: Negative content width -6 (allocation 1, extents 4x3) while allocating gadget (node toolbar, owner GtkToolbar)
17:22:49 
17:22:49 (SWT:1369): Gtk-CRITICAL **: 21:22:49.280: gtk_box_gadget_distribute: assertion 'size >= 0' failed in GtkScrollbar
17:22:49 
17:22:49 (SWT:1369): Gtk-CRITICAL **: 21:22:49.287: gtk_box_gadget_distribute: assertion 'size >= 0' failed in GtkScrollbar
17:22:49 
17:22:49 (SWT:1369): Gtk-WARNING **: 21:22:49.321: Negative content width -6 (allocation 1, extents 4x3) while allocating gadget (node toolbar, owner GtkToolbar)
17:22:49 
17:22:49 (SWT:1369): Gtk-WARNING **: 21:22:49.363: Negative content width -6 (allocation 1, extents 4x3) while allocating gadget (node toolbar, owner GtkToolbar)
17:22:49 
17:22:49 (SWT:1369): Gtk-WARNING **: 21:22:49.405: Negative content width -6 (allocation 1, extents 4x3) while allocating gadget (node toolbar, owner GtkToolbar)
17:22:49 
17:22:49 (SWT:1369): Gtk-WARNING **: 21:22:49.411: Negative content width -6 (allocation 1, extents 4x3) while allocating gadget (node toolbar, owner GtkToolbar)
17:22:49 
17:22:49 (SWT:1369): Gtk-WARNING **: 21:22:49.422: Negative content width -6 (allocation 1, extents 4x3) while allocating gadget (node toolbar, owner GtkToolbar)
17:22:49 
17:22:49 (SWT:1369): Gtk-WARNING **: 21:22:49.422: Negative content width -6 (allocation 1, extents 4x3) while allocating gadget (node toolbar, owner GtkToolbar)
17:22:49 
17:22:49 (SWT:1369): Gtk-WARNING **: 21:22:49.446: Negative content width -6 (allocation 1, extents 4x3) while allocating gadget (node toolbar, owner GtkToolbar)
17:22:49 
17:22:49 (SWT:1369): Gtk-WARNING **: 21:22:49.524: Negative content width -6 (allocation 1, extents 4x3) while allocating gadget (node toolbar, owner GtkToolbar)
17:22:49 
17:22:49 (SWT:1369): Gtk-WARNING **: 21:22:49.580: Negative content width -6 (allocation 1, extents 4x3) while allocating gadget (node toolbar, owner GtkToolbar)
17:22:49 
17:22:49 (SWT:1369): Gtk-WARNING **: 21:22:49.634: Negative content width -6 (allocation 1, extents 4x3) while allocating gadget (node toolbar, owner GtkToolbar)
17:22:49 
17:22:49 (SWT:1369): Gtk-CRITICAL **: 21:22:49.685: gtk_box_gadget_distribute: assertion 'size >= 0' failed in GtkScrollbar
17:22:49 
17:22:49 (SWT:1369): Gtk-CRITICAL **: 21:22:49.708: gtk_box_gadget_distribute: assertion 'size >= 0' failed in GtkScrollbar
17:22:49 
17:22:49 (SWT:1369): Gtk-CRITICAL **: 21:22:49.730: gtk_box_gadget_distribute: assertion 'size >= 0' failed in GtkScrollbar
17:22:49 
17:22:49 (SWT:1369): Gtk-CRITICAL **: 21:22:49.747: gtk_box_gadget_distribute: assertion 'size >= 0' failed in GtkScrollbar
17:22:49 
17:22:49 (SWT:1369): Gtk-CRITICAL **: 21:22:49.763: gtk_box_gadget_distribute: assertion 'size >= 0' failed in GtkScrollbar
17:22:49 
17:22:49 (SWT:1369): Gtk-CRITICAL **: 21:22:49.779: gtk_box_gadget_distribute: assertion 'size >= 0' failed in GtkScrollbar
17:22:49 
17:22:49 (SWT:1369): Gtk-CRITICAL **: 21:22:49.796: gtk_box_gadget_distribute: assertion 'size >= 0' failed in GtkScrollbar
17:22:49 
17:22:49 (SWT:1369): Gtk-CRITICAL **: 21:22:49.813: gtk_box_gadget_distribute: assertion 'size >= 0' failed in GtkScrollbar
17:22:49 
17:22:49 (SWT:1369): Gtk-CRITICAL **: 21:22:49.830: gtk_box_gadget_distribute: assertion 'size >= 0' failed in GtkScrollbar
17:22:49 
17:22:49 (SWT:1369): Gtk-WARNING **: 21:22:49.844: Negative content width -6 (allocation 1, extents 4x3) while allocating gadget (node toolbar, owner GtkToolbar)
17:22:49 
17:22:49 (SWT:1369): Gtk-WARNING **: 21:22:49.858: Negative content width -6 (allocation 1, extents 4x3) while allocating gadget (node toolbar, owner GtkToolbar)
17:22:51 
17:22:51 (SWT:1369): Gtk-WARNING **: 21:22:51.034: Negative content width -6 (allocation 1, extents 4x3) while allocating gadget (node toolbar, owner GtkToolbar)
17:22:51 
17:22:51 (SWT:1369): Gtk-WARNING **: 21:22:51.246: Negative content width -6 (allocation 1, extents 4x3) while allocating gadget (node toolbar, owner GtkToolbar)
17:22:51 
17:22:51 (SWT:1369): Gtk-WARNING **: 21:22:51.784: Negative content width -6 (allocation 1, extents 4x3) while allocating gadget (node toolbar, owner GtkToolbar)
17:22:52 
17:22:52 (SWT:1369): Gtk-WARNING **: 21:22:51.997: Negative content width -6 (allocation 1, extents 4x3) while allocating gadget (node toolbar, owner GtkToolbar)
17:22:52 
17:22:52 (SWT:1369): Gtk-CRITICAL **: 21:22:52.537: gtk_box_gadget_distribute: assertion 'size >= 0' failed in GtkScrollbar
17:22:52 
17:22:52 (SWT:1369): Gtk-WARNING **: 21:22:52.541: Negative content width -6 (allocation 1, extents 4x3) while allocating gadget (node toolbar, owner GtkToolbar)
17:22:52 
17:22:52 (SWT:1369): Gtk-WARNING **: 21:22:52.748: Negative content width -6 (allocation 1, extents 4x3) while allocating gadget (node toolbar, owner GtkToolbar)
17:22:53 
17:22:53 (SWT:1369): Gtk-WARNING **: 21:22:53.303: Negative content width -6 (allocation 1, extents 4x3) while allocating gadget (node toolbar, owner GtkToolbar)
17:22:53 
17:22:53 (SWT:1369): Gtk-CRITICAL **: 21:22:53.324: gtk_box_gadget_distribute: assertion 'size >= 0' failed in GtkScrollbar
17:22:53 
17:22:53 (SWT:1369): Gtk-CRITICAL **: 21:22:53.332: gtk_box_gadget_distribute: assertion 'size >= 0' failed in GtkScrollbar
17:22:53 
17:22:53 (SWT:1369): Gtk-WARNING **: 21:22:53.514: Negative content width -6 (allocation 1, extents 4x3) while allocating gadget (node toolbar, owner GtkToolbar)
17:22:56 
17:22:56 (SWT:1369): Gtk-WARNING **: 21:22:56.075: Negative content width -6 (allocation 1, extents 4x3) while allocating gadget (node toolbar, owner GtkToolbar)
17:22:56 
17:22:56 (SWT:1369): Gtk-WARNING **: 21:22:56.092: Negative content width -6 (allocation 1, extents 4x3) while allocating gadget (node toolbar, owner GtkToolbar)
17:22:56 
17:22:56 (SWT:1369): Gtk-WARNING **: 21:22:56.992: Negative content width -9 (allocation 9, extents 9x9) while allocating gadget (node entry, owner GtkEntry)
17:22:57 
17:22:57 (SWT:1369): Gtk-CRITICAL **: 21:22:57.035: gtk_box_gadget_distribute: assertion 'size >= 0' failed in GtkScrollbar
17:22:57 
17:22:57 (SWT:1369): Gtk-CRITICAL **: 21:22:57.049: gtk_box_gadget_distribute: assertion 'size >= 0' failed in GtkScrollbar
17:22:57 
17:22:57 (SWT:1369): Gtk-WARNING **: 21:22:57.055: Negative content width -6 (allocation 1, extents 4x3) while allocating gadget (node toolbar, owner GtkToolbar)
17:22:57 
17:22:57 (SWT:1369): Gtk-CRITICAL **: 21:22:57.066: gtk_box_gadget_distribute: assertion 'size >= 0' failed in GtkScrollbar
17:22:57 
17:22:57 (SWT:1369): Gtk-CRITICAL **: 21:22:57.072: gtk_box_gadget_distribute: assertion 'size >= 0' failed in GtkScrollbar
17:22:57 
17:22:57 (SWT:1369): Gtk-WARNING **: 21:22:57.142: Negative content width -6 (allocation 1, extents 4x3) while allocating gadget (node toolbar, owner GtkToolbar)
17:22:57 
17:22:57 (SWT:1369): Gtk-WARNING **: 21:22:57.181: Negative content width -6 (allocation 1, extents 4x3) while allocating gadget (node toolbar, owner GtkToolbar)
17:22:57 
17:22:57 (SWT:1369): Gtk-WARNING **: 21:22:57.186: Negative content width -6 (allocation 1, extents 4x3) while allocating gadget (node toolbar, owner GtkToolbar)
17:22:57 
17:22:57 (SWT:1369): Gtk-WARNING **: 21:22:57.199: Negative content width -6 (allocation 1, extents 4x3) while allocating gadget (node toolbar, owner GtkToolbar)
17:22:57 
17:22:57 (SWT:1369): Gtk-WARNING **: 21:22:57.199: Negative content width -6 (allocation 1, extents 4x3) while allocating gadget (node toolbar, owner GtkToolbar)
17:22:57 
17:22:57 (SWT:1369): Gtk-WARNING **: 21:22:57.224: Negative content width -6 (allocation 1, extents 4x3) while allocating gadget (node toolbar, owner GtkToolbar)
17:22:57 
17:22:57 (SWT:1369): Gtk-WARNING **: 21:22:57.303: Negative content width -6 (allocation 1, extents 4x3) while allocating gadget (node toolbar, owner GtkToolbar)
17:22:57 
17:22:57 (SWT:1369): Gtk-WARNING **: 21:22:57.372: Negative content width -6 (allocation 1, extents 4x3) while allocating gadget (node toolbar, owner GtkToolbar)
17:22:57 
17:22:57 (SWT:1369): Gtk-WARNING **: 21:22:57.429: Negative content width -6 (allocation 1, extents 4x3) while allocating gadget (node toolbar, owner GtkToolbar)
17:22:57 
17:22:57 (SWT:1369): Gtk-CRITICAL **: 21:22:57.468: gtk_box_gadget_distribute: assertion 'size >= 0' failed in GtkScrollbar
17:22:57 
17:22:57 (SWT:1369): Gtk-CRITICAL **: 21:22:57.492: gtk_box_gadget_distribute: assertion 'size >= 0' failed in GtkScrollbar
17:22:57 
17:22:57 (SWT:1369): Gtk-CRITICAL **: 21:22:57.507: gtk_box_gadget_distribute: assertion 'size >= 0' failed in GtkScrollbar
17:22:57 
17:22:57 (SWT:1369): Gtk-CRITICAL **: 21:22:57.524: gtk_box_gadget_distribute: assertion 'size >= 0' failed in GtkScrollbar
17:22:57 
17:22:57 (SWT:1369): Gtk-CRITICAL **: 21:22:57.540: gtk_box_gadget_distribute: assertion 'size >= 0' failed in GtkScrollbar
17:22:57 
17:22:57 (SWT:1369): Gtk-CRITICAL **: 21:22:57.557: gtk_box_gadget_distribute: assertion 'size >= 0' failed in GtkScrollbar
17:22:57 
17:22:57 (SWT:1369): Gtk-CRITICAL **: 21:22:57.574: gtk_box_gadget_distribute: assertion 'size >= 0' failed in GtkScrollbar
17:22:57 
17:22:57 (SWT:1369): Gtk-CRITICAL **: 21:22:57.591: gtk_box_gadget_distribute: assertion 'size >= 0' failed in GtkScrollbar
17:22:57 
17:22:57 (SWT:1369): Gtk-CRITICAL **: 21:22:57.608: gtk_box_gadget_distribute: assertion 'size >= 0' failed in GtkScrollbar
17:22:57 
17:22:57 (SWT:1369): Gtk-CRITICAL **: 21:22:57.623: gtk_box_gadget_distribute: assertion 'size >= 0' failed in GtkScrollbar
17:22:57 
17:22:57 (SWT:1369): Gtk-WARNING **: 21:22:57.637: Negative content width -6 (allocation 1, extents 4x3) while allocating gadget (node toolbar, owner GtkToolbar)
17:22:57 
17:22:57 (SWT:1369): Gtk-WARNING **: 21:22:57.653: Negative content width -6 (allocation 1, extents 4x3) while allocating gadget (node toolbar, owner GtkToolbar)
17:22:58 
17:22:58 (SWT:1369): Gtk-WARNING **: 21:22:58.934: Negative content width -6 (allocation 1, extents 4x3) while allocating gadget (node toolbar, owner GtkToolbar)
17:22:59 
17:22:59 (SWT:1369): Gtk-WARNING **: 21:22:59.147: Negative content width -6 (allocation 1, extents 4x3) while allocating gadget (node toolbar, owner GtkToolbar)
17:22:59 
17:22:59 (SWT:1369): Gtk-WARNING **: 21:22:59.587: Negative content width -6 (allocation 1, extents 4x3) while allocating gadget (node toolbar, owner GtkToolbar)
17:22:59 
17:22:59 (SWT:1369): Gtk-WARNING **: 21:22:59.799: Negative content width -6 (allocation 1, extents 4x3) while allocating gadget (node toolbar, owner GtkToolbar)
17:23:00 
17:23:00 (SWT:1369): Gtk-CRITICAL **: 21:23:00.243: gtk_box_gadget_distribute: assertion 'size >= 0' failed in GtkScrollbar
17:23:00 
17:23:00 (SWT:1369): Gtk-WARNING **: 21:23:00.247: Negative content width -6 (allocation 1, extents 4x3) while allocating gadget (node toolbar, owner GtkToolbar)
17:23:00 
17:23:00 (SWT:1369): Gtk-CRITICAL **: 21:23:00.263: gtk_box_gadget_distribute: assertion 'size >= 0' failed in GtkScrollbar
17:23:00 
17:23:00 (SWT:1369): Gtk-CRITICAL **: 21:23:00.263: gtk_box_gadget_distribute: assertion 'size >= 0' failed in GtkScrollbar
17:23:00 
17:23:00 (SWT:1369): Gtk-CRITICAL **: 21:23:00.283: gtk_box_gadget_distribute: assertion 'size >= 0' failed in GtkScrollbar
17:23:00 
17:23:00 (SWT:1369): Gtk-WARNING **: 21:23:00.459: Negative content width -6 (allocation 1, extents 4x3) while allocating gadget (node toolbar, owner GtkToolbar)
17:23:01 
17:23:01 (SWT:1369): Gtk-WARNING **: 21:23:01.006: Negative content width -6 (allocation 1, extents 4x3) while allocating gadget (node toolbar, owner GtkToolbar)
17:23:01 
17:23:01 (SWT:1369): Gtk-CRITICAL **: 21:23:01.015: gtk_box_gadget_distribute: assertion 'size >= 0' failed in GtkScrollbar
17:23:01 
17:23:01 (SWT:1369): Gtk-CRITICAL **: 21:23:01.029: gtk_box_gadget_distribute: assertion 'size >= 0' failed in GtkScrollbar
17:23:01 
17:23:01 (SWT:1369): Gtk-WARNING **: 21:23:01.218: Negative content width -6 (allocation 1, extents 4x3) while allocating gadget (node toolbar, owner GtkToolbar)
17:23:03 
17:23:03 (SWT:1369): Gtk-WARNING **: 21:23:03.049: Negative content width -6 (allocation 1, extents 4x3) while allocating gadget (node toolbar, owner GtkToolbar)
17:23:03 
17:23:03 (SWT:1369): Gtk-WARNING **: 21:23:03.062: Negative content width -6 (allocation 1, extents 4x3) while allocating gadget (node toolbar, owner GtkToolbar)
17:23:03 Tests run: 3, Failures: 0, Errors: 0, Skipped: 1, Time elapsed: 15.7 s - in org.eclipse.egit.ui.internal.selection.SelectionForViewsTest
17:23:03 testViewsReactOnRepoSwitchInStaging(org.eclipse.egit.ui.internal.selection.SelectionForViewsTest) skipped
17:23:03 testViewsReactOnBareRepoViewSelection(org.eclipse.egit.ui.internal.selection.SelectionForViewsTest)  Time elapsed: 8.719 s
17:23:03 testViewsReactOnRepoViewSelection(org.eclipse.egit.ui.internal.selection.SelectionForViewsTest)  Time elapsed: 6.969 s
17:23:03 Running org.eclipse.egit.ui.internal.CompareUtilsTest
17:23:04 Tests run: 2, Failures: 0, Errors: 0, Skipped: 0, Time elapsed: 1.753 s - in org.eclipse.egit.ui.internal.CompareUtilsTest
17:23:04 testIndexEditWithAttributes(org.eclipse.egit.ui.internal.CompareUtilsTest)  Time elapsed: 0.941 s
17:23:04 testIndexEdit(org.eclipse.egit.ui.internal.CompareUtilsTest)  Time elapsed: 0.802 s
17:23:04 Running org.eclipse.egit.ui.search.CommitSearchQueryTest
17:23:08 Tests run: 7, Failures: 0, Errors: 0, Skipped: 0, Time elapsed: 4.033 s - in org.eclipse.egit.ui.search.CommitSearchQueryTest
17:23:08 testQuery(org.eclipse.egit.ui.search.CommitSearchQueryTest)  Time elapsed: 0.56 s
17:23:08 testMatchMessage(org.eclipse.egit.ui.search.CommitSearchQueryTest)  Time elapsed: 0.559 s
17:23:08 testCaseInsensitive(org.eclipse.egit.ui.search.CommitSearchQueryTest)  Time elapsed: 0.55 s
17:23:08 testMatchCommit(org.eclipse.egit.ui.search.CommitSearchQueryTest)  Time elapsed: 0.557 s
17:23:08 testMatchParent(org.eclipse.egit.ui.search.CommitSearchQueryTest)  Time elapsed: 0.647 s
17:23:08 testMatchTree(org.eclipse.egit.ui.search.CommitSearchQueryTest)  Time elapsed: 0.56 s
17:23:08 testEmptyMatches(org.eclipse.egit.ui.search.CommitSearchQueryTest)  Time elapsed: 0.556 s
17:23:08 Running org.eclipse.egit.ui.search.CommitSearchDialogTest
17:23:09 
17:23:09 (SWT:1369): Gtk-WARNING **: 21:23:09.687: Negative content width -6 (allocation 1, extents 4x3) while allocating gadget (node toolbar, owner GtkToolbar)
17:23:09 
17:23:09 (SWT:1369): Gtk-WARNING **: 21:23:09.706: Negative content width -6 (allocation 1, extents 4x3) while allocating gadget (node toolbar, owner GtkToolbar)
17:23:09 
17:23:09 (SWT:1369): Gtk-WARNING **: 21:23:09.770: Negative content width -6 (allocation 1, extents 4x3) while allocating gadget (node toolbar, owner GtkToolbar)
17:23:09 
17:23:09 (SWT:1369): Gtk-WARNING **: 21:23:09.821: Negative content width -6 (allocation 1, extents 4x3) while allocating gadget (node toolbar, owner GtkToolbar)
17:23:10 
17:23:10 (SWT:1369): Gtk-WARNING **: 21:23:10.493: Negative content width -6 (allocation 1, extents 4x3) while allocating gadget (node toolbar, owner GtkToolbar)
17:23:10 Tests run: 1, Failures: 0, Errors: 0, Skipped: 0, Time elapsed: 1.62 s - in org.eclipse.egit.ui.search.CommitSearchDialogTest
17:23:10 openCommitTabOnSearchDialog(org.eclipse.egit.ui.search.CommitSearchDialogTest)  Time elapsed: 1.615 s
17:23:10 Running org.eclipse.egit.ui.submodule.SubmoduleUpdateTest
17:23:11 
17:23:11 (SWT:1369): Gtk-WARNING **: 21:23:11.410: Negative content width -6 (allocation 1, extents 4x3) while allocating gadget (node toolbar, owner GtkToolbar)
17:23:15 
17:23:15 (SWT:1369): Gtk-WARNING **: 21:23:15.915: Negative content width -6 (allocation 1, extents 4x3) while allocating gadget (node toolbar, owner GtkToolbar)
17:23:16 Tests run: 1, Failures: 0, Errors: 0, Skipped: 0, Time elapsed: 5.421 s - in org.eclipse.egit.ui.submodule.SubmoduleUpdateTest
17:23:16 updateSubmodule(org.eclipse.egit.ui.submodule.SubmoduleUpdateTest)  Time elapsed: 5.415 s
17:23:16 Running org.eclipse.egit.ui.submodule.SubmoduleAddTest
17:23:16 
17:23:16 (SWT:1369): Gtk-WARNING **: 21:23:16.788: Negative content width -6 (allocation 1, extents 4x3) while allocating gadget (node toolbar, owner GtkToolbar)
17:23:20 
17:23:20 (SWT:1369): Gtk-WARNING **: 21:23:20.526: Negative content width -6 (allocation 1, extents 4x3) while allocating gadget (node toolbar, owner GtkToolbar)
17:23:20 Tests run: 1, Failures: 0, Errors: 0, Skipped: 0, Time elapsed: 4.604 s - in org.eclipse.egit.ui.submodule.SubmoduleAddTest
17:23:20 addAtRoot(org.eclipse.egit.ui.submodule.SubmoduleAddTest)  Time elapsed: 4.599 s
17:23:20 Running org.eclipse.egit.ui.submodule.SubmoduleSyncTest
17:23:21 
17:23:21 (SWT:1369): Gtk-WARNING **: 21:23:21.366: Negative content width -6 (allocation 1, extents 4x3) while allocating gadget (node toolbar, owner GtkToolbar)
17:23:26 
17:23:26 (SWT:1369): Gtk-WARNING **: 21:23:26.551: Negative content width -6 (allocation 1, extents 4x3) while allocating gadget (node toolbar, owner GtkToolbar)
17:23:26 Tests run: 1, Failures: 0, Errors: 0, Skipped: 0, Time elapsed: 6.02 s - in org.eclipse.egit.ui.submodule.SubmoduleSyncTest
17:23:26 syncSubmodule(org.eclipse.egit.ui.submodule.SubmoduleSyncTest)  Time elapsed: 6.013 s
17:23:26 Running org.eclipse.egit.ui.operations.GitScopeUtilTest
17:23:30 Tests run: 5, Failures: 0, Errors: 0, Skipped: 0, Time elapsed: 4.183 s - in org.eclipse.egit.ui.operations.GitScopeUtilTest
17:23:30 relatedChangesWithPrompt(org.eclipse.egit.ui.operations.GitScopeUtilTest)  Time elapsed: 1.774 s
17:23:30 modelProviderWithExtensionFiles(org.eclipse.egit.ui.operations.GitScopeUtilTest)  Time elapsed: 0.65 s
17:23:30 relatedChangesWithInvalidParams(org.eclipse.egit.ui.operations.GitScopeUtilTest)  Time elapsed: 0.583 s
17:23:30 relatedChangesWithNullResources(org.eclipse.egit.ui.operations.GitScopeUtilTest)  Time elapsed: 0.568 s
17:23:30 relatedChangesWithEmptyResources(org.eclipse.egit.ui.operations.GitScopeUtilTest)  Time elapsed: 0.606 s
17:23:30 Running org.eclipse.egit.ui.prefpages.configuration.GlobalConfigurationPageTest
17:23:30 
17:23:30 !ENTRY org.eclipse.ui 2 2 2019-03-28 21:23:30.870
17:23:30 !MESSAGE Invalid preference category path: org.eclipse.ui.net.NetPreferences (bundle: org.eclipse.jsch.ui, page: org.eclipse.jsch.ui.SSHPreferences)
17:23:30 
17:23:30 (SWT:1369): Gtk-WARNING **: 21:23:30.885: Negative content width -13 (allocation 5, extents 9x9) while allocating gadget (node entry, owner GtkEntry)
17:23:31 
17:23:31 (SWT:1369): Gtk-WARNING **: 21:23:31.110: Negative content width -13 (allocation 5, extents 9x9) while allocating gadget (node entry, owner GtkEntry)
17:23:31 
17:23:31 (SWT:1369): Gtk-WARNING **: 21:23:31.287: Negative content width -13 (allocation 5, extents 9x9) while allocating gadget (node entry, owner GtkEntry)
17:23:31 
17:23:31 (SWT:1369): Gtk-WARNING **: 21:23:31.446: Negative content width -13 (allocation 5, extents 9x9) while allocating gadget (node entry, owner GtkEntry)
17:23:31 
17:23:31 (SWT:1369): Gtk-WARNING **: 21:23:31.549: Negative content width -13 (allocation 5, extents 9x9) while allocating gadget (node entry, owner GtkEntry)
17:23:31 
17:23:31 (SWT:1369): Gtk-WARNING **: 21:23:31.676: Negative content width -13 (allocation 5, extents 9x9) while allocating gadget (node entry, owner GtkEntry)
17:23:31 
17:23:31 (SWT:1369): Gtk-WARNING **: 21:23:31.853: Negative content width -13 (allocation 5, extents 9x9) while allocating gadget (node entry, owner GtkEntry)
17:23:31 
17:23:31 (SWT:1369): Gtk-WARNING **: 21:23:31.930: Negative content width -6 (allocation 1, extents 4x3) while allocating gadget (node toolbar, owner GtkToolbar)
17:23:31 
17:23:31 (SWT:1369): Gtk-WARNING **: 21:23:31.930: Negative content height -3 (allocation 1, extents 2x2) while allocating gadget (node toolbar, owner GtkToolbar)
17:23:31 
17:23:31 (SWT:1369): Gtk-WARNING **: 21:23:31.930: Negative content width -6 (allocation 1, extents 4x3) while allocating gadget (node toolbar, owner GtkToolbar)
17:23:31 
17:23:31 (SWT:1369): Gtk-WARNING **: 21:23:31.930: Negative content height -3 (allocation 1, extents 2x2) while allocating gadget (node toolbar, owner GtkToolbar)
17:23:32 
17:23:32 (SWT:1369): Gtk-WARNING **: 21:23:32.103: Negative content width -13 (allocation 5, extents 9x9) while allocating gadget (node entry, owner GtkEntry)
17:23:32 
17:23:32 (SWT:1369): Gtk-WARNING **: 21:23:32.282: Negative content width -13 (allocation 5, extents 9x9) while allocating gadget (node entry, owner GtkEntry)
17:23:32 
17:23:32 (SWT:1369): Gtk-WARNING **: 21:23:32.485: Negative content width -13 (allocation 5, extents 9x9) while allocating gadget (node entry, owner GtkEntry)
17:23:32 
17:23:32 (SWT:1369): Gtk-WARNING **: 21:23:32.653: Negative content width -13 (allocation 5, extents 9x9) while allocating gadget (node entry, owner GtkEntry)
17:23:32 
17:23:32 (SWT:1369): Gtk-WARNING **: 21:23:32.816: Negative content width -13 (allocation 5, extents 9x9) while allocating gadget (node entry, owner GtkEntry)
17:23:32 Tests run: 11, Failures: 0, Errors: 0, Skipped: 0, Time elapsed: 2.097 s - in org.eclipse.egit.ui.prefpages.configuration.GlobalConfigurationPageTest
17:23:32 testAddSubSectionEntry(org.eclipse.egit.ui.prefpages.configuration.GlobalConfigurationPageTest)  Time elapsed: 0.244 s
17:23:32 testAddSectionEntry(org.eclipse.egit.ui.prefpages.configuration.GlobalConfigurationPageTest)  Time elapsed: 0.177 s
17:23:32 testCanCreateSameEntryValue(org.eclipse.egit.ui.prefpages.configuration.GlobalConfigurationPageTest)  Time elapsed: 0.16 s
17:23:32 testNodes(org.eclipse.egit.ui.prefpages.configuration.GlobalConfigurationPageTest)  Time elapsed: 0.102 s
17:23:32 testRemoveValue(org.eclipse.egit.ui.prefpages.configuration.GlobalConfigurationPageTest)  Time elapsed: 0.127 s
17:23:32 testAddSubSectionEntryWithSuggestion(org.eclipse.egit.ui.prefpages.configuration.GlobalConfigurationPageTest)  Time elapsed: 0.179 s
17:23:32 testOpenEditor(org.eclipse.egit.ui.prefpages.configuration.GlobalConfigurationPageTest)  Time elapsed: 0.248 s
17:23:32 testSubsectionWithDot(org.eclipse.egit.ui.prefpages.configuration.GlobalConfigurationPageTest)  Time elapsed: 0.179 s
17:23:32 testChecksForKey(org.eclipse.egit.ui.prefpages.configuration.GlobalConfigurationPageTest)  Time elapsed: 0.203 s
17:23:32 testRemoveSubSection(org.eclipse.egit.ui.prefpages.configuration.GlobalConfigurationPageTest)  Time elapsed: 0.169 s
17:23:32 testRemoveSection(org.eclipse.egit.ui.prefpages.configuration.GlobalConfigurationPageTest)  Time elapsed: 0.162 s
17:23:32 Running org.eclipse.egit.ui.httpauth.PushTest
17:23:33 2019-03-28 21:23:33.193:INFO:oejs.Server:WorkbenchTestable: jetty-9.4.14.v20181114; built: 2019-01-14T17:18:45.591Z; git: c4550056e785fb5665914545889f21dc136ad9e6; jvm 1.8.0_202-b08
17:23:33 2019-03-28 21:23:33.195:INFO:oejsh.ContextHandler:WorkbenchTestable: Started o.e.j.s.ServletContextHandler@62ee5993{/sbasic,null,AVAILABLE}
17:23:33 2019-03-28 21:23:33.198:INFO:oejs.AbstractConnector:WorkbenchTestable: Started ServerConnector@19e97146{HTTP/1.1,[http/1.1]}{127.0.0.1:36854}
17:23:33 2019-03-28 21:23:33.199:INFO:oejs.Server:WorkbenchTestable: Started @812179ms
17:23:33 
17:23:33 (SWT:1369): Gtk-WARNING **: 21:23:33.585: Negative content width -11 (allocation 1, extents 6x6) while allocating gadget (node button, owner GtkButton)
17:23:33 
17:23:33 (SWT:1369): Gtk-WARNING **: 21:23:33.718: gtk_widget_size_allocate(): attempt to allocate widget with width 608 and height -1
17:23:33 
17:23:33 (SWT:1369): Gtk-WARNING **: 21:23:33.718: Negative content height -1 (allocation 1, extents 1x1) while allocating gadget (node scrolledwindow, owner GtkScrolledWindow)
17:23:33 
17:23:33 (SWT:1369): Gtk-WARNING **: 21:23:33.718: gtk_widget_size_allocate(): attempt to allocate widget with width 6 and height -25
17:23:33 
17:23:33 (SWT:1369): Gtk-CRITICAL **: 21:23:33.718: gtk_box_gadget_distribute: assertion 'size >= 0' failed in GtkScrollbar
17:23:33 
17:23:33 (SWT:1369): Gtk-WARNING **: 21:23:33.730: gtk_widget_size_allocate(): attempt to allocate widget with width 608 and height -1
17:23:34 2019-03-28 21:23:34.660:INFO:oejs.AbstractConnector:WorkbenchTestable: Stopped ServerConnector@19e97146{HTTP/1.1,[http/1.1]}{127.0.0.1:0}
17:23:34 2019-03-28 21:23:34.660:INFO:oejsh.ContextHandler:WorkbenchTestable: Stopped o.e.j.s.ServletContextHandler@62ee5993{/sbasic,null,UNAVAILABLE}
17:23:34 Tests run: 1, Failures: 0, Errors: 0, Skipped: 0, Time elapsed: 1.712 s - in org.eclipse.egit.ui.httpauth.PushTest
17:23:34 testPush(org.eclipse.egit.ui.httpauth.PushTest)  Time elapsed: 1.712 s
17:23:34 Running org.eclipse.egit.ui.variables.DynamicVariablesTest
17:23:39 Tests run: 4, Failures: 0, Errors: 0, Skipped: 0, Time elapsed: 4.775 s - in org.eclipse.egit.ui.variables.DynamicVariablesTest
17:23:39 testGitBranch(org.eclipse.egit.ui.variables.DynamicVariablesTest)  Time elapsed: 1.237 s
17:23:39 testGitPath(org.eclipse.egit.ui.variables.DynamicVariablesTest)  Time elapsed: 1.223 s
17:23:39 testGitWorkTree(org.eclipse.egit.ui.variables.DynamicVariablesTest)  Time elapsed: 1.114 s
17:23:39 testGitDir(org.eclipse.egit.ui.variables.DynamicVariablesTest)  Time elapsed: 1.2 s
17:23:39 
17:23:39 Results:
17:23:39 
17:23:39 Failures: 
17:23:39   CommandEnablementTest.testRepositoryViewStartFinishEnablement:62->assertAllCommandsDisabled:85->assertCommandEnablement:137
17:23:39 
17:23:39 Tests run: 468, Failures: 1, Errors: 0, Skipped: 13
17:23:39 
17:23:40 
17:23:40 !ENTRY org.eclipse.core.jobs 4 2 2019-03-28 21:23:40.657
17:23:40 !MESSAGE An internal error occurred during: "Git decorator updates (Git resource decorations).".
17:23:40 !STACK 0
17:23:40 org.eclipse.swt.SWTException: Device is disposed
17:23:40 	at org.eclipse.swt.SWT.error(SWT.java:4533)
17:23:40 	at org.eclipse.swt.SWT.error(SWT.java:4448)
17:23:40 	at org.eclipse.swt.SWT.error(SWT.java:4419)
17:23:40 	at org.eclipse.swt.widgets.Display.error(Display.java:1236)
17:23:40 	at org.eclipse.swt.widgets.Display.asyncExec(Display.java:775)
17:23:40 	at org.eclipse.egit.ui.internal.decorators.GitDecorator.fireLabelEvent(GitDecorator.java:79)
17:23:40 	at org.eclipse.egit.ui.internal.decorators.GitDecorator$EventJob.run(GitDecorator.java:125)
17:23:40 	at org.eclipse.core.internal.jobs.Worker.run(Worker.java:55)
17:23:40 
17:23:40 !ENTRY org.eclipse.core.jobs 4 2 2019-03-28 21:23:40.661
17:23:40 !MESSAGE An internal error occurred during: "Git decorator updates (Git resource decorations).".
17:23:40 !STACK 0
17:23:40 org.eclipse.swt.SWTException: Device is disposed
17:23:40 	at org.eclipse.swt.SWT.error(SWT.java:4533)
17:23:40 	at org.eclipse.swt.SWT.error(SWT.java:4448)
17:23:40 	at org.eclipse.swt.SWT.error(SWT.java:4419)
17:23:40 	at org.eclipse.swt.widgets.Display.error(Display.java:1236)
17:23:40 	at org.eclipse.swt.widgets.Display.asyncExec(Display.java:775)
17:23:40 	at org.eclipse.egit.ui.internal.decorators.GitDecorator.fireLabelEvent(GitDecorator.java:79)
17:23:40 	at org.eclipse.egit.ui.internal.decorators.GitDecorator$EventJob.run(GitDecorator.java:125)
17:23:40 	at org.eclipse.core.internal.jobs.Worker.run(Worker.java:55)
17:23:40 
17:23:40 !ENTRY org.eclipse.core.jobs 4 2 2019-03-28 21:23:40.661
17:23:40 !MESSAGE An internal error occurred during: "Git decorator updates (Git object decorations).".
17:23:40 !STACK 0
17:23:40 org.eclipse.swt.SWTException: Device is disposed
17:23:40 	at org.eclipse.swt.SWT.error(SWT.java:4533)
17:23:40 	at org.eclipse.swt.SWT.error(SWT.java:4448)
17:23:40 	at org.eclipse.swt.SWT.error(SWT.java:4419)
17:23:40 	at org.eclipse.swt.widgets.Display.error(Display.java:1236)
17:23:40 	at org.eclipse.swt.widgets.Display.asyncExec(Display.java:775)
17:23:40 	at org.eclipse.egit.ui.internal.decorators.GitDecorator.fireLabelEvent(GitDecorator.java:79)
17:23:40 	at org.eclipse.egit.ui.internal.decorators.GitDecorator$EventJob.run(GitDecorator.java:125)
17:23:40 	at org.eclipse.core.internal.jobs.Worker.run(Worker.java:55)
17:23:41 
17:23:41 !ENTRY org.eclipse.core.resources 2 10035 2019-03-28 21:23:41.333
17:23:41 !MESSAGE The workspace will exit with unsaved changes in this session.
17:23:42 [INFO] ------------------------------------------------------------------------
17:23:42 [INFO] BUILD FAILURE
17:23:42 [INFO] ------------------------------------------------------------------------
17:23:42 [INFO] Total time:  14:05 min
17:23:42 [INFO] Finished at: 2019-03-28T21:23:42Z
17:23:42 [INFO] ------------------------------------------------------------------------
17:23:42 [ERROR] Failed to execute goal org.eclipse.tycho:tycho-surefire-plugin:1.3.0:test (default-test) on project org.eclipse.egit.ui.test: There are test failures.
17:23:42 [ERROR] 
17:23:42 [ERROR] Please refer to /home/jenkins/workspace/egit.gerrit/repo/org.eclipse.egit.ui.test/target/surefire-reports for the individual test results.
17:23:42 [ERROR] -> [Help 1]
17:23:42 org.apache.maven.lifecycle.LifecycleExecutionException: Failed to execute goal org.eclipse.tycho:tycho-surefire-plugin:1.3.0:test (default-test) on project org.eclipse.egit.ui.test: There are test failures.
17:23:42 
17:23:42 Please refer to /home/jenkins/workspace/egit.gerrit/repo/org.eclipse.egit.ui.test/target/surefire-reports for the individual test results.
17:23:42     at org.apache.maven.lifecycle.internal.MojoExecutor.execute (MojoExecutor.java:215)
17:23:42     at org.apache.maven.lifecycle.internal.MojoExecutor.execute (MojoExecutor.java:156)
17:23:42     at org.apache.maven.lifecycle.internal.MojoExecutor.execute (MojoExecutor.java:148)
17:23:42     at org.apache.maven.lifecycle.internal.LifecycleModuleBuilder.buildProject (LifecycleModuleBuilder.java:117)
17:23:42     at org.apache.maven.lifecycle.internal.LifecycleModuleBuilder.buildProject (LifecycleModuleBuilder.java:81)
17:23:42     at org.apache.maven.lifecycle.internal.builder.singlethreaded.SingleThreadedBuilder.build (SingleThreadedBuilder.java:56)
17:23:42     at org.apache.maven.lifecycle.internal.LifecycleStarter.execute (LifecycleStarter.java:128)
17:23:42     at org.apache.maven.DefaultMaven.doExecute (DefaultMaven.java:305)
17:23:42     at org.apache.maven.DefaultMaven.doExecute (DefaultMaven.java:192)
17:23:42     at org.apache.maven.DefaultMaven.execute (DefaultMaven.java:105)
17:23:42     at org.apache.maven.cli.MavenCli.execute (MavenCli.java:956)
17:23:42     at org.apache.maven.cli.MavenCli.doMain (MavenCli.java:288)
17:23:42     at org.apache.maven.cli.MavenCli.main (MavenCli.java:192)
17:23:42     at sun.reflect.NativeMethodAccessorImpl.invoke0 (Native Method)
17:23:42     at sun.reflect.NativeMethodAccessorImpl.invoke (NativeMethodAccessorImpl.java:62)
17:23:42     at sun.reflect.DelegatingMethodAccessorImpl.invoke (DelegatingMethodAccessorImpl.java:43)
17:23:42     at java.lang.reflect.Method.invoke (Method.java:498)
17:23:42     at org.codehaus.plexus.classworlds.launcher.Launcher.launchEnhanced (Launcher.java:289)
17:23:42     at org.codehaus.plexus.classworlds.launcher.Launcher.launch (Launcher.java:229)
17:23:42     at org.codehaus.plexus.classworlds.launcher.Launcher.mainWithExitCode (Launcher.java:415)
17:23:42     at org.codehaus.plexus.classworlds.launcher.Launcher.main (Launcher.java:356)
17:23:42 Caused by: org.apache.maven.plugin.MojoFailureException: There are test failures.
17:23:42 
17:23:42 Please refer to /home/jenkins/workspace/egit.gerrit/repo/org.eclipse.egit.ui.test/target/surefire-reports for the individual test results.
17:23:42     at org.eclipse.tycho.surefire.TestMojo.runTest (TestMojo.java:1044)
17:23:42     at org.eclipse.tycho.surefire.TestMojo.execute (TestMojo.java:693)
17:23:42     at org.apache.maven.plugin.DefaultBuildPluginManager.executeMojo (DefaultBuildPluginManager.java:137)
17:23:42     at org.apache.maven.lifecycle.internal.MojoExecutor.execute (MojoExecutor.java:210)
17:23:42     at org.apache.maven.lifecycle.internal.MojoExecutor.execute (MojoExecutor.java:156)
17:23:42     at org.apache.maven.lifecycle.internal.MojoExecutor.execute (MojoExecutor.java:148)
17:23:42     at org.apache.maven.lifecycle.internal.LifecycleModuleBuilder.buildProject (LifecycleModuleBuilder.java:117)
17:23:42     at org.apache.maven.lifecycle.internal.LifecycleModuleBuilder.buildProject (LifecycleModuleBuilder.java:81)
17:23:42     at org.apache.maven.lifecycle.internal.builder.singlethreaded.SingleThreadedBuilder.build (SingleThreadedBuilder.java:56)
17:23:42     at org.apache.maven.lifecycle.internal.LifecycleStarter.execute (LifecycleStarter.java:128)
17:23:42     at org.apache.maven.DefaultMaven.doExecute (DefaultMaven.java:305)
17:23:42     at org.apache.maven.DefaultMaven.doExecute (DefaultMaven.java:192)
17:23:42     at org.apache.maven.DefaultMaven.execute (DefaultMaven.java:105)
17:23:42     at org.apache.maven.cli.MavenCli.execute (MavenCli.java:956)
17:23:42     at org.apache.maven.cli.MavenCli.doMain (MavenCli.java:288)
17:23:42     at org.apache.maven.cli.MavenCli.main (MavenCli.java:192)
17:23:42     at sun.reflect.NativeMethodAccessorImpl.invoke0 (Native Method)
17:23:42     at sun.reflect.NativeMethodAccessorImpl.invoke (NativeMethodAccessorImpl.java:62)
17:23:42     at sun.reflect.DelegatingMethodAccessorImpl.invoke (DelegatingMethodAccessorImpl.java:43)
17:23:42     at java.lang.reflect.Method.invoke (Method.java:498)
17:23:42     at org.codehaus.plexus.classworlds.launcher.Launcher.launchEnhanced (Launcher.java:289)
17:23:42     at org.codehaus.plexus.classworlds.launcher.Launcher.launch (Launcher.java:229)
17:23:42     at org.codehaus.plexus.classworlds.launcher.Launcher.mainWithExitCode (Launcher.java:415)
17:23:42     at org.codehaus.plexus.classworlds.launcher.Launcher.main (Launcher.java:356)
17:23:42 [ERROR] 
17:23:42 [ERROR] Re-run Maven using the -X switch to enable full debug logging.
17:23:42 [ERROR] 
17:23:42 [ERROR] For more information about the errors and possible solutions, please read the following articles:
17:23:42 [ERROR] [Help 1] http://cwiki.apache.org/confluence/display/MAVEN/MojoFailureException
17:23:42 [INFO] Build failures were ignored.
17:23:43 [egit.gerrit] $ /opt/tools/apache-maven/latest/bin/mvn -f repo/org.eclipse.egit.mylyn.ui.test/pom.xml -DGERRIT_BRANCH=master -DGERRIT_PATCHSET_REVISION=9bcfe4283455516385a73e4868ad9e90e5145e73 -DGERRIT_HOST=gerrit-local -DGERRIT_CHANGE_OWNER_EMAIL=thomas.wolf@paranor.ch "-DGERRIT_EVENT_ACCOUNT_NAME=Thomas Wolf" -DTEST_PARAMS=-Declipse.consoleLog=true -DGERRIT_CHANGE_URL=https://git.eclipse.org/r/139702 -DGERRIT_PATCHSET_UPLOADER_EMAIL=thomas.wolf@paranor.ch -DGERRIT_EVENT_TYPE=patchset-created -DGERRIT_PROJECT=egit/egit -DGERRIT_CHANGE_NUMBER=139702 -DGERRIT_SCHEME=ssh '-DGERRIT_PATCHSET_UPLOADER=\"Thomas Wolf\" <thomas.wolf@paranor.ch>' -DGERRIT_PORT=29418 -DGERRIT_CHANGE_PRIVATE_STATE=false -DGERRIT_REFSPEC=refs/changes/02/139702/1 -DJGIT_VERSION=5.4.0-SNAPSHOT "-DGERRIT_PATCHSET_UPLOADER_NAME=Thomas Wolf" '-DGERRIT_CHANGE_OWNER=\"Thomas Wolf\" <thomas.wolf@paranor.ch>' -DGERRIT_CHANGE_COMMIT_MESSAGE=W3JlbGVuZ10gQWRkIGRlcGVuZGVuY3kgZnJvbSBzb3VyY2UgdG8gYmluYXJ5IGZlYXR1cmUKCkJ1ZzogNTQ1OTA2CkNoYW5nZS1JZDogSThhN2Y0MjJmMmMyYWIwMDM0YTM5MjEyODFiOGNkZGIyNDEyZmEwOGQKU2lnbmVkLW9mZi1ieTogVGhvbWFzIFdvbGYgPHRob21hcy53b2xmQHBhcmFub3IuY2g+ "-DGERRIT_NAME=Eclipse Gerrit" -DGERRIT_TOPIC= "-DGERRIT_CHANGE_SUBJECT=[releng] Add dependency from source to binary feature" -DJGIT_SITE=https://repo.eclipse.org/content/unzip/snapshots.unzip/org/eclipse/jgit/org.eclipse.jgit.repository/${JGIT_VERSION}/org.eclipse.jgit.repository-${JGIT_VERSION}.zip-unzip/ '-DGERRIT_EVENT_ACCOUNT=\"Thomas Wolf\" <thomas.wolf@paranor.ch>' -DGERRIT_CHANGE_WIP_STATE=false -DGERRIT_CHANGE_ID=I8a7f422f2c2ab0034a3921281b8cddb2412fa08d -DGERRIT_EVENT_HASH=-145901407 -DGERRIT_VERSION=2.14.6 -DGERRIT_EVENT_ACCOUNT_EMAIL=thomas.wolf@paranor.ch -DGERRIT_PATCHSET_NUMBER=1 "-DGERRIT_CHANGE_OWNER_NAME=Thomas Wolf" -Djava.io.tmpdir=/home/jenkins/workspace/egit.gerrit/tmp/ "-Dtest.vmparams=-Declipse.consoleLog=true -Degit.test.tmpdir=/home/jenkins/workspace/egit.gerrit/tmp/egit.tmp/" -Djgit-site=https://repo.eclipse.org/content/unzip/snapshots.unzip/org/eclipse/jgit/org.eclipse.jgit.repository/5.4.0-SNAPSHOT/org.eclipse.jgit.repository-5.4.0-SNAPSHOT.zip-unzip/ -Declipse.p2.mirrors=false -Dmaven.repo.local=/home/jenkins/workspace/egit.gerrit/.repository -B -e verify --fail-never -P other-os
17:23:43 Picked up JAVA_TOOL_OPTIONS: -XX:+IgnoreUnrecognizedVMOptions -XX:+UseContainerSupport -XX:+UnlockExperimentalVMOptions -XX:+UseCGroupMemoryLimitForHeap
17:23:43 Picked up _JAVA_OPTIONS: -XX:MaxRAMPercentage=64.0
17:23:44 [INFO] Error stacktraces are turned on.
17:23:44 [INFO] Scanning for projects...
17:23:46 [INFO] Computing target platform for MavenProject: org.eclipse.egit:org.eclipse.egit.mylyn.ui.test:5.4.0-SNAPSHOT @ /home/jenkins/workspace/egit.gerrit/repo/org.eclipse.egit.mylyn.ui.test/pom.xml
17:23:47 [INFO] Adding repository http://download.eclipse.org/jetty/updates/jetty-bundles-9.x/9.4.14.v20181114
17:23:47 [INFO] Fetching p2.index from http://download.eclipse.org/technology/swtbot/snapshots/
17:23:47 [INFO] Fetching p2.index from http://download.eclipse.org/technology/swtbot/snapshots/
17:23:47 [INFO] Adding repository http://download.eclipse.org/technology/swtbot/snapshots
17:23:47 [INFO] Fetching p2.index from http://download.eclipse.org/tools/orbit/downloads/drops/R20190226160451/repository/
17:23:47 [INFO] Fetching p2.index from http://download.eclipse.org/tools/orbit/downloads/drops/R20190226160451/repository/
17:23:47 [INFO] Adding repository http://download.eclipse.org/tools/orbit/downloads/drops/R20190226160451/repository
17:23:47 [INFO] Fetching p2.index from http://download.eclipse.org/tools/orbit/downloads/drops2/R20190226160451/repository/
17:23:47 [INFO] Fetching p2.index from http://download.eclipse.org/tools/orbit/downloads/drops2/R20190226160451/repository/
17:23:47 [INFO] Fetching p2.index from http://download.eclipse.org/releases/neon/
17:23:47 [INFO] Fetching p2.index from http://download.eclipse.org/releases/neon/
17:23:47 [INFO] Adding repository http://download.eclipse.org/releases/neon
17:23:47 [INFO] Fetching p2.index from http://download.eclipse.org/technology/epp/packages/neon/
17:23:47 [INFO] Fetching p2.index from http://download.eclipse.org/technology/epp/packages/neon/
17:23:48 [INFO] Fetching p2.index from http://download.eclipse.org/releases/neon/201705151400/
17:23:48 [INFO] Fetching p2.index from http://download.eclipse.org/releases/neon/201705151400/
17:23:50 [INFO] Fetching p2.index from http://download.eclipse.org/releases/neon/201703141400/
17:23:50 [INFO] Fetching p2.index from http://download.eclipse.org/releases/neon/201703141400/
17:23:51 [INFO] Fetching p2.index from http://download.eclipse.org/releases/neon/201703231000/
17:23:51 [INFO] Fetching p2.index from http://download.eclipse.org/releases/neon/201703231000/
17:23:53 [INFO] Fetching p2.index from http://download.eclipse.org/releases/neon/201606221000/
17:23:53 [INFO] Fetching p2.index from http://download.eclipse.org/releases/neon/201606221000/
17:23:54 [INFO] Fetching p2.index from http://download.eclipse.org/releases/neon/201609281000/
17:23:54 [INFO] Fetching p2.index from http://download.eclipse.org/releases/neon/201609281000/
17:23:55 [INFO] Fetching p2.index from http://download.eclipse.org/releases/neon/201610111000/
17:23:55 [INFO] Fetching p2.index from http://download.eclipse.org/releases/neon/201610111000/
17:23:57 [INFO] Fetching p2.index from http://download.eclipse.org/releases/neon/201612211000/
17:23:57 [INFO] Fetching p2.index from http://download.eclipse.org/releases/neon/201612211000/
17:24:04 [INFO] Fetching p2.index from https://repo.eclipse.org/content/unzip/snapshots.unzip/org/eclipse/jgit/org.eclipse.jgit.repository/5.4.0-SNAPSHOT/org.eclipse.jgit.repository-5.4.0-SNAPSHOT.zip-unzip/ (172B)
17:24:04 [INFO] Fetching p2.index from https://repo.eclipse.org/content/unzip/snapshots.unzip/org/eclipse/jgit/org.eclipse.jgit.repository/5.4.0-SNAPSHOT/org.eclipse.jgit.repository-5.4.0-SNAPSHOT.zip-unzip/ (172B)
17:24:04 [INFO] Adding repository https://repo.eclipse.org/content/unzip/snapshots.unzip/org/eclipse/jgit/org.eclipse.jgit.repository/5.4.0-SNAPSHOT/org.eclipse.jgit.repository-5.4.0-SNAPSHOT.zip-unzip
17:24:04 [INFO] Fetching p2.index from http://download.eclipse.org/cbi/updates/license/
17:24:04 [INFO] Fetching p2.index from http://download.eclipse.org/cbi/updates/license/
17:24:05 [INFO] Adding repository http://download.eclipse.org/cbi/updates/license
17:24:05 [INFO] Fetching p2.index from http://download.eclipse.org/cbi/updates/license/2.0.0.v20180130-0820/
17:24:05 [INFO] Fetching p2.index from http://download.eclipse.org/cbi/updates/license/2.0.0.v20180130-0820/
17:24:05 [INFO] Fetching p2.index from http://download.eclipse.org/cbi/updates/license/2.0.1.v20180423-1114/
17:24:05 [INFO] Fetching p2.index from http://download.eclipse.org/cbi/updates/license/2.0.1.v20180423-1114/
17:24:05 [INFO] Resolving dependencies of MavenProject: org.eclipse.egit:org.eclipse.egit.mylyn.ui.test:5.4.0-SNAPSHOT @ /home/jenkins/workspace/egit.gerrit/repo/org.eclipse.egit.mylyn.ui.test/pom.xml
17:24:05 [WARNING] The following locally built units have been used to resolve project dependencies:
17:24:05 [WARNING]   org.eclipse.egit.mylyn.feature.group/5.4.0.201903282058
17:24:05 [WARNING]   org.eclipse.egit/5.4.0.201903282058
17:24:05 [WARNING]   org.eclipse.egit.feature.group/5.4.0.201903282058
17:24:05 [WARNING]   org.eclipse.egit.mylyn.feature.jar/5.4.0.201903282058
17:24:05 [WARNING]   org.eclipse.egit.ui/5.4.0.201903282058
17:24:05 [WARNING]   org.eclipse.egit.feature.jar/5.4.0.201903282058
17:24:05 [WARNING]   org.eclipse.egit.mylyn.ui/5.4.0.201903282058
17:24:05 [WARNING]   org.eclipse.egit.doc/5.4.0.201903282058
17:24:05 [WARNING]   org.eclipse.egit.core/5.4.0.201903282058
17:24:05 [INFO] Resolving class path of MavenProject: org.eclipse.egit:org.eclipse.egit.mylyn.ui.test:5.4.0-SNAPSHOT @ /home/jenkins/workspace/egit.gerrit/repo/org.eclipse.egit.mylyn.ui.test/pom.xml
17:24:06 [INFO] 
17:24:06 [INFO] ----------< org.eclipse.egit:org.eclipse.egit.mylyn.ui.test >-----------
17:24:06 [INFO] Building EGit Mylyn UI Test Plug-in 5.4.0-SNAPSHOT
17:24:06 [INFO] ------------------------[ eclipse-test-plugin ]-------------------------
17:24:06 [INFO] 
17:24:06 [INFO] --- tycho-packaging-plugin:1.3.0:build-qualifier (default-build-qualifier) @ org.eclipse.egit.mylyn.ui.test ---
17:24:06 [INFO] The project's OSGi version is 5.4.0.201903282123
17:24:06 [INFO] 
17:24:06 [INFO] --- tycho-packaging-plugin:1.3.0:validate-id (default-validate-id) @ org.eclipse.egit.mylyn.ui.test ---
17:24:06 [INFO] 
17:24:06 [INFO] --- tycho-packaging-plugin:1.3.0:validate-version (default-validate-version) @ org.eclipse.egit.mylyn.ui.test ---
17:24:06 [INFO] 
17:24:06 [INFO] --- maven-enforcer-plugin:3.0.0-M2:enforce (enforce-maven) @ org.eclipse.egit.mylyn.ui.test ---
17:24:06 [INFO] 
17:24:06 [INFO] --- maven-resources-plugin:2.4.3:resources (default-resources) @ org.eclipse.egit.mylyn.ui.test ---
17:24:06 [INFO] Using 'UTF-8' encoding to copy filtered resources.
17:24:06 [INFO] skip non existing resourceDirectory /home/jenkins/workspace/egit.gerrit/repo/org.eclipse.egit.mylyn.ui.test/src/main/resources
17:24:06 [INFO] 
17:24:06 [INFO] --- tycho-compiler-plugin:1.3.0:compile (default-compile) @ org.eclipse.egit.mylyn.ui.test ---
17:24:06 [INFO] Nothing to compile - all classes are up to date
17:24:06 [INFO] 
17:24:06 [INFO] --- maven-resources-plugin:2.4.3:testResources (default-testResources) @ org.eclipse.egit.mylyn.ui.test ---
17:24:06 [INFO] Using 'UTF-8' encoding to copy filtered resources.
17:24:06 [INFO] skip non existing resourceDirectory /home/jenkins/workspace/egit.gerrit/repo/org.eclipse.egit.mylyn.ui.test/src/test/resources
17:24:06 [INFO] 
17:24:06 [INFO] --- target-platform-configuration:1.3.0:target-platform (default-target-platform) @ org.eclipse.egit.mylyn.ui.test ---
17:24:06 [INFO] 
17:24:06 [INFO] --- tycho-packaging-plugin:1.3.0:package-plugin (default-package-plugin) @ org.eclipse.egit.mylyn.ui.test ---
17:24:07 [INFO] Building jar: /home/jenkins/workspace/egit.gerrit/repo/org.eclipse.egit.mylyn.ui.test/target/org.eclipse.egit.mylyn.ui.test-5.4.0-SNAPSHOT.jar
17:24:07 [INFO] 
17:24:07 [INFO] --- tycho-p2-plugin:1.3.0:p2-metadata-default (default-p2-metadata-default) @ org.eclipse.egit.mylyn.ui.test ---
17:24:07 [INFO] 
17:24:07 [INFO] --- tycho-surefire-plugin:1.3.0:test (default-test) @ org.eclipse.egit.mylyn.ui.test ---
17:24:07 [INFO] Expected eclipse log file: /home/jenkins/workspace/egit.gerrit/repo/org.eclipse.egit.mylyn.ui.test/target/work/data/.metadata/.log
17:24:07 [INFO] Command line:
17:24:07 	[/opt/tools/java/oracle/jdk-8/1.8.0_202/jre/bin/java, -Dosgi.noShutdown=false, -Dosgi.os=linux, -Dosgi.ws=gtk, -Dosgi.arch=x86_64, -Declipse.consoleLog=true, -Degit.test.tmpdir=/home/jenkins/workspace/egit.gerrit/tmp/egit.tmp/, -Xmx512m, -Dosgi.clean=true, -jar, /home/jenkins/workspace/egit.gerrit/.repository/p2/osgi/bundle/org.eclipse.equinox.launcher/1.3.201.v20161025-1711/org.eclipse.equinox.launcher-1.3.201.v20161025-1711.jar, -data, /home/jenkins/workspace/egit.gerrit/repo/org.eclipse.egit.mylyn.ui.test/target/work/data, -install, /home/jenkins/workspace/egit.gerrit/repo/org.eclipse.egit.mylyn.ui.test/target/work, -configuration, /home/jenkins/workspace/egit.gerrit/repo/org.eclipse.egit.mylyn.ui.test/target/work/configuration, -application, org.eclipse.tycho.surefire.osgibooter.uitest, -testproperties, /home/jenkins/workspace/egit.gerrit/repo/org.eclipse.egit.mylyn.ui.test/target/surefire.properties, -testApplication, org.eclipse.ui.ide.workbench]
17:24:07 Picked up JAVA_TOOL_OPTIONS: -XX:+IgnoreUnrecognizedVMOptions -XX:+UseContainerSupport -XX:+UnlockExperimentalVMOptions -XX:+UseCGroupMemoryLimitForHeap
17:24:07 Picked up _JAVA_OPTIONS: -XX:MaxRAMPercentage=64.0
17:24:09 !SESSION 2019-03-28 21:24:07.875 -----------------------------------------------
17:24:09 eclipse.buildId=unknown
17:24:09 java.version=1.8.0_202
17:24:09 java.vendor=Oracle Corporation
17:24:09 BootLoader constants: OS=linux, ARCH=x86_64, WS=gtk, NL=en_US
17:24:09 Framework arguments:  -application org.eclipse.tycho.surefire.osgibooter.uitest -testproperties /home/jenkins/workspace/egit.gerrit/repo/org.eclipse.egit.mylyn.ui.test/target/surefire.properties -testApplication org.eclipse.ui.ide.workbench
17:24:09 Command-line arguments:  -data /home/jenkins/workspace/egit.gerrit/repo/org.eclipse.egit.mylyn.ui.test/target/work/data -application org.eclipse.tycho.surefire.osgibooter.uitest -testproperties /home/jenkins/workspace/egit.gerrit/repo/org.eclipse.egit.mylyn.ui.test/target/surefire.properties -testApplication org.eclipse.ui.ide.workbench
17:24:09 
17:24:09 !ENTRY org.eclipse.jdt.launching.macosx 4 0 2019-03-28 21:24:09.637
17:24:09 !MESSAGE FrameworkEvent ERROR
17:24:09 !STACK 0
17:24:09 org.osgi.framework.BundleException: Could not resolve module: org.eclipse.jdt.launching.macosx [246]
17:24:09   Unresolved requirement: Require-Capability: eclipse.platform; filter:="(osgi.os=macosx)"
17:24:09 
17:24:09 	at org.eclipse.osgi.container.Module.start(Module.java:444)
17:24:09 	at org.eclipse.osgi.container.ModuleContainer$ContainerStartLevel.incStartLevel(ModuleContainer.java:1620)
17:24:09 	at org.eclipse.osgi.container.ModuleContainer$ContainerStartLevel.incStartLevel(ModuleContainer.java:1599)
17:24:09 	at org.eclipse.osgi.container.ModuleContainer$ContainerStartLevel.doContainerStartLevel(ModuleContainer.java:1571)
17:24:09 	at org.eclipse.osgi.container.ModuleContainer$ContainerStartLevel.dispatchEvent(ModuleContainer.java:1514)
17:24:09 	at org.eclipse.osgi.container.ModuleContainer$ContainerStartLevel.dispatchEvent(ModuleContainer.java:1)
17:24:09 	at org.eclipse.osgi.framework.eventmgr.EventManager.dispatchEvent(EventManager.java:230)
17:24:09 	at org.eclipse.osgi.framework.eventmgr.EventManager$EventThread.run(EventManager.java:340)
17:24:09 
17:24:09 !ENTRY org.eclipse.jdt.launching.ui.macosx 4 0 2019-03-28 21:24:09.638
17:24:09 !MESSAGE FrameworkEvent ERROR
17:24:09 !STACK 0
17:24:09 org.osgi.framework.BundleException: Could not resolve module: org.eclipse.jdt.launching.ui.macosx [247]
17:24:09   Unresolved requirement: Require-Capability: eclipse.platform; filter:="(osgi.os=macosx)"
17:24:09 
17:24:09 	at org.eclipse.osgi.container.Module.start(Module.java:444)
17:24:09 	at org.eclipse.osgi.container.ModuleContainer$ContainerStartLevel.incStartLevel(ModuleContainer.java:1620)
17:24:09 	at org.eclipse.osgi.container.ModuleContainer$ContainerStartLevel.incStartLevel(ModuleContainer.java:1599)
17:24:09 	at org.eclipse.osgi.container.ModuleContainer$ContainerStartLevel.doContainerStartLevel(ModuleContainer.java:1571)
17:24:09 	at org.eclipse.osgi.container.ModuleContainer$ContainerStartLevel.dispatchEvent(ModuleContainer.java:1514)
17:24:09 	at org.eclipse.osgi.container.ModuleContainer$ContainerStartLevel.dispatchEvent(ModuleContainer.java:1)
17:24:09 	at org.eclipse.osgi.framework.eventmgr.EventManager.dispatchEvent(EventManager.java:230)
17:24:09 	at org.eclipse.osgi.framework.eventmgr.EventManager$EventThread.run(EventManager.java:340)
17:24:09 Launching application org.eclipse.ui.ide.workbench...
17:24:12 
17:24:12 !ENTRY org.eclipse.egit.core 1 0 2019-03-28 21:24:12.053
17:24:12 !MESSAGE Using Apache MINA sshd as ssh client.
17:24:12 
17:24:12 (SWT:2387): Gtk-WARNING **: 21:24:12.817: Negative content width -6 (allocation 1, extents 4x3) while allocating gadget (node toolbar, owner GtkToolbar)
17:24:12 
17:24:12 (SWT:2387): Gtk-WARNING **: 21:24:12.817: Negative content height -3 (allocation 1, extents 2x2) while allocating gadget (node toolbar, owner GtkToolbar)
17:24:12 
17:24:12 (SWT:2387): Gtk-WARNING **: 21:24:12.817: Negative content width -6 (allocation 1, extents 4x3) while allocating gadget (node toolbar, owner GtkToolbar)
17:24:12 
17:24:12 (SWT:2387): Gtk-WARNING **: 21:24:12.817: Negative content height -3 (allocation 1, extents 2x2) while allocating gadget (node toolbar, owner GtkToolbar)
17:24:12 
17:24:12 (SWT:2387): Gtk-WARNING **: 21:24:12.823: Negative content width -6 (allocation 1, extents 4x3) while allocating gadget (node toolbar, owner GtkToolbar)
17:24:12 
17:24:12 (SWT:2387): Gtk-WARNING **: 21:24:12.823: Negative content height -3 (allocation 1, extents 2x2) while allocating gadget (node toolbar, owner GtkToolbar)
17:24:12 
17:24:12 (SWT:2387): Gtk-WARNING **: 21:24:12.824: Negative content width -6 (allocation 1, extents 4x3) while allocating gadget (node toolbar, owner GtkToolbar)
17:24:12 
17:24:12 (SWT:2387): Gtk-WARNING **: 21:24:12.824: Negative content height -3 (allocation 1, extents 2x2) while allocating gadget (node toolbar, owner GtkToolbar)
17:24:13 
17:24:13 (SWT:2387): Gtk-WARNING **: 21:24:13.043: Negative content width -6 (allocation 1, extents 4x3) while allocating gadget (node toolbar, owner GtkToolbar)
17:24:13 
17:24:13 (SWT:2387): Gtk-WARNING **: 21:24:13.043: Negative content height -3 (allocation 1, extents 2x2) while allocating gadget (node toolbar, owner GtkToolbar)
17:24:13 
17:24:13 (SWT:2387): Gtk-WARNING **: 21:24:13.043: Negative content width -6 (allocation 1, extents 4x3) while allocating gadget (node toolbar, owner GtkToolbar)
17:24:13 
17:24:13 (SWT:2387): Gtk-WARNING **: 21:24:13.043: Negative content height -3 (allocation 1, extents 2x2) while allocating gadget (node toolbar, owner GtkToolbar)
17:24:13 
17:24:13 (SWT:2387): Gtk-WARNING **: 21:24:13.054: gtk_widget_size_allocate(): attempt to allocate widget with width -3 and height -3
17:24:13 
17:24:13 (SWT:2387): Gtk-WARNING **: 21:24:13.387: Negative content width -6 (allocation 1, extents 4x3) while allocating gadget (node toolbar, owner GtkToolbar)
17:24:13 
17:24:13 (SWT:2387): Gtk-WARNING **: 21:24:13.387: Negative content height -3 (allocation 1, extents 2x2) while allocating gadget (node toolbar, owner GtkToolbar)
17:24:13 
17:24:13 (SWT:2387): Gtk-WARNING **: 21:24:13.388: Negative content width -6 (allocation 1, extents 4x3) while allocating gadget (node toolbar, owner GtkToolbar)
17:24:13 
17:24:13 (SWT:2387): Gtk-WARNING **: 21:24:13.388: Negative content height -3 (allocation 1, extents 2x2) while allocating gadget (node toolbar, owner GtkToolbar)
17:24:13 
17:24:13 (SWT:2387): Gtk-WARNING **: 21:24:13.404: Negative content width -6 (allocation 1, extents 4x3) while allocating gadget (node toolbar, owner GtkToolbar)
17:24:13 
17:24:13 (SWT:2387): Gtk-WARNING **: 21:24:13.404: Negative content height -3 (allocation 1, extents 2x2) while allocating gadget (node toolbar, owner GtkToolbar)
17:24:13 
17:24:13 (SWT:2387): Gtk-WARNING **: 21:24:13.404: Negative content width -6 (allocation 1, extents 4x3) while allocating gadget (node toolbar, owner GtkToolbar)
17:24:13 
17:24:13 (SWT:2387): Gtk-WARNING **: 21:24:13.404: Negative content height -3 (allocation 1, extents 2x2) while allocating gadget (node toolbar, owner GtkToolbar)
17:24:13 
17:24:13 (SWT:2387): Gtk-WARNING **: 21:24:13.408: Negative content width -6 (allocation 1, extents 4x3) while allocating gadget (node toolbar, owner GtkToolbar)
17:24:13 
17:24:13 (SWT:2387): Gtk-WARNING **: 21:24:13.408: Negative content height -3 (allocation 1, extents 2x2) while allocating gadget (node toolbar, owner GtkToolbar)
17:24:13 
17:24:13 (SWT:2387): Gtk-WARNING **: 21:24:13.408: Negative content width -6 (allocation 1, extents 4x3) while allocating gadget (node toolbar, owner GtkToolbar)
17:24:13 
17:24:13 (SWT:2387): Gtk-WARNING **: 21:24:13.408: Negative content height -3 (allocation 1, extents 2x2) while allocating gadget (node toolbar, owner GtkToolbar)
17:24:13 
17:24:13 (SWT:2387): Gtk-WARNING **: 21:24:13.413: Negative content width -6 (allocation 1, extents 4x3) while allocating gadget (node toolbar, owner GtkToolbar)
17:24:13 
17:24:13 (SWT:2387): Gtk-WARNING **: 21:24:13.413: Negative content height -3 (allocation 1, extents 2x2) while allocating gadget (node toolbar, owner GtkToolbar)
17:24:13 
17:24:13 (SWT:2387): Gtk-WARNING **: 21:24:13.413: Negative content width -6 (allocation 1, extents 4x3) while allocating gadget (node toolbar, owner GtkToolbar)
17:24:13 
17:24:13 (SWT:2387): Gtk-WARNING **: 21:24:13.413: Negative content height -3 (allocation 1, extents 2x2) while allocating gadget (node toolbar, owner GtkToolbar)
17:24:13 
17:24:13 (SWT:2387): Gtk-WARNING **: 21:24:13.844: Negative content width -6 (allocation 1, extents 4x3) while allocating gadget (node toolbar, owner GtkToolbar)
17:24:13 
17:24:13 (SWT:2387): Gtk-WARNING **: 21:24:13.844: Negative content height -3 (allocation 1, extents 2x2) while allocating gadget (node toolbar, owner GtkToolbar)
17:24:13 
17:24:13 (SWT:2387): Gtk-WARNING **: 21:24:13.844: Negative content width -6 (allocation 1, extents 4x3) while allocating gadget (node toolbar, owner GtkToolbar)
17:24:13 
17:24:13 (SWT:2387): Gtk-WARNING **: 21:24:13.844: Negative content height -3 (allocation 1, extents 2x2) while allocating gadget (node toolbar, owner GtkToolbar)
17:24:13 
17:24:13 (SWT:2387): Gtk-WARNING **: 21:24:13.855: Negative content width -6 (allocation 1, extents 4x3) while allocating gadget (node toolbar, owner GtkToolbar)
17:24:13 
17:24:13 (SWT:2387): Gtk-WARNING **: 21:24:13.855: Negative content height -3 (allocation 1, extents 2x2) while allocating gadget (node toolbar, owner GtkToolbar)
17:24:13 
17:24:13 (SWT:2387): Gtk-WARNING **: 21:24:13.855: Negative content width -6 (allocation 1, extents 4x3) while allocating gadget (node toolbar, owner GtkToolbar)
17:24:13 
17:24:13 (SWT:2387): Gtk-WARNING **: 21:24:13.855: Negative content height -3 (allocation 1, extents 2x2) while allocating gadget (node toolbar, owner GtkToolbar)
17:24:14 
17:24:14 (SWT:2387): Gtk-WARNING **: 21:24:14.255: Negative content height -9 (allocation 1, extents 5x5) while allocating gadget (node button, owner GtkButton)
17:24:14 
17:24:14 (SWT:2387): Gtk-WARNING **: 21:24:14.323: Negative content width -6 (allocation 1, extents 4x3) while allocating gadget (node toolbar, owner GtkToolbar)
17:24:14 
17:24:14 (SWT:2387): Gtk-WARNING **: 21:24:14.326: Negative content width -6 (allocation 1, extents 4x3) while allocating gadget (node toolbar, owner GtkToolbar)
17:24:14 
17:24:14 (SWT:2387): Gtk-WARNING **: 21:24:14.332: Negative content width -6 (allocation 1, extents 4x3) while allocating gadget (node toolbar, owner GtkToolbar)
17:24:14 
17:24:14 (SWT:2387): Gtk-WARNING **: 21:24:14.335: Negative content width -6 (allocation 1, extents 4x3) while allocating gadget (node toolbar, owner GtkToolbar)
17:24:14 
17:24:14 (SWT:2387): Gtk-WARNING **: 21:24:14.337: Negative content width -6 (allocation 1, extents 4x3) while allocating gadget (node toolbar, owner GtkToolbar)
17:24:14 
17:24:14 (SWT:2387): Gtk-WARNING **: 21:24:14.338: Negative content width -1 (allocation 1, extents 1x1) while allocating gadget (node trough, owner GtkProgressBar)
17:24:14 
17:24:14 (SWT:2387): Gtk-WARNING **: 21:24:14.338: Negative content width -1 (allocation 1, extents 1x1) while allocating gadget (node trough, owner GtkProgressBar)
17:24:14 
17:24:14 (SWT:2387): Gtk-WARNING **: 21:24:14.382: Negative content width -6 (allocation 1, extents 4x3) while allocating gadget (node toolbar, owner GtkToolbar)
17:24:14 
17:24:14 (SWT:2387): Gtk-WARNING **: 21:24:14.383: Negative content width -6 (allocation 1, extents 4x3) while allocating gadget (node toolbar, owner GtkToolbar)
17:24:14 
17:24:14 (SWT:2387): Gtk-WARNING **: 21:24:14.387: Negative content width -6 (allocation 1, extents 4x3) while allocating gadget (node toolbar, owner GtkToolbar)
17:24:14 
17:24:14 (SWT:2387): Gtk-WARNING **: 21:24:14.388: Negative content width -6 (allocation 1, extents 4x3) while allocating gadget (node toolbar, owner GtkToolbar)
17:24:14 
17:24:14 (SWT:2387): Gtk-WARNING **: 21:24:14.391: Negative content width -6 (allocation 1, extents 4x3) while allocating gadget (node toolbar, owner GtkToolbar)
17:24:14 
17:24:14 (SWT:2387): Gtk-WARNING **: 21:24:14.393: Negative content width -6 (allocation 1, extents 4x3) while allocating gadget (node toolbar, owner GtkToolbar)
17:24:14 Running org.eclipse.egit.internal.mylyn.CommitHyperlinkDetectorTest
17:24:14 Tests run: 14, Failures: 0, Errors: 0, Skipped: 0, Time elapsed: 0.131 s - in org.eclipse.egit.internal.mylyn.CommitHyperlinkDetectorTest
17:24:14 testEndLine(org.eclipse.egit.internal.mylyn.CommitHyperlinkDetectorTest)  Time elapsed: 0.043 s
17:24:14 testGerritId(org.eclipse.egit.internal.mylyn.CommitHyperlinkDetectorTest)  Time elapsed: 0.004 s
17:24:14 testMiddleLine(org.eclipse.egit.internal.mylyn.CommitHyperlinkDetectorTest)  Time elapsed: 0.003 s
17:24:14 testOffsetOff(org.eclipse.egit.internal.mylyn.CommitHyperlinkDetectorTest)  Time elapsed: 0.003 s
17:24:14 testEmpty(org.eclipse.egit.internal.mylyn.CommitHyperlinkDetectorTest)  Time elapsed: 0.003 s
17:24:14 testBadLocation(org.eclipse.egit.internal.mylyn.CommitHyperlinkDetectorTest)  Time elapsed: 0.003 s
17:24:14 testEndSentence(org.eclipse.egit.internal.mylyn.CommitHyperlinkDetectorTest)  Time elapsed: 0.004 s
17:24:14 testMultiLine(org.eclipse.egit.internal.mylyn.CommitHyperlinkDetectorTest)  Time elapsed: 0.003 s
17:24:14 testBeginSentence(org.eclipse.egit.internal.mylyn.CommitHyperlinkDetectorTest)  Time elapsed: 0.003 s
17:24:14 testGerritIdWithinText(org.eclipse.egit.internal.mylyn.CommitHyperlinkDetectorTest)  Time elapsed: 0.004 s
17:24:14 testMultiId(org.eclipse.egit.internal.mylyn.CommitHyperlinkDetectorTest)  Time elapsed: 0.004 s
17:24:14 testSimpleId(org.eclipse.egit.internal.mylyn.CommitHyperlinkDetectorTest)  Time elapsed: 0.004 s
17:24:14 testNoDocument(org.eclipse.egit.internal.mylyn.CommitHyperlinkDetectorTest)  Time elapsed: 0.003 s
17:24:14 testOffsetMiddle(org.eclipse.egit.internal.mylyn.CommitHyperlinkDetectorTest)  Time elapsed: 0.013 s
17:24:14 
17:24:14 Results:
17:24:14 
17:24:14 Tests run: 14, Failures: 0, Errors: 0, Skipped: 0
17:24:14 
17:24:14 
17:24:14 (SWT:2387): Gtk-WARNING **: 21:24:14.666: Negative content width -6 (allocation 1, extents 4x3) while allocating gadget (node toolbar, owner GtkToolbar)
17:24:14 
17:24:14 (SWT:2387): Gtk-WARNING **: 21:24:14.667: Negative content width -6 (allocation 1, extents 4x3) while allocating gadget (node toolbar, owner GtkToolbar)
17:24:17 [INFO] All tests passed!
17:24:17 [INFO] 
17:24:17 [INFO] >>> maven-pmd-plugin:3.11.0:cpd-check (default) > :cpd @ org.eclipse.egit.mylyn.ui.test >>>
17:24:17 [INFO] 
17:24:17 [INFO] --- maven-pmd-plugin:3.11.0:cpd (cpd) @ org.eclipse.egit.mylyn.ui.test ---
17:24:17 [INFO] 
17:24:17 [INFO] <<< maven-pmd-plugin:3.11.0:cpd-check (default) < :cpd @ org.eclipse.egit.mylyn.ui.test <<<
17:24:17 [INFO] 
17:24:17 [INFO] 
17:24:17 [INFO] --- maven-pmd-plugin:3.11.0:cpd-check (default) @ org.eclipse.egit.mylyn.ui.test ---
17:24:17 [INFO] 
17:24:17 [INFO] ------------------------------------------------------------------------
17:24:17 [INFO] BUILD SUCCESS
17:24:17 [INFO] ------------------------------------------------------------------------
17:24:17 [INFO] Total time:  33.320 s
17:24:17 [INFO] Finished at: 2019-03-28T21:24:17Z
17:24:17 [INFO] ------------------------------------------------------------------------
17:24:18 Terminating xvnc.
17:28:20 [FINDBUGS] Collecting findbugs analysis files...
17:28:23 [FINDBUGS] Searching for all files in /home/jenkins/workspace/egit.gerrit that match the pattern repo/*/target/*bugsXml.xml
17:28:23 [FINDBUGS] Parsing 10 files in /home/jenkins/workspace/egit.gerrit
17:28:23 [FINDBUGS] Successfully parsed file /home/jenkins/workspace/egit.gerrit/repo/org.eclipse.egit.core.junit/target/spotbugsXml.xml with 4 unique warnings and 0 duplicates.
17:28:23 [FINDBUGS] Successfully parsed file /home/jenkins/workspace/egit.gerrit/repo/org.eclipse.egit.core.test/target/spotbugsXml.xml with 10 unique warnings and 0 duplicates.
17:28:23 [FINDBUGS] Successfully parsed file /home/jenkins/workspace/egit.gerrit/repo/org.eclipse.egit.core/target/spotbugsXml.xml with 21 unique warnings and 0 duplicates.
17:28:23 [FINDBUGS] Successfully parsed file /home/jenkins/workspace/egit.gerrit/repo/org.eclipse.egit.gitflow.test/target/spotbugsXml.xml with 21 unique warnings and 0 duplicates.
17:28:23 [FINDBUGS] Successfully parsed file /home/jenkins/workspace/egit.gerrit/repo/org.eclipse.egit.gitflow.ui/target/spotbugsXml.xml with 21 unique warnings and 0 duplicates.
17:28:23 [FINDBUGS] Successfully parsed file /home/jenkins/workspace/egit.gerrit/repo/org.eclipse.egit.gitflow/target/spotbugsXml.xml with 23 unique warnings and 0 duplicates.
17:28:23 [FINDBUGS] Successfully parsed file /home/jenkins/workspace/egit.gerrit/repo/org.eclipse.egit.mylyn.ui.test/target/spotbugsXml.xml with 23 unique warnings and 0 duplicates.
17:28:23 [FINDBUGS] Successfully parsed file /home/jenkins/workspace/egit.gerrit/repo/org.eclipse.egit.mylyn.ui/target/spotbugsXml.xml with 23 unique warnings and 0 duplicates.
17:28:23 [FINDBUGS] Successfully parsed file /home/jenkins/workspace/egit.gerrit/repo/org.eclipse.egit.ui.test/target/spotbugsXml.xml with 45 unique warnings and 0 duplicates.
17:28:23 [FINDBUGS] Successfully parsed file /home/jenkins/workspace/egit.gerrit/repo/org.eclipse.egit.ui/target/spotbugsXml.xml with 80 unique warnings and 0 duplicates.
17:28:23 No credentials specified
17:28:23 <Git Blamer> Using GitBlamer to create author and commit information for all warnings.
17:28:23 <Git Blamer> GIT_COMMIT=9bcfe4283455516385a73e4868ad9e90e5145e73, workspace=/home/jenkins/workspace/egit.gerrit/repo
17:28:23  > /usr/bin/git rev-parse 9bcfe4283455516385a73e4868ad9e90e5145e73^{commit} # timeout=10
17:28:31 <Git Blamer> Skipping file /home/jenkins/workspace/egit.gerrit/repo/org.eclipse.egit.ui.test/src/org/eclipse/egit/ui/view/repositories/GitRepositoriesViewTestBase.java, no result found.
17:28:31 [FINDBUGS] Computing warning deltas based on reference build #11597
17:28:32 [DRY] Collecting duplicate code analysis files...
17:28:32 [DRY] Searching for all files in /home/jenkins/workspace/egit.gerrit that match the pattern **/cpd.xml
17:28:32 [DRY] Parsing 17 files in /home/jenkins/workspace/egit.gerrit
17:28:32 [DRY] Successfully parsed file /home/jenkins/workspace/egit.gerrit/repo/org.eclipse.egit-feature/target/cpd.xml with 0 unique warnings and 0 duplicates.
17:28:32 [DRY] Successfully parsed file /home/jenkins/workspace/egit.gerrit/repo/org.eclipse.egit.core.junit/target/cpd.xml with 0 unique warnings and 0 duplicates.
17:28:32 [DRY] Successfully parsed file /home/jenkins/workspace/egit.gerrit/repo/org.eclipse.egit.core.test/target/cpd.xml with 0 unique warnings and 0 duplicates.
17:28:32 [DRY] Successfully parsed file /home/jenkins/workspace/egit.gerrit/repo/org.eclipse.egit.core/target/cpd.xml with 4 unique warnings and 0 duplicates.
17:28:32 [DRY] Successfully parsed file /home/jenkins/workspace/egit.gerrit/repo/org.eclipse.egit.doc/target/cpd.xml with 4 unique warnings and 0 duplicates.
17:28:32 [DRY] Successfully parsed file /home/jenkins/workspace/egit.gerrit/repo/org.eclipse.egit.gitflow-feature/target/cpd.xml with 4 unique warnings and 0 duplicates.
17:28:32 [DRY] Successfully parsed file /home/jenkins/workspace/egit.gerrit/repo/org.eclipse.egit.gitflow.test/target/cpd.xml with 4 unique warnings and 0 duplicates.
17:28:32 [DRY] Successfully parsed file /home/jenkins/workspace/egit.gerrit/repo/org.eclipse.egit.gitflow.ui/target/cpd.xml with 4 unique warnings and 0 duplicates.
17:28:32 [DRY] Successfully parsed file /home/jenkins/workspace/egit.gerrit/repo/org.eclipse.egit.gitflow/target/cpd.xml with 4 unique warnings and 0 duplicates.
17:28:32 [DRY] Successfully parsed file /home/jenkins/workspace/egit.gerrit/repo/org.eclipse.egit.mylyn-feature/target/cpd.xml with 4 unique warnings and 0 duplicates.
17:28:32 [DRY] Successfully parsed file /home/jenkins/workspace/egit.gerrit/repo/org.eclipse.egit.mylyn.ui.test/target/cpd.xml with 4 unique warnings and 0 duplicates.
17:28:32 [DRY] Successfully parsed file /home/jenkins/workspace/egit.gerrit/repo/org.eclipse.egit.mylyn.ui/target/cpd.xml with 4 unique warnings and 0 duplicates.
17:28:32 [DRY] Successfully parsed file /home/jenkins/workspace/egit.gerrit/repo/org.eclipse.egit.repository/target/cpd.xml with 4 unique warnings and 0 duplicates.
17:28:32 [DRY] Successfully parsed file /home/jenkins/workspace/egit.gerrit/repo/org.eclipse.egit.source-feature/target/cpd.xml with 4 unique warnings and 0 duplicates.
17:28:32 [DRY] Successfully parsed file /home/jenkins/workspace/egit.gerrit/repo/org.eclipse.egit.ui.test/target/cpd.xml with 4 unique warnings and 0 duplicates.
17:28:32 [DRY] Successfully parsed file /home/jenkins/workspace/egit.gerrit/repo/org.eclipse.egit.ui/target/cpd.xml with 37 unique warnings and 0 duplicates.
17:28:32 [DRY] Successfully parsed file /home/jenkins/workspace/egit.gerrit/repo/org.eclipse.egit/target/cpd.xml with 37 unique warnings and 0 duplicates.
17:28:32 No credentials specified
17:28:32 <Git Blamer> Using GitBlamer to create author and commit information for all warnings.
17:28:32 <Git Blamer> GIT_COMMIT=9bcfe4283455516385a73e4868ad9e90e5145e73, workspace=/home/jenkins/workspace/egit.gerrit/repo
17:28:32  > /usr/bin/git rev-parse 9bcfe4283455516385a73e4868ad9e90e5145e73^{commit} # timeout=10
17:28:37 [DRY] Computing warning deltas based on reference build #11597
17:28:37 Recording test results
17:28:37 Build step 'Publish JUnit test result report' changed build result to UNSTABLE
17:28:37 Archiving artifacts
17:28:41 Finished: UNSTABLE