UnstableConsole Output

Skipping 1,493 KB.. Full Log
 >= 0' failed in GtkScrollbar
05:52:04 
05:52:04 (SWT:1344): Gtk-CRITICAL **: 09:52:04.762: gtk_box_gadget_distribute: assertion 'size >= 0' failed in GtkScrollbar
05:52:04 
05:52:04 (SWT:1344): Gtk-CRITICAL **: 09:52:04.764: gtk_box_gadget_distribute: assertion 'size >= 0' failed in GtkScrollbar
05:52:04 
05:52:04 (SWT:1344): Gtk-CRITICAL **: 09:52:04.765: gtk_box_gadget_distribute: assertion 'size >= 0' failed in GtkScrollbar
05:52:04 
05:52:04 (SWT:1344): Gtk-CRITICAL **: 09:52:04.770: gtk_box_gadget_distribute: assertion 'size >= 0' failed in GtkScrollbar
05:52:04 
05:52:04 (SWT:1344): Gtk-CRITICAL **: 09:52:04.771: gtk_box_gadget_distribute: assertion 'size >= 0' failed in GtkScrollbar
05:52:04 
05:52:04 (SWT:1344): Gtk-CRITICAL **: 09:52:04.782: gtk_box_gadget_distribute: assertion 'size >= 0' failed in GtkScrollbar
05:52:04 
05:52:04 (SWT:1344): Gtk-CRITICAL **: 09:52:04.796: gtk_box_gadget_distribute: assertion 'size >= 0' failed in GtkScrollbar
05:52:04 
05:52:04 (SWT:1344): Gtk-CRITICAL **: 09:52:04.796: gtk_box_gadget_distribute: assertion 'size >= 0' failed in GtkScrollbar
05:52:04 
05:52:04 (SWT:1344): Gtk-CRITICAL **: 09:52:04.813: gtk_box_gadget_distribute: assertion 'size >= 0' failed in GtkScrollbar
05:52:04 
05:52:04 (SWT:1344): Gtk-CRITICAL **: 09:52:04.813: gtk_box_gadget_distribute: assertion 'size >= 0' failed in GtkScrollbar
05:52:04 
05:52:04 (SWT:1344): Gtk-CRITICAL **: 09:52:04.830: gtk_box_gadget_distribute: assertion 'size >= 0' failed in GtkScrollbar
05:52:04 
05:52:04 (SWT:1344): Gtk-CRITICAL **: 09:52:04.830: gtk_box_gadget_distribute: assertion 'size >= 0' failed in GtkScrollbar
05:52:04 
05:52:04 (SWT:1344): Gtk-CRITICAL **: 09:52:04.848: gtk_box_gadget_distribute: assertion 'size >= 0' failed in GtkScrollbar
05:52:04 
05:52:04 (SWT:1344): Gtk-CRITICAL **: 09:52:04.848: gtk_box_gadget_distribute: assertion 'size >= 0' failed in GtkScrollbar
05:52:04 
05:52:04 (SWT:1344): Gtk-CRITICAL **: 09:52:04.864: gtk_box_gadget_distribute: assertion 'size >= 0' failed in GtkScrollbar
05:52:04 
05:52:04 (SWT:1344): Gtk-CRITICAL **: 09:52:04.864: gtk_box_gadget_distribute: assertion 'size >= 0' failed in GtkScrollbar
05:52:04 
05:52:04 (SWT:1344): Gtk-CRITICAL **: 09:52:04.880: gtk_box_gadget_distribute: assertion 'size >= 0' failed in GtkScrollbar
05:52:04 
05:52:04 (SWT:1344): Gtk-CRITICAL **: 09:52:04.880: gtk_box_gadget_distribute: assertion 'size >= 0' failed in GtkScrollbar
05:52:04 
05:52:04 (SWT:1344): Gtk-WARNING **: 09:52:04.935: Negative content width -6 (allocation 1, extents 4x3) while allocating gadget (node toolbar, owner GtkToolbar)
05:52:05 
05:52:05 (SWT:1344): Gtk-WARNING **: 09:52:05.492: Negative content width -9 (allocation 9, extents 9x9) while allocating gadget (node entry, owner GtkEntry)
05:52:05 *** BUG ***
05:52:05 In pixman_region32_init_rect: Invalid rectangle passed
05:52:05 Set a breakpoint on '_pixman_log_error' to debug
05:52:05 
05:52:05 
05:52:05 (SWT:1344): Gtk-CRITICAL **: 09:52:05.535: gtk_box_gadget_distribute: assertion 'size >= 0' failed in GtkScrollbar
05:52:05 
05:52:05 (SWT:1344): Gtk-CRITICAL **: 09:52:05.545: gtk_box_gadget_distribute: assertion 'size >= 0' failed in GtkScrollbar
05:52:05 
05:52:05 (SWT:1344): Gtk-WARNING **: 09:52:05.552: Negative content width -6 (allocation 1, extents 4x3) while allocating gadget (node toolbar, owner GtkToolbar)
05:52:05 
05:52:05 (SWT:1344): Gtk-CRITICAL **: 09:52:05.563: gtk_box_gadget_distribute: assertion 'size >= 0' failed in GtkScrollbar
05:52:05 
05:52:05 (SWT:1344): Gtk-CRITICAL **: 09:52:05.577: gtk_box_gadget_distribute: assertion 'size >= 0' failed in GtkScrollbar
05:52:05 
05:52:05 (SWT:1344): Gtk-CRITICAL **: 09:52:05.581: gtk_box_gadget_distribute: assertion 'size >= 0' failed in GtkScrollbar
05:52:05 
05:52:05 (SWT:1344): Gtk-CRITICAL **: 09:52:05.590: gtk_box_gadget_distribute: assertion 'size >= 0' failed in GtkScrollbar
05:52:05 
05:52:05 (SWT:1344): Gtk-CRITICAL **: 09:52:05.592: gtk_box_gadget_distribute: assertion 'size >= 0' failed in GtkScrollbar
05:52:05 
05:52:05 (SWT:1344): Gtk-CRITICAL **: 09:52:05.592: gtk_box_gadget_distribute: assertion 'size >= 0' failed in GtkScrollbar
05:52:05 
05:52:05 (SWT:1344): Gtk-CRITICAL **: 09:52:05.597: gtk_box_gadget_distribute: assertion 'size >= 0' failed in GtkScrollbar
05:52:05 
05:52:05 (SWT:1344): Gtk-CRITICAL **: 09:52:05.598: gtk_box_gadget_distribute: assertion 'size >= 0' failed in GtkScrollbar
05:52:05 
05:52:05 (SWT:1344): Gtk-CRITICAL **: 09:52:05.614: gtk_box_gadget_distribute: assertion 'size >= 0' failed in GtkScrollbar
05:52:05 
05:52:05 (SWT:1344): Gtk-CRITICAL **: 09:52:05.624: gtk_box_gadget_distribute: assertion 'size >= 0' failed in GtkScrollbar
05:52:05 
05:52:05 (SWT:1344): Gtk-CRITICAL **: 09:52:05.624: gtk_box_gadget_distribute: assertion 'size >= 0' failed in GtkScrollbar
05:52:05 
05:52:05 (SWT:1344): Gtk-CRITICAL **: 09:52:05.641: gtk_box_gadget_distribute: assertion 'size >= 0' failed in GtkScrollbar
05:52:05 
05:52:05 (SWT:1344): Gtk-CRITICAL **: 09:52:05.641: gtk_box_gadget_distribute: assertion 'size >= 0' failed in GtkScrollbar
05:52:05 
05:52:05 (SWT:1344): Gtk-CRITICAL **: 09:52:05.657: gtk_box_gadget_distribute: assertion 'size >= 0' failed in GtkScrollbar
05:52:05 
05:52:05 (SWT:1344): Gtk-CRITICAL **: 09:52:05.657: gtk_box_gadget_distribute: assertion 'size >= 0' failed in GtkScrollbar
05:52:05 
05:52:05 (SWT:1344): Gtk-CRITICAL **: 09:52:05.674: gtk_box_gadget_distribute: assertion 'size >= 0' failed in GtkScrollbar
05:52:05 
05:52:05 (SWT:1344): Gtk-CRITICAL **: 09:52:05.674: gtk_box_gadget_distribute: assertion 'size >= 0' failed in GtkScrollbar
05:52:05 
05:52:05 (SWT:1344): Gtk-CRITICAL **: 09:52:05.691: gtk_box_gadget_distribute: assertion 'size >= 0' failed in GtkScrollbar
05:52:05 
05:52:05 (SWT:1344): Gtk-CRITICAL **: 09:52:05.691: gtk_box_gadget_distribute: assertion 'size >= 0' failed in GtkScrollbar
05:52:05 
05:52:05 (SWT:1344): Gtk-CRITICAL **: 09:52:05.707: gtk_box_gadget_distribute: assertion 'size >= 0' failed in GtkScrollbar
05:52:05 
05:52:05 (SWT:1344): Gtk-CRITICAL **: 09:52:05.707: gtk_box_gadget_distribute: assertion 'size >= 0' failed in GtkScrollbar
05:52:05 
05:52:05 (SWT:1344): Gtk-CRITICAL **: 09:52:05.724: gtk_box_gadget_distribute: assertion 'size >= 0' failed in GtkScrollbar
05:52:05 
05:52:05 (SWT:1344): Gtk-CRITICAL **: 09:52:05.724: gtk_box_gadget_distribute: assertion 'size >= 0' failed in GtkScrollbar
05:52:05 
05:52:05 (SWT:1344): Gtk-CRITICAL **: 09:52:05.741: gtk_box_gadget_distribute: assertion 'size >= 0' failed in GtkScrollbar
05:52:05 
05:52:05 (SWT:1344): Gtk-CRITICAL **: 09:52:05.741: gtk_box_gadget_distribute: assertion 'size >= 0' failed in GtkScrollbar
05:52:05 
05:52:05 (SWT:1344): Gtk-CRITICAL **: 09:52:05.757: gtk_box_gadget_distribute: assertion 'size >= 0' failed in GtkScrollbar
05:52:05 
05:52:05 (SWT:1344): Gtk-WARNING **: 09:52:05.872: Negative content width -6 (allocation 1, extents 4x3) while allocating gadget (node toolbar, owner GtkToolbar)
05:52:06 
05:52:06 (SWT:1344): Gtk-WARNING **: 09:52:06.987: Negative content width -9 (allocation 9, extents 9x9) while allocating gadget (node entry, owner GtkEntry)
05:52:06 *** BUG ***
05:52:06 In pixman_region32_init_rect: Invalid rectangle passed
05:52:06 Set a breakpoint on '_pixman_log_error' to debug
05:52:06 
05:52:07 
05:52:07 (SWT:1344): Gtk-CRITICAL **: 09:52:07.026: gtk_box_gadget_distribute: assertion 'size >= 0' failed in GtkScrollbar
05:52:07 
05:52:07 (SWT:1344): Gtk-CRITICAL **: 09:52:07.033: gtk_box_gadget_distribute: assertion 'size >= 0' failed in GtkScrollbar
05:52:07 
05:52:07 (SWT:1344): Gtk-WARNING **: 09:52:07.039: Negative content width -6 (allocation 1, extents 4x3) while allocating gadget (node toolbar, owner GtkToolbar)
05:52:07 
05:52:07 (SWT:1344): Gtk-CRITICAL **: 09:52:07.059: gtk_box_gadget_distribute: assertion 'size >= 0' failed in GtkScrollbar
05:52:07 
05:52:07 (SWT:1344): Gtk-CRITICAL **: 09:52:07.066: gtk_box_gadget_distribute: assertion 'size >= 0' failed in GtkScrollbar
05:52:07 
05:52:07 (SWT:1344): Gtk-CRITICAL **: 09:52:07.075: gtk_box_gadget_distribute: assertion 'size >= 0' failed in GtkScrollbar
05:52:07 
05:52:07 (SWT:1344): Gtk-CRITICAL **: 09:52:07.076: gtk_box_gadget_distribute: assertion 'size >= 0' failed in GtkScrollbar
05:52:07 
05:52:07 (SWT:1344): Gtk-CRITICAL **: 09:52:07.077: gtk_box_gadget_distribute: assertion 'size >= 0' failed in GtkScrollbar
05:52:07 
05:52:07 (SWT:1344): Gtk-CRITICAL **: 09:52:07.078: gtk_box_gadget_distribute: assertion 'size >= 0' failed in GtkScrollbar
05:52:07 
05:52:07 (SWT:1344): Gtk-CRITICAL **: 09:52:07.083: gtk_box_gadget_distribute: assertion 'size >= 0' failed in GtkScrollbar
05:52:07 
05:52:07 (SWT:1344): Gtk-CRITICAL **: 09:52:07.083: gtk_box_gadget_distribute: assertion 'size >= 0' failed in GtkScrollbar
05:52:07 
05:52:07 (SWT:1344): Gtk-CRITICAL **: 09:52:07.083: gtk_box_gadget_distribute: assertion 'size >= 0' failed in GtkScrollbar
05:52:07 
05:52:07 (SWT:1344): Gtk-CRITICAL **: 09:52:07.101: gtk_box_gadget_distribute: assertion 'size >= 0' failed in GtkScrollbar
05:52:07 
05:52:07 (SWT:1344): Gtk-WARNING **: 09:52:07.148: Negative content width -6 (allocation 1, extents 4x3) while allocating gadget (node toolbar, owner GtkToolbar)
05:52:07 
05:52:07 (SWT:1344): Gtk-WARNING **: 09:52:07.880: Negative content width -9 (allocation 9, extents 9x9) while allocating gadget (node entry, owner GtkEntry)
05:52:07 *** BUG ***
05:52:07 In pixman_region32_init_rect: Invalid rectangle passed
05:52:07 Set a breakpoint on '_pixman_log_error' to debug
05:52:07 
05:52:07 
05:52:07 (SWT:1344): Gtk-CRITICAL **: 09:52:07.923: gtk_box_gadget_distribute: assertion 'size >= 0' failed in GtkScrollbar
05:52:07 
05:52:07 (SWT:1344): Gtk-CRITICAL **: 09:52:07.935: gtk_box_gadget_distribute: assertion 'size >= 0' failed in GtkScrollbar
05:52:07 
05:52:07 (SWT:1344): Gtk-WARNING **: 09:52:07.941: Negative content width -6 (allocation 1, extents 4x3) while allocating gadget (node toolbar, owner GtkToolbar)
05:52:07 
05:52:07 (SWT:1344): Gtk-CRITICAL **: 09:52:07.962: gtk_box_gadget_distribute: assertion 'size >= 0' failed in GtkScrollbar
05:52:07 
05:52:07 (SWT:1344): Gtk-CRITICAL **: 09:52:07.968: gtk_box_gadget_distribute: assertion 'size >= 0' failed in GtkScrollbar
05:52:07 
05:52:07 (SWT:1344): Gtk-CRITICAL **: 09:52:07.978: gtk_box_gadget_distribute: assertion 'size >= 0' failed in GtkScrollbar
05:52:07 
05:52:07 (SWT:1344): Gtk-CRITICAL **: 09:52:07.978: gtk_box_gadget_distribute: assertion 'size >= 0' failed in GtkScrollbar
05:52:07 
05:52:07 (SWT:1344): Gtk-CRITICAL **: 09:52:07.980: gtk_box_gadget_distribute: assertion 'size >= 0' failed in GtkScrollbar
05:52:07 
05:52:07 (SWT:1344): Gtk-CRITICAL **: 09:52:07.980: gtk_box_gadget_distribute: assertion 'size >= 0' failed in GtkScrollbar
05:52:07 
05:52:07 (SWT:1344): Gtk-CRITICAL **: 09:52:07.985: gtk_box_gadget_distribute: assertion 'size >= 0' failed in GtkScrollbar
05:52:07 
05:52:07 (SWT:1344): Gtk-CRITICAL **: 09:52:07.986: gtk_box_gadget_distribute: assertion 'size >= 0' failed in GtkScrollbar
05:52:07 
05:52:07 (SWT:1344): Gtk-CRITICAL **: 09:52:07.986: gtk_box_gadget_distribute: assertion 'size >= 0' failed in GtkScrollbar
05:52:08 
05:52:08 (SWT:1344): Gtk-CRITICAL **: 09:52:08.005: gtk_box_gadget_distribute: assertion 'size >= 0' failed in GtkScrollbar
05:52:08 
05:52:08 (SWT:1344): Gtk-WARNING **: 09:52:08.047: Negative content width -6 (allocation 1, extents 4x3) while allocating gadget (node toolbar, owner GtkToolbar)
05:52:08 Tests run: 4, Failures: 0, Errors: 0, Skipped: 0, Time elapsed: 3.968 s - in org.eclipse.egit.ui.test.team.actions.CommitActionStagingViewTest
05:52:08 testCommitWithoutAutoStage(org.eclipse.egit.ui.test.team.actions.CommitActionStagingViewTest)  Time elapsed: 0.844 s
05:52:08 testOpenStagingViewNoLinkWithSelection(org.eclipse.egit.ui.test.team.actions.CommitActionStagingViewTest)  Time elapsed: 0.936 s
05:52:08 testCommitWithAutoStageWithUntracked(org.eclipse.egit.ui.test.team.actions.CommitActionStagingViewTest)  Time elapsed: 1.279 s
05:52:08 testCommitWithAutoStageNoUntracked(org.eclipse.egit.ui.test.team.actions.CommitActionStagingViewTest)  Time elapsed: 0.897 s
05:52:08 Running org.eclipse.egit.ui.test.team.actions.CommitActionTest
05:52:20 Tests run: 7, Failures: 0, Errors: 0, Skipped: 0, Time elapsed: 12.188 s - in org.eclipse.egit.ui.test.team.actions.CommitActionTest
05:52:20 testIncludeUntracked(org.eclipse.egit.ui.test.team.actions.CommitActionTest)  Time elapsed: 1.25 s
05:52:20 testAmend(org.eclipse.egit.ui.test.team.actions.CommitActionTest)  Time elapsed: 2.091 s
05:52:20 testCommitSingleFile(org.eclipse.egit.ui.test.team.actions.CommitActionTest)  Time elapsed: 1.952 s
05:52:20 testSortingByName(org.eclipse.egit.ui.test.team.actions.CommitActionTest)  Time elapsed: 1.48 s
05:52:20 testOpenCommitWithoutChanged(org.eclipse.egit.ui.test.team.actions.CommitActionTest)  Time elapsed: 1.127 s
05:52:20 testAmendWithChangeIdPreferenceOff(org.eclipse.egit.ui.test.team.actions.CommitActionTest)  Time elapsed: 2.121 s
05:52:20 testLaunchedWithAmend(org.eclipse.egit.ui.test.team.actions.CommitActionTest)  Time elapsed: 2.149 s
05:52:20 Running org.eclipse.egit.ui.test.team.actions.MergeToolTest
05:52:21 
05:52:21 (SWT:1344): Gtk-WARNING **: 09:52:21.220: Negative content width -6 (allocation 1, extents 4x3) while allocating gadget (node toolbar, owner GtkToolbar)
05:52:21 
05:52:21 (SWT:1344): Gtk-WARNING **: 09:52:21.220: Negative content height -3 (allocation 1, extents 2x2) while allocating gadget (node toolbar, owner GtkToolbar)
05:52:21 
05:52:21 (SWT:1344): Gtk-WARNING **: 09:52:21.221: Negative content width -6 (allocation 1, extents 4x3) while allocating gadget (node toolbar, owner GtkToolbar)
05:52:21 
05:52:21 (SWT:1344): Gtk-WARNING **: 09:52:21.221: Negative content height -3 (allocation 1, extents 2x2) while allocating gadget (node toolbar, owner GtkToolbar)
05:52:21 
05:52:21 (SWT:1344): Gtk-WARNING **: 09:52:21.559: Negative content width -6 (allocation 1, extents 4x3) while allocating gadget (node toolbar, owner GtkToolbar)
05:52:21 
05:52:21 (SWT:1344): Gtk-WARNING **: 09:52:21.564: Negative content width -6 (allocation 1, extents 4x3) while allocating gadget (node toolbar, owner GtkToolbar)
05:52:21 
05:52:21 (SWT:1344): Gtk-WARNING **: 09:52:21.569: Negative content width -6 (allocation 1, extents 4x3) while allocating gadget (node toolbar, owner GtkToolbar)
05:52:21 
05:52:21 (SWT:1344): Gtk-WARNING **: 09:52:21.576: Negative content width -6 (allocation 1, extents 4x3) while allocating gadget (node toolbar, owner GtkToolbar)
05:52:21 
05:52:21 (SWT:1344): Gtk-WARNING **: 09:52:21.611: Negative content width -6 (allocation 1, extents 4x3) while allocating gadget (node toolbar, owner GtkToolbar)
05:52:21 
05:52:21 (SWT:1344): Gtk-WARNING **: 09:52:21.611: Negative content width -6 (allocation 1, extents 4x3) while allocating gadget (node toolbar, owner GtkToolbar)
05:52:21 
05:52:21 (SWT:1344): Gtk-WARNING **: 09:52:21.657: Negative content width -6 (allocation 1, extents 4x3) while allocating gadget (node toolbar, owner GtkToolbar)
05:52:21 
05:52:21 (SWT:1344): Gtk-WARNING **: 09:52:21.659: Negative content width -6 (allocation 1, extents 4x3) while allocating gadget (node toolbar, owner GtkToolbar)
05:52:22 Tests run: 1, Failures: 0, Errors: 0, Skipped: 0, Time elapsed: 1.956 s - in org.eclipse.egit.ui.test.team.actions.MergeToolTest
05:52:22 useHeadOptionShouldCauseFileToNotHaveConflictMarkers(org.eclipse.egit.ui.test.team.actions.MergeToolTest)  Time elapsed: 1.951 s
05:52:22 Running org.eclipse.egit.ui.test.team.actions.FetchAndMergeActionTest
05:52:26 Tests run: 2, Failures: 0, Errors: 0, Skipped: 0, Time elapsed: 4.402 s - in org.eclipse.egit.ui.test.team.actions.FetchAndMergeActionTest
05:52:26 testMergeSquash(org.eclipse.egit.ui.test.team.actions.FetchAndMergeActionTest)  Time elapsed: 2.114 s
05:52:26 testFetchFromOriginThenMerge(org.eclipse.egit.ui.test.team.actions.FetchAndMergeActionTest)  Time elapsed: 2.277 s
05:52:26 Running org.eclipse.egit.ui.test.team.actions.ShowInTest
05:52:57 
05:52:57 (SWT:1344): Gtk-WARNING **: 09:52:57.161: Negative content width -6 (allocation 1, extents 4x3) while allocating gadget (node toolbar, owner GtkToolbar)
05:52:57 
05:52:57 (SWT:1344): Gtk-WARNING **: 09:52:57.228: Negative content width -6 (allocation 1, extents 4x3) while allocating gadget (node toolbar, owner GtkToolbar)
05:53:28 
05:53:28 (SWT:1344): Gtk-WARNING **: 09:53:28.313: Negative content width -6 (allocation 1, extents 4x3) while allocating gadget (node toolbar, owner GtkToolbar)
05:53:28 
05:53:28 (SWT:1344): Gtk-WARNING **: 09:53:28.314: Negative content width -6 (allocation 1, extents 4x3) while allocating gadget (node toolbar, owner GtkToolbar)
05:53:28 
05:53:28 (SWT:1344): Gtk-WARNING **: 09:53:28.340: Negative content width -6 (allocation 1, extents 4x3) while allocating gadget (node toolbar, owner GtkToolbar)
05:53:28 
05:53:28 (SWT:1344): Gtk-CRITICAL **: 09:53:28.363: gtk_box_gadget_distribute: assertion 'size >= 0' failed in GtkScrollbar
05:53:28 
05:53:28 (SWT:1344): Gtk-WARNING **: 09:53:28.408: Negative content width -6 (allocation 1, extents 4x3) while allocating gadget (node toolbar, owner GtkToolbar)
05:53:29 Tests run: 4, Failures: 0, Errors: 0, Skipped: 0, Time elapsed: 62.426 s - in org.eclipse.egit.ui.test.team.actions.ShowInTest
05:53:29 testOpenRepoView(org.eclipse.egit.ui.test.team.actions.ShowInTest)  Time elapsed: 30.622 s
05:53:29 testOpenRepoViewMultiSelection(org.eclipse.egit.ui.test.team.actions.ShowInTest)  Time elapsed: 0.495 s
05:53:29 testOpenHistory(org.eclipse.egit.ui.test.team.actions.ShowInTest)  Time elapsed: 30.821 s
05:53:29 testOpenHistoryMultiSelection(org.eclipse.egit.ui.test.team.actions.ShowInTest)  Time elapsed: 0.478 s
05:53:29 Running org.eclipse.egit.ui.test.team.actions.TagActionTest
05:53:32 Tests run: 4, Failures: 0, Errors: 0, Skipped: 0, Time elapsed: 3.71 s - in org.eclipse.egit.ui.test.team.actions.TagActionTest
05:53:32 testCreateTagAndStartPush(org.eclipse.egit.ui.test.team.actions.TagActionTest)  Time elapsed: 0.905 s
05:53:32 testTagDialogShowExistingTags(org.eclipse.egit.ui.test.team.actions.TagActionTest)  Time elapsed: 0.784 s
05:53:32 testChangeTagMessage(org.eclipse.egit.ui.test.team.actions.TagActionTest)  Time elapsed: 1.207 s
05:53:32 testCreateTag(org.eclipse.egit.ui.test.team.actions.TagActionTest)  Time elapsed: 0.802 s
05:53:32 Running org.eclipse.egit.ui.test.team.actions.CompareActionsTest
05:53:33 
05:53:33 (SWT:1344): Gtk-WARNING **: 09:53:33.506: Negative content width -6 (allocation 1, extents 4x3) while allocating gadget (node toolbar, owner GtkToolbar)
05:53:33 
05:53:33 (SWT:1344): Gtk-WARNING **: 09:53:33.586: Negative content width -6 (allocation 1, extents 4x3) while allocating gadget (node toolbar, owner GtkToolbar)
05:53:33 
05:53:33 (SWT:1344): Gtk-WARNING **: 09:53:33.729: Negative content width -6 (allocation 1, extents 4x3) while allocating gadget (node toolbar, owner GtkToolbar)
05:53:33 
05:53:33 (SWT:1344): Gtk-WARNING **: 09:53:33.805: Negative content width -6 (allocation 1, extents 4x3) while allocating gadget (node toolbar, owner GtkToolbar)
05:53:33 
05:53:33 (SWT:1344): Gtk-WARNING **: 09:53:33.950: Negative content width -6 (allocation 1, extents 4x3) while allocating gadget (node toolbar, owner GtkToolbar)
05:53:34 
05:53:34 (SWT:1344): Gtk-WARNING **: 09:53:34.065: Negative content width -6 (allocation 1, extents 4x3) while allocating gadget (node toolbar, owner GtkToolbar)
05:53:34 
05:53:34 (SWT:1344): Gtk-WARNING **: 09:53:34.223: Negative content width -6 (allocation 1, extents 4x3) while allocating gadget (node toolbar, owner GtkToolbar)
05:53:34 
05:53:34 (SWT:1344): Gtk-WARNING **: 09:53:34.291: Negative content width -6 (allocation 1, extents 4x3) while allocating gadget (node toolbar, owner GtkToolbar)
05:53:35 
05:53:35 (SWT:1344): Gtk-WARNING **: 09:53:35.426: Negative content width -6 (allocation 1, extents 4x3) while allocating gadget (node toolbar, owner GtkToolbar)
05:53:35 
05:53:35 (SWT:1344): Gtk-WARNING **: 09:53:35.502: Negative content width -6 (allocation 1, extents 4x3) while allocating gadget (node toolbar, owner GtkToolbar)
05:53:36 
05:53:36 (SWT:1344): Gtk-WARNING **: 09:53:36.107: Negative content width -6 (allocation 1, extents 4x3) while allocating gadget (node toolbar, owner GtkToolbar)
05:53:36 
05:53:36 (SWT:1344): Gtk-WARNING **: 09:53:36.119: Negative content width -1 (allocation 1, extents 1x1) while allocating gadget (node trough, owner GtkProgressBar)
05:53:36 
05:53:36 (SWT:1344): Gtk-WARNING **: 09:53:36.122: Negative content height -1 (allocation 1, extents 1x1) while allocating gadget (node scrolledwindow, owner GtkScrolledWindow)
05:53:36 
05:53:36 (SWT:1344): Gtk-WARNING **: 09:53:36.134: Negative content height -1 (allocation 1, extents 1x1) while allocating gadget (node scrolledwindow, owner GtkScrolledWindow)
05:53:36 
05:53:36 (SWT:1344): Gtk-WARNING **: 09:53:36.426: Negative content width -6 (allocation 1, extents 4x3) while allocating gadget (node toolbar, owner GtkToolbar)
05:53:37 
05:53:37 (SWT:1344): Gtk-WARNING **: 09:53:37.592: Negative content width -6 (allocation 1, extents 4x3) while allocating gadget (node toolbar, owner GtkToolbar)
05:53:37 
05:53:37 (SWT:1344): Gtk-WARNING **: 09:53:37.618: Negative content width -1 (allocation 1, extents 1x1) while allocating gadget (node trough, owner GtkProgressBar)
05:53:37 
05:53:37 (SWT:1344): Gtk-WARNING **: 09:53:37.624: Negative content height -1 (allocation 1, extents 1x1) while allocating gadget (node scrolledwindow, owner GtkScrolledWindow)
05:53:37 
05:53:37 (SWT:1344): Gtk-WARNING **: 09:53:37.789: Negative content width -6 (allocation 1, extents 4x3) while allocating gadget (node toolbar, owner GtkToolbar)
05:53:38 
05:53:38 (SWT:1344): Gtk-WARNING **: 09:53:38.258: Negative content width -6 (allocation 1, extents 4x3) while allocating gadget (node toolbar, owner GtkToolbar)
05:53:38 
05:53:38 (SWT:1344): Gtk-WARNING **: 09:53:38.285: Negative content width -1 (allocation 1, extents 1x1) while allocating gadget (node trough, owner GtkProgressBar)
05:53:38 
05:53:38 (SWT:1344): Gtk-WARNING **: 09:53:38.290: Negative content height -1 (allocation 1, extents 1x1) while allocating gadget (node scrolledwindow, owner GtkScrolledWindow)
05:53:38 
05:53:38 (SWT:1344): Gtk-WARNING **: 09:53:38.526: Negative content width -6 (allocation 1, extents 4x3) while allocating gadget (node toolbar, owner GtkToolbar)
05:53:38 
05:53:38 (SWT:1344): Gtk-WARNING **: 09:53:38.960: Negative content width -1 (allocation 1, extents 1x1) while allocating gadget (node trough, owner GtkProgressBar)
05:53:38 
05:53:38 (SWT:1344): Gtk-WARNING **: 09:53:38.982: Negative content width -1 (allocation 1, extents 1x1) while allocating gadget (node trough, owner GtkProgressBar)
05:53:38 
05:53:38 (SWT:1344): Gtk-WARNING **: 09:53:38.989: Negative content width -1 (allocation 1, extents 1x1) while allocating gadget (node trough, owner GtkProgressBar)
05:53:39 
05:53:39 (SWT:1344): Gtk-WARNING **: 09:53:39.042: Negative content width -6 (allocation 1, extents 4x3) while allocating gadget (node toolbar, owner GtkToolbar)
05:53:39 
05:53:39 (SWT:1344): Gtk-WARNING **: 09:53:39.071: Negative content width -1 (allocation 1, extents 1x1) while allocating gadget (node trough, owner GtkProgressBar)
05:53:39 
05:53:39 (SWT:1344): Gtk-WARNING **: 09:53:39.075: Negative content height -1 (allocation 1, extents 1x1) while allocating gadget (node scrolledwindow, owner GtkScrolledWindow)
05:53:39 
05:53:39 (SWT:1344): Gtk-WARNING **: 09:53:39.369: Negative content width -6 (allocation 1, extents 4x3) while allocating gadget (node toolbar, owner GtkToolbar)
05:53:39 
05:53:39 (SWT:1344): Gtk-WARNING **: 09:53:39.792: Negative content width -1 (allocation 1, extents 1x1) while allocating gadget (node trough, owner GtkProgressBar)
05:53:39 
05:53:39 (SWT:1344): Gtk-WARNING **: 09:53:39.812: Negative content width -1 (allocation 1, extents 1x1) while allocating gadget (node trough, owner GtkProgressBar)
05:53:39 
05:53:39 (SWT:1344): Gtk-WARNING **: 09:53:39.822: Negative content width -1 (allocation 1, extents 1x1) while allocating gadget (node trough, owner GtkProgressBar)
05:53:39 
05:53:39 (SWT:1344): Gtk-WARNING **: 09:53:39.836: Negative content width -1 (allocation 1, extents 1x1) while allocating gadget (node trough, owner GtkProgressBar)
05:53:39 
05:53:39 (SWT:1344): Gtk-WARNING **: 09:53:39.856: Negative content width -1 (allocation 1, extents 1x1) while allocating gadget (node trough, owner GtkProgressBar)
05:53:39 
05:53:39 (SWT:1344): Gtk-WARNING **: 09:53:39.862: Negative content width -1 (allocation 1, extents 1x1) while allocating gadget (node trough, owner GtkProgressBar)
05:53:39 
05:53:39 (SWT:1344): Gtk-WARNING **: 09:53:39.911: Negative content width -6 (allocation 1, extents 4x3) while allocating gadget (node toolbar, owner GtkToolbar)
05:53:39 
05:53:39 (SWT:1344): Gtk-WARNING **: 09:53:39.945: Negative content width -1 (allocation 1, extents 1x1) while allocating gadget (node trough, owner GtkProgressBar)
05:53:39 
05:53:39 (SWT:1344): Gtk-WARNING **: 09:53:39.950: Negative content height -1 (allocation 1, extents 1x1) while allocating gadget (node scrolledwindow, owner GtkScrolledWindow)
05:53:40 
05:53:40 (SWT:1344): Gtk-WARNING **: 09:53:40.211: Negative content width -6 (allocation 1, extents 4x3) while allocating gadget (node toolbar, owner GtkToolbar)
05:53:40 
05:53:40 (SWT:1344): Gtk-WARNING **: 09:53:40.253: Negative content width -1 (allocation 1, extents 1x1) while allocating gadget (node trough, owner GtkProgressBar)
05:53:40 
05:53:40 (SWT:1344): Gtk-WARNING **: 09:53:40.285: Negative content width -1 (allocation 1, extents 1x1) while allocating gadget (node trough, owner GtkProgressBar)
05:53:40 
05:53:40 (SWT:1344): Gtk-WARNING **: 09:53:40.312: Negative content width -1 (allocation 1, extents 1x1) while allocating gadget (node trough, owner GtkProgressBar)
05:53:41 
05:53:41 (SWT:1344): Gtk-WARNING **: 09:53:41.433: Negative content width -1 (allocation 1, extents 1x1) while allocating gadget (node trough, owner GtkProgressBar)
05:53:41 
05:53:41 (SWT:1344): Gtk-WARNING **: 09:53:41.458: Negative content width -1 (allocation 1, extents 1x1) while allocating gadget (node trough, owner GtkProgressBar)
05:53:41 
05:53:41 (SWT:1344): Gtk-WARNING **: 09:53:41.481: Negative content width -1 (allocation 1, extents 1x1) while allocating gadget (node trough, owner GtkProgressBar)
05:53:41 
05:53:41 (SWT:1344): Gtk-WARNING **: 09:53:41.504: Negative content width -1 (allocation 1, extents 1x1) while allocating gadget (node trough, owner GtkProgressBar)
05:53:41 
05:53:41 (SWT:1344): Gtk-WARNING **: 09:53:41.620: Negative content width -6 (allocation 1, extents 4x3) while allocating gadget (node toolbar, owner GtkToolbar)
05:53:41 
05:53:41 (SWT:1344): Gtk-WARNING **: 09:53:41.700: Negative content width -6 (allocation 1, extents 4x3) while allocating gadget (node toolbar, owner GtkToolbar)
05:53:42 
05:53:42 (SWT:1344): Gtk-WARNING **: 09:53:42.273: Negative content width -1 (allocation 1, extents 1x1) while allocating gadget (node trough, owner GtkProgressBar)
05:53:42 
05:53:42 (SWT:1344): Gtk-WARNING **: 09:53:42.277: Negative content width -1 (allocation 1, extents 1x1) while allocating gadget (node trough, owner GtkProgressBar)
05:53:42 
05:53:42 (SWT:1344): Gtk-WARNING **: 09:53:42.289: Negative content width -1 (allocation 1, extents 1x1) while allocating gadget (node trough, owner GtkProgressBar)
05:53:42 
05:53:42 (SWT:1344): Gtk-WARNING **: 09:53:42.294: Negative content width -1 (allocation 1, extents 1x1) while allocating gadget (node trough, owner GtkProgressBar)
05:53:42 
05:53:42 (SWT:1344): Gtk-WARNING **: 09:53:42.307: Negative content width -1 (allocation 1, extents 1x1) while allocating gadget (node trough, owner GtkProgressBar)
05:53:42 
05:53:42 (SWT:1344): Gtk-WARNING **: 09:53:42.311: Negative content width -1 (allocation 1, extents 1x1) while allocating gadget (node trough, owner GtkProgressBar)
05:53:42 
05:53:42 (SWT:1344): Gtk-WARNING **: 09:53:42.354: Negative content width -6 (allocation 1, extents 4x3) while allocating gadget (node toolbar, owner GtkToolbar)
05:53:42 
05:53:42 (SWT:1344): Gtk-WARNING **: 09:53:42.387: Negative content width -1 (allocation 1, extents 1x1) while allocating gadget (node trough, owner GtkProgressBar)
05:53:42 
05:53:42 (SWT:1344): Gtk-WARNING **: 09:53:42.391: Negative content height -1 (allocation 1, extents 1x1) while allocating gadget (node scrolledwindow, owner GtkScrolledWindow)
05:53:42 
05:53:42 (SWT:1344): Gtk-WARNING **: 09:53:42.717: Negative content width -6 (allocation 1, extents 4x3) while allocating gadget (node toolbar, owner GtkToolbar)
05:53:42 
05:53:42 (SWT:1344): Gtk-WARNING **: 09:53:42.966: Negative content width -1 (allocation 1, extents 1x1) while allocating gadget (node trough, owner GtkProgressBar)
05:53:45 
05:53:45 (SWT:1344): Gtk-WARNING **: 09:53:45.490: Negative content width -1 (allocation 1, extents 1x1) while allocating gadget (node trough, owner GtkProgressBar)
05:53:45 
05:53:45 (SWT:1344): Gtk-WARNING **: 09:53:45.513: Negative content width -1 (allocation 1, extents 1x1) while allocating gadget (node trough, owner GtkProgressBar)
05:53:45 
05:53:45 (SWT:1344): Gtk-WARNING **: 09:53:45.673: Negative content width -6 (allocation 1, extents 4x3) while allocating gadget (node toolbar, owner GtkToolbar)
05:53:45 
05:53:45 (SWT:1344): Gtk-WARNING **: 09:53:45.739: Negative content width -6 (allocation 1, extents 4x3) while allocating gadget (node toolbar, owner GtkToolbar)
05:53:45 Tests run: 6, Failures: 0, Errors: 0, Skipped: 0, Time elapsed: 13.041 s - in org.eclipse.egit.ui.test.team.actions.CompareActionsTest
05:53:45 testCompareWithIndex(org.eclipse.egit.ui.test.team.actions.CompareActionsTest)  Time elapsed: 1.529 s
05:53:45 testCompareWithCommit(org.eclipse.egit.ui.test.team.actions.CompareActionsTest)  Time elapsed: 2.179 s
05:53:45 testCompareWithHead(org.eclipse.egit.ui.test.team.actions.CompareActionsTest)  Time elapsed: 3.791 s
05:53:45 testCompareWithRef(org.eclipse.egit.ui.test.team.actions.CompareActionsTest)  Time elapsed: 2.501 s
05:53:45 testCompareWithPreviousWithMerge(org.eclipse.egit.ui.test.team.actions.CompareActionsTest)  Time elapsed: 1.607 s
05:53:45 testCompareWithPrevious(org.eclipse.egit.ui.test.team.actions.CompareActionsTest)  Time elapsed: 1.415 s
05:53:45 Running org.eclipse.egit.ui.test.team.actions.DisconnectConnectTest
05:53:46 
05:53:46 (SWT:1344): Gtk-WARNING **: 09:53:46.020: Negative content width -1 (allocation 1, extents 1x1) while allocating gadget (node trough, owner GtkProgressBar)
05:53:46 
05:53:46 (SWT:1344): Gtk-WARNING **: 09:53:46.040: Negative content width -1 (allocation 1, extents 1x1) while allocating gadget (node trough, owner GtkProgressBar)
05:53:46 
05:53:46 (SWT:1344): Gtk-WARNING **: 09:53:46.063: Negative content width -1 (allocation 1, extents 1x1) while allocating gadget (node trough, owner GtkProgressBar)
05:53:47 
05:53:47 (SWT:1344): Gtk-WARNING **: 09:53:47.397: Negative content height -1 (allocation 1, extents 1x1) while allocating gadget (node scrolledwindow, owner GtkScrolledWindow)
05:53:47 *** BUG ***
05:53:47 In pixman_region32_init_rect: Invalid rectangle passed
05:53:47 Set a breakpoint on '_pixman_log_error' to debug
05:53:47 
05:53:47 *** BUG ***
05:53:47 In pixman_region32_init_rect: Invalid rectangle passed
05:53:47 Set a breakpoint on '_pixman_log_error' to debug
05:53:47 
05:53:47 
05:53:47 (SWT:1344): Gtk-WARNING **: 09:53:47.397: gtk_widget_size_allocate(): attempt to allocate widget with width 6 and height -25
05:53:47 
05:53:47 (SWT:1344): Gtk-CRITICAL **: 09:53:47.397: gtk_box_gadget_distribute: assertion 'size >= 0' failed in GtkScrollbar
05:53:47 *** BUG ***
05:53:47 In pixman_region32_init_rect: Invalid rectangle passed
05:53:47 Set a breakpoint on '_pixman_log_error' to debug
05:53:47 
05:53:49 
05:53:49 (SWT:1344): Gtk-WARNING **: 09:53:49.923: Negative content height -1 (allocation 1, extents 1x1) while allocating gadget (node scrolledwindow, owner GtkScrolledWindow)
05:53:49 *** BUG ***
05:53:49 In pixman_region32_init_rect: Invalid rectangle passed
05:53:49 Set a breakpoint on '_pixman_log_error' to debug
05:53:49 
05:53:49 
05:53:49 (SWT:1344): Gtk-WARNING **: 09:53:49.923: gtk_widget_size_allocate(): attempt to allocate widget with width 6 and height -25
05:53:49 
05:53:49 (SWT:1344): Gtk-CRITICAL **: 09:53:49.923: gtk_box_gadget_distribute: assertion 'size >= 0' failed in GtkScrollbar
05:53:50 Tests run: 2, Failures: 0, Errors: 0, Skipped: 0, Time elapsed: 4.739 s - in org.eclipse.egit.ui.test.team.actions.DisconnectConnectTest
05:53:50 testDecorations(org.eclipse.egit.ui.test.team.actions.DisconnectConnectTest)  Time elapsed: 2.856 s
05:53:50 testDisconnectAndReconnect(org.eclipse.egit.ui.test.team.actions.DisconnectConnectTest)  Time elapsed: 1.877 s
05:53:50 Running org.eclipse.egit.ui.test.team.actions.ShowBlameActionHandlerTest
05:53:55 Tests run: 1, Failures: 0, Errors: 0, Skipped: 0, Time elapsed: 5.282 s - in org.eclipse.egit.ui.test.team.actions.ShowBlameActionHandlerTest
05:53:55 testShowAnnotationsFromProjectExplorer(org.eclipse.egit.ui.test.team.actions.ShowBlameActionHandlerTest)  Time elapsed: 5.273 s
05:53:55 Running org.eclipse.egit.ui.test.team.actions.BranchAndResetActionTest
05:54:04 
05:54:04 (SWT:1344): Gtk-CRITICAL **: 09:54:04.886: gtk_box_gadget_distribute: assertion 'size >= 0' failed in GtkScrollbar
05:54:04 
05:54:04 (SWT:1344): Gtk-CRITICAL **: 09:54:04.905: gtk_box_gadget_distribute: assertion 'size >= 0' failed in GtkScrollbar
05:54:04 
05:54:04 (SWT:1344): Gtk-CRITICAL **: 09:54:04.916: gtk_box_gadget_distribute: assertion 'size >= 0' failed in GtkScrollbar
05:54:04 
05:54:04 (SWT:1344): Gtk-CRITICAL **: 09:54:04.932: gtk_box_gadget_distribute: assertion 'size >= 0' failed in GtkScrollbar
05:54:04 
05:54:04 (SWT:1344): Gtk-CRITICAL **: 09:54:04.950: gtk_box_gadget_distribute: assertion 'size >= 0' failed in GtkScrollbar
05:54:04 
05:54:04 (SWT:1344): Gtk-CRITICAL **: 09:54:04.966: gtk_box_gadget_distribute: assertion 'size >= 0' failed in GtkScrollbar
05:54:04 
05:54:04 (SWT:1344): Gtk-CRITICAL **: 09:54:04.983: gtk_box_gadget_distribute: assertion 'size >= 0' failed in GtkScrollbar
05:54:05 
05:54:05 (SWT:1344): Gtk-CRITICAL **: 09:54:04.999: gtk_box_gadget_distribute: assertion 'size >= 0' failed in GtkScrollbar
05:54:11 
05:54:11 (SWT:1344): Gtk-CRITICAL **: 09:54:11.137: gtk_box_gadget_distribute: assertion 'size >= 0' failed in GtkScrollbar
05:54:11 
05:54:11 (SWT:1344): Gtk-CRITICAL **: 09:54:11.156: gtk_box_gadget_distribute: assertion 'size >= 0' failed in GtkScrollbar
05:54:11 
05:54:11 (SWT:1344): Gtk-CRITICAL **: 09:54:11.171: gtk_box_gadget_distribute: assertion 'size >= 0' failed in GtkScrollbar
05:54:11 
05:54:11 (SWT:1344): Gtk-CRITICAL **: 09:54:11.187: gtk_box_gadget_distribute: assertion 'size >= 0' failed in GtkScrollbar
05:54:11 
05:54:11 (SWT:1344): Gtk-CRITICAL **: 09:54:11.204: gtk_box_gadget_distribute: assertion 'size >= 0' failed in GtkScrollbar
05:54:11 
05:54:11 (SWT:1344): Gtk-CRITICAL **: 09:54:11.221: gtk_box_gadget_distribute: assertion 'size >= 0' failed in GtkScrollbar
05:54:11 
05:54:11 (SWT:1344): Gtk-CRITICAL **: 09:54:11.238: gtk_box_gadget_distribute: assertion 'size >= 0' failed in GtkScrollbar
05:54:11 
05:54:11 (SWT:1344): Gtk-CRITICAL **: 09:54:11.254: gtk_box_gadget_distribute: assertion 'size >= 0' failed in GtkScrollbar
05:54:11 Tests run: 9, Failures: 0, Errors: 0, Skipped: 0, Time elapsed: 15.513 s - in org.eclipse.egit.ui.test.team.actions.BranchAndResetActionTest
05:54:11 testCheckoutTags(org.eclipse.egit.ui.test.team.actions.BranchAndResetActionTest)  Time elapsed: 2.177 s
05:54:11 testCheckoutWithNonDeleted(org.eclipse.egit.ui.test.team.actions.BranchAndResetActionTest)  Time elapsed: 0.702 s
05:54:11 testCreateDeleteBranch(org.eclipse.egit.ui.test.team.actions.BranchAndResetActionTest)  Time elapsed: 1.303 s
05:54:11 testCreateBranchSelectSource(org.eclipse.egit.ui.test.team.actions.BranchAndResetActionTest)  Time elapsed: 1.376 s
05:54:11 testCheckoutLocalBranches(org.eclipse.egit.ui.test.team.actions.BranchAndResetActionTest)  Time elapsed: 2.009 s
05:54:11 testCheckoutWithConflictsAndReset(org.eclipse.egit.ui.test.team.actions.BranchAndResetActionTest)  Time elapsed: 2.32 s
05:54:11 testRenameBranch(org.eclipse.egit.ui.test.team.actions.BranchAndResetActionTest)  Time elapsed: 2.168 s
05:54:11 testResetToLocalBranch(org.eclipse.egit.ui.test.team.actions.BranchAndResetActionTest)  Time elapsed: 2.005 s
05:54:11 testCheckoutWithConflicts(org.eclipse.egit.ui.test.team.actions.BranchAndResetActionTest)  Time elapsed: 1.426 s
05:54:11 Running org.eclipse.egit.ui.test.team.actions.CreatePatchActionTest
05:54:19 Tests run: 6, Failures: 0, Errors: 0, Skipped: 0, Time elapsed: 7.66 s - in org.eclipse.egit.ui.test.team.actions.CreatePatchActionTest
05:54:19 testNoChangesInSelection(org.eclipse.egit.ui.test.team.actions.CreatePatchActionTest)  Time elapsed: 0.892 s
05:54:19 testWorkspaceHeader(org.eclipse.egit.ui.test.team.actions.CreatePatchActionTest)  Time elapsed: 1.527 s
05:54:19 testClipboard(org.eclipse.egit.ui.test.team.actions.CreatePatchActionTest)  Time elapsed: 1.487 s
05:54:19 testWorkspace(org.eclipse.egit.ui.test.team.actions.CreatePatchActionTest)  Time elapsed: 1.53 s
05:54:19 testNoChanges(org.eclipse.egit.ui.test.team.actions.CreatePatchActionTest)  Time elapsed: 0.722 s
05:54:19 testFilesystem(org.eclipse.egit.ui.test.team.actions.CreatePatchActionTest)  Time elapsed: 1.482 s
05:54:19 Running org.eclipse.egit.ui.test.stagview.CommitMessageProvidersTest
05:54:19 
05:54:19 (SWT:1344): Gtk-WARNING **: 09:54:19.598: Negative content width -6 (allocation 1, extents 4x3) while allocating gadget (node toolbar, owner GtkToolbar)
05:54:20 
05:54:20 (SWT:1344): Gtk-WARNING **: 09:54:20.016: Negative content width -9 (allocation 9, extents 9x9) while allocating gadget (node entry, owner GtkEntry)
05:54:20 
05:54:20 (SWT:1344): Gtk-CRITICAL **: 09:54:20.056: gtk_box_gadget_distribute: assertion 'size >= 0' failed in GtkScrollbar
05:54:20 
05:54:20 (SWT:1344): Gtk-CRITICAL **: 09:54:20.065: gtk_box_gadget_distribute: assertion 'size >= 0' failed in GtkScrollbar
05:54:20 
05:54:20 (SWT:1344): Gtk-WARNING **: 09:54:20.070: Negative content width -6 (allocation 1, extents 4x3) while allocating gadget (node toolbar, owner GtkToolbar)
05:54:20 
05:54:20 (SWT:1344): Gtk-CRITICAL **: 09:54:20.079: gtk_box_gadget_distribute: assertion 'size >= 0' failed in GtkScrollbar
05:54:20 
05:54:20 (SWT:1344): Gtk-CRITICAL **: 09:54:20.095: gtk_box_gadget_distribute: assertion 'size >= 0' failed in GtkScrollbar
05:54:20 
05:54:20 (SWT:1344): Gtk-CRITICAL **: 09:54:20.105: gtk_box_gadget_distribute: assertion 'size >= 0' failed in GtkScrollbar
05:54:20 
05:54:20 (SWT:1344): Gtk-CRITICAL **: 09:54:20.116: gtk_box_gadget_distribute: assertion 'size >= 0' failed in GtkScrollbar
05:54:20 
05:54:20 (SWT:1344): Gtk-CRITICAL **: 09:54:20.118: gtk_box_gadget_distribute: assertion 'size >= 0' failed in GtkScrollbar
05:54:20 
05:54:20 (SWT:1344): Gtk-CRITICAL **: 09:54:20.119: gtk_box_gadget_distribute: assertion 'size >= 0' failed in GtkScrollbar
05:54:20 
05:54:20 (SWT:1344): Gtk-CRITICAL **: 09:54:20.120: gtk_box_gadget_distribute: assertion 'size >= 0' failed in GtkScrollbar
05:54:20 
05:54:20 (SWT:1344): Gtk-CRITICAL **: 09:54:20.121: gtk_box_gadget_distribute: assertion 'size >= 0' failed in GtkScrollbar
05:54:20 
05:54:20 (SWT:1344): Gtk-CRITICAL **: 09:54:20.126: gtk_box_gadget_distribute: assertion 'size >= 0' failed in GtkScrollbar
05:54:20 
05:54:20 (SWT:1344): Gtk-CRITICAL **: 09:54:20.126: gtk_box_gadget_distribute: assertion 'size >= 0' failed in GtkScrollbar
05:54:20 
05:54:20 (SWT:1344): Gtk-CRITICAL **: 09:54:20.136: gtk_box_gadget_distribute: assertion 'size >= 0' failed in GtkScrollbar
05:54:20 
05:54:20 (SWT:1344): Gtk-CRITICAL **: 09:54:20.153: gtk_box_gadget_distribute: assertion 'size >= 0' failed in GtkScrollbar
05:54:20 
05:54:20 (SWT:1344): Gtk-CRITICAL **: 09:54:20.153: gtk_box_gadget_distribute: assertion 'size >= 0' failed in GtkScrollbar
05:54:20 
05:54:20 (SWT:1344): Gtk-CRITICAL **: 09:54:20.169: gtk_box_gadget_distribute: assertion 'size >= 0' failed in GtkScrollbar
05:54:20 
05:54:20 (SWT:1344): Gtk-CRITICAL **: 09:54:20.169: gtk_box_gadget_distribute: assertion 'size >= 0' failed in GtkScrollbar
05:54:20 
05:54:20 (SWT:1344): Gtk-CRITICAL **: 09:54:20.186: gtk_box_gadget_distribute: assertion 'size >= 0' failed in GtkScrollbar
05:54:20 
05:54:20 (SWT:1344): Gtk-CRITICAL **: 09:54:20.186: gtk_box_gadget_distribute: assertion 'size >= 0' failed in GtkScrollbar
05:54:20 
05:54:20 (SWT:1344): Gtk-CRITICAL **: 09:54:20.203: gtk_box_gadget_distribute: assertion 'size >= 0' failed in GtkScrollbar
05:54:20 
05:54:20 (SWT:1344): Gtk-CRITICAL **: 09:54:20.203: gtk_box_gadget_distribute: assertion 'size >= 0' failed in GtkScrollbar
05:54:20 
05:54:20 (SWT:1344): Gtk-CRITICAL **: 09:54:20.219: gtk_box_gadget_distribute: assertion 'size >= 0' failed in GtkScrollbar
05:54:20 
05:54:20 (SWT:1344): Gtk-CRITICAL **: 09:54:20.219: gtk_box_gadget_distribute: assertion 'size >= 0' failed in GtkScrollbar
05:54:20 
05:54:20 (SWT:1344): Gtk-CRITICAL **: 09:54:20.236: gtk_box_gadget_distribute: assertion 'size >= 0' failed in GtkScrollbar
05:54:20 
05:54:20 (SWT:1344): Gtk-CRITICAL **: 09:54:20.236: gtk_box_gadget_distribute: assertion 'size >= 0' failed in GtkScrollbar
05:54:20 
05:54:20 (SWT:1344): Gtk-CRITICAL **: 09:54:20.263: gtk_box_gadget_distribute: assertion 'size >= 0' failed in GtkScrollbar
05:54:20 
05:54:20 (SWT:1344): Gtk-CRITICAL **: 09:54:20.263: gtk_box_gadget_distribute: assertion 'size >= 0' failed in GtkScrollbar
05:54:20 
05:54:20 (SWT:1344): Gtk-CRITICAL **: 09:54:20.271: gtk_box_gadget_distribute: assertion 'size >= 0' failed in GtkScrollbar
05:54:20 
05:54:20 (SWT:1344): Gtk-CRITICAL **: 09:54:20.271: gtk_box_gadget_distribute: assertion 'size >= 0' failed in GtkScrollbar
05:54:20 
05:54:20 (SWT:1344): Gtk-CRITICAL **: 09:54:20.287: gtk_box_gadget_distribute: assertion 'size >= 0' failed in GtkScrollbar
05:54:20 
05:54:20 (SWT:1344): Gtk-CRITICAL **: 09:54:20.287: gtk_box_gadget_distribute: assertion 'size >= 0' failed in GtkScrollbar
05:54:20 
05:54:20 (SWT:1344): Gtk-CRITICAL **: 09:54:20.302: gtk_box_gadget_distribute: assertion 'size >= 0' failed in GtkScrollbar
05:54:20 
05:54:20 (SWT:1344): Gtk-CRITICAL **: 09:54:20.318: gtk_box_gadget_distribute: assertion 'size >= 0' failed in GtkScrollbar
05:54:20 
05:54:20 (SWT:1344): Gtk-CRITICAL **: 09:54:20.335: gtk_box_gadget_distribute: assertion 'size >= 0' failed in GtkScrollbar
05:54:20 
05:54:20 (SWT:1344): Gtk-CRITICAL **: 09:54:20.358: gtk_box_gadget_distribute: assertion 'size >= 0' failed in GtkScrollbar
05:54:20 
05:54:20 (SWT:1344): Gtk-CRITICAL **: 09:54:20.359: gtk_box_gadget_distribute: assertion 'size >= 0' failed in GtkScrollbar
05:54:20 
05:54:20 (SWT:1344): Gtk-CRITICAL **: 09:54:20.362: gtk_box_gadget_distribute: assertion 'size >= 0' failed in GtkScrollbar
05:54:20 
05:54:20 (SWT:1344): Gtk-WARNING **: 09:54:20.434: Negative content width -6 (allocation 1, extents 4x3) while allocating gadget (node toolbar, owner GtkToolbar)
05:54:21 
05:54:21 (SWT:1344): Gtk-WARNING **: 09:54:21.689: Negative content width -6 (allocation 1, extents 4x3) while allocating gadget (node toolbar, owner GtkToolbar)
05:54:21 
05:54:21 (SWT:1344): Gtk-WARNING **: 09:54:21.721: Negative content width -6 (allocation 1, extents 4x3) while allocating gadget (node toolbar, owner GtkToolbar)
05:54:22 
05:54:22 (SWT:1344): Gtk-WARNING **: 09:54:22.318: Negative content width -6 (allocation 1, extents 4x3) while allocating gadget (node toolbar, owner GtkToolbar)
05:54:22 
05:54:22 (SWT:1344): Gtk-WARNING **: 09:54:22.746: Negative content width -9 (allocation 9, extents 9x9) while allocating gadget (node entry, owner GtkEntry)
05:54:22 
05:54:22 (SWT:1344): Gtk-CRITICAL **: 09:54:22.785: gtk_box_gadget_distribute: assertion 'size >= 0' failed in GtkScrollbar
05:54:22 
05:54:22 (SWT:1344): Gtk-CRITICAL **: 09:54:22.796: gtk_box_gadget_distribute: assertion 'size >= 0' failed in GtkScrollbar
05:54:22 
05:54:22 (SWT:1344): Gtk-WARNING **: 09:54:22.802: Negative content width -6 (allocation 1, extents 4x3) while allocating gadget (node toolbar, owner GtkToolbar)
05:54:22 
05:54:22 (SWT:1344): Gtk-CRITICAL **: 09:54:22.813: gtk_box_gadget_distribute: assertion 'size >= 0' failed in GtkScrollbar
05:54:22 
05:54:22 (SWT:1344): Gtk-CRITICAL **: 09:54:22.836: gtk_box_gadget_distribute: assertion 'size >= 0' failed in GtkScrollbar
05:54:22 
05:54:22 (SWT:1344): Gtk-CRITICAL **: 09:54:22.842: gtk_box_gadget_distribute: assertion 'size >= 0' failed in GtkScrollbar
05:54:22 
05:54:22 (SWT:1344): Gtk-CRITICAL **: 09:54:22.847: gtk_box_gadget_distribute: assertion 'size >= 0' failed in GtkScrollbar
05:54:22 
05:54:22 (SWT:1344): Gtk-CRITICAL **: 09:54:22.855: gtk_box_gadget_distribute: assertion 'size >= 0' failed in GtkScrollbar
05:54:22 
05:54:22 !ENTRY org.eclipse.egit.ui 2 0 2019-03-28 09:54:22.875
05:54:22 !MESSAGE Found multiple implementations of ICommitMessageProvider2. Ignoring caret positioning for org.eclipse.egit.ui.test.stagview.CommitMessageProvidersTest$TestCommitMessageProvider.
05:54:22 
05:54:22 (SWT:1344): Gtk-CRITICAL **: 09:54:22.877: gtk_box_gadget_distribute: assertion 'size >= 0' failed in GtkScrollbar
05:54:22 
05:54:22 (SWT:1344): Gtk-CRITICAL **: 09:54:22.877: gtk_box_gadget_distribute: assertion 'size >= 0' failed in GtkScrollbar
05:54:22 
05:54:22 (SWT:1344): Gtk-CRITICAL **: 09:54:22.879: gtk_box_gadget_distribute: assertion 'size >= 0' failed in GtkScrollbar
05:54:22 
05:54:22 (SWT:1344): Gtk-CRITICAL **: 09:54:22.879: gtk_box_gadget_distribute: assertion 'size >= 0' failed in GtkScrollbar
05:54:22 
05:54:22 (SWT:1344): Gtk-CRITICAL **: 09:54:22.885: gtk_box_gadget_distribute: assertion 'size >= 0' failed in GtkScrollbar
05:54:22 
05:54:22 (SWT:1344): Gtk-CRITICAL **: 09:54:22.886: gtk_box_gadget_distribute: assertion 'size >= 0' failed in GtkScrollbar
05:54:22 
05:54:22 (SWT:1344): Gtk-CRITICAL **: 09:54:22.897: gtk_box_gadget_distribute: assertion 'size >= 0' failed in GtkScrollbar
05:54:22 
05:54:22 (SWT:1344): Gtk-CRITICAL **: 09:54:22.914: gtk_box_gadget_distribute: assertion 'size >= 0' failed in GtkScrollbar
05:54:22 
05:54:22 (SWT:1344): Gtk-CRITICAL **: 09:54:22.914: gtk_box_gadget_distribute: assertion 'size >= 0' failed in GtkScrollbar
05:54:22 
05:54:22 (SWT:1344): Gtk-CRITICAL **: 09:54:22.929: gtk_box_gadget_distribute: assertion 'size >= 0' failed in GtkScrollbar
05:54:22 
05:54:22 (SWT:1344): Gtk-CRITICAL **: 09:54:22.929: gtk_box_gadget_distribute: assertion 'size >= 0' failed in GtkScrollbar
05:54:22 
05:54:22 (SWT:1344): Gtk-CRITICAL **: 09:54:22.947: gtk_box_gadget_distribute: assertion 'size >= 0' failed in GtkScrollbar
05:54:22 
05:54:22 (SWT:1344): Gtk-CRITICAL **: 09:54:22.947: gtk_box_gadget_distribute: assertion 'size >= 0' failed in GtkScrollbar
05:54:22 
05:54:22 (SWT:1344): Gtk-CRITICAL **: 09:54:22.963: gtk_box_gadget_distribute: assertion 'size >= 0' failed in GtkScrollbar
05:54:22 
05:54:22 (SWT:1344): Gtk-CRITICAL **: 09:54:22.963: gtk_box_gadget_distribute: assertion 'size >= 0' failed in GtkScrollbar
05:54:22 
05:54:22 (SWT:1344): Gtk-CRITICAL **: 09:54:22.981: gtk_box_gadget_distribute: assertion 'size >= 0' failed in GtkScrollbar
05:54:22 
05:54:22 (SWT:1344): Gtk-CRITICAL **: 09:54:22.981: gtk_box_gadget_distribute: assertion 'size >= 0' failed in GtkScrollbar
05:54:22 
05:54:22 (SWT:1344): Gtk-CRITICAL **: 09:54:22.997: gtk_box_gadget_distribute: assertion 'size >= 0' failed in GtkScrollbar
05:54:22 
05:54:22 (SWT:1344): Gtk-CRITICAL **: 09:54:22.997: gtk_box_gadget_distribute: assertion 'size >= 0' failed in GtkScrollbar
05:54:23 
05:54:23 (SWT:1344): Gtk-CRITICAL **: 09:54:23.024: gtk_box_gadget_distribute: assertion 'size >= 0' failed in GtkScrollbar
05:54:23 
05:54:23 (SWT:1344): Gtk-CRITICAL **: 09:54:23.024: gtk_box_gadget_distribute: assertion 'size >= 0' failed in GtkScrollbar
05:54:23 
05:54:23 (SWT:1344): Gtk-CRITICAL **: 09:54:23.032: gtk_box_gadget_distribute: assertion 'size >= 0' failed in GtkScrollbar
05:54:23 
05:54:23 (SWT:1344): Gtk-CRITICAL **: 09:54:23.046: gtk_box_gadget_distribute: assertion 'size >= 0' failed in GtkScrollbar
05:54:23 
05:54:23 (SWT:1344): Gtk-CRITICAL **: 09:54:23.062: gtk_box_gadget_distribute: assertion 'size >= 0' failed in GtkScrollbar
05:54:23 
05:54:23 (SWT:1344): Gtk-CRITICAL **: 09:54:23.079: gtk_box_gadget_distribute: assertion 'size >= 0' failed in GtkScrollbar
05:54:23 
05:54:23 (SWT:1344): Gtk-CRITICAL **: 09:54:23.096: gtk_box_gadget_distribute: assertion 'size >= 0' failed in GtkScrollbar
05:54:23 
05:54:23 (SWT:1344): Gtk-CRITICAL **: 09:54:23.116: gtk_box_gadget_distribute: assertion 'size >= 0' failed in GtkScrollbar
05:54:23 
05:54:23 (SWT:1344): Gtk-CRITICAL **: 09:54:23.117: gtk_box_gadget_distribute: assertion 'size >= 0' failed in GtkScrollbar
05:54:23 
05:54:23 (SWT:1344): Gtk-CRITICAL **: 09:54:23.120: gtk_box_gadget_distribute: assertion 'size >= 0' failed in GtkScrollbar
05:54:23 
05:54:23 (SWT:1344): Gtk-WARNING **: 09:54:23.196: Negative content width -6 (allocation 1, extents 4x3) while allocating gadget (node toolbar, owner GtkToolbar)
05:54:24 
05:54:24 (SWT:1344): Gtk-WARNING **: 09:54:24.395: Negative content width -6 (allocation 1, extents 4x3) while allocating gadget (node toolbar, owner GtkToolbar)
05:54:24 
05:54:24 (SWT:1344): Gtk-WARNING **: 09:54:24.408: Negative content width -6 (allocation 1, extents 4x3) while allocating gadget (node toolbar, owner GtkToolbar)
05:54:25 
05:54:25 (SWT:1344): Gtk-WARNING **: 09:54:25.023: Negative content width -6 (allocation 1, extents 4x3) while allocating gadget (node toolbar, owner GtkToolbar)
05:54:25 
05:54:25 (SWT:1344): Gtk-WARNING **: 09:54:25.556: Negative content width -9 (allocation 9, extents 9x9) while allocating gadget (node entry, owner GtkEntry)
05:54:25 
05:54:25 (SWT:1344): Gtk-CRITICAL **: 09:54:25.597: gtk_box_gadget_distribute: assertion 'size >= 0' failed in GtkScrollbar
05:54:25 
05:54:25 (SWT:1344): Gtk-CRITICAL **: 09:54:25.606: gtk_box_gadget_distribute: assertion 'size >= 0' failed in GtkScrollbar
05:54:25 
05:54:25 (SWT:1344): Gtk-WARNING **: 09:54:25.612: Negative content width -6 (allocation 1, extents 4x3) while allocating gadget (node toolbar, owner GtkToolbar)
05:54:25 
05:54:25 (SWT:1344): Gtk-CRITICAL **: 09:54:25.622: gtk_box_gadget_distribute: assertion 'size >= 0' failed in GtkScrollbar
05:54:25 
05:54:25 (SWT:1344): Gtk-CRITICAL **: 09:54:25.628: gtk_box_gadget_distribute: assertion 'size >= 0' failed in GtkScrollbar
05:54:25 
05:54:25 (SWT:1344): Gtk-CRITICAL **: 09:54:25.630: gtk_box_gadget_distribute: assertion 'size >= 0' failed in GtkScrollbar
05:54:25 
05:54:25 (SWT:1344): Gtk-CRITICAL **: 09:54:25.630: gtk_box_gadget_distribute: assertion 'size >= 0' failed in GtkScrollbar
05:54:25 
05:54:25 (SWT:1344): Gtk-CRITICAL **: 09:54:25.631: gtk_box_gadget_distribute: assertion 'size >= 0' failed in GtkScrollbar
05:54:25 
05:54:25 (SWT:1344): Gtk-CRITICAL **: 09:54:25.631: gtk_box_gadget_distribute: assertion 'size >= 0' failed in GtkScrollbar
05:54:25 
05:54:25 (SWT:1344): Gtk-CRITICAL **: 09:54:25.637: gtk_box_gadget_distribute: assertion 'size >= 0' failed in GtkScrollbar
05:54:25 
05:54:25 (SWT:1344): Gtk-CRITICAL **: 09:54:25.637: gtk_box_gadget_distribute: assertion 'size >= 0' failed in GtkScrollbar
05:54:25 
05:54:25 (SWT:1344): Gtk-CRITICAL **: 09:54:25.648: gtk_box_gadget_distribute: assertion 'size >= 0' failed in GtkScrollbar
05:54:25 
05:54:25 (SWT:1344): Gtk-CRITICAL **: 09:54:25.662: gtk_box_gadget_distribute: assertion 'size >= 0' failed in GtkScrollbar
05:54:25 
05:54:25 (SWT:1344): Gtk-CRITICAL **: 09:54:25.662: gtk_box_gadget_distribute: assertion 'size >= 0' failed in GtkScrollbar
05:54:25 
05:54:25 (SWT:1344): Gtk-CRITICAL **: 09:54:25.679: gtk_box_gadget_distribute: assertion 'size >= 0' failed in GtkScrollbar
05:54:25 
05:54:25 (SWT:1344): Gtk-CRITICAL **: 09:54:25.679: gtk_box_gadget_distribute: assertion 'size >= 0' failed in GtkScrollbar
05:54:25 
05:54:25 (SWT:1344): Gtk-CRITICAL **: 09:54:25.696: gtk_box_gadget_distribute: assertion 'size >= 0' failed in GtkScrollbar
05:54:25 
05:54:25 (SWT:1344): Gtk-CRITICAL **: 09:54:25.696: gtk_box_gadget_distribute: assertion 'size >= 0' failed in GtkScrollbar
05:54:25 
05:54:25 (SWT:1344): Gtk-CRITICAL **: 09:54:25.712: gtk_box_gadget_distribute: assertion 'size >= 0' failed in GtkScrollbar
05:54:25 
05:54:25 (SWT:1344): Gtk-CRITICAL **: 09:54:25.712: gtk_box_gadget_distribute: assertion 'size >= 0' failed in GtkScrollbar
05:54:25 
05:54:25 (SWT:1344): Gtk-CRITICAL **: 09:54:25.729: gtk_box_gadget_distribute: assertion 'size >= 0' failed in GtkScrollbar
05:54:25 
05:54:25 (SWT:1344): Gtk-CRITICAL **: 09:54:25.729: gtk_box_gadget_distribute: assertion 'size >= 0' failed in GtkScrollbar
05:54:25 
05:54:25 (SWT:1344): Gtk-CRITICAL **: 09:54:25.745: gtk_box_gadget_distribute: assertion 'size >= 0' failed in GtkScrollbar
05:54:25 
05:54:25 (SWT:1344): Gtk-CRITICAL **: 09:54:25.745: gtk_box_gadget_distribute: assertion 'size >= 0' failed in GtkScrollbar
05:54:25 
05:54:25 (SWT:1344): Gtk-CRITICAL **: 09:54:25.778: gtk_box_gadget_distribute: assertion 'size >= 0' failed in GtkScrollbar
05:54:25 
05:54:25 (SWT:1344): Gtk-CRITICAL **: 09:54:25.778: gtk_box_gadget_distribute: assertion 'size >= 0' failed in GtkScrollbar
05:54:25 
05:54:25 (SWT:1344): Gtk-CRITICAL **: 09:54:25.788: gtk_box_gadget_distribute: assertion 'size >= 0' failed in GtkScrollbar
05:54:25 
05:54:25 (SWT:1344): Gtk-CRITICAL **: 09:54:25.788: gtk_box_gadget_distribute: assertion 'size >= 0' failed in GtkScrollbar
05:54:25 
05:54:25 (SWT:1344): Gtk-CRITICAL **: 09:54:25.799: gtk_box_gadget_distribute: assertion 'size >= 0' failed in GtkScrollbar
05:54:25 
05:54:25 (SWT:1344): Gtk-CRITICAL **: 09:54:25.799: gtk_box_gadget_distribute: assertion 'size >= 0' failed in GtkScrollbar
05:54:25 
05:54:25 (SWT:1344): Gtk-CRITICAL **: 09:54:25.814: gtk_box_gadget_distribute: assertion 'size >= 0' failed in GtkScrollbar
05:54:25 
05:54:25 (SWT:1344): Gtk-CRITICAL **: 09:54:25.814: gtk_box_gadget_distribute: assertion 'size >= 0' failed in GtkScrollbar
05:54:25 
05:54:25 (SWT:1344): Gtk-CRITICAL **: 09:54:25.819: gtk_box_gadget_distribute: assertion 'size >= 0' failed in GtkScrollbar
05:54:25 
05:54:25 (SWT:1344): Gtk-CRITICAL **: 09:54:25.819: gtk_box_gadget_distribute: assertion 'size >= 0' failed in GtkScrollbar
05:54:25 
05:54:25 (SWT:1344): Gtk-CRITICAL **: 09:54:25.819: gtk_box_gadget_distribute: assertion 'size >= 0' failed in GtkScrollbar
05:54:25 
05:54:25 (SWT:1344): Gtk-CRITICAL **: 09:54:25.845: gtk_box_gadget_distribute: assertion 'size >= 0' failed in GtkScrollbar
05:54:25 
05:54:25 (SWT:1344): Gtk-WARNING **: 09:54:25.902: Negative content width -6 (allocation 1, extents 4x3) while allocating gadget (node toolbar, owner GtkToolbar)
05:54:27 
05:54:27 (SWT:1344): Gtk-WARNING **: 09:54:27.060: Negative content width -6 (allocation 1, extents 4x3) while allocating gadget (node toolbar, owner GtkToolbar)
05:54:27 
05:54:27 (SWT:1344): Gtk-WARNING **: 09:54:27.075: Negative content width -6 (allocation 1, extents 4x3) while allocating gadget (node toolbar, owner GtkToolbar)
05:54:27 Tests run: 3, Failures: 0, Errors: 0, Skipped: 0, Time elapsed: 8.104 s - in org.eclipse.egit.ui.test.stagview.CommitMessageProvidersTest
05:54:27 testCaretPosition(org.eclipse.egit.ui.test.stagview.CommitMessageProvidersTest)  Time elapsed: 2.74 s
05:54:27 testTwoProvidersFromSameExtension(org.eclipse.egit.ui.test.stagview.CommitMessageProvidersTest)  Time elapsed: 2.689 s
05:54:27 testCaretPositionUndefined(org.eclipse.egit.ui.test.stagview.CommitMessageProvidersTest)  Time elapsed: 2.664 s
05:54:27 Running org.eclipse.egit.ui.test.stagview.StagingViewTest
05:54:27 
05:54:27 (SWT:1344): Gtk-WARNING **: 09:54:27.736: Negative content width -6 (allocation 1, extents 4x3) while allocating gadget (node toolbar, owner GtkToolbar)
05:54:28 
05:54:28 (SWT:1344): Gtk-WARNING **: 09:54:28.301: Negative content width -9 (allocation 9, extents 9x9) while allocating gadget (node entry, owner GtkEntry)
05:54:28 
05:54:28 (SWT:1344): Gtk-CRITICAL **: 09:54:28.339: gtk_box_gadget_distribute: assertion 'size >= 0' failed in GtkScrollbar
05:54:28 
05:54:28 (SWT:1344): Gtk-CRITICAL **: 09:54:28.348: gtk_box_gadget_distribute: assertion 'size >= 0' failed in GtkScrollbar
05:54:28 
05:54:28 (SWT:1344): Gtk-WARNING **: 09:54:28.354: Negative content width -6 (allocation 1, extents 4x3) while allocating gadget (node toolbar, owner GtkToolbar)
05:54:28 
05:54:28 (SWT:1344): Gtk-CRITICAL **: 09:54:28.363: gtk_box_gadget_distribute: assertion 'size >= 0' failed in GtkScrollbar
05:54:28 
05:54:28 (SWT:1344): Gtk-CRITICAL **: 09:54:28.370: gtk_box_gadget_distribute: assertion 'size >= 0' failed in GtkScrollbar
05:54:28 
05:54:28 (SWT:1344): Gtk-CRITICAL **: 09:54:28.371: gtk_box_gadget_distribute: assertion 'size >= 0' failed in GtkScrollbar
05:54:28 
05:54:28 (SWT:1344): Gtk-CRITICAL **: 09:54:28.372: gtk_box_gadget_distribute: assertion 'size >= 0' failed in GtkScrollbar
05:54:28 
05:54:28 (SWT:1344): Gtk-CRITICAL **: 09:54:28.377: gtk_box_gadget_distribute: assertion 'size >= 0' failed in GtkScrollbar
05:54:28 
05:54:28 (SWT:1344): Gtk-CRITICAL **: 09:54:28.378: gtk_box_gadget_distribute: assertion 'size >= 0' failed in GtkScrollbar
05:54:28 
05:54:28 (SWT:1344): Gtk-CRITICAL **: 09:54:28.445: gtk_box_gadget_distribute: assertion 'size >= 0' failed in GtkScrollbar
05:54:28 
05:54:28 (SWT:1344): Gtk-CRITICAL **: 09:54:28.445: gtk_box_gadget_distribute: assertion 'size >= 0' failed in GtkScrollbar
05:54:28 
05:54:28 (SWT:1344): Gtk-CRITICAL **: 09:54:28.452: gtk_box_gadget_distribute: assertion 'size >= 0' failed in GtkScrollbar
05:54:28 
05:54:28 (SWT:1344): Gtk-CRITICAL **: 09:54:28.462: gtk_box_gadget_distribute: assertion 'size >= 0' failed in GtkScrollbar
05:54:28 
05:54:28 (SWT:1344): Gtk-CRITICAL **: 09:54:28.462: gtk_box_gadget_distribute: assertion 'size >= 0' failed in GtkScrollbar
05:54:28 
05:54:28 (SWT:1344): Gtk-CRITICAL **: 09:54:28.478: gtk_box_gadget_distribute: assertion 'size >= 0' failed in GtkScrollbar
05:54:28 
05:54:28 (SWT:1344): Gtk-CRITICAL **: 09:54:28.478: gtk_box_gadget_distribute: assertion 'size >= 0' failed in GtkScrollbar
05:54:28 
05:54:28 (SWT:1344): Gtk-CRITICAL **: 09:54:28.494: gtk_box_gadget_distribute: assertion 'size >= 0' failed in GtkScrollbar
05:54:28 
05:54:28 (SWT:1344): Gtk-CRITICAL **: 09:54:28.494: gtk_box_gadget_distribute: assertion 'size >= 0' failed in GtkScrollbar
05:54:28 
05:54:28 (SWT:1344): Gtk-CRITICAL **: 09:54:28.512: gtk_box_gadget_distribute: assertion 'size >= 0' failed in GtkScrollbar
05:54:28 
05:54:28 (SWT:1344): Gtk-CRITICAL **: 09:54:28.512: gtk_box_gadget_distribute: assertion 'size >= 0' failed in GtkScrollbar
05:54:28 
05:54:28 (SWT:1344): Gtk-CRITICAL **: 09:54:28.528: gtk_box_gadget_distribute: assertion 'size >= 0' failed in GtkScrollbar
05:54:28 
05:54:28 (SWT:1344): Gtk-CRITICAL **: 09:54:28.528: gtk_box_gadget_distribute: assertion 'size >= 0' failed in GtkScrollbar
05:54:28 
05:54:28 (SWT:1344): Gtk-CRITICAL **: 09:54:28.545: gtk_box_gadget_distribute: assertion 'size >= 0' failed in GtkScrollbar
05:54:28 
05:54:28 (SWT:1344): Gtk-CRITICAL **: 09:54:28.545: gtk_box_gadget_distribute: assertion 'size >= 0' failed in GtkScrollbar
05:54:28 
05:54:28 (SWT:1344): Gtk-CRITICAL **: 09:54:28.569: gtk_box_gadget_distribute: assertion 'size >= 0' failed in GtkScrollbar
05:54:28 
05:54:28 (SWT:1344): Gtk-CRITICAL **: 09:54:28.600: gtk_box_gadget_distribute: assertion 'size >= 0' failed in GtkScrollbar
05:54:28 
05:54:28 (SWT:1344): Gtk-CRITICAL **: 09:54:28.612: gtk_box_gadget_distribute: assertion 'size >= 0' failed in GtkScrollbar
05:54:28 
05:54:28 (SWT:1344): Gtk-CRITICAL **: 09:54:28.627: gtk_box_gadget_distribute: assertion 'size >= 0' failed in GtkScrollbar
05:54:28 
05:54:28 (SWT:1344): Gtk-CRITICAL **: 09:54:28.643: gtk_box_gadget_distribute: assertion 'size >= 0' failed in GtkScrollbar
05:54:28 
05:54:28 (SWT:1344): Gtk-CRITICAL **: 09:54:28.661: gtk_box_gadget_distribute: assertion 'size >= 0' failed in GtkScrollbar
05:54:28 
05:54:28 (SWT:1344): Gtk-CRITICAL **: 09:54:28.673: gtk_box_gadget_distribute: assertion 'size >= 0' failed in GtkScrollbar
05:54:28 
05:54:28 (SWT:1344): Gtk-CRITICAL **: 09:54:28.673: gtk_box_gadget_distribute: assertion 'size >= 0' failed in GtkScrollbar
05:54:28 
05:54:28 (SWT:1344): Gtk-CRITICAL **: 09:54:28.674: gtk_box_gadget_distribute: assertion 'size >= 0' failed in GtkScrollbar
05:54:28 
05:54:28 (SWT:1344): Gtk-CRITICAL **: 09:54:28.675: gtk_box_gadget_distribute: assertion 'size >= 0' failed in GtkScrollbar
05:54:28 
05:54:28 (SWT:1344): Gtk-CRITICAL **: 09:54:28.678: gtk_box_gadget_distribute: assertion 'size >= 0' failed in GtkScrollbar
05:54:28 
05:54:28 (SWT:1344): Gtk-CRITICAL **: 09:54:28.687: gtk_box_gadget_distribute: assertion 'size >= 0' failed in GtkScrollbar
05:54:28 
05:54:28 (SWT:1344): Gtk-CRITICAL **: 09:54:28.693: gtk_box_gadget_distribute: assertion 'size >= 0' failed in GtkScrollbar
05:54:28 
05:54:28 (SWT:1344): Gtk-CRITICAL **: 09:54:28.693: gtk_box_gadget_distribute: assertion 'size >= 0' failed in GtkScrollbar
05:54:28 
05:54:28 (SWT:1344): Gtk-CRITICAL **: 09:54:28.700: gtk_box_gadget_distribute: assertion 'size >= 0' failed in GtkScrollbar
05:54:28 
05:54:28 (SWT:1344): Gtk-CRITICAL **: 09:54:28.702: gtk_box_gadget_distribute: assertion 'size >= 0' failed in GtkScrollbar
05:54:28 
05:54:28 (SWT:1344): Gtk-CRITICAL **: 09:54:28.702: gtk_box_gadget_distribute: assertion 'size >= 0' failed in GtkScrollbar
05:54:28 
05:54:28 (SWT:1344): Gtk-CRITICAL **: 09:54:28.703: gtk_box_gadget_distribute: assertion 'size >= 0' failed in GtkScrollbar
05:54:28 
05:54:28 (SWT:1344): Gtk-CRITICAL **: 09:54:28.705: gtk_box_gadget_distribute: assertion 'size >= 0' failed in GtkScrollbar
05:54:28 
05:54:28 (SWT:1344): Gtk-CRITICAL **: 09:54:28.706: gtk_box_gadget_distribute: assertion 'size >= 0' failed in GtkScrollbar
05:54:28 
05:54:28 (SWT:1344): Gtk-CRITICAL **: 09:54:28.707: gtk_box_gadget_distribute: assertion 'size >= 0' failed in GtkScrollbar
05:54:28 
05:54:28 (SWT:1344): Gtk-CRITICAL **: 09:54:28.717: gtk_box_gadget_distribute: assertion 'size >= 0' failed in GtkScrollbar
05:54:28 
05:54:28 (SWT:1344): Gtk-CRITICAL **: 09:54:28.717: gtk_box_gadget_distribute: assertion 'size >= 0' failed in GtkScrollbar
05:54:28 
05:54:28 (SWT:1344): Gtk-CRITICAL **: 09:54:28.757: gtk_box_gadget_distribute: assertion 'size >= 0' failed in GtkScrollbar
05:54:28 
05:54:28 (SWT:1344): Gtk-CRITICAL **: 09:54:28.763: gtk_box_gadget_distribute: assertion 'size >= 0' failed in GtkScrollbar
05:54:28 
05:54:28 (SWT:1344): Gtk-CRITICAL **: 09:54:28.764: gtk_box_gadget_distribute: assertion 'size >= 0' failed in GtkScrollbar
05:54:28 
05:54:28 (SWT:1344): Gtk-CRITICAL **: 09:54:28.764: gtk_box_gadget_distribute: assertion 'size >= 0' failed in GtkScrollbar
05:54:28 
05:54:28 (SWT:1344): Gtk-CRITICAL **: 09:54:28.768: gtk_box_gadget_distribute: assertion 'size >= 0' failed in GtkScrollbar
05:54:28 
05:54:28 (SWT:1344): Gtk-CRITICAL **: 09:54:28.784: gtk_box_gadget_distribute: assertion 'size >= 0' failed in GtkScrollbar
05:54:28 
05:54:28 (SWT:1344): Gtk-CRITICAL **: 09:54:28.813: gtk_box_gadget_distribute: assertion 'size >= 0' failed in GtkScrollbar
05:54:28 
05:54:28 (SWT:1344): Gtk-CRITICAL **: 09:54:28.816: gtk_box_gadget_distribute: assertion 'size >= 0' failed in GtkScrollbar
05:54:28 
05:54:28 (SWT:1344): Gtk-CRITICAL **: 09:54:28.816: gtk_box_gadget_distribute: assertion 'size >= 0' failed in GtkScrollbar
05:54:28 
05:54:28 (SWT:1344): Gtk-CRITICAL **: 09:54:28.828: gtk_box_gadget_distribute: assertion 'size >= 0' failed in GtkScrollbar
05:54:29 
05:54:29 (SWT:1344): Gtk-CRITICAL **: 09:54:29.321: gtk_box_gadget_distribute: assertion 'size >= 0' failed in GtkScrollbar
05:54:29 
05:54:29 (SWT:1344): Gtk-CRITICAL **: 09:54:29.331: gtk_box_gadget_distribute: assertion 'size >= 0' failed in GtkScrollbar
05:54:29 
05:54:29 (SWT:1344): Gtk-CRITICAL **: 09:54:29.345: gtk_box_gadget_distribute: assertion 'size >= 0' failed in GtkScrollbar
05:54:29 
05:54:29 (SWT:1344): Gtk-CRITICAL **: 09:54:29.357: gtk_box_gadget_distribute: assertion 'size >= 0' failed in GtkScrollbar
05:54:29 
05:54:29 (SWT:1344): Gtk-CRITICAL **: 09:54:29.358: gtk_box_gadget_distribute: assertion 'size >= 0' failed in GtkScrollbar
05:54:29 
05:54:29 (SWT:1344): Gtk-CRITICAL **: 09:54:29.359: gtk_box_gadget_distribute: assertion 'size >= 0' failed in GtkScrollbar
05:54:29 
05:54:29 (SWT:1344): Gtk-CRITICAL **: 09:54:29.360: gtk_box_gadget_distribute: assertion 'size >= 0' failed in GtkScrollbar
05:54:29 
05:54:29 (SWT:1344): Gtk-CRITICAL **: 09:54:29.363: gtk_box_gadget_distribute: assertion 'size >= 0' failed in GtkScrollbar
05:54:29 
05:54:29 (SWT:1344): Gtk-CRITICAL **: 09:54:29.372: gtk_box_gadget_distribute: assertion 'size >= 0' failed in GtkScrollbar
05:54:29 
05:54:29 (SWT:1344): Gtk-CRITICAL **: 09:54:29.438: gtk_box_gadget_distribute: assertion 'size >= 0' failed in GtkScrollbar
05:54:29 
05:54:29 (SWT:1344): Gtk-CRITICAL **: 09:54:29.439: gtk_box_gadget_distribute: assertion 'size >= 0' failed in GtkScrollbar
05:54:29 
05:54:29 (SWT:1344): Gtk-CRITICAL **: 09:54:29.441: gtk_box_gadget_distribute: assertion 'size >= 0' failed in GtkScrollbar
05:54:29 
05:54:29 (SWT:1344): Gtk-CRITICAL **: 09:54:29.464: gtk_box_gadget_distribute: assertion 'size >= 0' failed in GtkScrollbar
05:54:29 
05:54:29 (SWT:1344): Gtk-CRITICAL **: 09:54:29.464: gtk_box_gadget_distribute: assertion 'size >= 0' failed in GtkScrollbar
05:54:29 
05:54:29 (SWT:1344): Gtk-CRITICAL **: 09:54:29.556: gtk_box_gadget_distribute: assertion 'size >= 0' failed in GtkScrollbar
05:54:29 
05:54:29 (SWT:1344): Gtk-CRITICAL **: 09:54:29.562: gtk_box_gadget_distribute: assertion 'size >= 0' failed in GtkScrollbar
05:54:29 
05:54:29 (SWT:1344): Gtk-CRITICAL **: 09:54:29.563: gtk_box_gadget_distribute: assertion 'size >= 0' failed in GtkScrollbar
05:54:29 
05:54:29 (SWT:1344): Gtk-CRITICAL **: 09:54:29.564: gtk_box_gadget_distribute: assertion 'size >= 0' failed in GtkScrollbar
05:54:29 
05:54:29 (SWT:1344): Gtk-CRITICAL **: 09:54:29.567: gtk_box_gadget_distribute: assertion 'size >= 0' failed in GtkScrollbar
05:54:29 
05:54:29 (SWT:1344): Gtk-CRITICAL **: 09:54:29.580: gtk_box_gadget_distribute: assertion 'size >= 0' failed in GtkScrollbar
05:54:29 
05:54:29 (SWT:1344): Gtk-WARNING **: 09:54:29.653: Negative content width -6 (allocation 1, extents 4x3) while allocating gadget (node toolbar, owner GtkToolbar)
05:54:29 
05:54:29 (SWT:1344): Gtk-WARNING **: 09:54:29.993: Negative content width -6 (allocation 1, extents 4x3) while allocating gadget (node toolbar, owner GtkToolbar)
05:54:30 
05:54:30 (SWT:1344): Gtk-WARNING **: 09:54:30.020: Negative content width -6 (allocation 1, extents 4x3) while allocating gadget (node toolbar, owner GtkToolbar)
05:54:30 
05:54:30 (SWT:1344): Gtk-WARNING **: 09:54:30.657: Negative content width -6 (allocation 1, extents 4x3) while allocating gadget (node toolbar, owner GtkToolbar)
05:54:30 
05:54:30 (SWT:1344): Gtk-WARNING **: 09:54:30.972: Negative content width -9 (allocation 9, extents 9x9) while allocating gadget (node entry, owner GtkEntry)
05:54:31 
05:54:31 (SWT:1344): Gtk-CRITICAL **: 09:54:31.022: gtk_box_gadget_distribute: assertion 'size >= 0' failed in GtkScrollbar
05:54:31 
05:54:31 (SWT:1344): Gtk-CRITICAL **: 09:54:31.035: gtk_box_gadget_distribute: assertion 'size >= 0' failed in GtkScrollbar
05:54:31 
05:54:31 (SWT:1344): Gtk-WARNING **: 09:54:31.042: Negative content width -6 (allocation 1, extents 4x3) while allocating gadget (node toolbar, owner GtkToolbar)
05:54:31 
05:54:31 (SWT:1344): Gtk-CRITICAL **: 09:54:31.054: gtk_box_gadget_distribute: assertion 'size >= 0' failed in GtkScrollbar
05:54:31 
05:54:31 (SWT:1344): Gtk-CRITICAL **: 09:54:31.063: gtk_box_gadget_distribute: assertion 'size >= 0' failed in GtkScrollbar
05:54:31 
05:54:31 (SWT:1344): Gtk-CRITICAL **: 09:54:31.065: gtk_box_gadget_distribute: assertion 'size >= 0' failed in GtkScrollbar
05:54:31 
05:54:31 (SWT:1344): Gtk-CRITICAL **: 09:54:31.066: gtk_box_gadget_distribute: assertion 'size >= 0' failed in GtkScrollbar
05:54:31 
05:54:31 (SWT:1344): Gtk-CRITICAL **: 09:54:31.071: gtk_box_gadget_distribute: assertion 'size >= 0' failed in GtkScrollbar
05:54:31 
05:54:31 (SWT:1344): Gtk-CRITICAL **: 09:54:31.072: gtk_box_gadget_distribute: assertion 'size >= 0' failed in GtkScrollbar
05:54:31 
05:54:31 (SWT:1344): Gtk-CRITICAL **: 09:54:31.092: gtk_box_gadget_distribute: assertion 'size >= 0' failed in GtkScrollbar
05:54:31 
05:54:31 (SWT:1344): Gtk-CRITICAL **: 09:54:31.092: gtk_box_gadget_distribute: assertion 'size >= 0' failed in GtkScrollbar
05:54:31 
05:54:31 (SWT:1344): Gtk-CRITICAL **: 09:54:31.103: gtk_box_gadget_distribute: assertion 'size >= 0' failed in GtkScrollbar
05:54:31 
05:54:31 (SWT:1344): Gtk-CRITICAL **: 09:54:31.108: gtk_box_gadget_distribute: assertion 'size >= 0' failed in GtkScrollbar
05:54:31 
05:54:31 (SWT:1344): Gtk-CRITICAL **: 09:54:31.108: gtk_box_gadget_distribute: assertion 'size >= 0' failed in GtkScrollbar
05:54:31 
05:54:31 (SWT:1344): Gtk-CRITICAL **: 09:54:31.125: gtk_box_gadget_distribute: assertion 'size >= 0' failed in GtkScrollbar
05:54:31 
05:54:31 (SWT:1344): Gtk-CRITICAL **: 09:54:31.125: gtk_box_gadget_distribute: assertion 'size >= 0' failed in GtkScrollbar
05:54:31 
05:54:31 (SWT:1344): Gtk-CRITICAL **: 09:54:31.141: gtk_box_gadget_distribute: assertion 'size >= 0' failed in GtkScrollbar
05:54:31 
05:54:31 (SWT:1344): Gtk-CRITICAL **: 09:54:31.141: gtk_box_gadget_distribute: assertion 'size >= 0' failed in GtkScrollbar
05:54:31 
05:54:31 (SWT:1344): Gtk-CRITICAL **: 09:54:31.158: gtk_box_gadget_distribute: assertion 'size >= 0' failed in GtkScrollbar
05:54:31 
05:54:31 (SWT:1344): Gtk-CRITICAL **: 09:54:31.158: gtk_box_gadget_distribute: assertion 'size >= 0' failed in GtkScrollbar
05:54:31 
05:54:31 (SWT:1344): Gtk-CRITICAL **: 09:54:31.175: gtk_box_gadget_distribute: assertion 'size >= 0' failed in GtkScrollbar
05:54:31 
05:54:31 (SWT:1344): Gtk-CRITICAL **: 09:54:31.175: gtk_box_gadget_distribute: assertion 'size >= 0' failed in GtkScrollbar
05:54:31 
05:54:31 (SWT:1344): Gtk-CRITICAL **: 09:54:31.191: gtk_box_gadget_distribute: assertion 'size >= 0' failed in GtkScrollbar
05:54:31 
05:54:31 (SWT:1344): Gtk-CRITICAL **: 09:54:31.191: gtk_box_gadget_distribute: assertion 'size >= 0' failed in GtkScrollbar
05:54:31 
05:54:31 (SWT:1344): Gtk-CRITICAL **: 09:54:31.220: gtk_box_gadget_distribute: assertion 'size >= 0' failed in GtkScrollbar
05:54:31 
05:54:31 (SWT:1344): Gtk-CRITICAL **: 09:54:31.220: gtk_box_gadget_distribute: assertion 'size >= 0' failed in GtkScrollbar
05:54:31 
05:54:31 (SWT:1344): Gtk-CRITICAL **: 09:54:31.247: gtk_box_gadget_distribute: assertion 'size >= 0' failed in GtkScrollbar
05:54:31 
05:54:31 (SWT:1344): Gtk-CRITICAL **: 09:54:31.247: gtk_box_gadget_distribute: assertion 'size >= 0' failed in GtkScrollbar
05:54:31 
05:54:31 (SWT:1344): Gtk-CRITICAL **: 09:54:31.261: gtk_box_gadget_distribute: assertion 'size >= 0' failed in GtkScrollbar
05:54:31 
05:54:31 (SWT:1344): Gtk-CRITICAL **: 09:54:31.277: gtk_box_gadget_distribute: assertion 'size >= 0' failed in GtkScrollbar
05:54:31 
05:54:31 (SWT:1344): Gtk-CRITICAL **: 09:54:31.277: gtk_box_gadget_distribute: assertion 'size >= 0' failed in GtkScrollbar
05:54:31 
05:54:31 (SWT:1344): Gtk-CRITICAL **: 09:54:31.279: gtk_box_gadget_distribute: assertion 'size >= 0' failed in GtkScrollbar
05:54:31 
05:54:31 (SWT:1344): Gtk-CRITICAL **: 09:54:31.279: gtk_box_gadget_distribute: assertion 'size >= 0' failed in GtkScrollbar
05:54:31 
05:54:31 (SWT:1344): Gtk-CRITICAL **: 09:54:31.282: gtk_box_gadget_distribute: assertion 'size >= 0' failed in GtkScrollbar
05:54:31 
05:54:31 (SWT:1344): Gtk-CRITICAL **: 09:54:31.292: gtk_box_gadget_distribute: assertion 'size >= 0' failed in GtkScrollbar
05:54:31 
05:54:31 (SWT:1344): Gtk-CRITICAL **: 09:54:31.343: gtk_box_gadget_distribute: assertion 'size >= 0' failed in GtkScrollbar
05:54:31 
05:54:31 (SWT:1344): Gtk-CRITICAL **: 09:54:31.344: gtk_box_gadget_distribute: assertion 'size >= 0' failed in GtkScrollbar
05:54:31 
05:54:31 (SWT:1344): Gtk-CRITICAL **: 09:54:31.351: gtk_box_gadget_distribute: assertion 'size >= 0' failed in GtkScrollbar
05:54:31 
05:54:31 (SWT:1344): Gtk-CRITICAL **: 09:54:31.361: gtk_box_gadget_distribute: assertion 'size >= 0' failed in GtkScrollbar
05:54:31 
05:54:31 (SWT:1344): Gtk-CRITICAL **: 09:54:31.361: gtk_box_gadget_distribute: assertion 'size >= 0' failed in GtkScrollbar
05:54:31 
05:54:31 (SWT:1344): Gtk-CRITICAL **: 09:54:31.437: gtk_box_gadget_distribute: assertion 'size >= 0' failed in GtkScrollbar
05:54:31 
05:54:31 (SWT:1344): Gtk-CRITICAL **: 09:54:31.444: gtk_box_gadget_distribute: assertion 'size >= 0' failed in GtkScrollbar
05:54:31 
05:54:31 (SWT:1344): Gtk-CRITICAL **: 09:54:31.446: gtk_box_gadget_distribute: assertion 'size >= 0' failed in GtkScrollbar
05:54:31 
05:54:31 (SWT:1344): Gtk-CRITICAL **: 09:54:31.446: gtk_box_gadget_distribute: assertion 'size >= 0' failed in GtkScrollbar
05:54:31 
05:54:31 (SWT:1344): Gtk-CRITICAL **: 09:54:31.457: gtk_box_gadget_distribute: assertion 'size >= 0' failed in GtkScrollbar
05:54:31 
05:54:31 (SWT:1344): Gtk-CRITICAL **: 09:54:31.468: gtk_box_gadget_distribute: assertion 'size >= 0' failed in GtkScrollbar
05:54:31 
05:54:31 (SWT:1344): Gtk-WARNING **: 09:54:31.537: Negative content width -6 (allocation 1, extents 4x3) while allocating gadget (node toolbar, owner GtkToolbar)
05:54:32 
05:54:32 (SWT:1344): Gtk-WARNING **: 09:54:32.596: Negative content width -6 (allocation 1, extents 4x3) while allocating gadget (node toolbar, owner GtkToolbar)
05:54:32 
05:54:32 (SWT:1344): Gtk-WARNING **: 09:54:32.612: Negative content width -6 (allocation 1, extents 4x3) while allocating gadget (node toolbar, owner GtkToolbar)
05:54:33 
05:54:33 (SWT:1344): Gtk-WARNING **: 09:54:33.232: Negative content width -6 (allocation 1, extents 4x3) while allocating gadget (node toolbar, owner GtkToolbar)
05:54:33 
05:54:33 (SWT:1344): Gtk-WARNING **: 09:54:33.648: Negative content width -9 (allocation 9, extents 9x9) while allocating gadget (node entry, owner GtkEntry)
05:54:33 
05:54:33 (SWT:1344): Gtk-CRITICAL **: 09:54:33.695: gtk_box_gadget_distribute: assertion 'size >= 0' failed in GtkScrollbar
05:54:33 
05:54:33 (SWT:1344): Gtk-CRITICAL **: 09:54:33.705: gtk_box_gadget_distribute: assertion 'size >= 0' failed in GtkScrollbar
05:54:33 
05:54:33 (SWT:1344): Gtk-WARNING **: 09:54:33.710: Negative content width -6 (allocation 1, extents 4x3) while allocating gadget (node toolbar, owner GtkToolbar)
05:54:33 
05:54:33 (SWT:1344): Gtk-CRITICAL **: 09:54:33.721: gtk_box_gadget_distribute: assertion 'size >= 0' failed in GtkScrollbar
05:54:33 
05:54:33 (SWT:1344): Gtk-CRITICAL **: 09:54:33.803: gtk_box_gadget_distribute: assertion 'size >= 0' failed in GtkScrollbar
05:54:33 
05:54:33 (SWT:1344): Gtk-CRITICAL **: 09:54:33.809: gtk_box_gadget_distribute: assertion 'size >= 0' failed in GtkScrollbar
05:54:33 
05:54:33 (SWT:1344): Gtk-CRITICAL **: 09:54:33.818: gtk_box_gadget_distribute: assertion 'size >= 0' failed in GtkScrollbar
05:54:33 
05:54:33 (SWT:1344): Gtk-CRITICAL **: 09:54:33.820: gtk_box_gadget_distribute: assertion 'size >= 0' failed in GtkScrollbar
05:54:33 
05:54:33 (SWT:1344): Gtk-CRITICAL **: 09:54:33.821: gtk_box_gadget_distribute: assertion 'size >= 0' failed in GtkScrollbar
05:54:33 
05:54:33 (SWT:1344): Gtk-CRITICAL **: 09:54:33.826: gtk_box_gadget_distribute: assertion 'size >= 0' failed in GtkScrollbar
05:54:33 
05:54:33 (SWT:1344): Gtk-CRITICAL **: 09:54:33.827: gtk_box_gadget_distribute: assertion 'size >= 0' failed in GtkScrollbar
05:54:33 
05:54:33 (SWT:1344): Gtk-CRITICAL **: 09:54:33.838: gtk_box_gadget_distribute: assertion 'size >= 0' failed in GtkScrollbar
05:54:33 
05:54:33 (SWT:1344): Gtk-CRITICAL **: 09:54:33.855: gtk_box_gadget_distribute: assertion 'size >= 0' failed in GtkScrollbar
05:54:33 
05:54:33 (SWT:1344): Gtk-CRITICAL **: 09:54:33.855: gtk_box_gadget_distribute: assertion 'size >= 0' failed in GtkScrollbar
05:54:33 
05:54:33 (SWT:1344): Gtk-CRITICAL **: 09:54:33.871: gtk_box_gadget_distribute: assertion 'size >= 0' failed in GtkScrollbar
05:54:33 
05:54:33 (SWT:1344): Gtk-CRITICAL **: 09:54:33.871: gtk_box_gadget_distribute: assertion 'size >= 0' failed in GtkScrollbar
05:54:33 
05:54:33 (SWT:1344): Gtk-CRITICAL **: 09:54:33.888: gtk_box_gadget_distribute: assertion 'size >= 0' failed in GtkScrollbar
05:54:33 
05:54:33 (SWT:1344): Gtk-CRITICAL **: 09:54:33.888: gtk_box_gadget_distribute: assertion 'size >= 0' failed in GtkScrollbar
05:54:33 
05:54:33 (SWT:1344): Gtk-CRITICAL **: 09:54:33.904: gtk_box_gadget_distribute: assertion 'size >= 0' failed in GtkScrollbar
05:54:33 
05:54:33 (SWT:1344): Gtk-CRITICAL **: 09:54:33.988: gtk_box_gadget_distribute: assertion 'size >= 0' failed in GtkScrollbar
05:54:34 
05:54:34 (SWT:1344): Gtk-CRITICAL **: 09:54:34.022: gtk_box_gadget_distribute: assertion 'size >= 0' failed in GtkScrollbar
05:54:34 
05:54:34 (SWT:1344): Gtk-CRITICAL **: 09:54:34.047: gtk_box_gadget_distribute: assertion 'size >= 0' failed in GtkScrollbar
05:54:34 
05:54:34 (SWT:1344): Gtk-CRITICAL **: 09:54:34.047: gtk_box_gadget_distribute: assertion 'size >= 0' failed in GtkScrollbar
05:54:34 
05:54:34 (SWT:1344): Gtk-CRITICAL **: 09:54:34.050: gtk_box_gadget_distribute: assertion 'size >= 0' failed in GtkScrollbar
05:54:34 
05:54:34 (SWT:1344): Gtk-CRITICAL **: 09:54:34.051: gtk_box_gadget_distribute: assertion 'size >= 0' failed in GtkScrollbar
05:54:34 
05:54:34 (SWT:1344): Gtk-CRITICAL **: 09:54:34.055: gtk_box_gadget_distribute: assertion 'size >= 0' failed in GtkScrollbar
05:54:34 
05:54:34 (SWT:1344): Gtk-CRITICAL **: 09:54:34.069: gtk_box_gadget_distribute: assertion 'size >= 0' failed in GtkScrollbar
05:54:34 
05:54:34 (SWT:1344): Gtk-CRITICAL **: 09:54:34.106: gtk_box_gadget_distribute: assertion 'size >= 0' failed in GtkScrollbar
05:54:34 
05:54:34 (SWT:1344): Gtk-CRITICAL **: 09:54:34.107: gtk_box_gadget_distribute: assertion 'size >= 0' failed in GtkScrollbar
05:54:34 
05:54:34 (SWT:1344): Gtk-CRITICAL **: 09:54:34.109: gtk_box_gadget_distribute: assertion 'size >= 0' failed in GtkScrollbar
05:54:34 
05:54:34 (SWT:1344): Gtk-CRITICAL **: 09:54:34.110: gtk_box_gadget_distribute: assertion 'size >= 0' failed in GtkScrollbar
05:54:34 
05:54:34 (SWT:1344): Gtk-CRITICAL **: 09:54:34.111: gtk_box_gadget_distribute: assertion 'size >= 0' failed in GtkScrollbar
05:54:34 
05:54:34 (SWT:1344): Gtk-CRITICAL **: 09:54:34.111: gtk_box_gadget_distribute: assertion 'size >= 0' failed in GtkScrollbar
05:54:34 
05:54:34 (SWT:1344): Gtk-CRITICAL **: 09:54:34.114: gtk_box_gadget_distribute: assertion 'size >= 0' failed in GtkScrollbar
05:54:34 
05:54:34 (SWT:1344): Gtk-CRITICAL **: 09:54:34.114: gtk_box_gadget_distribute: assertion 'size >= 0' failed in GtkScrollbar
05:54:34 
05:54:34 (SWT:1344): Gtk-CRITICAL **: 09:54:34.128: gtk_box_gadget_distribute: assertion 'size >= 0' failed in GtkScrollbar
05:54:34 
05:54:34 (SWT:1344): Gtk-CRITICAL **: 09:54:34.152: gtk_box_gadget_distribute: assertion 'size >= 0' failed in GtkScrollbar
05:54:34 
05:54:34 (SWT:1344): Gtk-CRITICAL **: 09:54:34.152: gtk_box_gadget_distribute: assertion 'size >= 0' failed in GtkScrollbar
05:54:34 
05:54:34 (SWT:1344): Gtk-CRITICAL **: 09:54:34.193: gtk_box_gadget_distribute: assertion 'size >= 0' failed in GtkScrollbar
05:54:34 
05:54:34 (SWT:1344): Gtk-CRITICAL **: 09:54:34.199: gtk_box_gadget_distribute: assertion 'size >= 0' failed in GtkScrollbar
05:54:34 
05:54:34 (SWT:1344): Gtk-CRITICAL **: 09:54:34.200: gtk_box_gadget_distribute: assertion 'size >= 0' failed in GtkScrollbar
05:54:34 
05:54:34 (SWT:1344): Gtk-CRITICAL **: 09:54:34.201: gtk_box_gadget_distribute: assertion 'size >= 0' failed in GtkScrollbar
05:54:34 
05:54:34 (SWT:1344): Gtk-CRITICAL **: 09:54:34.204: gtk_box_gadget_distribute: assertion 'size >= 0' failed in GtkScrollbar
05:54:34 
05:54:34 (SWT:1344): Gtk-CRITICAL **: 09:54:34.213: gtk_box_gadget_distribute: assertion 'size >= 0' failed in GtkScrollbar
05:54:34 
05:54:34 (SWT:1344): Gtk-CRITICAL **: 09:54:34.235: gtk_box_gadget_distribute: assertion 'size >= 0' failed in GtkScrollbar
05:54:34 
05:54:34 (SWT:1344): Gtk-CRITICAL **: 09:54:34.236: gtk_box_gadget_distribute: assertion 'size >= 0' failed in GtkScrollbar
05:54:34 
05:54:34 (SWT:1344): Gtk-CRITICAL **: 09:54:34.237: gtk_box_gadget_distribute: assertion 'size >= 0' failed in GtkScrollbar
05:54:34 
05:54:34 (SWT:1344): Gtk-CRITICAL **: 09:54:34.249: gtk_box_gadget_distribute: assertion 'size >= 0' failed in GtkScrollbar
05:54:34 
05:54:34 (SWT:1344): Gtk-CRITICAL **: 09:54:34.254: gtk_box_gadget_distribute: assertion 'size >= 0' failed in GtkScrollbar
05:54:34 
05:54:34 (SWT:1344): Gtk-CRITICAL **: 09:54:34.256: gtk_box_gadget_distribute: assertion 'size >= 0' failed in GtkScrollbar
05:54:34 
05:54:34 (SWT:1344): Gtk-CRITICAL **: 09:54:34.256: gtk_box_gadget_distribute: assertion 'size >= 0' failed in GtkScrollbar
05:54:34 
05:54:34 (SWT:1344): Gtk-CRITICAL **: 09:54:34.259: gtk_box_gadget_distribute: assertion 'size >= 0' failed in GtkScrollbar
05:54:34 
05:54:34 (SWT:1344): Gtk-CRITICAL **: 09:54:34.803: gtk_box_gadget_distribute: assertion 'size >= 0' failed in GtkScrollbar
05:54:34 
05:54:34 (SWT:1344): Gtk-CRITICAL **: 09:54:34.809: gtk_box_gadget_distribute: assertion 'size >= 0' failed in GtkScrollbar
05:54:34 
05:54:34 (SWT:1344): Gtk-CRITICAL **: 09:54:34.826: gtk_box_gadget_distribute: assertion 'size >= 0' failed in GtkScrollbar
05:54:34 
05:54:34 (SWT:1344): Gtk-CRITICAL **: 09:54:34.844: gtk_box_gadget_distribute: assertion 'size >= 0' failed in GtkScrollbar
05:54:34 
05:54:34 (SWT:1344): Gtk-CRITICAL **: 09:54:34.863: gtk_box_gadget_distribute: assertion 'size >= 0' failed in GtkScrollbar
05:54:34 
05:54:34 (SWT:1344): Gtk-CRITICAL **: 09:54:34.863: gtk_box_gadget_distribute: assertion 'size >= 0' failed in GtkScrollbar
05:54:34 
05:54:34 (SWT:1344): Gtk-CRITICAL **: 09:54:34.865: gtk_box_gadget_distribute: assertion 'size >= 0' failed in GtkScrollbar
05:54:34 
05:54:34 (SWT:1344): Gtk-CRITICAL **: 09:54:34.865: gtk_box_gadget_distribute: assertion 'size >= 0' failed in GtkScrollbar
05:54:34 
05:54:34 (SWT:1344): Gtk-CRITICAL **: 09:54:34.868: gtk_box_gadget_distribute: assertion 'size >= 0' failed in GtkScrollbar
05:54:34 
05:54:34 (SWT:1344): Gtk-CRITICAL **: 09:54:34.876: gtk_box_gadget_distribute: assertion 'size >= 0' failed in GtkScrollbar
05:54:34 
05:54:34 (SWT:1344): Gtk-CRITICAL **: 09:54:34.900: gtk_box_gadget_distribute: assertion 'size >= 0' failed in GtkScrollbar
05:54:34 
05:54:34 (SWT:1344): Gtk-CRITICAL **: 09:54:34.901: gtk_box_gadget_distribute: assertion 'size >= 0' failed in GtkScrollbar
05:54:34 
05:54:34 (SWT:1344): Gtk-CRITICAL **: 09:54:34.902: gtk_box_gadget_distribute: assertion 'size >= 0' failed in GtkScrollbar
05:54:34 
05:54:34 (SWT:1344): Gtk-CRITICAL **: 09:54:34.903: gtk_box_gadget_distribute: assertion 'size >= 0' failed in GtkScrollbar
05:54:34 
05:54:34 (SWT:1344): Gtk-CRITICAL **: 09:54:34.903: gtk_box_gadget_distribute: assertion 'size >= 0' failed in GtkScrollbar
05:54:34 
05:54:34 (SWT:1344): Gtk-CRITICAL **: 09:54:34.904: gtk_box_gadget_distribute: assertion 'size >= 0' failed in GtkScrollbar
05:54:34 
05:54:34 (SWT:1344): Gtk-CRITICAL **: 09:54:34.905: gtk_box_gadget_distribute: assertion 'size >= 0' failed in GtkScrollbar
05:54:34 
05:54:34 (SWT:1344): Gtk-CRITICAL **: 09:54:34.906: gtk_box_gadget_distribute: assertion 'size >= 0' failed in GtkScrollbar
05:54:34 
05:54:34 (SWT:1344): Gtk-CRITICAL **: 09:54:34.906: gtk_box_gadget_distribute: assertion 'size >= 0' failed in GtkScrollbar
05:54:34 
05:54:34 (SWT:1344): Gtk-CRITICAL **: 09:54:34.941: gtk_box_gadget_distribute: assertion 'size >= 0' failed in GtkScrollbar
05:54:34 
05:54:34 (SWT:1344): Gtk-CRITICAL **: 09:54:34.941: gtk_box_gadget_distribute: assertion 'size >= 0' failed in GtkScrollbar
05:54:34 
05:54:34 (SWT:1344): Gtk-CRITICAL **: 09:54:34.970: gtk_box_gadget_distribute: assertion 'size >= 0' failed in GtkScrollbar
05:54:34 
05:54:34 (SWT:1344): Gtk-CRITICAL **: 09:54:34.976: gtk_box_gadget_distribute: assertion 'size >= 0' failed in GtkScrollbar
05:54:34 
05:54:34 (SWT:1344): Gtk-CRITICAL **: 09:54:34.977: gtk_box_gadget_distribute: assertion 'size >= 0' failed in GtkScrollbar
05:54:34 
05:54:34 (SWT:1344): Gtk-CRITICAL **: 09:54:34.977: gtk_box_gadget_distribute: assertion 'size >= 0' failed in GtkScrollbar
05:54:34 
05:54:34 (SWT:1344): Gtk-CRITICAL **: 09:54:34.980: gtk_box_gadget_distribute: assertion 'size >= 0' failed in GtkScrollbar
05:54:34 
05:54:34 (SWT:1344): Gtk-CRITICAL **: 09:54:34.988: gtk_box_gadget_distribute: assertion 'size >= 0' failed in GtkScrollbar
05:54:35 
05:54:35 (SWT:1344): Gtk-CRITICAL **: 09:54:35.017: gtk_box_gadget_distribute: assertion 'size >= 0' failed in GtkScrollbar
05:54:35 
05:54:35 (SWT:1344): Gtk-CRITICAL **: 09:54:35.018: gtk_box_gadget_distribute: assertion 'size >= 0' failed in GtkScrollbar
05:54:35 
05:54:35 (SWT:1344): Gtk-CRITICAL **: 09:54:35.019: gtk_box_gadget_distribute: assertion 'size >= 0' failed in GtkScrollbar
05:54:35 
05:54:35 (SWT:1344): Gtk-CRITICAL **: 09:54:35.037: gtk_box_gadget_distribute: assertion 'size >= 0' failed in GtkScrollbar
05:54:35 
05:54:35 (SWT:1344): Gtk-CRITICAL **: 09:54:35.148: gtk_box_gadget_distribute: assertion 'size >= 0' failed in GtkScrollbar
05:54:35 
05:54:35 (SWT:1344): Gtk-CRITICAL **: 09:54:35.149: gtk_box_gadget_distribute: assertion 'size >= 0' failed in GtkScrollbar
05:54:35 
05:54:35 (SWT:1344): Gtk-CRITICAL **: 09:54:35.150: gtk_box_gadget_distribute: assertion 'size >= 0' failed in GtkScrollbar
05:54:35 
05:54:35 (SWT:1344): Gtk-CRITICAL **: 09:54:35.163: gtk_box_gadget_distribute: assertion 'size >= 0' failed in GtkScrollbar
05:54:35 
05:54:35 (SWT:1344): Gtk-CRITICAL **: 09:54:35.242: gtk_box_gadget_distribute: assertion 'size >= 0' failed in GtkScrollbar
05:54:35 
05:54:35 (SWT:1344): Gtk-CRITICAL **: 09:54:35.254: gtk_box_gadget_distribute: assertion 'size >= 0' failed in GtkScrollbar
05:54:35 
05:54:35 (SWT:1344): Gtk-CRITICAL **: 09:54:35.274: gtk_box_gadget_distribute: assertion 'size >= 0' failed in GtkScrollbar
05:54:35 
05:54:35 (SWT:1344): Gtk-CRITICAL **: 09:54:35.275: gtk_box_gadget_distribute: assertion 'size >= 0' failed in GtkScrollbar
05:54:35 
05:54:35 (SWT:1344): Gtk-CRITICAL **: 09:54:35.276: gtk_box_gadget_distribute: assertion 'size >= 0' failed in GtkScrollbar
05:54:35 
05:54:35 (SWT:1344): Gtk-CRITICAL **: 09:54:35.277: gtk_box_gadget_distribute: assertion 'size >= 0' failed in GtkScrollbar
05:54:35 
05:54:35 (SWT:1344): Gtk-CRITICAL **: 09:54:35.278: gtk_box_gadget_distribute: assertion 'size >= 0' failed in GtkScrollbar
05:54:35 
05:54:35 (SWT:1344): Gtk-CRITICAL **: 09:54:35.278: gtk_box_gadget_distribute: assertion 'size >= 0' failed in GtkScrollbar
05:54:35 
05:54:35 (SWT:1344): Gtk-CRITICAL **: 09:54:35.284: gtk_box_gadget_distribute: assertion 'size >= 0' failed in GtkScrollbar
05:54:35 
05:54:35 (SWT:1344): Gtk-CRITICAL **: 09:54:35.294: gtk_box_gadget_distribute: assertion 'size >= 0' failed in GtkScrollbar
05:54:35 
05:54:35 (SWT:1344): Gtk-CRITICAL **: 09:54:35.368: gtk_box_gadget_distribute: assertion 'size >= 0' failed in GtkScrollbar
05:54:35 
05:54:35 (SWT:1344): Gtk-CRITICAL **: 09:54:35.368: gtk_box_gadget_distribute: assertion 'size >= 0' failed in GtkScrollbar
05:54:35 
05:54:35 (SWT:1344): Gtk-CRITICAL **: 09:54:35.388: gtk_box_gadget_distribute: assertion 'size >= 0' failed in GtkScrollbar
05:54:35 
05:54:35 (SWT:1344): Gtk-CRITICAL **: 09:54:35.394: gtk_box_gadget_distribute: assertion 'size >= 0' failed in GtkScrollbar
05:54:35 
05:54:35 (SWT:1344): Gtk-CRITICAL **: 09:54:35.396: gtk_box_gadget_distribute: assertion 'size >= 0' failed in GtkScrollbar
05:54:35 
05:54:35 (SWT:1344): Gtk-CRITICAL **: 09:54:35.396: gtk_box_gadget_distribute: assertion 'size >= 0' failed in GtkScrollbar
05:54:35 
05:54:35 (SWT:1344): Gtk-CRITICAL **: 09:54:35.400: gtk_box_gadget_distribute: assertion 'size >= 0' failed in GtkScrollbar
05:54:35 
05:54:35 (SWT:1344): Gtk-CRITICAL **: 09:54:35.409: gtk_box_gadget_distribute: assertion 'size >= 0' failed in GtkScrollbar
05:54:35 
05:54:35 (SWT:1344): Gtk-WARNING **: 09:54:35.444: Negative content width -6 (allocation 1, extents 4x3) while allocating gadget (node toolbar, owner GtkToolbar)
05:54:36 
05:54:36 (SWT:1344): Gtk-WARNING **: 09:54:36.196: Negative content width -6 (allocation 1, extents 4x3) while allocating gadget (node toolbar, owner GtkToolbar)
05:54:36 
05:54:36 (SWT:1344): Gtk-WARNING **: 09:54:36.210: Negative content width -6 (allocation 1, extents 4x3) while allocating gadget (node toolbar, owner GtkToolbar)
05:54:36 
05:54:36 (SWT:1344): Gtk-WARNING **: 09:54:36.834: Negative content width -6 (allocation 1, extents 4x3) while allocating gadget (node toolbar, owner GtkToolbar)
05:54:37 
05:54:37 (SWT:1344): Gtk-WARNING **: 09:54:37.465: Negative content width -9 (allocation 9, extents 9x9) while allocating gadget (node entry, owner GtkEntry)
05:54:37 
05:54:37 (SWT:1344): Gtk-CRITICAL **: 09:54:37.508: gtk_box_gadget_distribute: assertion 'size >= 0' failed in GtkScrollbar
05:54:37 
05:54:37 (SWT:1344): Gtk-CRITICAL **: 09:54:37.520: gtk_box_gadget_distribute: assertion 'size >= 0' failed in GtkScrollbar
05:54:37 
05:54:37 (SWT:1344): Gtk-WARNING **: 09:54:37.526: Negative content width -6 (allocation 1, extents 4x3) while allocating gadget (node toolbar, owner GtkToolbar)
05:54:37 
05:54:37 (SWT:1344): Gtk-CRITICAL **: 09:54:37.537: gtk_box_gadget_distribute: assertion 'size >= 0' failed in GtkScrollbar
05:54:37 
05:54:37 (SWT:1344): Gtk-CRITICAL **: 09:54:37.543: gtk_box_gadget_distribute: assertion 'size >= 0' failed in GtkScrollbar
05:54:37 
05:54:37 (SWT:1344): Gtk-CRITICAL **: 09:54:37.549: gtk_box_gadget_distribute: assertion 'size >= 0' failed in GtkScrollbar
05:54:37 
05:54:37 (SWT:1344): Gtk-CRITICAL **: 09:54:37.551: gtk_box_gadget_distribute: assertion 'size >= 0' failed in GtkScrollbar
05:54:37 
05:54:37 (SWT:1344): Gtk-CRITICAL **: 09:54:37.552: gtk_box_gadget_distribute: assertion 'size >= 0' failed in GtkScrollbar
05:54:37 
05:54:37 (SWT:1344): Gtk-CRITICAL **: 09:54:37.557: gtk_box_gadget_distribute: assertion 'size >= 0' failed in GtkScrollbar
05:54:37 
05:54:37 (SWT:1344): Gtk-CRITICAL **: 09:54:37.557: gtk_box_gadget_distribute: assertion 'size >= 0' failed in GtkScrollbar
05:54:37 
05:54:37 (SWT:1344): Gtk-CRITICAL **: 09:54:37.574: gtk_box_gadget_distribute: assertion 'size >= 0' failed in GtkScrollbar
05:54:37 
05:54:37 (SWT:1344): Gtk-CRITICAL **: 09:54:37.584: gtk_box_gadget_distribute: assertion 'size >= 0' failed in GtkScrollbar
05:54:37 
05:54:37 (SWT:1344): Gtk-CRITICAL **: 09:54:37.584: gtk_box_gadget_distribute: assertion 'size >= 0' failed in GtkScrollbar
05:54:37 
05:54:37 (SWT:1344): Gtk-CRITICAL **: 09:54:37.600: gtk_box_gadget_distribute: assertion 'size >= 0' failed in GtkScrollbar
05:54:37 
05:54:37 (SWT:1344): Gtk-CRITICAL **: 09:54:37.600: gtk_box_gadget_distribute: assertion 'size >= 0' failed in GtkScrollbar
05:54:37 
05:54:37 (SWT:1344): Gtk-CRITICAL **: 09:54:37.617: gtk_box_gadget_distribute: assertion 'size >= 0' failed in GtkScrollbar
05:54:37 
05:54:37 (SWT:1344): Gtk-CRITICAL **: 09:54:37.617: gtk_box_gadget_distribute: assertion 'size >= 0' failed in GtkScrollbar
05:54:37 
05:54:37 (SWT:1344): Gtk-CRITICAL **: 09:54:37.633: gtk_box_gadget_distribute: assertion 'size >= 0' failed in GtkScrollbar
05:54:37 
05:54:37 (SWT:1344): Gtk-CRITICAL **: 09:54:37.633: gtk_box_gadget_distribute: assertion 'size >= 0' failed in GtkScrollbar
05:54:37 
05:54:37 (SWT:1344): Gtk-CRITICAL **: 09:54:37.650: gtk_box_gadget_distribute: assertion 'size >= 0' failed in GtkScrollbar
05:54:37 
05:54:37 (SWT:1344): Gtk-CRITICAL **: 09:54:37.650: gtk_box_gadget_distribute: assertion 'size >= 0' failed in GtkScrollbar
05:54:37 
05:54:37 (SWT:1344): Gtk-CRITICAL **: 09:54:37.667: gtk_box_gadget_distribute: assertion 'size >= 0' failed in GtkScrollbar
05:54:37 
05:54:37 (SWT:1344): Gtk-CRITICAL **: 09:54:37.667: gtk_box_gadget_distribute: assertion 'size >= 0' failed in GtkScrollbar
05:54:37 
05:54:37 (SWT:1344): Gtk-CRITICAL **: 09:54:37.678: gtk_box_gadget_distribute: assertion 'size >= 0' failed in GtkScrollbar
05:54:37 
05:54:37 (SWT:1344): Gtk-CRITICAL **: 09:54:37.678: gtk_box_gadget_distribute: assertion 'size >= 0' failed in GtkScrollbar
05:54:37 
05:54:37 (SWT:1344): Gtk-CRITICAL **: 09:54:37.680: gtk_box_gadget_distribute: assertion 'size >= 0' failed in GtkScrollbar
05:54:37 
05:54:37 (SWT:1344): Gtk-CRITICAL **: 09:54:37.682: gtk_box_gadget_distribute: assertion 'size >= 0' failed in GtkScrollbar
05:54:37 
05:54:37 (SWT:1344): Gtk-CRITICAL **: 09:54:37.682: gtk_box_gadget_distribute: assertion 'size >= 0' failed in GtkScrollbar
05:54:37 
05:54:37 (SWT:1344): Gtk-CRITICAL **: 09:54:37.684: gtk_box_gadget_distribute: assertion 'size >= 0' failed in GtkScrollbar
05:54:37 
05:54:37 (SWT:1344): Gtk-CRITICAL **: 09:54:37.684: gtk_box_gadget_distribute: assertion 'size >= 0' failed in GtkScrollbar
05:54:37 
05:54:37 (SWT:1344): Gtk-CRITICAL **: 09:54:37.691: gtk_box_gadget_distribute: assertion 'size >= 0' failed in GtkScrollbar
05:54:37 
05:54:37 (SWT:1344): Gtk-CRITICAL **: 09:54:37.696: gtk_box_gadget_distribute: assertion 'size >= 0' failed in GtkScrollbar
05:54:37 
05:54:37 (SWT:1344): Gtk-CRITICAL **: 09:54:37.696: gtk_box_gadget_distribute: assertion 'size >= 0' failed in GtkScrollbar
05:54:37 
05:54:37 (SWT:1344): Gtk-CRITICAL **: 09:54:37.697: gtk_box_gadget_distribute: assertion 'size >= 0' failed in GtkScrollbar
05:54:37 
05:54:37 (SWT:1344): Gtk-CRITICAL **: 09:54:37.702: gtk_box_gadget_distribute: assertion 'size >= 0' failed in GtkScrollbar
05:54:37 
05:54:37 (SWT:1344): Gtk-CRITICAL **: 09:54:37.702: gtk_box_gadget_distribute: assertion 'size >= 0' failed in GtkScrollbar
05:54:37 
05:54:37 (SWT:1344): Gtk-CRITICAL **: 09:54:37.723: gtk_box_gadget_distribute: assertion 'size >= 0' failed in GtkScrollbar
05:54:37 
05:54:37 (SWT:1344): Gtk-CRITICAL **: 09:54:37.733: gtk_box_gadget_distribute: assertion 'size >= 0' failed in GtkScrollbar
05:54:37 
05:54:37 (SWT:1344): Gtk-WARNING **: 09:54:37.756: Negative content width -6 (allocation 1, extents 4x3) while allocating gadget (node toolbar, owner GtkToolbar)
05:54:38 
05:54:38 (SWT:1344): Gtk-WARNING **: 09:54:38.704: Negative content width -6 (allocation 1, extents 4x3) while allocating gadget (node toolbar, owner GtkToolbar)
05:54:38 
05:54:38 (SWT:1344): Gtk-WARNING **: 09:54:38.719: Negative content width -6 (allocation 1, extents 4x3) while allocating gadget (node toolbar, owner GtkToolbar)
05:54:39 
05:54:39 (SWT:1344): Gtk-WARNING **: 09:54:39.318: Negative content width -6 (allocation 1, extents 4x3) while allocating gadget (node toolbar, owner GtkToolbar)
05:54:39 
05:54:39 (SWT:1344): Gtk-WARNING **: 09:54:39.742: Negative content width -9 (allocation 9, extents 9x9) while allocating gadget (node entry, owner GtkEntry)
05:54:39 
05:54:39 (SWT:1344): Gtk-CRITICAL **: 09:54:39.788: gtk_box_gadget_distribute: assertion 'size >= 0' failed in GtkScrollbar
05:54:39 
05:54:39 (SWT:1344): Gtk-CRITICAL **: 09:54:39.798: gtk_box_gadget_distribute: assertion 'size >= 0' failed in GtkScrollbar
05:54:39 
05:54:39 (SWT:1344): Gtk-WARNING **: 09:54:39.804: Negative content width -6 (allocation 1, extents 4x3) while allocating gadget (node toolbar, owner GtkToolbar)
05:54:39 
05:54:39 (SWT:1344): Gtk-CRITICAL **: 09:54:39.814: gtk_box_gadget_distribute: assertion 'size >= 0' failed in GtkScrollbar
05:54:39 
05:54:39 (SWT:1344): Gtk-CRITICAL **: 09:54:39.820: gtk_box_gadget_distribute: assertion 'size >= 0' failed in GtkScrollbar
05:54:39 
05:54:39 (SWT:1344): Gtk-CRITICAL **: 09:54:39.836: gtk_box_gadget_distribute: assertion 'size >= 0' failed in GtkScrollbar
05:54:39 
05:54:39 (SWT:1344): Gtk-CRITICAL **: 09:54:39.846: gtk_box_gadget_distribute: assertion 'size >= 0' failed in GtkScrollbar
05:54:39 
05:54:39 (SWT:1344): Gtk-CRITICAL **: 09:54:39.848: gtk_box_gadget_distribute: assertion 'size >= 0' failed in GtkScrollbar
05:54:39 
05:54:39 (SWT:1344): Gtk-CRITICAL **: 09:54:39.848: gtk_box_gadget_distribute: assertion 'size >= 0' failed in GtkScrollbar
05:54:39 
05:54:39 (SWT:1344): Gtk-CRITICAL **: 09:54:39.853: gtk_box_gadget_distribute: assertion 'size >= 0' failed in GtkScrollbar
05:54:39 
05:54:39 (SWT:1344): Gtk-CRITICAL **: 09:54:39.853: gtk_box_gadget_distribute: assertion 'size >= 0' failed in GtkScrollbar
05:54:39 
05:54:39 (SWT:1344): Gtk-CRITICAL **: 09:54:39.868: gtk_box_gadget_distribute: assertion 'size >= 0' failed in GtkScrollbar
05:54:39 
05:54:39 (SWT:1344): Gtk-CRITICAL **: 09:54:39.879: gtk_box_gadget_distribute: assertion 'size >= 0' failed in GtkScrollbar
05:54:39 
05:54:39 (SWT:1344): Gtk-CRITICAL **: 09:54:39.879: gtk_box_gadget_distribute: assertion 'size >= 0' failed in GtkScrollbar
05:54:39 
05:54:39 (SWT:1344): Gtk-CRITICAL **: 09:54:39.895: gtk_box_gadget_distribute: assertion 'size >= 0' failed in GtkScrollbar
05:54:39 
05:54:39 (SWT:1344): Gtk-CRITICAL **: 09:54:39.895: gtk_box_gadget_distribute: assertion 'size >= 0' failed in GtkScrollbar
05:54:39 
05:54:39 (SWT:1344): Gtk-CRITICAL **: 09:54:39.911: gtk_box_gadget_distribute: assertion 'size >= 0' failed in GtkScrollbar
05:54:39 
05:54:39 (SWT:1344): Gtk-CRITICAL **: 09:54:39.912: gtk_box_gadget_distribute: assertion 'size >= 0' failed in GtkScrollbar
05:54:39 
05:54:39 (SWT:1344): Gtk-CRITICAL **: 09:54:39.928: gtk_box_gadget_distribute: assertion 'size >= 0' failed in GtkScrollbar
05:54:39 
05:54:39 (SWT:1344): Gtk-CRITICAL **: 09:54:39.928: gtk_box_gadget_distribute: assertion 'size >= 0' failed in GtkScrollbar
05:54:39 
05:54:39 (SWT:1344): Gtk-CRITICAL **: 09:54:39.945: gtk_box_gadget_distribute: assertion 'size >= 0' failed in GtkScrollbar
05:54:39 
05:54:39 (SWT:1344): Gtk-CRITICAL **: 09:54:39.945: gtk_box_gadget_distribute: assertion 'size >= 0' failed in GtkScrollbar
05:54:39 
05:54:39 (SWT:1344): Gtk-CRITICAL **: 09:54:39.961: gtk_box_gadget_distribute: assertion 'size >= 0' failed in GtkScrollbar
05:54:39 
05:54:39 (SWT:1344): Gtk-CRITICAL **: 09:54:39.961: gtk_box_gadget_distribute: assertion 'size >= 0' failed in GtkScrollbar
05:54:39 
05:54:39 (SWT:1344): Gtk-CRITICAL **: 09:54:39.974: gtk_box_gadget_distribute: assertion 'size >= 0' failed in GtkScrollbar
05:54:39 
05:54:39 (SWT:1344): Gtk-CRITICAL **: 09:54:39.974: gtk_box_gadget_distribute: assertion 'size >= 0' failed in GtkScrollbar
05:54:39 
05:54:39 (SWT:1344): Gtk-CRITICAL **: 09:54:39.976: gtk_box_gadget_distribute: assertion 'size >= 0' failed in GtkScrollbar
05:54:39 
05:54:39 (SWT:1344): Gtk-CRITICAL **: 09:54:39.976: gtk_box_gadget_distribute: assertion 'size >= 0' failed in GtkScrollbar
05:54:39 
05:54:39 (SWT:1344): Gtk-CRITICAL **: 09:54:39.977: gtk_box_gadget_distribute: assertion 'size >= 0' failed in GtkScrollbar
05:54:39 
05:54:39 (SWT:1344): Gtk-CRITICAL **: 09:54:39.978: gtk_box_gadget_distribute: assertion 'size >= 0' failed in GtkScrollbar
05:54:39 
05:54:39 (SWT:1344): Gtk-CRITICAL **: 09:54:39.979: gtk_box_gadget_distribute: assertion 'size >= 0' failed in GtkScrollbar
05:54:39 
05:54:39 (SWT:1344): Gtk-CRITICAL **: 09:54:39.979: gtk_box_gadget_distribute: assertion 'size >= 0' failed in GtkScrollbar
05:54:39 
05:54:39 (SWT:1344): Gtk-CRITICAL **: 09:54:39.996: gtk_box_gadget_distribute: assertion 'size >= 0' failed in GtkScrollbar
05:54:39 
05:54:39 (SWT:1344): Gtk-CRITICAL **: 09:54:39.996: gtk_box_gadget_distribute: assertion 'size >= 0' failed in GtkScrollbar
05:54:40 
05:54:40 (SWT:1344): Gtk-CRITICAL **: 09:54:40.002: gtk_box_gadget_distribute: assertion 'size >= 0' failed in GtkScrollbar
05:54:40 
05:54:40 (SWT:1344): Gtk-CRITICAL **: 09:54:40.002: gtk_box_gadget_distribute: assertion 'size >= 0' failed in GtkScrollbar
05:54:40 
05:54:40 (SWT:1344): Gtk-CRITICAL **: 09:54:40.003: gtk_box_gadget_distribute: assertion 'size >= 0' failed in GtkScrollbar
05:54:40 
05:54:40 (SWT:1344): Gtk-CRITICAL **: 09:54:40.021: gtk_box_gadget_distribute: assertion 'size >= 0' failed in GtkScrollbar
05:54:40 
05:54:40 (SWT:1344): Gtk-WARNING **: 09:54:40.051: Negative content width -6 (allocation 1, extents 4x3) while allocating gadget (node toolbar, owner GtkToolbar)
05:54:41 
05:54:41 (SWT:1344): Gtk-CRITICAL **: 09:54:41.244: gtk_box_gadget_distribute: assertion 'size >= 0' failed in GtkScrollbar
05:54:41 
05:54:41 (SWT:1344): Gtk-CRITICAL **: 09:54:41.246: gtk_box_gadget_distribute: assertion 'size >= 0' failed in GtkScrollbar
05:54:41 
05:54:41 (SWT:1344): Gtk-WARNING **: 09:54:41.304: Negative content width -6 (allocation 1, extents 4x3) while allocating gadget (node toolbar, owner GtkToolbar)
05:54:41 
05:54:41 (SWT:1344): Gtk-WARNING **: 09:54:41.319: Negative content width -6 (allocation 1, extents 4x3) while allocating gadget (node toolbar, owner GtkToolbar)
05:54:41 
05:54:41 (SWT:1344): Gtk-WARNING **: 09:54:41.919: Negative content width -6 (allocation 1, extents 4x3) while allocating gadget (node toolbar, owner GtkToolbar)
05:54:42 
05:54:42 (SWT:1344): Gtk-WARNING **: 09:54:42.461: Negative content width -9 (allocation 9, extents 9x9) while allocating gadget (node entry, owner GtkEntry)
05:54:42 
05:54:42 (SWT:1344): Gtk-CRITICAL **: 09:54:42.555: gtk_box_gadget_distribute: assertion 'size >= 0' failed in GtkScrollbar
05:54:42 
05:54:42 (SWT:1344): Gtk-CRITICAL **: 09:54:42.566: gtk_box_gadget_distribute: assertion 'size >= 0' failed in GtkScrollbar
05:54:42 
05:54:42 (SWT:1344): Gtk-WARNING **: 09:54:42.571: Negative content width -6 (allocation 1, extents 4x3) while allocating gadget (node toolbar, owner GtkToolbar)
05:54:42 
05:54:42 (SWT:1344): Gtk-CRITICAL **: 09:54:42.581: gtk_box_gadget_distribute: assertion 'size >= 0' failed in GtkScrollbar
05:54:42 
05:54:42 (SWT:1344): Gtk-CRITICAL **: 09:54:42.587: gtk_box_gadget_distribute: assertion 'size >= 0' failed in GtkScrollbar
05:54:42 
05:54:42 (SWT:1344): Gtk-CRITICAL **: 09:54:42.588: gtk_box_gadget_distribute: assertion 'size >= 0' failed in GtkScrollbar
05:54:42 
05:54:42 (SWT:1344): Gtk-CRITICAL **: 09:54:42.589: gtk_box_gadget_distribute: assertion 'size >= 0' failed in GtkScrollbar
05:54:42 
05:54:42 (SWT:1344): Gtk-CRITICAL **: 09:54:42.594: gtk_box_gadget_distribute: assertion 'size >= 0' failed in GtkScrollbar
05:54:42 
05:54:42 (SWT:1344): Gtk-CRITICAL **: 09:54:42.594: gtk_box_gadget_distribute: assertion 'size >= 0' failed in GtkScrollbar
05:54:42 
05:54:42 (SWT:1344): Gtk-CRITICAL **: 09:54:42.612: gtk_box_gadget_distribute: assertion 'size >= 0' failed in GtkScrollbar
05:54:42 
05:54:42 (SWT:1344): Gtk-CRITICAL **: 09:54:42.622: gtk_box_gadget_distribute: assertion 'size >= 0' failed in GtkScrollbar
05:54:42 
05:54:42 (SWT:1344): Gtk-CRITICAL **: 09:54:42.622: gtk_box_gadget_distribute: assertion 'size >= 0' failed in GtkScrollbar
05:54:42 
05:54:42 (SWT:1344): Gtk-CRITICAL **: 09:54:42.638: gtk_box_gadget_distribute: assertion 'size >= 0' failed in GtkScrollbar
05:54:42 
05:54:42 (SWT:1344): Gtk-CRITICAL **: 09:54:42.638: gtk_box_gadget_distribute: assertion 'size >= 0' failed in GtkScrollbar
05:54:42 
05:54:42 (SWT:1344): Gtk-CRITICAL **: 09:54:42.654: gtk_box_gadget_distribute: assertion 'size >= 0' failed in GtkScrollbar
05:54:42 
05:54:42 (SWT:1344): Gtk-CRITICAL **: 09:54:42.654: gtk_box_gadget_distribute: assertion 'size >= 0' failed in GtkScrollbar
05:54:42 
05:54:42 (SWT:1344): Gtk-CRITICAL **: 09:54:42.671: gtk_box_gadget_distribute: assertion 'size >= 0' failed in GtkScrollbar
05:54:42 
05:54:42 (SWT:1344): Gtk-CRITICAL **: 09:54:42.671: gtk_box_gadget_distribute: assertion 'size >= 0' failed in GtkScrollbar
05:54:42 
05:54:42 (SWT:1344): Gtk-CRITICAL **: 09:54:42.687: gtk_box_gadget_distribute: assertion 'size >= 0' failed in GtkScrollbar
05:54:42 
05:54:42 (SWT:1344): Gtk-CRITICAL **: 09:54:42.688: gtk_box_gadget_distribute: assertion 'size >= 0' failed in GtkScrollbar
05:54:42 
05:54:42 (SWT:1344): Gtk-CRITICAL **: 09:54:42.704: gtk_box_gadget_distribute: assertion 'size >= 0' failed in GtkScrollbar
05:54:42 
05:54:42 (SWT:1344): Gtk-CRITICAL **: 09:54:42.704: gtk_box_gadget_distribute: assertion 'size >= 0' failed in GtkScrollbar
05:54:42 
05:54:42 (SWT:1344): Gtk-CRITICAL **: 09:54:42.718: gtk_box_gadget_distribute: assertion 'size >= 0' failed in GtkScrollbar
05:54:42 
05:54:42 (SWT:1344): Gtk-CRITICAL **: 09:54:42.719: gtk_box_gadget_distribute: assertion 'size >= 0' failed in GtkScrollbar
05:54:42 
05:54:42 (SWT:1344): Gtk-CRITICAL **: 09:54:42.721: gtk_box_gadget_distribute: assertion 'size >= 0' failed in GtkScrollbar
05:54:42 
05:54:42 (SWT:1344): Gtk-CRITICAL **: 09:54:42.727: gtk_box_gadget_distribute: assertion 'size >= 0' failed in GtkScrollbar
05:54:42 
05:54:42 (SWT:1344): Gtk-CRITICAL **: 09:54:42.728: gtk_box_gadget_distribute: assertion 'size >= 0' failed in GtkScrollbar
05:54:42 
05:54:42 (SWT:1344): Gtk-CRITICAL **: 09:54:42.728: gtk_box_gadget_distribute: assertion 'size >= 0' failed in GtkScrollbar
05:54:42 
05:54:42 (SWT:1344): Gtk-CRITICAL **: 09:54:42.729: gtk_box_gadget_distribute: assertion 'size >= 0' failed in GtkScrollbar
05:54:42 
05:54:42 (SWT:1344): Gtk-CRITICAL **: 09:54:42.746: gtk_box_gadget_distribute: assertion 'size >= 0' failed in GtkScrollbar
05:54:42 
05:54:42 (SWT:1344): Gtk-CRITICAL **: 09:54:42.746: gtk_box_gadget_distribute: assertion 'size >= 0' failed in GtkScrollbar
05:54:42 
05:54:42 (SWT:1344): Gtk-CRITICAL **: 09:54:42.747: gtk_box_gadget_distribute: assertion 'size >= 0' failed in GtkScrollbar
05:54:42 
05:54:42 (SWT:1344): Gtk-WARNING **: 09:54:42.788: Negative content width -6 (allocation 1, extents 4x3) while allocating gadget (node toolbar, owner GtkToolbar)
05:54:43 
05:54:43 (SWT:1344): Gtk-CRITICAL **: 09:54:43.945: gtk_box_gadget_distribute: assertion 'size >= 0' failed in GtkScrollbar
05:54:43 
05:54:43 (SWT:1344): Gtk-CRITICAL **: 09:54:43.946: gtk_box_gadget_distribute: assertion 'size >= 0' failed in GtkScrollbar
05:54:44 
05:54:44 (SWT:1344): Gtk-WARNING **: 09:54:44.142: Negative content width -6 (allocation 1, extents 4x3) while allocating gadget (node toolbar, owner GtkToolbar)
05:54:44 
05:54:44 (SWT:1344): Gtk-WARNING **: 09:54:44.156: Negative content width -6 (allocation 1, extents 4x3) while allocating gadget (node toolbar, owner GtkToolbar)
05:54:44 
05:54:44 (SWT:1344): Gtk-WARNING **: 09:54:44.761: Negative content width -6 (allocation 1, extents 4x3) while allocating gadget (node toolbar, owner GtkToolbar)
05:54:45 
05:54:45 (SWT:1344): Gtk-WARNING **: 09:54:45.077: Negative content width -9 (allocation 9, extents 9x9) while allocating gadget (node entry, owner GtkEntry)
05:54:45 
05:54:45 (SWT:1344): Gtk-CRITICAL **: 09:54:45.118: gtk_box_gadget_distribute: assertion 'size >= 0' failed in GtkScrollbar
05:54:45 
05:54:45 (SWT:1344): Gtk-CRITICAL **: 09:54:45.129: gtk_box_gadget_distribute: assertion 'size >= 0' failed in GtkScrollbar
05:54:45 
05:54:45 (SWT:1344): Gtk-WARNING **: 09:54:45.134: Negative content width -6 (allocation 1, extents 4x3) while allocating gadget (node toolbar, owner GtkToolbar)
05:54:45 
05:54:45 (SWT:1344): Gtk-CRITICAL **: 09:54:45.144: gtk_box_gadget_distribute: assertion 'size >= 0' failed in GtkScrollbar
05:54:45 
05:54:45 (SWT:1344): Gtk-CRITICAL **: 09:54:45.147: gtk_box_gadget_distribute: assertion 'size >= 0' failed in GtkScrollbar
05:54:45 
05:54:45 (SWT:1344): Gtk-CRITICAL **: 09:54:45.161: gtk_box_gadget_distribute: assertion 'size >= 0' failed in GtkScrollbar
05:54:45 
05:54:45 (SWT:1344): Gtk-CRITICAL **: 09:54:45.163: gtk_box_gadget_distribute: assertion 'size >= 0' failed in GtkScrollbar
05:54:45 
05:54:45 (SWT:1344): Gtk-CRITICAL **: 09:54:45.163: gtk_box_gadget_distribute: assertion 'size >= 0' failed in GtkScrollbar
05:54:45 
05:54:45 (SWT:1344): Gtk-CRITICAL **: 09:54:45.169: gtk_box_gadget_distribute: assertion 'size >= 0' failed in GtkScrollbar
05:54:45 
05:54:45 (SWT:1344): Gtk-CRITICAL **: 09:54:45.169: gtk_box_gadget_distribute: assertion 'size >= 0' failed in GtkScrollbar
05:54:45 
05:54:45 (SWT:1344): Gtk-CRITICAL **: 09:54:45.181: gtk_box_gadget_distribute: assertion 'size >= 0' failed in GtkScrollbar
05:54:45 
05:54:45 (SWT:1344): Gtk-CRITICAL **: 09:54:45.199: gtk_box_gadget_distribute: assertion 'size >= 0' failed in GtkScrollbar
05:54:45 
05:54:45 (SWT:1344): Gtk-CRITICAL **: 09:54:45.200: gtk_box_gadget_distribute: assertion 'size >= 0' failed in GtkScrollbar
05:54:45 
05:54:45 (SWT:1344): Gtk-CRITICAL **: 09:54:45.212: gtk_box_gadget_distribute: assertion 'size >= 0' failed in GtkScrollbar
05:54:45 
05:54:45 (SWT:1344): Gtk-CRITICAL **: 09:54:45.212: gtk_box_gadget_distribute: assertion 'size >= 0' failed in GtkScrollbar
05:54:45 
05:54:45 (SWT:1344): Gtk-CRITICAL **: 09:54:45.228: gtk_box_gadget_distribute: assertion 'size >= 0' failed in GtkScrollbar
05:54:45 
05:54:45 (SWT:1344): Gtk-CRITICAL **: 09:54:45.229: gtk_box_gadget_distribute: assertion 'size >= 0' failed in GtkScrollbar
05:54:45 
05:54:45 (SWT:1344): Gtk-CRITICAL **: 09:54:45.245: gtk_box_gadget_distribute: assertion 'size >= 0' failed in GtkScrollbar
05:54:45 
05:54:45 (SWT:1344): Gtk-CRITICAL **: 09:54:45.245: gtk_box_gadget_distribute: assertion 'size >= 0' failed in GtkScrollbar
05:54:45 
05:54:45 (SWT:1344): Gtk-CRITICAL **: 09:54:45.261: gtk_box_gadget_distribute: assertion 'size >= 0' failed in GtkScrollbar
05:54:45 
05:54:45 (SWT:1344): Gtk-CRITICAL **: 09:54:45.261: gtk_box_gadget_distribute: assertion 'size >= 0' failed in GtkScrollbar
05:54:45 
05:54:45 (SWT:1344): Gtk-CRITICAL **: 09:54:45.278: gtk_box_gadget_distribute: assertion 'size >= 0' failed in GtkScrollbar
05:54:45 
05:54:45 (SWT:1344): Gtk-CRITICAL **: 09:54:45.278: gtk_box_gadget_distribute: assertion 'size >= 0' failed in GtkScrollbar
05:54:45 
05:54:45 (SWT:1344): Gtk-CRITICAL **: 09:54:45.295: gtk_box_gadget_distribute: assertion 'size >= 0' failed in GtkScrollbar
05:54:45 
05:54:45 (SWT:1344): Gtk-CRITICAL **: 09:54:45.295: gtk_box_gadget_distribute: assertion 'size >= 0' failed in GtkScrollbar
05:54:45 
05:54:45 (SWT:1344): Gtk-CRITICAL **: 09:54:45.312: gtk_box_gadget_distribute: assertion 'size >= 0' failed in GtkScrollbar
05:54:45 
05:54:45 (SWT:1344): Gtk-CRITICAL **: 09:54:45.312: gtk_box_gadget_distribute: assertion 'size >= 0' failed in GtkScrollbar
05:54:45 
05:54:45 (SWT:1344): Gtk-CRITICAL **: 09:54:45.318: gtk_box_gadget_distribute: assertion 'size >= 0' failed in GtkScrollbar
05:54:45 
05:54:45 (SWT:1344): Gtk-CRITICAL **: 09:54:45.319: gtk_box_gadget_distribute: assertion 'size >= 0' failed in GtkScrollbar
05:54:45 
05:54:45 (SWT:1344): Gtk-CRITICAL **: 09:54:45.321: gtk_box_gadget_distribute: assertion 'size >= 0' failed in GtkScrollbar
05:54:45 
05:54:45 (SWT:1344): Gtk-CRITICAL **: 09:54:45.322: gtk_box_gadget_distribute: assertion 'size >= 0' failed in GtkScrollbar
05:54:45 
05:54:45 (SWT:1344): Gtk-CRITICAL **: 09:54:45.326: gtk_box_gadget_distribute: assertion 'size >= 0' failed in GtkScrollbar
05:54:45 
05:54:45 (SWT:1344): Gtk-CRITICAL **: 09:54:45.329: gtk_box_gadget_distribute: assertion 'size >= 0' failed in GtkScrollbar
05:54:45 
05:54:45 (SWT:1344): Gtk-CRITICAL **: 09:54:45.329: gtk_box_gadget_distribute: assertion 'size >= 0' failed in GtkScrollbar
05:54:45 
05:54:45 (SWT:1344): Gtk-CRITICAL **: 09:54:45.336: gtk_box_gadget_distribute: assertion 'size >= 0' failed in GtkScrollbar
05:54:45 
05:54:45 (SWT:1344): Gtk-CRITICAL **: 09:54:45.352: gtk_box_gadget_distribute: assertion 'size >= 0' failed in GtkScrollbar
05:54:45 
05:54:45 (SWT:1344): Gtk-CRITICAL **: 09:54:45.391: gtk_box_gadget_distribute: assertion 'size >= 0' failed in GtkScrollbar
05:54:45 
05:54:45 (SWT:1344): Gtk-WARNING **: 09:54:45.524: Negative content width -6 (allocation 1, extents 4x3) while allocating gadget (node toolbar, owner GtkToolbar)
05:54:46 
05:54:46 (SWT:1344): Gtk-CRITICAL **: 09:54:46.560: gtk_box_gadget_distribute: assertion 'size >= 0' failed in GtkScrollbar
05:54:46 
05:54:46 (SWT:1344): Gtk-CRITICAL **: 09:54:46.561: gtk_box_gadget_distribute: assertion 'size >= 0' failed in GtkScrollbar
05:54:46 
05:54:46 (SWT:1344): Gtk-WARNING **: 09:54:46.742: Negative content width -6 (allocation 1, extents 4x3) while allocating gadget (node toolbar, owner GtkToolbar)
05:54:46 
05:54:46 (SWT:1344): Gtk-WARNING **: 09:54:46.756: Negative content width -6 (allocation 1, extents 4x3) while allocating gadget (node toolbar, owner GtkToolbar)
05:54:47 
05:54:47 (SWT:1344): Gtk-WARNING **: 09:54:47.375: Negative content width -6 (allocation 1, extents 4x3) while allocating gadget (node toolbar, owner GtkToolbar)
05:54:47 
05:54:47 (SWT:1344): Gtk-WARNING **: 09:54:47.680: Negative content width -9 (allocation 9, extents 9x9) while allocating gadget (node entry, owner GtkEntry)
05:54:47 
05:54:47 (SWT:1344): Gtk-CRITICAL **: 09:54:47.722: gtk_box_gadget_distribute: assertion 'size >= 0' failed in GtkScrollbar
05:54:47 
05:54:47 (SWT:1344): Gtk-CRITICAL **: 09:54:47.731: gtk_box_gadget_distribute: assertion 'size >= 0' failed in GtkScrollbar
05:54:47 
05:54:47 (SWT:1344): Gtk-WARNING **: 09:54:47.737: Negative content width -6 (allocation 1, extents 4x3) while allocating gadget (node toolbar, owner GtkToolbar)
05:54:47 
05:54:47 (SWT:1344): Gtk-CRITICAL **: 09:54:47.747: gtk_box_gadget_distribute: assertion 'size >= 0' failed in GtkScrollbar
05:54:47 
05:54:47 (SWT:1344): Gtk-CRITICAL **: 09:54:47.753: gtk_box_gadget_distribute: assertion 'size >= 0' failed in GtkScrollbar
05:54:47 
05:54:47 (SWT:1344): Gtk-CRITICAL **: 09:54:47.762: gtk_box_gadget_distribute: assertion 'size >= 0' failed in GtkScrollbar
05:54:47 
05:54:47 (SWT:1344): Gtk-CRITICAL **: 09:54:47.763: gtk_box_gadget_distribute: assertion 'size >= 0' failed in GtkScrollbar
05:54:47 
05:54:47 (SWT:1344): Gtk-CRITICAL **: 09:54:47.764: gtk_box_gadget_distribute: assertion 'size >= 0' failed in GtkScrollbar
05:54:47 
05:54:47 (SWT:1344): Gtk-CRITICAL **: 09:54:47.769: gtk_box_gadget_distribute: assertion 'size >= 0' failed in GtkScrollbar
05:54:47 
05:54:47 (SWT:1344): Gtk-CRITICAL **: 09:54:47.769: gtk_box_gadget_distribute: assertion 'size >= 0' failed in GtkScrollbar
05:54:47 
05:54:47 (SWT:1344): Gtk-CRITICAL **: 09:54:47.780: gtk_box_gadget_distribute: assertion 'size >= 0' failed in GtkScrollbar
05:54:47 
05:54:47 (SWT:1344): Gtk-CRITICAL **: 09:54:47.797: gtk_box_gadget_distribute: assertion 'size >= 0' failed in GtkScrollbar
05:54:47 
05:54:47 (SWT:1344): Gtk-CRITICAL **: 09:54:47.797: gtk_box_gadget_distribute: assertion 'size >= 0' failed in GtkScrollbar
05:54:47 
05:54:47 (SWT:1344): Gtk-CRITICAL **: 09:54:47.813: gtk_box_gadget_distribute: assertion 'size >= 0' failed in GtkScrollbar
05:54:47 
05:54:47 (SWT:1344): Gtk-CRITICAL **: 09:54:47.813: gtk_box_gadget_distribute: assertion 'size >= 0' failed in GtkScrollbar
05:54:47 
05:54:47 (SWT:1344): Gtk-CRITICAL **: 09:54:47.830: gtk_box_gadget_distribute: assertion 'size >= 0' failed in GtkScrollbar
05:54:47 
05:54:47 (SWT:1344): Gtk-CRITICAL **: 09:54:47.830: gtk_box_gadget_distribute: assertion 'size >= 0' failed in GtkScrollbar
05:54:47 
05:54:47 (SWT:1344): Gtk-CRITICAL **: 09:54:47.846: gtk_box_gadget_distribute: assertion 'size >= 0' failed in GtkScrollbar
05:54:47 
05:54:47 (SWT:1344): Gtk-CRITICAL **: 09:54:47.846: gtk_box_gadget_distribute: assertion 'size >= 0' failed in GtkScrollbar
05:54:47 
05:54:47 (SWT:1344): Gtk-CRITICAL **: 09:54:47.863: gtk_box_gadget_distribute: assertion 'size >= 0' failed in GtkScrollbar
05:54:47 
05:54:47 (SWT:1344): Gtk-CRITICAL **: 09:54:47.863: gtk_box_gadget_distribute: assertion 'size >= 0' failed in GtkScrollbar
05:54:47 
05:54:47 (SWT:1344): Gtk-CRITICAL **: 09:54:47.879: gtk_box_gadget_distribute: assertion 'size >= 0' failed in GtkScrollbar
05:54:47 
05:54:47 (SWT:1344): Gtk-CRITICAL **: 09:54:47.879: gtk_box_gadget_distribute: assertion 'size >= 0' failed in GtkScrollbar
05:54:47 
05:54:47 (SWT:1344): Gtk-CRITICAL **: 09:54:47.890: gtk_box_gadget_distribute: assertion 'size >= 0' failed in GtkScrollbar
05:54:47 
05:54:47 (SWT:1344): Gtk-CRITICAL **: 09:54:47.891: gtk_box_gadget_distribute: assertion 'size >= 0' failed in GtkScrollbar
05:54:47 
05:54:47 (SWT:1344): Gtk-CRITICAL **: 09:54:47.892: gtk_box_gadget_distribute: assertion 'size >= 0' failed in GtkScrollbar
05:54:47 
05:54:47 (SWT:1344): Gtk-CRITICAL **: 09:54:47.893: gtk_box_gadget_distribute: assertion 'size >= 0' failed in GtkScrollbar
05:54:47 
05:54:47 (SWT:1344): Gtk-CRITICAL **: 09:54:47.894: gtk_box_gadget_distribute: assertion 'size >= 0' failed in GtkScrollbar
05:54:47 
05:54:47 (SWT:1344): Gtk-CRITICAL **: 09:54:47.894: gtk_box_gadget_distribute: assertion 'size >= 0' failed in GtkScrollbar
05:54:47 
05:54:47 (SWT:1344): Gtk-CRITICAL **: 09:54:47.896: gtk_box_gadget_distribute: assertion 'size >= 0' failed in GtkScrollbar
05:54:47 
05:54:47 (SWT:1344): Gtk-CRITICAL **: 09:54:47.896: gtk_box_gadget_distribute: assertion 'size >= 0' failed in GtkScrollbar
05:54:47 
05:54:47 (SWT:1344): Gtk-CRITICAL **: 09:54:47.913: gtk_box_gadget_distribute: assertion 'size >= 0' failed in GtkScrollbar
05:54:47 
05:54:47 (SWT:1344): Gtk-CRITICAL **: 09:54:47.915: gtk_box_gadget_distribute: assertion 'size >= 0' failed in GtkScrollbar
05:54:47 
05:54:47 (SWT:1344): Gtk-CRITICAL **: 09:54:47.925: gtk_box_gadget_distribute: assertion 'size >= 0' failed in GtkScrollbar
05:54:47 
05:54:47 (SWT:1344): Gtk-CRITICAL **: 09:54:47.926: gtk_box_gadget_distribute: assertion 'size >= 0' failed in GtkScrollbar
05:54:47 
05:54:47 (SWT:1344): Gtk-CRITICAL **: 09:54:47.928: gtk_box_gadget_distribute: assertion 'size >= 0' failed in GtkScrollbar
05:54:47 
05:54:47 (SWT:1344): Gtk-CRITICAL **: 09:54:47.930: gtk_box_gadget_distribute: assertion 'size >= 0' failed in GtkScrollbar
05:54:47 
05:54:47 (SWT:1344): Gtk-CRITICAL **: 09:54:47.930: gtk_box_gadget_distribute: assertion 'size >= 0' failed in GtkScrollbar
05:54:47 
05:54:47 (SWT:1344): Gtk-CRITICAL **: 09:54:47.947: gtk_box_gadget_distribute: assertion 'size >= 0' failed in GtkScrollbar
05:54:47 
05:54:47 (SWT:1344): Gtk-WARNING **: 09:54:47.992: Negative content width -6 (allocation 1, extents 4x3) while allocating gadget (node toolbar, owner GtkToolbar)
05:54:49 
05:54:49 (SWT:1344): Gtk-CRITICAL **: 09:54:49.163: gtk_box_gadget_distribute: assertion 'size >= 0' failed in GtkScrollbar
05:54:49 
05:54:49 (SWT:1344): Gtk-CRITICAL **: 09:54:49.164: gtk_box_gadget_distribute: assertion 'size >= 0' failed in GtkScrollbar
05:54:49 
05:54:49 (SWT:1344): Gtk-WARNING **: 09:54:49.350: Negative content width -6 (allocation 1, extents 4x3) while allocating gadget (node toolbar, owner GtkToolbar)
05:54:49 
05:54:49 (SWT:1344): Gtk-WARNING **: 09:54:49.365: Negative content width -6 (allocation 1, extents 4x3) while allocating gadget (node toolbar, owner GtkToolbar)
05:54:49 
05:54:49 (SWT:1344): Gtk-WARNING **: 09:54:49.972: Negative content width -6 (allocation 1, extents 4x3) while allocating gadget (node toolbar, owner GtkToolbar)
05:54:50 
05:54:50 (SWT:1344): Gtk-WARNING **: 09:54:50.337: Negative content width -9 (allocation 9, extents 9x9) while allocating gadget (node entry, owner GtkEntry)
05:54:50 
05:54:50 (SWT:1344): Gtk-CRITICAL **: 09:54:50.382: gtk_box_gadget_distribute: assertion 'size >= 0' failed in GtkScrollbar
05:54:50 
05:54:50 (SWT:1344): Gtk-CRITICAL **: 09:54:50.392: gtk_box_gadget_distribute: assertion 'size >= 0' failed in GtkScrollbar
05:54:50 
05:54:50 (SWT:1344): Gtk-WARNING **: 09:54:50.397: Negative content width -6 (allocation 1, extents 4x3) while allocating gadget (node toolbar, owner GtkToolbar)
05:54:50 
05:54:50 (SWT:1344): Gtk-CRITICAL **: 09:54:50.409: gtk_box_gadget_distribute: assertion 'size >= 0' failed in GtkScrollbar
05:54:50 
05:54:50 (SWT:1344): Gtk-CRITICAL **: 09:54:50.416: gtk_box_gadget_distribute: assertion 'size >= 0' failed in GtkScrollbar
05:54:50 
05:54:50 (SWT:1344): Gtk-CRITICAL **: 09:54:50.424: gtk_box_gadget_distribute: assertion 'size >= 0' failed in GtkScrollbar
05:54:50 
05:54:50 (SWT:1344): Gtk-CRITICAL **: 09:54:50.426: gtk_box_gadget_distribute: assertion 'size >= 0' failed in GtkScrollbar
05:54:50 
05:54:50 (SWT:1344): Gtk-CRITICAL **: 09:54:50.426: gtk_box_gadget_distribute: assertion 'size >= 0' failed in GtkScrollbar
05:54:50 
05:54:50 (SWT:1344): Gtk-CRITICAL **: 09:54:50.431: gtk_box_gadget_distribute: assertion 'size >= 0' failed in GtkScrollbar
05:54:50 
05:54:50 (SWT:1344): Gtk-CRITICAL **: 09:54:50.432: gtk_box_gadget_distribute: assertion 'size >= 0' failed in GtkScrollbar
05:54:50 
05:54:50 (SWT:1344): Gtk-CRITICAL **: 09:54:50.443: gtk_box_gadget_distribute: assertion 'size >= 0' failed in GtkScrollbar
05:54:50 
05:54:50 (SWT:1344): Gtk-CRITICAL **: 09:54:50.458: gtk_box_gadget_distribute: assertion 'size >= 0' failed in GtkScrollbar
05:54:50 
05:54:50 (SWT:1344): Gtk-CRITICAL **: 09:54:50.458: gtk_box_gadget_distribute: assertion 'size >= 0' failed in GtkScrollbar
05:54:50 
05:54:50 (SWT:1344): Gtk-CRITICAL **: 09:54:50.475: gtk_box_gadget_distribute: assertion 'size >= 0' failed in GtkScrollbar
05:54:50 
05:54:50 (SWT:1344): Gtk-CRITICAL **: 09:54:50.475: gtk_box_gadget_distribute: assertion 'size >= 0' failed in GtkScrollbar
05:54:50 
05:54:50 (SWT:1344): Gtk-CRITICAL **: 09:54:50.491: gtk_box_gadget_distribute: assertion 'size >= 0' failed in GtkScrollbar
05:54:50 
05:54:50 (SWT:1344): Gtk-CRITICAL **: 09:54:50.491: gtk_box_gadget_distribute: assertion 'size >= 0' failed in GtkScrollbar
05:54:50 
05:54:50 (SWT:1344): Gtk-CRITICAL **: 09:54:50.508: gtk_box_gadget_distribute: assertion 'size >= 0' failed in GtkScrollbar
05:54:50 
05:54:50 (SWT:1344): Gtk-CRITICAL **: 09:54:50.508: gtk_box_gadget_distribute: assertion 'size >= 0' failed in GtkScrollbar
05:54:50 
05:54:50 (SWT:1344): Gtk-CRITICAL **: 09:54:50.525: gtk_box_gadget_distribute: assertion 'size >= 0' failed in GtkScrollbar
05:54:50 
05:54:50 (SWT:1344): Gtk-CRITICAL **: 09:54:50.525: gtk_box_gadget_distribute: assertion 'size >= 0' failed in GtkScrollbar
05:54:50 
05:54:50 (SWT:1344): Gtk-CRITICAL **: 09:54:50.542: gtk_box_gadget_distribute: assertion 'size >= 0' failed in GtkScrollbar
05:54:50 
05:54:50 (SWT:1344): Gtk-CRITICAL **: 09:54:50.543: gtk_box_gadget_distribute: assertion 'size >= 0' failed in GtkScrollbar
05:54:50 
05:54:50 (SWT:1344): Gtk-CRITICAL **: 09:54:50.552: gtk_box_gadget_distribute: assertion 'size >= 0' failed in GtkScrollbar
05:54:50 
05:54:50 (SWT:1344): Gtk-CRITICAL **: 09:54:50.552: gtk_box_gadget_distribute: assertion 'size >= 0' failed in GtkScrollbar
05:54:50 
05:54:50 (SWT:1344): Gtk-CRITICAL **: 09:54:50.554: gtk_box_gadget_distribute: assertion 'size >= 0' failed in GtkScrollbar
05:54:50 
05:54:50 (SWT:1344): Gtk-CRITICAL **: 09:54:50.554: gtk_box_gadget_distribute: assertion 'size >= 0' failed in GtkScrollbar
05:54:50 
05:54:50 (SWT:1344): Gtk-CRITICAL **: 09:54:50.555: gtk_box_gadget_distribute: assertion 'size >= 0' failed in GtkScrollbar
05:54:50 
05:54:50 (SWT:1344): Gtk-CRITICAL **: 09:54:50.555: gtk_box_gadget_distribute: assertion 'size >= 0' failed in GtkScrollbar
05:54:50 
05:54:50 (SWT:1344): Gtk-CRITICAL **: 09:54:50.558: gtk_box_gadget_distribute: assertion 'size >= 0' failed in GtkScrollbar
05:54:50 
05:54:50 (SWT:1344): Gtk-CRITICAL **: 09:54:50.558: gtk_box_gadget_distribute: assertion 'size >= 0' failed in GtkScrollbar
05:54:50 
05:54:50 (SWT:1344): Gtk-CRITICAL **: 09:54:50.565: gtk_box_gadget_distribute: assertion 'size >= 0' failed in GtkScrollbar
05:54:50 
05:54:50 (SWT:1344): Gtk-CRITICAL **: 09:54:50.565: gtk_box_gadget_distribute: assertion 'size >= 0' failed in GtkScrollbar
05:54:50 
05:54:50 (SWT:1344): Gtk-CRITICAL **: 09:54:50.566: gtk_box_gadget_distribute: assertion 'size >= 0' failed in GtkScrollbar
05:54:50 
05:54:50 (SWT:1344): Gtk-CRITICAL **: 09:54:50.576: gtk_box_gadget_distribute: assertion 'size >= 0' failed in GtkScrollbar
05:54:50 
05:54:50 (SWT:1344): Gtk-CRITICAL **: 09:54:50.576: gtk_box_gadget_distribute: assertion 'size >= 0' failed in GtkScrollbar
05:54:50 
05:54:50 (SWT:1344): Gtk-CRITICAL **: 09:54:50.597: gtk_box_gadget_distribute: assertion 'size >= 0' failed in GtkScrollbar
05:54:50 
05:54:50 (SWT:1344): Gtk-WARNING **: 09:54:50.634: Negative content width -6 (allocation 1, extents 4x3) while allocating gadget (node toolbar, owner GtkToolbar)
05:54:51 
05:54:51 (SWT:1344): Gtk-WARNING **: 09:54:51.884: Negative content width -6 (allocation 1, extents 4x3) while allocating gadget (node toolbar, owner GtkToolbar)
05:54:51 
05:54:51 (SWT:1344): Gtk-WARNING **: 09:54:51.898: Negative content width -6 (allocation 1, extents 4x3) while allocating gadget (node toolbar, owner GtkToolbar)
05:54:52 Tests run: 9, Failures: 0, Errors: 0, Skipped: 0, Time elapsed: 24.824 s - in org.eclipse.egit.ui.test.stagview.StagingViewTest
05:54:52 testAmend(org.eclipse.egit.ui.test.stagview.StagingViewTest)  Time elapsed: 2.922 s
05:54:52 testCommitSingleFile(org.eclipse.egit.ui.test.stagview.StagingViewTest)  Time elapsed: 2.591 s
05:54:52 testMergeConflict(org.eclipse.egit.ui.test.stagview.StagingViewTest)  Time elapsed: 3.598 s
05:54:52 testCommitMessageConfigChangeAmending(org.eclipse.egit.ui.test.stagview.StagingViewTest)  Time elapsed: 2.508 s
05:54:52 testCommitMessageConfigChangeWithAuthor(org.eclipse.egit.ui.test.stagview.StagingViewTest)  Time elapsed: 2.6 s
05:54:52 testCommitMessageConfigChange(org.eclipse.egit.ui.test.stagview.StagingViewTest)  Time elapsed: 2.838 s
05:54:52 testCommitMessageConfigChangeBranchSwitchToNew(org.eclipse.egit.ui.test.stagview.StagingViewTest)  Time elapsed: 2.599 s
05:54:52 testCommitMessageCommitterChangeSignOff(org.eclipse.egit.ui.test.stagview.StagingViewTest)  Time elapsed: 2.611 s
05:54:52 testCommitMessageConfigChangeNoSignOff(org.eclipse.egit.ui.test.stagview.StagingViewTest)  Time elapsed: 2.532 s
05:54:52 
05:54:52 Results:
05:54:52 
05:54:52 Failures: 
05:54:52   GitRepositoriesViewTest.testImportWizardGeneralProject:371 expected:<0> but was:<1>
05:54:52 
05:54:52 Tests run: 468, Failures: 1, Errors: 0, Skipped: 13
05:54:52 
05:54:53 
05:54:53 !ENTRY org.eclipse.core.resources 2 10035 2019-03-28 09:54:53.146
05:54:53 !MESSAGE The workspace will exit with unsaved changes in this session.
05:54:54 [INFO] ------------------------------------------------------------------------
05:54:54 [INFO] BUILD FAILURE
05:54:54 [INFO] ------------------------------------------------------------------------
05:54:54 [INFO] Total time:  12:58 min
05:54:54 [INFO] Finished at: 2019-03-28T09:54:54Z
05:54:54 [INFO] ------------------------------------------------------------------------
05:54:54 [ERROR] Failed to execute goal org.eclipse.tycho:tycho-surefire-plugin:1.3.0:test (default-test) on project org.eclipse.egit.ui.test: There are test failures.
05:54:54 [ERROR] 
05:54:54 [ERROR] Please refer to /home/jenkins/workspace/egit.gerrit/repo/org.eclipse.egit.ui.test/target/surefire-reports for the individual test results.
05:54:54 [ERROR] -> [Help 1]
05:54:54 org.apache.maven.lifecycle.LifecycleExecutionException: Failed to execute goal org.eclipse.tycho:tycho-surefire-plugin:1.3.0:test (default-test) on project org.eclipse.egit.ui.test: There are test failures.
05:54:54 
05:54:54 Please refer to /home/jenkins/workspace/egit.gerrit/repo/org.eclipse.egit.ui.test/target/surefire-reports for the individual test results.
05:54:54     at org.apache.maven.lifecycle.internal.MojoExecutor.execute (MojoExecutor.java:215)
05:54:54     at org.apache.maven.lifecycle.internal.MojoExecutor.execute (MojoExecutor.java:156)
05:54:54     at org.apache.maven.lifecycle.internal.MojoExecutor.execute (MojoExecutor.java:148)
05:54:54     at org.apache.maven.lifecycle.internal.LifecycleModuleBuilder.buildProject (LifecycleModuleBuilder.java:117)
05:54:54     at org.apache.maven.lifecycle.internal.LifecycleModuleBuilder.buildProject (LifecycleModuleBuilder.java:81)
05:54:54     at org.apache.maven.lifecycle.internal.builder.singlethreaded.SingleThreadedBuilder.build (SingleThreadedBuilder.java:56)
05:54:54     at org.apache.maven.lifecycle.internal.LifecycleStarter.execute (LifecycleStarter.java:128)
05:54:54     at org.apache.maven.DefaultMaven.doExecute (DefaultMaven.java:305)
05:54:54     at org.apache.maven.DefaultMaven.doExecute (DefaultMaven.java:192)
05:54:54     at org.apache.maven.DefaultMaven.execute (DefaultMaven.java:105)
05:54:54     at org.apache.maven.cli.MavenCli.execute (MavenCli.java:956)
05:54:54     at org.apache.maven.cli.MavenCli.doMain (MavenCli.java:288)
05:54:54     at org.apache.maven.cli.MavenCli.main (MavenCli.java:192)
05:54:54     at sun.reflect.NativeMethodAccessorImpl.invoke0 (Native Method)
05:54:54     at sun.reflect.NativeMethodAccessorImpl.invoke (NativeMethodAccessorImpl.java:62)
05:54:54     at sun.reflect.DelegatingMethodAccessorImpl.invoke (DelegatingMethodAccessorImpl.java:43)
05:54:54     at java.lang.reflect.Method.invoke (Method.java:498)
05:54:54     at org.codehaus.plexus.classworlds.launcher.Launcher.launchEnhanced (Launcher.java:289)
05:54:54     at org.codehaus.plexus.classworlds.launcher.Launcher.launch (Launcher.java:229)
05:54:54     at org.codehaus.plexus.classworlds.launcher.Launcher.mainWithExitCode (Launcher.java:415)
05:54:54     at org.codehaus.plexus.classworlds.launcher.Launcher.main (Launcher.java:356)
05:54:54 Caused by: org.apache.maven.plugin.MojoFailureException: There are test failures.
05:54:54 
05:54:54 Please refer to /home/jenkins/workspace/egit.gerrit/repo/org.eclipse.egit.ui.test/target/surefire-reports for the individual test results.
05:54:54     at org.eclipse.tycho.surefire.TestMojo.runTest (TestMojo.java:1044)
05:54:54     at org.eclipse.tycho.surefire.TestMojo.execute (TestMojo.java:693)
05:54:54     at org.apache.maven.plugin.DefaultBuildPluginManager.executeMojo (DefaultBuildPluginManager.java:137)
05:54:54     at org.apache.maven.lifecycle.internal.MojoExecutor.execute (MojoExecutor.java:210)
05:54:54     at org.apache.maven.lifecycle.internal.MojoExecutor.execute (MojoExecutor.java:156)
05:54:54     at org.apache.maven.lifecycle.internal.MojoExecutor.execute (MojoExecutor.java:148)
05:54:54     at org.apache.maven.lifecycle.internal.LifecycleModuleBuilder.buildProject (LifecycleModuleBuilder.java:117)
05:54:54     at org.apache.maven.lifecycle.internal.LifecycleModuleBuilder.buildProject (LifecycleModuleBuilder.java:81)
05:54:54     at org.apache.maven.lifecycle.internal.builder.singlethreaded.SingleThreadedBuilder.build (SingleThreadedBuilder.java:56)
05:54:54     at org.apache.maven.lifecycle.internal.LifecycleStarter.execute (LifecycleStarter.java:128)
05:54:54     at org.apache.maven.DefaultMaven.doExecute (DefaultMaven.java:305)
05:54:54     at org.apache.maven.DefaultMaven.doExecute (DefaultMaven.java:192)
05:54:54     at org.apache.maven.DefaultMaven.execute (DefaultMaven.java:105)
05:54:54     at org.apache.maven.cli.MavenCli.execute (MavenCli.java:956)
05:54:54     at org.apache.maven.cli.MavenCli.doMain (MavenCli.java:288)
05:54:54     at org.apache.maven.cli.MavenCli.main (MavenCli.java:192)
05:54:54     at sun.reflect.NativeMethodAccessorImpl.invoke0 (Native Method)
05:54:54     at sun.reflect.NativeMethodAccessorImpl.invoke (NativeMethodAccessorImpl.java:62)
05:54:54     at sun.reflect.DelegatingMethodAccessorImpl.invoke (DelegatingMethodAccessorImpl.java:43)
05:54:54     at java.lang.reflect.Method.invoke (Method.java:498)
05:54:54     at org.codehaus.plexus.classworlds.launcher.Launcher.launchEnhanced (Launcher.java:289)
05:54:54     at org.codehaus.plexus.classworlds.launcher.Launcher.launch (Launcher.java:229)
05:54:54     at org.codehaus.plexus.classworlds.launcher.Launcher.mainWithExitCode (Launcher.java:415)
05:54:54     at org.codehaus.plexus.classworlds.launcher.Launcher.main (Launcher.java:356)
05:54:54 [ERROR] 
05:54:54 [ERROR] Re-run Maven using the -X switch to enable full debug logging.
05:54:54 [ERROR] 
05:54:54 [ERROR] For more information about the errors and possible solutions, please read the following articles:
05:54:54 [ERROR] [Help 1] http://cwiki.apache.org/confluence/display/MAVEN/MojoFailureException
05:54:54 [INFO] Build failures were ignored.
05:54:54 [egit.gerrit] $ /opt/tools/apache-maven/latest/bin/mvn -f repo/org.eclipse.egit.mylyn.ui.test/pom.xml -DGERRIT_BRANCH=master -DGERRIT_PATCHSET_REVISION=b4e44e37f79af2226db7264af6282a15157f54c8 -DGERRIT_HOST=gerrit-local -DGERRIT_CHANGE_OWNER_EMAIL=michael.keppler@gmx.de "-DGERRIT_EVENT_ACCOUNT_NAME=Michael Keppler" -DTEST_PARAMS=-Declipse.consoleLog=true -DGERRIT_CHANGE_URL=https://git.eclipse.org/r/139444 -DGERRIT_PATCHSET_UPLOADER_EMAIL=michael.keppler@gmx.de -DGERRIT_EVENT_TYPE=patchset-created -DGERRIT_PROJECT=egit/egit -DGERRIT_CHANGE_NUMBER=139444 -DGERRIT_SCHEME=ssh '-DGERRIT_PATCHSET_UPLOADER=\"Michael Keppler\" <michael.keppler@gmx.de>' -DGERRIT_PORT=29418 -DGERRIT_CHANGE_PRIVATE_STATE=false -DGERRIT_REFSPEC=refs/changes/44/139444/2 -DJGIT_VERSION=5.4.0-SNAPSHOT "-DGERRIT_PATCHSET_UPLOADER_NAME=Michael Keppler" '-DGERRIT_CHANGE_OWNER=\"Michael Keppler\" <michael.keppler@gmx.de>' -DGERRIT_CHANGE_COMMIT_MESSAGE=Y29udmVydCB0YXJnZXQgcGxhdGZvcm0gdG8gc2ltcGxlIFBPTSBwcm9qZWN0CgpUaGVyZSBpcyBubyByZWFzb24gd2h5IHRoaXMgaXMgYSBwbHVnaW4gcHJvamVjdC4gSXQgaXMgc3VmZmljaWVudCBhcwpYdGV4dCBuYXR1cmUgcHJvamVjdCB3aGljaCBpcyBvbmx5IGJ1aWx0IHZpYSBNYXZlbi4KCkNoYW5nZS1JZDogSWJlNmRmMWQ4MmViOTBlOGM4NTIwNzcyZWVhNjUxMzg1ZTk1MGFhMWIKU2lnbmVkLW9mZi1ieTogTWljaGFlbCBLZXBwbGVyIDxNaWNoYWVsLktlcHBsZXJAZ214LmRlPgo= "-DGERRIT_NAME=Eclipse Gerrit" -DGERRIT_TOPIC= "-DGERRIT_CHANGE_SUBJECT=convert target platform to simple POM project" -DJGIT_SITE=https://repo.eclipse.org/content/unzip/snapshots.unzip/org/eclipse/jgit/org.eclipse.jgit.repository/${JGIT_VERSION}/org.eclipse.jgit.repository-${JGIT_VERSION}.zip-unzip/ '-DGERRIT_EVENT_ACCOUNT=\"Michael Keppler\" <michael.keppler@gmx.de>' -DGERRIT_CHANGE_WIP_STATE=false -DGERRIT_CHANGE_ID=Ibe6df1d82eb90e8c8520772eea651385e950aa1b -DGERRIT_EVENT_HASH=396453790 -DGERRIT_VERSION=2.14.6 -DGERRIT_EVENT_ACCOUNT_EMAIL=michael.keppler@gmx.de -DGERRIT_PATCHSET_NUMBER=2 "-DGERRIT_CHANGE_OWNER_NAME=Michael Keppler" -Djava.io.tmpdir=/home/jenkins/workspace/egit.gerrit/tmp/ "-Dtest.vmparams=-Declipse.consoleLog=true -Degit.test.tmpdir=/home/jenkins/workspace/egit.gerrit/tmp/egit.tmp/" -Djgit-site=https://repo.eclipse.org/content/unzip/snapshots.unzip/org/eclipse/jgit/org.eclipse.jgit.repository/5.4.0-SNAPSHOT/org.eclipse.jgit.repository-5.4.0-SNAPSHOT.zip-unzip/ -Declipse.p2.mirrors=false -Dmaven.repo.local=/home/jenkins/workspace/egit.gerrit/.repository -B -e verify --fail-never -P other-os
05:54:54 Picked up JAVA_TOOL_OPTIONS: -XX:+IgnoreUnrecognizedVMOptions -XX:+UseContainerSupport -XX:+UnlockExperimentalVMOptions -XX:+UseCGroupMemoryLimitForHeap
05:54:54 Picked up _JAVA_OPTIONS: -XX:MaxRAMPercentage=64.0
05:54:55 [INFO] Error stacktraces are turned on.
05:54:56 [INFO] Scanning for projects...
05:54:58 [INFO] Computing target platform for MavenProject: org.eclipse.egit:org.eclipse.egit.mylyn.ui.test:5.4.0-SNAPSHOT @ /home/jenkins/workspace/egit.gerrit/repo/org.eclipse.egit.mylyn.ui.test/pom.xml
05:55:03 [INFO] Adding repository http://download.eclipse.org/jetty/updates/jetty-bundles-9.x/9.4.14.v20181114
05:55:03 [INFO] Fetching p2.index from http://download.eclipse.org/technology/swtbot/snapshots/
05:55:03 [INFO] Fetching p2.index from http://download.eclipse.org/technology/swtbot/snapshots/
05:55:03 [INFO] Adding repository http://download.eclipse.org/technology/swtbot/snapshots
05:55:03 [INFO] Fetching p2.index from http://download.eclipse.org/tools/orbit/downloads/drops/R20190226160451/repository/
05:55:03 [INFO] Fetching p2.index from http://download.eclipse.org/tools/orbit/downloads/drops/R20190226160451/repository/
05:55:03 [INFO] Adding repository http://download.eclipse.org/tools/orbit/downloads/drops/R20190226160451/repository
05:55:05 [INFO] Fetching p2.index from http://download.eclipse.org/tools/orbit/downloads/drops2/R20190226160451/repository/
05:55:05 [INFO] Fetching p2.index from http://download.eclipse.org/tools/orbit/downloads/drops2/R20190226160451/repository/
05:55:05 [INFO] Fetching p2.index from http://download.eclipse.org/releases/neon/
05:55:05 [INFO] Fetching p2.index from http://download.eclipse.org/releases/neon/
05:55:05 [INFO] Adding repository http://download.eclipse.org/releases/neon
05:55:05 [INFO] Fetching p2.index from http://download.eclipse.org/technology/epp/packages/neon/
05:55:05 [INFO] Fetching p2.index from http://download.eclipse.org/technology/epp/packages/neon/
05:55:05 [INFO] Fetching p2.index from http://download.eclipse.org/releases/neon/201705151400/
05:55:05 [INFO] Fetching p2.index from http://download.eclipse.org/releases/neon/201705151400/
05:55:07 [INFO] Fetching p2.index from http://download.eclipse.org/releases/neon/201703141400/
05:55:07 [INFO] Fetching p2.index from http://download.eclipse.org/releases/neon/201703141400/
05:55:08 [INFO] Fetching p2.index from http://download.eclipse.org/releases/neon/201703231000/
05:55:08 [INFO] Fetching p2.index from http://download.eclipse.org/releases/neon/201703231000/
05:55:10 [INFO] Fetching p2.index from http://download.eclipse.org/releases/neon/201606221000/
05:55:10 [INFO] Fetching p2.index from http://download.eclipse.org/releases/neon/201606221000/
05:55:11 [INFO] Fetching p2.index from http://download.eclipse.org/releases/neon/201609281000/
05:55:11 [INFO] Fetching p2.index from http://download.eclipse.org/releases/neon/201609281000/
05:55:13 [INFO] Fetching p2.index from http://download.eclipse.org/releases/neon/201610111000/
05:55:13 [INFO] Fetching p2.index from http://download.eclipse.org/releases/neon/201610111000/
05:55:14 [INFO] Fetching p2.index from http://download.eclipse.org/releases/neon/201612211000/
05:55:14 [INFO] Fetching p2.index from http://download.eclipse.org/releases/neon/201612211000/
05:55:21 [INFO] Fetching p2.index from https://repo.eclipse.org/content/unzip/snapshots.unzip/org/eclipse/jgit/org.eclipse.jgit.repository/5.4.0-SNAPSHOT/org.eclipse.jgit.repository-5.4.0-SNAPSHOT.zip-unzip/ (172B)
05:55:21 [INFO] Fetching p2.index from https://repo.eclipse.org/content/unzip/snapshots.unzip/org/eclipse/jgit/org.eclipse.jgit.repository/5.4.0-SNAPSHOT/org.eclipse.jgit.repository-5.4.0-SNAPSHOT.zip-unzip/ (172B)
05:55:21 [INFO] Adding repository https://repo.eclipse.org/content/unzip/snapshots.unzip/org/eclipse/jgit/org.eclipse.jgit.repository/5.4.0-SNAPSHOT/org.eclipse.jgit.repository-5.4.0-SNAPSHOT.zip-unzip
05:55:21 [INFO] Fetching p2.index from http://download.eclipse.org/cbi/updates/license/
05:55:21 [INFO] Fetching p2.index from http://download.eclipse.org/cbi/updates/license/
05:55:21 [INFO] Adding repository http://download.eclipse.org/cbi/updates/license
05:55:21 [INFO] Fetching p2.index from http://download.eclipse.org/cbi/updates/license/2.0.0.v20180130-0820/
05:55:21 [INFO] Fetching p2.index from http://download.eclipse.org/cbi/updates/license/2.0.0.v20180130-0820/
05:55:21 [INFO] Fetching p2.index from http://download.eclipse.org/cbi/updates/license/2.0.1.v20180423-1114/
05:55:21 [INFO] Fetching p2.index from http://download.eclipse.org/cbi/updates/license/2.0.1.v20180423-1114/
05:55:21 [INFO] Resolving dependencies of MavenProject: org.eclipse.egit:org.eclipse.egit.mylyn.ui.test:5.4.0-SNAPSHOT @ /home/jenkins/workspace/egit.gerrit/repo/org.eclipse.egit.mylyn.ui.test/pom.xml
05:55:22 [WARNING] The following locally built units have been used to resolve project dependencies:
05:55:22 [WARNING]   org.eclipse.egit.mylyn.feature.group/5.4.0.201903280930
05:55:22 [WARNING]   org.eclipse.egit.feature.jar/5.4.0.201903280930
05:55:22 [WARNING]   org.eclipse.egit/5.4.0.201903280930
05:55:22 [WARNING]   org.eclipse.egit.feature.group/5.4.0.201903280930
05:55:22 [WARNING]   org.eclipse.egit.mylyn.feature.jar/5.4.0.201903280930
05:55:22 [WARNING]   org.eclipse.egit.core/5.4.0.201903280930
05:55:22 [WARNING]   org.eclipse.egit.ui/5.4.0.201903280930
05:55:22 [WARNING]   org.eclipse.egit.doc/5.4.0.201903280930
05:55:22 [WARNING]   org.eclipse.egit.mylyn.ui/5.4.0.201903280930
05:55:22 [INFO] Resolving class path of MavenProject: org.eclipse.egit:org.eclipse.egit.mylyn.ui.test:5.4.0-SNAPSHOT @ /home/jenkins/workspace/egit.gerrit/repo/org.eclipse.egit.mylyn.ui.test/pom.xml
05:55:22 [INFO] 
05:55:22 [INFO] ----------< org.eclipse.egit:org.eclipse.egit.mylyn.ui.test >-----------
05:55:22 [INFO] Building EGit Mylyn UI Test Plug-in 5.4.0-SNAPSHOT
05:55:22 [INFO] ------------------------[ eclipse-test-plugin ]-------------------------
05:55:22 [INFO] 
05:55:22 [INFO] --- tycho-packaging-plugin:1.3.0:build-qualifier (default-build-qualifier) @ org.eclipse.egit.mylyn.ui.test ---
05:55:23 [INFO] The project's OSGi version is 5.4.0.201903280954
05:55:23 [INFO] 
05:55:23 [INFO] --- tycho-packaging-plugin:1.3.0:validate-id (default-validate-id) @ org.eclipse.egit.mylyn.ui.test ---
05:55:23 [INFO] 
05:55:23 [INFO] --- tycho-packaging-plugin:1.3.0:validate-version (default-validate-version) @ org.eclipse.egit.mylyn.ui.test ---
05:55:23 [INFO] 
05:55:23 [INFO] --- maven-enforcer-plugin:3.0.0-M2:enforce (enforce-maven) @ org.eclipse.egit.mylyn.ui.test ---
05:55:23 [INFO] 
05:55:23 [INFO] --- maven-resources-plugin:2.4.3:resources (default-resources) @ org.eclipse.egit.mylyn.ui.test ---
05:55:23 [INFO] Using 'UTF-8' encoding to copy filtered resources.
05:55:23 [INFO] skip non existing resourceDirectory /home/jenkins/workspace/egit.gerrit/repo/org.eclipse.egit.mylyn.ui.test/src/main/resources
05:55:23 [INFO] 
05:55:23 [INFO] --- tycho-compiler-plugin:1.3.0:compile (default-compile) @ org.eclipse.egit.mylyn.ui.test ---
05:55:23 [INFO] Nothing to compile - all classes are up to date
05:55:23 [INFO] 
05:55:23 [INFO] --- maven-resources-plugin:2.4.3:testResources (default-testResources) @ org.eclipse.egit.mylyn.ui.test ---
05:55:23 [INFO] Using 'UTF-8' encoding to copy filtered resources.
05:55:23 [INFO] skip non existing resourceDirectory /home/jenkins/workspace/egit.gerrit/repo/org.eclipse.egit.mylyn.ui.test/src/test/resources
05:55:23 [INFO] 
05:55:23 [INFO] --- target-platform-configuration:1.3.0:target-platform (default-target-platform) @ org.eclipse.egit.mylyn.ui.test ---
05:55:23 [INFO] 
05:55:23 [INFO] --- tycho-packaging-plugin:1.3.0:package-plugin (default-package-plugin) @ org.eclipse.egit.mylyn.ui.test ---
05:55:23 [INFO] Building jar: /home/jenkins/workspace/egit.gerrit/repo/org.eclipse.egit.mylyn.ui.test/target/org.eclipse.egit.mylyn.ui.test-5.4.0-SNAPSHOT.jar
05:55:23 [INFO] 
05:55:23 [INFO] --- tycho-p2-plugin:1.3.0:p2-metadata-default (default-p2-metadata-default) @ org.eclipse.egit.mylyn.ui.test ---
05:55:23 [INFO] 
05:55:23 [INFO] --- tycho-surefire-plugin:1.3.0:test (default-test) @ org.eclipse.egit.mylyn.ui.test ---
05:55:24 [INFO] Expected eclipse log file: /home/jenkins/workspace/egit.gerrit/repo/org.eclipse.egit.mylyn.ui.test/target/work/data/.metadata/.log
05:55:24 [INFO] Command line:
05:55:24 	[/opt/tools/java/oracle/jdk-8/1.8.0_202/jre/bin/java, -Dosgi.noShutdown=false, -Dosgi.os=linux, -Dosgi.ws=gtk, -Dosgi.arch=x86_64, -Declipse.consoleLog=true, -Degit.test.tmpdir=/home/jenkins/workspace/egit.gerrit/tmp/egit.tmp/, -Xmx512m, -Dosgi.clean=true, -jar, /home/jenkins/workspace/egit.gerrit/.repository/p2/osgi/bundle/org.eclipse.equinox.launcher/1.3.201.v20161025-1711/org.eclipse.equinox.launcher-1.3.201.v20161025-1711.jar, -data, /home/jenkins/workspace/egit.gerrit/repo/org.eclipse.egit.mylyn.ui.test/target/work/data, -install, /home/jenkins/workspace/egit.gerrit/repo/org.eclipse.egit.mylyn.ui.test/target/work, -configuration, /home/jenkins/workspace/egit.gerrit/repo/org.eclipse.egit.mylyn.ui.test/target/work/configuration, -application, org.eclipse.tycho.surefire.osgibooter.uitest, -testproperties, /home/jenkins/workspace/egit.gerrit/repo/org.eclipse.egit.mylyn.ui.test/target/surefire.properties, -testApplication, org.eclipse.ui.ide.workbench]
05:55:24 Picked up JAVA_TOOL_OPTIONS: -XX:+IgnoreUnrecognizedVMOptions -XX:+UseContainerSupport -XX:+UnlockExperimentalVMOptions -XX:+UseCGroupMemoryLimitForHeap
05:55:24 Picked up _JAVA_OPTIONS: -XX:MaxRAMPercentage=64.0
05:55:26 !SESSION 2019-03-28 09:55:24.389 -----------------------------------------------
05:55:26 eclipse.buildId=unknown
05:55:26 java.version=1.8.0_202
05:55:26 java.vendor=Oracle Corporation
05:55:26 BootLoader constants: OS=linux, ARCH=x86_64, WS=gtk, NL=en_US
05:55:26 Framework arguments:  -application org.eclipse.tycho.surefire.osgibooter.uitest -testproperties /home/jenkins/workspace/egit.gerrit/repo/org.eclipse.egit.mylyn.ui.test/target/surefire.properties -testApplication org.eclipse.ui.ide.workbench
05:55:26 Command-line arguments:  -data /home/jenkins/workspace/egit.gerrit/repo/org.eclipse.egit.mylyn.ui.test/target/work/data -application org.eclipse.tycho.surefire.osgibooter.uitest -testproperties /home/jenkins/workspace/egit.gerrit/repo/org.eclipse.egit.mylyn.ui.test/target/surefire.properties -testApplication org.eclipse.ui.ide.workbench
05:55:26 
05:55:26 !ENTRY org.eclipse.jdt.launching.macosx 4 0 2019-03-28 09:55:26.065
05:55:26 !MESSAGE FrameworkEvent ERROR
05:55:26 !STACK 0
05:55:26 org.osgi.framework.BundleException: Could not resolve module: org.eclipse.jdt.launching.macosx [246]
05:55:26   Unresolved requirement: Require-Capability: eclipse.platform; filter:="(osgi.os=macosx)"
05:55:26 
05:55:26 	at org.eclipse.osgi.container.Module.start(Module.java:444)
05:55:26 	at org.eclipse.osgi.container.ModuleContainer$ContainerStartLevel.incStartLevel(ModuleContainer.java:1620)
05:55:26 	at org.eclipse.osgi.container.ModuleContainer$ContainerStartLevel.incStartLevel(ModuleContainer.java:1599)
05:55:26 	at org.eclipse.osgi.container.ModuleContainer$ContainerStartLevel.doContainerStartLevel(ModuleContainer.java:1571)
05:55:26 	at org.eclipse.osgi.container.ModuleContainer$ContainerStartLevel.dispatchEvent(ModuleContainer.java:1514)
05:55:26 	at org.eclipse.osgi.container.ModuleContainer$ContainerStartLevel.dispatchEvent(ModuleContainer.java:1)
05:55:26 	at org.eclipse.osgi.framework.eventmgr.EventManager.dispatchEvent(EventManager.java:230)
05:55:26 	at org.eclipse.osgi.framework.eventmgr.EventManager$EventThread.run(EventManager.java:340)
05:55:26 
05:55:26 !ENTRY org.eclipse.jdt.launching.ui.macosx 4 0 2019-03-28 09:55:26.066
05:55:26 !MESSAGE FrameworkEvent ERROR
05:55:26 !STACK 0
05:55:26 org.osgi.framework.BundleException: Could not resolve module: org.eclipse.jdt.launching.ui.macosx [247]
05:55:26   Unresolved requirement: Require-Capability: eclipse.platform; filter:="(osgi.os=macosx)"
05:55:26 
05:55:26 	at org.eclipse.osgi.container.Module.start(Module.java:444)
05:55:26 	at org.eclipse.osgi.container.ModuleContainer$ContainerStartLevel.incStartLevel(ModuleContainer.java:1620)
05:55:26 	at org.eclipse.osgi.container.ModuleContainer$ContainerStartLevel.incStartLevel(ModuleContainer.java:1599)
05:55:26 	at org.eclipse.osgi.container.ModuleContainer$ContainerStartLevel.doContainerStartLevel(ModuleContainer.java:1571)
05:55:26 	at org.eclipse.osgi.container.ModuleContainer$ContainerStartLevel.dispatchEvent(ModuleContainer.java:1514)
05:55:26 	at org.eclipse.osgi.container.ModuleContainer$ContainerStartLevel.dispatchEvent(ModuleContainer.java:1)
05:55:26 	at org.eclipse.osgi.framework.eventmgr.EventManager.dispatchEvent(EventManager.java:230)
05:55:26 	at org.eclipse.osgi.framework.eventmgr.EventManager$EventThread.run(EventManager.java:340)
05:55:26 Launching application org.eclipse.ui.ide.workbench...
05:55:28 
05:55:28 !ENTRY org.eclipse.egit.core 1 0 2019-03-28 09:55:28.220
05:55:28 !MESSAGE Using Apache MINA sshd as ssh client.
05:55:28 
05:55:28 (SWT:2363): Gtk-WARNING **: 09:55:28.882: Negative content width -6 (allocation 1, extents 4x3) while allocating gadget (node toolbar, owner GtkToolbar)
05:55:28 
05:55:28 (SWT:2363): Gtk-WARNING **: 09:55:28.882: Negative content height -3 (allocation 1, extents 2x2) while allocating gadget (node toolbar, owner GtkToolbar)
05:55:28 
05:55:28 (SWT:2363): Gtk-WARNING **: 09:55:28.882: Negative content width -6 (allocation 1, extents 4x3) while allocating gadget (node toolbar, owner GtkToolbar)
05:55:28 
05:55:28 (SWT:2363): Gtk-WARNING **: 09:55:28.883: Negative content height -3 (allocation 1, extents 2x2) while allocating gadget (node toolbar, owner GtkToolbar)
05:55:28 
05:55:28 (SWT:2363): Gtk-WARNING **: 09:55:28.889: Negative content width -6 (allocation 1, extents 4x3) while allocating gadget (node toolbar, owner GtkToolbar)
05:55:28 
05:55:28 (SWT:2363): Gtk-WARNING **: 09:55:28.889: Negative content height -3 (allocation 1, extents 2x2) while allocating gadget (node toolbar, owner GtkToolbar)
05:55:28 
05:55:28 (SWT:2363): Gtk-WARNING **: 09:55:28.889: Negative content width -6 (allocation 1, extents 4x3) while allocating gadget (node toolbar, owner GtkToolbar)
05:55:28 
05:55:28 (SWT:2363): Gtk-WARNING **: 09:55:28.889: Negative content height -3 (allocation 1, extents 2x2) while allocating gadget (node toolbar, owner GtkToolbar)
05:55:29 
05:55:29 (SWT:2363): Gtk-WARNING **: 09:55:29.080: Negative content width -6 (allocation 1, extents 4x3) while allocating gadget (node toolbar, owner GtkToolbar)
05:55:29 
05:55:29 (SWT:2363): Gtk-WARNING **: 09:55:29.080: Negative content height -3 (allocation 1, extents 2x2) while allocating gadget (node toolbar, owner GtkToolbar)
05:55:29 
05:55:29 (SWT:2363): Gtk-WARNING **: 09:55:29.080: Negative content width -6 (allocation 1, extents 4x3) while allocating gadget (node toolbar, owner GtkToolbar)
05:55:29 
05:55:29 (SWT:2363): Gtk-WARNING **: 09:55:29.080: Negative content height -3 (allocation 1, extents 2x2) while allocating gadget (node toolbar, owner GtkToolbar)
05:55:29 
05:55:29 (SWT:2363): Gtk-WARNING **: 09:55:29.088: gtk_widget_size_allocate(): attempt to allocate widget with width -3 and height -3
05:55:29 
05:55:29 (SWT:2363): Gtk-WARNING **: 09:55:29.394: Negative content width -6 (allocation 1, extents 4x3) while allocating gadget (node toolbar, owner GtkToolbar)
05:55:29 
05:55:29 (SWT:2363): Gtk-WARNING **: 09:55:29.394: Negative content height -3 (allocation 1, extents 2x2) while allocating gadget (node toolbar, owner GtkToolbar)
05:55:29 
05:55:29 (SWT:2363): Gtk-WARNING **: 09:55:29.394: Negative content width -6 (allocation 1, extents 4x3) while allocating gadget (node toolbar, owner GtkToolbar)
05:55:29 
05:55:29 (SWT:2363): Gtk-WARNING **: 09:55:29.394: Negative content height -3 (allocation 1, extents 2x2) while allocating gadget (node toolbar, owner GtkToolbar)
05:55:29 
05:55:29 (SWT:2363): Gtk-WARNING **: 09:55:29.410: Negative content width -6 (allocation 1, extents 4x3) while allocating gadget (node toolbar, owner GtkToolbar)
05:55:29 
05:55:29 (SWT:2363): Gtk-WARNING **: 09:55:29.410: Negative content height -3 (allocation 1, extents 2x2) while allocating gadget (node toolbar, owner GtkToolbar)
05:55:29 
05:55:29 (SWT:2363): Gtk-WARNING **: 09:55:29.410: Negative content width -6 (allocation 1, extents 4x3) while allocating gadget (node toolbar, owner GtkToolbar)
05:55:29 
05:55:29 (SWT:2363): Gtk-WARNING **: 09:55:29.410: Negative content height -3 (allocation 1, extents 2x2) while allocating gadget (node toolbar, owner GtkToolbar)
05:55:29 
05:55:29 (SWT:2363): Gtk-WARNING **: 09:55:29.414: Negative content width -6 (allocation 1, extents 4x3) while allocating gadget (node toolbar, owner GtkToolbar)
05:55:29 
05:55:29 (SWT:2363): Gtk-WARNING **: 09:55:29.414: Negative content height -3 (allocation 1, extents 2x2) while allocating gadget (node toolbar, owner GtkToolbar)
05:55:29 
05:55:29 (SWT:2363): Gtk-WARNING **: 09:55:29.414: Negative content width -6 (allocation 1, extents 4x3) while allocating gadget (node toolbar, owner GtkToolbar)
05:55:29 
05:55:29 (SWT:2363): Gtk-WARNING **: 09:55:29.414: Negative content height -3 (allocation 1, extents 2x2) while allocating gadget (node toolbar, owner GtkToolbar)
05:55:29 
05:55:29 (SWT:2363): Gtk-WARNING **: 09:55:29.419: Negative content width -6 (allocation 1, extents 4x3) while allocating gadget (node toolbar, owner GtkToolbar)
05:55:29 
05:55:29 (SWT:2363): Gtk-WARNING **: 09:55:29.419: Negative content height -3 (allocation 1, extents 2x2) while allocating gadget (node toolbar, owner GtkToolbar)
05:55:29 
05:55:29 (SWT:2363): Gtk-WARNING **: 09:55:29.419: Negative content width -6 (allocation 1, extents 4x3) while allocating gadget (node toolbar, owner GtkToolbar)
05:55:29 
05:55:29 (SWT:2363): Gtk-WARNING **: 09:55:29.419: Negative content height -3 (allocation 1, extents 2x2) while allocating gadget (node toolbar, owner GtkToolbar)
05:55:30 
05:55:30 (SWT:2363): Gtk-WARNING **: 09:55:30.131: Negative content height -9 (allocation 1, extents 5x5) while allocating gadget (node button, owner GtkButton)
05:55:30 
05:55:30 (SWT:2363): Gtk-WARNING **: 09:55:30.201: Negative content width -6 (allocation 1, extents 4x3) while allocating gadget (node toolbar, owner GtkToolbar)
05:55:30 
05:55:30 (SWT:2363): Gtk-WARNING **: 09:55:30.201: Negative content height -3 (allocation 1, extents 2x2) while allocating gadget (node toolbar, owner GtkToolbar)
05:55:30 
05:55:30 (SWT:2363): Gtk-WARNING **: 09:55:30.201: Negative content width -6 (allocation 1, extents 4x3) while allocating gadget (node toolbar, owner GtkToolbar)
05:55:30 
05:55:30 (SWT:2363): Gtk-WARNING **: 09:55:30.201: Negative content height -3 (allocation 1, extents 2x2) while allocating gadget (node toolbar, owner GtkToolbar)
05:55:30 
05:55:30 (SWT:2363): Gtk-WARNING **: 09:55:30.210: Negative content width -6 (allocation 1, extents 4x3) while allocating gadget (node toolbar, owner GtkToolbar)
05:55:30 
05:55:30 (SWT:2363): Gtk-WARNING **: 09:55:30.210: Negative content height -3 (allocation 1, extents 2x2) while allocating gadget (node toolbar, owner GtkToolbar)
05:55:30 
05:55:30 (SWT:2363): Gtk-WARNING **: 09:55:30.210: Negative content width -6 (allocation 1, extents 4x3) while allocating gadget (node toolbar, owner GtkToolbar)
05:55:30 
05:55:30 (SWT:2363): Gtk-WARNING **: 09:55:30.210: Negative content height -3 (allocation 1, extents 2x2) while allocating gadget (node toolbar, owner GtkToolbar)
05:55:30 
05:55:30 (SWT:2363): Gtk-WARNING **: 09:55:30.238: Negative content width -6 (allocation 1, extents 4x3) while allocating gadget (node toolbar, owner GtkToolbar)
05:55:30 
05:55:30 (SWT:2363): Gtk-WARNING **: 09:55:30.241: Negative content width -6 (allocation 1, extents 4x3) while allocating gadget (node toolbar, owner GtkToolbar)
05:55:30 
05:55:30 (SWT:2363): Gtk-WARNING **: 09:55:30.247: Negative content width -6 (allocation 1, extents 4x3) while allocating gadget (node toolbar, owner GtkToolbar)
05:55:30 
05:55:30 (SWT:2363): Gtk-WARNING **: 09:55:30.249: Negative content width -6 (allocation 1, extents 4x3) while allocating gadget (node toolbar, owner GtkToolbar)
05:55:30 
05:55:30 (SWT:2363): Gtk-WARNING **: 09:55:30.252: Negative content width -6 (allocation 1, extents 4x3) while allocating gadget (node toolbar, owner GtkToolbar)
05:55:30 
05:55:30 (SWT:2363): Gtk-WARNING **: 09:55:30.253: Negative content width -1 (allocation 1, extents 1x1) while allocating gadget (node trough, owner GtkProgressBar)
05:55:30 
05:55:30 (SWT:2363): Gtk-WARNING **: 09:55:30.253: Negative content width -1 (allocation 1, extents 1x1) while allocating gadget (node trough, owner GtkProgressBar)
05:55:30 
05:55:30 (SWT:2363): Gtk-WARNING **: 09:55:30.293: Negative content width -6 (allocation 1, extents 4x3) while allocating gadget (node toolbar, owner GtkToolbar)
05:55:30 
05:55:30 (SWT:2363): Gtk-WARNING **: 09:55:30.294: Negative content width -6 (allocation 1, extents 4x3) while allocating gadget (node toolbar, owner GtkToolbar)
05:55:30 
05:55:30 (SWT:2363): Gtk-WARNING **: 09:55:30.298: Negative content width -6 (allocation 1, extents 4x3) while allocating gadget (node toolbar, owner GtkToolbar)
05:55:30 
05:55:30 (SWT:2363): Gtk-WARNING **: 09:55:30.299: Negative content width -6 (allocation 1, extents 4x3) while allocating gadget (node toolbar, owner GtkToolbar)
05:55:30 
05:55:30 (SWT:2363): Gtk-WARNING **: 09:55:30.303: Negative content width -6 (allocation 1, extents 4x3) while allocating gadget (node toolbar, owner GtkToolbar)
05:55:30 
05:55:30 (SWT:2363): Gtk-WARNING **: 09:55:30.304: Negative content width -6 (allocation 1, extents 4x3) while allocating gadget (node toolbar, owner GtkToolbar)
05:55:30 Running org.eclipse.egit.internal.mylyn.CommitHyperlinkDetectorTest
05:55:30 Tests run: 14, Failures: 0, Errors: 0, Skipped: 0, Time elapsed: 0.101 s - in org.eclipse.egit.internal.mylyn.CommitHyperlinkDetectorTest
05:55:30 testEndLine(org.eclipse.egit.internal.mylyn.CommitHyperlinkDetectorTest)  Time elapsed: 0.036 s
05:55:30 testGerritId(org.eclipse.egit.internal.mylyn.CommitHyperlinkDetectorTest)  Time elapsed: 0.003 s
05:55:30 testMiddleLine(org.eclipse.egit.internal.mylyn.CommitHyperlinkDetectorTest)  Time elapsed: 0.003 s
05:55:30 testOffsetOff(org.eclipse.egit.internal.mylyn.CommitHyperlinkDetectorTest)  Time elapsed: 0.004 s
05:55:30 testEmpty(org.eclipse.egit.internal.mylyn.CommitHyperlinkDetectorTest)  Time elapsed: 0.003 s
05:55:30 testBadLocation(org.eclipse.egit.internal.mylyn.CommitHyperlinkDetectorTest)  Time elapsed: 0.003 s
05:55:30 testEndSentence(org.eclipse.egit.internal.mylyn.CommitHyperlinkDetectorTest)  Time elapsed: 0.003 s
05:55:30 testMultiLine(org.eclipse.egit.internal.mylyn.CommitHyperlinkDetectorTest)  Time elapsed: 0.003 s
05:55:30 testBeginSentence(org.eclipse.egit.internal.mylyn.CommitHyperlinkDetectorTest)  Time elapsed: 0.004 s
05:55:30 testGerritIdWithinText(org.eclipse.egit.internal.mylyn.CommitHyperlinkDetectorTest)  Time elapsed: 0.003 s
05:55:30 testMultiId(org.eclipse.egit.internal.mylyn.CommitHyperlinkDetectorTest)  Time elapsed: 0.003 s
05:55:30 testSimpleId(org.eclipse.egit.internal.mylyn.CommitHyperlinkDetectorTest)  Time elapsed: 0.003 s
05:55:30 testNoDocument(org.eclipse.egit.internal.mylyn.CommitHyperlinkDetectorTest)  Time elapsed: 0.003 s
05:55:30 testOffsetMiddle(org.eclipse.egit.internal.mylyn.CommitHyperlinkDetectorTest)  Time elapsed: 0.003 s
05:55:30 
05:55:30 Results:
05:55:30 
05:55:30 Tests run: 14, Failures: 0, Errors: 0, Skipped: 0
05:55:30 
05:55:30 
05:55:30 (SWT:2363): Gtk-WARNING **: 09:55:30.544: Negative content width -6 (allocation 1, extents 4x3) while allocating gadget (node toolbar, owner GtkToolbar)
05:55:30 
05:55:30 (SWT:2363): Gtk-WARNING **: 09:55:30.545: Negative content width -6 (allocation 1, extents 4x3) while allocating gadget (node toolbar, owner GtkToolbar)
05:55:33 [INFO] All tests passed!
05:55:33 [INFO] 
05:55:33 [INFO] >>> maven-pmd-plugin:3.11.0:cpd-check (default) > :cpd @ org.eclipse.egit.mylyn.ui.test >>>
05:55:33 [INFO] 
05:55:33 [INFO] --- maven-pmd-plugin:3.11.0:cpd (cpd) @ org.eclipse.egit.mylyn.ui.test ---
05:55:33 [INFO] 
05:55:33 [INFO] <<< maven-pmd-plugin:3.11.0:cpd-check (default) < :cpd @ org.eclipse.egit.mylyn.ui.test <<<
05:55:33 [INFO] 
05:55:33 [INFO] 
05:55:33 [INFO] --- maven-pmd-plugin:3.11.0:cpd-check (default) @ org.eclipse.egit.mylyn.ui.test ---
05:55:33 [INFO] 
05:55:33 [INFO] ------------------------------------------------------------------------
05:55:33 [INFO] BUILD SUCCESS
05:55:33 [INFO] ------------------------------------------------------------------------
05:55:33 [INFO] Total time:  37.760 s
05:55:33 [INFO] Finished at: 2019-03-28T09:55:33Z
05:55:33 [INFO] ------------------------------------------------------------------------
05:55:34 Terminating xvnc.
05:59:36 [FINDBUGS] Collecting findbugs analysis files...
05:59:41 [FINDBUGS] Searching for all files in /home/jenkins/workspace/egit.gerrit that match the pattern repo/*/target/*bugsXml.xml
05:59:41 [FINDBUGS] Parsing 10 files in /home/jenkins/workspace/egit.gerrit
05:59:41 [FINDBUGS] Successfully parsed file /home/jenkins/workspace/egit.gerrit/repo/org.eclipse.egit.core.junit/target/spotbugsXml.xml with 4 unique warnings and 0 duplicates.
05:59:41 [FINDBUGS] Successfully parsed file /home/jenkins/workspace/egit.gerrit/repo/org.eclipse.egit.core.test/target/spotbugsXml.xml with 10 unique warnings and 0 duplicates.
05:59:41 [FINDBUGS] Successfully parsed file /home/jenkins/workspace/egit.gerrit/repo/org.eclipse.egit.core/target/spotbugsXml.xml with 21 unique warnings and 0 duplicates.
05:59:41 [FINDBUGS] Successfully parsed file /home/jenkins/workspace/egit.gerrit/repo/org.eclipse.egit.gitflow.test/target/spotbugsXml.xml with 21 unique warnings and 0 duplicates.
05:59:41 [FINDBUGS] Successfully parsed file /home/jenkins/workspace/egit.gerrit/repo/org.eclipse.egit.gitflow.ui/target/spotbugsXml.xml with 21 unique warnings and 0 duplicates.
05:59:41 [FINDBUGS] Successfully parsed file /home/jenkins/workspace/egit.gerrit/repo/org.eclipse.egit.gitflow/target/spotbugsXml.xml with 23 unique warnings and 0 duplicates.
05:59:41 [FINDBUGS] Successfully parsed file /home/jenkins/workspace/egit.gerrit/repo/org.eclipse.egit.mylyn.ui.test/target/spotbugsXml.xml with 23 unique warnings and 0 duplicates.
05:59:41 [FINDBUGS] Successfully parsed file /home/jenkins/workspace/egit.gerrit/repo/org.eclipse.egit.mylyn.ui/target/spotbugsXml.xml with 23 unique warnings and 0 duplicates.
05:59:41 [FINDBUGS] Successfully parsed file /home/jenkins/workspace/egit.gerrit/repo/org.eclipse.egit.ui.test/target/spotbugsXml.xml with 45 unique warnings and 0 duplicates.
05:59:41 [FINDBUGS] Successfully parsed file /home/jenkins/workspace/egit.gerrit/repo/org.eclipse.egit.ui/target/spotbugsXml.xml with 80 unique warnings and 0 duplicates.
05:59:41 No credentials specified
05:59:41 <Git Blamer> Using GitBlamer to create author and commit information for all warnings.
05:59:41 <Git Blamer> GIT_COMMIT=b4e44e37f79af2226db7264af6282a15157f54c8, workspace=/home/jenkins/workspace/egit.gerrit/repo
05:59:41  > /usr/bin/git rev-parse b4e44e37f79af2226db7264af6282a15157f54c8^{commit} # timeout=10
05:59:49 <Git Blamer> Skipping file /home/jenkins/workspace/egit.gerrit/repo/org.eclipse.egit.ui.test/src/org/eclipse/egit/ui/view/repositories/GitRepositoriesViewTestBase.java, no result found.
05:59:49 [FINDBUGS] Computing warning deltas based on reference build #11592
05:59:50 [DRY] Collecting duplicate code analysis files...
05:59:50 [DRY] Searching for all files in /home/jenkins/workspace/egit.gerrit that match the pattern **/cpd.xml
05:59:50 [DRY] Parsing 17 files in /home/jenkins/workspace/egit.gerrit
05:59:50 [DRY] Successfully parsed file /home/jenkins/workspace/egit.gerrit/repo/org.eclipse.egit-feature/target/cpd.xml with 0 unique warnings and 0 duplicates.
05:59:50 [DRY] Successfully parsed file /home/jenkins/workspace/egit.gerrit/repo/org.eclipse.egit.core.junit/target/cpd.xml with 0 unique warnings and 0 duplicates.
05:59:50 [DRY] Successfully parsed file /home/jenkins/workspace/egit.gerrit/repo/org.eclipse.egit.core.test/target/cpd.xml with 0 unique warnings and 0 duplicates.
05:59:50 [DRY] Successfully parsed file /home/jenkins/workspace/egit.gerrit/repo/org.eclipse.egit.core/target/cpd.xml with 4 unique warnings and 0 duplicates.
05:59:50 [DRY] Successfully parsed file /home/jenkins/workspace/egit.gerrit/repo/org.eclipse.egit.doc/target/cpd.xml with 4 unique warnings and 0 duplicates.
05:59:50 [DRY] Successfully parsed file /home/jenkins/workspace/egit.gerrit/repo/org.eclipse.egit.gitflow-feature/target/cpd.xml with 4 unique warnings and 0 duplicates.
05:59:50 [DRY] Successfully parsed file /home/jenkins/workspace/egit.gerrit/repo/org.eclipse.egit.gitflow.test/target/cpd.xml with 4 unique warnings and 0 duplicates.
05:59:50 [DRY] Successfully parsed file /home/jenkins/workspace/egit.gerrit/repo/org.eclipse.egit.gitflow.ui/target/cpd.xml with 4 unique warnings and 0 duplicates.
05:59:50 [DRY] Successfully parsed file /home/jenkins/workspace/egit.gerrit/repo/org.eclipse.egit.gitflow/target/cpd.xml with 4 unique warnings and 0 duplicates.
05:59:50 [DRY] Successfully parsed file /home/jenkins/workspace/egit.gerrit/repo/org.eclipse.egit.mylyn-feature/target/cpd.xml with 4 unique warnings and 0 duplicates.
05:59:50 [DRY] Successfully parsed file /home/jenkins/workspace/egit.gerrit/repo/org.eclipse.egit.mylyn.ui.test/target/cpd.xml with 4 unique warnings and 0 duplicates.
05:59:50 [DRY] Successfully parsed file /home/jenkins/workspace/egit.gerrit/repo/org.eclipse.egit.mylyn.ui/target/cpd.xml with 4 unique warnings and 0 duplicates.
05:59:50 [DRY] Successfully parsed file /home/jenkins/workspace/egit.gerrit/repo/org.eclipse.egit.repository/target/cpd.xml with 4 unique warnings and 0 duplicates.
05:59:50 [DRY] Successfully parsed file /home/jenkins/workspace/egit.gerrit/repo/org.eclipse.egit.source-feature/target/cpd.xml with 4 unique warnings and 0 duplicates.
05:59:50 [DRY] Successfully parsed file /home/jenkins/workspace/egit.gerrit/repo/org.eclipse.egit.ui.test/target/cpd.xml with 4 unique warnings and 0 duplicates.
05:59:50 [DRY] Successfully parsed file /home/jenkins/workspace/egit.gerrit/repo/org.eclipse.egit.ui/target/cpd.xml with 37 unique warnings and 0 duplicates.
05:59:50 [DRY] Successfully parsed file /home/jenkins/workspace/egit.gerrit/repo/org.eclipse.egit/target/cpd.xml with 37 unique warnings and 0 duplicates.
05:59:50 No credentials specified
05:59:50 <Git Blamer> Using GitBlamer to create author and commit information for all warnings.
05:59:50 <Git Blamer> GIT_COMMIT=b4e44e37f79af2226db7264af6282a15157f54c8, workspace=/home/jenkins/workspace/egit.gerrit/repo
05:59:50  > /usr/bin/git rev-parse b4e44e37f79af2226db7264af6282a15157f54c8^{commit} # timeout=10
05:59:54 [DRY] Computing warning deltas based on reference build #11592
05:59:54 Recording test results
05:59:55 Build step 'Publish JUnit test result report' changed build result to UNSTABLE
05:59:55 Archiving artifacts
05:59:59 Finished: UNSTABLE