FailedConsole Output

Skipping 1,145 KB.. Full Log
ore.test.SubmoduleAndContainerTreeIteratorTest
13:14:10 Tests run: 2, Failures: 0, Errors: 0, Skipped: 0, Time elapsed: 6.487 s - in org.eclipse.egit.core.test.SubmoduleAndContainerTreeIteratorTest
13:14:10 testCleanStateAfterInit(org.eclipse.egit.core.test.SubmoduleAndContainerTreeIteratorTest)  Time elapsed: 3.292 s
13:14:10 testCleanStateFirstCommit(org.eclipse.egit.core.test.SubmoduleAndContainerTreeIteratorTest)  Time elapsed: 3.195 s
13:14:10 Running org.eclipse.egit.core.test.RevUtilsTest
13:14:10 Tests run: 1, Failures: 0, Errors: 0, Skipped: 0, Time elapsed: 0.103 s - in org.eclipse.egit.core.test.RevUtilsTest
13:14:10 isContainedInAnyRef(org.eclipse.egit.core.test.RevUtilsTest)  Time elapsed: 0.103 s
13:14:10 Running org.eclipse.egit.core.test.CommitUtilTest
13:14:10 Tests run: 1, Failures: 0, Errors: 0, Skipped: 0, Time elapsed: 0.095 s - in org.eclipse.egit.core.test.CommitUtilTest
13:14:10 sortCommits(org.eclipse.egit.core.test.CommitUtilTest)  Time elapsed: 0.094 s
13:14:10 Running org.eclipse.egit.core.test.internal.mapping.HistoryTest
13:14:10 Tests run: 8, Failures: 0, Errors: 0, Skipped: 0, Time elapsed: 0.288 s - in org.eclipse.egit.core.test.internal.mapping.HistoryTest
13:14:10 testIndexRevision(org.eclipse.egit.core.test.internal.mapping.HistoryTest)  Time elapsed: 0.032 s
13:14:10 testIndexRevisionSecondCommit(org.eclipse.egit.core.test.internal.mapping.HistoryTest)  Time elapsed: 0.077 s
13:14:10 testShallowHistory(org.eclipse.egit.core.test.internal.mapping.HistoryTest)  Time elapsed: 0.03 s
13:14:10 testSingleRevision_1(org.eclipse.egit.core.test.internal.mapping.HistoryTest)  Time elapsed: 0.028 s
13:14:10 testSingleRevision_2(org.eclipse.egit.core.test.internal.mapping.HistoryTest)  Time elapsed: 0.029 s
13:14:10 testSingleRevision_3(org.eclipse.egit.core.test.internal.mapping.HistoryTest)  Time elapsed: 0.031 s
13:14:10 testDeepHistory_A(org.eclipse.egit.core.test.internal.mapping.HistoryTest)  Time elapsed: 0.029 s
13:14:10 testDeepHistory_B(org.eclipse.egit.core.test.internal.mapping.HistoryTest)  Time elapsed: 0.03 s
13:14:10 Running org.eclipse.egit.core.synchronize.ChangeTest
13:14:10 Tests run: 8, Failures: 0, Errors: 0, Skipped: 0, Time elapsed: 0.003 s - in org.eclipse.egit.core.synchronize.ChangeTest
13:14:10 shouldNotBeEqualWhenObjectIdsAreDifferent(org.eclipse.egit.core.synchronize.ChangeTest)  Time elapsed: 0.001 s
13:14:10 shouldNotBeEqualWithDifferentType(org.eclipse.egit.core.synchronize.ChangeTest)  Time elapsed: 0 s
13:14:10 shouldNotBeEqualWhenOneRemoteObjectIsNull(org.eclipse.egit.core.synchronize.ChangeTest)  Time elapsed: 0 s
13:14:10 shouldBeEqualWhenBothIdsAreNull(org.eclipse.egit.core.synchronize.ChangeTest)  Time elapsed: 0 s
13:14:10 shouldBeEqualWhenBothObjectIdsAreTheSame(org.eclipse.egit.core.synchronize.ChangeTest)  Time elapsed: 0 s
13:14:10 shouldBeEqualWhenBothObjectIdsAndRemoteIdsAreSame(org.eclipse.egit.core.synchronize.ChangeTest)  Time elapsed: 0 s
13:14:10 shouldNotBeEqualWithNullReference(org.eclipse.egit.core.synchronize.ChangeTest)  Time elapsed: 0 s
13:14:10 shouldNotBeEqualWhenOneObjectIdIsNull(org.eclipse.egit.core.synchronize.ChangeTest)  Time elapsed: 0 s
13:14:10 Running org.eclipse.egit.core.synchronize.StagedChangeCacheTest
13:14:11 Tests run: 12, Failures: 0, Errors: 0, Skipped: 0, Time elapsed: 0.35 s - in org.eclipse.egit.core.synchronize.StagedChangeCacheTest
13:14:11 shouldListSingleWorkspaceChangeInFolder(org.eclipse.egit.core.synchronize.StagedChangeCacheTest)  Time elapsed: 0.243 s
13:14:11 shouldListTwoWorkspaceAdditionsInFolder(org.eclipse.egit.core.synchronize.StagedChangeCacheTest)  Time elapsed: 0.008 s
13:14:11 shouldListTwoWorkspaceDeletionsInFolder(org.eclipse.egit.core.synchronize.StagedChangeCacheTest)  Time elapsed: 0.011 s
13:14:11 shouldListTwoWorkspaceChanges(org.eclipse.egit.core.synchronize.StagedChangeCacheTest)  Time elapsed: 0.01 s
13:14:11 shouldListSingleWorkspaceDeletion(org.eclipse.egit.core.synchronize.StagedChangeCacheTest)  Time elapsed: 0.01 s
13:14:11 shouldListSingleWorkspaceAdditionInFolder(org.eclipse.egit.core.synchronize.StagedChangeCacheTest)  Time elapsed: 0.007 s
13:14:11 shouldListTwoWorkspaceDeletions(org.eclipse.egit.core.synchronize.StagedChangeCacheTest)  Time elapsed: 0.01 s
13:14:11 shouldListSingleWorkspaceDeletionInFolder(org.eclipse.egit.core.synchronize.StagedChangeCacheTest)  Time elapsed: 0.009 s
13:14:11 shouldListSingleWorkspaceChange(org.eclipse.egit.core.synchronize.StagedChangeCacheTest)  Time elapsed: 0.011 s
13:14:11 shouldListTwoWorkspaceChangesInFolder(org.eclipse.egit.core.synchronize.StagedChangeCacheTest)  Time elapsed: 0.012 s
13:14:11 shouldListSingleWorkspaceAddition(org.eclipse.egit.core.synchronize.StagedChangeCacheTest)  Time elapsed: 0.008 s
13:14:11 shouldListTwoWorkspaceAdditions(org.eclipse.egit.core.synchronize.StagedChangeCacheTest)  Time elapsed: 0.008 s
13:14:11 Running org.eclipse.egit.core.synchronize.GitResourceVariantTreeSubscriberTest
13:14:13 Tests run: 3, Failures: 0, Errors: 0, Skipped: 0, Time elapsed: 1.717 s - in org.eclipse.egit.core.synchronize.GitResourceVariantTreeSubscriberTest
13:14:13 testSyncBranchAndMaster(org.eclipse.egit.core.synchronize.GitResourceVariantTreeSubscriberTest)  Time elapsed: 1.243 s
13:14:13 testSyncMasterAndBranch(org.eclipse.egit.core.synchronize.GitResourceVariantTreeSubscriberTest)  Time elapsed: 0.379 s
13:14:13 testSyncLocalAndBranch(org.eclipse.egit.core.synchronize.GitResourceVariantTreeSubscriberTest)  Time elapsed: 0.094 s
13:14:13 Running org.eclipse.egit.core.synchronize.dto.GitSynchronizeDataTest
13:14:14 Tests run: 1, Failures: 0, Errors: 0, Skipped: 0, Time elapsed: 1.029 s - in org.eclipse.egit.core.synchronize.dto.GitSynchronizeDataTest
13:14:14 shouldReturnDstMergeForRemoteBranch(org.eclipse.egit.core.synchronize.dto.GitSynchronizeDataTest)  Time elapsed: 1.028 s
13:14:14 Running org.eclipse.egit.core.synchronize.ThreeWayDiffEntryTest
13:14:14 Tests run: 9, Failures: 0, Errors: 0, Skipped: 0, Time elapsed: 0.378 s - in org.eclipse.egit.core.synchronize.ThreeWayDiffEntryTest
13:14:14 shouldListIncomingDelete(org.eclipse.egit.core.synchronize.ThreeWayDiffEntryTest)  Time elapsed: 0.007 s
13:14:14 shouldListIncomingModify(org.eclipse.egit.core.synchronize.ThreeWayDiffEntryTest)  Time elapsed: 0.008 s
13:14:14 shouldListIncomingAddition(org.eclipse.egit.core.synchronize.ThreeWayDiffEntryTest)  Time elapsed: 0.005 s
13:14:14 shouldListConflictingChange(org.eclipse.egit.core.synchronize.ThreeWayDiffEntryTest)  Time elapsed: 0.006 s
13:14:14 shouldListConflictingModify(org.eclipse.egit.core.synchronize.ThreeWayDiffEntryTest)  Time elapsed: 0.131 s
13:14:14 shouldListOutgoingAddition(org.eclipse.egit.core.synchronize.ThreeWayDiffEntryTest)  Time elapsed: 0.006 s
13:14:14 shouldListOutgoingDelete(org.eclipse.egit.core.synchronize.ThreeWayDiffEntryTest)  Time elapsed: 0.006 s
13:14:14 shouldListOutgoingModify(org.eclipse.egit.core.synchronize.ThreeWayDiffEntryTest)  Time elapsed: 0.201 s
13:14:14 shouldListConflictingChange2(org.eclipse.egit.core.synchronize.ThreeWayDiffEntryTest)  Time elapsed: 0.005 s
13:14:14 Running org.eclipse.egit.core.synchronize.GitSubscriberMergeContextTest
13:14:25 Tests run: 6, Failures: 0, Errors: 0, Skipped: 0, Time elapsed: 11.489 s - in org.eclipse.egit.core.synchronize.GitSubscriberMergeContextTest
13:14:25 mergeWithConflict(org.eclipse.egit.core.synchronize.GitSubscriberMergeContextTest)  Time elapsed: 1.162 s
13:14:25 mergeModelWithDeletedFileNoConflict(org.eclipse.egit.core.synchronize.GitSubscriberMergeContextTest)  Time elapsed: 3.05 s
13:14:25 mergeNoConflict(org.eclipse.egit.core.synchronize.GitSubscriberMergeContextTest)  Time elapsed: 1.876 s
13:14:25 mergeModelWithConflict(org.eclipse.egit.core.synchronize.GitSubscriberMergeContextTest)  Time elapsed: 1.767 s
13:14:25 markAsMerged(org.eclipse.egit.core.synchronize.GitSubscriberMergeContextTest)  Time elapsed: 2.037 s
13:14:25 mergeModelNoConflict(org.eclipse.egit.core.synchronize.GitSubscriberMergeContextTest)  Time elapsed: 1.594 s
13:14:25 Running org.eclipse.egit.core.synchronize.GitSubscriberResourceMappingContextTest
13:14:30 Tests run: 11, Failures: 0, Errors: 0, Skipped: 0, Time elapsed: 4.518 s - in org.eclipse.egit.core.synchronize.GitSubscriberResourceMappingContextTest
13:14:30 hasRemoteChanges(org.eclipse.egit.core.synchronize.GitSubscriberResourceMappingContextTest)  Time elapsed: 0.186 s
13:14:30 hasRemoteChangeInNewFile(org.eclipse.egit.core.synchronize.GitSubscriberResourceMappingContextTest)  Time elapsed: 0.146 s
13:14:30 hasLocalChangeWithFileRemoval(org.eclipse.egit.core.synchronize.GitSubscriberResourceMappingContextTest)  Time elapsed: 1.129 s
13:14:30 hasDeletion(org.eclipse.egit.core.synchronize.GitSubscriberResourceMappingContextTest)  Time elapsed: 0.207 s
13:14:30 hasLocalChangeInNewFolder(org.eclipse.egit.core.synchronize.GitSubscriberResourceMappingContextTest)  Time elapsed: 0.129 s
13:14:30 hasRemoteChangeInNewFolder(org.eclipse.egit.core.synchronize.GitSubscriberResourceMappingContextTest)  Time elapsed: 0.144 s
13:14:30 hasNestedDeletion(org.eclipse.egit.core.synchronize.GitSubscriberResourceMappingContextTest)  Time elapsed: 1.042 s
13:14:30 hasLocalChange(org.eclipse.egit.core.synchronize.GitSubscriberResourceMappingContextTest)  Time elapsed: 0.152 s
13:14:30 hasLocalChangeWhenRefreshingParentFolder(org.eclipse.egit.core.synchronize.GitSubscriberResourceMappingContextTest)  Time elapsed: 0.127 s
13:14:30 hasLocalAndRemoteChangeInSubFolder(org.eclipse.egit.core.synchronize.GitSubscriberResourceMappingContextTest)  Time elapsed: 0.153 s
13:14:30 hasLocalAndRemoteChange(org.eclipse.egit.core.synchronize.GitSubscriberResourceMappingContextTest)  Time elapsed: 1.1 s
13:14:30 Running org.eclipse.egit.core.synchronize.GitCommitsModelCacheTest
13:14:31 Tests run: 14, Failures: 0, Errors: 0, Skipped: 0, Time elapsed: 0.726 s - in org.eclipse.egit.core.synchronize.GitCommitsModelCacheTest
13:14:31 shouldListAllTypeOfChangesInsideSeparateFoldersInOneCommit(org.eclipse.egit.core.synchronize.GitCommitsModelCacheTest)  Time elapsed: 0.192 s
13:14:31 shouldListAdditionOrDeletionInsideFolderInCommit(org.eclipse.egit.core.synchronize.GitCommitsModelCacheTest)  Time elapsed: 0.094 s
13:14:31 shouldListAdditionsOrDeletionsInsideFolderInCommit(org.eclipse.egit.core.synchronize.GitCommitsModelCacheTest)  Time elapsed: 0.011 s
13:14:31 shouldListChangeInsideFolderInCommit(org.eclipse.egit.core.synchronize.GitCommitsModelCacheTest)  Time elapsed: 0.014 s
13:14:31 shouldListChangesInsideFolderInCommit(org.eclipse.egit.core.synchronize.GitCommitsModelCacheTest)  Time elapsed: 0.014 s
13:14:31 shouldListAllTypeOfChangesInOneCommit(org.eclipse.egit.core.synchronize.GitCommitsModelCacheTest)  Time elapsed: 0.014 s
13:14:31 shouldApplyPathFilter(org.eclipse.egit.core.synchronize.GitCommitsModelCacheTest)  Time elapsed: 0.011 s
13:14:31 shouldListAllTypeOfChangesInsideFolderInOneCommit(org.eclipse.egit.core.synchronize.GitCommitsModelCacheTest)  Time elapsed: 0.015 s
13:14:31 shouldListChangesInsideSeparateFoldersInCommit(org.eclipse.egit.core.synchronize.GitCommitsModelCacheTest)  Time elapsed: 0.015 s
13:14:31 shouldListAdditionOrDeletionInCommit(org.eclipse.egit.core.synchronize.GitCommitsModelCacheTest)  Time elapsed: 0.009 s
13:14:31 shouldListAdditionsOrDeletionsInsideSeparateFoldersInCommit(org.eclipse.egit.core.synchronize.GitCommitsModelCacheTest)  Time elapsed: 0.012 s
13:14:31 shouldNotListEmptyCommits(org.eclipse.egit.core.synchronize.GitCommitsModelCacheTest)  Time elapsed: 0.009 s
13:14:31 shouldReturnEmptyListForSameSrcAndDstCommit(org.eclipse.egit.core.synchronize.GitCommitsModelCacheTest)  Time elapsed: 0.007 s
13:14:31 shouldListChangeInCommit(org.eclipse.egit.core.synchronize.GitCommitsModelCacheTest)  Time elapsed: 0.305 s
13:14:31 Running org.eclipse.egit.core.synchronize.GitResourceVariantComparatorTest
13:14:47 Tests run: 19, Failures: 0, Errors: 0, Skipped: 0, Time elapsed: 16.271 s - in org.eclipse.egit.core.synchronize.GitResourceVariantComparatorTest
13:14:47 shouldReturnFalseWhenRemoteDoesNotExist2(org.eclipse.egit.core.synchronize.GitResourceVariantComparatorTest)  Time elapsed: 0.355 s
13:14:47 shouldReturnFalseWhenComparingContainerAndContainer(org.eclipse.egit.core.synchronize.GitResourceVariantComparatorTest)  Time elapsed: 1.176 s
13:14:47 shouldReturnFalseWhenComparingRemoteVariantContainerWithFile(org.eclipse.egit.core.synchronize.GitResourceVariantComparatorTest)  Time elapsed: 0.284 s
13:14:47 shouldReturnFalseWhenShortContentIsDifferent(org.eclipse.egit.core.synchronize.GitResourceVariantComparatorTest)  Time elapsed: 1.244 s
13:14:47 shouldReturnFalseWhenLongContentLengthIsDifferent(org.eclipse.egit.core.synchronize.GitResourceVariantComparatorTest)  Time elapsed: 0.257 s
13:14:47 shouldReturnFalseWhenComparingFileAndContainer(org.eclipse.egit.core.synchronize.GitResourceVariantComparatorTest)  Time elapsed: 0.226 s
13:14:47 shouldReturnFalseWhenContentLengthIsDifferent(org.eclipse.egit.core.synchronize.GitResourceVariantComparatorTest)  Time elapsed: 1.132 s
13:14:47 shouldReturnFalseWhenRemoteDoesNotExist(org.eclipse.egit.core.synchronize.GitResourceVariantComparatorTest)  Time elapsed: 0.307 s
13:14:47 shouldReturnFalseWhenComparingRemoteVariantFileWithContainer(org.eclipse.egit.core.synchronize.GitResourceVariantComparatorTest)  Time elapsed: 1.236 s
13:14:47 shouldReturnTrueWhenComparingContainerAndContainer(org.eclipse.egit.core.synchronize.GitResourceVariantComparatorTest)  Time elapsed: 0.251 s
13:14:47 shouldReturnTrueWhenComparingRemoteVariantContainerWithContainer(org.eclipse.egit.core.synchronize.GitResourceVariantComparatorTest)  Time elapsed: 0.233 s
13:14:47 shouldReturnFalseWhenComparingRemoteVariantWithDifferentObjectId(org.eclipse.egit.core.synchronize.GitResourceVariantComparatorTest)  Time elapsed: 1.179 s
13:14:47 shouldReturnTrueWhenShortContentIsDifferent(org.eclipse.egit.core.synchronize.GitResourceVariantComparatorTest)  Time elapsed: 1.667 s
13:14:47 shouldReturnFalseWhenRemoteVariantDoesntExist(org.eclipse.egit.core.synchronize.GitResourceVariantComparatorTest)  Time elapsed: 1.623 s
13:14:47 shouldReturnTrueWhenLongContentLengthIsDifferent(org.eclipse.egit.core.synchronize.GitResourceVariantComparatorTest)  Time elapsed: 1.636 s
13:14:47 shouldReturnFalseWhenComparingRemoteVariantContainerWithContainer(org.eclipse.egit.core.synchronize.GitResourceVariantComparatorTest)  Time elapsed: 1.664 s
13:14:47 shouldReturnTrueWhenComparingRemoteVariant(org.eclipse.egit.core.synchronize.GitResourceVariantComparatorTest)  Time elapsed: 0.311 s
13:14:47 shouldReturnFalseWhenLongContentIsDifferent(org.eclipse.egit.core.synchronize.GitResourceVariantComparatorTest)  Time elapsed: 1.229 s
13:14:47 shouldReturnFalseWhenBaseDoesntExist(org.eclipse.egit.core.synchronize.GitResourceVariantComparatorTest)  Time elapsed: 0.256 s
13:14:47 Running org.eclipse.egit.core.synchronize.WorkingTreeChangeCacheTest
13:14:47 Tests run: 13, Failures: 0, Errors: 0, Skipped: 0, Time elapsed: 0.098 s - in org.eclipse.egit.core.synchronize.WorkingTreeChangeCacheTest
13:14:47 shouldListSingleWorkspaceChangeInFolder(org.eclipse.egit.core.synchronize.WorkingTreeChangeCacheTest)  Time elapsed: 0.01 s
13:14:47 shouldListTwoWorkspaceAdditionsInFolder(org.eclipse.egit.core.synchronize.WorkingTreeChangeCacheTest)  Time elapsed: 0.007 s
13:14:47 shouldListTwoWorkspaceDeletionsInFolder(org.eclipse.egit.core.synchronize.WorkingTreeChangeCacheTest)  Time elapsed: 0.008 s
13:14:47 shouldListTwoWorkspaceChanges(org.eclipse.egit.core.synchronize.WorkingTreeChangeCacheTest)  Time elapsed: 0.008 s
13:14:47 shouldListSingleWorkspaceDeletion(org.eclipse.egit.core.synchronize.WorkingTreeChangeCacheTest)  Time elapsed: 0.007 s
13:14:47 shouldListSingleWorkspaceAdditionInFolder(org.eclipse.egit.core.synchronize.WorkingTreeChangeCacheTest)  Time elapsed: 0.006 s
13:14:47 shouldNotListIgnoredFile(org.eclipse.egit.core.synchronize.WorkingTreeChangeCacheTest)  Time elapsed: 0.007 s
13:14:47 shouldListTwoWorkspaceDeletions(org.eclipse.egit.core.synchronize.WorkingTreeChangeCacheTest)  Time elapsed: 0.007 s
13:14:47 shouldListSingleWorkspaceDeletionInFolder(org.eclipse.egit.core.synchronize.WorkingTreeChangeCacheTest)  Time elapsed: 0.007 s
13:14:47 shouldListSingleWorkspaceChange(org.eclipse.egit.core.synchronize.WorkingTreeChangeCacheTest)  Time elapsed: 0.008 s
13:14:47 shouldListTwoWorkspaceChangesInFolder(org.eclipse.egit.core.synchronize.WorkingTreeChangeCacheTest)  Time elapsed: 0.008 s
13:14:47 shouldListSingleWorkspaceAddition(org.eclipse.egit.core.synchronize.WorkingTreeChangeCacheTest)  Time elapsed: 0.006 s
13:14:47 shouldListTwoWorkspaceAdditions(org.eclipse.egit.core.synchronize.WorkingTreeChangeCacheTest)  Time elapsed: 0.007 s
13:14:47 Running org.eclipse.egit.core.synchronize.GitResourceVariantTreeTest
13:14:54 Tests run: 7, Failures: 0, Errors: 0, Skipped: 0, Time elapsed: 7.28 s - in org.eclipse.egit.core.synchronize.GitResourceVariantTreeTest
13:14:54 shouldReturnNullResourceVariant2(org.eclipse.egit.core.synchronize.GitResourceVariantTreeTest)  Time elapsed: 1.308 s
13:14:54 shouldReturnOneRoot(org.eclipse.egit.core.synchronize.GitResourceVariantTreeTest)  Time elapsed: 1.414 s
13:14:54 shouldReturnTwoRoots(org.eclipse.egit.core.synchronize.GitResourceVariantTreeTest)  Time elapsed: 1.558 s
13:14:54 shoulReturnSameResourceVariant(org.eclipse.egit.core.synchronize.GitResourceVariantTreeTest)  Time elapsed: 0.244 s
13:14:54 shouldReturnNullResourceVariant(org.eclipse.egit.core.synchronize.GitResourceVariantTreeTest)  Time elapsed: 1.23 s
13:14:54 shouldNotReturnNullOnSameResouceVariant(org.eclipse.egit.core.synchronize.GitResourceVariantTreeTest)  Time elapsed: 0.271 s
13:14:54 shouldReturnDifferentResourceVariant(org.eclipse.egit.core.synchronize.GitResourceVariantTreeTest)  Time elapsed: 1.252 s
13:14:54 Running org.eclipse.egit.core.project.RepositoryMappingTest
13:14:57 Tests run: 8, Failures: 0, Errors: 0, Skipped: 0, Time elapsed: 3.046 s - in org.eclipse.egit.core.project.RepositoryMappingTest
13:14:57 shouldReturnMappingForResourceInProject(org.eclipse.egit.core.project.RepositoryMappingTest)  Time elapsed: 0.136 s
13:14:57 shouldResolveRelativePathRelativeToContainer(org.eclipse.egit.core.project.RepositoryMappingTest)  Time elapsed: 0.121 s
13:14:57 shouldResolveAsRelativePath(org.eclipse.egit.core.project.RepositoryMappingTest)  Time elapsed: 0.121 s
13:14:57 shouldFindRepositoryMappingForRepository(org.eclipse.egit.core.project.RepositoryMappingTest)  Time elapsed: 1.122 s
13:14:57 shouldNotReturnMappingForResourceOutsideOfProject(org.eclipse.egit.core.project.RepositoryMappingTest)  Time elapsed: 0.139 s
13:14:57 shouldReturnMappingWhenPathIsRepository(org.eclipse.egit.core.project.RepositoryMappingTest)  Time elapsed: 0.12 s
13:14:57 shouldNotReturnMappingWhenPathIsOutsideRepository(org.eclipse.egit.core.project.RepositoryMappingTest)  Time elapsed: 0.186 s
13:14:57 shouldReturnMappingForPathOutsideOfProject(org.eclipse.egit.core.project.RepositoryMappingTest)  Time elapsed: 1.097 s
13:14:57 Running org.eclipse.egit.core.internal.ProjectReferenceImporterTest
13:14:58 Tests run: 5, Failures: 0, Errors: 0, Skipped: 0, Time elapsed: 0.111 s - in org.eclipse.egit.core.internal.ProjectReferenceImporterTest
13:14:58 findRepository_MultipleRemotes(org.eclipse.egit.core.internal.ProjectReferenceImporterTest)  Time elapsed: 0.031 s
13:14:58 findRepository_SameURLs(org.eclipse.egit.core.internal.ProjectReferenceImporterTest)  Time elapsed: 0.019 s
13:14:58 findRepository_DifferentUsersAndRepoSuffixes(org.eclipse.egit.core.internal.ProjectReferenceImporterTest)  Time elapsed: 0.02 s
13:14:58 findRepository_DifferentRepos(org.eclipse.egit.core.internal.ProjectReferenceImporterTest)  Time elapsed: 0.02 s
13:14:58 findRepository_DifferentUsers(org.eclipse.egit.core.internal.ProjectReferenceImporterTest)  Time elapsed: 0.02 s
13:14:58 Running org.eclipse.egit.core.internal.indexdiff.IndexDiffCacheEntryTest
13:15:00 Tests run: 3, Failures: 0, Errors: 0, Skipped: 0, Time elapsed: 2.984 s - in org.eclipse.egit.core.internal.indexdiff.IndexDiffCacheEntryTest
13:15:00 basicTest(org.eclipse.egit.core.internal.indexdiff.IndexDiffCacheEntryTest)  Time elapsed: 0.541 s
13:15:00 testProjectDeletion(org.eclipse.egit.core.internal.indexdiff.IndexDiffCacheEntryTest)  Time elapsed: 1.608 s
13:15:00 testReloadAndUpdate(org.eclipse.egit.core.internal.indexdiff.IndexDiffCacheEntryTest)  Time elapsed: 0.834 s
13:15:00 Running org.eclipse.egit.core.internal.indexdiff.IndexDiffCacheTest
13:15:09 Tests run: 7, Failures: 0, Errors: 0, Skipped: 0, Time elapsed: 8.689 s - in org.eclipse.egit.core.internal.indexdiff.IndexDiffCacheTest
13:15:09 testAddFileFromUntrackedFolder(org.eclipse.egit.core.internal.indexdiff.IndexDiffCacheTest)  Time elapsed: 1.214 s
13:15:09 testAddingAFile(org.eclipse.egit.core.internal.indexdiff.IndexDiffCacheTest)  Time elapsed: 0.343 s
13:15:09 testAddIgnoredFolder(org.eclipse.egit.core.internal.indexdiff.IndexDiffCacheTest)  Time elapsed: 0.45 s
13:15:09 testAddAndRemoveGitIgnoreFileToIgnoredDir(org.eclipse.egit.core.internal.indexdiff.IndexDiffCacheTest)  Time elapsed: 1.541 s
13:15:09 testModifyFileInIgnoredDir(org.eclipse.egit.core.internal.indexdiff.IndexDiffCacheTest)  Time elapsed: 1.409 s
13:15:09 testAddAndRemoveFileToIgnoredDir(org.eclipse.egit.core.internal.indexdiff.IndexDiffCacheTest)  Time elapsed: 2.273 s
13:15:09 testRemoveIgnoredFile(org.eclipse.egit.core.internal.indexdiff.IndexDiffCacheTest)  Time elapsed: 1.454 s
13:15:09 Running org.eclipse.egit.core.internal.indexdiff.IndexDiffDataTest
13:15:09 Tests run: 2, Failures: 0, Errors: 0, Skipped: 0, Time elapsed: 0.139 s - in org.eclipse.egit.core.internal.indexdiff.IndexDiffDataTest
13:15:09 testIsAnyPrefixOf(org.eclipse.egit.core.internal.indexdiff.IndexDiffDataTest)  Time elapsed: 0.034 s
13:15:09 testMergeIgnored(org.eclipse.egit.core.internal.indexdiff.IndexDiffDataTest)  Time elapsed: 0.103 s
13:15:09 Running org.eclipse.egit.core.internal.util.ResourceUtilTest
13:15:10 Tests run: 6, Failures: 0, Errors: 0, Skipped: 0, Time elapsed: 0.538 s - in org.eclipse.egit.core.internal.util.ResourceUtilTest
13:15:10 getFileForLocationShouldReturnExistingFileInCaseOfNestedNotClosedProject(org.eclipse.egit.core.internal.util.ResourceUtilTest)  Time elapsed: 0.101 s
13:15:10 getFileForLocationShouldNotUseFilesWithoutRepositoryMapping(org.eclipse.egit.core.internal.util.ResourceUtilTest)  Time elapsed: 0.038 s
13:15:10 getFileForLocationShouldReturnExistingFileInCaseOfNestedProject(org.eclipse.egit.core.internal.util.ResourceUtilTest)  Time elapsed: 0.107 s
13:15:10 getResourceForLocationShouldReturnNullForInexistentFile(org.eclipse.egit.core.internal.util.ResourceUtilTest)  Time elapsed: 0.109 s
13:15:10 getResourceForLocationShouldReturnFile(org.eclipse.egit.core.internal.util.ResourceUtilTest)  Time elapsed: 0.159 s
13:15:10 getResourceForLocationShouldReturnFolder(org.eclipse.egit.core.internal.util.ResourceUtilTest)  Time elapsed: 0.022 s
13:15:10 Running org.eclipse.egit.core.internal.util.RepositoryPathCheckerTest
13:15:10 Tests run: 7, Failures: 0, Errors: 0, Skipped: 1, Time elapsed: 0.014 s - in org.eclipse.egit.core.internal.util.RepositoryPathCheckerTest
13:15:10 testSSH(org.eclipse.egit.core.internal.util.RepositoryPathCheckerTest)  Time elapsed: 0 s
13:15:10 testLocalAbsoluteFileUnix(org.eclipse.egit.core.internal.util.RepositoryPathCheckerTest)  Time elapsed: 0 s
13:15:10 testFile(org.eclipse.egit.core.internal.util.RepositoryPathCheckerTest)  Time elapsed: 0 s
13:15:10 testHTTP(org.eclipse.egit.core.internal.util.RepositoryPathCheckerTest)  Time elapsed: 0 s
13:15:10 testLocalAbsoluteFileWindows(org.eclipse.egit.core.internal.util.RepositoryPathCheckerTest) skipped
13:15:10 testLocalRelativePath(org.eclipse.egit.core.internal.util.RepositoryPathCheckerTest)  Time elapsed: 0 s
13:15:10 testFooBar(org.eclipse.egit.core.internal.util.RepositoryPathCheckerTest)  Time elapsed: 0 s
13:15:10 Running org.eclipse.egit.core.internal.util.ProjectUtilTest
13:15:11 Tests run: 15, Failures: 0, Errors: 0, Skipped: 0, Time elapsed: 1.302 s - in org.eclipse.egit.core.internal.util.ProjectUtilTest
13:15:11 testFindProjectFilesNested(org.eclipse.egit.core.internal.util.ProjectUtilTest)  Time elapsed: 0.07 s
13:15:11 testFindProjectFilesEmptyDir(org.eclipse.egit.core.internal.util.ProjectUtilTest)  Time elapsed: 0.059 s
13:15:11 testGetValidOpenProjects(org.eclipse.egit.core.internal.util.ProjectUtilTest)  Time elapsed: 0.02 s
13:15:11 testGetProjectsUnconnected(org.eclipse.egit.core.internal.util.ProjectUtilTest)  Time elapsed: 0.018 s
13:15:11 testGetValidOpenProjectsClosedProject(org.eclipse.egit.core.internal.util.ProjectUtilTest)  Time elapsed: 0.042 s
13:15:11 testCloseMissingProject(org.eclipse.egit.core.internal.util.ProjectUtilTest)  Time elapsed: 0.144 s
13:15:11 testFindProjectFiles(org.eclipse.egit.core.internal.util.ProjectUtilTest)  Time elapsed: 0.051 s
13:15:11 testFindProjectFilesNullDir(org.eclipse.egit.core.internal.util.ProjectUtilTest)  Time elapsed: 0.019 s
13:15:11 testRefreshValidProjects(org.eclipse.egit.core.internal.util.ProjectUtilTest)  Time elapsed: 0.508 s
13:15:11 testGetProjects(org.eclipse.egit.core.internal.util.ProjectUtilTest)  Time elapsed: 0.085 s
13:15:11 testRefreshResource(org.eclipse.egit.core.internal.util.ProjectUtilTest)  Time elapsed: 0.022 s
13:15:11 testGetNestedProjectsContains(org.eclipse.egit.core.internal.util.ProjectUtilTest)  Time elapsed: 0.083 s
13:15:11 testFindContainer(org.eclipse.egit.core.internal.util.ProjectUtilTest)  Time elapsed: 0.02 s
13:15:11 testGetProjectsContains(org.eclipse.egit.core.internal.util.ProjectUtilTest)  Time elapsed: 0.073 s
13:15:11 testRefreshRepositoryResources(org.eclipse.egit.core.internal.util.ProjectUtilTest)  Time elapsed: 0.083 s
13:15:11 Running org.eclipse.egit.core.internal.storage.CommitFileRevisionTest
13:15:11 Tests run: 4, Failures: 0, Errors: 0, Skipped: 0, Time elapsed: 0.212 s - in org.eclipse.egit.core.internal.storage.CommitFileRevisionTest
13:15:11 testWithAttributesCheckedIn(org.eclipse.egit.core.internal.storage.CommitFileRevisionTest)  Time elapsed: 0.089 s
13:15:11 testWithAttributesCheckedInAndWithGlobalAttributes(org.eclipse.egit.core.internal.storage.CommitFileRevisionTest)  Time elapsed: 0.037 s
13:15:11 testWithAttributesNotCheckedIn(org.eclipse.egit.core.internal.storage.CommitFileRevisionTest)  Time elapsed: 0.031 s
13:15:11 testWithAttributesNotCheckedInButWithGlobalAttributes(org.eclipse.egit.core.internal.storage.CommitFileRevisionTest)  Time elapsed: 0.055 s
13:15:11 Running org.eclipse.egit.core.internal.storage.IndexFileRevisionTest
13:15:12 Tests run: 6, Failures: 0, Errors: 0, Skipped: 0, Time elapsed: 0.187 s - in org.eclipse.egit.core.internal.storage.IndexFileRevisionTest
13:15:12 shouldUseFirstWhenNotSpecified(org.eclipse.egit.core.internal.storage.IndexFileRevisionTest)  Time elapsed: 0.019 s
13:15:12 stage3With2Missing(org.eclipse.egit.core.internal.storage.IndexFileRevisionTest)  Time elapsed: 0.022 s
13:15:12 missingEntry(org.eclipse.egit.core.internal.storage.IndexFileRevisionTest)  Time elapsed: 0.053 s
13:15:12 missingStage(org.eclipse.egit.core.internal.storage.IndexFileRevisionTest)  Time elapsed: 0.021 s
13:15:12 stage0WithoutOtherStages(org.eclipse.egit.core.internal.storage.IndexFileRevisionTest)  Time elapsed: 0.022 s
13:15:12 stage1WithOtherStages(org.eclipse.egit.core.internal.storage.IndexFileRevisionTest)  Time elapsed: 0.049 s
13:15:12 Running org.eclipse.egit.core.securestorage.EGitSecureStoreTest
13:15:12 Tests run: 13, Failures: 0, Errors: 0, Skipped: 0, Time elapsed: 0.133 s - in org.eclipse.egit.core.securestorage.EGitSecureStoreTest
13:15:12 testGetUserAndPassword(org.eclipse.egit.core.securestorage.EGitSecureStoreTest)  Time elapsed: 0.121 s
13:15:12 testGetUserAndPasswordURIContainingUserAndPass(org.eclipse.egit.core.securestorage.EGitSecureStoreTest)  Time elapsed: 0.001 s
13:15:12 testEnsureDefaultPortFtp(org.eclipse.egit.core.securestorage.EGitSecureStoreTest)  Time elapsed: 0.001 s
13:15:12 testEnsureDefaultPortSsh(org.eclipse.egit.core.securestorage.EGitSecureStoreTest)  Time elapsed: 0.001 s
13:15:12 testPutUserAndPasswordURIContainingUserAndPass(org.eclipse.egit.core.securestorage.EGitSecureStoreTest)  Time elapsed: 0 s
13:15:12 testGetUserAndPasswordUnknownURI(org.eclipse.egit.core.securestorage.EGitSecureStoreTest)  Time elapsed: 0.001 s
13:15:12 testGetUserAndPasswordURIContainingOtherUserAndPass(org.eclipse.egit.core.securestorage.EGitSecureStoreTest)  Time elapsed: 0.001 s
13:15:12 testEnsureDefaultPortHttp(org.eclipse.egit.core.securestorage.EGitSecureStoreTest)  Time elapsed: 0.001 s
13:15:12 testEnsureDefaultPortSftp(org.eclipse.egit.core.securestorage.EGitSecureStoreTest)  Time elapsed: 0.001 s
13:15:12 testClearCredentials(org.eclipse.egit.core.securestorage.EGitSecureStoreTest)  Time elapsed: 0.001 s
13:15:12 testEnsureDefaultPortHttps(org.eclipse.egit.core.securestorage.EGitSecureStoreTest)  Time elapsed: 0.001 s
13:15:12 testClearCredentialsTwice(org.eclipse.egit.core.securestorage.EGitSecureStoreTest)  Time elapsed: 0 s
13:15:12 testPutUserAndPassword(org.eclipse.egit.core.securestorage.EGitSecureStoreTest)  Time elapsed: 0.001 s
13:15:12 Running org.eclipse.egit.core.op.ConfigureGerritAfterCloneMatcherTest
13:15:12 Tests run: 1, Failures: 0, Errors: 0, Skipped: 0, Time elapsed: 0.002 s - in org.eclipse.egit.core.op.ConfigureGerritAfterCloneMatcherTest
13:15:12 testMatches(org.eclipse.egit.core.op.ConfigureGerritAfterCloneMatcherTest)  Time elapsed: 0.001 s
13:15:12 Running org.eclipse.egit.core.GitMoveDeleteHookTest
13:15:24 Tests run: 21, Failures: 0, Errors: 0, Skipped: 0, Time elapsed: 12.394 s - in org.eclipse.egit.core.GitMoveDeleteHookTest
13:15:24 testRenameProjectOutsideWorkspaceContainingGitRepo(org.eclipse.egit.core.GitMoveDeleteHookTest)  Time elapsed: 2.728 s
13:15:24 testDeleteFolder(org.eclipse.egit.core.GitMoveDeleteHookTest)  Time elapsed: 0.241 s
13:15:24 testDeleteProject(org.eclipse.egit.core.GitMoveDeleteHookTest)  Time elapsed: 0.134 s
13:15:24 testMoveAndRenameProjectContainingGitRepo(org.eclipse.egit.core.GitMoveDeleteHookTest)  Time elapsed: 0.139 s
13:15:24 testMoveButDoNotRenameProjectOutsideWorkspaceContainingGitRepo(org.eclipse.egit.core.GitMoveDeleteHookTest)  Time elapsed: 0.13 s
13:15:24 testMoveProjectWithinGitRepoMoveFromOneLevelDownOutsideTheRepo(org.eclipse.egit.core.GitMoveDeleteHookTest)  Time elapsed: 0.308 s
13:15:24 testMoveProjectWithinGitOutsideWorkspaceRepoMoveFromOneLevelDownToSameDepth(org.eclipse.egit.core.GitMoveDeleteHookTest)  Time elapsed: 0.325 s
13:15:24 testMoveProjectWithinGitOutsideWorkspaceRepoMoveFromOneLevelDownOutsideTheRepo(org.eclipse.egit.core.GitMoveDeleteHookTest)  Time elapsed: 0.263 s
13:15:24 testMoveProjectWithinGitRepoMoveFromTopOneLevelDown(org.eclipse.egit.core.GitMoveDeleteHookTest)  Time elapsed: 0.369 s
13:15:24 testMoveProjectWithinGitOutsideWorkspaceRepoMoveFromTopOneLevelDown(org.eclipse.egit.core.GitMoveDeleteHookTest)  Time elapsed: 0.275 s
13:15:24 testMoveProjectWithinGitRepoMoveFromLevelZeroDownOne(org.eclipse.egit.core.GitMoveDeleteHookTest)  Time elapsed: 0.313 s
13:15:24 testMoveProjectWithinGitRepoMoveFromOneLevelDownToTop(org.eclipse.egit.core.GitMoveDeleteHookTest)  Time elapsed: 0.329 s
13:15:24 testMoveProjectWithinGitOutsideWorkspaceRepoMoveFromOneLevelDownToTop(org.eclipse.egit.core.GitMoveDeleteHookTest)  Time elapsed: 0.265 s
13:15:24 testMoveFile(org.eclipse.egit.core.GitMoveDeleteHookTest)  Time elapsed: 0.307 s
13:15:24 testMoveFileWithConflictsShouldBeCanceled(org.eclipse.egit.core.GitMoveDeleteHookTest)  Time elapsed: 0.331 s
13:15:24 testMoveProjectWithinGitRepoMoveFromOneLevelDownToSameDepth(org.eclipse.egit.core.GitMoveDeleteHookTest)  Time elapsed: 0.273 s
13:15:24 testDeleteFile(org.eclipse.egit.core.GitMoveDeleteHookTest)  Time elapsed: 2.308 s
13:15:24 testMoveFolder(org.eclipse.egit.core.GitMoveDeleteHookTest)  Time elapsed: 1.508 s
13:15:24 testMoveFolderWithFileWithConflictsShouldBeCanceled(org.eclipse.egit.core.GitMoveDeleteHookTest)  Time elapsed: 0.244 s
13:15:24 testMoveProjectWithinGitRepoMoveAtSameTopLevel(org.eclipse.egit.core.GitMoveDeleteHookTest)  Time elapsed: 1.301 s
13:15:24 testMoveProjectWithinGitOutsideWorkspaceRepoMoveAtSameTopLevel(org.eclipse.egit.core.GitMoveDeleteHookTest)  Time elapsed: 0.297 s
13:15:24 Running org.eclipse.egit.core.storage.GitBlobStorageTest
13:15:25 Tests run: 6, Failures: 0, Errors: 0, Skipped: 0, Time elapsed: 0.716 s - in org.eclipse.egit.core.storage.GitBlobStorageTest
13:15:25 testGitFileHistorySingleProjectOk(org.eclipse.egit.core.storage.GitBlobStorageTest)  Time elapsed: 0.044 s
13:15:25 testOk(org.eclipse.egit.core.storage.GitBlobStorageTest)  Time elapsed: 0.02 s
13:15:25 testFailNotFound(org.eclipse.egit.core.storage.GitBlobStorageTest)  Time elapsed: 0.316 s
13:15:25 testFailWrongType(org.eclipse.egit.core.storage.GitBlobStorageTest)  Time elapsed: 0.098 s
13:15:25 testFailCorrupt(org.eclipse.egit.core.storage.GitBlobStorageTest)  Time elapsed: 0.218 s
13:15:25 testFailCorrupt2(org.eclipse.egit.core.storage.GitBlobStorageTest)  Time elapsed: 0.019 s
13:15:25 
13:15:25 Results:
13:15:25 
13:15:25 Tests run: 381, Failures: 0, Errors: 0, Skipped: 1
13:15:25 
13:15:25 
13:15:25 !ENTRY org.eclipse.core.resources 2 10035 2019-03-25 17:15:25.646
13:15:25 !MESSAGE The workspace will exit with unsaved changes in this session.
13:15:26 [INFO] All tests passed!
13:15:26 [INFO] 
13:15:26 [INFO] >>> spotbugs-maven-plugin:3.1.11:check (default) > :spotbugs @ org.eclipse.egit.core.test >>>
13:15:26 [INFO] 
13:15:26 [INFO] --- spotbugs-maven-plugin:3.1.11:spotbugs (spotbugs) @ org.eclipse.egit.core.test ---
13:15:26 [INFO] Fork Value is true
13:15:26      [java] Picked up JAVA_TOOL_OPTIONS: -XX:+IgnoreUnrecognizedVMOptions -XX:+UseContainerSupport -XX:+UnlockExperimentalVMOptions -XX:+UseCGroupMemoryLimitForHeap
13:15:26      [java] Picked up _JAVA_OPTIONS: -XX:MaxRAMPercentage=64.0
13:15:35      [java] Warnings generated: 6
13:15:35 [INFO] Done SpotBugs Analysis....
13:15:35 [INFO] 
13:15:35 [INFO] <<< spotbugs-maven-plugin:3.1.11:check (default) < :spotbugs @ org.eclipse.egit.core.test <<<
13:15:35 [INFO] 
13:15:35 [INFO] 
13:15:35 [INFO] --- spotbugs-maven-plugin:3.1.11:check (default) @ org.eclipse.egit.core.test ---
13:15:35 [INFO] BugInstance size is 6
13:15:35 [INFO] Error size is 0
13:15:35 [INFO] Total bugs: 6
13:15:35 [ERROR] Hard coded reference to an absolute pathname in org.eclipse.egit.core.internal.util.RepositoryPathCheckerTest.testLocalAbsoluteFileUnix() [org.eclipse.egit.core.internal.util.RepositoryPathCheckerTest] At RepositoryPathCheckerTest.java:[line 32] DMI_HARDCODED_ABSOLUTE_FILENAME
13:15:35 [ERROR] Hard coded reference to an absolute pathname in org.eclipse.egit.core.internal.util.RepositoryPathCheckerTest.testLocalAbsoluteFileWindows() [org.eclipse.egit.core.internal.util.RepositoryPathCheckerTest] At RepositoryPathCheckerTest.java:[line 38] DMI_HARDCODED_ABSOLUTE_FILENAME
13:15:35 [ERROR] org.eclipse.egit.core.project.RepositoryMappingTest.shouldResolveAsRelativePath() concatenates strings using + in a loop [org.eclipse.egit.core.project.RepositoryMappingTest] At RepositoryMappingTest.java:[line 152] SBSC_USE_STRINGBUFFER_CONCATENATION
13:15:35 [ERROR] Unread field: org.eclipse.egit.core.test.LinkedResourcesTest.project1Dir [org.eclipse.egit.core.test.LinkedResourcesTest] At LinkedResourcesTest.java:[line 79] URF_UNREAD_FIELD
13:15:35 [ERROR] Return value of org.eclipse.jgit.lib.AnyObjectId.equals(AnyObjectId) ignored, but method has no side effect [org.eclipse.egit.core.test.op.CommitOperationTest] At CommitOperationTest.java:[line 158] RV_RETURN_VALUE_IGNORED_NO_SIDE_EFFECT
13:15:35 [ERROR] Useless object stored in variable notIndexed of method org.eclipse.egit.core.test.op.CommitOperationTest.testCommitEmptiedTree() [org.eclipse.egit.core.test.op.CommitOperationTest] At CommitOperationTest.java:[line 202] UC_USELESS_OBJECT
13:15:35 [INFO] 
13:15:35 
13:15:35 
13:15:35 To see bug detail using the Spotbugs GUI, use the following command "mvn spotbugs:gui"
13:15:35 
13:15:35 
13:15:35 
13:15:35 [INFO] 
13:15:35 [INFO] >>> maven-pmd-plugin:3.11.0:cpd-check (default) > :cpd @ org.eclipse.egit.core.test >>>
13:15:35 [INFO] 
13:15:35 [INFO] --- maven-pmd-plugin:3.11.0:cpd (cpd) @ org.eclipse.egit.core.test ---
13:15:35 [INFO] 
13:15:35 [INFO] <<< maven-pmd-plugin:3.11.0:cpd-check (default) < :cpd @ org.eclipse.egit.core.test <<<
13:15:35 [INFO] 
13:15:35 [INFO] 
13:15:35 [INFO] --- maven-pmd-plugin:3.11.0:cpd-check (default) @ org.eclipse.egit.core.test ---
13:15:35 [INFO] 
13:15:35 [INFO] 
13:15:35 [INFO] --- tycho-pack200a-plugin:1.3.0:normalize (pack200-normalize) @ org.eclipse.egit.core.test ---
13:15:35 [INFO] Pack200 normalizing jar /home/jenkins/workspace/egit.gerrit/repo/org.eclipse.egit.core.test/target/org.eclipse.egit.core.test-5.4.0-SNAPSHOT.jar
13:15:36 [INFO] 
13:15:36 [INFO] --- eclipse-jarsigner-plugin:1.1.5:sign (sign) @ org.eclipse.egit.core.test ---
13:15:36 [INFO] Signing jar: /home/jenkins/workspace/egit.gerrit/repo/org.eclipse.egit.core.test/target/org.eclipse.egit.core.test-5.4.0-SNAPSHOT.jar
13:15:42 [INFO] 
13:15:42 [INFO] --- tycho-pack200b-plugin:1.3.0:pack (pack200-pack) @ org.eclipse.egit.core.test ---
13:15:42 [INFO] Pack200 packing jar /home/jenkins/workspace/egit.gerrit/repo/org.eclipse.egit.core.test/target/org.eclipse.egit.core.test-5.4.0-SNAPSHOT.jar
13:15:42 [INFO] 
13:15:42 [INFO] --- tycho-p2-plugin:1.3.0:p2-metadata (p2-metadata) @ org.eclipse.egit.core.test ---
13:15:42 [INFO] 
13:15:42 [INFO] --- maven-install-plugin:2.3.1:install (default-install) @ org.eclipse.egit.core.test ---
13:15:42 [INFO] Installing /home/jenkins/workspace/egit.gerrit/repo/org.eclipse.egit.core.test/target/org.eclipse.egit.core.test-5.4.0-SNAPSHOT.jar to /home/jenkins/workspace/egit.gerrit/.repository/org/eclipse/egit/org.eclipse.egit.core.test/5.4.0-SNAPSHOT/org.eclipse.egit.core.test-5.4.0-SNAPSHOT.jar
13:15:42 [INFO] Installing /home/jenkins/workspace/egit.gerrit/repo/org.eclipse.egit.core.test/pom.xml to /home/jenkins/workspace/egit.gerrit/.repository/org/eclipse/egit/org.eclipse.egit.core.test/5.4.0-SNAPSHOT/org.eclipse.egit.core.test-5.4.0-SNAPSHOT.pom
13:15:42 [INFO] Installing /home/jenkins/workspace/egit.gerrit/repo/org.eclipse.egit.core.test/target/org.eclipse.egit.core.test-5.4.0-SNAPSHOT.jar.pack.gz to /home/jenkins/workspace/egit.gerrit/.repository/org/eclipse/egit/org.eclipse.egit.core.test/5.4.0-SNAPSHOT/org.eclipse.egit.core.test-5.4.0-SNAPSHOT-pack200.jar.pack.gz
13:15:42 [INFO] Installing /home/jenkins/workspace/egit.gerrit/repo/org.eclipse.egit.core.test/target/p2content.xml to /home/jenkins/workspace/egit.gerrit/.repository/org/eclipse/egit/org.eclipse.egit.core.test/5.4.0-SNAPSHOT/org.eclipse.egit.core.test-5.4.0-SNAPSHOT-p2metadata.xml
13:15:42 [INFO] Installing /home/jenkins/workspace/egit.gerrit/repo/org.eclipse.egit.core.test/target/p2artifacts.xml to /home/jenkins/workspace/egit.gerrit/.repository/org/eclipse/egit/org.eclipse.egit.core.test/5.4.0-SNAPSHOT/org.eclipse.egit.core.test-5.4.0-SNAPSHOT-p2artifacts.xml
13:15:42 [INFO] 
13:15:42 [INFO] --- tycho-p2-plugin:1.3.0:update-local-index (default-update-local-index) @ org.eclipse.egit.core.test ---
13:15:42 [INFO] 
13:15:42 [INFO] -------------< org.eclipse.egit:org.eclipse.egit.ui.test >--------------
13:15:42 [INFO] Building EGit UI Test Plug-in 5.4.0-SNAPSHOT                     [19/21]
13:15:42 [INFO] ------------------------[ eclipse-test-plugin ]-------------------------
13:15:42 [INFO] 
13:15:42 [INFO] --- maven-clean-plugin:2.5:clean (default-clean) @ org.eclipse.egit.ui.test ---
13:15:42 [INFO] 
13:15:42 [INFO] --- tycho-packaging-plugin:1.3.0:build-qualifier (default-build-qualifier) @ org.eclipse.egit.ui.test ---
13:15:42 [INFO] The project's OSGi version is 5.4.0.201903251706
13:15:42 [INFO] 
13:15:42 [INFO] --- tycho-packaging-plugin:1.3.0:validate-id (default-validate-id) @ org.eclipse.egit.ui.test ---
13:15:42 [INFO] 
13:15:42 [INFO] --- tycho-packaging-plugin:1.3.0:validate-version (default-validate-version) @ org.eclipse.egit.ui.test ---
13:15:42 [INFO] 
13:15:42 [INFO] --- maven-enforcer-plugin:3.0.0-M2:enforce (enforce-maven) @ org.eclipse.egit.ui.test ---
13:15:42 [INFO] 
13:15:42 [INFO] --- maven-resources-plugin:2.4.3:resources (default-resources) @ org.eclipse.egit.ui.test ---
13:15:42 [INFO] Using 'UTF-8' encoding to copy filtered resources.
13:15:42 [INFO] skip non existing resourceDirectory /home/jenkins/workspace/egit.gerrit/repo/org.eclipse.egit.ui.test/src/main/resources
13:15:42 [INFO] 
13:15:42 [INFO] --- tycho-compiler-plugin:1.3.0:compile (default-compile) @ org.eclipse.egit.ui.test ---
13:15:42 [INFO] Compiling 132 source files to /home/jenkins/workspace/egit.gerrit/repo/org.eclipse.egit.ui.test/target/classes
13:15:43 [INFO] 
13:15:43 [INFO] --- maven-resources-plugin:2.4.3:testResources (default-testResources) @ org.eclipse.egit.ui.test ---
13:15:43 [INFO] Using 'UTF-8' encoding to copy filtered resources.
13:15:43 [INFO] skip non existing resourceDirectory /home/jenkins/workspace/egit.gerrit/repo/org.eclipse.egit.ui.test/src/test/resources
13:15:43 [INFO] 
13:15:43 [INFO] --- target-platform-configuration:1.3.0:target-platform (default-target-platform) @ org.eclipse.egit.ui.test ---
13:15:43 [INFO] 
13:15:43 [INFO] --- tycho-packaging-plugin:1.3.0:package-plugin (default-package-plugin) @ org.eclipse.egit.ui.test ---
13:15:43 [INFO] Building jar: /home/jenkins/workspace/egit.gerrit/repo/org.eclipse.egit.ui.test/target/org.eclipse.egit.ui.test-5.4.0-SNAPSHOT.jar
13:15:44 [INFO] 
13:15:44 [INFO] --- tycho-p2-plugin:1.3.0:p2-metadata-default (default-p2-metadata-default) @ org.eclipse.egit.ui.test ---
13:15:44 [INFO] 
13:15:44 [INFO] --- tycho-surefire-plugin:1.3.0:test (default-test) @ org.eclipse.egit.ui.test ---
13:15:44 [INFO] Skipping tests
13:15:44 [INFO] 
13:15:44 [INFO] >>> spotbugs-maven-plugin:3.1.11:check (default) > :spotbugs @ org.eclipse.egit.ui.test >>>
13:15:44 [INFO] 
13:15:44 [INFO] --- spotbugs-maven-plugin:3.1.11:spotbugs (spotbugs) @ org.eclipse.egit.ui.test ---
13:15:44 [INFO] Fork Value is true
13:15:44      [java] Picked up JAVA_TOOL_OPTIONS: -XX:+IgnoreUnrecognizedVMOptions -XX:+UseContainerSupport -XX:+UnlockExperimentalVMOptions -XX:+UseCGroupMemoryLimitForHeap
13:15:44      [java] Picked up _JAVA_OPTIONS: -XX:MaxRAMPercentage=64.0
13:15:57      [java] Warnings generated: 22
13:15:57 [INFO] Done SpotBugs Analysis....
13:15:58 [INFO] 
13:15:58 [INFO] <<< spotbugs-maven-plugin:3.1.11:check (default) < :spotbugs @ org.eclipse.egit.ui.test <<<
13:15:58 [INFO] 
13:15:58 [INFO] 
13:15:58 [INFO] --- spotbugs-maven-plugin:3.1.11:check (default) @ org.eclipse.egit.ui.test ---
13:15:58 [INFO] BugInstance size is 22
13:15:58 [INFO] Error size is 0
13:15:58 [INFO] Total bugs: 22
13:15:58 [ERROR] Possible null pointer dereference in org.eclipse.egit.ui.common.LocalRepositoryTestCase.shareProjects(File) due to return value of called method [org.eclipse.egit.ui.common.LocalRepositoryTestCase, org.eclipse.egit.ui.common.LocalRepositoryTestCase] Dereferenced at LocalRepositoryTestCase.java:[line 607]Known null at LocalRepositoryTestCase.java:[line 607] NP_NULL_ON_SOME_PATH_FROM_RETURN_VALUE
13:15:58 [ERROR] Possible null pointer dereference in org.eclipse.egit.ui.common.LocalRepositoryTestCase.shareProjects(File) due to return value of called method [org.eclipse.egit.ui.common.LocalRepositoryTestCase, org.eclipse.egit.ui.common.LocalRepositoryTestCase] Dereferenced at LocalRepositoryTestCase.java:[line 609]Known null at LocalRepositoryTestCase.java:[line 609] NP_NULL_ON_SOME_PATH_FROM_RETURN_VALUE
13:15:58 [ERROR] Write to static field org.eclipse.egit.ui.common.LocalRepositoryTestCase.testMethodNumber from instance method org.eclipse.egit.ui.common.LocalRepositoryTestCase.initNewTestDirectory() [org.eclipse.egit.ui.common.LocalRepositoryTestCase] At LocalRepositoryTestCase.java:[line 190] ST_WRITE_TO_STATIC_FROM_INSTANCE_METHOD
13:15:58 [ERROR] Exceptional return value of java.io.File.delete() ignored in org.eclipse.egit.ui.internal.actions.SwitchToMenuTest.multipleSelectionWithMultipleRepositoriesAndNoCommonBranches() [org.eclipse.egit.ui.internal.actions.SwitchToMenuTest, org.eclipse.egit.ui.internal.actions.SwitchToMenuTest] At SwitchToMenuTest.java:[line 250]Another occurrence at SwitchToMenuTest.java:[line 251] RV_RETURN_VALUE_IGNORED_BAD_PRACTICE
13:15:58 [ERROR] Exceptional return value of java.io.File.delete() ignored in org.eclipse.egit.ui.internal.actions.SwitchToMenuTest.selectionWithProj1AndReflog() [org.eclipse.egit.ui.internal.actions.SwitchToMenuTest] At SwitchToMenuTest.java:[line 108] RV_RETURN_VALUE_IGNORED_BAD_PRACTICE
13:15:58 [ERROR] Call to org.eclipse.egit.ui.internal.decorators.TestDecoratableResource.equals(org.eclipse.egit.ui.internal.decorators.DecoratableResourceAdapter) in org.eclipse.egit.ui.internal.decorators.DecoratableResourceAdapterTest.testDecorationDeletedFile() [org.eclipse.egit.ui.internal.decorators.DecoratableResourceAdapterTest] At DecoratableResourceAdapterTest.java:[line 384] EC_UNRELATED_TYPES
13:15:58 [ERROR] Call to org.eclipse.egit.ui.internal.synchronize.model.GitModelCommit.equals(org.eclipse.egit.ui.internal.synchronize.model.GitModelBlob) in org.eclipse.egit.ui.internal.synchronize.model.GitModelBlobTest.shouldBeSymmetric1() [org.eclipse.egit.ui.internal.synchronize.model.GitModelBlobTest] At GitModelBlobTest.java:[line 123] EC_UNRELATED_TYPES
13:15:58 [ERROR] Call to org.eclipse.egit.ui.internal.synchronize.model.GitModelBlob.equals(org.eclipse.egit.ui.internal.synchronize.model.GitModelCommit) in org.eclipse.egit.ui.internal.synchronize.model.GitModelBlobTest.shouldBeSymmetric1() [org.eclipse.egit.ui.internal.synchronize.model.GitModelBlobTest] At GitModelBlobTest.java:[line 122] EC_UNRELATED_TYPES
13:15:58 [ERROR] Call to org.eclipse.egit.ui.internal.synchronize.model.GitModelBlob.equals(org.eclipse.egit.ui.internal.synchronize.model.GitModelCommit) in org.eclipse.egit.ui.internal.synchronize.model.GitModelBlobTest.shouldReturnNotEqualForBlobAndCommit() [org.eclipse.egit.ui.internal.synchronize.model.GitModelBlobTest] At GitModelBlobTest.java:[line 199] EC_UNRELATED_TYPES
13:15:58 [ERROR] Write to static field org.eclipse.egit.ui.internal.synchronize.model.GitModelRootTest.repo1 from instance method org.eclipse.egit.ui.internal.synchronize.model.GitModelRootTest.setupEnvironment() [org.eclipse.egit.ui.internal.synchronize.model.GitModelRootTest] At GitModelRootTest.java:[line 32] ST_WRITE_TO_STATIC_FROM_INSTANCE_METHOD
13:15:58 [ERROR] Write to static field org.eclipse.egit.ui.internal.synchronize.model.GitModelRootTest.repo2 from instance method org.eclipse.egit.ui.internal.synchronize.model.GitModelRootTest.setupEnvironment() [org.eclipse.egit.ui.internal.synchronize.model.GitModelRootTest] At GitModelRootTest.java:[line 35] ST_WRITE_TO_STATIC_FROM_INSTANCE_METHOD
13:15:58 [ERROR] Exceptional return value of java.io.File.delete() ignored in org.eclipse.egit.ui.prefpages.configuration.GlobalConfigurationPageTest.afterTest() [org.eclipse.egit.ui.prefpages.configuration.GlobalConfigurationPageTest] At GlobalConfigurationPageTest.java:[line 124] RV_RETURN_VALUE_IGNORED_BAD_PRACTICE
13:15:58 [ERROR] Return value of org.eclipse.swtbot.eclipse.finder.waits.Conditions.waitForView(Matcher) ignored, but method has no side effect [org.eclipse.egit.ui.test.TestUtil] At TestUtil.java:[line 752] RV_RETURN_VALUE_IGNORED_NO_SIDE_EFFECT
13:15:58 [ERROR] Return value of org.eclipse.swtbot.eclipse.finder.waits.Conditions.waitForView(Matcher) ignored, but method has no side effect [org.eclipse.egit.ui.test.TestUtil] At TestUtil.java:[line 768] RV_RETURN_VALUE_IGNORED_NO_SIDE_EFFECT
13:15:58 [ERROR] Write to static field org.eclipse.egit.ui.test.team.actions.BranchAndResetActionTest.LOCAL_BRANCHES from instance method org.eclipse.egit.ui.test.team.actions.BranchAndResetActionTest.setup() [org.eclipse.egit.ui.test.team.actions.BranchAndResetActionTest] At BranchAndResetActionTest.java:[line 99] ST_WRITE_TO_STATIC_FROM_INSTANCE_METHOD
13:15:58 [ERROR] Write to static field org.eclipse.egit.ui.test.team.actions.BranchAndResetActionTest.TAGS from instance method org.eclipse.egit.ui.test.team.actions.BranchAndResetActionTest.setup() [org.eclipse.egit.ui.test.team.actions.BranchAndResetActionTest] At BranchAndResetActionTest.java:[line 100] ST_WRITE_TO_STATIC_FROM_INSTANCE_METHOD
13:15:58 [ERROR] Write to static field org.eclipse.egit.ui.test.team.actions.CompareActionsTest.TAGS from instance method org.eclipse.egit.ui.test.team.actions.CompareActionsTest.setup() [org.eclipse.egit.ui.test.team.actions.CompareActionsTest] At CompareActionsTest.java:[line 94] ST_WRITE_TO_STATIC_FROM_INSTANCE_METHOD
13:15:58 [ERROR] Write to static field org.eclipse.egit.ui.test.team.actions.CompareActionsTest.commitOfTag from instance method org.eclipse.egit.ui.test.team.actions.CompareActionsTest.setup() [org.eclipse.egit.ui.test.team.actions.CompareActionsTest] At CompareActionsTest.java:[line 89] ST_WRITE_TO_STATIC_FROM_INSTANCE_METHOD
13:15:58 [ERROR] VERY confusing to have methods org.eclipse.egit.ui.view.repositories.GitRepositoriesViewBranchHandlingTest.setUp() and org.eclipse.egit.ui.view.repositories.GitRepositoriesViewTestBase.setup() [org.eclipse.egit.ui.view.repositories.GitRepositoriesViewBranchHandlingTest] At GitRepositoriesViewBranchHandlingTest.java:[lines 84-103] NM_VERY_CONFUSING
13:15:58 [ERROR] Possible null pointer dereference in org.eclipse.egit.ui.view.repositories.GitRepositoriesViewTest.testExpandWorkDir() due to return value of called method [org.eclipse.egit.ui.view.repositories.GitRepositoriesViewTest, org.eclipse.egit.ui.view.repositories.GitRepositoriesViewTest] Method invoked at GitRepositoriesViewTest.java:[line 192]Known null at GitRepositoriesViewTest.java:[line 192] NP_NULL_ON_SOME_PATH_FROM_RETURN_VALUE
13:15:58 [ERROR] org.eclipse.egit.ui.view.repositories.GitRepositoriesViewTestBase.myRepoViewUtil isn't final and can't be protected from malicious code  [org.eclipse.egit.ui.view.repositories.GitRepositoriesViewTestBase] In GitRepositoriesViewTestBase.java MS_CANNOT_BE_FINAL
13:15:58 [ERROR] VERY confusing to have methods org.eclipse.egit.ui.wizards.pull.PullWizardTest.setUp() and org.eclipse.egit.ui.view.repositories.GitRepositoriesViewTestBase.setup() [org.eclipse.egit.ui.wizards.pull.PullWizardTest] At PullWizardTest.java:[lines 80-88] NM_VERY_CONFUSING
13:15:58 [INFO] 
13:15:58 
13:15:58 
13:15:58 To see bug detail using the Spotbugs GUI, use the following command "mvn spotbugs:gui"
13:15:58 
13:15:58 
13:15:58 
13:15:58 [INFO] 
13:15:58 [INFO] >>> maven-pmd-plugin:3.11.0:cpd-check (default) > :cpd @ org.eclipse.egit.ui.test >>>
13:15:58 [INFO] 
13:15:58 [INFO] --- maven-pmd-plugin:3.11.0:cpd (cpd) @ org.eclipse.egit.ui.test ---
13:15:58 [INFO] 
13:15:58 [INFO] <<< maven-pmd-plugin:3.11.0:cpd-check (default) < :cpd @ org.eclipse.egit.ui.test <<<
13:15:58 [INFO] 
13:15:58 [INFO] 
13:15:58 [INFO] --- maven-pmd-plugin:3.11.0:cpd-check (default) @ org.eclipse.egit.ui.test ---
13:15:58 [INFO] 
13:15:58 [INFO] 
13:15:58 [INFO] --- tycho-pack200a-plugin:1.3.0:normalize (pack200-normalize) @ org.eclipse.egit.ui.test ---
13:15:58 [INFO] Pack200 normalizing jar /home/jenkins/workspace/egit.gerrit/repo/org.eclipse.egit.ui.test/target/org.eclipse.egit.ui.test-5.4.0-SNAPSHOT.jar
13:15:58 [INFO] 
13:15:58 [INFO] --- eclipse-jarsigner-plugin:1.1.5:sign (sign) @ org.eclipse.egit.ui.test ---
13:15:58 [INFO] Signing jar: /home/jenkins/workspace/egit.gerrit/repo/org.eclipse.egit.ui.test/target/org.eclipse.egit.ui.test-5.4.0-SNAPSHOT.jar
13:16:00 [INFO] 
13:16:00 [INFO] --- tycho-pack200b-plugin:1.3.0:pack (pack200-pack) @ org.eclipse.egit.ui.test ---
13:16:00 [INFO] Pack200 packing jar /home/jenkins/workspace/egit.gerrit/repo/org.eclipse.egit.ui.test/target/org.eclipse.egit.ui.test-5.4.0-SNAPSHOT.jar
13:16:01 [INFO] 
13:16:01 [INFO] --- tycho-p2-plugin:1.3.0:p2-metadata (p2-metadata) @ org.eclipse.egit.ui.test ---
13:16:01 [INFO] 
13:16:01 [INFO] --- maven-install-plugin:2.3.1:install (default-install) @ org.eclipse.egit.ui.test ---
13:16:01 [INFO] Installing /home/jenkins/workspace/egit.gerrit/repo/org.eclipse.egit.ui.test/target/org.eclipse.egit.ui.test-5.4.0-SNAPSHOT.jar to /home/jenkins/workspace/egit.gerrit/.repository/org/eclipse/egit/org.eclipse.egit.ui.test/5.4.0-SNAPSHOT/org.eclipse.egit.ui.test-5.4.0-SNAPSHOT.jar
13:16:01 [INFO] Installing /home/jenkins/workspace/egit.gerrit/repo/org.eclipse.egit.ui.test/pom.xml to /home/jenkins/workspace/egit.gerrit/.repository/org/eclipse/egit/org.eclipse.egit.ui.test/5.4.0-SNAPSHOT/org.eclipse.egit.ui.test-5.4.0-SNAPSHOT.pom
13:16:01 [INFO] Installing /home/jenkins/workspace/egit.gerrit/repo/org.eclipse.egit.ui.test/target/org.eclipse.egit.ui.test-5.4.0-SNAPSHOT.jar.pack.gz to /home/jenkins/workspace/egit.gerrit/.repository/org/eclipse/egit/org.eclipse.egit.ui.test/5.4.0-SNAPSHOT/org.eclipse.egit.ui.test-5.4.0-SNAPSHOT-pack200.jar.pack.gz
13:16:01 [INFO] Installing /home/jenkins/workspace/egit.gerrit/repo/org.eclipse.egit.ui.test/target/p2content.xml to /home/jenkins/workspace/egit.gerrit/.repository/org/eclipse/egit/org.eclipse.egit.ui.test/5.4.0-SNAPSHOT/org.eclipse.egit.ui.test-5.4.0-SNAPSHOT-p2metadata.xml
13:16:01 [INFO] Installing /home/jenkins/workspace/egit.gerrit/repo/org.eclipse.egit.ui.test/target/p2artifacts.xml to /home/jenkins/workspace/egit.gerrit/.repository/org/eclipse/egit/org.eclipse.egit.ui.test/5.4.0-SNAPSHOT/org.eclipse.egit.ui.test-5.4.0-SNAPSHOT-p2artifacts.xml
13:16:01 [INFO] 
13:16:01 [INFO] --- tycho-p2-plugin:1.3.0:update-local-index (default-update-local-index) @ org.eclipse.egit.ui.test ---
13:16:01 [INFO] 
13:16:01 [INFO] ----------< org.eclipse.egit:org.eclipse.egit.mylyn.ui.test >-----------
13:16:01 [INFO] Building EGit Mylyn UI Test Plug-in 5.4.0-SNAPSHOT               [20/21]
13:16:01 [INFO] ------------------------[ eclipse-test-plugin ]-------------------------
13:16:01 [INFO] 
13:16:01 [INFO] --- maven-clean-plugin:2.5:clean (default-clean) @ org.eclipse.egit.mylyn.ui.test ---
13:16:01 [INFO] 
13:16:01 [INFO] --- tycho-packaging-plugin:1.3.0:build-qualifier (default-build-qualifier) @ org.eclipse.egit.mylyn.ui.test ---
13:16:01 [INFO] The project's OSGi version is 5.4.0.201903251706
13:16:01 [INFO] 
13:16:01 [INFO] --- tycho-packaging-plugin:1.3.0:validate-id (default-validate-id) @ org.eclipse.egit.mylyn.ui.test ---
13:16:01 [INFO] 
13:16:01 [INFO] --- tycho-packaging-plugin:1.3.0:validate-version (default-validate-version) @ org.eclipse.egit.mylyn.ui.test ---
13:16:01 [INFO] 
13:16:01 [INFO] --- maven-enforcer-plugin:3.0.0-M2:enforce (enforce-maven) @ org.eclipse.egit.mylyn.ui.test ---
13:16:01 [INFO] 
13:16:01 [INFO] --- maven-resources-plugin:2.4.3:resources (default-resources) @ org.eclipse.egit.mylyn.ui.test ---
13:16:01 [INFO] Using 'UTF-8' encoding to copy filtered resources.
13:16:01 [INFO] skip non existing resourceDirectory /home/jenkins/workspace/egit.gerrit/repo/org.eclipse.egit.mylyn.ui.test/src/main/resources
13:16:01 [INFO] 
13:16:01 [INFO] --- tycho-compiler-plugin:1.3.0:compile (default-compile) @ org.eclipse.egit.mylyn.ui.test ---
13:16:01 [INFO] Compiling 1 source file to /home/jenkins/workspace/egit.gerrit/repo/org.eclipse.egit.mylyn.ui.test/target/classes
13:16:01 [INFO] 
13:16:01 [INFO] --- maven-resources-plugin:2.4.3:testResources (default-testResources) @ org.eclipse.egit.mylyn.ui.test ---
13:16:01 [INFO] Using 'UTF-8' encoding to copy filtered resources.
13:16:01 [INFO] skip non existing resourceDirectory /home/jenkins/workspace/egit.gerrit/repo/org.eclipse.egit.mylyn.ui.test/src/test/resources
13:16:01 [INFO] 
13:16:01 [INFO] --- target-platform-configuration:1.3.0:target-platform (default-target-platform) @ org.eclipse.egit.mylyn.ui.test ---
13:16:01 [INFO] 
13:16:01 [INFO] --- tycho-packaging-plugin:1.3.0:package-plugin (default-package-plugin) @ org.eclipse.egit.mylyn.ui.test ---
13:16:01 [INFO] Building jar: /home/jenkins/workspace/egit.gerrit/repo/org.eclipse.egit.mylyn.ui.test/target/org.eclipse.egit.mylyn.ui.test-5.4.0-SNAPSHOT.jar
13:16:01 [INFO] 
13:16:01 [INFO] --- tycho-p2-plugin:1.3.0:p2-metadata-default (default-p2-metadata-default) @ org.eclipse.egit.mylyn.ui.test ---
13:16:01 [INFO] 
13:16:01 [INFO] --- tycho-surefire-plugin:1.3.0:test (default-test) @ org.eclipse.egit.mylyn.ui.test ---
13:16:01 [INFO] Skipping tests
13:16:01 [INFO] 
13:16:01 [INFO] >>> spotbugs-maven-plugin:3.1.11:check (default) > :spotbugs @ org.eclipse.egit.mylyn.ui.test >>>
13:16:01 [INFO] 
13:16:01 [INFO] --- spotbugs-maven-plugin:3.1.11:spotbugs (spotbugs) @ org.eclipse.egit.mylyn.ui.test ---
13:16:01 [INFO] Fork Value is true
13:16:01      [java] Picked up JAVA_TOOL_OPTIONS: -XX:+IgnoreUnrecognizedVMOptions -XX:+UseContainerSupport -XX:+UnlockExperimentalVMOptions -XX:+UseCGroupMemoryLimitForHeap
13:16:01      [java] Picked up _JAVA_OPTIONS: -XX:MaxRAMPercentage=64.0
13:16:04 [INFO] Done SpotBugs Analysis....
13:16:04 [INFO] 
13:16:04 [INFO] <<< spotbugs-maven-plugin:3.1.11:check (default) < :spotbugs @ org.eclipse.egit.mylyn.ui.test <<<
13:16:04 [INFO] 
13:16:04 [INFO] 
13:16:04 [INFO] --- spotbugs-maven-plugin:3.1.11:check (default) @ org.eclipse.egit.mylyn.ui.test ---
13:16:04 [INFO] BugInstance size is 0
13:16:04 [INFO] Error size is 0
13:16:04 [INFO] No errors/warnings found
13:16:04 [INFO] 
13:16:04 [INFO] >>> maven-pmd-plugin:3.11.0:cpd-check (default) > :cpd @ org.eclipse.egit.mylyn.ui.test >>>
13:16:04 [INFO] 
13:16:04 [INFO] --- maven-pmd-plugin:3.11.0:cpd (cpd) @ org.eclipse.egit.mylyn.ui.test ---
13:16:04 [INFO] 
13:16:04 [INFO] <<< maven-pmd-plugin:3.11.0:cpd-check (default) < :cpd @ org.eclipse.egit.mylyn.ui.test <<<
13:16:04 [INFO] 
13:16:04 [INFO] 
13:16:04 [INFO] --- maven-pmd-plugin:3.11.0:cpd-check (default) @ org.eclipse.egit.mylyn.ui.test ---
13:16:04 [INFO] 
13:16:04 [INFO] 
13:16:04 [INFO] --- tycho-pack200a-plugin:1.3.0:normalize (pack200-normalize) @ org.eclipse.egit.mylyn.ui.test ---
13:16:04 [INFO] Pack200 normalizing jar /home/jenkins/workspace/egit.gerrit/repo/org.eclipse.egit.mylyn.ui.test/target/org.eclipse.egit.mylyn.ui.test-5.4.0-SNAPSHOT.jar
13:16:04 [INFO] 
13:16:04 [INFO] --- eclipse-jarsigner-plugin:1.1.5:sign (sign) @ org.eclipse.egit.mylyn.ui.test ---
13:16:04 [INFO] Signing jar: /home/jenkins/workspace/egit.gerrit/repo/org.eclipse.egit.mylyn.ui.test/target/org.eclipse.egit.mylyn.ui.test-5.4.0-SNAPSHOT.jar
13:16:06 [INFO] 
13:16:06 [INFO] --- tycho-pack200b-plugin:1.3.0:pack (pack200-pack) @ org.eclipse.egit.mylyn.ui.test ---
13:16:06 [INFO] Pack200 packing jar /home/jenkins/workspace/egit.gerrit/repo/org.eclipse.egit.mylyn.ui.test/target/org.eclipse.egit.mylyn.ui.test-5.4.0-SNAPSHOT.jar
13:16:06 [INFO] 
13:16:06 [INFO] --- tycho-p2-plugin:1.3.0:p2-metadata (p2-metadata) @ org.eclipse.egit.mylyn.ui.test ---
13:16:06 [INFO] 
13:16:06 [INFO] --- maven-install-plugin:2.3.1:install (default-install) @ org.eclipse.egit.mylyn.ui.test ---
13:16:06 [INFO] Installing /home/jenkins/workspace/egit.gerrit/repo/org.eclipse.egit.mylyn.ui.test/target/org.eclipse.egit.mylyn.ui.test-5.4.0-SNAPSHOT.jar to /home/jenkins/workspace/egit.gerrit/.repository/org/eclipse/egit/org.eclipse.egit.mylyn.ui.test/5.4.0-SNAPSHOT/org.eclipse.egit.mylyn.ui.test-5.4.0-SNAPSHOT.jar
13:16:06 [INFO] Installing /home/jenkins/workspace/egit.gerrit/repo/org.eclipse.egit.mylyn.ui.test/pom.xml to /home/jenkins/workspace/egit.gerrit/.repository/org/eclipse/egit/org.eclipse.egit.mylyn.ui.test/5.4.0-SNAPSHOT/org.eclipse.egit.mylyn.ui.test-5.4.0-SNAPSHOT.pom
13:16:06 [INFO] Installing /home/jenkins/workspace/egit.gerrit/repo/org.eclipse.egit.mylyn.ui.test/target/org.eclipse.egit.mylyn.ui.test-5.4.0-SNAPSHOT.jar.pack.gz to /home/jenkins/workspace/egit.gerrit/.repository/org/eclipse/egit/org.eclipse.egit.mylyn.ui.test/5.4.0-SNAPSHOT/org.eclipse.egit.mylyn.ui.test-5.4.0-SNAPSHOT-pack200.jar.pack.gz
13:16:06 [INFO] Installing /home/jenkins/workspace/egit.gerrit/repo/org.eclipse.egit.mylyn.ui.test/target/p2content.xml to /home/jenkins/workspace/egit.gerrit/.repository/org/eclipse/egit/org.eclipse.egit.mylyn.ui.test/5.4.0-SNAPSHOT/org.eclipse.egit.mylyn.ui.test-5.4.0-SNAPSHOT-p2metadata.xml
13:16:06 [INFO] Installing /home/jenkins/workspace/egit.gerrit/repo/org.eclipse.egit.mylyn.ui.test/target/p2artifacts.xml to /home/jenkins/workspace/egit.gerrit/.repository/org/eclipse/egit/org.eclipse.egit.mylyn.ui.test/5.4.0-SNAPSHOT/org.eclipse.egit.mylyn.ui.test-5.4.0-SNAPSHOT-p2artifacts.xml
13:16:06 [INFO] 
13:16:06 [INFO] --- tycho-p2-plugin:1.3.0:update-local-index (default-update-local-index) @ org.eclipse.egit.mylyn.ui.test ---
13:16:06 [INFO] 
13:16:06 [INFO] --------< org.eclipse.egit:org.eclipse.egit.ui.importer.tests >---------
13:16:06 [INFO] Building Git Team Provider (experimental auto-import wizard, incubation) 5.4.0-SNAPSHOT [21/21]
13:16:06 [INFO] ------------------------[ eclipse-test-plugin ]-------------------------
13:16:06 [INFO] 
13:16:06 [INFO] --- maven-clean-plugin:2.5:clean (default-clean) @ org.eclipse.egit.ui.importer.tests ---
13:16:06 [INFO] 
13:16:06 [INFO] --- tycho-packaging-plugin:1.3.0:build-qualifier (default-build-qualifier) @ org.eclipse.egit.ui.importer.tests ---
13:16:06 [INFO] The project's OSGi version is 5.4.0.201903251706
13:16:06 [INFO] 
13:16:06 [INFO] --- tycho-packaging-plugin:1.3.0:validate-id (default-validate-id) @ org.eclipse.egit.ui.importer.tests ---
13:16:06 [INFO] 
13:16:06 [INFO] --- tycho-packaging-plugin:1.3.0:validate-version (default-validate-version) @ org.eclipse.egit.ui.importer.tests ---
13:16:06 [INFO] 
13:16:06 [INFO] --- maven-enforcer-plugin:3.0.0-M2:enforce (enforce-maven) @ org.eclipse.egit.ui.importer.tests ---
13:16:06 [INFO] 
13:16:06 [INFO] --- maven-resources-plugin:2.4.3:resources (default-resources) @ org.eclipse.egit.ui.importer.tests ---
13:16:06 [INFO] Using 'UTF-8' encoding to copy filtered resources.
13:16:06 [INFO] skip non existing resourceDirectory /home/jenkins/workspace/egit.gerrit/repo/org.eclipse.egit.ui.importer.tests/src/main/resources
13:16:06 [INFO] 
13:16:06 [INFO] --- tycho-compiler-plugin:1.3.0:compile (default-compile) @ org.eclipse.egit.ui.importer.tests ---
13:16:06 [INFO] Compiling 1 source file to /home/jenkins/workspace/egit.gerrit/repo/org.eclipse.egit.ui.importer.tests/target/classes
13:16:06 [INFO] 
13:16:06 [INFO] --- maven-resources-plugin:2.4.3:testResources (default-testResources) @ org.eclipse.egit.ui.importer.tests ---
13:16:06 [INFO] Using 'UTF-8' encoding to copy filtered resources.
13:16:06 [INFO] skip non existing resourceDirectory /home/jenkins/workspace/egit.gerrit/repo/org.eclipse.egit.ui.importer.tests/src/test/resources
13:16:06 [INFO] 
13:16:06 [INFO] --- tycho-source-plugin:1.3.0:plugin-source (attach-source) @ org.eclipse.egit.ui.importer.tests ---
13:16:06 [INFO] Building jar: /home/jenkins/workspace/egit.gerrit/repo/org.eclipse.egit.ui.importer.tests/target/org.eclipse.egit.ui.importer.tests-5.4.0-SNAPSHOT-sources.jar
13:16:06 [INFO] 
13:16:06 [INFO] --- target-platform-configuration:1.3.0:target-platform (default-target-platform) @ org.eclipse.egit.ui.importer.tests ---
13:16:06 [INFO] 
13:16:06 [INFO] --- tycho-packaging-plugin:1.3.0:package-plugin (default-package-plugin) @ org.eclipse.egit.ui.importer.tests ---
13:16:06 [INFO] Building jar: /home/jenkins/workspace/egit.gerrit/repo/org.eclipse.egit.ui.importer.tests/target/org.eclipse.egit.ui.importer.tests-5.4.0-SNAPSHOT.jar
13:16:06 [INFO] 
13:16:06 [INFO] --- tycho-p2-plugin:1.3.0:p2-metadata-default (default-p2-metadata-default) @ org.eclipse.egit.ui.importer.tests ---
13:16:06 [INFO] 
13:16:06 [INFO] --- tycho-surefire-plugin:1.3.0:test (default-test) @ org.eclipse.egit.ui.importer.tests ---
13:16:06 [INFO] Expected eclipse log file: /home/jenkins/workspace/egit.gerrit/repo/org.eclipse.egit.ui.importer.tests/target/work/data/.metadata/.log
13:16:06 [INFO] Command line:
13:16:06 	[/opt/tools/java/oracle/jdk-8/1.8.0_202/jre/bin/java, -Dosgi.noShutdown=false, -Dosgi.os=linux, -Dosgi.ws=gtk, -Dosgi.arch=x86_64, -Declipse.consoleLog=true, -Degit.test.tmpdir=/home/jenkins/workspace/egit.gerrit/tmp/egit.tmp/, -Dorg.eclipse.swtbot.search.timeout=30000, -Dorg.eclipse.swtbot.screenshots.dir=target/screenshots, -Xmx1024m, -Dosgi.clean=true, -jar, /home/jenkins/workspace/egit.gerrit/.repository/p2/osgi/bundle/org.eclipse.equinox.launcher/1.3.201.v20161025-1711/org.eclipse.equinox.launcher-1.3.201.v20161025-1711.jar, -data, /home/jenkins/workspace/egit.gerrit/repo/org.eclipse.egit.ui.importer.tests/target/work/data, -install, /home/jenkins/workspace/egit.gerrit/repo/org.eclipse.egit.ui.importer.tests/target/work, -configuration, /home/jenkins/workspace/egit.gerrit/repo/org.eclipse.egit.ui.importer.tests/target/work/configuration, -application, org.eclipse.tycho.surefire.osgibooter.uitest, -testproperties, /home/jenkins/workspace/egit.gerrit/repo/org.eclipse.egit.ui.importer.tests/target/surefire.properties, -testApplication, org.eclipse.ui.ide.workbench, -nouithread]
13:16:06 Picked up JAVA_TOOL_OPTIONS: -XX:+IgnoreUnrecognizedVMOptions -XX:+UseContainerSupport -XX:+UnlockExperimentalVMOptions -XX:+UseCGroupMemoryLimitForHeap
13:16:06 Picked up _JAVA_OPTIONS: -XX:MaxRAMPercentage=64.0
13:16:07 Launching application org.eclipse.ui.ide.workbench...
13:16:10 !SESSION 2019-03-25 17:16:06.760 -----------------------------------------------
13:16:10 eclipse.buildId=unknown
13:16:10 java.version=1.8.0_202
13:16:10 java.vendor=Oracle Corporation
13:16:10 BootLoader constants: OS=linux, ARCH=x86_64, WS=gtk, NL=en_US
13:16:10 Framework arguments:  -application org.eclipse.tycho.surefire.osgibooter.uitest -testproperties /home/jenkins/workspace/egit.gerrit/repo/org.eclipse.egit.ui.importer.tests/target/surefire.properties -testApplication org.eclipse.ui.ide.workbench -nouithread
13:16:10 Command-line arguments:  -data /home/jenkins/workspace/egit.gerrit/repo/org.eclipse.egit.ui.importer.tests/target/work/data -application org.eclipse.tycho.surefire.osgibooter.uitest -testproperties /home/jenkins/workspace/egit.gerrit/repo/org.eclipse.egit.ui.importer.tests/target/surefire.properties -testApplication org.eclipse.ui.ide.workbench -nouithread
13:16:10 
13:16:10 !ENTRY org.eclipse.osgi 4 0 2019-03-25 17:16:10.634
13:16:10 !MESSAGE An error occurred while automatically activating bundle org.eclipse.egit.ui (81).
13:16:10 !STACK 0
13:16:10 org.osgi.framework.BundleException: Exception in org.eclipse.egit.ui.Activator.start() of bundle org.eclipse.egit.ui.
13:16:10 	at org.eclipse.osgi.internal.framework.BundleContextImpl.startActivator(BundleContextImpl.java:795)
13:16:10 	at org.eclipse.osgi.internal.framework.BundleContextImpl.start(BundleContextImpl.java:724)
13:16:10 	at org.eclipse.osgi.internal.framework.EquinoxBundle.startWorker0(EquinoxBundle.java:932)
13:16:10 	at org.eclipse.osgi.internal.framework.EquinoxBundle$EquinoxModule.startWorker(EquinoxBundle.java:309)
13:16:10 	at org.eclipse.osgi.container.Module.doStart(Module.java:581)
13:16:10 	at org.eclipse.osgi.container.Module.start(Module.java:449)
13:16:10 	at org.eclipse.osgi.framework.util.SecureAction.start(SecureAction.java:470)
13:16:10 	at org.eclipse.osgi.internal.hooks.EclipseLazyStarter.postFindLocalClass(EclipseLazyStarter.java:107)
13:16:10 	at org.eclipse.osgi.internal.loader.classpath.ClasspathManager.findLocalClass(ClasspathManager.java:529)
13:16:10 	at org.eclipse.osgi.internal.loader.ModuleClassLoader.findLocalClass(ModuleClassLoader.java:325)
13:16:10 	at org.eclipse.osgi.internal.loader.BundleLoader.findLocalClass(BundleLoader.java:345)
13:16:10 	at org.eclipse.osgi.internal.loader.BundleLoader.findClassInternal(BundleLoader.java:423)
13:16:10 	at org.eclipse.osgi.internal.loader.BundleLoader.findClass(BundleLoader.java:372)
13:16:10 	at org.eclipse.osgi.internal.loader.BundleLoader.findClass(BundleLoader.java:364)
13:16:10 	at org.eclipse.osgi.internal.loader.ModuleClassLoader.loadClass(ModuleClassLoader.java:161)
13:16:10 	at java.lang.ClassLoader.loadClass(ClassLoader.java:357)
13:16:10 	at org.eclipse.osgi.internal.framework.EquinoxBundle.loadClass(EquinoxBundle.java:564)
13:16:10 	at org.eclipse.core.internal.registry.osgi.RegistryStrategyOSGI.createExecutableExtension(RegistryStrategyOSGI.java:174)
13:16:10 	at org.eclipse.core.internal.registry.ExtensionRegistry.createExecutableExtension(ExtensionRegistry.java:905)
13:16:10 	at org.eclipse.core.internal.registry.ConfigurationElement.createExecutableExtension(ConfigurationElement.java:243)
13:16:10 	at org.eclipse.core.internal.registry.ConfigurationElementHandle.createExecutableExtension(ConfigurationElementHandle.java:55)
13:16:10 	at org.eclipse.ui.internal.services.WorkbenchServiceRegistry.getSourceProviders(WorkbenchServiceRegistry.java:177)
13:16:10 	at org.eclipse.ui.internal.services.SourceProviderService.readRegistry(SourceProviderService.java:108)
13:16:10 	at org.eclipse.ui.internal.Workbench$47.runWithException(Workbench.java:2447)
13:16:10 	at org.eclipse.ui.internal.StartupThreading$StartupRunnable.run(StartupThreading.java:32)
13:16:10 	at org.eclipse.swt.widgets.Synchronizer.syncExec(Synchronizer.java:233)
13:16:10 	at org.eclipse.ui.internal.UISynchronizer.syncExec(UISynchronizer.java:145)
13:16:10 	at org.eclipse.swt.widgets.Display.syncExec(Display.java:5414)
13:16:10 	at org.eclipse.ui.internal.StartupThreading.runWithoutExceptions(StartupThreading.java:95)
13:16:10 	at org.eclipse.ui.internal.Workbench.initializeDefaultServices(Workbench.java:2442)
13:16:10 	at org.eclipse.ui.internal.Workbench.init(Workbench.java:1678)
13:16:10 	at org.eclipse.ui.internal.Workbench.runUI(Workbench.java:2944)
13:16:10 	at org.eclipse.ui.internal.Workbench.access$9(Workbench.java:2875)
13:16:10 	at org.eclipse.ui.internal.Workbench$5.run(Workbench.java:684)
13:16:10 	at org.eclipse.core.databinding.observable.Realm.runWithDefault(Realm.java:336)
13:16:10 	at org.eclipse.ui.internal.Workbench.createAndRunWorkbench(Workbench.java:610)
13:16:10 	at org.eclipse.ui.PlatformUI.createAndRunWorkbench(PlatformUI.java:148)
13:16:10 	at org.eclipse.ui.internal.ide.application.IDEApplication.start(IDEApplication.java:138)
13:16:10 	at org.eclipse.tycho.surefire.osgibooter.UITestApplication.runApplication(UITestApplication.java:31)
13:16:10 	at org.eclipse.tycho.surefire.osgibooter.AbstractUITestApplication.run(AbstractUITestApplication.java:120)
13:16:10 	at org.eclipse.tycho.surefire.osgibooter.UITestApplication.start(UITestApplication.java:37)
13:16:10 	at org.eclipse.equinox.internal.app.EclipseAppHandle.run(EclipseAppHandle.java:196)
13:16:10 	at org.eclipse.core.runtime.internal.adaptor.EclipseAppLauncher.runApplication(EclipseAppLauncher.java:134)
13:16:10 	at org.eclipse.core.runtime.internal.adaptor.EclipseAppLauncher.start(EclipseAppLauncher.java:104)
13:16:10 	at org.eclipse.core.runtime.adaptor.EclipseStarter.run(EclipseStarter.java:388)
13:16:10 	at org.eclipse.core.runtime.adaptor.EclipseStarter.run(EclipseStarter.java:243)
13:16:10 	at sun.reflect.NativeMethodAccessorImpl.invoke0(Native Method)
13:16:10 	at sun.reflect.NativeMethodAccessorImpl.invoke(NativeMethodAccessorImpl.java:62)
13:16:10 	at sun.reflect.DelegatingMethodAccessorImpl.invoke(DelegatingMethodAccessorImpl.java:43)
13:16:10 	at java.lang.reflect.Method.invoke(Method.java:498)
13:16:10 	at org.eclipse.equinox.launcher.Main.invokeFramework(Main.java:673)
13:16:10 	at org.eclipse.equinox.launcher.Main.basicRun(Main.java:610)
13:16:10 	at org.eclipse.equinox.launcher.Main.run(Main.java:1519)
13:16:10 	at org.eclipse.equinox.launcher.Main.main(Main.java:1492)
13:16:10 Caused by: java.lang.NoClassDefFoundError: org/eclipse/core/resources/IResource
13:16:10 	at org.eclipse.egit.ui.Activator.setupRepoChangeScanner(Activator.java:1081)
13:16:10 	at org.eclipse.egit.ui.Activator.start(Activator.java:355)
13:16:10 	at org.eclipse.osgi.internal.framework.BundleContextImpl$3.run(BundleContextImpl.java:774)
13:16:10 	at org.eclipse.osgi.internal.framework.BundleContextImpl$3.run(BundleContextImpl.java:1)
13:16:10 	at java.security.AccessController.doPrivileged(Native Method)
13:16:10 	at org.eclipse.osgi.internal.framework.BundleContextImpl.startActivator(BundleContextImpl.java:767)
13:16:10 	... 53 more
13:16:10 Caused by: java.lang.ClassNotFoundException: org.eclipse.core.resources.IResource cannot be found by org.eclipse.egit.ui_5.4.0.201903251706
13:16:10 	at org.eclipse.osgi.internal.loader.BundleLoader.findClassInternal(BundleLoader.java:461)
13:16:10 	at org.eclipse.osgi.internal.loader.BundleLoader.findClass(BundleLoader.java:372)
13:16:10 	at org.eclipse.osgi.internal.loader.BundleLoader.findClass(BundleLoader.java:364)
13:16:10 	at org.eclipse.osgi.internal.loader.ModuleClassLoader.loadClass(ModuleClassLoader.java:161)
13:16:10 	at java.lang.ClassLoader.loadClass(ClassLoader.java:357)
13:16:10 	... 59 more
13:16:10 Root exception:
13:16:10 java.lang.NoClassDefFoundError: org/eclipse/core/resources/IResource
13:16:10 	at org.eclipse.egit.ui.Activator.setupRepoChangeScanner(Activator.java:1081)
13:16:10 	at org.eclipse.egit.ui.Activator.start(Activator.java:355)
13:16:10 	at org.eclipse.osgi.internal.framework.BundleContextImpl$3.run(BundleContextImpl.java:774)
13:16:10 	at org.eclipse.osgi.internal.framework.BundleContextImpl$3.run(BundleContextImpl.java:1)
13:16:10 	at java.security.AccessController.doPrivileged(Native Method)
13:16:10 	at org.eclipse.osgi.internal.framework.BundleContextImpl.startActivator(BundleContextImpl.java:767)
13:16:10 	at org.eclipse.osgi.internal.framework.BundleContextImpl.start(BundleContextImpl.java:724)
13:16:10 	at org.eclipse.osgi.internal.framework.EquinoxBundle.startWorker0(EquinoxBundle.java:932)
13:16:10 	at org.eclipse.osgi.internal.framework.EquinoxBundle$EquinoxModule.startWorker(EquinoxBundle.java:309)
13:16:10 	at org.eclipse.osgi.container.Module.doStart(Module.java:581)
13:16:10 	at org.eclipse.osgi.container.Module.start(Module.java:449)
13:16:10 	at org.eclipse.osgi.framework.util.SecureAction.start(SecureAction.java:470)
13:16:10 	at org.eclipse.osgi.internal.hooks.EclipseLazyStarter.postFindLocalClass(EclipseLazyStarter.java:107)
13:16:10 	at org.eclipse.osgi.internal.loader.classpath.ClasspathManager.findLocalClass(ClasspathManager.java:529)
13:16:10 	at org.eclipse.osgi.internal.loader.ModuleClassLoader.findLocalClass(ModuleClassLoader.java:325)
13:16:10 	at org.eclipse.osgi.internal.loader.BundleLoader.findLocalClass(BundleLoader.java:345)
13:16:10 	at org.eclipse.osgi.internal.loader.BundleLoader.findClassInternal(BundleLoader.java:423)
13:16:10 	at org.eclipse.osgi.internal.loader.BundleLoader.findClass(BundleLoader.java:372)
13:16:10 	at org.eclipse.osgi.internal.loader.BundleLoader.findClass(BundleLoader.java:364)
13:16:10 	at org.eclipse.osgi.internal.loader.ModuleClassLoader.loadClass(ModuleClassLoader.java:161)
13:16:10 	at java.lang.ClassLoader.loadClass(ClassLoader.java:357)
13:16:10 	at org.eclipse.osgi.internal.framework.EquinoxBundle.loadClass(EquinoxBundle.java:564)
13:16:10 	at org.eclipse.core.internal.registry.osgi.RegistryStrategyOSGI.createExecutableExtension(RegistryStrategyOSGI.java:174)
13:16:10 	at org.eclipse.core.internal.registry.ExtensionRegistry.createExecutableExtension(ExtensionRegistry.java:905)
13:16:10 	at org.eclipse.core.internal.registry.ConfigurationElement.createExecutableExtension(ConfigurationElement.java:243)
13:16:10 	at org.eclipse.core.internal.registry.ConfigurationElementHandle.createExecutableExtension(ConfigurationElementHandle.java:55)
13:16:10 	at org.eclipse.ui.internal.services.WorkbenchServiceRegistry.getSourceProviders(WorkbenchServiceRegistry.java:177)
13:16:10 	at org.eclipse.ui.internal.services.SourceProviderService.readRegistry(SourceProviderService.java:108)
13:16:10 	at org.eclipse.ui.internal.Workbench$47.runWithException(Workbench.java:2447)
13:16:10 	at org.eclipse.ui.internal.StartupThreading$StartupRunnable.run(StartupThreading.java:32)
13:16:10 	at org.eclipse.swt.widgets.Synchronizer.syncExec(Synchronizer.java:233)
13:16:10 	at org.eclipse.ui.internal.UISynchronizer.syncExec(UISynchronizer.java:145)
13:16:10 	at org.eclipse.swt.widgets.Display.syncExec(Display.java:5414)
13:16:10 	at org.eclipse.ui.internal.StartupThreading.runWithoutExceptions(StartupThreading.java:95)
13:16:10 	at org.eclipse.ui.internal.Workbench.initializeDefaultServices(Workbench.java:2442)
13:16:10 	at org.eclipse.ui.internal.Workbench.init(Workbench.java:1678)
13:16:10 	at org.eclipse.ui.internal.Workbench.runUI(Workbench.java:2944)
13:16:10 	at org.eclipse.ui.internal.Workbench.access$9(Workbench.java:2875)
13:16:10 	at org.eclipse.ui.internal.Workbench$5.run(Workbench.java:684)
13:16:10 	at org.eclipse.core.databinding.observable.Realm.runWithDefault(Realm.java:336)
13:16:10 	at org.eclipse.ui.internal.Workbench.createAndRunWorkbench(Workbench.java:610)
13:16:10 	at org.eclipse.ui.PlatformUI.createAndRunWorkbench(PlatformUI.java:148)
13:16:10 	at org.eclipse.ui.internal.ide.application.IDEApplication.start(IDEApplication.java:138)
13:16:10 	at org.eclipse.tycho.surefire.osgibooter.UITestApplication.runApplication(UITestApplication.java:31)
13:16:10 	at org.eclipse.tycho.surefire.osgibooter.AbstractUITestApplication.run(AbstractUITestApplication.java:120)
13:16:10 	at org.eclipse.tycho.surefire.osgibooter.UITestApplication.start(UITestApplication.java:37)
13:16:10 	at org.eclipse.equinox.internal.app.EclipseAppHandle.run(EclipseAppHandle.java:196)
13:16:10 	at org.eclipse.core.runtime.internal.adaptor.EclipseAppLauncher.runApplication(EclipseAppLauncher.java:134)
13:16:10 	at org.eclipse.core.runtime.internal.adaptor.EclipseAppLauncher.start(EclipseAppLauncher.java:104)
13:16:10 	at org.eclipse.core.runtime.adaptor.EclipseStarter.run(EclipseStarter.java:388)
13:16:10 	at org.eclipse.core.runtime.adaptor.EclipseStarter.run(EclipseStarter.java:243)
13:16:10 	at sun.reflect.NativeMethodAccessorImpl.invoke0(Native Method)
13:16:10 	at sun.reflect.NativeMethodAccessorImpl.invoke(NativeMethodAccessorImpl.java:62)
13:16:10 	at sun.reflect.DelegatingMethodAccessorImpl.invoke(DelegatingMethodAccessorImpl.java:43)
13:16:10 	at java.lang.reflect.Method.invoke(Method.java:498)
13:16:10 	at org.eclipse.equinox.launcher.Main.invokeFramework(Main.java:673)
13:16:10 	at org.eclipse.equinox.launcher.Main.basicRun(Main.java:610)
13:16:10 	at org.eclipse.equinox.launcher.Main.run(Main.java:1519)
13:16:10 	at org.eclipse.equinox.launcher.Main.main(Main.java:1492)
13:16:10 Caused by: java.lang.ClassNotFoundException: org.eclipse.core.resources.IResource cannot be found by org.eclipse.egit.ui_5.4.0.201903251706
13:16:10 	at org.eclipse.osgi.internal.loader.BundleLoader.findClassInternal(BundleLoader.java:461)
13:16:10 	at org.eclipse.osgi.internal.loader.BundleLoader.findClass(BundleLoader.java:372)
13:16:10 	at org.eclipse.osgi.internal.loader.BundleLoader.findClass(BundleLoader.java:364)
13:16:10 	at org.eclipse.osgi.internal.loader.ModuleClassLoader.loadClass(ModuleClassLoader.java:161)
13:16:10 	at java.lang.ClassLoader.loadClass(ClassLoader.java:357)
13:16:10 	... 59 more
13:16:10 
13:16:10 !ENTRY org.eclipse.equinox.registry 4 1 2019-03-25 17:16:10.659
13:16:10 !MESSAGE Plug-in org.eclipse.egit.ui was unable to load class org.eclipse.egit.ui.internal.selection.RepositorySourceProvider.
13:16:10 !STACK 0
13:16:10 java.lang.ClassNotFoundException: An error occurred while automatically activating bundle org.eclipse.egit.ui (81).
13:16:10 	at org.eclipse.osgi.internal.hooks.EclipseLazyStarter.postFindLocalClass(EclipseLazyStarter.java:116)
13:16:10 	at org.eclipse.osgi.internal.loader.classpath.ClasspathManager.findLocalClass(ClasspathManager.java:529)
13:16:10 	at org.eclipse.osgi.internal.loader.ModuleClassLoader.findLocalClass(ModuleClassLoader.java:325)
13:16:10 	at org.eclipse.osgi.internal.loader.BundleLoader.findLocalClass(BundleLoader.java:345)
13:16:10 	at org.eclipse.osgi.internal.loader.BundleLoader.findClassInternal(BundleLoader.java:423)
13:16:10 	at org.eclipse.osgi.internal.loader.BundleLoader.findClass(BundleLoader.java:372)
13:16:10 	at org.eclipse.osgi.internal.loader.BundleLoader.findClass(BundleLoader.java:364)
13:16:10 	at org.eclipse.osgi.internal.loader.ModuleClassLoader.loadClass(ModuleClassLoader.java:161)
13:16:10 	at java.lang.ClassLoader.loadClass(ClassLoader.java:357)
13:16:10 	at org.eclipse.osgi.internal.framework.EquinoxBundle.loadClass(EquinoxBundle.java:564)
13:16:10 	at org.eclipse.core.internal.registry.osgi.RegistryStrategyOSGI.createExecutableExtension(RegistryStrategyOSGI.java:174)
13:16:10 	at org.eclipse.core.internal.registry.ExtensionRegistry.createExecutableExtension(ExtensionRegistry.java:905)
13:16:10 	at org.eclipse.core.internal.registry.ConfigurationElement.createExecutableExtension(ConfigurationElement.java:243)
13:16:10 	at org.eclipse.core.internal.registry.ConfigurationElementHandle.createExecutableExtension(ConfigurationElementHandle.java:55)
13:16:10 	at org.eclipse.ui.internal.services.WorkbenchServiceRegistry.getSourceProviders(WorkbenchServiceRegistry.java:177)
13:16:10 	at org.eclipse.ui.internal.services.SourceProviderService.readRegistry(SourceProviderService.java:108)
13:16:10 	at org.eclipse.ui.internal.Workbench$47.runWithException(Workbench.java:2447)
13:16:10 	at org.eclipse.ui.internal.StartupThreading$StartupRunnable.run(StartupThreading.java:32)
13:16:10 	at org.eclipse.swt.widgets.Synchronizer.syncExec(Synchronizer.java:233)
13:16:10 	at org.eclipse.ui.internal.UISynchronizer.syncExec(UISynchronizer.java:145)
13:16:10 	at org.eclipse.swt.widgets.Display.syncExec(Display.java:5414)
13:16:10 	at org.eclipse.ui.internal.StartupThreading.runWithoutExceptions(StartupThreading.java:95)
13:16:10 	at org.eclipse.ui.internal.Workbench.initializeDefaultServices(Workbench.java:2442)
13:16:10 	at org.eclipse.ui.internal.Workbench.init(Workbench.java:1678)
13:16:10 	at org.eclipse.ui.internal.Workbench.runUI(Workbench.java:2944)
13:16:10 	at org.eclipse.ui.internal.Workbench.access$9(Workbench.java:2875)
13:16:10 	at org.eclipse.ui.internal.Workbench$5.run(Workbench.java:684)
13:16:10 	at org.eclipse.core.databinding.observable.Realm.runWithDefault(Realm.java:336)
13:16:10 	at org.eclipse.ui.internal.Workbench.createAndRunWorkbench(Workbench.java:610)
13:16:10 	at org.eclipse.ui.PlatformUI.createAndRunWorkbench(PlatformUI.java:148)
13:16:10 	at org.eclipse.ui.internal.ide.application.IDEApplication.start(IDEApplication.java:138)
13:16:10 	at org.eclipse.tycho.surefire.osgibooter.UITestApplication.runApplication(UITestApplication.java:31)
13:16:10 	at org.eclipse.tycho.surefire.osgibooter.AbstractUITestApplication.run(AbstractUITestApplication.java:120)
13:16:10 	at org.eclipse.tycho.surefire.osgibooter.UITestApplication.start(UITestApplication.java:37)
13:16:10 	at org.eclipse.equinox.internal.app.EclipseAppHandle.run(EclipseAppHandle.java:196)
13:16:10 	at org.eclipse.core.runtime.internal.adaptor.EclipseAppLauncher.runApplication(EclipseAppLauncher.java:134)
13:16:10 	at org.eclipse.core.runtime.internal.adaptor.EclipseAppLauncher.start(EclipseAppLauncher.java:104)
13:16:10 	at org.eclipse.core.runtime.adaptor.EclipseStarter.run(EclipseStarter.java:388)
13:16:10 	at org.eclipse.core.runtime.adaptor.EclipseStarter.run(EclipseStarter.java:243)
13:16:10 	at sun.reflect.NativeMethodAccessorImpl.invoke0(Native Method)
13:16:10 	at sun.reflect.NativeMethodAccessorImpl.invoke(NativeMethodAccessorImpl.java:62)
13:16:10 	at sun.reflect.DelegatingMethodAccessorImpl.invoke(DelegatingMethodAccessorImpl.java:43)
13:16:10 	at java.lang.reflect.Method.invoke(Method.java:498)
13:16:10 	at org.eclipse.equinox.launcher.Main.invokeFramework(Main.java:673)
13:16:10 	at org.eclipse.equinox.launcher.Main.basicRun(Main.java:610)
13:16:10 	at org.eclipse.equinox.launcher.Main.run(Main.java:1519)
13:16:10 	at org.eclipse.equinox.launcher.Main.main(Main.java:1492)
13:16:10 Caused by: org.osgi.framework.BundleException: Exception in org.eclipse.egit.ui.Activator.start() of bundle org.eclipse.egit.ui.
13:16:10 	at org.eclipse.osgi.internal.framework.BundleContextImpl.startActivator(BundleContextImpl.java:795)
13:16:10 	at org.eclipse.osgi.internal.framework.BundleContextImpl.start(BundleContextImpl.java:724)
13:16:10 	at org.eclipse.osgi.internal.framework.EquinoxBundle.startWorker0(EquinoxBundle.java:932)
13:16:10 	at org.eclipse.osgi.internal.framework.EquinoxBundle$EquinoxModule.startWorker(EquinoxBundle.java:309)
13:16:10 	at org.eclipse.osgi.container.Module.doStart(Module.java:581)
13:16:10 	at org.eclipse.osgi.container.Module.start(Module.java:449)
13:16:10 	at org.eclipse.osgi.framework.util.SecureAction.start(SecureAction.java:470)
13:16:10 	at org.eclipse.osgi.internal.hooks.EclipseLazyStarter.postFindLocalClass(EclipseLazyStarter.java:107)
13:16:10 	... 46 more
13:16:10 Caused by: java.lang.NoClassDefFoundError: org/eclipse/core/resources/IResource
13:16:10 	at org.eclipse.egit.ui.Activator.setupRepoChangeScanner(Activator.java:1081)
13:16:10 	at org.eclipse.egit.ui.Activator.start(Activator.java:355)
13:16:10 	at org.eclipse.osgi.internal.framework.BundleContextImpl$3.run(BundleContextImpl.java:774)
13:16:10 	at org.eclipse.osgi.internal.framework.BundleContextImpl$3.run(BundleContextImpl.java:1)
13:16:10 	at java.security.AccessController.doPrivileged(Native Method)
13:16:10 	at org.eclipse.osgi.internal.framework.BundleContextImpl.startActivator(BundleContextImpl.java:767)
13:16:10 	... 53 more
13:16:10 Caused by: java.lang.ClassNotFoundException: org.eclipse.core.resources.IResource cannot be found by org.eclipse.egit.ui_5.4.0.201903251706
13:16:10 	at org.eclipse.osgi.internal.loader.BundleLoader.findClassInternal(BundleLoader.java:461)
13:16:10 	at org.eclipse.osgi.internal.loader.BundleLoader.findClass(BundleLoader.java:372)
13:16:10 	at org.eclipse.osgi.internal.loader.BundleLoader.findClass(BundleLoader.java:364)
13:16:10 	at org.eclipse.osgi.internal.loader.ModuleClassLoader.loadClass(ModuleClassLoader.java:161)
13:16:10 	at java.lang.ClassLoader.loadClass(ClassLoader.java:357)
13:16:10 	... 59 more
13:16:11 
13:16:11 !ENTRY org.eclipse.ui.workbench 4 2 2019-03-25 17:16:11.363
13:16:11 !MESSAGE Problems occurred when invoking code from plug-in: "org.eclipse.ui.workbench".
13:16:11 !STACK 1
13:16:11 org.eclipse.core.runtime.CoreException: Plug-in org.eclipse.egit.ui was unable to load class org.eclipse.egit.ui.internal.clone.GitCloneDropAdapter.
13:16:11 	at org.eclipse.core.internal.registry.osgi.RegistryStrategyOSGI.throwException(RegistryStrategyOSGI.java:194)
13:16:11 	at org.eclipse.core.internal.registry.osgi.RegistryStrategyOSGI.createExecutableExtension(RegistryStrategyOSGI.java:176)
13:16:11 	at org.eclipse.core.internal.registry.ExtensionRegistry.createExecutableExtension(ExtensionRegistry.java:905)
13:16:11 	at org.eclipse.core.internal.registry.ConfigurationElement.createExecutableExtension(ConfigurationElement.java:243)
13:16:11 	at org.eclipse.core.internal.registry.ConfigurationElementHandle.createExecutableExtension(ConfigurationElementHandle.java:55)
13:16:11 	at org.eclipse.ui.internal.WorkbenchPlugin$1.run(WorkbenchPlugin.java:291)
13:16:11 	at org.eclipse.swt.custom.BusyIndicator.showWhile(BusyIndicator.java:52)
13:16:11 	at org.eclipse.ui.internal.WorkbenchPlugin.createExtension(WorkbenchPlugin.java:286)
13:16:11 	at org.eclipse.ui.internal.EarlyStartupRunnable.run(EarlyStartupRunnable.java:53)
13:16:11 	at org.eclipse.core.runtime.SafeRunner.run(SafeRunner.java:42)
13:16:11 	at org.eclipse.ui.internal.Workbench$55.run(Workbench.java:2835)
13:16:11 	at org.eclipse.core.internal.jobs.Worker.run(Worker.java:55)
13:16:11 Caused by: java.lang.ClassNotFoundException: An error occurred while automatically activating bundle org.eclipse.egit.ui (81).
13:16:11 	at org.eclipse.osgi.internal.hooks.EclipseLazyStarter.postFindLocalClass(EclipseLazyStarter.java:116)
13:16:11 	at org.eclipse.osgi.internal.loader.classpath.ClasspathManager.findLocalClass(ClasspathManager.java:529)
13:16:11 	at org.eclipse.osgi.internal.loader.ModuleClassLoader.findLocalClass(ModuleClassLoader.java:325)
13:16:11 	at org.eclipse.osgi.internal.loader.BundleLoader.findLocalClass(BundleLoader.java:345)
13:16:11 	at org.eclipse.osgi.internal.loader.BundleLoader.findClassInternal(BundleLoader.java:423)
13:16:11 	at org.eclipse.osgi.internal.loader.BundleLoader.findClass(BundleLoader.java:372)
13:16:11 	at org.eclipse.osgi.internal.loader.BundleLoader.findClass(BundleLoader.java:364)
13:16:11 	at org.eclipse.osgi.internal.loader.ModuleClassLoader.loadClass(ModuleClassLoader.java:161)
13:16:11 	at java.lang.ClassLoader.loadClass(ClassLoader.java:357)
13:16:11 	at org.eclipse.osgi.internal.framework.EquinoxBundle.loadClass(EquinoxBundle.java:564)
13:16:11 	at org.eclipse.core.internal.registry.osgi.RegistryStrategyOSGI.createExecutableExtension(RegistryStrategyOSGI.java:174)
13:16:11 	at org.eclipse.core.internal.registry.ExtensionRegistry.createExecutableExtension(ExtensionRegistry.java:905)
13:16:11 	at org.eclipse.core.internal.registry.ConfigurationElement.createExecutableExtension(ConfigurationElement.java:243)
13:16:11 	at org.eclipse.core.internal.registry.ConfigurationElementHandle.createExecutableExtension(ConfigurationElementHandle.java:55)
13:16:11 	at org.eclipse.ui.internal.services.WorkbenchServiceRegistry.getSourceProviders(WorkbenchServiceRegistry.java:177)
13:16:11 	at org.eclipse.ui.internal.services.SourceProviderService.readRegistry(SourceProviderService.java:108)
13:16:11 	at org.eclipse.ui.internal.Workbench$47.runWithException(Workbench.java:2447)
13:16:11 	at org.eclipse.ui.internal.StartupThreading$StartupRunnable.run(StartupThreading.java:32)
13:16:11 	at org.eclipse.swt.widgets.Synchronizer.syncExec(Synchronizer.java:233)
13:16:11 	at org.eclipse.ui.internal.UISynchronizer.syncExec(UISynchronizer.java:145)
13:16:11 	at org.eclipse.swt.widgets.Display.syncExec(Display.java:5414)
13:16:11 	at org.eclipse.ui.internal.StartupThreading.runWithoutExceptions(StartupThreading.java:95)
13:16:11 	at org.eclipse.ui.internal.Workbench.initializeDefaultServices(Workbench.java:2442)
13:16:11 	at org.eclipse.ui.internal.Workbench.init(Workbench.java:1678)
13:16:11 	at org.eclipse.ui.internal.Workbench.runUI(Workbench.java:2944)
13:16:11 	at org.eclipse.ui.internal.Workbench.access$9(Workbench.java:2875)
13:16:11 	at org.eclipse.ui.internal.Workbench$5.run(Workbench.java:684)
13:16:11 	at org.eclipse.core.databinding.observable.Realm.runWithDefault(Realm.java:336)
13:16:11 	at org.eclipse.ui.internal.Workbench.createAndRunWorkbench(Workbench.java:610)
13:16:11 	at org.eclipse.ui.PlatformUI.createAndRunWorkbench(PlatformUI.java:148)
13:16:11 	at org.eclipse.ui.internal.ide.application.IDEApplication.start(IDEApplication.java:138)
13:16:11 	at org.eclipse.tycho.surefire.osgibooter.UITestApplication.runApplication(UITestApplication.java:31)
13:16:11 	at org.eclipse.tycho.surefire.osgibooter.AbstractUITestApplication.run(AbstractUITestApplication.java:120)
13:16:11 	at org.eclipse.tycho.surefire.osgibooter.UITestApplication.start(UITestApplication.java:37)
13:16:11 	at org.eclipse.equinox.internal.app.EclipseAppHandle.run(EclipseAppHandle.java:196)
13:16:11 	at org.eclipse.core.runtime.internal.adaptor.EclipseAppLauncher.runApplication(EclipseAppLauncher.java:134)
13:16:11 	at org.eclipse.core.runtime.internal.adaptor.EclipseAppLauncher.start(EclipseAppLauncher.java:104)
13:16:11 	at org.eclipse.core.runtime.adaptor.EclipseStarter.run(EclipseStarter.java:388)
13:16:11 	at org.eclipse.core.runtime.adaptor.EclipseStarter.run(EclipseStarter.java:243)
13:16:11 	at sun.reflect.NativeMethodAccessorImpl.invoke0(Native Method)
13:16:11 	at sun.reflect.NativeMethodAccessorImpl.invoke(NativeMethodAccessorImpl.java:62)
13:16:11 	at sun.reflect.DelegatingMethodAccessorImpl.invoke(DelegatingMethodAccessorImpl.java:43)
13:16:11 	at java.lang.reflect.Method.invoke(Method.java:498)
13:16:11 	at org.eclipse.equinox.launcher.Main.invokeFramework(Main.java:673)
13:16:11 	at org.eclipse.equinox.launcher.Main.basicRun(Main.java:610)
13:16:11 	at org.eclipse.equinox.launcher.Main.run(Main.java:1519)
13:16:11 	at org.eclipse.equinox.launcher.Main.main(Main.java:1492)
13:16:11 Caused by: org.osgi.framework.BundleException: Exception in org.eclipse.egit.ui.Activator.start() of bundle org.eclipse.egit.ui.
13:16:11 	at org.eclipse.osgi.internal.framework.BundleContextImpl.startActivator(BundleContextImpl.java:795)
13:16:11 	at org.eclipse.osgi.internal.framework.BundleContextImpl.start(BundleContextImpl.java:724)
13:16:11 	at org.eclipse.osgi.internal.framework.EquinoxBundle.startWorker0(EquinoxBundle.java:932)
13:16:11 	at org.eclipse.osgi.internal.framework.EquinoxBundle$EquinoxModule.startWorker(EquinoxBundle.java:309)
13:16:11 	at org.eclipse.osgi.container.Module.doStart(Module.java:581)
13:16:11 	at org.eclipse.osgi.container.Module.start(Module.java:449)
13:16:11 	at org.eclipse.osgi.framework.util.SecureAction.start(SecureAction.java:470)
13:16:11 	at org.eclipse.osgi.internal.hooks.EclipseLazyStarter.postFindLocalClass(EclipseLazyStarter.java:107)
13:16:11 	... 46 more
13:16:11 Caused by: java.lang.NoClassDefFoundError: org/eclipse/core/resources/IResource
13:16:11 	at org.eclipse.egit.ui.Activator.setupRepoChangeScanner(Activator.java:1081)
13:16:11 	at org.eclipse.egit.ui.Activator.start(Activator.java:355)
13:16:11 	at org.eclipse.osgi.internal.framework.BundleContextImpl$3.run(BundleContextImpl.java:774)
13:16:11 	at org.eclipse.osgi.internal.framework.BundleContextImpl$3.run(BundleContextImpl.java:1)
13:16:11 	at java.security.AccessController.doPrivileged(Native Method)
13:16:11 	at org.eclipse.osgi.internal.framework.BundleContextImpl.startActivator(BundleContextImpl.java:767)
13:16:11 	... 53 more
13:16:11 Caused by: java.lang.ClassNotFoundException: org.eclipse.core.resources.IResource cannot be found by org.eclipse.egit.ui_5.4.0.201903251706
13:16:11 	at org.eclipse.osgi.internal.loader.BundleLoader.findClassInternal(BundleLoader.java:461)
13:16:11 	at org.eclipse.osgi.internal.loader.BundleLoader.findClass(BundleLoader.java:372)
13:16:11 	at org.eclipse.osgi.internal.loader.BundleLoader.findClass(BundleLoader.java:364)
13:16:11 	at org.eclipse.osgi.internal.loader.ModuleClassLoader.loadClass(ModuleClassLoader.java:161)
13:16:11 	at java.lang.ClassLoader.loadClass(ClassLoader.java:357)
13:16:11 	... 59 more
13:16:11 !SUBENTRY 1 org.eclipse.equinox.registry 4 1 2019-03-25 17:16:11.364
13:16:11 !MESSAGE Plug-in org.eclipse.egit.ui was unable to load class org.eclipse.egit.ui.internal.clone.GitCloneDropAdapter.
13:16:11 !STACK 0
13:16:11 java.lang.ClassNotFoundException: An error occurred while automatically activating bundle org.eclipse.egit.ui (81).
13:16:11 	at org.eclipse.osgi.internal.hooks.EclipseLazyStarter.postFindLocalClass(EclipseLazyStarter.java:116)
13:16:11 	at org.eclipse.osgi.internal.loader.classpath.ClasspathManager.findLocalClass(ClasspathManager.java:529)
13:16:11 	at org.eclipse.osgi.internal.loader.ModuleClassLoader.findLocalClass(ModuleClassLoader.java:325)
13:16:11 	at org.eclipse.osgi.internal.loader.BundleLoader.findLocalClass(BundleLoader.java:345)
13:16:11 	at org.eclipse.osgi.internal.loader.BundleLoader.findClassInternal(BundleLoader.java:423)
13:16:11 	at org.eclipse.osgi.internal.loader.BundleLoader.findClass(BundleLoader.java:372)
13:16:11 	at org.eclipse.osgi.internal.loader.BundleLoader.findClass(BundleLoader.java:364)
13:16:11 	at org.eclipse.osgi.internal.loader.ModuleClassLoader.loadClass(ModuleClassLoader.java:161)
13:16:11 	at java.lang.ClassLoader.loadClass(ClassLoader.java:357)
13:16:11 	at org.eclipse.osgi.internal.framework.EquinoxBundle.loadClass(EquinoxBundle.java:564)
13:16:11 	at org.eclipse.core.internal.registry.osgi.RegistryStrategyOSGI.createExecutableExtension(RegistryStrategyOSGI.java:174)
13:16:11 	at org.eclipse.core.internal.registry.ExtensionRegistry.createExecutableExtension(ExtensionRegistry.java:905)
13:16:11 	at org.eclipse.core.internal.registry.ConfigurationElement.createExecutableExtension(ConfigurationElement.java:243)
13:16:11 	at org.eclipse.core.internal.registry.ConfigurationElementHandle.createExecutableExtension(ConfigurationElementHandle.java:55)
13:16:11 	at org.eclipse.ui.internal.services.WorkbenchServiceRegistry.getSourceProviders(WorkbenchServiceRegistry.java:177)
13:16:11 	at org.eclipse.ui.internal.services.SourceProviderService.readRegistry(SourceProviderService.java:108)
13:16:11 	at org.eclipse.ui.internal.Workbench$47.runWithException(Workbench.java:2447)
13:16:11 	at org.eclipse.ui.internal.StartupThreading$StartupRunnable.run(StartupThreading.java:32)
13:16:11 	at org.eclipse.swt.widgets.Synchronizer.syncExec(Synchronizer.java:233)
13:16:11 	at org.eclipse.ui.internal.UISynchronizer.syncExec(UISynchronizer.java:145)
13:16:11 	at org.eclipse.swt.widgets.Display.syncExec(Display.java:5414)
13:16:11 	at org.eclipse.ui.internal.StartupThreading.runWithoutExceptions(StartupThreading.java:95)
13:16:11 	at org.eclipse.ui.internal.Workbench.initializeDefaultServices(Workbench.java:2442)
13:16:11 	at org.eclipse.ui.internal.Workbench.init(Workbench.java:1678)
13:16:11 	at org.eclipse.ui.internal.Workbench.runUI(Workbench.java:2944)
13:16:11 	at org.eclipse.ui.internal.Workbench.access$9(Workbench.java:2875)
13:16:11 	at org.eclipse.ui.internal.Workbench$5.run(Workbench.java:684)
13:16:11 	at org.eclipse.core.databinding.observable.Realm.runWithDefault(Realm.java:336)
13:16:11 	at org.eclipse.ui.internal.Workbench.createAndRunWorkbench(Workbench.java:610)
13:16:11 	at org.eclipse.ui.PlatformUI.createAndRunWorkbench(PlatformUI.java:148)
13:16:11 	at org.eclipse.ui.internal.ide.application.IDEApplication.start(IDEApplication.java:138)
13:16:11 	at org.eclipse.tycho.surefire.osgibooter.UITestApplication.runApplication(UITestApplication.java:31)
13:16:11 	at org.eclipse.tycho.surefire.osgibooter.AbstractUITestApplication.run(AbstractUITestApplication.java:120)
13:16:11 	at org.eclipse.tycho.surefire.osgibooter.UITestApplication.start(UITestApplication.java:37)
13:16:11 	at org.eclipse.equinox.internal.app.EclipseAppHandle.run(EclipseAppHandle.java:196)
13:16:11 	at org.eclipse.core.runtime.internal.adaptor.EclipseAppLauncher.runApplication(EclipseAppLauncher.java:134)
13:16:11 	at org.eclipse.core.runtime.internal.adaptor.EclipseAppLauncher.start(EclipseAppLauncher.java:104)
13:16:11 	at org.eclipse.core.runtime.adaptor.EclipseStarter.run(EclipseStarter.java:388)
13:16:11 	at org.eclipse.core.runtime.adaptor.EclipseStarter.run(EclipseStarter.java:243)
13:16:11 	at sun.reflect.NativeMethodAccessorImpl.invoke0(Native Method)
13:16:11 	at sun.reflect.NativeMethodAccessorImpl.invoke(NativeMethodAccessorImpl.java:62)
13:16:11 	at sun.reflect.DelegatingMethodAccessorImpl.invoke(DelegatingMethodAccessorImpl.java:43)
13:16:11 	at java.lang.reflect.Method.invoke(Method.java:498)
13:16:11 	at org.eclipse.equinox.launcher.Main.invokeFramework(Main.java:673)
13:16:11 	at org.eclipse.equinox.launcher.Main.basicRun(Main.java:610)
13:16:11 	at org.eclipse.equinox.launcher.Main.run(Main.java:1519)
13:16:11 	at org.eclipse.equinox.launcher.Main.main(Main.java:1492)
13:16:11 Caused by: org.osgi.framework.BundleException: Exception in org.eclipse.egit.ui.Activator.start() of bundle org.eclipse.egit.ui.
13:16:11 	at org.eclipse.osgi.internal.framework.BundleContextImpl.startActivator(BundleContextImpl.java:795)
13:16:11 	at org.eclipse.osgi.internal.framework.BundleContextImpl.start(BundleContextImpl.java:724)
13:16:11 	at org.eclipse.osgi.internal.framework.EquinoxBundle.startWorker0(EquinoxBundle.java:932)
13:16:11 	at org.eclipse.osgi.internal.framework.EquinoxBundle$EquinoxModule.startWorker(EquinoxBundle.java:309)
13:16:11 	at org.eclipse.osgi.container.Module.doStart(Module.java:581)
13:16:11 	at org.eclipse.osgi.container.Module.start(Module.java:449)
13:16:11 	at org.eclipse.osgi.framework.util.SecureAction.start(SecureAction.java:470)
13:16:11 	at org.eclipse.osgi.internal.hooks.EclipseLazyStarter.postFindLocalClass(EclipseLazyStarter.java:107)
13:16:11 	... 46 more
13:16:11 Caused by: java.lang.NoClassDefFoundError: org/eclipse/core/resources/IResource
13:16:11 	at org.eclipse.egit.ui.Activator.setupRepoChangeScanner(Activator.java:1081)
13:16:11 	at org.eclipse.egit.ui.Activator.start(Activator.java:355)
13:16:11 	at org.eclipse.osgi.internal.framework.BundleContextImpl$3.run(BundleContextImpl.java:774)
13:16:11 	at org.eclipse.osgi.internal.framework.BundleContextImpl$3.run(BundleContextImpl.java:1)
13:16:11 	at java.security.AccessController.doPrivileged(Native Method)
13:16:11 	at org.eclipse.osgi.internal.framework.BundleContextImpl.startActivator(BundleContextImpl.java:767)
13:16:11 	... 53 more
13:16:11 Caused by: java.lang.ClassNotFoundException: org.eclipse.core.resources.IResource cannot be found by org.eclipse.egit.ui_5.4.0.201903251706
13:16:11 	at org.eclipse.osgi.internal.loader.BundleLoader.findClassInternal(BundleLoader.java:461)
13:16:11 	at org.eclipse.osgi.internal.loader.BundleLoader.findClass(BundleLoader.java:372)
13:16:11 	at org.eclipse.osgi.internal.loader.BundleLoader.findClass(BundleLoader.java:364)
13:16:11 	at org.eclipse.osgi.internal.loader.ModuleClassLoader.loadClass(ModuleClassLoader.java:161)
13:16:11 	at java.lang.ClassLoader.loadClass(ClassLoader.java:357)
13:16:11 	... 59 more
13:16:11 !SUBENTRY 1 org.eclipse.equinox.registry 4 1 2019-03-25 17:16:11.364
13:16:11 !MESSAGE Plug-in org.eclipse.egit.ui was unable to load class org.eclipse.egit.ui.internal.clone.GitCloneDropAdapter.
13:16:11 !STACK 0
13:16:11 java.lang.ClassNotFoundException: An error occurred while automatically activating bundle org.eclipse.egit.ui (81).
13:16:11 	at org.eclipse.osgi.internal.hooks.EclipseLazyStarter.postFindLocalClass(EclipseLazyStarter.java:116)
13:16:11 	at org.eclipse.osgi.internal.loader.classpath.ClasspathManager.findLocalClass(ClasspathManager.java:529)
13:16:11 	at org.eclipse.osgi.internal.loader.ModuleClassLoader.findLocalClass(ModuleClassLoader.java:325)
13:16:11 	at org.eclipse.osgi.internal.loader.BundleLoader.findLocalClass(BundleLoader.java:345)
13:16:11 	at org.eclipse.osgi.internal.loader.BundleLoader.findClassInternal(BundleLoader.java:423)
13:16:11 	at org.eclipse.osgi.internal.loader.BundleLoader.findClass(BundleLoader.java:372)
13:16:11 	at org.eclipse.osgi.internal.loader.BundleLoader.findClass(BundleLoader.java:364)
13:16:11 	at org.eclipse.osgi.internal.loader.ModuleClassLoader.loadClass(ModuleClassLoader.java:161)
13:16:11 	at java.lang.ClassLoader.loadClass(ClassLoader.java:357)
13:16:11 	at org.eclipse.osgi.internal.framework.EquinoxBundle.loadClass(EquinoxBundle.java:564)
13:16:11 	at org.eclipse.core.internal.registry.osgi.RegistryStrategyOSGI.createExecutableExtension(RegistryStrategyOSGI.java:174)
13:16:11 	at org.eclipse.core.internal.registry.ExtensionRegistry.createExecutableExtension(ExtensionRegistry.java:905)
13:16:11 	at org.eclipse.core.internal.registry.ConfigurationElement.createExecutableExtension(ConfigurationElement.java:243)
13:16:11 	at org.eclipse.core.internal.registry.ConfigurationElementHandle.createExecutableExtension(ConfigurationElementHandle.java:55)
13:16:11 	at org.eclipse.ui.internal.services.WorkbenchServiceRegistry.getSourceProviders(WorkbenchServiceRegistry.java:177)
13:16:11 	at org.eclipse.ui.internal.services.SourceProviderService.readRegistry(SourceProviderService.java:108)
13:16:11 	at org.eclipse.ui.internal.Workbench$47.runWithException(Workbench.java:2447)
13:16:11 	at org.eclipse.ui.internal.StartupThreading$StartupRunnable.run(StartupThreading.java:32)
13:16:11 	at org.eclipse.swt.widgets.Synchronizer.syncExec(Synchronizer.java:233)
13:16:11 	at org.eclipse.ui.internal.UISynchronizer.syncExec(UISynchronizer.java:145)
13:16:11 	at org.eclipse.swt.widgets.Display.syncExec(Display.java:5414)
13:16:11 	at org.eclipse.ui.internal.StartupThreading.runWithoutExceptions(StartupThreading.java:95)
13:16:11 	at org.eclipse.ui.internal.Workbench.initializeDefaultServices(Workbench.java:2442)
13:16:11 	at org.eclipse.ui.internal.Workbench.init(Workbench.java:1678)
13:16:11 	at org.eclipse.ui.internal.Workbench.runUI(Workbench.java:2944)
13:16:11 	at org.eclipse.ui.internal.Workbench.access$9(Workbench.java:2875)
13:16:11 	at org.eclipse.ui.internal.Workbench$5.run(Workbench.java:684)
13:16:11 	at org.eclipse.core.databinding.observable.Realm.runWithDefault(Realm.java:336)
13:16:11 	at org.eclipse.ui.internal.Workbench.createAndRunWorkbench(Workbench.java:610)
13:16:11 	at org.eclipse.ui.PlatformUI.createAndRunWorkbench(PlatformUI.java:148)
13:16:11 	at org.eclipse.ui.internal.ide.application.IDEApplication.start(IDEApplication.java:138)
13:16:11 	at org.eclipse.tycho.surefire.osgibooter.UITestApplication.runApplication(UITestApplication.java:31)
13:16:11 	at org.eclipse.tycho.surefire.osgibooter.AbstractUITestApplication.run(AbstractUITestApplication.java:120)
13:16:11 	at org.eclipse.tycho.surefire.osgibooter.UITestApplication.start(UITestApplication.java:37)
13:16:11 	at org.eclipse.equinox.internal.app.EclipseAppHandle.run(EclipseAppHandle.java:196)
13:16:11 	at org.eclipse.core.runtime.internal.adaptor.EclipseAppLauncher.runApplication(EclipseAppLauncher.java:134)
13:16:11 	at org.eclipse.core.runtime.internal.adaptor.EclipseAppLauncher.start(EclipseAppLauncher.java:104)
13:16:11 	at org.eclipse.core.runtime.adaptor.EclipseStarter.run(EclipseStarter.java:388)
13:16:11 	at org.eclipse.core.runtime.adaptor.EclipseStarter.run(EclipseStarter.java:243)
13:16:11 	at sun.reflect.NativeMethodAccessorImpl.invoke0(Native Method)
13:16:11 	at sun.reflect.NativeMethodAccessorImpl.invoke(NativeMethodAccessorImpl.java:62)
13:16:11 	at sun.reflect.DelegatingMethodAccessorImpl.invoke(DelegatingMethodAccessorImpl.java:43)
13:16:11 	at java.lang.reflect.Method.invoke(Method.java:498)
13:16:11 	at org.eclipse.equinox.launcher.Main.invokeFramework(Main.java:673)
13:16:11 	at org.eclipse.equinox.launcher.Main.basicRun(Main.java:610)
13:16:11 	at org.eclipse.equinox.launcher.Main.run(Main.java:1519)
13:16:11 	at org.eclipse.equinox.launcher.Main.main(Main.java:1492)
13:16:11 Caused by: org.osgi.framework.BundleException: Exception in org.eclipse.egit.ui.Activator.start() of bundle org.eclipse.egit.ui.
13:16:11 	at org.eclipse.osgi.internal.framework.BundleContextImpl.startActivator(BundleContextImpl.java:795)
13:16:11 	at org.eclipse.osgi.internal.framework.BundleContextImpl.start(BundleContextImpl.java:724)
13:16:11 	at org.eclipse.osgi.internal.framework.EquinoxBundle.startWorker0(EquinoxBundle.java:932)
13:16:11 	at org.eclipse.osgi.internal.framework.EquinoxBundle$EquinoxModule.startWorker(EquinoxBundle.java:309)
13:16:11 	at org.eclipse.osgi.container.Module.doStart(Module.java:581)
13:16:11 	at org.eclipse.osgi.container.Module.start(Module.java:449)
13:16:11 	at org.eclipse.osgi.framework.util.SecureAction.start(SecureAction.java:470)
13:16:11 	at org.eclipse.osgi.internal.hooks.EclipseLazyStarter.postFindLocalClass(EclipseLazyStarter.java:107)
13:16:11 	... 46 more
13:16:11 Caused by: java.lang.NoClassDefFoundError: org/eclipse/core/resources/IResource
13:16:11 	at org.eclipse.egit.ui.Activator.setupRepoChangeScanner(Activator.java:1081)
13:16:11 	at org.eclipse.egit.ui.Activator.start(Activator.java:355)
13:16:11 	at org.eclipse.osgi.internal.framework.BundleContextImpl$3.run(BundleContextImpl.java:774)
13:16:11 	at org.eclipse.osgi.internal.framework.BundleContextImpl$3.run(BundleContextImpl.java:1)
13:16:11 	at java.security.AccessController.doPrivileged(Native Method)
13:16:11 	at org.eclipse.osgi.internal.framework.BundleContextImpl.startActivator(BundleContextImpl.java:767)
13:16:11 	... 53 more
13:16:11 Caused by: java.lang.ClassNotFoundException: org.eclipse.core.resources.IResource cannot be found by org.eclipse.egit.ui_5.4.0.201903251706
13:16:11 	at org.eclipse.osgi.internal.loader.BundleLoader.findClassInternal(BundleLoader.java:461)
13:16:11 	at org.eclipse.osgi.internal.loader.BundleLoader.findClass(BundleLoader.java:372)
13:16:11 	at org.eclipse.osgi.internal.loader.BundleLoader.findClass(BundleLoader.java:364)
13:16:11 	at org.eclipse.osgi.internal.loader.ModuleClassLoader.loadClass(ModuleClassLoader.java:161)
13:16:11 	at java.lang.ClassLoader.loadClass(ClassLoader.java:357)
13:16:11 	... 59 more
13:16:11 
13:16:11 !ENTRY org.eclipse.ui 4 0 2019-03-25 17:16:11.365
13:16:11 !MESSAGE Unable to execute early startup code for the org.eclipse.ui.IStartup extension contributed by the 'org.eclipse.egit.ui' plug-in.
13:16:11 !STACK 1
13:16:11 org.eclipse.core.runtime.CoreException: Plug-in org.eclipse.egit.ui was unable to load class org.eclipse.egit.ui.internal.clone.GitCloneDropAdapter.
13:16:11 	at org.eclipse.core.internal.registry.osgi.RegistryStrategyOSGI.throwException(RegistryStrategyOSGI.java:194)
13:16:11 	at org.eclipse.core.internal.registry.osgi.RegistryStrategyOSGI.createExecutableExtension(RegistryStrategyOSGI.java:176)
13:16:11 	at org.eclipse.core.internal.registry.ExtensionRegistry.createExecutableExtension(ExtensionRegistry.java:905)
13:16:11 	at org.eclipse.core.internal.registry.ConfigurationElement.createExecutableExtension(ConfigurationElement.java:243)
13:16:11 	at org.eclipse.core.internal.registry.ConfigurationElementHandle.createExecutableExtension(ConfigurationElementHandle.java:55)
13:16:11 	at org.eclipse.ui.internal.WorkbenchPlugin$1.run(WorkbenchPlugin.java:291)
13:16:11 	at org.eclipse.swt.custom.BusyIndicator.showWhile(BusyIndicator.java:52)
13:16:11 	at org.eclipse.ui.internal.WorkbenchPlugin.createExtension(WorkbenchPlugin.java:286)
13:16:11 	at org.eclipse.ui.internal.EarlyStartupRunnable.run(EarlyStartupRunnable.java:53)
13:16:11 	at org.eclipse.core.runtime.SafeRunner.run(SafeRunner.java:42)
13:16:11 	at org.eclipse.ui.internal.Workbench$55.run(Workbench.java:2835)
13:16:11 	at org.eclipse.core.internal.jobs.Worker.run(Worker.java:55)
13:16:11 Caused by: java.lang.ClassNotFoundException: An error occurred while automatically activating bundle org.eclipse.egit.ui (81).
13:16:11 	at org.eclipse.osgi.internal.hooks.EclipseLazyStarter.postFindLocalClass(EclipseLazyStarter.java:116)
13:16:11 	at org.eclipse.osgi.internal.loader.classpath.ClasspathManager.findLocalClass(ClasspathManager.java:529)
13:16:11 	at org.eclipse.osgi.internal.loader.ModuleClassLoader.findLocalClass(ModuleClassLoader.java:325)
13:16:11 	at org.eclipse.osgi.internal.loader.BundleLoader.findLocalClass(BundleLoader.java:345)
13:16:11 	at org.eclipse.osgi.internal.loader.BundleLoader.findClassInternal(BundleLoader.java:423)
13:16:11 	at org.eclipse.osgi.internal.loader.BundleLoader.findClass(BundleLoader.java:372)
13:16:11 	at org.eclipse.osgi.internal.loader.BundleLoader.findClass(BundleLoader.java:364)
13:16:11 	at org.eclipse.osgi.internal.loader.ModuleClassLoader.loadClass(ModuleClassLoader.java:161)
13:16:11 	at java.lang.ClassLoader.loadClass(ClassLoader.java:357)
13:16:11 	at org.eclipse.osgi.internal.framework.EquinoxBundle.loadClass(EquinoxBundle.java:564)
13:16:11 	at org.eclipse.core.internal.registry.osgi.RegistryStrategyOSGI.createExecutableExtension(RegistryStrategyOSGI.java:174)
13:16:11 	at org.eclipse.core.internal.registry.ExtensionRegistry.createExecutableExtension(ExtensionRegistry.java:905)
13:16:11 	at org.eclipse.core.internal.registry.ConfigurationElement.createExecutableExtension(ConfigurationElement.java:243)
13:16:11 	at org.eclipse.core.internal.registry.ConfigurationElementHandle.createExecutableExtension(ConfigurationElementHandle.java:55)
13:16:11 	at org.eclipse.ui.internal.services.WorkbenchServiceRegistry.getSourceProviders(WorkbenchServiceRegistry.java:177)
13:16:11 	at org.eclipse.ui.internal.services.SourceProviderService.readRegistry(SourceProviderService.java:108)
13:16:11 	at org.eclipse.ui.internal.Workbench$47.runWithException(Workbench.java:2447)
13:16:11 	at org.eclipse.ui.internal.StartupThreading$StartupRunnable.run(StartupThreading.java:32)
13:16:11 	at org.eclipse.swt.widgets.Synchronizer.syncExec(Synchronizer.java:233)
13:16:11 	at org.eclipse.ui.internal.UISynchronizer.syncExec(UISynchronizer.java:145)
13:16:11 	at org.eclipse.swt.widgets.Display.syncExec(Display.java:5414)
13:16:11 	at org.eclipse.ui.internal.StartupThreading.runWithoutExceptions(StartupThreading.java:95)
13:16:11 	at org.eclipse.ui.internal.Workbench.initializeDefaultServices(Workbench.java:2442)
13:16:11 	at org.eclipse.ui.internal.Workbench.init(Workbench.java:1678)
13:16:11 	at org.eclipse.ui.internal.Workbench.runUI(Workbench.java:2944)
13:16:11 	at org.eclipse.ui.internal.Workbench.access$9(Workbench.java:2875)
13:16:11 	at org.eclipse.ui.internal.Workbench$5.run(Workbench.java:684)
13:16:11 	at org.eclipse.core.databinding.observable.Realm.runWithDefault(Realm.java:336)
13:16:11 	at org.eclipse.ui.internal.Workbench.createAndRunWorkbench(Workbench.java:610)
13:16:11 	at org.eclipse.ui.PlatformUI.createAndRunWorkbench(PlatformUI.java:148)
13:16:11 	at org.eclipse.ui.internal.ide.application.IDEApplication.start(IDEApplication.java:138)
13:16:11 	at org.eclipse.tycho.surefire.osgibooter.UITestApplication.runApplication(UITestApplication.java:31)
13:16:11 	at org.eclipse.tycho.surefire.osgibooter.AbstractUITestApplication.run(AbstractUITestApplication.java:120)
13:16:11 	at org.eclipse.tycho.surefire.osgibooter.UITestApplication.start(UITestApplication.java:37)
13:16:11 	at org.eclipse.equinox.internal.app.EclipseAppHandle.run(EclipseAppHandle.java:196)
13:16:11 	at org.eclipse.core.runtime.internal.adaptor.EclipseAppLauncher.runApplication(EclipseAppLauncher.java:134)
13:16:11 	at org.eclipse.core.runtime.internal.adaptor.EclipseAppLauncher.start(EclipseAppLauncher.java:104)
13:16:11 	at org.eclipse.core.runtime.adaptor.EclipseStarter.run(EclipseStarter.java:388)
13:16:11 	at org.eclipse.core.runtime.adaptor.EclipseStarter.run(EclipseStarter.java:243)
13:16:11 	at sun.reflect.NativeMethodAccessorImpl.invoke0(Native Method)
13:16:11 	at sun.reflect.NativeMethodAccessorImpl.invoke(NativeMethodAccessorImpl.java:62)
13:16:11 	at sun.reflect.DelegatingMethodAccessorImpl.invoke(DelegatingMethodAccessorImpl.java:43)
13:16:11 	at java.lang.reflect.Method.invoke(Method.java:498)
13:16:11 	at org.eclipse.equinox.launcher.Main.invokeFramework(Main.java:673)
13:16:11 	at org.eclipse.equinox.launcher.Main.basicRun(Main.java:610)
13:16:11 	at org.eclipse.equinox.launcher.Main.run(Main.java:1519)
13:16:11 	at org.eclipse.equinox.launcher.Main.main(Main.java:1492)
13:16:11 Caused by: org.osgi.framework.BundleException: Exception in org.eclipse.egit.ui.Activator.start() of bundle org.eclipse.egit.ui.
13:16:11 	at org.eclipse.osgi.internal.framework.BundleContextImpl.startActivator(BundleContextImpl.java:795)
13:16:11 	at org.eclipse.osgi.internal.framework.BundleContextImpl.start(BundleContextImpl.java:724)
13:16:11 	at org.eclipse.osgi.internal.framework.EquinoxBundle.startWorker0(EquinoxBundle.java:932)
13:16:11 	at org.eclipse.osgi.internal.framework.EquinoxBundle$EquinoxModule.startWorker(EquinoxBundle.java:309)
13:16:11 	at org.eclipse.osgi.container.Module.doStart(Module.java:581)
13:16:11 	at org.eclipse.osgi.container.Module.start(Module.java:449)
13:16:11 	at org.eclipse.osgi.framework.util.SecureAction.start(SecureAction.java:470)
13:16:11 	at org.eclipse.osgi.internal.hooks.EclipseLazyStarter.postFindLocalClass(EclipseLazyStarter.java:107)
13:16:11 	... 46 more
13:16:11 Caused by: java.lang.NoClassDefFoundError: org/eclipse/core/resources/IResource
13:16:11 	at org.eclipse.egit.ui.Activator.setupRepoChangeScanner(Activator.java:1081)
13:16:11 	at org.eclipse.egit.ui.Activator.start(Activator.java:355)
13:16:11 	at org.eclipse.osgi.internal.framework.BundleContextImpl$3.run(BundleContextImpl.java:774)
13:16:11 	at org.eclipse.osgi.internal.framework.BundleContextImpl$3.run(BundleContextImpl.java:1)
13:16:11 	at java.security.AccessController.doPrivileged(Native Method)
13:16:11 	at org.eclipse.osgi.internal.framework.BundleContextImpl.startActivator(BundleContextImpl.java:767)
13:16:11 	... 53 more
13:16:11 Caused by: java.lang.ClassNotFoundException: org.eclipse.core.resources.IResource cannot be found by org.eclipse.egit.ui_5.4.0.201903251706
13:16:11 	at org.eclipse.osgi.internal.loader.BundleLoader.findClassInternal(BundleLoader.java:461)
13:16:11 	at org.eclipse.osgi.internal.loader.BundleLoader.findClass(BundleLoader.java:372)
13:16:11 	at org.eclipse.osgi.internal.loader.BundleLoader.findClass(BundleLoader.java:364)
13:16:11 	at org.eclipse.osgi.internal.loader.ModuleClassLoader.loadClass(ModuleClassLoader.java:161)
13:16:11 	at java.lang.ClassLoader.loadClass(ClassLoader.java:357)
13:16:11 	... 59 more
13:16:11 !SUBENTRY 1 org.eclipse.equinox.registry 4 1 2019-03-25 17:16:11.366
13:16:11 !MESSAGE Plug-in org.eclipse.egit.ui was unable to load class org.eclipse.egit.ui.internal.clone.GitCloneDropAdapter.
13:16:11 !STACK 0
13:16:11 java.lang.ClassNotFoundException: An error occurred while automatically activating bundle org.eclipse.egit.ui (81).
13:16:11 	at org.eclipse.osgi.internal.hooks.EclipseLazyStarter.postFindLocalClass(EclipseLazyStarter.java:116)
13:16:11 	at org.eclipse.osgi.internal.loader.classpath.ClasspathManager.findLocalClass(ClasspathManager.java:529)
13:16:11 	at org.eclipse.osgi.internal.loader.ModuleClassLoader.findLocalClass(ModuleClassLoader.java:325)
13:16:11 	at org.eclipse.osgi.internal.loader.BundleLoader.findLocalClass(BundleLoader.java:345)
13:16:11 	at org.eclipse.osgi.internal.loader.BundleLoader.findClassInternal(BundleLoader.java:423)
13:16:11 	at org.eclipse.osgi.internal.loader.BundleLoader.findClass(BundleLoader.java:372)
13:16:11 	at org.eclipse.osgi.internal.loader.BundleLoader.findClass(BundleLoader.java:364)
13:16:11 	at org.eclipse.osgi.internal.loader.ModuleClassLoader.loadClass(ModuleClassLoader.java:161)
13:16:11 	at java.lang.ClassLoader.loadClass(ClassLoader.java:357)
13:16:11 	at org.eclipse.osgi.internal.framework.EquinoxBundle.loadClass(EquinoxBundle.java:564)
13:16:11 	at org.eclipse.core.internal.registry.osgi.RegistryStrategyOSGI.createExecutableExtension(RegistryStrategyOSGI.java:174)
13:16:11 	at org.eclipse.core.internal.registry.ExtensionRegistry.createExecutableExtension(ExtensionRegistry.java:905)
13:16:11 	at org.eclipse.core.internal.registry.ConfigurationElement.createExecutableExtension(ConfigurationElement.java:243)
13:16:11 	at org.eclipse.core.internal.registry.ConfigurationElementHandle.createExecutableExtension(ConfigurationElementHandle.java:55)
13:16:11 	at org.eclipse.ui.internal.services.WorkbenchServiceRegistry.getSourceProviders(WorkbenchServiceRegistry.java:177)
13:16:11 	at org.eclipse.ui.internal.services.SourceProviderService.readRegistry(SourceProviderService.java:108)
13:16:11 	at org.eclipse.ui.internal.Workbench$47.runWithException(Workbench.java:2447)
13:16:11 	at org.eclipse.ui.internal.StartupThreading$StartupRunnable.run(StartupThreading.java:32)
13:16:11 	at org.eclipse.swt.widgets.Synchronizer.syncExec(Synchronizer.java:233)
13:16:11 	at org.eclipse.ui.internal.UISynchronizer.syncExec(UISynchronizer.java:145)
13:16:11 	at org.eclipse.swt.widgets.Display.syncExec(Display.java:5414)
13:16:11 	at org.eclipse.ui.internal.StartupThreading.runWithoutExceptions(StartupThreading.java:95)
13:16:11 	at org.eclipse.ui.internal.Workbench.initializeDefaultServices(Workbench.java:2442)
13:16:11 	at org.eclipse.ui.internal.Workbench.init(Workbench.java:1678)
13:16:11 	at org.eclipse.ui.internal.Workbench.runUI(Workbench.java:2944)
13:16:11 	at org.eclipse.ui.internal.Workbench.access$9(Workbench.java:2875)
13:16:11 	at org.eclipse.ui.internal.Workbench$5.run(Workbench.java:684)
13:16:11 	at org.eclipse.core.databinding.observable.Realm.runWithDefault(Realm.java:336)
13:16:11 	at org.eclipse.ui.internal.Workbench.createAndRunWorkbench(Workbench.java:610)
13:16:11 	at org.eclipse.ui.PlatformUI.createAndRunWorkbench(PlatformUI.java:148)
13:16:11 	at org.eclipse.ui.internal.ide.application.IDEApplication.start(IDEApplication.java:138)
13:16:11 	at org.eclipse.tycho.surefire.osgibooter.UITestApplication.runApplication(UITestApplication.java:31)
13:16:11 	at org.eclipse.tycho.surefire.osgibooter.AbstractUITestApplication.run(AbstractUITestApplication.java:120)
13:16:11 	at org.eclipse.tycho.surefire.osgibooter.UITestApplication.start(UITestApplication.java:37)
13:16:11 	at org.eclipse.equinox.internal.app.EclipseAppHandle.run(EclipseAppHandle.java:196)
13:16:11 	at org.eclipse.core.runtime.internal.adaptor.EclipseAppLauncher.runApplication(EclipseAppLauncher.java:134)
13:16:11 	at org.eclipse.core.runtime.internal.adaptor.EclipseAppLauncher.start(EclipseAppLauncher.java:104)
13:16:11 	at org.eclipse.core.runtime.adaptor.EclipseStarter.run(EclipseStarter.java:388)
13:16:11 	at org.eclipse.core.runtime.adaptor.EclipseStarter.run(EclipseStarter.java:243)
13:16:11 	at sun.reflect.NativeMethodAccessorImpl.invoke0(Native Method)
13:16:11 	at sun.reflect.NativeMethodAccessorImpl.invoke(NativeMethodAccessorImpl.java:62)
13:16:11 	at sun.reflect.DelegatingMethodAccessorImpl.invoke(DelegatingMethodAccessorImpl.java:43)
13:16:11 	at java.lang.reflect.Method.invoke(Method.java:498)
13:16:11 	at org.eclipse.equinox.launcher.Main.invokeFramework(Main.java:673)
13:16:11 	at org.eclipse.equinox.launcher.Main.basicRun(Main.java:610)
13:16:11 	at org.eclipse.equinox.launcher.Main.run(Main.java:1519)
13:16:11 	at org.eclipse.equinox.launcher.Main.main(Main.java:1492)
13:16:11 Caused by: org.osgi.framework.BundleException: Exception in org.eclipse.egit.ui.Activator.start() of bundle org.eclipse.egit.ui.
13:16:11 	at org.eclipse.osgi.internal.framework.BundleContextImpl.startActivator(BundleContextImpl.java:795)
13:16:11 	at org.eclipse.osgi.internal.framework.BundleContextImpl.start(BundleContextImpl.java:724)
13:16:11 	at org.eclipse.osgi.internal.framework.EquinoxBundle.startWorker0(EquinoxBundle.java:932)
13:16:11 	at org.eclipse.osgi.internal.framework.EquinoxBundle$EquinoxModule.startWorker(EquinoxBundle.java:309)
13:16:11 	at org.eclipse.osgi.container.Module.doStart(Module.java:581)
13:16:11 	at org.eclipse.osgi.container.Module.start(Module.java:449)
13:16:11 	at org.eclipse.osgi.framework.util.SecureAction.start(SecureAction.java:470)
13:16:11 	at org.eclipse.osgi.internal.hooks.EclipseLazyStarter.postFindLocalClass(EclipseLazyStarter.java:107)
13:16:11 	... 46 more
13:16:11 Caused by: java.lang.NoClassDefFoundError: org/eclipse/core/resources/IResource
13:16:11 	at org.eclipse.egit.ui.Activator.setupRepoChangeScanner(Activator.java:1081)
13:16:11 	at org.eclipse.egit.ui.Activator.start(Activator.java:355)
13:16:11 	at org.eclipse.osgi.internal.framework.BundleContextImpl$3.run(BundleContextImpl.java:774)
13:16:11 	at org.eclipse.osgi.internal.framework.BundleContextImpl$3.run(BundleContextImpl.java:1)
13:16:11 	at java.security.AccessController.doPrivileged(Native Method)
13:16:11 	at org.eclipse.osgi.internal.framework.BundleContextImpl.startActivator(BundleContextImpl.java:767)
13:16:11 	... 53 more
13:16:11 Caused by: java.lang.ClassNotFoundException: org.eclipse.core.resources.IResource cannot be found by org.eclipse.egit.ui_5.4.0.201903251706
13:16:11 	at org.eclipse.osgi.internal.loader.BundleLoader.findClassInternal(BundleLoader.java:461)
13:16:11 	at org.eclipse.osgi.internal.loader.BundleLoader.findClass(BundleLoader.java:372)
13:16:11 	at org.eclipse.osgi.internal.loader.BundleLoader.findClass(BundleLoader.java:364)
13:16:11 	at org.eclipse.osgi.internal.loader.ModuleClassLoader.loadClass(ModuleClassLoader.java:161)
13:16:11 	at java.lang.ClassLoader.loadClass(ClassLoader.java:357)
13:16:11 	... 59 more
13:16:11 Running org.eclipse.egit.ui.importer.tests.SmartImportWizardTest
13:16:11 Tests run: 1, Failures: 0, Errors: 0, Skipped: 1, Time elapsed: 0.004 s - in org.eclipse.egit.ui.importer.tests.SmartImportWizardTest
13:16:11 org.eclipse.egit.ui.importer.tests.SmartImportWizardTest skipped
13:16:11 
13:16:11 Results:
13:16:11 
13:16:11 Tests run: 1, Failures: 0, Errors: 0, Skipped: 1
13:16:11 
13:16:12 [INFO] All tests passed!
13:16:12 [INFO] 
13:16:12 [INFO] >>> spotbugs-maven-plugin:3.1.11:check (default) > :spotbugs @ org.eclipse.egit.ui.importer.tests >>>
13:16:12 [INFO] 
13:16:12 [INFO] --- spotbugs-maven-plugin:3.1.11:spotbugs (spotbugs) @ org.eclipse.egit.ui.importer.tests ---
13:16:12 [INFO] Fork Value is true
13:16:12      [java] Picked up JAVA_TOOL_OPTIONS: -XX:+IgnoreUnrecognizedVMOptions -XX:+UseContainerSupport -XX:+UnlockExperimentalVMOptions -XX:+UseCGroupMemoryLimitForHeap
13:16:12      [java] Picked up _JAVA_OPTIONS: -XX:MaxRAMPercentage=64.0
13:16:15 [INFO] Done SpotBugs Analysis....
13:16:15 [INFO] 
13:16:15 [INFO] <<< spotbugs-maven-plugin:3.1.11:check (default) < :spotbugs @ org.eclipse.egit.ui.importer.tests <<<
13:16:15 [INFO] 
13:16:15 [INFO] 
13:16:15 [INFO] --- spotbugs-maven-plugin:3.1.11:check (default) @ org.eclipse.egit.ui.importer.tests ---
13:16:15 [INFO] BugInstance size is 0
13:16:15 [INFO] Error size is 0
13:16:15 [INFO] No errors/warnings found
13:16:15 [INFO] 
13:16:15 [INFO] >>> maven-pmd-plugin:3.11.0:cpd-check (default) > :cpd @ org.eclipse.egit.ui.importer.tests >>>
13:16:15 [INFO] 
13:16:15 [INFO] --- maven-pmd-plugin:3.11.0:cpd (cpd) @ org.eclipse.egit.ui.importer.tests ---
13:16:15 [INFO] 
13:16:15 [INFO] <<< maven-pmd-plugin:3.11.0:cpd-check (default) < :cpd @ org.eclipse.egit.ui.importer.tests <<<
13:16:15 [INFO] 
13:16:15 [INFO] 
13:16:15 [INFO] --- maven-pmd-plugin:3.11.0:cpd-check (default) @ org.eclipse.egit.ui.importer.tests ---
13:16:15 [INFO] 
13:16:15 [INFO] 
13:16:15 [INFO] --- tycho-pack200a-plugin:1.3.0:normalize (pack200-normalize) @ org.eclipse.egit.ui.importer.tests ---
13:16:15 [INFO] Pack200 normalizing jar /home/jenkins/workspace/egit.gerrit/repo/org.eclipse.egit.ui.importer.tests/target/org.eclipse.egit.ui.importer.tests-5.4.0-SNAPSHOT.jar
13:16:15 [INFO] 
13:16:15 [INFO] --- eclipse-jarsigner-plugin:1.1.5:sign (sign) @ org.eclipse.egit.ui.importer.tests ---
13:16:15 [INFO] Signing jar: /home/jenkins/workspace/egit.gerrit/repo/org.eclipse.egit.ui.importer.tests/target/org.eclipse.egit.ui.importer.tests-5.4.0-SNAPSHOT.jar
13:16:40 [WARNING] An exception has been thrown, but the request will be retried (attempt 1 / 3)
13:16:40 java.net.UnknownHostException: build.eclipse.org: Name or service not known
13:16:40     at java.net.Inet6AddressImpl.lookupAllHostAddr (Native Method)
13:16:40     at java.net.InetAddress$2.lookupAllHostAddr (InetAddress.java:929)
13:16:40     at java.net.InetAddress.getAddressesFromNameService (InetAddress.java:1324)
13:16:40     at java.net.InetAddress.getAllByName0 (InetAddress.java:1277)
13:16:40     at java.net.InetAddress.getAllByName (InetAddress.java:1193)
13:16:40     at java.net.InetAddress.getAllByName (InetAddress.java:1127)
13:16:40     at org.apache.http.impl.conn.SystemDefaultDnsResolver.resolve (SystemDefaultDnsResolver.java:45)
13:16:40     at org.apache.http.impl.conn.DefaultHttpClientConnectionOperator.connect (DefaultHttpClientConnectionOperator.java:112)
13:16:40     at org.apache.http.impl.conn.PoolingHttpClientConnectionManager.connect (PoolingHttpClientConnectionManager.java:359)
13:16:40     at org.apache.http.impl.execchain.MainClientExec.establishRoute (MainClientExec.java:381)
13:16:40     at org.apache.http.impl.execchain.MainClientExec.execute (MainClientExec.java:237)
13:16:40     at org.apache.http.impl.execchain.ProtocolExec.execute (ProtocolExec.java:185)
13:16:40     at org.apache.http.impl.execchain.RetryExec.execute (RetryExec.java:89)
13:16:40     at org.apache.http.impl.execchain.RedirectExec.execute (RedirectExec.java:111)
13:16:40     at org.apache.http.impl.client.InternalHttpClient.doExecute (InternalHttpClient.java:185)
13:16:40     at org.apache.http.impl.client.CloseableHttpClient.execute (CloseableHttpClient.java:72)
13:16:40     at org.apache.http.impl.client.CloseableHttpClient.execute (CloseableHttpClient.java:221)
13:16:40     at org.apache.http.impl.client.CloseableHttpClient.execute (CloseableHttpClient.java:165)
13:16:40     at org.apache.http.impl.client.CloseableHttpClient.execute (CloseableHttpClient.java:140)
13:16:40     at org.eclipse.cbi.maven.http.apache.ApacheHttpClient.lambda$send$1 (ApacheHttpClient.java:81)
13:16:40     at java.util.concurrent.FutureTask.run (FutureTask.java:266)
13:16:40     at java.util.concurrent.ThreadPoolExecutor.runWorker (ThreadPoolExecutor.java:1149)
13:16:40     at java.util.concurrent.ThreadPoolExecutor$Worker.run (ThreadPoolExecutor.java:624)
13:16:40     at java.lang.Thread.run (Thread.java:748)
13:17:15 [WARNING] An exception has been thrown, but the request will be retried (attempt 2 / 3)
13:17:15 java.net.UnknownHostException: build.eclipse.org: Name or service not known
13:17:15     at java.net.Inet6AddressImpl.lookupAllHostAddr (Native Method)
13:17:15     at java.net.InetAddress$2.lookupAllHostAddr (InetAddress.java:929)
13:17:15     at java.net.InetAddress.getAddressesFromNameService (InetAddress.java:1324)
13:17:15     at java.net.InetAddress.getAllByName0 (InetAddress.java:1277)
13:17:15     at java.net.InetAddress.getAllByName (InetAddress.java:1193)
13:17:15     at java.net.InetAddress.getAllByName (InetAddress.java:1127)
13:17:15     at org.apache.http.impl.conn.SystemDefaultDnsResolver.resolve (SystemDefaultDnsResolver.java:45)
13:17:15     at org.apache.http.impl.conn.DefaultHttpClientConnectionOperator.connect (DefaultHttpClientConnectionOperator.java:112)
13:17:15     at org.apache.http.impl.conn.PoolingHttpClientConnectionManager.connect (PoolingHttpClientConnectionManager.java:359)
13:17:15     at org.apache.http.impl.execchain.MainClientExec.establishRoute (MainClientExec.java:381)
13:17:15     at org.apache.http.impl.execchain.MainClientExec.execute (MainClientExec.java:237)
13:17:15     at org.apache.http.impl.execchain.ProtocolExec.execute (ProtocolExec.java:185)
13:17:15     at org.apache.http.impl.execchain.RetryExec.execute (RetryExec.java:89)
13:17:15     at org.apache.http.impl.execchain.RedirectExec.execute (RedirectExec.java:111)
13:17:15     at org.apache.http.impl.client.InternalHttpClient.doExecute (InternalHttpClient.java:185)
13:17:15     at org.apache.http.impl.client.CloseableHttpClient.execute (CloseableHttpClient.java:72)
13:17:15     at org.apache.http.impl.client.CloseableHttpClient.execute (CloseableHttpClient.java:221)
13:17:15     at org.apache.http.impl.client.CloseableHttpClient.execute (CloseableHttpClient.java:165)
13:17:15     at org.apache.http.impl.client.CloseableHttpClient.execute (CloseableHttpClient.java:140)
13:17:15     at org.eclipse.cbi.maven.http.apache.ApacheHttpClient.lambda$send$1 (ApacheHttpClient.java:81)
13:17:15     at java.util.concurrent.FutureTask.run (FutureTask.java:266)
13:17:15     at java.util.concurrent.ThreadPoolExecutor.runWorker (ThreadPoolExecutor.java:1149)
13:17:15     at java.util.concurrent.ThreadPoolExecutor$Worker.run (ThreadPoolExecutor.java:624)
13:17:15     at java.lang.Thread.run (Thread.java:748)
13:17:25 [WARNING] An exception has been thrown, but the request will be retried (attempt 3 / 3)
13:17:25 java.net.UnknownHostException: build.eclipse.org: Name or service not known
13:17:25     at java.net.Inet6AddressImpl.lookupAllHostAddr (Native Method)
13:17:25     at java.net.InetAddress$2.lookupAllHostAddr (InetAddress.java:929)
13:17:25     at java.net.InetAddress.getAddressesFromNameService (InetAddress.java:1324)
13:17:25     at java.net.InetAddress.getAllByName0 (InetAddress.java:1277)
13:17:25     at java.net.InetAddress.getAllByName (InetAddress.java:1193)
13:17:25     at java.net.InetAddress.getAllByName (InetAddress.java:1127)
13:17:25     at org.apache.http.impl.conn.SystemDefaultDnsResolver.resolve (SystemDefaultDnsResolver.java:45)
13:17:25     at org.apache.http.impl.conn.DefaultHttpClientConnectionOperator.connect (DefaultHttpClientConnectionOperator.java:112)
13:17:25     at org.apache.http.impl.conn.PoolingHttpClientConnectionManager.connect (PoolingHttpClientConnectionManager.java:359)
13:17:25     at org.apache.http.impl.execchain.MainClientExec.establishRoute (MainClientExec.java:381)
13:17:25     at org.apache.http.impl.execchain.MainClientExec.execute (MainClientExec.java:237)
13:17:25     at org.apache.http.impl.execchain.ProtocolExec.execute (ProtocolExec.java:185)
13:17:25     at org.apache.http.impl.execchain.RetryExec.execute (RetryExec.java:89)
13:17:25     at org.apache.http.impl.execchain.RedirectExec.execute (RedirectExec.java:111)
13:17:25     at org.apache.http.impl.client.InternalHttpClient.doExecute (InternalHttpClient.java:185)
13:17:25     at org.apache.http.impl.client.CloseableHttpClient.execute (CloseableHttpClient.java:72)
13:17:25     at org.apache.http.impl.client.CloseableHttpClient.execute (CloseableHttpClient.java:221)
13:17:25     at org.apache.http.impl.client.CloseableHttpClient.execute (CloseableHttpClient.java:165)
13:17:25     at org.apache.http.impl.client.CloseableHttpClient.execute (CloseableHttpClient.java:140)
13:17:25     at org.eclipse.cbi.maven.http.apache.ApacheHttpClient.lambda$send$1 (ApacheHttpClient.java:81)
13:17:25     at java.util.concurrent.FutureTask.run (FutureTask.java:266)
13:17:25     at java.util.concurrent.ThreadPoolExecutor.runWorker (ThreadPoolExecutor.java:1149)
13:17:25     at java.util.concurrent.ThreadPoolExecutor$Worker.run (ThreadPoolExecutor.java:624)
13:17:25     at java.lang.Thread.run (Thread.java:748)
13:17:35 [INFO] ------------------------------------------------------------------------
13:17:35 [INFO] Reactor Summary for EGit Parent 5.4.0-SNAPSHOT:
13:17:35 [INFO] 
13:17:35 [INFO] EGit Parent ........................................ SUCCESS [ 39.167 s]
13:17:35 [INFO] EGit Target Platform Definition .................... SUCCESS [  1.474 s]
13:17:35 [INFO] Eclipse EGit ....................................... SUCCESS [  5.049 s]
13:17:35 [INFO] Git Team Provider (Core) ........................... SUCCESS [ 18.963 s]
13:17:35 [INFO] Git Team Provider (UI) ............................. SUCCESS [ 49.582 s]
13:17:35 [INFO] Git Team Provider (auto-import wizard) ............. SUCCESS [  5.965 s]
13:17:35 [INFO] EGit Mylyn UI ...................................... SUCCESS [  7.620 s]
13:17:35 [INFO] Git Team Provider (Documentation) .................. SUCCESS [  5.784 s]
13:17:35 [INFO] Eclipse EGit Feature ............................... SUCCESS [  1.361 s]
13:17:35 [INFO] EGit Mylyn Feature ................................. SUCCESS [  1.423 s]
13:17:35 [INFO] Git Flow ........................................... SUCCESS [ 11.958 s]
13:17:35 [INFO] Git Flow UI ........................................ SUCCESS [  8.693 s]
13:17:35 [INFO] Eclipse EGit Gitflow Feature ....................... SUCCESS [  1.241 s]
13:17:35 [INFO] EGit JUnit Support ................................. SUCCESS [  6.677 s]
13:17:35 [INFO] GitFlow Test Plug-in ............................... SUCCESS [ 31.550 s]
13:17:35 [INFO] Eclipse EGit Source Feature ........................ SUCCESS [  1.325 s]
13:17:35 [INFO] EGit P2 Repository ................................. SUCCESS [ 15.693 s]
13:17:35 [INFO] EGit Core Test Plug-in ............................. SUCCESS [02:45 min]
13:17:35 [INFO] EGit UI Test Plug-in ............................... SUCCESS [ 18.559 s]
13:17:35 [INFO] EGit Mylyn UI Test Plug-in ......................... SUCCESS [  4.705 s]
13:17:35 [INFO] Git Team Provider (experimental auto-import wizard, incubation) FAILURE [01:29 min]
13:17:35 [INFO] ------------------------------------------------------------------------
13:17:35 [INFO] BUILD FAILURE
13:17:35 [INFO] ------------------------------------------------------------------------
13:17:35 [INFO] Total time:  11:17 min
13:17:35 [INFO] Finished at: 2019-03-25T17:17:35Z
13:17:35 [INFO] ------------------------------------------------------------------------
13:17:35 [ERROR] Failed to execute goal org.eclipse.cbi.maven.plugins:eclipse-jarsigner-plugin:1.1.5:sign (sign) on project org.eclipse.egit.ui.importer.tests: [Mon Mar 25 17:17:35 UTC 2019] Unable to sign jar '/home/jenkins/workspace/egit.gerrit/repo/org.eclipse.egit.ui.importer.tests/target/org.eclipse.egit.ui.importer.tests-5.4.0-SNAPSHOT.jar': Unknown host build.eclipse.org: Name or service not known -> [Help 1]
13:17:35 org.apache.maven.lifecycle.LifecycleExecutionException: Failed to execute goal org.eclipse.cbi.maven.plugins:eclipse-jarsigner-plugin:1.1.5:sign (sign) on project org.eclipse.egit.ui.importer.tests: [Mon Mar 25 17:17:35 UTC 2019] Unable to sign jar '/home/jenkins/workspace/egit.gerrit/repo/org.eclipse.egit.ui.importer.tests/target/org.eclipse.egit.ui.importer.tests-5.4.0-SNAPSHOT.jar'
13:17:35     at org.apache.maven.lifecycle.internal.MojoExecutor.execute (MojoExecutor.java:215)
13:17:35     at org.apache.maven.lifecycle.internal.MojoExecutor.execute (MojoExecutor.java:156)
13:17:35     at org.apache.maven.lifecycle.internal.MojoExecutor.execute (MojoExecutor.java:148)
13:17:35     at org.apache.maven.lifecycle.internal.LifecycleModuleBuilder.buildProject (LifecycleModuleBuilder.java:117)
13:17:35     at org.apache.maven.lifecycle.internal.LifecycleModuleBuilder.buildProject (LifecycleModuleBuilder.java:81)
13:17:35     at org.apache.maven.lifecycle.internal.builder.singlethreaded.SingleThreadedBuilder.build (SingleThreadedBuilder.java:56)
13:17:35     at org.apache.maven.lifecycle.internal.LifecycleStarter.execute (LifecycleStarter.java:128)
13:17:35     at org.apache.maven.DefaultMaven.doExecute (DefaultMaven.java:305)
13:17:35     at org.apache.maven.DefaultMaven.doExecute (DefaultMaven.java:192)
13:17:35     at org.apache.maven.DefaultMaven.execute (DefaultMaven.java:105)
13:17:35     at org.apache.maven.cli.MavenCli.execute (MavenCli.java:956)
13:17:35     at org.apache.maven.cli.MavenCli.doMain (MavenCli.java:288)
13:17:35     at org.apache.maven.cli.MavenCli.main (MavenCli.java:192)
13:17:35     at sun.reflect.NativeMethodAccessorImpl.invoke0 (Native Method)
13:17:35     at sun.reflect.NativeMethodAccessorImpl.invoke (NativeMethodAccessorImpl.java:62)
13:17:35     at sun.reflect.DelegatingMethodAccessorImpl.invoke (DelegatingMethodAccessorImpl.java:43)
13:17:35     at java.lang.reflect.Method.invoke (Method.java:498)
13:17:35     at org.codehaus.plexus.classworlds.launcher.Launcher.launchEnhanced (Launcher.java:289)
13:17:35     at org.codehaus.plexus.classworlds.launcher.Launcher.launch (Launcher.java:229)
13:17:35     at org.codehaus.plexus.classworlds.launcher.Launcher.mainWithExitCode (Launcher.java:415)
13:17:35     at org.codehaus.plexus.classworlds.launcher.Launcher.main (Launcher.java:356)
13:17:35 Caused by: org.apache.maven.plugin.MojoExecutionException: [Mon Mar 25 17:17:35 UTC 2019] Unable to sign jar '/home/jenkins/workspace/egit.gerrit/repo/org.eclipse.egit.ui.importer.tests/target/org.eclipse.egit.ui.importer.tests-5.4.0-SNAPSHOT.jar'
13:17:35     at org.eclipse.cbi.maven.ExceptionHandler.handleError (ExceptionHandler.java:40)
13:17:35     at org.eclipse.cbi.maven.plugins.jarsigner.mojo.SignMojo.signArtifact (SignMojo.java:337)
13:17:35     at org.eclipse.cbi.maven.plugins.jarsigner.mojo.SignMojo.execute (SignMojo.java:312)
13:17:35     at org.apache.maven.plugin.DefaultBuildPluginManager.executeMojo (DefaultBuildPluginManager.java:137)
13:17:35     at org.apache.maven.lifecycle.internal.MojoExecutor.execute (MojoExecutor.java:210)
13:17:35     at org.apache.maven.lifecycle.internal.MojoExecutor.execute (MojoExecutor.java:156)
13:17:35     at org.apache.maven.lifecycle.internal.MojoExecutor.execute (MojoExecutor.java:148)
13:17:35     at org.apache.maven.lifecycle.internal.LifecycleModuleBuilder.buildProject (LifecycleModuleBuilder.java:117)
13:17:35     at org.apache.maven.lifecycle.internal.LifecycleModuleBuilder.buildProject (LifecycleModuleBuilder.java:81)
13:17:35     at org.apache.maven.lifecycle.internal.builder.singlethreaded.SingleThreadedBuilder.build (SingleThreadedBuilder.java:56)
13:17:35     at org.apache.maven.lifecycle.internal.LifecycleStarter.execute (LifecycleStarter.java:128)
13:17:35     at org.apache.maven.DefaultMaven.doExecute (DefaultMaven.java:305)
13:17:35     at org.apache.maven.DefaultMaven.doExecute (DefaultMaven.java:192)
13:17:35     at org.apache.maven.DefaultMaven.execute (DefaultMaven.java:105)
13:17:35     at org.apache.maven.cli.MavenCli.execute (MavenCli.java:956)
13:17:35     at org.apache.maven.cli.MavenCli.doMain (MavenCli.java:288)
13:17:35     at org.apache.maven.cli.MavenCli.main (MavenCli.java:192)
13:17:35     at sun.reflect.NativeMethodAccessorImpl.invoke0 (Native Method)
13:17:35     at sun.reflect.NativeMethodAccessorImpl.invoke (NativeMethodAccessorImpl.java:62)
13:17:35     at sun.reflect.DelegatingMethodAccessorImpl.invoke (DelegatingMethodAccessorImpl.java:43)
13:17:35     at java.lang.reflect.Method.invoke (Method.java:498)
13:17:35     at org.codehaus.plexus.classworlds.launcher.Launcher.launchEnhanced (Launcher.java:289)
13:17:35     at org.codehaus.plexus.classworlds.launcher.Launcher.launch (Launcher.java:229)
13:17:35     at org.codehaus.plexus.classworlds.launcher.Launcher.mainWithExitCode (Launcher.java:415)
13:17:35     at org.codehaus.plexus.classworlds.launcher.Launcher.main (Launcher.java:356)
13:17:35 Caused by: java.net.UnknownHostException: build.eclipse.org: Name or service not known
13:17:35     at java.net.Inet6AddressImpl.lookupAllHostAddr (Native Method)
13:17:35     at java.net.InetAddress$2.lookupAllHostAddr (InetAddress.java:929)
13:17:35     at java.net.InetAddress.getAddressesFromNameService (InetAddress.java:1324)
13:17:35     at java.net.InetAddress.getAllByName0 (InetAddress.java:1277)
13:17:35     at java.net.InetAddress.getAllByName (InetAddress.java:1193)
13:17:35     at java.net.InetAddress.getAllByName (InetAddress.java:1127)
13:17:35     at org.apache.http.impl.conn.SystemDefaultDnsResolver.resolve (SystemDefaultDnsResolver.java:45)
13:17:35     at org.apache.http.impl.conn.DefaultHttpClientConnectionOperator.connect (DefaultHttpClientConnectionOperator.java:112)
13:17:35     at org.apache.http.impl.conn.PoolingHttpClientConnectionManager.connect (PoolingHttpClientConnectionManager.java:359)
13:17:35     at org.apache.http.impl.execchain.MainClientExec.establishRoute (MainClientExec.java:381)
13:17:35     at org.apache.http.impl.execchain.MainClientExec.execute (MainClientExec.java:237)
13:17:35     at org.apache.http.impl.execchain.ProtocolExec.execute (ProtocolExec.java:185)
13:17:35     at org.apache.http.impl.execchain.RetryExec.execute (RetryExec.java:89)
13:17:35     at org.apache.http.impl.execchain.RedirectExec.execute (RedirectExec.java:111)
13:17:35     at org.apache.http.impl.client.InternalHttpClient.doExecute (InternalHttpClient.java:185)
13:17:35     at org.apache.http.impl.client.CloseableHttpClient.execute (CloseableHttpClient.java:72)
13:17:35     at org.apache.http.impl.client.CloseableHttpClient.execute (CloseableHttpClient.java:221)
13:17:35     at org.apache.http.impl.client.CloseableHttpClient.execute (CloseableHttpClient.java:165)
13:17:35     at org.apache.http.impl.client.CloseableHttpClient.execute (CloseableHttpClient.java:140)
13:17:35     at org.eclipse.cbi.maven.http.apache.ApacheHttpClient.lambda$send$1 (ApacheHttpClient.java:81)
13:17:35     at java.util.concurrent.FutureTask.run (FutureTask.java:266)
13:17:35     at java.util.concurrent.ThreadPoolExecutor.runWorker (ThreadPoolExecutor.java:1149)
13:17:35     at java.util.concurrent.ThreadPoolExecutor$Worker.run (ThreadPoolExecutor.java:624)
13:17:35     at java.lang.Thread.run (Thread.java:748)
13:17:35 [ERROR] 
13:17:35 [ERROR] Re-run Maven using the -X switch to enable full debug logging.
13:17:35 [ERROR] 
13:17:35 [ERROR] For more information about the errors and possible solutions, please read the following articles:
13:17:35 [ERROR] [Help 1] http://cwiki.apache.org/confluence/display/MAVEN/MojoExecutionException
13:17:35 [ERROR] 
13:17:35 [ERROR] After correcting the problems, you can resume the build with the command
13:17:35 [ERROR]   mvn <goals> -rf :org.eclipse.egit.ui.importer.tests
13:17:37 Build step 'Invoke top-level Maven targets' marked build as failure
13:17:37 Terminating xvnc.
13:19:38 [FINDBUGS] Skipping publisher since build result is FAILURE
13:19:38 [DRY] Skipping publisher since build result is FAILURE
13:19:38 Recording test results
13:19:39 Archiving artifacts
13:19:42 Finished: FAILURE