UnstableConsole Output

Skipping 1,574 KB.. Full Log
): Gtk-CRITICAL **: 17:42:23.092: gtk_box_gadget_distribute: assertion 'size >= 0' failed in GtkScrollbar
13:42:23 
13:42:23 (SWT:1478): Gtk-CRITICAL **: 17:42:23.093: gtk_box_gadget_distribute: assertion 'size >= 0' failed in GtkScrollbar
13:42:23 
13:42:23 (SWT:1478): Gtk-CRITICAL **: 17:42:23.103: gtk_box_gadget_distribute: assertion 'size >= 0' failed in GtkScrollbar
13:42:23 
13:42:23 (SWT:1478): Gtk-CRITICAL **: 17:42:23.157: gtk_box_gadget_distribute: assertion 'size >= 0' failed in GtkScrollbar
13:42:23 
13:42:23 (SWT:1478): Gtk-CRITICAL **: 17:42:23.159: gtk_box_gadget_distribute: assertion 'size >= 0' failed in GtkScrollbar
13:42:23 
13:42:23 (SWT:1478): Gtk-CRITICAL **: 17:42:23.159: gtk_box_gadget_distribute: assertion 'size >= 0' failed in GtkScrollbar
13:42:23 
13:42:23 (SWT:1478): Gtk-CRITICAL **: 17:42:23.171: gtk_box_gadget_distribute: assertion 'size >= 0' failed in GtkScrollbar
13:42:23 
13:42:23 (SWT:1478): Gtk-CRITICAL **: 17:42:23.686: gtk_box_gadget_distribute: assertion 'size >= 0' failed in GtkScrollbar
13:42:23 
13:42:23 (SWT:1478): Gtk-CRITICAL **: 17:42:23.698: gtk_box_gadget_distribute: assertion 'size >= 0' failed in GtkScrollbar
13:42:23 
13:42:23 (SWT:1478): Gtk-CRITICAL **: 17:42:23.698: gtk_box_gadget_distribute: assertion 'size >= 0' failed in GtkScrollbar
13:42:23 
13:42:23 (SWT:1478): Gtk-CRITICAL **: 17:42:23.700: gtk_box_gadget_distribute: assertion 'size >= 0' failed in GtkScrollbar
13:42:23 
13:42:23 (SWT:1478): Gtk-CRITICAL **: 17:42:23.700: gtk_box_gadget_distribute: assertion 'size >= 0' failed in GtkScrollbar
13:42:23 
13:42:23 (SWT:1478): Gtk-CRITICAL **: 17:42:23.703: gtk_box_gadget_distribute: assertion 'size >= 0' failed in GtkScrollbar
13:42:23 
13:42:23 (SWT:1478): Gtk-CRITICAL **: 17:42:23.711: gtk_box_gadget_distribute: assertion 'size >= 0' failed in GtkScrollbar
13:42:23 
13:42:23 (SWT:1478): Gtk-CRITICAL **: 17:42:23.784: gtk_box_gadget_distribute: assertion 'size >= 0' failed in GtkScrollbar
13:42:23 
13:42:23 (SWT:1478): Gtk-CRITICAL **: 17:42:23.784: gtk_box_gadget_distribute: assertion 'size >= 0' failed in GtkScrollbar
13:42:23 
13:42:23 (SWT:1478): Gtk-CRITICAL **: 17:42:23.786: gtk_box_gadget_distribute: assertion 'size >= 0' failed in GtkScrollbar
13:42:23 
13:42:23 (SWT:1478): Gtk-CRITICAL **: 17:42:23.787: gtk_box_gadget_distribute: assertion 'size >= 0' failed in GtkScrollbar
13:42:23 
13:42:23 (SWT:1478): Gtk-CRITICAL **: 17:42:23.787: gtk_box_gadget_distribute: assertion 'size >= 0' failed in GtkScrollbar
13:42:23 
13:42:23 (SWT:1478): Gtk-CRITICAL **: 17:42:23.788: gtk_box_gadget_distribute: assertion 'size >= 0' failed in GtkScrollbar
13:42:23 
13:42:23 (SWT:1478): Gtk-CRITICAL **: 17:42:23.790: gtk_box_gadget_distribute: assertion 'size >= 0' failed in GtkScrollbar
13:42:23 
13:42:23 (SWT:1478): Gtk-CRITICAL **: 17:42:23.790: gtk_box_gadget_distribute: assertion 'size >= 0' failed in GtkScrollbar
13:42:23 
13:42:23 (SWT:1478): Gtk-CRITICAL **: 17:42:23.791: gtk_box_gadget_distribute: assertion 'size >= 0' failed in GtkScrollbar
13:42:23 
13:42:23 (SWT:1478): Gtk-CRITICAL **: 17:42:23.844: gtk_box_gadget_distribute: assertion 'size >= 0' failed in GtkScrollbar
13:42:23 
13:42:23 (SWT:1478): Gtk-CRITICAL **: 17:42:23.844: gtk_box_gadget_distribute: assertion 'size >= 0' failed in GtkScrollbar
13:42:23 
13:42:23 (SWT:1478): Gtk-CRITICAL **: 17:42:23.873: gtk_box_gadget_distribute: assertion 'size >= 0' failed in GtkScrollbar
13:42:23 
13:42:23 (SWT:1478): Gtk-CRITICAL **: 17:42:23.878: gtk_box_gadget_distribute: assertion 'size >= 0' failed in GtkScrollbar
13:42:23 
13:42:23 (SWT:1478): Gtk-CRITICAL **: 17:42:23.879: gtk_box_gadget_distribute: assertion 'size >= 0' failed in GtkScrollbar
13:42:23 
13:42:23 (SWT:1478): Gtk-CRITICAL **: 17:42:23.880: gtk_box_gadget_distribute: assertion 'size >= 0' failed in GtkScrollbar
13:42:23 
13:42:23 (SWT:1478): Gtk-CRITICAL **: 17:42:23.883: gtk_box_gadget_distribute: assertion 'size >= 0' failed in GtkScrollbar
13:42:23 
13:42:23 (SWT:1478): Gtk-CRITICAL **: 17:42:23.892: gtk_box_gadget_distribute: assertion 'size >= 0' failed in GtkScrollbar
13:42:23 
13:42:23 (SWT:1478): Gtk-CRITICAL **: 17:42:23.977: gtk_box_gadget_distribute: assertion 'size >= 0' failed in GtkScrollbar
13:42:23 
13:42:23 (SWT:1478): Gtk-CRITICAL **: 17:42:23.978: gtk_box_gadget_distribute: assertion 'size >= 0' failed in GtkScrollbar
13:42:23 
13:42:23 (SWT:1478): Gtk-CRITICAL **: 17:42:23.979: gtk_box_gadget_distribute: assertion 'size >= 0' failed in GtkScrollbar
13:42:23 
13:42:23 (SWT:1478): Gtk-CRITICAL **: 17:42:23.997: gtk_box_gadget_distribute: assertion 'size >= 0' failed in GtkScrollbar
13:42:24 
13:42:24 (SWT:1478): Gtk-CRITICAL **: 17:42:24.063: gtk_box_gadget_distribute: assertion 'size >= 0' failed in GtkScrollbar
13:42:24 
13:42:24 (SWT:1478): Gtk-CRITICAL **: 17:42:24.064: gtk_box_gadget_distribute: assertion 'size >= 0' failed in GtkScrollbar
13:42:24 
13:42:24 (SWT:1478): Gtk-CRITICAL **: 17:42:24.064: gtk_box_gadget_distribute: assertion 'size >= 0' failed in GtkScrollbar
13:42:24 
13:42:24 (SWT:1478): Gtk-CRITICAL **: 17:42:24.078: gtk_box_gadget_distribute: assertion 'size >= 0' failed in GtkScrollbar
13:42:24 
13:42:24 (SWT:1478): Gtk-CRITICAL **: 17:42:24.122: gtk_box_gadget_distribute: assertion 'size >= 0' failed in GtkScrollbar
13:42:24 
13:42:24 (SWT:1478): Gtk-CRITICAL **: 17:42:24.131: gtk_box_gadget_distribute: assertion 'size >= 0' failed in GtkScrollbar
13:42:24 
13:42:24 (SWT:1478): Gtk-CRITICAL **: 17:42:24.145: gtk_box_gadget_distribute: assertion 'size >= 0' failed in GtkScrollbar
13:42:24 
13:42:24 (SWT:1478): Gtk-CRITICAL **: 17:42:24.159: gtk_box_gadget_distribute: assertion 'size >= 0' failed in GtkScrollbar
13:42:24 
13:42:24 (SWT:1478): Gtk-CRITICAL **: 17:42:24.159: gtk_box_gadget_distribute: assertion 'size >= 0' failed in GtkScrollbar
13:42:24 
13:42:24 (SWT:1478): Gtk-CRITICAL **: 17:42:24.161: gtk_box_gadget_distribute: assertion 'size >= 0' failed in GtkScrollbar
13:42:24 
13:42:24 (SWT:1478): Gtk-CRITICAL **: 17:42:24.162: gtk_box_gadget_distribute: assertion 'size >= 0' failed in GtkScrollbar
13:42:24 
13:42:24 (SWT:1478): Gtk-CRITICAL **: 17:42:24.163: gtk_box_gadget_distribute: assertion 'size >= 0' failed in GtkScrollbar
13:42:24 
13:42:24 (SWT:1478): Gtk-CRITICAL **: 17:42:24.163: gtk_box_gadget_distribute: assertion 'size >= 0' failed in GtkScrollbar
13:42:24 
13:42:24 (SWT:1478): Gtk-CRITICAL **: 17:42:24.169: gtk_box_gadget_distribute: assertion 'size >= 0' failed in GtkScrollbar
13:42:24 
13:42:24 (SWT:1478): Gtk-CRITICAL **: 17:42:24.179: gtk_box_gadget_distribute: assertion 'size >= 0' failed in GtkScrollbar
13:42:24 
13:42:24 (SWT:1478): Gtk-CRITICAL **: 17:42:24.246: gtk_box_gadget_distribute: assertion 'size >= 0' failed in GtkScrollbar
13:42:24 
13:42:24 (SWT:1478): Gtk-CRITICAL **: 17:42:24.246: gtk_box_gadget_distribute: assertion 'size >= 0' failed in GtkScrollbar
13:42:24 
13:42:24 (SWT:1478): Gtk-CRITICAL **: 17:42:24.258: gtk_box_gadget_distribute: assertion 'size >= 0' failed in GtkScrollbar
13:42:24 
13:42:24 (SWT:1478): Gtk-CRITICAL **: 17:42:24.263: gtk_box_gadget_distribute: assertion 'size >= 0' failed in GtkScrollbar
13:42:24 
13:42:24 (SWT:1478): Gtk-CRITICAL **: 17:42:24.264: gtk_box_gadget_distribute: assertion 'size >= 0' failed in GtkScrollbar
13:42:24 
13:42:24 (SWT:1478): Gtk-CRITICAL **: 17:42:24.265: gtk_box_gadget_distribute: assertion 'size >= 0' failed in GtkScrollbar
13:42:24 
13:42:24 (SWT:1478): Gtk-CRITICAL **: 17:42:24.268: gtk_box_gadget_distribute: assertion 'size >= 0' failed in GtkScrollbar
13:42:24 
13:42:24 (SWT:1478): Gtk-CRITICAL **: 17:42:24.278: gtk_box_gadget_distribute: assertion 'size >= 0' failed in GtkScrollbar
13:42:24 
13:42:24 (SWT:1478): Gtk-WARNING **: 17:42:24.385: Negative content width -6 (allocation 1, extents 4x3) while allocating gadget (node toolbar, owner GtkToolbar)
13:42:25 
13:42:25 (SWT:1478): Gtk-WARNING **: 17:42:25.006: Negative content width -6 (allocation 1, extents 4x3) while allocating gadget (node toolbar, owner GtkToolbar)
13:42:25 
13:42:25 (SWT:1478): Gtk-WARNING **: 17:42:25.020: Negative content width -6 (allocation 1, extents 4x3) while allocating gadget (node toolbar, owner GtkToolbar)
13:42:25 
13:42:25 (SWT:1478): Gtk-WARNING **: 17:42:25.635: Negative content width -6 (allocation 1, extents 4x3) while allocating gadget (node toolbar, owner GtkToolbar)
13:42:25 
13:42:25 (SWT:1478): Gtk-WARNING **: 17:42:25.952: Negative content width -9 (allocation 9, extents 9x9) while allocating gadget (node entry, owner GtkEntry)
13:42:25 
13:42:25 (SWT:1478): Gtk-CRITICAL **: 17:42:25.990: gtk_box_gadget_distribute: assertion 'size >= 0' failed in GtkScrollbar
13:42:26 
13:42:26 (SWT:1478): Gtk-CRITICAL **: 17:42:25.999: gtk_box_gadget_distribute: assertion 'size >= 0' failed in GtkScrollbar
13:42:26 
13:42:26 (SWT:1478): Gtk-WARNING **: 17:42:26.003: Negative content width -6 (allocation 1, extents 4x3) while allocating gadget (node toolbar, owner GtkToolbar)
13:42:26 
13:42:26 (SWT:1478): Gtk-CRITICAL **: 17:42:26.012: gtk_box_gadget_distribute: assertion 'size >= 0' failed in GtkScrollbar
13:42:26 
13:42:26 (SWT:1478): Gtk-CRITICAL **: 17:42:26.019: gtk_box_gadget_distribute: assertion 'size >= 0' failed in GtkScrollbar
13:42:26 
13:42:26 (SWT:1478): Gtk-CRITICAL **: 17:42:26.020: gtk_box_gadget_distribute: assertion 'size >= 0' failed in GtkScrollbar
13:42:26 
13:42:26 (SWT:1478): Gtk-CRITICAL **: 17:42:26.021: gtk_box_gadget_distribute: assertion 'size >= 0' failed in GtkScrollbar
13:42:26 
13:42:26 (SWT:1478): Gtk-CRITICAL **: 17:42:26.026: gtk_box_gadget_distribute: assertion 'size >= 0' failed in GtkScrollbar
13:42:26 
13:42:26 (SWT:1478): Gtk-CRITICAL **: 17:42:26.026: gtk_box_gadget_distribute: assertion 'size >= 0' failed in GtkScrollbar
13:42:26 
13:42:26 (SWT:1478): Gtk-CRITICAL **: 17:42:26.042: gtk_box_gadget_distribute: assertion 'size >= 0' failed in GtkScrollbar
13:42:26 
13:42:26 (SWT:1478): Gtk-CRITICAL **: 17:42:26.042: gtk_box_gadget_distribute: assertion 'size >= 0' failed in GtkScrollbar
13:42:26 
13:42:26 (SWT:1478): Gtk-CRITICAL **: 17:42:26.053: gtk_box_gadget_distribute: assertion 'size >= 0' failed in GtkScrollbar
13:42:26 
13:42:26 (SWT:1478): Gtk-CRITICAL **: 17:42:26.070: gtk_box_gadget_distribute: assertion 'size >= 0' failed in GtkScrollbar
13:42:26 
13:42:26 (SWT:1478): Gtk-CRITICAL **: 17:42:26.070: gtk_box_gadget_distribute: assertion 'size >= 0' failed in GtkScrollbar
13:42:26 
13:42:26 (SWT:1478): Gtk-CRITICAL **: 17:42:26.086: gtk_box_gadget_distribute: assertion 'size >= 0' failed in GtkScrollbar
13:42:26 
13:42:26 (SWT:1478): Gtk-CRITICAL **: 17:42:26.086: gtk_box_gadget_distribute: assertion 'size >= 0' failed in GtkScrollbar
13:42:26 
13:42:26 (SWT:1478): Gtk-CRITICAL **: 17:42:26.103: gtk_box_gadget_distribute: assertion 'size >= 0' failed in GtkScrollbar
13:42:26 
13:42:26 (SWT:1478): Gtk-CRITICAL **: 17:42:26.103: gtk_box_gadget_distribute: assertion 'size >= 0' failed in GtkScrollbar
13:42:26 
13:42:26 (SWT:1478): Gtk-CRITICAL **: 17:42:26.120: gtk_box_gadget_distribute: assertion 'size >= 0' failed in GtkScrollbar
13:42:26 
13:42:26 (SWT:1478): Gtk-CRITICAL **: 17:42:26.120: gtk_box_gadget_distribute: assertion 'size >= 0' failed in GtkScrollbar
13:42:26 
13:42:26 (SWT:1478): Gtk-CRITICAL **: 17:42:26.136: gtk_box_gadget_distribute: assertion 'size >= 0' failed in GtkScrollbar
13:42:26 
13:42:26 (SWT:1478): Gtk-CRITICAL **: 17:42:26.137: gtk_box_gadget_distribute: assertion 'size >= 0' failed in GtkScrollbar
13:42:26 
13:42:26 (SWT:1478): Gtk-CRITICAL **: 17:42:26.154: gtk_box_gadget_distribute: assertion 'size >= 0' failed in GtkScrollbar
13:42:26 
13:42:26 (SWT:1478): Gtk-CRITICAL **: 17:42:26.154: gtk_box_gadget_distribute: assertion 'size >= 0' failed in GtkScrollbar
13:42:26 
13:42:26 (SWT:1478): Gtk-CRITICAL **: 17:42:26.170: gtk_box_gadget_distribute: assertion 'size >= 0' failed in GtkScrollbar
13:42:26 
13:42:26 (SWT:1478): Gtk-CRITICAL **: 17:42:26.170: gtk_box_gadget_distribute: assertion 'size >= 0' failed in GtkScrollbar
13:42:26 
13:42:26 (SWT:1478): Gtk-CRITICAL **: 17:42:26.186: gtk_box_gadget_distribute: assertion 'size >= 0' failed in GtkScrollbar
13:42:26 
13:42:26 (SWT:1478): Gtk-CRITICAL **: 17:42:26.186: gtk_box_gadget_distribute: assertion 'size >= 0' failed in GtkScrollbar
13:42:26 
13:42:26 (SWT:1478): Gtk-CRITICAL **: 17:42:26.203: gtk_box_gadget_distribute: assertion 'size >= 0' failed in GtkScrollbar
13:42:26 
13:42:26 (SWT:1478): Gtk-CRITICAL **: 17:42:26.203: gtk_box_gadget_distribute: assertion 'size >= 0' failed in GtkScrollbar
13:42:26 
13:42:26 (SWT:1478): Gtk-CRITICAL **: 17:42:26.460: gtk_box_gadget_distribute: assertion 'size >= 0' failed in GtkScrollbar
13:42:26 
13:42:26 (SWT:1478): Gtk-CRITICAL **: 17:42:26.461: gtk_box_gadget_distribute: assertion 'size >= 0' failed in GtkScrollbar
13:42:26 
13:42:26 (SWT:1478): Gtk-CRITICAL **: 17:42:26.462: gtk_box_gadget_distribute: assertion 'size >= 0' failed in GtkScrollbar
13:42:26 
13:42:26 (SWT:1478): Gtk-CRITICAL **: 17:42:26.464: gtk_box_gadget_distribute: assertion 'size >= 0' failed in GtkScrollbar
13:42:26 
13:42:26 (SWT:1478): Gtk-CRITICAL **: 17:42:26.464: gtk_box_gadget_distribute: assertion 'size >= 0' failed in GtkScrollbar
13:42:26 
13:42:26 (SWT:1478): Gtk-CRITICAL **: 17:42:26.466: gtk_box_gadget_distribute: assertion 'size >= 0' failed in GtkScrollbar
13:42:26 
13:42:26 (SWT:1478): Gtk-CRITICAL **: 17:42:26.473: gtk_box_gadget_distribute: assertion 'size >= 0' failed in GtkScrollbar
13:42:26 
13:42:26 (SWT:1478): Gtk-CRITICAL **: 17:42:26.474: gtk_box_gadget_distribute: assertion 'size >= 0' failed in GtkScrollbar
13:42:26 
13:42:26 (SWT:1478): Gtk-CRITICAL **: 17:42:26.475: gtk_box_gadget_distribute: assertion 'size >= 0' failed in GtkScrollbar
13:42:26 
13:42:26 (SWT:1478): Gtk-WARNING **: 17:42:26.523: Negative content width -6 (allocation 1, extents 4x3) while allocating gadget (node toolbar, owner GtkToolbar)
13:42:27 
13:42:27 (SWT:1478): Gtk-WARNING **: 17:42:27.165: Negative content width -6 (allocation 1, extents 4x3) while allocating gadget (node toolbar, owner GtkToolbar)
13:42:27 
13:42:27 (SWT:1478): Gtk-WARNING **: 17:42:27.178: Negative content width -6 (allocation 1, extents 4x3) while allocating gadget (node toolbar, owner GtkToolbar)
13:42:27 
13:42:27 (SWT:1478): Gtk-WARNING **: 17:42:27.779: Negative content width -6 (allocation 1, extents 4x3) while allocating gadget (node toolbar, owner GtkToolbar)
13:42:28 
13:42:28 (SWT:1478): Gtk-WARNING **: 17:42:28.100: Negative content width -9 (allocation 9, extents 9x9) while allocating gadget (node entry, owner GtkEntry)
13:42:28 
13:42:28 (SWT:1478): Gtk-CRITICAL **: 17:42:28.135: gtk_box_gadget_distribute: assertion 'size >= 0' failed in GtkScrollbar
13:42:28 
13:42:28 (SWT:1478): Gtk-CRITICAL **: 17:42:28.145: gtk_box_gadget_distribute: assertion 'size >= 0' failed in GtkScrollbar
13:42:28 
13:42:28 (SWT:1478): Gtk-WARNING **: 17:42:28.151: Negative content width -6 (allocation 1, extents 4x3) while allocating gadget (node toolbar, owner GtkToolbar)
13:42:28 
13:42:28 (SWT:1478): Gtk-CRITICAL **: 17:42:28.160: gtk_box_gadget_distribute: assertion 'size >= 0' failed in GtkScrollbar
13:42:28 
13:42:28 (SWT:1478): Gtk-CRITICAL **: 17:42:28.166: gtk_box_gadget_distribute: assertion 'size >= 0' failed in GtkScrollbar
13:42:28 
13:42:28 (SWT:1478): Gtk-CRITICAL **: 17:42:28.168: gtk_box_gadget_distribute: assertion 'size >= 0' failed in GtkScrollbar
13:42:28 
13:42:28 (SWT:1478): Gtk-CRITICAL **: 17:42:28.168: gtk_box_gadget_distribute: assertion 'size >= 0' failed in GtkScrollbar
13:42:28 
13:42:28 (SWT:1478): Gtk-CRITICAL **: 17:42:28.173: gtk_box_gadget_distribute: assertion 'size >= 0' failed in GtkScrollbar
13:42:28 
13:42:28 (SWT:1478): Gtk-CRITICAL **: 17:42:28.174: gtk_box_gadget_distribute: assertion 'size >= 0' failed in GtkScrollbar
13:42:28 
13:42:28 (SWT:1478): Gtk-CRITICAL **: 17:42:28.192: gtk_box_gadget_distribute: assertion 'size >= 0' failed in GtkScrollbar
13:42:28 
13:42:28 (SWT:1478): Gtk-CRITICAL **: 17:42:28.200: gtk_box_gadget_distribute: assertion 'size >= 0' failed in GtkScrollbar
13:42:28 
13:42:28 (SWT:1478): Gtk-CRITICAL **: 17:42:28.200: gtk_box_gadget_distribute: assertion 'size >= 0' failed in GtkScrollbar
13:42:28 
13:42:28 (SWT:1478): Gtk-CRITICAL **: 17:42:28.216: gtk_box_gadget_distribute: assertion 'size >= 0' failed in GtkScrollbar
13:42:28 
13:42:28 (SWT:1478): Gtk-CRITICAL **: 17:42:28.217: gtk_box_gadget_distribute: assertion 'size >= 0' failed in GtkScrollbar
13:42:28 
13:42:28 (SWT:1478): Gtk-CRITICAL **: 17:42:28.233: gtk_box_gadget_distribute: assertion 'size >= 0' failed in GtkScrollbar
13:42:28 
13:42:28 (SWT:1478): Gtk-CRITICAL **: 17:42:28.233: gtk_box_gadget_distribute: assertion 'size >= 0' failed in GtkScrollbar
13:42:28 
13:42:28 (SWT:1478): Gtk-CRITICAL **: 17:42:28.251: gtk_box_gadget_distribute: assertion 'size >= 0' failed in GtkScrollbar
13:42:28 
13:42:28 (SWT:1478): Gtk-CRITICAL **: 17:42:28.251: gtk_box_gadget_distribute: assertion 'size >= 0' failed in GtkScrollbar
13:42:28 
13:42:28 (SWT:1478): Gtk-CRITICAL **: 17:42:28.267: gtk_box_gadget_distribute: assertion 'size >= 0' failed in GtkScrollbar
13:42:28 
13:42:28 (SWT:1478): Gtk-CRITICAL **: 17:42:28.267: gtk_box_gadget_distribute: assertion 'size >= 0' failed in GtkScrollbar
13:42:28 
13:42:28 (SWT:1478): Gtk-CRITICAL **: 17:42:28.284: gtk_box_gadget_distribute: assertion 'size >= 0' failed in GtkScrollbar
13:42:28 
13:42:28 (SWT:1478): Gtk-CRITICAL **: 17:42:28.284: gtk_box_gadget_distribute: assertion 'size >= 0' failed in GtkScrollbar
13:42:28 
13:42:28 (SWT:1478): Gtk-CRITICAL **: 17:42:28.296: gtk_box_gadget_distribute: assertion 'size >= 0' failed in GtkScrollbar
13:42:28 
13:42:28 (SWT:1478): Gtk-CRITICAL **: 17:42:28.297: gtk_box_gadget_distribute: assertion 'size >= 0' failed in GtkScrollbar
13:42:28 
13:42:28 (SWT:1478): Gtk-CRITICAL **: 17:42:28.298: gtk_box_gadget_distribute: assertion 'size >= 0' failed in GtkScrollbar
13:42:28 
13:42:28 (SWT:1478): Gtk-CRITICAL **: 17:42:28.299: gtk_box_gadget_distribute: assertion 'size >= 0' failed in GtkScrollbar
13:42:28 
13:42:28 (SWT:1478): Gtk-CRITICAL **: 17:42:28.300: gtk_box_gadget_distribute: assertion 'size >= 0' failed in GtkScrollbar
13:42:28 
13:42:28 (SWT:1478): Gtk-CRITICAL **: 17:42:28.302: gtk_box_gadget_distribute: assertion 'size >= 0' failed in GtkScrollbar
13:42:28 
13:42:28 (SWT:1478): Gtk-CRITICAL **: 17:42:28.302: gtk_box_gadget_distribute: assertion 'size >= 0' failed in GtkScrollbar
13:42:28 
13:42:28 (SWT:1478): Gtk-CRITICAL **: 17:42:28.307: gtk_box_gadget_distribute: assertion 'size >= 0' failed in GtkScrollbar
13:42:28 
13:42:28 (SWT:1478): Gtk-CRITICAL **: 17:42:28.314: gtk_box_gadget_distribute: assertion 'size >= 0' failed in GtkScrollbar
13:42:28 
13:42:28 (SWT:1478): Gtk-CRITICAL **: 17:42:28.315: gtk_box_gadget_distribute: assertion 'size >= 0' failed in GtkScrollbar
13:42:28 
13:42:28 (SWT:1478): Gtk-CRITICAL **: 17:42:28.316: gtk_box_gadget_distribute: assertion 'size >= 0' failed in GtkScrollbar
13:42:28 
13:42:28 (SWT:1478): Gtk-CRITICAL **: 17:42:28.317: gtk_box_gadget_distribute: assertion 'size >= 0' failed in GtkScrollbar
13:42:28 
13:42:28 (SWT:1478): Gtk-CRITICAL **: 17:42:28.317: gtk_box_gadget_distribute: assertion 'size >= 0' failed in GtkScrollbar
13:42:28 
13:42:28 (SWT:1478): Gtk-CRITICAL **: 17:42:28.340: gtk_box_gadget_distribute: assertion 'size >= 0' failed in GtkScrollbar
13:42:28 
13:42:28 (SWT:1478): Gtk-CRITICAL **: 17:42:28.350: gtk_box_gadget_distribute: assertion 'size >= 0' failed in GtkScrollbar
13:42:28 
13:42:28 (SWT:1478): Gtk-WARNING **: 17:42:28.374: Negative content width -6 (allocation 1, extents 4x3) while allocating gadget (node toolbar, owner GtkToolbar)
13:42:29 
13:42:29 (SWT:1478): Gtk-WARNING **: 17:42:29.630: Negative content width -6 (allocation 1, extents 4x3) while allocating gadget (node toolbar, owner GtkToolbar)
13:42:29 
13:42:29 (SWT:1478): Gtk-WARNING **: 17:42:29.650: Negative content width -6 (allocation 1, extents 4x3) while allocating gadget (node toolbar, owner GtkToolbar)
13:42:30 
13:42:30 (SWT:1478): Gtk-WARNING **: 17:42:30.252: Negative content width -6 (allocation 1, extents 4x3) while allocating gadget (node toolbar, owner GtkToolbar)
13:42:30 
13:42:30 (SWT:1478): Gtk-WARNING **: 17:42:30.666: Negative content width -9 (allocation 9, extents 9x9) while allocating gadget (node entry, owner GtkEntry)
13:42:30 
13:42:30 (SWT:1478): Gtk-CRITICAL **: 17:42:30.701: gtk_box_gadget_distribute: assertion 'size >= 0' failed in GtkScrollbar
13:42:30 
13:42:30 (SWT:1478): Gtk-CRITICAL **: 17:42:30.710: gtk_box_gadget_distribute: assertion 'size >= 0' failed in GtkScrollbar
13:42:30 
13:42:30 (SWT:1478): Gtk-WARNING **: 17:42:30.715: Negative content width -6 (allocation 1, extents 4x3) while allocating gadget (node toolbar, owner GtkToolbar)
13:42:30 
13:42:30 (SWT:1478): Gtk-CRITICAL **: 17:42:30.723: gtk_box_gadget_distribute: assertion 'size >= 0' failed in GtkScrollbar
13:42:30 
13:42:30 (SWT:1478): Gtk-CRITICAL **: 17:42:30.731: gtk_box_gadget_distribute: assertion 'size >= 0' failed in GtkScrollbar
13:42:30 
13:42:30 (SWT:1478): Gtk-CRITICAL **: 17:42:30.733: gtk_box_gadget_distribute: assertion 'size >= 0' failed in GtkScrollbar
13:42:30 
13:42:30 (SWT:1478): Gtk-CRITICAL **: 17:42:30.733: gtk_box_gadget_distribute: assertion 'size >= 0' failed in GtkScrollbar
13:42:30 
13:42:30 (SWT:1478): Gtk-CRITICAL **: 17:42:30.738: gtk_box_gadget_distribute: assertion 'size >= 0' failed in GtkScrollbar
13:42:30 
13:42:30 (SWT:1478): Gtk-CRITICAL **: 17:42:30.738: gtk_box_gadget_distribute: assertion 'size >= 0' failed in GtkScrollbar
13:42:30 
13:42:30 (SWT:1478): Gtk-CRITICAL **: 17:42:30.750: gtk_box_gadget_distribute: assertion 'size >= 0' failed in GtkScrollbar
13:42:30 
13:42:30 (SWT:1478): Gtk-CRITICAL **: 17:42:30.767: gtk_box_gadget_distribute: assertion 'size >= 0' failed in GtkScrollbar
13:42:30 
13:42:30 (SWT:1478): Gtk-CRITICAL **: 17:42:30.767: gtk_box_gadget_distribute: assertion 'size >= 0' failed in GtkScrollbar
13:42:30 
13:42:30 (SWT:1478): Gtk-CRITICAL **: 17:42:30.782: gtk_box_gadget_distribute: assertion 'size >= 0' failed in GtkScrollbar
13:42:30 
13:42:30 (SWT:1478): Gtk-CRITICAL **: 17:42:30.783: gtk_box_gadget_distribute: assertion 'size >= 0' failed in GtkScrollbar
13:42:30 
13:42:30 (SWT:1478): Gtk-CRITICAL **: 17:42:30.799: gtk_box_gadget_distribute: assertion 'size >= 0' failed in GtkScrollbar
13:42:30 
13:42:30 (SWT:1478): Gtk-CRITICAL **: 17:42:30.799: gtk_box_gadget_distribute: assertion 'size >= 0' failed in GtkScrollbar
13:42:30 
13:42:30 (SWT:1478): Gtk-CRITICAL **: 17:42:30.816: gtk_box_gadget_distribute: assertion 'size >= 0' failed in GtkScrollbar
13:42:30 
13:42:30 (SWT:1478): Gtk-CRITICAL **: 17:42:30.817: gtk_box_gadget_distribute: assertion 'size >= 0' failed in GtkScrollbar
13:42:30 
13:42:30 (SWT:1478): Gtk-CRITICAL **: 17:42:30.833: gtk_box_gadget_distribute: assertion 'size >= 0' failed in GtkScrollbar
13:42:30 
13:42:30 (SWT:1478): Gtk-CRITICAL **: 17:42:30.833: gtk_box_gadget_distribute: assertion 'size >= 0' failed in GtkScrollbar
13:42:30 
13:42:30 (SWT:1478): Gtk-CRITICAL **: 17:42:30.850: gtk_box_gadget_distribute: assertion 'size >= 0' failed in GtkScrollbar
13:42:30 
13:42:30 (SWT:1478): Gtk-CRITICAL **: 17:42:30.850: gtk_box_gadget_distribute: assertion 'size >= 0' failed in GtkScrollbar
13:42:30 
13:42:30 (SWT:1478): Gtk-CRITICAL **: 17:42:30.860: gtk_box_gadget_distribute: assertion 'size >= 0' failed in GtkScrollbar
13:42:30 
13:42:30 (SWT:1478): Gtk-CRITICAL **: 17:42:30.860: gtk_box_gadget_distribute: assertion 'size >= 0' failed in GtkScrollbar
13:42:30 
13:42:30 (SWT:1478): Gtk-CRITICAL **: 17:42:30.862: gtk_box_gadget_distribute: assertion 'size >= 0' failed in GtkScrollbar
13:42:30 
13:42:30 (SWT:1478): Gtk-CRITICAL **: 17:42:30.863: gtk_box_gadget_distribute: assertion 'size >= 0' failed in GtkScrollbar
13:42:30 
13:42:30 (SWT:1478): Gtk-CRITICAL **: 17:42:30.863: gtk_box_gadget_distribute: assertion 'size >= 0' failed in GtkScrollbar
13:42:30 
13:42:30 (SWT:1478): Gtk-CRITICAL **: 17:42:30.864: gtk_box_gadget_distribute: assertion 'size >= 0' failed in GtkScrollbar
13:42:30 
13:42:30 (SWT:1478): Gtk-CRITICAL **: 17:42:30.867: gtk_box_gadget_distribute: assertion 'size >= 0' failed in GtkScrollbar
13:42:30 
13:42:30 (SWT:1478): Gtk-CRITICAL **: 17:42:30.867: gtk_box_gadget_distribute: assertion 'size >= 0' failed in GtkScrollbar
13:42:30 
13:42:30 (SWT:1478): Gtk-CRITICAL **: 17:42:30.879: gtk_box_gadget_distribute: assertion 'size >= 0' failed in GtkScrollbar
13:42:30 
13:42:30 (SWT:1478): Gtk-CRITICAL **: 17:42:30.879: gtk_box_gadget_distribute: assertion 'size >= 0' failed in GtkScrollbar
13:42:30 
13:42:30 (SWT:1478): Gtk-CRITICAL **: 17:42:30.880: gtk_box_gadget_distribute: assertion 'size >= 0' failed in GtkScrollbar
13:42:30 
13:42:30 (SWT:1478): Gtk-CRITICAL **: 17:42:30.883: gtk_box_gadget_distribute: assertion 'size >= 0' failed in GtkScrollbar
13:42:30 
13:42:30 (SWT:1478): Gtk-CRITICAL **: 17:42:30.883: gtk_box_gadget_distribute: assertion 'size >= 0' failed in GtkScrollbar
13:42:30 
13:42:30 (SWT:1478): Gtk-CRITICAL **: 17:42:30.905: gtk_box_gadget_distribute: assertion 'size >= 0' failed in GtkScrollbar
13:42:30 
13:42:30 (SWT:1478): Gtk-WARNING **: 17:42:30.934: Negative content width -6 (allocation 1, extents 4x3) while allocating gadget (node toolbar, owner GtkToolbar)
13:42:32 
13:42:32 (SWT:1478): Gtk-WARNING **: 17:42:32.189: Negative content width -6 (allocation 1, extents 4x3) while allocating gadget (node toolbar, owner GtkToolbar)
13:42:32 
13:42:32 (SWT:1478): Gtk-WARNING **: 17:42:32.202: Negative content width -6 (allocation 1, extents 4x3) while allocating gadget (node toolbar, owner GtkToolbar)
13:42:32 
13:42:32 (SWT:1478): Gtk-WARNING **: 17:42:32.791: Negative content width -6 (allocation 1, extents 4x3) while allocating gadget (node toolbar, owner GtkToolbar)
13:42:33 
13:42:33 (SWT:1478): Gtk-WARNING **: 17:42:33.215: Negative content width -9 (allocation 9, extents 9x9) while allocating gadget (node entry, owner GtkEntry)
13:42:33 
13:42:33 (SWT:1478): Gtk-CRITICAL **: 17:42:33.253: gtk_box_gadget_distribute: assertion 'size >= 0' failed in GtkScrollbar
13:42:33 
13:42:33 (SWT:1478): Gtk-CRITICAL **: 17:42:33.262: gtk_box_gadget_distribute: assertion 'size >= 0' failed in GtkScrollbar
13:42:33 
13:42:33 (SWT:1478): Gtk-WARNING **: 17:42:33.267: Negative content width -6 (allocation 1, extents 4x3) while allocating gadget (node toolbar, owner GtkToolbar)
13:42:33 
13:42:33 (SWT:1478): Gtk-CRITICAL **: 17:42:33.276: gtk_box_gadget_distribute: assertion 'size >= 0' failed in GtkScrollbar
13:42:33 
13:42:33 (SWT:1478): Gtk-CRITICAL **: 17:42:33.283: gtk_box_gadget_distribute: assertion 'size >= 0' failed in GtkScrollbar
13:42:33 
13:42:33 (SWT:1478): Gtk-CRITICAL **: 17:42:33.284: gtk_box_gadget_distribute: assertion 'size >= 0' failed in GtkScrollbar
13:42:33 
13:42:33 (SWT:1478): Gtk-CRITICAL **: 17:42:33.285: gtk_box_gadget_distribute: assertion 'size >= 0' failed in GtkScrollbar
13:42:33 
13:42:33 (SWT:1478): Gtk-CRITICAL **: 17:42:33.290: gtk_box_gadget_distribute: assertion 'size >= 0' failed in GtkScrollbar
13:42:33 
13:42:33 (SWT:1478): Gtk-CRITICAL **: 17:42:33.291: gtk_box_gadget_distribute: assertion 'size >= 0' failed in GtkScrollbar
13:42:33 
13:42:33 (SWT:1478): Gtk-CRITICAL **: 17:42:33.310: gtk_box_gadget_distribute: assertion 'size >= 0' failed in GtkScrollbar
13:42:33 
13:42:33 (SWT:1478): Gtk-CRITICAL **: 17:42:33.313: gtk_box_gadget_distribute: assertion 'size >= 0' failed in GtkScrollbar
13:42:33 
13:42:33 (SWT:1478): Gtk-CRITICAL **: 17:42:33.313: gtk_box_gadget_distribute: assertion 'size >= 0' failed in GtkScrollbar
13:42:33 
13:42:33 (SWT:1478): Gtk-CRITICAL **: 17:42:33.329: gtk_box_gadget_distribute: assertion 'size >= 0' failed in GtkScrollbar
13:42:33 
13:42:33 (SWT:1478): Gtk-CRITICAL **: 17:42:33.329: gtk_box_gadget_distribute: assertion 'size >= 0' failed in GtkScrollbar
13:42:33 
13:42:33 (SWT:1478): Gtk-CRITICAL **: 17:42:33.347: gtk_box_gadget_distribute: assertion 'size >= 0' failed in GtkScrollbar
13:42:33 
13:42:33 (SWT:1478): Gtk-CRITICAL **: 17:42:33.347: gtk_box_gadget_distribute: assertion 'size >= 0' failed in GtkScrollbar
13:42:33 
13:42:33 (SWT:1478): Gtk-CRITICAL **: 17:42:33.363: gtk_box_gadget_distribute: assertion 'size >= 0' failed in GtkScrollbar
13:42:33 
13:42:33 (SWT:1478): Gtk-CRITICAL **: 17:42:33.363: gtk_box_gadget_distribute: assertion 'size >= 0' failed in GtkScrollbar
13:42:33 
13:42:33 (SWT:1478): Gtk-CRITICAL **: 17:42:33.380: gtk_box_gadget_distribute: assertion 'size >= 0' failed in GtkScrollbar
13:42:33 
13:42:33 (SWT:1478): Gtk-CRITICAL **: 17:42:33.380: gtk_box_gadget_distribute: assertion 'size >= 0' failed in GtkScrollbar
13:42:33 
13:42:33 (SWT:1478): Gtk-CRITICAL **: 17:42:33.396: gtk_box_gadget_distribute: assertion 'size >= 0' failed in GtkScrollbar
13:42:33 
13:42:33 (SWT:1478): Gtk-CRITICAL **: 17:42:33.397: gtk_box_gadget_distribute: assertion 'size >= 0' failed in GtkScrollbar
13:42:33 
13:42:33 (SWT:1478): Gtk-CRITICAL **: 17:42:33.414: gtk_box_gadget_distribute: assertion 'size >= 0' failed in GtkScrollbar
13:42:33 
13:42:33 (SWT:1478): Gtk-CRITICAL **: 17:42:33.414: gtk_box_gadget_distribute: assertion 'size >= 0' failed in GtkScrollbar
13:42:33 
13:42:33 (SWT:1478): Gtk-CRITICAL **: 17:42:33.421: gtk_box_gadget_distribute: assertion 'size >= 0' failed in GtkScrollbar
13:42:33 
13:42:33 (SWT:1478): Gtk-CRITICAL **: 17:42:33.422: gtk_box_gadget_distribute: assertion 'size >= 0' failed in GtkScrollbar
13:42:33 
13:42:33 (SWT:1478): Gtk-CRITICAL **: 17:42:33.423: gtk_box_gadget_distribute: assertion 'size >= 0' failed in GtkScrollbar
13:42:33 
13:42:33 (SWT:1478): Gtk-CRITICAL **: 17:42:33.424: gtk_box_gadget_distribute: assertion 'size >= 0' failed in GtkScrollbar
13:42:33 
13:42:33 (SWT:1478): Gtk-CRITICAL **: 17:42:33.424: gtk_box_gadget_distribute: assertion 'size >= 0' failed in GtkScrollbar
13:42:33 
13:42:33 (SWT:1478): Gtk-CRITICAL **: 17:42:33.425: gtk_box_gadget_distribute: assertion 'size >= 0' failed in GtkScrollbar
13:42:33 
13:42:33 (SWT:1478): Gtk-CRITICAL **: 17:42:33.430: gtk_box_gadget_distribute: assertion 'size >= 0' failed in GtkScrollbar
13:42:33 
13:42:33 (SWT:1478): Gtk-CRITICAL **: 17:42:33.431: gtk_box_gadget_distribute: assertion 'size >= 0' failed in GtkScrollbar
13:42:33 
13:42:33 (SWT:1478): Gtk-CRITICAL **: 17:42:33.454: gtk_box_gadget_distribute: assertion 'size >= 0' failed in GtkScrollbar
13:42:33 
13:42:33 (SWT:1478): Gtk-CRITICAL **: 17:42:33.454: gtk_box_gadget_distribute: assertion 'size >= 0' failed in GtkScrollbar
13:42:33 
13:42:33 (SWT:1478): Gtk-CRITICAL **: 17:42:33.464: gtk_box_gadget_distribute: assertion 'size >= 0' failed in GtkScrollbar
13:42:33 
13:42:33 (SWT:1478): Gtk-CRITICAL **: 17:42:33.464: gtk_box_gadget_distribute: assertion 'size >= 0' failed in GtkScrollbar
13:42:33 
13:42:33 (SWT:1478): Gtk-CRITICAL **: 17:42:33.480: gtk_box_gadget_distribute: assertion 'size >= 0' failed in GtkScrollbar
13:42:33 
13:42:33 (SWT:1478): Gtk-CRITICAL **: 17:42:33.512: gtk_box_gadget_distribute: assertion 'size >= 0' failed in GtkScrollbar
13:42:33 
13:42:33 (SWT:1478): Gtk-WARNING **: 17:42:33.591: Negative content width -6 (allocation 1, extents 4x3) while allocating gadget (node toolbar, owner GtkToolbar)
13:42:34 
13:42:34 (SWT:1478): Gtk-CRITICAL **: 17:42:34.707: gtk_box_gadget_distribute: assertion 'size >= 0' failed in GtkScrollbar
13:42:34 
13:42:34 (SWT:1478): Gtk-CRITICAL **: 17:42:34.708: gtk_box_gadget_distribute: assertion 'size >= 0' failed in GtkScrollbar
13:42:34 
13:42:34 (SWT:1478): Gtk-WARNING **: 17:42:34.746: Negative content width -6 (allocation 1, extents 4x3) while allocating gadget (node toolbar, owner GtkToolbar)
13:42:34 
13:42:34 (SWT:1478): Gtk-WARNING **: 17:42:34.760: Negative content width -6 (allocation 1, extents 4x3) while allocating gadget (node toolbar, owner GtkToolbar)
13:42:35 
13:42:35 (SWT:1478): Gtk-WARNING **: 17:42:35.510: Negative content width -6 (allocation 1, extents 4x3) while allocating gadget (node toolbar, owner GtkToolbar)
13:42:35 
13:42:35 (SWT:1478): Gtk-WARNING **: 17:42:35.949: Negative content width -9 (allocation 9, extents 9x9) while allocating gadget (node entry, owner GtkEntry)
13:42:35 
13:42:35 (SWT:1478): Gtk-CRITICAL **: 17:42:35.988: gtk_box_gadget_distribute: assertion 'size >= 0' failed in GtkScrollbar
13:42:35 
13:42:35 (SWT:1478): Gtk-CRITICAL **: 17:42:35.997: gtk_box_gadget_distribute: assertion 'size >= 0' failed in GtkScrollbar
13:42:36 
13:42:36 (SWT:1478): Gtk-WARNING **: 17:42:36.002: Negative content width -6 (allocation 1, extents 4x3) while allocating gadget (node toolbar, owner GtkToolbar)
13:42:36 
13:42:36 (SWT:1478): Gtk-CRITICAL **: 17:42:36.010: gtk_box_gadget_distribute: assertion 'size >= 0' failed in GtkScrollbar
13:42:36 
13:42:36 (SWT:1478): Gtk-CRITICAL **: 17:42:36.016: gtk_box_gadget_distribute: assertion 'size >= 0' failed in GtkScrollbar
13:42:36 
13:42:36 (SWT:1478): Gtk-CRITICAL **: 17:42:36.018: gtk_box_gadget_distribute: assertion 'size >= 0' failed in GtkScrollbar
13:42:36 
13:42:36 (SWT:1478): Gtk-CRITICAL **: 17:42:36.018: gtk_box_gadget_distribute: assertion 'size >= 0' failed in GtkScrollbar
13:42:36 
13:42:36 (SWT:1478): Gtk-CRITICAL **: 17:42:36.023: gtk_box_gadget_distribute: assertion 'size >= 0' failed in GtkScrollbar
13:42:36 
13:42:36 (SWT:1478): Gtk-CRITICAL **: 17:42:36.023: gtk_box_gadget_distribute: assertion 'size >= 0' failed in GtkScrollbar
13:42:36 
13:42:36 (SWT:1478): Gtk-CRITICAL **: 17:42:36.041: gtk_box_gadget_distribute: assertion 'size >= 0' failed in GtkScrollbar
13:42:36 
13:42:36 (SWT:1478): Gtk-CRITICAL **: 17:42:36.050: gtk_box_gadget_distribute: assertion 'size >= 0' failed in GtkScrollbar
13:42:36 
13:42:36 (SWT:1478): Gtk-CRITICAL **: 17:42:36.050: gtk_box_gadget_distribute: assertion 'size >= 0' failed in GtkScrollbar
13:42:36 
13:42:36 (SWT:1478): Gtk-CRITICAL **: 17:42:36.066: gtk_box_gadget_distribute: assertion 'size >= 0' failed in GtkScrollbar
13:42:36 
13:42:36 (SWT:1478): Gtk-CRITICAL **: 17:42:36.067: gtk_box_gadget_distribute: assertion 'size >= 0' failed in GtkScrollbar
13:42:36 
13:42:36 (SWT:1478): Gtk-CRITICAL **: 17:42:36.083: gtk_box_gadget_distribute: assertion 'size >= 0' failed in GtkScrollbar
13:42:36 
13:42:36 (SWT:1478): Gtk-CRITICAL **: 17:42:36.083: gtk_box_gadget_distribute: assertion 'size >= 0' failed in GtkScrollbar
13:42:36 
13:42:36 (SWT:1478): Gtk-CRITICAL **: 17:42:36.100: gtk_box_gadget_distribute: assertion 'size >= 0' failed in GtkScrollbar
13:42:36 
13:42:36 (SWT:1478): Gtk-CRITICAL **: 17:42:36.100: gtk_box_gadget_distribute: assertion 'size >= 0' failed in GtkScrollbar
13:42:36 
13:42:36 (SWT:1478): Gtk-CRITICAL **: 17:42:36.117: gtk_box_gadget_distribute: assertion 'size >= 0' failed in GtkScrollbar
13:42:36 
13:42:36 (SWT:1478): Gtk-CRITICAL **: 17:42:36.117: gtk_box_gadget_distribute: assertion 'size >= 0' failed in GtkScrollbar
13:42:36 
13:42:36 (SWT:1478): Gtk-CRITICAL **: 17:42:36.133: gtk_box_gadget_distribute: assertion 'size >= 0' failed in GtkScrollbar
13:42:36 
13:42:36 (SWT:1478): Gtk-CRITICAL **: 17:42:36.133: gtk_box_gadget_distribute: assertion 'size >= 0' failed in GtkScrollbar
13:42:36 
13:42:36 (SWT:1478): Gtk-CRITICAL **: 17:42:36.145: gtk_box_gadget_distribute: assertion 'size >= 0' failed in GtkScrollbar
13:42:36 
13:42:36 (SWT:1478): Gtk-CRITICAL **: 17:42:36.145: gtk_box_gadget_distribute: assertion 'size >= 0' failed in GtkScrollbar
13:42:36 
13:42:36 (SWT:1478): Gtk-CRITICAL **: 17:42:36.147: gtk_box_gadget_distribute: assertion 'size >= 0' failed in GtkScrollbar
13:42:36 
13:42:36 (SWT:1478): Gtk-CRITICAL **: 17:42:36.148: gtk_box_gadget_distribute: assertion 'size >= 0' failed in GtkScrollbar
13:42:36 
13:42:36 (SWT:1478): Gtk-CRITICAL **: 17:42:36.148: gtk_box_gadget_distribute: assertion 'size >= 0' failed in GtkScrollbar
13:42:36 
13:42:36 (SWT:1478): Gtk-CRITICAL **: 17:42:36.149: gtk_box_gadget_distribute: assertion 'size >= 0' failed in GtkScrollbar
13:42:36 
13:42:36 (SWT:1478): Gtk-CRITICAL **: 17:42:36.151: gtk_box_gadget_distribute: assertion 'size >= 0' failed in GtkScrollbar
13:42:36 
13:42:36 (SWT:1478): Gtk-CRITICAL **: 17:42:36.151: gtk_box_gadget_distribute: assertion 'size >= 0' failed in GtkScrollbar
13:42:36 
13:42:36 (SWT:1478): Gtk-CRITICAL **: 17:42:36.167: gtk_box_gadget_distribute: assertion 'size >= 0' failed in GtkScrollbar
13:42:36 
13:42:36 (SWT:1478): Gtk-CRITICAL **: 17:42:36.168: gtk_box_gadget_distribute: assertion 'size >= 0' failed in GtkScrollbar
13:42:36 
13:42:36 (SWT:1478): Gtk-CRITICAL **: 17:42:36.178: gtk_box_gadget_distribute: assertion 'size >= 0' failed in GtkScrollbar
13:42:36 
13:42:36 (SWT:1478): Gtk-CRITICAL **: 17:42:36.178: gtk_box_gadget_distribute: assertion 'size >= 0' failed in GtkScrollbar
13:42:36 
13:42:36 (SWT:1478): Gtk-CRITICAL **: 17:42:36.180: gtk_box_gadget_distribute: assertion 'size >= 0' failed in GtkScrollbar
13:42:36 
13:42:36 (SWT:1478): Gtk-CRITICAL **: 17:42:36.183: gtk_box_gadget_distribute: assertion 'size >= 0' failed in GtkScrollbar
13:42:36 
13:42:36 (SWT:1478): Gtk-CRITICAL **: 17:42:36.183: gtk_box_gadget_distribute: assertion 'size >= 0' failed in GtkScrollbar
13:42:36 
13:42:36 (SWT:1478): Gtk-CRITICAL **: 17:42:36.206: gtk_box_gadget_distribute: assertion 'size >= 0' failed in GtkScrollbar
13:42:36 
13:42:36 (SWT:1478): Gtk-CRITICAL **: 17:42:36.216: gtk_box_gadget_distribute: assertion 'size >= 0' failed in GtkScrollbar
13:42:36 
13:42:36 (SWT:1478): Gtk-WARNING **: 17:42:36.291: Negative content width -6 (allocation 1, extents 4x3) while allocating gadget (node toolbar, owner GtkToolbar)
13:42:37 
13:42:37 (SWT:1478): Gtk-CRITICAL **: 17:42:37.429: gtk_box_gadget_distribute: assertion 'size >= 0' failed in GtkScrollbar
13:42:37 
13:42:37 (SWT:1478): Gtk-CRITICAL **: 17:42:37.430: gtk_box_gadget_distribute: assertion 'size >= 0' failed in GtkScrollbar
13:42:37 
13:42:37 (SWT:1478): Gtk-WARNING **: 17:42:37.532: Negative content width -6 (allocation 1, extents 4x3) while allocating gadget (node toolbar, owner GtkToolbar)
13:42:37 
13:42:37 (SWT:1478): Gtk-WARNING **: 17:42:37.544: Negative content width -6 (allocation 1, extents 4x3) while allocating gadget (node toolbar, owner GtkToolbar)
13:42:38 
13:42:38 (SWT:1478): Gtk-WARNING **: 17:42:38.156: Negative content width -6 (allocation 1, extents 4x3) while allocating gadget (node toolbar, owner GtkToolbar)
13:42:38 
13:42:38 (SWT:1478): Gtk-WARNING **: 17:42:38.431: Negative content width -9 (allocation 9, extents 9x9) while allocating gadget (node entry, owner GtkEntry)
13:42:38 
13:42:38 (SWT:1478): Gtk-CRITICAL **: 17:42:38.474: gtk_box_gadget_distribute: assertion 'size >= 0' failed in GtkScrollbar
13:42:38 
13:42:38 (SWT:1478): Gtk-CRITICAL **: 17:42:38.484: gtk_box_gadget_distribute: assertion 'size >= 0' failed in GtkScrollbar
13:42:38 
13:42:38 (SWT:1478): Gtk-WARNING **: 17:42:38.489: Negative content width -6 (allocation 1, extents 4x3) while allocating gadget (node toolbar, owner GtkToolbar)
13:42:38 
13:42:38 (SWT:1478): Gtk-CRITICAL **: 17:42:38.498: gtk_box_gadget_distribute: assertion 'size >= 0' failed in GtkScrollbar
13:42:38 
13:42:38 (SWT:1478): Gtk-CRITICAL **: 17:42:38.504: gtk_box_gadget_distribute: assertion 'size >= 0' failed in GtkScrollbar
13:42:38 
13:42:38 (SWT:1478): Gtk-CRITICAL **: 17:42:38.510: gtk_box_gadget_distribute: assertion 'size >= 0' failed in GtkScrollbar
13:42:38 
13:42:38 (SWT:1478): Gtk-CRITICAL **: 17:42:38.512: gtk_box_gadget_distribute: assertion 'size >= 0' failed in GtkScrollbar
13:42:38 
13:42:38 (SWT:1478): Gtk-CRITICAL **: 17:42:38.512: gtk_box_gadget_distribute: assertion 'size >= 0' failed in GtkScrollbar
13:42:38 
13:42:38 (SWT:1478): Gtk-CRITICAL **: 17:42:38.517: gtk_box_gadget_distribute: assertion 'size >= 0' failed in GtkScrollbar
13:42:38 
13:42:38 (SWT:1478): Gtk-CRITICAL **: 17:42:38.517: gtk_box_gadget_distribute: assertion 'size >= 0' failed in GtkScrollbar
13:42:38 
13:42:38 (SWT:1478): Gtk-CRITICAL **: 17:42:38.533: gtk_box_gadget_distribute: assertion 'size >= 0' failed in GtkScrollbar
13:42:38 
13:42:38 (SWT:1478): Gtk-CRITICAL **: 17:42:38.533: gtk_box_gadget_distribute: assertion 'size >= 0' failed in GtkScrollbar
13:42:38 
13:42:38 (SWT:1478): Gtk-CRITICAL **: 17:42:38.543: gtk_box_gadget_distribute: assertion 'size >= 0' failed in GtkScrollbar
13:42:38 
13:42:38 (SWT:1478): Gtk-CRITICAL **: 17:42:38.548: gtk_box_gadget_distribute: assertion 'size >= 0' failed in GtkScrollbar
13:42:38 
13:42:38 (SWT:1478): Gtk-CRITICAL **: 17:42:38.549: gtk_box_gadget_distribute: assertion 'size >= 0' failed in GtkScrollbar
13:42:38 
13:42:38 (SWT:1478): Gtk-CRITICAL **: 17:42:38.565: gtk_box_gadget_distribute: assertion 'size >= 0' failed in GtkScrollbar
13:42:38 
13:42:38 (SWT:1478): Gtk-CRITICAL **: 17:42:38.565: gtk_box_gadget_distribute: assertion 'size >= 0' failed in GtkScrollbar
13:42:38 
13:42:38 (SWT:1478): Gtk-CRITICAL **: 17:42:38.582: gtk_box_gadget_distribute: assertion 'size >= 0' failed in GtkScrollbar
13:42:38 
13:42:38 (SWT:1478): Gtk-CRITICAL **: 17:42:38.582: gtk_box_gadget_distribute: assertion 'size >= 0' failed in GtkScrollbar
13:42:38 
13:42:38 (SWT:1478): Gtk-CRITICAL **: 17:42:38.599: gtk_box_gadget_distribute: assertion 'size >= 0' failed in GtkScrollbar
13:42:38 
13:42:38 (SWT:1478): Gtk-CRITICAL **: 17:42:38.599: gtk_box_gadget_distribute: assertion 'size >= 0' failed in GtkScrollbar
13:42:38 
13:42:38 (SWT:1478): Gtk-CRITICAL **: 17:42:38.615: gtk_box_gadget_distribute: assertion 'size >= 0' failed in GtkScrollbar
13:42:38 
13:42:38 (SWT:1478): Gtk-CRITICAL **: 17:42:38.615: gtk_box_gadget_distribute: assertion 'size >= 0' failed in GtkScrollbar
13:42:38 
13:42:38 (SWT:1478): Gtk-CRITICAL **: 17:42:38.631: gtk_box_gadget_distribute: assertion 'size >= 0' failed in GtkScrollbar
13:42:38 
13:42:38 (SWT:1478): Gtk-CRITICAL **: 17:42:38.631: gtk_box_gadget_distribute: assertion 'size >= 0' failed in GtkScrollbar
13:42:38 
13:42:38 (SWT:1478): Gtk-CRITICAL **: 17:42:38.647: gtk_box_gadget_distribute: assertion 'size >= 0' failed in GtkScrollbar
13:42:38 
13:42:38 (SWT:1478): Gtk-CRITICAL **: 17:42:38.648: gtk_box_gadget_distribute: assertion 'size >= 0' failed in GtkScrollbar
13:42:38 
13:42:38 (SWT:1478): Gtk-CRITICAL **: 17:42:38.649: gtk_box_gadget_distribute: assertion 'size >= 0' failed in GtkScrollbar
13:42:38 
13:42:38 (SWT:1478): Gtk-CRITICAL **: 17:42:38.649: gtk_box_gadget_distribute: assertion 'size >= 0' failed in GtkScrollbar
13:42:38 
13:42:38 (SWT:1478): Gtk-CRITICAL **: 17:42:38.655: gtk_box_gadget_distribute: assertion 'size >= 0' failed in GtkScrollbar
13:42:38 
13:42:38 (SWT:1478): Gtk-CRITICAL **: 17:42:38.657: gtk_box_gadget_distribute: assertion 'size >= 0' failed in GtkScrollbar
13:42:38 
13:42:38 (SWT:1478): Gtk-CRITICAL **: 17:42:38.657: gtk_box_gadget_distribute: assertion 'size >= 0' failed in GtkScrollbar
13:42:38 
13:42:38 (SWT:1478): Gtk-CRITICAL **: 17:42:38.658: gtk_box_gadget_distribute: assertion 'size >= 0' failed in GtkScrollbar
13:42:38 
13:42:38 (SWT:1478): Gtk-CRITICAL **: 17:42:38.661: gtk_box_gadget_distribute: assertion 'size >= 0' failed in GtkScrollbar
13:42:38 
13:42:38 (SWT:1478): Gtk-CRITICAL **: 17:42:38.662: gtk_box_gadget_distribute: assertion 'size >= 0' failed in GtkScrollbar
13:42:38 
13:42:38 (SWT:1478): Gtk-CRITICAL **: 17:42:38.662: gtk_box_gadget_distribute: assertion 'size >= 0' failed in GtkScrollbar
13:42:38 
13:42:38 (SWT:1478): Gtk-CRITICAL **: 17:42:38.670: gtk_box_gadget_distribute: assertion 'size >= 0' failed in GtkScrollbar
13:42:38 
13:42:38 (SWT:1478): Gtk-CRITICAL **: 17:42:38.670: gtk_box_gadget_distribute: assertion 'size >= 0' failed in GtkScrollbar
13:42:38 
13:42:38 (SWT:1478): Gtk-CRITICAL **: 17:42:38.681: gtk_box_gadget_distribute: assertion 'size >= 0' failed in GtkScrollbar
13:42:38 
13:42:38 (SWT:1478): Gtk-CRITICAL **: 17:42:38.682: gtk_box_gadget_distribute: assertion 'size >= 0' failed in GtkScrollbar
13:42:38 
13:42:38 (SWT:1478): Gtk-WARNING **: 17:42:38.714: Negative content width -6 (allocation 1, extents 4x3) while allocating gadget (node toolbar, owner GtkToolbar)
13:42:39 
13:42:39 (SWT:1478): Gtk-WARNING **: 17:42:39.991: Negative content width -6 (allocation 1, extents 4x3) while allocating gadget (node toolbar, owner GtkToolbar)
13:42:40 
13:42:40 (SWT:1478): Gtk-WARNING **: 17:42:40.003: Negative content width -6 (allocation 1, extents 4x3) while allocating gadget (node toolbar, owner GtkToolbar)
13:42:40 Tests run: 9, Failures: 0, Errors: 0, Skipped: 0, Time elapsed: 23.491 s - in org.eclipse.egit.ui.test.stagview.StagingViewTest
13:42:40 testAmend(org.eclipse.egit.ui.test.stagview.StagingViewTest)  Time elapsed: 2.589 s
13:42:40 testCommitSingleFile(org.eclipse.egit.ui.test.stagview.StagingViewTest)  Time elapsed: 2.596 s
13:42:40 testMergeConflict(org.eclipse.egit.ui.test.stagview.StagingViewTest)  Time elapsed: 3.294 s
13:42:40 testCommitMessageConfigChangeAmending(org.eclipse.egit.ui.test.stagview.StagingViewTest)  Time elapsed: 2.158 s
13:42:40 testCommitMessageConfigChangeWithAuthor(org.eclipse.egit.ui.test.stagview.StagingViewTest)  Time elapsed: 2.475 s
13:42:40 testCommitMessageConfigChange(org.eclipse.egit.ui.test.stagview.StagingViewTest)  Time elapsed: 2.547 s
13:42:40 testCommitMessageConfigChangeBranchSwitchToNew(org.eclipse.egit.ui.test.stagview.StagingViewTest)  Time elapsed: 2.562 s
13:42:40 testCommitMessageCommitterChangeSignOff(org.eclipse.egit.ui.test.stagview.StagingViewTest)  Time elapsed: 2.782 s
13:42:40 testCommitMessageConfigChangeNoSignOff(org.eclipse.egit.ui.test.stagview.StagingViewTest)  Time elapsed: 2.458 s
13:42:40 Running org.eclipse.egit.ui.test.stagview.CommitMessageProvidersTest
13:42:40 
13:42:40 (SWT:1478): Gtk-WARNING **: 17:42:40.642: Negative content width -6 (allocation 1, extents 4x3) while allocating gadget (node toolbar, owner GtkToolbar)
13:42:41 
13:42:41 (SWT:1478): Gtk-WARNING **: 17:42:41.195: Negative content width -9 (allocation 9, extents 9x9) while allocating gadget (node entry, owner GtkEntry)
13:42:41 
13:42:41 (SWT:1478): Gtk-CRITICAL **: 17:42:41.234: gtk_box_gadget_distribute: assertion 'size >= 0' failed in GtkScrollbar
13:42:41 
13:42:41 (SWT:1478): Gtk-CRITICAL **: 17:42:41.244: gtk_box_gadget_distribute: assertion 'size >= 0' failed in GtkScrollbar
13:42:41 
13:42:41 (SWT:1478): Gtk-WARNING **: 17:42:41.249: Negative content width -6 (allocation 1, extents 4x3) while allocating gadget (node toolbar, owner GtkToolbar)
13:42:41 
13:42:41 (SWT:1478): Gtk-CRITICAL **: 17:42:41.258: gtk_box_gadget_distribute: assertion 'size >= 0' failed in GtkScrollbar
13:42:41 
13:42:41 (SWT:1478): Gtk-CRITICAL **: 17:42:41.266: gtk_box_gadget_distribute: assertion 'size >= 0' failed in GtkScrollbar
13:42:41 
13:42:41 (SWT:1478): Gtk-CRITICAL **: 17:42:41.268: gtk_box_gadget_distribute: assertion 'size >= 0' failed in GtkScrollbar
13:42:41 
13:42:41 (SWT:1478): Gtk-CRITICAL **: 17:42:41.269: gtk_box_gadget_distribute: assertion 'size >= 0' failed in GtkScrollbar
13:42:41 
13:42:41 (SWT:1478): Gtk-CRITICAL **: 17:42:41.270: gtk_box_gadget_distribute: assertion 'size >= 0' failed in GtkScrollbar
13:42:41 
13:42:41 (SWT:1478): Gtk-CRITICAL **: 17:42:41.270: gtk_box_gadget_distribute: assertion 'size >= 0' failed in GtkScrollbar
13:42:41 
13:42:41 (SWT:1478): Gtk-CRITICAL **: 17:42:41.276: gtk_box_gadget_distribute: assertion 'size >= 0' failed in GtkScrollbar
13:42:41 
13:42:41 (SWT:1478): Gtk-CRITICAL **: 17:42:41.276: gtk_box_gadget_distribute: assertion 'size >= 0' failed in GtkScrollbar
13:42:41 
13:42:41 (SWT:1478): Gtk-CRITICAL **: 17:42:41.289: gtk_box_gadget_distribute: assertion 'size >= 0' failed in GtkScrollbar
13:42:41 
13:42:41 (SWT:1478): Gtk-CRITICAL **: 17:42:41.301: gtk_box_gadget_distribute: assertion 'size >= 0' failed in GtkScrollbar
13:42:41 
13:42:41 (SWT:1478): Gtk-CRITICAL **: 17:42:41.301: gtk_box_gadget_distribute: assertion 'size >= 0' failed in GtkScrollbar
13:42:41 
13:42:41 (SWT:1478): Gtk-CRITICAL **: 17:42:41.317: gtk_box_gadget_distribute: assertion 'size >= 0' failed in GtkScrollbar
13:42:41 
13:42:41 (SWT:1478): Gtk-CRITICAL **: 17:42:41.317: gtk_box_gadget_distribute: assertion 'size >= 0' failed in GtkScrollbar
13:42:41 
13:42:41 (SWT:1478): Gtk-CRITICAL **: 17:42:41.333: gtk_box_gadget_distribute: assertion 'size >= 0' failed in GtkScrollbar
13:42:41 
13:42:41 (SWT:1478): Gtk-CRITICAL **: 17:42:41.334: gtk_box_gadget_distribute: assertion 'size >= 0' failed in GtkScrollbar
13:42:41 
13:42:41 (SWT:1478): Gtk-CRITICAL **: 17:42:41.351: gtk_box_gadget_distribute: assertion 'size >= 0' failed in GtkScrollbar
13:42:41 
13:42:41 (SWT:1478): Gtk-CRITICAL **: 17:42:41.351: gtk_box_gadget_distribute: assertion 'size >= 0' failed in GtkScrollbar
13:42:41 
13:42:41 (SWT:1478): Gtk-CRITICAL **: 17:42:41.367: gtk_box_gadget_distribute: assertion 'size >= 0' failed in GtkScrollbar
13:42:41 
13:42:41 (SWT:1478): Gtk-CRITICAL **: 17:42:41.367: gtk_box_gadget_distribute: assertion 'size >= 0' failed in GtkScrollbar
13:42:41 
13:42:41 (SWT:1478): Gtk-CRITICAL **: 17:42:41.384: gtk_box_gadget_distribute: assertion 'size >= 0' failed in GtkScrollbar
13:42:41 
13:42:41 (SWT:1478): Gtk-CRITICAL **: 17:42:41.384: gtk_box_gadget_distribute: assertion 'size >= 0' failed in GtkScrollbar
13:42:41 
13:42:41 (SWT:1478): Gtk-CRITICAL **: 17:42:41.418: gtk_box_gadget_distribute: assertion 'size >= 0' failed in GtkScrollbar
13:42:41 
13:42:41 (SWT:1478): Gtk-CRITICAL **: 17:42:41.418: gtk_box_gadget_distribute: assertion 'size >= 0' failed in GtkScrollbar
13:42:41 
13:42:41 (SWT:1478): Gtk-CRITICAL **: 17:42:41.426: gtk_box_gadget_distribute: assertion 'size >= 0' failed in GtkScrollbar
13:42:41 
13:42:41 (SWT:1478): Gtk-CRITICAL **: 17:42:41.426: gtk_box_gadget_distribute: assertion 'size >= 0' failed in GtkScrollbar
13:42:41 
13:42:41 (SWT:1478): Gtk-CRITICAL **: 17:42:41.434: gtk_box_gadget_distribute: assertion 'size >= 0' failed in GtkScrollbar
13:42:41 
13:42:41 (SWT:1478): Gtk-CRITICAL **: 17:42:41.434: gtk_box_gadget_distribute: assertion 'size >= 0' failed in GtkScrollbar
13:42:41 
13:42:41 (SWT:1478): Gtk-CRITICAL **: 17:42:41.450: gtk_box_gadget_distribute: assertion 'size >= 0' failed in GtkScrollbar
13:42:41 
13:42:41 (SWT:1478): Gtk-CRITICAL **: 17:42:41.450: gtk_box_gadget_distribute: assertion 'size >= 0' failed in GtkScrollbar
13:42:41 
13:42:41 (SWT:1478): Gtk-CRITICAL **: 17:42:41.471: gtk_box_gadget_distribute: assertion 'size >= 0' failed in GtkScrollbar
13:42:41 
13:42:41 (SWT:1478): Gtk-CRITICAL **: 17:42:41.488: gtk_box_gadget_distribute: assertion 'size >= 0' failed in GtkScrollbar
13:42:41 
13:42:41 (SWT:1478): Gtk-CRITICAL **: 17:42:41.488: gtk_box_gadget_distribute: assertion 'size >= 0' failed in GtkScrollbar
13:42:41 
13:42:41 (SWT:1478): Gtk-CRITICAL **: 17:42:41.499: gtk_box_gadget_distribute: assertion 'size >= 0' failed in GtkScrollbar
13:42:41 
13:42:41 (SWT:1478): Gtk-WARNING **: 17:42:41.545: Negative content width -6 (allocation 1, extents 4x3) while allocating gadget (node toolbar, owner GtkToolbar)
13:42:42 
13:42:42 (SWT:1478): Gtk-WARNING **: 17:42:42.751: Negative content width -6 (allocation 1, extents 4x3) while allocating gadget (node toolbar, owner GtkToolbar)
13:42:42 
13:42:42 (SWT:1478): Gtk-WARNING **: 17:42:42.764: Negative content width -6 (allocation 1, extents 4x3) while allocating gadget (node toolbar, owner GtkToolbar)
13:42:43 
13:42:43 (SWT:1478): Gtk-WARNING **: 17:42:43.357: Negative content width -6 (allocation 1, extents 4x3) while allocating gadget (node toolbar, owner GtkToolbar)
13:42:43 
13:42:43 (SWT:1478): Gtk-WARNING **: 17:42:43.777: Negative content width -9 (allocation 9, extents 9x9) while allocating gadget (node entry, owner GtkEntry)
13:42:43 
13:42:43 (SWT:1478): Gtk-CRITICAL **: 17:42:43.816: gtk_box_gadget_distribute: assertion 'size >= 0' failed in GtkScrollbar
13:42:43 
13:42:43 (SWT:1478): Gtk-CRITICAL **: 17:42:43.826: gtk_box_gadget_distribute: assertion 'size >= 0' failed in GtkScrollbar
13:42:43 
13:42:43 (SWT:1478): Gtk-WARNING **: 17:42:43.831: Negative content width -6 (allocation 1, extents 4x3) while allocating gadget (node toolbar, owner GtkToolbar)
13:42:43 
13:42:43 (SWT:1478): Gtk-CRITICAL **: 17:42:43.840: gtk_box_gadget_distribute: assertion 'size >= 0' failed in GtkScrollbar
13:42:43 
13:42:43 (SWT:1478): Gtk-CRITICAL **: 17:42:43.846: gtk_box_gadget_distribute: assertion 'size >= 0' failed in GtkScrollbar
13:42:43 
13:42:43 !ENTRY org.eclipse.egit.ui 2 0 2019-03-24 17:42:43.858
13:42:43 !MESSAGE Found multiple implementations of ICommitMessageProvider2. Ignoring caret positioning for org.eclipse.egit.ui.test.stagview.CommitMessageProvidersTest$TestCommitMessageProvider.
13:42:43 
13:42:43 (SWT:1478): Gtk-CRITICAL **: 17:42:43.859: gtk_box_gadget_distribute: assertion 'size >= 0' failed in GtkScrollbar
13:42:43 
13:42:43 (SWT:1478): Gtk-CRITICAL **: 17:42:43.859: gtk_box_gadget_distribute: assertion 'size >= 0' failed in GtkScrollbar
13:42:43 
13:42:43 (SWT:1478): Gtk-CRITICAL **: 17:42:43.861: gtk_box_gadget_distribute: assertion 'size >= 0' failed in GtkScrollbar
13:42:43 
13:42:43 (SWT:1478): Gtk-CRITICAL **: 17:42:43.861: gtk_box_gadget_distribute: assertion 'size >= 0' failed in GtkScrollbar
13:42:43 
13:42:43 (SWT:1478): Gtk-CRITICAL **: 17:42:43.867: gtk_box_gadget_distribute: assertion 'size >= 0' failed in GtkScrollbar
13:42:43 
13:42:43 (SWT:1478): Gtk-CRITICAL **: 17:42:43.868: gtk_box_gadget_distribute: assertion 'size >= 0' failed in GtkScrollbar
13:42:43 
13:42:43 (SWT:1478): Gtk-CRITICAL **: 17:42:43.887: gtk_box_gadget_distribute: assertion 'size >= 0' failed in GtkScrollbar
13:42:43 
13:42:43 (SWT:1478): Gtk-CRITICAL **: 17:42:43.895: gtk_box_gadget_distribute: assertion 'size >= 0' failed in GtkScrollbar
13:42:43 
13:42:43 (SWT:1478): Gtk-CRITICAL **: 17:42:43.895: gtk_box_gadget_distribute: assertion 'size >= 0' failed in GtkScrollbar
13:42:43 
13:42:43 (SWT:1478): Gtk-CRITICAL **: 17:42:43.911: gtk_box_gadget_distribute: assertion 'size >= 0' failed in GtkScrollbar
13:42:43 
13:42:43 (SWT:1478): Gtk-CRITICAL **: 17:42:43.911: gtk_box_gadget_distribute: assertion 'size >= 0' failed in GtkScrollbar
13:42:43 
13:42:43 (SWT:1478): Gtk-CRITICAL **: 17:42:43.928: gtk_box_gadget_distribute: assertion 'size >= 0' failed in GtkScrollbar
13:42:43 
13:42:43 (SWT:1478): Gtk-CRITICAL **: 17:42:43.928: gtk_box_gadget_distribute: assertion 'size >= 0' failed in GtkScrollbar
13:42:43 
13:42:43 (SWT:1478): Gtk-CRITICAL **: 17:42:43.945: gtk_box_gadget_distribute: assertion 'size >= 0' failed in GtkScrollbar
13:42:43 
13:42:43 (SWT:1478): Gtk-CRITICAL **: 17:42:43.945: gtk_box_gadget_distribute: assertion 'size >= 0' failed in GtkScrollbar
13:42:43 
13:42:43 (SWT:1478): Gtk-CRITICAL **: 17:42:43.961: gtk_box_gadget_distribute: assertion 'size >= 0' failed in GtkScrollbar
13:42:43 
13:42:43 (SWT:1478): Gtk-CRITICAL **: 17:42:43.961: gtk_box_gadget_distribute: assertion 'size >= 0' failed in GtkScrollbar
13:42:43 
13:42:43 (SWT:1478): Gtk-CRITICAL **: 17:42:43.978: gtk_box_gadget_distribute: assertion 'size >= 0' failed in GtkScrollbar
13:42:43 
13:42:43 (SWT:1478): Gtk-CRITICAL **: 17:42:43.978: gtk_box_gadget_distribute: assertion 'size >= 0' failed in GtkScrollbar
13:42:44 
13:42:44 (SWT:1478): Gtk-CRITICAL **: 17:42:44.002: gtk_box_gadget_distribute: assertion 'size >= 0' failed in GtkScrollbar
13:42:44 
13:42:44 (SWT:1478): Gtk-CRITICAL **: 17:42:44.002: gtk_box_gadget_distribute: assertion 'size >= 0' failed in GtkScrollbar
13:42:44 
13:42:44 (SWT:1478): Gtk-CRITICAL **: 17:42:44.011: gtk_box_gadget_distribute: assertion 'size >= 0' failed in GtkScrollbar
13:42:44 
13:42:44 (SWT:1478): Gtk-CRITICAL **: 17:42:44.011: gtk_box_gadget_distribute: assertion 'size >= 0' failed in GtkScrollbar
13:42:44 
13:42:44 (SWT:1478): Gtk-CRITICAL **: 17:42:44.029: gtk_box_gadget_distribute: assertion 'size >= 0' failed in GtkScrollbar
13:42:44 
13:42:44 (SWT:1478): Gtk-CRITICAL **: 17:42:44.029: gtk_box_gadget_distribute: assertion 'size >= 0' failed in GtkScrollbar
13:42:44 
13:42:44 (SWT:1478): Gtk-CRITICAL **: 17:42:44.052: gtk_box_gadget_distribute: assertion 'size >= 0' failed in GtkScrollbar
13:42:44 
13:42:44 (SWT:1478): Gtk-CRITICAL **: 17:42:44.052: gtk_box_gadget_distribute: assertion 'size >= 0' failed in GtkScrollbar
13:42:44 
13:42:44 (SWT:1478): Gtk-CRITICAL **: 17:42:44.069: gtk_box_gadget_distribute: assertion 'size >= 0' failed in GtkScrollbar
13:42:44 
13:42:44 (SWT:1478): Gtk-CRITICAL **: 17:42:44.070: gtk_box_gadget_distribute: assertion 'size >= 0' failed in GtkScrollbar
13:42:44 
13:42:44 (SWT:1478): Gtk-CRITICAL **: 17:42:44.081: gtk_box_gadget_distribute: assertion 'size >= 0' failed in GtkScrollbar
13:42:44 
13:42:44 (SWT:1478): Gtk-WARNING **: 17:42:44.159: Negative content width -6 (allocation 1, extents 4x3) while allocating gadget (node toolbar, owner GtkToolbar)
13:42:45 
13:42:45 (SWT:1478): Gtk-WARNING **: 17:42:45.407: Negative content width -6 (allocation 1, extents 4x3) while allocating gadget (node toolbar, owner GtkToolbar)
13:42:45 
13:42:45 (SWT:1478): Gtk-WARNING **: 17:42:45.420: Negative content width -6 (allocation 1, extents 4x3) while allocating gadget (node toolbar, owner GtkToolbar)
13:42:46 
13:42:46 (SWT:1478): Gtk-WARNING **: 17:42:46.017: Negative content width -6 (allocation 1, extents 4x3) while allocating gadget (node toolbar, owner GtkToolbar)
13:42:46 
13:42:46 (SWT:1478): Gtk-WARNING **: 17:42:46.429: Negative content width -9 (allocation 9, extents 9x9) while allocating gadget (node entry, owner GtkEntry)
13:42:46 
13:42:46 (SWT:1478): Gtk-CRITICAL **: 17:42:46.474: gtk_box_gadget_distribute: assertion 'size >= 0' failed in GtkScrollbar
13:42:46 
13:42:46 (SWT:1478): Gtk-CRITICAL **: 17:42:46.485: gtk_box_gadget_distribute: assertion 'size >= 0' failed in GtkScrollbar
13:42:46 
13:42:46 (SWT:1478): Gtk-WARNING **: 17:42:46.489: Negative content width -6 (allocation 1, extents 4x3) while allocating gadget (node toolbar, owner GtkToolbar)
13:42:46 
13:42:46 (SWT:1478): Gtk-CRITICAL **: 17:42:46.498: gtk_box_gadget_distribute: assertion 'size >= 0' failed in GtkScrollbar
13:42:46 
13:42:46 (SWT:1478): Gtk-CRITICAL **: 17:42:46.503: gtk_box_gadget_distribute: assertion 'size >= 0' failed in GtkScrollbar
13:42:46 
13:42:46 (SWT:1478): Gtk-CRITICAL **: 17:42:46.505: gtk_box_gadget_distribute: assertion 'size >= 0' failed in GtkScrollbar
13:42:46 
13:42:46 (SWT:1478): Gtk-CRITICAL **: 17:42:46.505: gtk_box_gadget_distribute: assertion 'size >= 0' failed in GtkScrollbar
13:42:46 
13:42:46 (SWT:1478): Gtk-CRITICAL **: 17:42:46.506: gtk_box_gadget_distribute: assertion 'size >= 0' failed in GtkScrollbar
13:42:46 
13:42:46 (SWT:1478): Gtk-CRITICAL **: 17:42:46.506: gtk_box_gadget_distribute: assertion 'size >= 0' failed in GtkScrollbar
13:42:46 
13:42:46 (SWT:1478): Gtk-CRITICAL **: 17:42:46.511: gtk_box_gadget_distribute: assertion 'size >= 0' failed in GtkScrollbar
13:42:46 
13:42:46 (SWT:1478): Gtk-CRITICAL **: 17:42:46.512: gtk_box_gadget_distribute: assertion 'size >= 0' failed in GtkScrollbar
13:42:46 
13:42:46 (SWT:1478): Gtk-CRITICAL **: 17:42:46.528: gtk_box_gadget_distribute: assertion 'size >= 0' failed in GtkScrollbar
13:42:46 
13:42:46 (SWT:1478): Gtk-CRITICAL **: 17:42:46.534: gtk_box_gadget_distribute: assertion 'size >= 0' failed in GtkScrollbar
13:42:46 
13:42:46 (SWT:1478): Gtk-CRITICAL **: 17:42:46.534: gtk_box_gadget_distribute: assertion 'size >= 0' failed in GtkScrollbar
13:42:46 
13:42:46 (SWT:1478): Gtk-CRITICAL **: 17:42:46.551: gtk_box_gadget_distribute: assertion 'size >= 0' failed in GtkScrollbar
13:42:46 
13:42:46 (SWT:1478): Gtk-CRITICAL **: 17:42:46.551: gtk_box_gadget_distribute: assertion 'size >= 0' failed in GtkScrollbar
13:42:46 
13:42:46 (SWT:1478): Gtk-CRITICAL **: 17:42:46.568: gtk_box_gadget_distribute: assertion 'size >= 0' failed in GtkScrollbar
13:42:46 
13:42:46 (SWT:1478): Gtk-CRITICAL **: 17:42:46.568: gtk_box_gadget_distribute: assertion 'size >= 0' failed in GtkScrollbar
13:42:46 
13:42:46 (SWT:1478): Gtk-CRITICAL **: 17:42:46.584: gtk_box_gadget_distribute: assertion 'size >= 0' failed in GtkScrollbar
13:42:46 
13:42:46 (SWT:1478): Gtk-CRITICAL **: 17:42:46.584: gtk_box_gadget_distribute: assertion 'size >= 0' failed in GtkScrollbar
13:42:46 
13:42:46 (SWT:1478): Gtk-CRITICAL **: 17:42:46.601: gtk_box_gadget_distribute: assertion 'size >= 0' failed in GtkScrollbar
13:42:46 
13:42:46 (SWT:1478): Gtk-CRITICAL **: 17:42:46.602: gtk_box_gadget_distribute: assertion 'size >= 0' failed in GtkScrollbar
13:42:46 
13:42:46 (SWT:1478): Gtk-CRITICAL **: 17:42:46.618: gtk_box_gadget_distribute: assertion 'size >= 0' failed in GtkScrollbar
13:42:46 
13:42:46 (SWT:1478): Gtk-CRITICAL **: 17:42:46.618: gtk_box_gadget_distribute: assertion 'size >= 0' failed in GtkScrollbar
13:42:46 
13:42:46 (SWT:1478): Gtk-CRITICAL **: 17:42:46.645: gtk_box_gadget_distribute: assertion 'size >= 0' failed in GtkScrollbar
13:42:46 
13:42:46 (SWT:1478): Gtk-CRITICAL **: 17:42:46.645: gtk_box_gadget_distribute: assertion 'size >= 0' failed in GtkScrollbar
13:42:46 
13:42:46 (SWT:1478): Gtk-CRITICAL **: 17:42:46.653: gtk_box_gadget_distribute: assertion 'size >= 0' failed in GtkScrollbar
13:42:46 
13:42:46 (SWT:1478): Gtk-CRITICAL **: 17:42:46.653: gtk_box_gadget_distribute: assertion 'size >= 0' failed in GtkScrollbar
13:42:46 
13:42:46 (SWT:1478): Gtk-CRITICAL **: 17:42:46.669: gtk_box_gadget_distribute: assertion 'size >= 0' failed in GtkScrollbar
13:42:46 
13:42:46 (SWT:1478): Gtk-CRITICAL **: 17:42:46.669: gtk_box_gadget_distribute: assertion 'size >= 0' failed in GtkScrollbar
13:42:46 
13:42:46 (SWT:1478): Gtk-CRITICAL **: 17:42:46.685: gtk_box_gadget_distribute: assertion 'size >= 0' failed in GtkScrollbar
13:42:46 
13:42:46 (SWT:1478): Gtk-CRITICAL **: 17:42:46.685: gtk_box_gadget_distribute: assertion 'size >= 0' failed in GtkScrollbar
13:42:46 
13:42:46 (SWT:1478): Gtk-CRITICAL **: 17:42:46.701: gtk_box_gadget_distribute: assertion 'size >= 0' failed in GtkScrollbar
13:42:46 
13:42:46 (SWT:1478): Gtk-CRITICAL **: 17:42:46.701: gtk_box_gadget_distribute: assertion 'size >= 0' failed in GtkScrollbar
13:42:46 
13:42:46 (SWT:1478): Gtk-CRITICAL **: 17:42:46.721: gtk_box_gadget_distribute: assertion 'size >= 0' failed in GtkScrollbar
13:42:46 
13:42:46 (SWT:1478): Gtk-CRITICAL **: 17:42:46.721: gtk_box_gadget_distribute: assertion 'size >= 0' failed in GtkScrollbar
13:42:46 
13:42:46 (SWT:1478): Gtk-CRITICAL **: 17:42:46.725: gtk_box_gadget_distribute: assertion 'size >= 0' failed in GtkScrollbar
13:42:46 
13:42:46 (SWT:1478): Gtk-CRITICAL **: 17:42:46.726: gtk_box_gadget_distribute: assertion 'size >= 0' failed in GtkScrollbar
13:42:46 
13:42:46 (SWT:1478): Gtk-CRITICAL **: 17:42:46.726: gtk_box_gadget_distribute: assertion 'size >= 0' failed in GtkScrollbar
13:42:46 
13:42:46 (SWT:1478): Gtk-WARNING **: 17:42:46.801: Negative content width -6 (allocation 1, extents 4x3) while allocating gadget (node toolbar, owner GtkToolbar)
13:42:47 
13:42:47 (SWT:1478): Gtk-CRITICAL **: 17:42:47.912: gtk_box_gadget_distribute: assertion 'size >= 0' failed in GtkScrollbar
13:42:47 
13:42:47 (SWT:1478): Gtk-CRITICAL **: 17:42:47.912: gtk_box_gadget_distribute: assertion 'size >= 0' failed in GtkScrollbar
13:42:47 
13:42:47 (SWT:1478): Gtk-WARNING **: 17:42:47.948: Negative content width -6 (allocation 1, extents 4x3) while allocating gadget (node toolbar, owner GtkToolbar)
13:42:47 
13:42:47 (SWT:1478): Gtk-WARNING **: 17:42:47.960: Negative content width -6 (allocation 1, extents 4x3) while allocating gadget (node toolbar, owner GtkToolbar)
13:42:48 Tests run: 3, Failures: 0, Errors: 0, Skipped: 0, Time elapsed: 7.936 s - in org.eclipse.egit.ui.test.stagview.CommitMessageProvidersTest
13:42:48 testCaretPosition(org.eclipse.egit.ui.test.stagview.CommitMessageProvidersTest)  Time elapsed: 2.732 s
13:42:48 testTwoProvidersFromSameExtension(org.eclipse.egit.ui.test.stagview.CommitMessageProvidersTest)  Time elapsed: 2.656 s
13:42:48 testCaretPositionUndefined(org.eclipse.egit.ui.test.stagview.CommitMessageProvidersTest)  Time elapsed: 2.539 s
13:42:48 Running org.eclipse.egit.ui.test.history.HistoryViewTest
13:42:48 
13:42:48 (SWT:1478): Gtk-WARNING **: 17:42:48.764: Negative content width -6 (allocation 1, extents 4x3) while allocating gadget (node toolbar, owner GtkToolbar)
13:42:48 
13:42:48 (SWT:1478): Gtk-WARNING **: 17:42:48.765: Negative content width -6 (allocation 1, extents 4x3) while allocating gadget (node toolbar, owner GtkToolbar)
13:42:48 
13:42:48 (SWT:1478): Gtk-WARNING **: 17:42:48.779: Negative content width -6 (allocation 1, extents 4x3) while allocating gadget (node toolbar, owner GtkToolbar)
13:42:48 
13:42:48 (SWT:1478): Gtk-CRITICAL **: 17:42:48.800: gtk_box_gadget_distribute: assertion 'size >= 0' failed in GtkScrollbar
13:42:48 
13:42:48 (SWT:1478): Gtk-CRITICAL **: 17:42:48.826: gtk_box_gadget_distribute: assertion 'size >= 0' failed in GtkScrollbar
13:42:48 
13:42:48 (SWT:1478): Gtk-CRITICAL **: 17:42:48.843: gtk_box_gadget_distribute: assertion 'size >= 0' failed in GtkScrollbar
13:42:48 
13:42:48 (SWT:1478): Gtk-CRITICAL **: 17:42:48.860: gtk_box_gadget_distribute: assertion 'size >= 0' failed in GtkScrollbar
13:42:48 
13:42:48 (SWT:1478): Gtk-CRITICAL **: 17:42:48.876: gtk_box_gadget_distribute: assertion 'size >= 0' failed in GtkScrollbar
13:42:48 
13:42:48 (SWT:1478): Gtk-CRITICAL **: 17:42:48.895: gtk_box_gadget_distribute: assertion 'size >= 0' failed in GtkScrollbar
13:42:48 
13:42:48 (SWT:1478): Gtk-WARNING **: 17:42:48.927: Negative content width -6 (allocation 1, extents 4x3) while allocating gadget (node toolbar, owner GtkToolbar)
13:42:48 
13:42:48 (SWT:1478): Gtk-CRITICAL **: 17:42:48.994: gtk_box_gadget_distribute: assertion 'size >= 0' failed in GtkScrollbar
13:42:49 
13:42:49 (SWT:1478): Gtk-CRITICAL **: 17:42:49.012: gtk_box_gadget_distribute: assertion 'size >= 0' failed in GtkScrollbar
13:42:49 
13:42:49 (SWT:1478): Gtk-CRITICAL **: 17:42:49.017: gtk_box_gadget_distribute: assertion 'size >= 0' failed in GtkScrollbar
13:42:49 
13:42:49 (SWT:1478): Gtk-WARNING **: 17:42:49.020: Negative content width -6 (allocation 1, extents 4x3) while allocating gadget (node toolbar, owner GtkToolbar)
13:42:49 
13:42:49 (SWT:1478): Gtk-CRITICAL **: 17:42:49.039: gtk_box_gadget_distribute: assertion 'size >= 0' failed in GtkScrollbar
13:42:49 
13:42:49 (SWT:1478): Gtk-WARNING **: 17:42:49.060: Negative content width -6 (allocation 1, extents 4x3) while allocating gadget (node toolbar, owner GtkToolbar)
13:42:49 
13:42:49 (SWT:1478): Gtk-CRITICAL **: 17:42:49.139: gtk_box_gadget_distribute: assertion 'size >= 0' failed in GtkScrollbar
13:42:49 
13:42:49 (SWT:1478): Gtk-WARNING **: 17:42:49.146: Negative content width -6 (allocation 1, extents 4x3) while allocating gadget (node toolbar, owner GtkToolbar)
13:42:49 
13:42:49 (SWT:1478): Gtk-CRITICAL **: 17:42:49.172: gtk_box_gadget_distribute: assertion 'size >= 0' failed in GtkScrollbar
13:42:49 
13:42:49 (SWT:1478): Gtk-CRITICAL **: 17:42:49.189: gtk_box_gadget_distribute: assertion 'size >= 0' failed in GtkScrollbar
13:42:49 
13:42:49 (SWT:1478): Gtk-CRITICAL **: 17:42:49.262: gtk_box_gadget_distribute: assertion 'size >= 0' failed in GtkScrollbar
13:42:49 
13:42:49 (SWT:1478): Gtk-CRITICAL **: 17:42:49.294: gtk_box_gadget_distribute: assertion 'size >= 0' failed in GtkScrollbar
13:42:49 
13:42:49 (SWT:1478): Gtk-CRITICAL **: 17:42:49.304: gtk_box_gadget_distribute: assertion 'size >= 0' failed in GtkScrollbar
13:42:49 
13:42:49 (SWT:1478): Gtk-CRITICAL **: 17:42:49.312: gtk_box_gadget_distribute: assertion 'size >= 0' failed in GtkScrollbar
13:42:49 
13:42:49 (SWT:1478): Gtk-CRITICAL **: 17:42:49.332: gtk_box_gadget_distribute: assertion 'size >= 0' failed in GtkScrollbar
13:42:49 
13:42:49 (SWT:1478): Gtk-CRITICAL **: 17:42:49.346: gtk_box_gadget_distribute: assertion 'size >= 0' failed in GtkScrollbar
13:42:49 
13:42:49 (SWT:1478): Gtk-CRITICAL **: 17:42:49.372: gtk_box_gadget_distribute: assertion 'size >= 0' failed in GtkScrollbar
13:42:49 
13:42:49 (SWT:1478): Gtk-CRITICAL **: 17:42:49.388: gtk_box_gadget_distribute: assertion 'size >= 0' failed in GtkScrollbar
13:42:49 
13:42:49 (SWT:1478): Gtk-CRITICAL **: 17:42:49.405: gtk_box_gadget_distribute: assertion 'size >= 0' failed in GtkScrollbar
13:42:49 
13:42:49 (SWT:1478): Gtk-WARNING **: 17:42:49.439: Negative content width -6 (allocation 1, extents 4x3) while allocating gadget (node toolbar, owner GtkToolbar)
13:42:49 
13:42:49 (SWT:1478): Gtk-CRITICAL **: 17:42:49.545: gtk_box_gadget_distribute: assertion 'size >= 0' failed in GtkScrollbar
13:42:49 
13:42:49 (SWT:1478): Gtk-CRITICAL **: 17:42:49.566: gtk_box_gadget_distribute: assertion 'size >= 0' failed in GtkScrollbar
13:42:49 
13:42:49 (SWT:1478): Gtk-WARNING **: 17:42:49.572: Negative content width -6 (allocation 1, extents 4x3) while allocating gadget (node toolbar, owner GtkToolbar)
13:42:49 
13:42:49 (SWT:1478): Gtk-WARNING **: 17:42:49.619: Negative content width -6 (allocation 1, extents 4x3) while allocating gadget (node toolbar, owner GtkToolbar)
13:42:49 
13:42:49 (SWT:1478): Gtk-CRITICAL **: 17:42:49.625: gtk_box_gadget_distribute: assertion 'size >= 0' failed in GtkScrollbar
13:42:49 
13:42:49 (SWT:1478): Gtk-CRITICAL **: 17:42:49.631: gtk_box_gadget_distribute: assertion 'size >= 0' failed in GtkScrollbar
13:42:49 
13:42:49 (SWT:1478): Gtk-CRITICAL **: 17:42:49.718: gtk_box_gadget_distribute: assertion 'size >= 0' failed in GtkScrollbar
13:42:49 
13:42:49 (SWT:1478): Gtk-WARNING **: 17:42:49.724: Negative content width -6 (allocation 1, extents 4x3) while allocating gadget (node toolbar, owner GtkToolbar)
13:42:49 
13:42:49 (SWT:1478): Gtk-WARNING **: 17:42:49.761: Negative content width -6 (allocation 1, extents 4x3) while allocating gadget (node toolbar, owner GtkToolbar)
13:42:49 
13:42:49 (SWT:1478): Gtk-CRITICAL **: 17:42:49.843: gtk_box_gadget_distribute: assertion 'size >= 0' failed in GtkScrollbar
13:42:49 
13:42:49 (SWT:1478): Gtk-WARNING **: 17:42:49.850: Negative content width -6 (allocation 1, extents 4x3) while allocating gadget (node toolbar, owner GtkToolbar)
13:42:49 
13:42:49 (SWT:1478): Gtk-WARNING **: 17:42:49.894: Negative content width -6 (allocation 1, extents 4x3) while allocating gadget (node toolbar, owner GtkToolbar)
13:42:49 
13:42:49 (SWT:1478): Gtk-CRITICAL **: 17:42:49.901: gtk_box_gadget_distribute: assertion 'size >= 0' failed in GtkScrollbar
13:42:49 
13:42:49 (SWT:1478): Gtk-CRITICAL **: 17:42:49.907: gtk_box_gadget_distribute: assertion 'size >= 0' failed in GtkScrollbar
13:42:49 
13:42:49 (SWT:1478): Gtk-CRITICAL **: 17:42:49.981: gtk_box_gadget_distribute: assertion 'size >= 0' failed in GtkScrollbar
13:42:49 
13:42:49 (SWT:1478): Gtk-WARNING **: 17:42:49.987: Negative content width -6 (allocation 1, extents 4x3) while allocating gadget (node toolbar, owner GtkToolbar)
13:42:50 
13:42:50 (SWT:1478): Gtk-WARNING **: 17:42:50.039: Negative content width -6 (allocation 1, extents 4x3) while allocating gadget (node toolbar, owner GtkToolbar)
13:42:50 
13:42:50 (SWT:1478): Gtk-WARNING **: 17:42:50.828: Negative content width -6 (allocation 1, extents 4x3) while allocating gadget (node toolbar, owner GtkToolbar)
13:42:50 
13:42:50 (SWT:1478): Gtk-WARNING **: 17:42:50.829: Negative content width -6 (allocation 1, extents 4x3) while allocating gadget (node toolbar, owner GtkToolbar)
13:42:50 
13:42:50 (SWT:1478): Gtk-WARNING **: 17:42:50.844: Negative content width -6 (allocation 1, extents 4x3) while allocating gadget (node toolbar, owner GtkToolbar)
13:42:50 
13:42:50 (SWT:1478): Gtk-CRITICAL **: 17:42:50.868: gtk_box_gadget_distribute: assertion 'size >= 0' failed in GtkScrollbar
13:42:50 
13:42:50 (SWT:1478): Gtk-CRITICAL **: 17:42:50.898: gtk_box_gadget_distribute: assertion 'size >= 0' failed in GtkScrollbar
13:42:50 
13:42:50 (SWT:1478): Gtk-CRITICAL **: 17:42:50.914: gtk_box_gadget_distribute: assertion 'size >= 0' failed in GtkScrollbar
13:42:50 
13:42:50 (SWT:1478): Gtk-CRITICAL **: 17:42:50.929: gtk_box_gadget_distribute: assertion 'size >= 0' failed in GtkScrollbar
13:42:50 
13:42:50 (SWT:1478): Gtk-CRITICAL **: 17:42:50.947: gtk_box_gadget_distribute: assertion 'size >= 0' failed in GtkScrollbar
13:42:50 
13:42:50 (SWT:1478): Gtk-CRITICAL **: 17:42:50.965: gtk_box_gadget_distribute: assertion 'size >= 0' failed in GtkScrollbar
13:42:50 
13:42:50 (SWT:1478): Gtk-WARNING **: 17:42:50.996: Negative content width -6 (allocation 1, extents 4x3) while allocating gadget (node toolbar, owner GtkToolbar)
13:42:51 
13:42:51 (SWT:1478): Gtk-CRITICAL **: 17:42:51.064: gtk_box_gadget_distribute: assertion 'size >= 0' failed in GtkScrollbar
13:42:51 
13:42:51 (SWT:1478): Gtk-CRITICAL **: 17:42:51.081: gtk_box_gadget_distribute: assertion 'size >= 0' failed in GtkScrollbar
13:42:51 
13:42:51 (SWT:1478): Gtk-CRITICAL **: 17:42:51.087: gtk_box_gadget_distribute: assertion 'size >= 0' failed in GtkScrollbar
13:42:51 
13:42:51 (SWT:1478): Gtk-WARNING **: 17:42:51.089: Negative content width -6 (allocation 1, extents 4x3) while allocating gadget (node toolbar, owner GtkToolbar)
13:42:51 
13:42:51 (SWT:1478): Gtk-WARNING **: 17:42:51.126: Negative content width -6 (allocation 1, extents 4x3) while allocating gadget (node toolbar, owner GtkToolbar)
13:42:51 
13:42:51 (SWT:1478): Gtk-CRITICAL **: 17:42:51.212: gtk_box_gadget_distribute: assertion 'size >= 0' failed in GtkScrollbar
13:42:51 
13:42:51 (SWT:1478): Gtk-WARNING **: 17:42:51.219: Negative content width -6 (allocation 1, extents 4x3) while allocating gadget (node toolbar, owner GtkToolbar)
13:42:51 
13:42:51 (SWT:1478): Gtk-WARNING **: 17:42:51.258: Negative content width -6 (allocation 1, extents 4x3) while allocating gadget (node toolbar, owner GtkToolbar)
13:42:51 
13:42:51 (SWT:1478): Gtk-CRITICAL **: 17:42:51.360: gtk_box_gadget_distribute: assertion 'size >= 0' failed in GtkScrollbar
13:42:51 
13:42:51 (SWT:1478): Gtk-WARNING **: 17:42:51.367: Negative content width -6 (allocation 1, extents 4x3) while allocating gadget (node toolbar, owner GtkToolbar)
13:42:51 
13:42:51 (SWT:1478): Gtk-CRITICAL **: 17:42:51.380: gtk_box_gadget_distribute: assertion 'size >= 0' failed in GtkScrollbar
13:42:51 
13:42:51 (SWT:1478): Gtk-CRITICAL **: 17:42:51.386: gtk_box_gadget_distribute: assertion 'size >= 0' failed in GtkScrollbar
13:42:51 
13:42:51 (SWT:1478): Gtk-WARNING **: 17:42:51.412: Negative content width -6 (allocation 1, extents 4x3) while allocating gadget (node toolbar, owner GtkToolbar)
13:42:51 
13:42:51 (SWT:1478): Gtk-CRITICAL **: 17:42:51.493: gtk_box_gadget_distribute: assertion 'size >= 0' failed in GtkScrollbar
13:42:51 
13:42:51 (SWT:1478): Gtk-WARNING **: 17:42:51.499: Negative content width -6 (allocation 1, extents 4x3) while allocating gadget (node toolbar, owner GtkToolbar)
13:42:51 
13:42:51 (SWT:1478): Gtk-WARNING **: 17:42:51.532: Negative content width -6 (allocation 1, extents 4x3) while allocating gadget (node toolbar, owner GtkToolbar)
13:42:51 
13:42:51 (SWT:1478): Gtk-CRITICAL **: 17:42:51.619: gtk_box_gadget_distribute: assertion 'size >= 0' failed in GtkScrollbar
13:42:51 
13:42:51 (SWT:1478): Gtk-WARNING **: 17:42:51.624: Negative content width -6 (allocation 1, extents 4x3) while allocating gadget (node toolbar, owner GtkToolbar)
13:42:51 
13:42:51 (SWT:1478): Gtk-CRITICAL **: 17:42:51.634: gtk_box_gadget_distribute: assertion 'size >= 0' failed in GtkScrollbar
13:42:51 
13:42:51 (SWT:1478): Gtk-CRITICAL **: 17:42:51.644: gtk_box_gadget_distribute: assertion 'size >= 0' failed in GtkScrollbar
13:42:51 
13:42:51 (SWT:1478): Gtk-WARNING **: 17:42:51.663: Negative content width -6 (allocation 1, extents 4x3) while allocating gadget (node toolbar, owner GtkToolbar)
13:42:51 
13:42:51 (SWT:1478): Gtk-CRITICAL **: 17:42:51.751: gtk_box_gadget_distribute: assertion 'size >= 0' failed in GtkScrollbar
13:42:51 
13:42:51 (SWT:1478): Gtk-WARNING **: 17:42:51.757: Negative content width -6 (allocation 1, extents 4x3) while allocating gadget (node toolbar, owner GtkToolbar)
13:42:51 
13:42:51 (SWT:1478): Gtk-WARNING **: 17:42:51.823: Negative content width -6 (allocation 1, extents 4x3) while allocating gadget (node toolbar, owner GtkToolbar)
13:42:51 
13:42:51 (SWT:1478): Gtk-WARNING **: 17:42:51.915: Negative content width -6 (allocation 1, extents 4x3) while allocating gadget (node toolbar, owner GtkToolbar)
13:42:51 
13:42:51 (SWT:1478): Gtk-WARNING **: 17:42:51.966: Negative content width -6 (allocation 1, extents 4x3) while allocating gadget (node toolbar, owner GtkToolbar)
13:42:52 
13:42:52 (SWT:1478): Gtk-WARNING **: 17:42:52.732: Negative content width -6 (allocation 1, extents 4x3) while allocating gadget (node toolbar, owner GtkToolbar)
13:42:52 
13:42:52 (SWT:1478): Gtk-WARNING **: 17:42:52.733: Negative content width -6 (allocation 1, extents 4x3) while allocating gadget (node toolbar, owner GtkToolbar)
13:42:52 
13:42:52 (SWT:1478): Gtk-WARNING **: 17:42:52.746: Negative content width -6 (allocation 1, extents 4x3) while allocating gadget (node toolbar, owner GtkToolbar)
13:42:52 
13:42:52 (SWT:1478): Gtk-CRITICAL **: 17:42:52.767: gtk_box_gadget_distribute: assertion 'size >= 0' failed in GtkScrollbar
13:42:52 
13:42:52 (SWT:1478): Gtk-CRITICAL **: 17:42:52.795: gtk_box_gadget_distribute: assertion 'size >= 0' failed in GtkScrollbar
13:42:52 
13:42:52 (SWT:1478): Gtk-CRITICAL **: 17:42:52.812: gtk_box_gadget_distribute: assertion 'size >= 0' failed in GtkScrollbar
13:42:52 
13:42:52 (SWT:1478): Gtk-CRITICAL **: 17:42:52.829: gtk_box_gadget_distribute: assertion 'size >= 0' failed in GtkScrollbar
13:42:52 
13:42:52 (SWT:1478): Gtk-CRITICAL **: 17:42:52.845: gtk_box_gadget_distribute: assertion 'size >= 0' failed in GtkScrollbar
13:42:52 
13:42:52 (SWT:1478): Gtk-CRITICAL **: 17:42:52.872: gtk_box_gadget_distribute: assertion 'size >= 0' failed in GtkScrollbar
13:42:52 
13:42:52 (SWT:1478): Gtk-CRITICAL **: 17:42:52.931: gtk_box_gadget_distribute: assertion 'size >= 0' failed in GtkScrollbar
13:42:52 
13:42:52 (SWT:1478): Gtk-CRITICAL **: 17:42:52.955: gtk_box_gadget_distribute: assertion 'size >= 0' failed in GtkScrollbar
13:42:52 
13:42:52 (SWT:1478): Gtk-CRITICAL **: 17:42:52.966: gtk_box_gadget_distribute: assertion 'size >= 0' failed in GtkScrollbar
13:42:52 
13:42:52 (SWT:1478): Gtk-CRITICAL **: 17:42:52.982: gtk_box_gadget_distribute: assertion 'size >= 0' failed in GtkScrollbar
13:42:52 
13:42:52 (SWT:1478): Gtk-CRITICAL **: 17:42:52.998: gtk_box_gadget_distribute: assertion 'size >= 0' failed in GtkScrollbar
13:42:53 
13:42:53 (SWT:1478): Gtk-CRITICAL **: 17:42:53.014: gtk_box_gadget_distribute: assertion 'size >= 0' failed in GtkScrollbar
13:42:53 
13:42:53 (SWT:1478): Gtk-CRITICAL **: 17:42:53.031: gtk_box_gadget_distribute: assertion 'size >= 0' failed in GtkScrollbar
13:42:53 
13:42:53 (SWT:1478): Gtk-CRITICAL **: 17:42:53.047: gtk_box_gadget_distribute: assertion 'size >= 0' failed in GtkScrollbar
13:42:53 
13:42:53 (SWT:1478): Gtk-WARNING **: 17:42:53.091: Negative content width -6 (allocation 1, extents 4x3) while allocating gadget (node toolbar, owner GtkToolbar)
13:42:53 
13:42:53 (SWT:1478): Gtk-WARNING **: 17:42:53.910: Negative content width -6 (allocation 1, extents 4x3) while allocating gadget (node toolbar, owner GtkToolbar)
13:42:53 
13:42:53 (SWT:1478): Gtk-WARNING **: 17:42:53.911: Negative content width -6 (allocation 1, extents 4x3) while allocating gadget (node toolbar, owner GtkToolbar)
13:42:53 
13:42:53 (SWT:1478): Gtk-WARNING **: 17:42:53.924: Negative content width -6 (allocation 1, extents 4x3) while allocating gadget (node toolbar, owner GtkToolbar)
13:42:53 
13:42:53 (SWT:1478): Gtk-CRITICAL **: 17:42:53.952: gtk_box_gadget_distribute: assertion 'size >= 0' failed in GtkScrollbar
13:42:53 
13:42:53 (SWT:1478): Gtk-CRITICAL **: 17:42:53.980: gtk_box_gadget_distribute: assertion 'size >= 0' failed in GtkScrollbar
13:42:53 
13:42:53 (SWT:1478): Gtk-CRITICAL **: 17:42:53.996: gtk_box_gadget_distribute: assertion 'size >= 0' failed in GtkScrollbar
13:42:54 
13:42:54 (SWT:1478): Gtk-CRITICAL **: 17:42:54.012: gtk_box_gadget_distribute: assertion 'size >= 0' failed in GtkScrollbar
13:42:54 
13:42:54 (SWT:1478): Gtk-CRITICAL **: 17:42:54.029: gtk_box_gadget_distribute: assertion 'size >= 0' failed in GtkScrollbar
13:42:54 
13:42:54 (SWT:1478): Gtk-WARNING **: 17:42:54.066: Negative content width -6 (allocation 1, extents 4x3) while allocating gadget (node toolbar, owner GtkToolbar)
13:42:55 
13:42:55 (SWT:1478): Gtk-WARNING **: 17:42:55.046: Negative content width -6 (allocation 1, extents 4x3) while allocating gadget (node toolbar, owner GtkToolbar)
13:42:55 
13:42:55 (SWT:1478): Gtk-WARNING **: 17:42:55.047: Negative content width -6 (allocation 1, extents 4x3) while allocating gadget (node toolbar, owner GtkToolbar)
13:42:55 
13:42:55 (SWT:1478): Gtk-WARNING **: 17:42:55.061: Negative content width -6 (allocation 1, extents 4x3) while allocating gadget (node toolbar, owner GtkToolbar)
13:42:55 
13:42:55 (SWT:1478): Gtk-CRITICAL **: 17:42:55.091: gtk_box_gadget_distribute: assertion 'size >= 0' failed in GtkScrollbar
13:42:55 
13:42:55 (SWT:1478): Gtk-CRITICAL **: 17:42:55.107: gtk_box_gadget_distribute: assertion 'size >= 0' failed in GtkScrollbar
13:42:55 
13:42:55 (SWT:1478): Gtk-CRITICAL **: 17:42:55.123: gtk_box_gadget_distribute: assertion 'size >= 0' failed in GtkScrollbar
13:42:55 
13:42:55 (SWT:1478): Gtk-CRITICAL **: 17:42:55.140: gtk_box_gadget_distribute: assertion 'size >= 0' failed in GtkScrollbar
13:42:55 
13:42:55 (SWT:1478): Gtk-CRITICAL **: 17:42:55.156: gtk_box_gadget_distribute: assertion 'size >= 0' failed in GtkScrollbar
13:42:55 
13:42:55 (SWT:1478): Gtk-CRITICAL **: 17:42:55.181: gtk_box_gadget_distribute: assertion 'size >= 0' failed in GtkScrollbar
13:42:55 
13:42:55 (SWT:1478): Gtk-CRITICAL **: 17:42:55.246: gtk_box_gadget_distribute: assertion 'size >= 0' failed in GtkScrollbar
13:42:55 
13:42:55 (SWT:1478): Gtk-CRITICAL **: 17:42:55.272: gtk_box_gadget_distribute: assertion 'size >= 0' failed in GtkScrollbar
13:42:55 
13:42:55 (SWT:1478): Gtk-CRITICAL **: 17:42:55.305: gtk_box_gadget_distribute: assertion 'size >= 0' failed in GtkScrollbar
13:42:55 
13:42:55 (SWT:1478): Gtk-WARNING **: 17:42:55.887: Negative content width -6 (allocation 1, extents 4x3) while allocating gadget (node toolbar, owner GtkToolbar)
13:42:56 
13:42:56 (SWT:1478): Gtk-WARNING **: 17:42:56.670: Negative content width -6 (allocation 1, extents 4x3) while allocating gadget (node toolbar, owner GtkToolbar)
13:42:56 
13:42:56 (SWT:1478): Gtk-WARNING **: 17:42:56.671: Negative content width -6 (allocation 1, extents 4x3) while allocating gadget (node toolbar, owner GtkToolbar)
13:42:56 
13:42:56 (SWT:1478): Gtk-WARNING **: 17:42:56.685: Negative content width -6 (allocation 1, extents 4x3) while allocating gadget (node toolbar, owner GtkToolbar)
13:42:56 
13:42:56 (SWT:1478): Gtk-CRITICAL **: 17:42:56.710: gtk_box_gadget_distribute: assertion 'size >= 0' failed in GtkScrollbar
13:42:56 
13:42:56 (SWT:1478): Gtk-CRITICAL **: 17:42:56.739: gtk_box_gadget_distribute: assertion 'size >= 0' failed in GtkScrollbar
13:42:56 
13:42:56 (SWT:1478): Gtk-CRITICAL **: 17:42:56.755: gtk_box_gadget_distribute: assertion 'size >= 0' failed in GtkScrollbar
13:42:56 
13:42:56 (SWT:1478): Gtk-CRITICAL **: 17:42:56.772: gtk_box_gadget_distribute: assertion 'size >= 0' failed in GtkScrollbar
13:42:56 
13:42:56 (SWT:1478): Gtk-CRITICAL **: 17:42:56.788: gtk_box_gadget_distribute: assertion 'size >= 0' failed in GtkScrollbar
13:42:56 
13:42:56 (SWT:1478): Gtk-CRITICAL **: 17:42:56.863: gtk_box_gadget_distribute: assertion 'size >= 0' failed in GtkScrollbar
13:42:56 
13:42:56 (SWT:1478): Gtk-CRITICAL **: 17:42:56.873: gtk_box_gadget_distribute: assertion 'size >= 0' failed in GtkScrollbar
13:42:56 
13:42:56 (SWT:1478): Gtk-CRITICAL **: 17:42:56.915: gtk_box_gadget_distribute: assertion 'size >= 0' failed in GtkScrollbar
13:42:56 
13:42:56 (SWT:1478): Gtk-CRITICAL **: 17:42:56.931: gtk_box_gadget_distribute: assertion 'size >= 0' failed in GtkScrollbar
13:42:57 
13:42:57 (SWT:1478): Gtk-WARNING **: 17:42:57.083: Negative content width -6 (allocation 1, extents 4x3) while allocating gadget (node toolbar, owner GtkToolbar)
13:42:57 
13:42:57 (SWT:1478): Gtk-WARNING **: 17:42:57.874: Negative content width -6 (allocation 1, extents 4x3) while allocating gadget (node toolbar, owner GtkToolbar)
13:42:57 
13:42:57 (SWT:1478): Gtk-WARNING **: 17:42:57.875: Negative content width -6 (allocation 1, extents 4x3) while allocating gadget (node toolbar, owner GtkToolbar)
13:42:57 
13:42:57 (SWT:1478): Gtk-WARNING **: 17:42:57.888: Negative content width -6 (allocation 1, extents 4x3) while allocating gadget (node toolbar, owner GtkToolbar)
13:42:57 
13:42:57 (SWT:1478): Gtk-CRITICAL **: 17:42:57.911: gtk_box_gadget_distribute: assertion 'size >= 0' failed in GtkScrollbar
13:42:57 
13:42:57 (SWT:1478): Gtk-CRITICAL **: 17:42:57.943: gtk_box_gadget_distribute: assertion 'size >= 0' failed in GtkScrollbar
13:42:57 
13:42:57 (SWT:1478): Gtk-CRITICAL **: 17:42:57.959: gtk_box_gadget_distribute: assertion 'size >= 0' failed in GtkScrollbar
13:42:57 
13:42:57 (SWT:1478): Gtk-CRITICAL **: 17:42:57.975: gtk_box_gadget_distribute: assertion 'size >= 0' failed in GtkScrollbar
13:42:57 
13:42:57 (SWT:1478): Gtk-CRITICAL **: 17:42:57.992: gtk_box_gadget_distribute: assertion 'size >= 0' failed in GtkScrollbar
13:42:58 
13:42:58 (SWT:1478): Gtk-CRITICAL **: 17:42:58.009: gtk_box_gadget_distribute: assertion 'size >= 0' failed in GtkScrollbar
13:42:58 
13:42:58 (SWT:1478): Gtk-CRITICAL **: 17:42:58.025: gtk_box_gadget_distribute: assertion 'size >= 0' failed in GtkScrollbar
13:42:58 
13:42:58 (SWT:1478): Gtk-CRITICAL **: 17:42:58.042: gtk_box_gadget_distribute: assertion 'size >= 0' failed in GtkScrollbar
13:42:58 
13:42:58 (SWT:1478): Gtk-CRITICAL **: 17:42:58.058: gtk_box_gadget_distribute: assertion 'size >= 0' failed in GtkScrollbar
13:42:58 
13:42:58 (SWT:1478): Gtk-CRITICAL **: 17:42:58.074: gtk_box_gadget_distribute: assertion 'size >= 0' failed in GtkScrollbar
13:42:58 
13:42:58 (SWT:1478): Gtk-CRITICAL **: 17:42:58.091: gtk_box_gadget_distribute: assertion 'size >= 0' failed in GtkScrollbar
13:42:58 
13:42:58 (SWT:1478): Gtk-CRITICAL **: 17:42:58.108: gtk_box_gadget_distribute: assertion 'size >= 0' failed in GtkScrollbar
13:42:58 
13:42:58 (SWT:1478): Gtk-CRITICAL **: 17:42:58.110: gtk_box_gadget_distribute: assertion 'size >= 0' failed in GtkScrollbar
13:42:58 
13:42:58 (SWT:1478): Gtk-WARNING **: 17:42:58.169: Negative content width -6 (allocation 1, extents 4x3) while allocating gadget (node toolbar, owner GtkToolbar)
13:42:58 
13:42:58 (SWT:1478): Gtk-CRITICAL **: 17:42:58.241: gtk_box_gadget_distribute: assertion 'size >= 0' failed in GtkScrollbar
13:42:58 
13:42:58 (SWT:1478): Gtk-CRITICAL **: 17:42:58.261: gtk_box_gadget_distribute: assertion 'size >= 0' failed in GtkScrollbar
13:42:58 
13:42:58 (SWT:1478): Gtk-WARNING **: 17:42:58.269: Negative content width -6 (allocation 1, extents 4x3) while allocating gadget (node toolbar, owner GtkToolbar)
13:42:58 
13:42:58 (SWT:1478): Gtk-WARNING **: 17:42:58.327: Negative content width -6 (allocation 1, extents 4x3) while allocating gadget (node toolbar, owner GtkToolbar)
13:42:58 
13:42:58 (SWT:1478): Gtk-CRITICAL **: 17:42:58.415: gtk_box_gadget_distribute: assertion 'size >= 0' failed in GtkScrollbar
13:42:58 
13:42:58 (SWT:1478): Gtk-WARNING **: 17:42:58.422: Negative content width -6 (allocation 1, extents 4x3) while allocating gadget (node toolbar, owner GtkToolbar)
13:42:58 
13:42:58 (SWT:1478): Gtk-WARNING **: 17:42:58.476: Negative content width -6 (allocation 1, extents 4x3) while allocating gadget (node toolbar, owner GtkToolbar)
13:42:59 
13:42:59 (SWT:1478): Gtk-WARNING **: 17:42:59.269: Negative content width -6 (allocation 1, extents 4x3) while allocating gadget (node toolbar, owner GtkToolbar)
13:42:59 
13:42:59 (SWT:1478): Gtk-WARNING **: 17:42:59.271: Negative content width -6 (allocation 1, extents 4x3) while allocating gadget (node toolbar, owner GtkToolbar)
13:42:59 
13:42:59 (SWT:1478): Gtk-WARNING **: 17:42:59.284: Negative content width -6 (allocation 1, extents 4x3) while allocating gadget (node toolbar, owner GtkToolbar)
13:42:59 
13:42:59 (SWT:1478): Gtk-CRITICAL **: 17:42:59.308: gtk_box_gadget_distribute: assertion 'size >= 0' failed in GtkScrollbar
13:42:59 
13:42:59 (SWT:1478): Gtk-CRITICAL **: 17:42:59.337: gtk_box_gadget_distribute: assertion 'size >= 0' failed in GtkScrollbar
13:42:59 
13:42:59 (SWT:1478): Gtk-CRITICAL **: 17:42:59.352: gtk_box_gadget_distribute: assertion 'size >= 0' failed in GtkScrollbar
13:42:59 
13:42:59 (SWT:1478): Gtk-CRITICAL **: 17:42:59.369: gtk_box_gadget_distribute: assertion 'size >= 0' failed in GtkScrollbar
13:42:59 
13:42:59 (SWT:1478): Gtk-CRITICAL **: 17:42:59.386: gtk_box_gadget_distribute: assertion 'size >= 0' failed in GtkScrollbar
13:42:59 
13:42:59 (SWT:1478): Gtk-WARNING **: 17:42:59.416: Negative content width -6 (allocation 1, extents 4x3) while allocating gadget (node toolbar, owner GtkToolbar)
13:42:59 
13:42:59 (SWT:1478): Gtk-CRITICAL **: 17:42:59.488: gtk_box_gadget_distribute: assertion 'size >= 0' failed in GtkScrollbar
13:42:59 
13:42:59 (SWT:1478): Gtk-CRITICAL **: 17:42:59.506: gtk_box_gadget_distribute: assertion 'size >= 0' failed in GtkScrollbar
13:42:59 
13:42:59 (SWT:1478): Gtk-CRITICAL **: 17:42:59.511: gtk_box_gadget_distribute: assertion 'size >= 0' failed in GtkScrollbar
13:42:59 
13:42:59 (SWT:1478): Gtk-WARNING **: 17:42:59.513: Negative content width -6 (allocation 1, extents 4x3) while allocating gadget (node toolbar, owner GtkToolbar)
13:42:59 
13:42:59 (SWT:1478): Gtk-WARNING **: 17:42:59.553: Negative content width -6 (allocation 1, extents 4x3) while allocating gadget (node toolbar, owner GtkToolbar)
13:42:59 
13:42:59 (SWT:1478): Gtk-CRITICAL **: 17:42:59.652: gtk_box_gadget_distribute: assertion 'size >= 0' failed in GtkScrollbar
13:42:59 
13:42:59 (SWT:1478): Gtk-WARNING **: 17:42:59.660: Negative content width -6 (allocation 1, extents 4x3) while allocating gadget (node toolbar, owner GtkToolbar)
13:42:59 
13:42:59 (SWT:1478): Gtk-WARNING **: 17:42:59.696: Negative content width -6 (allocation 1, extents 4x3) while allocating gadget (node toolbar, owner GtkToolbar)
13:42:59 
13:42:59 (SWT:1478): Gtk-CRITICAL **: 17:42:59.850: gtk_box_gadget_distribute: assertion 'size >= 0' failed in GtkScrollbar
13:42:59 
13:42:59 (SWT:1478): Gtk-WARNING **: 17:42:59.857: Negative content width -6 (allocation 1, extents 4x3) while allocating gadget (node toolbar, owner GtkToolbar)
13:42:59 
13:42:59 (SWT:1478): Gtk-WARNING **: 17:42:59.893: Negative content width -6 (allocation 1, extents 4x3) while allocating gadget (node toolbar, owner GtkToolbar)
13:43:00 
13:43:00 (SWT:1478): Gtk-CRITICAL **: 17:43:00.008: gtk_box_gadget_distribute: assertion 'size >= 0' failed in GtkScrollbar
13:43:00 
13:43:00 (SWT:1478): Gtk-WARNING **: 17:43:00.015: Negative content width -6 (allocation 1, extents 4x3) while allocating gadget (node toolbar, owner GtkToolbar)
13:43:00 
13:43:00 (SWT:1478): Gtk-WARNING **: 17:43:00.051: Negative content width -6 (allocation 1, extents 4x3) while allocating gadget (node toolbar, owner GtkToolbar)
13:43:00 
13:43:00 (SWT:1478): Gtk-CRITICAL **: 17:43:00.136: gtk_box_gadget_distribute: assertion 'size >= 0' failed in GtkScrollbar
13:43:00 
13:43:00 (SWT:1478): Gtk-WARNING **: 17:43:00.143: Negative content width -6 (allocation 1, extents 4x3) while allocating gadget (node toolbar, owner GtkToolbar)
13:43:00 
13:43:00 (SWT:1478): Gtk-WARNING **: 17:43:00.182: Negative content width -6 (allocation 1, extents 4x3) while allocating gadget (node toolbar, owner GtkToolbar)
13:43:00 
13:43:00 (SWT:1478): Gtk-CRITICAL **: 17:43:00.274: gtk_box_gadget_distribute: assertion 'size >= 0' failed in GtkScrollbar
13:43:00 
13:43:00 (SWT:1478): Gtk-WARNING **: 17:43:00.281: Negative content width -6 (allocation 1, extents 4x3) while allocating gadget (node toolbar, owner GtkToolbar)
13:43:00 
13:43:00 (SWT:1478): Gtk-WARNING **: 17:43:00.323: Negative content width -6 (allocation 1, extents 4x3) while allocating gadget (node toolbar, owner GtkToolbar)
13:43:00 
13:43:00 (SWT:1478): Gtk-CRITICAL **: 17:43:00.409: gtk_box_gadget_distribute: assertion 'size >= 0' failed in GtkScrollbar
13:43:00 
13:43:00 (SWT:1478): Gtk-WARNING **: 17:43:00.415: Negative content width -6 (allocation 1, extents 4x3) while allocating gadget (node toolbar, owner GtkToolbar)
13:43:00 
13:43:00 (SWT:1478): Gtk-WARNING **: 17:43:00.478: Negative content width -6 (allocation 1, extents 4x3) while allocating gadget (node toolbar, owner GtkToolbar)
13:43:01 
13:43:01 (SWT:1478): Gtk-WARNING **: 17:43:01.277: Negative content width -6 (allocation 1, extents 4x3) while allocating gadget (node toolbar, owner GtkToolbar)
13:43:01 
13:43:01 (SWT:1478): Gtk-WARNING **: 17:43:01.278: Negative content width -6 (allocation 1, extents 4x3) while allocating gadget (node toolbar, owner GtkToolbar)
13:43:01 
13:43:01 (SWT:1478): Gtk-WARNING **: 17:43:01.292: Negative content width -6 (allocation 1, extents 4x3) while allocating gadget (node toolbar, owner GtkToolbar)
13:43:01 
13:43:01 (SWT:1478): Gtk-CRITICAL **: 17:43:01.316: gtk_box_gadget_distribute: assertion 'size >= 0' failed in GtkScrollbar
13:43:01 
13:43:01 (SWT:1478): Gtk-CRITICAL **: 17:43:01.344: gtk_box_gadget_distribute: assertion 'size >= 0' failed in GtkScrollbar
13:43:01 
13:43:01 (SWT:1478): Gtk-CRITICAL **: 17:43:01.360: gtk_box_gadget_distribute: assertion 'size >= 0' failed in GtkScrollbar
13:43:01 
13:43:01 (SWT:1478): Gtk-CRITICAL **: 17:43:01.377: gtk_box_gadget_distribute: assertion 'size >= 0' failed in GtkScrollbar
13:43:01 
13:43:01 (SWT:1478): Gtk-CRITICAL **: 17:43:01.394: gtk_box_gadget_distribute: assertion 'size >= 0' failed in GtkScrollbar
13:43:01 
13:43:01 (SWT:1478): Gtk-CRITICAL **: 17:43:01.413: gtk_box_gadget_distribute: assertion 'size >= 0' failed in GtkScrollbar
13:43:01 
13:43:01 (SWT:1478): Gtk-WARNING **: 17:43:01.442: Negative content width -6 (allocation 1, extents 4x3) while allocating gadget (node toolbar, owner GtkToolbar)
13:43:01 
13:43:01 (SWT:1478): Gtk-CRITICAL **: 17:43:01.508: gtk_box_gadget_distribute: assertion 'size >= 0' failed in GtkScrollbar
13:43:01 
13:43:01 (SWT:1478): Gtk-CRITICAL **: 17:43:01.526: gtk_box_gadget_distribute: assertion 'size >= 0' failed in GtkScrollbar
13:43:01 
13:43:01 (SWT:1478): Gtk-CRITICAL **: 17:43:01.531: gtk_box_gadget_distribute: assertion 'size >= 0' failed in GtkScrollbar
13:43:01 
13:43:01 (SWT:1478): Gtk-WARNING **: 17:43:01.533: Negative content width -6 (allocation 1, extents 4x3) while allocating gadget (node toolbar, owner GtkToolbar)
13:43:01 
13:43:01 (SWT:1478): Gtk-WARNING **: 17:43:01.575: Negative content width -6 (allocation 1, extents 4x3) while allocating gadget (node toolbar, owner GtkToolbar)
13:43:01 
13:43:01 (SWT:1478): Gtk-CRITICAL **: 17:43:01.659: gtk_box_gadget_distribute: assertion 'size >= 0' failed in GtkScrollbar
13:43:01 
13:43:01 (SWT:1478): Gtk-WARNING **: 17:43:01.666: Negative content width -6 (allocation 1, extents 4x3) while allocating gadget (node toolbar, owner GtkToolbar)
13:43:01 
13:43:01 (SWT:1478): Gtk-WARNING **: 17:43:01.708: Negative content width -6 (allocation 1, extents 4x3) while allocating gadget (node toolbar, owner GtkToolbar)
13:43:01 
13:43:01 (SWT:1478): Gtk-CRITICAL **: 17:43:01.795: gtk_box_gadget_distribute: assertion 'size >= 0' failed in GtkScrollbar
13:43:01 
13:43:01 (SWT:1478): Gtk-WARNING **: 17:43:01.802: Negative content width -6 (allocation 1, extents 4x3) while allocating gadget (node toolbar, owner GtkToolbar)
13:43:01 
13:43:01 (SWT:1478): Gtk-WARNING **: 17:43:01.839: Negative content width -6 (allocation 1, extents 4x3) while allocating gadget (node toolbar, owner GtkToolbar)
13:43:01 
13:43:01 (SWT:1478): Gtk-CRITICAL **: 17:43:01.928: gtk_box_gadget_distribute: assertion 'size >= 0' failed in GtkScrollbar
13:43:01 
13:43:01 (SWT:1478): Gtk-WARNING **: 17:43:01.935: Negative content width -6 (allocation 1, extents 4x3) while allocating gadget (node toolbar, owner GtkToolbar)
13:43:01 
13:43:01 (SWT:1478): Gtk-WARNING **: 17:43:01.972: Negative content width -6 (allocation 1, extents 4x3) while allocating gadget (node toolbar, owner GtkToolbar)
13:43:02 
13:43:02 (SWT:1478): Gtk-CRITICAL **: 17:43:02.054: gtk_box_gadget_distribute: assertion 'size >= 0' failed in GtkScrollbar
13:43:02 
13:43:02 (SWT:1478): Gtk-WARNING **: 17:43:02.061: Negative content width -6 (allocation 1, extents 4x3) while allocating gadget (node toolbar, owner GtkToolbar)
13:43:02 
13:43:02 (SWT:1478): Gtk-WARNING **: 17:43:02.096: Negative content width -6 (allocation 1, extents 4x3) while allocating gadget (node toolbar, owner GtkToolbar)
13:43:02 
13:43:02 (SWT:1478): Gtk-CRITICAL **: 17:43:02.182: gtk_box_gadget_distribute: assertion 'size >= 0' failed in GtkScrollbar
13:43:02 
13:43:02 (SWT:1478): Gtk-WARNING **: 17:43:02.189: Negative content width -6 (allocation 1, extents 4x3) while allocating gadget (node toolbar, owner GtkToolbar)
13:43:02 
13:43:02 (SWT:1478): Gtk-WARNING **: 17:43:02.225: Negative content width -6 (allocation 1, extents 4x3) while allocating gadget (node toolbar, owner GtkToolbar)
13:43:02 
13:43:02 (SWT:1478): Gtk-CRITICAL **: 17:43:02.325: gtk_box_gadget_distribute: assertion 'size >= 0' failed in GtkScrollbar
13:43:02 
13:43:02 (SWT:1478): Gtk-WARNING **: 17:43:02.331: Negative content width -6 (allocation 1, extents 4x3) while allocating gadget (node toolbar, owner GtkToolbar)
13:43:02 
13:43:02 (SWT:1478): Gtk-WARNING **: 17:43:02.406: Negative content width -6 (allocation 1, extents 4x3) while allocating gadget (node toolbar, owner GtkToolbar)
13:43:03 
13:43:03 (SWT:1478): Gtk-WARNING **: 17:43:03.180: Negative content width -6 (allocation 1, extents 4x3) while allocating gadget (node toolbar, owner GtkToolbar)
13:43:03 
13:43:03 (SWT:1478): Gtk-WARNING **: 17:43:03.181: Negative content width -6 (allocation 1, extents 4x3) while allocating gadget (node toolbar, owner GtkToolbar)
13:43:03 
13:43:03 (SWT:1478): Gtk-WARNING **: 17:43:03.196: Negative content width -6 (allocation 1, extents 4x3) while allocating gadget (node toolbar, owner GtkToolbar)
13:43:03 
13:43:03 (SWT:1478): Gtk-CRITICAL **: 17:43:03.222: gtk_box_gadget_distribute: assertion 'size >= 0' failed in GtkScrollbar
13:43:03 
13:43:03 (SWT:1478): Gtk-CRITICAL **: 17:43:03.250: gtk_box_gadget_distribute: assertion 'size >= 0' failed in GtkScrollbar
13:43:03 
13:43:03 (SWT:1478): Gtk-CRITICAL **: 17:43:03.266: gtk_box_gadget_distribute: assertion 'size >= 0' failed in GtkScrollbar
13:43:03 
13:43:03 (SWT:1478): Gtk-CRITICAL **: 17:43:03.283: gtk_box_gadget_distribute: assertion 'size >= 0' failed in GtkScrollbar
13:43:03 
13:43:03 (SWT:1478): Gtk-CRITICAL **: 17:43:03.299: gtk_box_gadget_distribute: assertion 'size >= 0' failed in GtkScrollbar
13:43:03 
13:43:03 (SWT:1478): Gtk-CRITICAL **: 17:43:03.411: gtk_box_gadget_distribute: assertion 'size >= 0' failed in GtkScrollbar
13:43:03 
13:43:03 (SWT:1478): Gtk-CRITICAL **: 17:43:03.421: gtk_box_gadget_distribute: assertion 'size >= 0' failed in GtkScrollbar
13:43:03 
13:43:03 (SWT:1478): Gtk-CRITICAL **: 17:43:03.469: gtk_box_gadget_distribute: assertion 'size >= 0' failed in GtkScrollbar
13:43:03 
13:43:03 (SWT:1478): Gtk-WARNING **: 17:43:03.708: Negative content width -6 (allocation 1, extents 4x3) while allocating gadget (node toolbar, owner GtkToolbar)
13:43:04 
13:43:04 (SWT:1478): Gtk-WARNING **: 17:43:04.524: Negative content width -6 (allocation 1, extents 4x3) while allocating gadget (node toolbar, owner GtkToolbar)
13:43:04 
13:43:04 (SWT:1478): Gtk-WARNING **: 17:43:04.525: Negative content width -6 (allocation 1, extents 4x3) while allocating gadget (node toolbar, owner GtkToolbar)
13:43:04 
13:43:04 (SWT:1478): Gtk-WARNING **: 17:43:04.538: Negative content width -6 (allocation 1, extents 4x3) while allocating gadget (node toolbar, owner GtkToolbar)
13:43:04 
13:43:04 (SWT:1478): Gtk-CRITICAL **: 17:43:04.569: gtk_box_gadget_distribute: assertion 'size >= 0' failed in GtkScrollbar
13:43:04 
13:43:04 (SWT:1478): Gtk-CRITICAL **: 17:43:04.585: gtk_box_gadget_distribute: assertion 'size >= 0' failed in GtkScrollbar
13:43:04 
13:43:04 (SWT:1478): Gtk-CRITICAL **: 17:43:04.601: gtk_box_gadget_distribute: assertion 'size >= 0' failed in GtkScrollbar
13:43:04 
13:43:04 (SWT:1478): Gtk-CRITICAL **: 17:43:04.619: gtk_box_gadget_distribute: assertion 'size >= 0' failed in GtkScrollbar
13:43:04 
13:43:04 (SWT:1478): Gtk-CRITICAL **: 17:43:04.635: gtk_box_gadget_distribute: assertion 'size >= 0' failed in GtkScrollbar
13:43:04 
13:43:04 (SWT:1478): Gtk-CRITICAL **: 17:43:04.652: gtk_box_gadget_distribute: assertion 'size >= 0' failed in GtkScrollbar
13:43:04 
13:43:04 (SWT:1478): Gtk-WARNING **: 17:43:04.681: Negative content width -6 (allocation 1, extents 4x3) while allocating gadget (node toolbar, owner GtkToolbar)
13:43:04 
13:43:04 (SWT:1478): Gtk-CRITICAL **: 17:43:04.750: gtk_box_gadget_distribute: assertion 'size >= 0' failed in GtkScrollbar
13:43:04 
13:43:04 (SWT:1478): Gtk-CRITICAL **: 17:43:04.768: gtk_box_gadget_distribute: assertion 'size >= 0' failed in GtkScrollbar
13:43:04 
13:43:04 (SWT:1478): Gtk-CRITICAL **: 17:43:04.773: gtk_box_gadget_distribute: assertion 'size >= 0' failed in GtkScrollbar
13:43:04 
13:43:04 (SWT:1478): Gtk-WARNING **: 17:43:04.775: Negative content width -6 (allocation 1, extents 4x3) while allocating gadget (node toolbar, owner GtkToolbar)
13:43:04 
13:43:04 (SWT:1478): Gtk-CRITICAL **: 17:43:04.796: gtk_box_gadget_distribute: assertion 'size >= 0' failed in GtkScrollbar
13:43:04 
13:43:04 (SWT:1478): Gtk-WARNING **: 17:43:04.819: Negative content width -6 (allocation 1, extents 4x3) while allocating gadget (node toolbar, owner GtkToolbar)
13:43:04 
13:43:04 (SWT:1478): Gtk-CRITICAL **: 17:43:04.911: gtk_box_gadget_distribute: assertion 'size >= 0' failed in GtkScrollbar
13:43:04 
13:43:04 (SWT:1478): Gtk-WARNING **: 17:43:04.918: Negative content width -6 (allocation 1, extents 4x3) while allocating gadget (node toolbar, owner GtkToolbar)
13:43:04 
13:43:04 (SWT:1478): Gtk-CRITICAL **: 17:43:04.933: gtk_box_gadget_distribute: assertion 'size >= 0' failed in GtkScrollbar
13:43:04 
13:43:04 (SWT:1478): Gtk-CRITICAL **: 17:43:04.939: gtk_box_gadget_distribute: assertion 'size >= 0' failed in GtkScrollbar
13:43:04 
13:43:04 (SWT:1478): Gtk-WARNING **: 17:43:04.966: Negative content width -6 (allocation 1, extents 4x3) while allocating gadget (node toolbar, owner GtkToolbar)
13:43:05 
13:43:05 (SWT:1478): Gtk-CRITICAL **: 17:43:05.054: gtk_box_gadget_distribute: assertion 'size >= 0' failed in GtkScrollbar
13:43:05 
13:43:05 (SWT:1478): Gtk-WARNING **: 17:43:05.060: Negative content width -6 (allocation 1, extents 4x3) while allocating gadget (node toolbar, owner GtkToolbar)
13:43:05 
13:43:05 (SWT:1478): Gtk-WARNING **: 17:43:05.109: Negative content width -6 (allocation 1, extents 4x3) while allocating gadget (node toolbar, owner GtkToolbar)
13:43:05 
13:43:05 (SWT:1478): Gtk-CRITICAL **: 17:43:05.193: gtk_box_gadget_distribute: assertion 'size >= 0' failed in GtkScrollbar
13:43:05 
13:43:05 (SWT:1478): Gtk-WARNING **: 17:43:05.199: Negative content width -6 (allocation 1, extents 4x3) while allocating gadget (node toolbar, owner GtkToolbar)
13:43:05 
13:43:05 (SWT:1478): Gtk-WARNING **: 17:43:05.233: Negative content width -6 (allocation 1, extents 4x3) while allocating gadget (node toolbar, owner GtkToolbar)
13:43:05 
13:43:05 (SWT:1478): Gtk-WARNING **: 17:43:05.323: Negative content width -6 (allocation 1, extents 4x3) while allocating gadget (node toolbar, owner GtkToolbar)
13:43:05 
13:43:05 (SWT:1478): Gtk-WARNING **: 17:43:05.360: Negative content width -6 (allocation 1, extents 4x3) while allocating gadget (node toolbar, owner GtkToolbar)
13:43:05 
13:43:05 (SWT:1478): Gtk-WARNING **: 17:43:05.456: Negative content width -6 (allocation 1, extents 4x3) while allocating gadget (node toolbar, owner GtkToolbar)
13:43:05 
13:43:05 (SWT:1478): Gtk-WARNING **: 17:43:05.515: Negative content width -6 (allocation 1, extents 4x3) while allocating gadget (node toolbar, owner GtkToolbar)
13:43:05 
13:43:05 (SWT:1478): Gtk-WARNING **: 17:43:05.607: Negative content width -6 (allocation 1, extents 4x3) while allocating gadget (node toolbar, owner GtkToolbar)
13:43:05 
13:43:05 (SWT:1478): Gtk-WARNING **: 17:43:05.648: Negative content width -6 (allocation 1, extents 4x3) while allocating gadget (node toolbar, owner GtkToolbar)
13:43:05 
13:43:05 (SWT:1478): Gtk-WARNING **: 17:43:05.744: Negative content width -6 (allocation 1, extents 4x3) while allocating gadget (node toolbar, owner GtkToolbar)
13:43:05 
13:43:05 (SWT:1478): Gtk-WARNING **: 17:43:05.795: Negative content width -6 (allocation 1, extents 4x3) while allocating gadget (node toolbar, owner GtkToolbar)
13:43:05 
13:43:05 (SWT:1478): Gtk-WARNING **: 17:43:05.889: Negative content width -6 (allocation 1, extents 4x3) while allocating gadget (node toolbar, owner GtkToolbar)
13:43:05 
13:43:05 (SWT:1478): Gtk-WARNING **: 17:43:05.939: Negative content width -6 (allocation 1, extents 4x3) while allocating gadget (node toolbar, owner GtkToolbar)
13:43:06 
13:43:06 (SWT:1478): Gtk-WARNING **: 17:43:06.729: Negative content width -6 (allocation 1, extents 4x3) while allocating gadget (node toolbar, owner GtkToolbar)
13:43:06 
13:43:06 (SWT:1478): Gtk-WARNING **: 17:43:06.730: Negative content width -6 (allocation 1, extents 4x3) while allocating gadget (node toolbar, owner GtkToolbar)
13:43:06 
13:43:06 (SWT:1478): Gtk-WARNING **: 17:43:06.743: Negative content width -6 (allocation 1, extents 4x3) while allocating gadget (node toolbar, owner GtkToolbar)
13:43:06 
13:43:06 (SWT:1478): Gtk-CRITICAL **: 17:43:06.764: gtk_box_gadget_distribute: assertion 'size >= 0' failed in GtkScrollbar
13:43:06 
13:43:06 (SWT:1478): Gtk-CRITICAL **: 17:43:06.793: gtk_box_gadget_distribute: assertion 'size >= 0' failed in GtkScrollbar
13:43:06 
13:43:06 (SWT:1478): Gtk-CRITICAL **: 17:43:06.808: gtk_box_gadget_distribute: assertion 'size >= 0' failed in GtkScrollbar
13:43:06 
13:43:06 (SWT:1478): Gtk-CRITICAL **: 17:43:06.824: gtk_box_gadget_distribute: assertion 'size >= 0' failed in GtkScrollbar
13:43:06 
13:43:06 (SWT:1478): Gtk-CRITICAL **: 17:43:06.842: gtk_box_gadget_distribute: assertion 'size >= 0' failed in GtkScrollbar
13:43:06 
13:43:06 (SWT:1478): Gtk-CRITICAL **: 17:43:06.867: gtk_box_gadget_distribute: assertion 'size >= 0' failed in GtkScrollbar
13:43:06 
13:43:06 (SWT:1478): Gtk-CRITICAL **: 17:43:06.878: gtk_box_gadget_distribute: assertion 'size >= 0' failed in GtkScrollbar
13:43:06 
13:43:06 (SWT:1478): Gtk-CRITICAL **: 17:43:06.892: gtk_box_gadget_distribute: assertion 'size >= 0' failed in GtkScrollbar
13:43:06 
13:43:06 (SWT:1478): Gtk-CRITICAL **: 17:43:06.908: gtk_box_gadget_distribute: assertion 'size >= 0' failed in GtkScrollbar
13:43:06 
13:43:06 (SWT:1478): Gtk-CRITICAL **: 17:43:06.925: gtk_box_gadget_distribute: assertion 'size >= 0' failed in GtkScrollbar
13:43:06 
13:43:06 (SWT:1478): Gtk-CRITICAL **: 17:43:06.942: gtk_box_gadget_distribute: assertion 'size >= 0' failed in GtkScrollbar
13:43:06 
13:43:06 (SWT:1478): Gtk-CRITICAL **: 17:43:06.965: gtk_box_gadget_distribute: assertion 'size >= 0' failed in GtkScrollbar
13:43:06 
13:43:06 (SWT:1478): Gtk-CRITICAL **: 17:43:06.977: gtk_box_gadget_distribute: assertion 'size >= 0' failed in GtkScrollbar
13:43:06 
13:43:06 (SWT:1478): Gtk-WARNING **: 17:43:06.995: Negative content width -6 (allocation 1, extents 4x3) while allocating gadget (node toolbar, owner GtkToolbar)
13:43:06 
13:43:06 (SWT:1478): Gtk-WARNING **: 17:43:06.995: Negative content height -3 (allocation 1, extents 2x2) while allocating gadget (node toolbar, owner GtkToolbar)
13:43:06 
13:43:06 (SWT:1478): Gtk-WARNING **: 17:43:06.995: Negative content width -6 (allocation 1, extents 4x3) while allocating gadget (node toolbar, owner GtkToolbar)
13:43:06 
13:43:06 (SWT:1478): Gtk-WARNING **: 17:43:06.995: Negative content height -3 (allocation 1, extents 2x2) while allocating gadget (node toolbar, owner GtkToolbar)
13:43:07 
13:43:07 (SWT:1478): Gtk-CRITICAL **: 17:43:07.043: gtk_box_gadget_distribute: assertion 'size >= 0' failed in GtkScrollbar
13:43:07 
13:43:07 (SWT:1478): Gtk-WARNING **: 17:43:07.119: Negative content width -6 (allocation 1, extents 4x3) while allocating gadget (node toolbar, owner GtkToolbar)
13:43:07 Tests run: 13, Failures: 0, Errors: 0, Skipped: 1, Time elapsed: 19.175 s - in org.eclipse.egit.ui.test.history.HistoryViewTest
13:43:07 testShowAllBranches(org.eclipse.egit.ui.test.history.HistoryViewTest)  Time elapsed: 2.064 s
13:43:07 testOpenHistoryOnFileFolderFilter(org.eclipse.egit.ui.test.history.HistoryViewTest)  Time elapsed: 1.928 s
13:43:07 testCheckOut(org.eclipse.egit.ui.test.history.HistoryViewTest)  Time elapsed: 1.124 s
13:43:07 testOpenHistoryOnProject(org.eclipse.egit.ui.test.history.HistoryViewTest)  Time elapsed: 0.975 s
13:43:07 testRevertFailure(org.eclipse.egit.ui.test.history.HistoryViewTest)  Time elapsed: 1.819 s
13:43:07 testRebaseAlreadyUpToDate(org.eclipse.egit.ui.test.history.HistoryViewTest) skipped
13:43:07 testAddBranch(org.eclipse.egit.ui.test.history.HistoryViewTest)  Time elapsed: 1.194 s
13:43:07 testAddCommit(org.eclipse.egit.ui.test.history.HistoryViewTest)  Time elapsed: 1.395 s
13:43:07 testOpenHistoryOnFileProjectFilter(org.eclipse.egit.ui.test.history.HistoryViewTest)  Time elapsed: 2.012 s
13:43:07 testOpenHistoryOnFileRepoFilter(org.eclipse.egit.ui.test.history.HistoryViewTest)  Time elapsed: 1.922 s
13:43:07 testAddTag(org.eclipse.egit.ui.test.history.HistoryViewTest)  Time elapsed: 1.298 s
13:43:07 testOpenHistoryOnFileNoFilter(org.eclipse.egit.ui.test.history.HistoryViewTest)  Time elapsed: 2.234 s
13:43:07 testOpenOfDeletedFile(org.eclipse.egit.ui.test.history.HistoryViewTest)  Time elapsed: 1.177 s
13:43:07 Running org.eclipse.egit.ui.test.commit.CommitEditorTest
13:43:07 
13:43:07 (SWT:1478): Gtk-WARNING **: 17:43:07.735: Negative content width -6 (allocation 1, extents 4x3) while allocating gadget (node toolbar, owner GtkToolbar)
13:43:07 
13:43:07 (SWT:1478): Gtk-WARNING **: 17:43:07.735: Negative content height -3 (allocation 1, extents 2x2) while allocating gadget (node toolbar, owner GtkToolbar)
13:43:07 
13:43:07 (SWT:1478): Gtk-WARNING **: 17:43:07.735: Negative content width -6 (allocation 1, extents 4x3) while allocating gadget (node toolbar, owner GtkToolbar)
13:43:07 
13:43:07 (SWT:1478): Gtk-WARNING **: 17:43:07.735: Negative content height -3 (allocation 1, extents 2x2) while allocating gadget (node toolbar, owner GtkToolbar)
13:43:07 
13:43:07 (SWT:1478): Gtk-WARNING **: 17:43:07.836: Negative content width -6 (allocation 1, extents 4x3) while allocating gadget (node toolbar, owner GtkToolbar)
13:43:07 
13:43:07 (SWT:1478): Gtk-WARNING **: 17:43:07.864: Negative content width -6 (allocation 1, extents 4x3) while allocating gadget (node toolbar, owner GtkToolbar)
13:43:07 
13:43:07 (SWT:1478): Gtk-CRITICAL **: 17:43:07.904: gtk_box_gadget_distribute: assertion 'size >= 0' failed in GtkScrollbar
13:43:07 
13:43:07 (SWT:1478): Gtk-CRITICAL **: 17:43:07.904: gtk_box_gadget_distribute: assertion 'size >= 0' failed in GtkScrollbar
13:43:07 
13:43:07 (SWT:1478): Gtk-CRITICAL **: 17:43:07.916: gtk_box_gadget_distribute: assertion 'size >= 0' failed in GtkScrollbar
13:43:07 
13:43:07 (SWT:1478): Gtk-CRITICAL **: 17:43:07.916: gtk_box_gadget_distribute: assertion 'size >= 0' failed in GtkScrollbar
13:43:07 
13:43:07 (SWT:1478): Gtk-CRITICAL **: 17:43:07.933: gtk_box_gadget_distribute: assertion 'size >= 0' failed in GtkScrollbar
13:43:07 
13:43:07 (SWT:1478): Gtk-CRITICAL **: 17:43:07.933: gtk_box_gadget_distribute: assertion 'size >= 0' failed in GtkScrollbar
13:43:07 
13:43:07 (SWT:1478): Gtk-CRITICAL **: 17:43:07.960: gtk_box_gadget_distribute: assertion 'size >= 0' failed in GtkScrollbar
13:43:07 
13:43:07 (SWT:1478): Gtk-CRITICAL **: 17:43:07.960: gtk_box_gadget_distribute: assertion 'size >= 0' failed in GtkScrollbar
13:43:07 
13:43:07 (SWT:1478): Gtk-WARNING **: 17:43:07.965: Negative content width -6 (allocation 1, extents 4x3) while allocating gadget (node toolbar, owner GtkToolbar)
13:43:07 
13:43:07 (SWT:1478): Gtk-WARNING **: 17:43:07.965: Negative content height -3 (allocation 1, extents 2x2) while allocating gadget (node toolbar, owner GtkToolbar)
13:43:07 
13:43:07 (SWT:1478): Gtk-WARNING **: 17:43:07.965: Negative content width -6 (allocation 1, extents 4x3) while allocating gadget (node toolbar, owner GtkToolbar)
13:43:07 
13:43:07 (SWT:1478): Gtk-WARNING **: 17:43:07.965: Negative content height -3 (allocation 1, extents 2x2) while allocating gadget (node toolbar, owner GtkToolbar)
13:43:08 
13:43:08 (SWT:1478): Gtk-WARNING **: 17:43:08.654: Negative content width -6 (allocation 1, extents 4x3) while allocating gadget (node toolbar, owner GtkToolbar)
13:43:08 
13:43:08 (SWT:1478): Gtk-WARNING **: 17:43:08.654: Negative content height -3 (allocation 1, extents 2x2) while allocating gadget (node toolbar, owner GtkToolbar)
13:43:08 
13:43:08 (SWT:1478): Gtk-WARNING **: 17:43:08.654: Negative content width -6 (allocation 1, extents 4x3) while allocating gadget (node toolbar, owner GtkToolbar)
13:43:08 
13:43:08 (SWT:1478): Gtk-WARNING **: 17:43:08.654: Negative content height -3 (allocation 1, extents 2x2) while allocating gadget (node toolbar, owner GtkToolbar)
13:43:08 
13:43:08 (SWT:1478): Gtk-WARNING **: 17:43:08.753: Negative content width -6 (allocation 1, extents 4x3) while allocating gadget (node toolbar, owner GtkToolbar)
13:43:08 
13:43:08 (SWT:1478): Gtk-WARNING **: 17:43:08.776: Negative content width -6 (allocation 1, extents 4x3) while allocating gadget (node toolbar, owner GtkToolbar)
13:43:08 
13:43:08 (SWT:1478): Gtk-CRITICAL **: 17:43:08.802: gtk_box_gadget_distribute: assertion 'size >= 0' failed in GtkScrollbar
13:43:08 
13:43:08 (SWT:1478): Gtk-CRITICAL **: 17:43:08.802: gtk_box_gadget_distribute: assertion 'size >= 0' failed in GtkScrollbar
13:43:08 
13:43:08 (SWT:1478): Gtk-CRITICAL **: 17:43:08.828: gtk_box_gadget_distribute: assertion 'size >= 0' failed in GtkScrollbar
13:43:08 
13:43:08 (SWT:1478): Gtk-CRITICAL **: 17:43:08.828: gtk_box_gadget_distribute: assertion 'size >= 0' failed in GtkScrollbar
13:43:09 Tests run: 2, Failures: 0, Errors: 0, Skipped: 0, Time elapsed: 1.744 s - in org.eclipse.egit.ui.test.commit.CommitEditorTest
13:43:09 showAnnotations(org.eclipse.egit.ui.test.commit.CommitEditorTest)  Time elapsed: 0.918 s
13:43:09 openAllEditorPagesOnValidCommit(org.eclipse.egit.ui.test.commit.CommitEditorTest)  Time elapsed: 0.82 s
13:43:09 Running org.eclipse.egit.ui.test.commit.RepositoryCommitTest
13:43:11 Tests run: 4, Failures: 0, Errors: 0, Skipped: 0, Time elapsed: 2.138 s - in org.eclipse.egit.ui.test.commit.RepositoryCommitTest
13:43:11 testDiffs(org.eclipse.egit.ui.test.commit.RepositoryCommitTest)  Time elapsed: 0.54 s
13:43:11 testAdapters(org.eclipse.egit.ui.test.commit.RepositoryCommitTest)  Time elapsed: 0.527 s
13:43:11 testGetters(org.eclipse.egit.ui.test.commit.RepositoryCommitTest)  Time elapsed: 0.53 s
13:43:11 testConstructorAsserts(org.eclipse.egit.ui.test.commit.RepositoryCommitTest)  Time elapsed: 0.53 s
13:43:11 Running org.eclipse.egit.ui.test.commit.CommitEditorInputFactoryTest
13:43:12 Tests run: 2, Failures: 0, Errors: 0, Skipped: 0, Time elapsed: 1.073 s - in org.eclipse.egit.ui.test.commit.CommitEditorInputFactoryTest
13:43:12 shouldPersistAndRestoreStashCommit(org.eclipse.egit.ui.test.commit.CommitEditorInputFactoryTest)  Time elapsed: 0.535 s
13:43:12 shouldPersistAndRestoreCommit(org.eclipse.egit.ui.test.commit.CommitEditorInputFactoryTest)  Time elapsed: 0.532 s
13:43:12 Running org.eclipse.egit.ui.test.commit.DiffRegionFormatterTest
13:43:12 Tests run: 1, Failures: 0, Errors: 0, Skipped: 0, Time elapsed: 0.545 s - in org.eclipse.egit.ui.test.commit.DiffRegionFormatterTest
13:43:12 testRanges(org.eclipse.egit.ui.test.commit.DiffRegionFormatterTest)  Time elapsed: 0.541 s
13:43:12 Running org.eclipse.egit.ui.test.commit.CommitEditorInputTest
13:43:14 Tests run: 3, Failures: 0, Errors: 0, Skipped: 0, Time elapsed: 1.624 s - in org.eclipse.egit.ui.test.commit.CommitEditorInputTest
13:43:14 testInput(org.eclipse.egit.ui.test.commit.CommitEditorInputTest)  Time elapsed: 0.537 s
13:43:14 testAdapters(org.eclipse.egit.ui.test.commit.CommitEditorInputTest)  Time elapsed: 0.543 s
13:43:14 testConstructorAsserts(org.eclipse.egit.ui.test.commit.CommitEditorInputTest)  Time elapsed: 0.537 s
13:43:14 Running org.eclipse.egit.ui.test.trace.TraceConfigurationDialogTest
13:43:14 
13:43:14 (SWT:1478): Gtk-CRITICAL **: 17:43:14.502: gtk_box_gadget_distribute: assertion 'size >= 0' failed in GtkScrollbar
13:43:14 
13:43:14 (SWT:1478): Gtk-CRITICAL **: 17:43:14.571: gtk_box_gadget_distribute: assertion 'size >= 0' failed in GtkScrollbar
13:43:14 
13:43:14 (SWT:1478): Gtk-CRITICAL **: 17:43:14.635: gtk_box_gadget_distribute: assertion 'size >= 0' failed in GtkScrollbar
13:43:14 
13:43:14 (SWT:1478): Gtk-CRITICAL **: 17:43:14.695: gtk_box_gadget_distribute: assertion 'size >= 0' failed in GtkScrollbar
13:43:14 
13:43:14 (SWT:1478): Gtk-CRITICAL **: 17:43:14.761: gtk_box_gadget_distribute: assertion 'size >= 0' failed in GtkScrollbar
13:43:14 
13:43:14 (SWT:1478): Gtk-CRITICAL **: 17:43:14.825: gtk_box_gadget_distribute: assertion 'size >= 0' failed in GtkScrollbar
13:43:14 
13:43:14 (SWT:1478): Gtk-CRITICAL **: 17:43:14.839: gtk_box_gadget_distribute: assertion 'size >= 0' failed in GtkScrollbar
13:43:14 Tests run: 2, Failures: 0, Errors: 0, Skipped: 0, Time elapsed: 0.431 s - in org.eclipse.egit.ui.test.trace.TraceConfigurationDialogTest
13:43:14 testMainSwitch(org.eclipse.egit.ui.test.trace.TraceConfigurationDialogTest)  Time elapsed: 0.212 s
13:43:14 testTreeNode(org.eclipse.egit.ui.test.trace.TraceConfigurationDialogTest)  Time elapsed: 0.218 s
13:43:14 Running org.eclipse.egit.ui.prefpages.configuration.GlobalConfigurationPageTest
13:43:14 
13:43:14 !ENTRY org.eclipse.ui 2 2 2019-03-24 17:43:14.892
13:43:14 !MESSAGE Invalid preference category path: org.eclipse.ui.net.NetPreferences (bundle: org.eclipse.jsch.ui, page: org.eclipse.jsch.ui.SSHPreferences)
13:43:14 
13:43:14 (SWT:1478): Gtk-WARNING **: 17:43:14.906: Negative content width -13 (allocation 5, extents 9x9) while allocating gadget (node entry, owner GtkEntry)
13:43:15 
13:43:15 (SWT:1478): Gtk-WARNING **: 17:43:15.139: Negative content width -13 (allocation 5, extents 9x9) while allocating gadget (node entry, owner GtkEntry)
13:43:15 
13:43:15 (SWT:1478): Gtk-WARNING **: 17:43:15.305: Negative content width -13 (allocation 5, extents 9x9) while allocating gadget (node entry, owner GtkEntry)
13:43:15 
13:43:15 (SWT:1478): Gtk-WARNING **: 17:43:15.466: Negative content width -13 (allocation 5, extents 9x9) while allocating gadget (node entry, owner GtkEntry)
13:43:15 
13:43:15 (SWT:1478): Gtk-WARNING **: 17:43:15.573: Negative content width -13 (allocation 5, extents 9x9) while allocating gadget (node entry, owner GtkEntry)
13:43:15 
13:43:15 (SWT:1478): Gtk-WARNING **: 17:43:15.726: Negative content width -13 (allocation 5, extents 9x9) while allocating gadget (node entry, owner GtkEntry)
13:43:15 
13:43:15 (SWT:1478): Gtk-WARNING **: 17:43:15.916: Negative content width -13 (allocation 5, extents 9x9) while allocating gadget (node entry, owner GtkEntry)
13:43:16 
13:43:16 (SWT:1478): Gtk-WARNING **: 17:43:16.001: Negative content width -6 (allocation 1, extents 4x3) while allocating gadget (node toolbar, owner GtkToolbar)
13:43:16 
13:43:16 (SWT:1478): Gtk-WARNING **: 17:43:16.001: Negative content height -3 (allocation 1, extents 2x2) while allocating gadget (node toolbar, owner GtkToolbar)
13:43:16 
13:43:16 (SWT:1478): Gtk-WARNING **: 17:43:16.001: Negative content width -6 (allocation 1, extents 4x3) while allocating gadget (node toolbar, owner GtkToolbar)
13:43:16 
13:43:16 (SWT:1478): Gtk-WARNING **: 17:43:16.001: Negative content height -3 (allocation 1, extents 2x2) while allocating gadget (node toolbar, owner GtkToolbar)
13:43:16 
13:43:16 (SWT:1478): Gtk-WARNING **: 17:43:16.166: Negative content width -13 (allocation 5, extents 9x9) while allocating gadget (node entry, owner GtkEntry)
13:43:16 
13:43:16 (SWT:1478): Gtk-WARNING **: 17:43:16.338: Negative content width -13 (allocation 5, extents 9x9) while allocating gadget (node entry, owner GtkEntry)
13:43:16 
13:43:16 (SWT:1478): Gtk-WARNING **: 17:43:16.552: Negative content width -13 (allocation 5, extents 9x9) while allocating gadget (node entry, owner GtkEntry)
13:43:16 
13:43:16 (SWT:1478): Gtk-WARNING **: 17:43:16.719: Negative content width -13 (allocation 5, extents 9x9) while allocating gadget (node entry, owner GtkEntry)
13:43:16 
13:43:16 (SWT:1478): Gtk-WARNING **: 17:43:16.885: Negative content width -13 (allocation 5, extents 9x9) while allocating gadget (node entry, owner GtkEntry)
13:43:17 Tests run: 11, Failures: 0, Errors: 0, Skipped: 0, Time elapsed: 2.144 s - in org.eclipse.egit.ui.prefpages.configuration.GlobalConfigurationPageTest
13:43:17 testAddSubSectionEntry(org.eclipse.egit.ui.prefpages.configuration.GlobalConfigurationPageTest)  Time elapsed: 0.252 s
13:43:17 testAddSectionEntry(org.eclipse.egit.ui.prefpages.configuration.GlobalConfigurationPageTest)  Time elapsed: 0.165 s
13:43:17 testCanCreateSameEntryValue(org.eclipse.egit.ui.prefpages.configuration.GlobalConfigurationPageTest)  Time elapsed: 0.161 s
13:43:17 testNodes(org.eclipse.egit.ui.prefpages.configuration.GlobalConfigurationPageTest)  Time elapsed: 0.107 s
13:43:17 testRemoveValue(org.eclipse.egit.ui.prefpages.configuration.GlobalConfigurationPageTest)  Time elapsed: 0.151 s
13:43:17 testAddSubSectionEntryWithSuggestion(org.eclipse.egit.ui.prefpages.configuration.GlobalConfigurationPageTest)  Time elapsed: 0.191 s
13:43:17 testOpenEditor(org.eclipse.egit.ui.prefpages.configuration.GlobalConfigurationPageTest)  Time elapsed: 0.249 s
13:43:17 testSubsectionWithDot(org.eclipse.egit.ui.prefpages.configuration.GlobalConfigurationPageTest)  Time elapsed: 0.173 s
13:43:17 testChecksForKey(org.eclipse.egit.ui.prefpages.configuration.GlobalConfigurationPageTest)  Time elapsed: 0.214 s
13:43:17 testRemoveSubSection(org.eclipse.egit.ui.prefpages.configuration.GlobalConfigurationPageTest)  Time elapsed: 0.168 s
13:43:17 testRemoveSection(org.eclipse.egit.ui.prefpages.configuration.GlobalConfigurationPageTest)  Time elapsed: 0.165 s
13:43:17 Running org.eclipse.egit.ui.variables.DynamicVariablesTest
13:43:21 Tests run: 4, Failures: 0, Errors: 0, Skipped: 0, Time elapsed: 4.394 s - in org.eclipse.egit.ui.variables.DynamicVariablesTest
13:43:21 testGitBranch(org.eclipse.egit.ui.variables.DynamicVariablesTest)  Time elapsed: 1.102 s
13:43:21 testGitPath(org.eclipse.egit.ui.variables.DynamicVariablesTest)  Time elapsed: 1.1 s
13:43:21 testGitWorkTree(org.eclipse.egit.ui.variables.DynamicVariablesTest)  Time elapsed: 1.11 s
13:43:21 testGitDir(org.eclipse.egit.ui.variables.DynamicVariablesTest)  Time elapsed: 1.08 s
13:43:21 Running org.eclipse.egit.ui.submodule.SubmoduleSyncTest
13:43:22 
13:43:22 (SWT:1478): Gtk-WARNING **: 17:43:22.145: Negative content width -6 (allocation 1, extents 4x3) while allocating gadget (node toolbar, owner GtkToolbar)
13:43:26 
13:43:26 (SWT:1478): Gtk-WARNING **: 17:43:26.843: Negative content width -6 (allocation 1, extents 4x3) while allocating gadget (node toolbar, owner GtkToolbar)
13:43:26 Tests run: 1, Failures: 0, Errors: 0, Skipped: 0, Time elapsed: 5.518 s - in org.eclipse.egit.ui.submodule.SubmoduleSyncTest
13:43:26 syncSubmodule(org.eclipse.egit.ui.submodule.SubmoduleSyncTest)  Time elapsed: 5.512 s
13:43:26 Running org.eclipse.egit.ui.submodule.SubmoduleAddTest
13:43:27 
13:43:27 (SWT:1478): Gtk-WARNING **: 17:43:27.652: Negative content width -6 (allocation 1, extents 4x3) while allocating gadget (node toolbar, owner GtkToolbar)
13:43:31 
13:43:31 (SWT:1478): Gtk-WARNING **: 17:43:31.277: Negative content width -6 (allocation 1, extents 4x3) while allocating gadget (node toolbar, owner GtkToolbar)
13:43:31 Tests run: 1, Failures: 0, Errors: 0, Skipped: 0, Time elapsed: 4.433 s - in org.eclipse.egit.ui.submodule.SubmoduleAddTest
13:43:31 addAtRoot(org.eclipse.egit.ui.submodule.SubmoduleAddTest)  Time elapsed: 4.428 s
13:43:31 Running org.eclipse.egit.ui.submodule.SubmoduleUpdateTest
13:43:32 
13:43:32 (SWT:1478): Gtk-WARNING **: 17:43:32.120: Negative content width -6 (allocation 1, extents 4x3) while allocating gadget (node toolbar, owner GtkToolbar)
13:43:37 
13:43:37 (SWT:1478): Gtk-WARNING **: 17:43:37.269: Negative content width -6 (allocation 1, extents 4x3) while allocating gadget (node toolbar, owner GtkToolbar)
13:43:37 Tests run: 1, Failures: 0, Errors: 0, Skipped: 0, Time elapsed: 5.987 s - in org.eclipse.egit.ui.submodule.SubmoduleUpdateTest
13:43:37 updateSubmodule(org.eclipse.egit.ui.submodule.SubmoduleUpdateTest)  Time elapsed: 5.98 s
13:43:37 
13:43:37 Results:
13:43:37 
13:43:37 Failures: 
13:43:37   GitRepositoriesViewRepoDeletionTest.testRemoveRepositoryRemoveFromCachesBug483664:278 Expected no IndexDiffCache entries expected:<[[]]> but was:<[[/home/jenkins/workspace/egit.gerrit/repo/org.eclipse.egit.ui.test/target/work/data/test4068234565534904/.git, /home/jenkins/workspace/egit.gerrit/repo/org.eclipse.egit.ui.test/target/work/data/test2/.git]]>
13:43:37 
13:43:37 Tests run: 467, Failures: 1, Errors: 0, Skipped: 12
13:43:37 
13:43:38 
13:43:38 !ENTRY org.eclipse.core.resources 2 10035 2019-03-24 17:43:38.287
13:43:38 !MESSAGE The workspace will exit with unsaved changes in this session.
13:43:39 [INFO] ------------------------------------------------------------------------
13:43:39 [INFO] BUILD FAILURE
13:43:39 [INFO] ------------------------------------------------------------------------
13:43:39 [INFO] Total time:  13:09 min
13:43:39 [INFO] Finished at: 2019-03-24T17:43:39Z
13:43:39 [INFO] ------------------------------------------------------------------------
13:43:39 [ERROR] Failed to execute goal org.eclipse.tycho:tycho-surefire-plugin:1.3.0:test (default-test) on project org.eclipse.egit.ui.test: There are test failures.
13:43:39 [ERROR] 
13:43:39 [ERROR] Please refer to /home/jenkins/workspace/egit.gerrit/repo/org.eclipse.egit.ui.test/target/surefire-reports for the individual test results.
13:43:39 [ERROR] -> [Help 1]
13:43:39 org.apache.maven.lifecycle.LifecycleExecutionException: Failed to execute goal org.eclipse.tycho:tycho-surefire-plugin:1.3.0:test (default-test) on project org.eclipse.egit.ui.test: There are test failures.
13:43:39 
13:43:39 Please refer to /home/jenkins/workspace/egit.gerrit/repo/org.eclipse.egit.ui.test/target/surefire-reports for the individual test results.
13:43:39     at org.apache.maven.lifecycle.internal.MojoExecutor.execute (MojoExecutor.java:215)
13:43:39     at org.apache.maven.lifecycle.internal.MojoExecutor.execute (MojoExecutor.java:156)
13:43:39     at org.apache.maven.lifecycle.internal.MojoExecutor.execute (MojoExecutor.java:148)
13:43:39     at org.apache.maven.lifecycle.internal.LifecycleModuleBuilder.buildProject (LifecycleModuleBuilder.java:117)
13:43:39     at org.apache.maven.lifecycle.internal.LifecycleModuleBuilder.buildProject (LifecycleModuleBuilder.java:81)
13:43:39     at org.apache.maven.lifecycle.internal.builder.singlethreaded.SingleThreadedBuilder.build (SingleThreadedBuilder.java:56)
13:43:39     at org.apache.maven.lifecycle.internal.LifecycleStarter.execute (LifecycleStarter.java:128)
13:43:39     at org.apache.maven.DefaultMaven.doExecute (DefaultMaven.java:305)
13:43:39     at org.apache.maven.DefaultMaven.doExecute (DefaultMaven.java:192)
13:43:39     at org.apache.maven.DefaultMaven.execute (DefaultMaven.java:105)
13:43:39     at org.apache.maven.cli.MavenCli.execute (MavenCli.java:956)
13:43:39     at org.apache.maven.cli.MavenCli.doMain (MavenCli.java:288)
13:43:39     at org.apache.maven.cli.MavenCli.main (MavenCli.java:192)
13:43:39     at sun.reflect.NativeMethodAccessorImpl.invoke0 (Native Method)
13:43:39     at sun.reflect.NativeMethodAccessorImpl.invoke (NativeMethodAccessorImpl.java:62)
13:43:39     at sun.reflect.DelegatingMethodAccessorImpl.invoke (DelegatingMethodAccessorImpl.java:43)
13:43:39     at java.lang.reflect.Method.invoke (Method.java:498)
13:43:39     at org.codehaus.plexus.classworlds.launcher.Launcher.launchEnhanced (Launcher.java:289)
13:43:39     at org.codehaus.plexus.classworlds.launcher.Launcher.launch (Launcher.java:229)
13:43:39     at org.codehaus.plexus.classworlds.launcher.Launcher.mainWithExitCode (Launcher.java:415)
13:43:39     at org.codehaus.plexus.classworlds.launcher.Launcher.main (Launcher.java:356)
13:43:39 Caused by: org.apache.maven.plugin.MojoFailureException: There are test failures.
13:43:39 
13:43:39 Please refer to /home/jenkins/workspace/egit.gerrit/repo/org.eclipse.egit.ui.test/target/surefire-reports for the individual test results.
13:43:39     at org.eclipse.tycho.surefire.TestMojo.runTest (TestMojo.java:1044)
13:43:39     at org.eclipse.tycho.surefire.TestMojo.execute (TestMojo.java:693)
13:43:39     at org.apache.maven.plugin.DefaultBuildPluginManager.executeMojo (DefaultBuildPluginManager.java:137)
13:43:39     at org.apache.maven.lifecycle.internal.MojoExecutor.execute (MojoExecutor.java:210)
13:43:39     at org.apache.maven.lifecycle.internal.MojoExecutor.execute (MojoExecutor.java:156)
13:43:39     at org.apache.maven.lifecycle.internal.MojoExecutor.execute (MojoExecutor.java:148)
13:43:39     at org.apache.maven.lifecycle.internal.LifecycleModuleBuilder.buildProject (LifecycleModuleBuilder.java:117)
13:43:39     at org.apache.maven.lifecycle.internal.LifecycleModuleBuilder.buildProject (LifecycleModuleBuilder.java:81)
13:43:39     at org.apache.maven.lifecycle.internal.builder.singlethreaded.SingleThreadedBuilder.build (SingleThreadedBuilder.java:56)
13:43:39     at org.apache.maven.lifecycle.internal.LifecycleStarter.execute (LifecycleStarter.java:128)
13:43:39     at org.apache.maven.DefaultMaven.doExecute (DefaultMaven.java:305)
13:43:39     at org.apache.maven.DefaultMaven.doExecute (DefaultMaven.java:192)
13:43:39     at org.apache.maven.DefaultMaven.execute (DefaultMaven.java:105)
13:43:39     at org.apache.maven.cli.MavenCli.execute (MavenCli.java:956)
13:43:39     at org.apache.maven.cli.MavenCli.doMain (MavenCli.java:288)
13:43:39     at org.apache.maven.cli.MavenCli.main (MavenCli.java:192)
13:43:39     at sun.reflect.NativeMethodAccessorImpl.invoke0 (Native Method)
13:43:39     at sun.reflect.NativeMethodAccessorImpl.invoke (NativeMethodAccessorImpl.java:62)
13:43:39     at sun.reflect.DelegatingMethodAccessorImpl.invoke (DelegatingMethodAccessorImpl.java:43)
13:43:39     at java.lang.reflect.Method.invoke (Method.java:498)
13:43:39     at org.codehaus.plexus.classworlds.launcher.Launcher.launchEnhanced (Launcher.java:289)
13:43:39     at org.codehaus.plexus.classworlds.launcher.Launcher.launch (Launcher.java:229)
13:43:39     at org.codehaus.plexus.classworlds.launcher.Launcher.mainWithExitCode (Launcher.java:415)
13:43:39     at org.codehaus.plexus.classworlds.launcher.Launcher.main (Launcher.java:356)
13:43:39 [ERROR] 
13:43:39 [ERROR] Re-run Maven using the -X switch to enable full debug logging.
13:43:39 [ERROR] 
13:43:39 [ERROR] For more information about the errors and possible solutions, please read the following articles:
13:43:39 [ERROR] [Help 1] http://cwiki.apache.org/confluence/display/MAVEN/MojoFailureException
13:43:39 [INFO] Build failures were ignored.
13:43:40 [egit.gerrit] $ /opt/tools/apache-maven/latest/bin/mvn -f repo/org.eclipse.egit.mylyn.ui.test/pom.xml -DGERRIT_BRANCH=master -DGERRIT_PATCHSET_REVISION=bc8bffa131aa90f874172e5fe3f4903b9e266312 -DGERRIT_HOST=gerrit-local -DGERRIT_CHANGE_OWNER_EMAIL=thomas.wolf@paranor.ch "-DGERRIT_EVENT_ACCOUNT_NAME=Thomas Wolf" -DTEST_PARAMS=-Declipse.consoleLog=true -DGERRIT_CHANGE_URL=https://git.eclipse.org/r/139385 -DGERRIT_PATCHSET_UPLOADER_EMAIL=thomas.wolf@paranor.ch -DGERRIT_EVENT_TYPE=patchset-created -DGERRIT_PROJECT=egit/egit -DGERRIT_CHANGE_NUMBER=139385 -DGERRIT_SCHEME=ssh '-DGERRIT_PATCHSET_UPLOADER=\"Thomas Wolf\" <thomas.wolf@paranor.ch>' -DGERRIT_PORT=29418 -DGERRIT_CHANGE_PRIVATE_STATE=false -DGERRIT_REFSPEC=refs/changes/85/139385/2 -DJGIT_VERSION=5.4.0-SNAPSHOT "-DGERRIT_PATCHSET_UPLOADER_NAME=Thomas Wolf" '-DGERRIT_CHANGE_OWNER=\"Thomas Wolf\" <thomas.wolf@paranor.ch>' -DGERRIT_CHANGE_COMMIT_MESSAGE=VHJ5IHRvIHN0YWJpbGl6ZSB0ZXN0cwoKSW5jcmVhc2UgdGltZW91dHMgaW4gb25lIHRlc3Q7IGNsb3NlIGEgcmVwb3NpdG9yeSBpbiBhbm90aGVyLgoKQ2hhbmdlLUlkOiBJNmEyNWYxMjk2YzVlN2FlZmIzYWZkNWVjNmI5MDY5MWIyNThhNTEyOApTaWduZWQtb2ZmLWJ5OiBUaG9tYXMgV29sZiA8dGhvbWFzLndvbGZAcGFyYW5vci5jaD4= "-DGERRIT_NAME=Eclipse Gerrit" -DGERRIT_TOPIC= "-DGERRIT_CHANGE_SUBJECT=Try to stabilize tests" -DJGIT_SITE=https://repo.eclipse.org/content/unzip/snapshots.unzip/org/eclipse/jgit/org.eclipse.jgit.repository/${JGIT_VERSION}/org.eclipse.jgit.repository-${JGIT_VERSION}.zip-unzip/ '-DGERRIT_EVENT_ACCOUNT=\"Thomas Wolf\" <thomas.wolf@paranor.ch>' -DGERRIT_CHANGE_WIP_STATE=false -DGERRIT_CHANGE_ID=I6a25f1296c5e7aefb3afd5ec6b90691b258a5128 -DGERRIT_EVENT_HASH=1234395730 -DGERRIT_VERSION=2.14.6 -DGERRIT_EVENT_ACCOUNT_EMAIL=thomas.wolf@paranor.ch -DGERRIT_PATCHSET_NUMBER=2 "-DGERRIT_CHANGE_OWNER_NAME=Thomas Wolf" -Djava.io.tmpdir=/home/jenkins/workspace/egit.gerrit/tmp/ "-Dtest.vmparams=-Declipse.consoleLog=true -Degit.test.tmpdir=/home/jenkins/workspace/egit.gerrit/tmp/egit.tmp/" -Djgit-site=https://repo.eclipse.org/content/unzip/snapshots.unzip/org/eclipse/jgit/org.eclipse.jgit.repository/5.4.0-SNAPSHOT/org.eclipse.jgit.repository-5.4.0-SNAPSHOT.zip-unzip/ -Declipse.p2.mirrors=false -Dmaven.repo.local=/home/jenkins/workspace/egit.gerrit/.repository -B -e verify --fail-never -P other-os
13:43:40 Picked up JAVA_TOOL_OPTIONS: -XX:+IgnoreUnrecognizedVMOptions -XX:+UseContainerSupport -XX:+UnlockExperimentalVMOptions -XX:+UseCGroupMemoryLimitForHeap
13:43:40 Picked up _JAVA_OPTIONS: -XX:MaxRAMPercentage=64.0
13:43:41 [INFO] Error stacktraces are turned on.
13:43:41 [INFO] Scanning for projects...
13:43:43 [INFO] Computing target platform for MavenProject: org.eclipse.egit:org.eclipse.egit.mylyn.ui.test:5.4.0-SNAPSHOT @ /home/jenkins/workspace/egit.gerrit/repo/org.eclipse.egit.mylyn.ui.test/pom.xml
13:43:48 [INFO] Adding repository http://download.eclipse.org/jetty/updates/jetty-bundles-9.x/9.4.14.v20181114
13:43:48 [INFO] Fetching p2.index from http://download.eclipse.org/technology/swtbot/snapshots/
13:43:48 [INFO] Adding repository http://download.eclipse.org/technology/swtbot/snapshots
13:43:48 [INFO] Fetching p2.index from http://download.eclipse.org/tools/orbit/downloads/drops/R20190226160451/repository/
13:43:48 [INFO] Fetching p2.index from http://download.eclipse.org/tools/orbit/downloads/drops/R20190226160451/repository/
13:43:48 [INFO] Adding repository http://download.eclipse.org/tools/orbit/downloads/drops/R20190226160451/repository
13:43:49 [INFO] Fetching p2.index from http://download.eclipse.org/tools/orbit/downloads/drops2/R20190226160451/repository/
13:43:49 [INFO] Fetching p2.index from http://download.eclipse.org/tools/orbit/downloads/drops2/R20190226160451/repository/
13:43:49 [INFO] Fetching p2.index from http://download.eclipse.org/releases/neon/
13:43:49 [INFO] Fetching p2.index from http://download.eclipse.org/releases/neon/
13:43:49 [INFO] Adding repository http://download.eclipse.org/releases/neon
13:43:49 [INFO] Fetching p2.index from http://download.eclipse.org/technology/epp/packages/neon/
13:43:49 [INFO] Fetching p2.index from http://download.eclipse.org/technology/epp/packages/neon/
13:43:49 [INFO] Fetching p2.index from http://download.eclipse.org/releases/neon/201705151400/
13:43:49 [INFO] Fetching p2.index from http://download.eclipse.org/releases/neon/201705151400/
13:43:51 [INFO] Fetching p2.index from http://download.eclipse.org/releases/neon/201703141400/
13:43:51 [INFO] Fetching p2.index from http://download.eclipse.org/releases/neon/201703141400/
13:43:53 [INFO] Fetching p2.index from http://download.eclipse.org/releases/neon/201703231000/
13:43:53 [INFO] Fetching p2.index from http://download.eclipse.org/releases/neon/201703231000/
13:43:54 [INFO] Fetching p2.index from http://download.eclipse.org/releases/neon/201606221000/
13:43:54 [INFO] Fetching p2.index from http://download.eclipse.org/releases/neon/201606221000/
13:43:55 [INFO] Fetching p2.index from http://download.eclipse.org/releases/neon/201609281000/
13:43:55 [INFO] Fetching p2.index from http://download.eclipse.org/releases/neon/201609281000/
13:43:56 [INFO] Fetching p2.index from http://download.eclipse.org/releases/neon/201610111000/
13:43:56 [INFO] Fetching p2.index from http://download.eclipse.org/releases/neon/201610111000/
13:43:57 [INFO] Fetching p2.index from http://download.eclipse.org/releases/neon/201612211000/
13:43:57 [INFO] Fetching p2.index from http://download.eclipse.org/releases/neon/201612211000/
13:44:05 [INFO] Fetching p2.index from https://repo.eclipse.org/content/unzip/snapshots.unzip/org/eclipse/jgit/org.eclipse.jgit.repository/5.4.0-SNAPSHOT/org.eclipse.jgit.repository-5.4.0-SNAPSHOT.zip-unzip/ (172B)
13:44:05 [INFO] Fetching p2.index from https://repo.eclipse.org/content/unzip/snapshots.unzip/org/eclipse/jgit/org.eclipse.jgit.repository/5.4.0-SNAPSHOT/org.eclipse.jgit.repository-5.4.0-SNAPSHOT.zip-unzip/ (172B)
13:44:05 [INFO] Adding repository https://repo.eclipse.org/content/unzip/snapshots.unzip/org/eclipse/jgit/org.eclipse.jgit.repository/5.4.0-SNAPSHOT/org.eclipse.jgit.repository-5.4.0-SNAPSHOT.zip-unzip
13:44:05 [INFO] Fetching p2.index from http://download.eclipse.org/cbi/updates/license/
13:44:05 [INFO] Fetching p2.index from http://download.eclipse.org/cbi/updates/license/
13:44:05 [INFO] Adding repository http://download.eclipse.org/cbi/updates/license
13:44:05 [INFO] Fetching p2.index from http://download.eclipse.org/cbi/updates/license/2.0.0.v20180130-0820/
13:44:05 [INFO] Fetching p2.index from http://download.eclipse.org/cbi/updates/license/2.0.0.v20180130-0820/
13:44:05 [INFO] Fetching p2.index from http://download.eclipse.org/cbi/updates/license/2.0.1.v20180423-1114/
13:44:05 [INFO] Fetching p2.index from http://download.eclipse.org/cbi/updates/license/2.0.1.v20180423-1114/
13:44:05 [INFO] Resolving dependencies of MavenProject: org.eclipse.egit:org.eclipse.egit.mylyn.ui.test:5.4.0-SNAPSHOT @ /home/jenkins/workspace/egit.gerrit/repo/org.eclipse.egit.mylyn.ui.test/pom.xml
13:44:06 [WARNING] The following locally built units have been used to resolve project dependencies:
13:44:06 [WARNING]   org.eclipse.egit.core/5.4.0.201903241721
13:44:06 [WARNING]   org.eclipse.egit.mylyn.feature.group/5.4.0.201903241721
13:44:06 [WARNING]   org.eclipse.egit/5.4.0.201903241721
13:44:06 [WARNING]   org.eclipse.egit.feature.jar/5.4.0.201903241721
13:44:06 [WARNING]   org.eclipse.egit.feature.group/5.4.0.201903241721
13:44:06 [WARNING]   org.eclipse.egit.mylyn.feature.jar/5.4.0.201903241721
13:44:06 [WARNING]   org.eclipse.egit.doc/5.4.0.201903241721
13:44:06 [WARNING]   org.eclipse.egit.mylyn.ui/5.4.0.201903241721
13:44:06 [WARNING]   org.eclipse.egit.ui/5.4.0.201903241721
13:44:06 [INFO] Resolving class path of MavenProject: org.eclipse.egit:org.eclipse.egit.mylyn.ui.test:5.4.0-SNAPSHOT @ /home/jenkins/workspace/egit.gerrit/repo/org.eclipse.egit.mylyn.ui.test/pom.xml
13:44:06 [INFO] 
13:44:06 [INFO] ----------< org.eclipse.egit:org.eclipse.egit.mylyn.ui.test >-----------
13:44:06 [INFO] Building EGit Mylyn UI Test Plug-in 5.4.0-SNAPSHOT
13:44:06 [INFO] ------------------------[ eclipse-test-plugin ]-------------------------
13:44:06 [INFO] 
13:44:06 [INFO] --- tycho-packaging-plugin:1.3.0:build-qualifier (default-build-qualifier) @ org.eclipse.egit.mylyn.ui.test ---
13:44:06 [INFO] The project's OSGi version is 5.4.0.201903241743
13:44:06 [INFO] 
13:44:06 [INFO] --- tycho-packaging-plugin:1.3.0:validate-id (default-validate-id) @ org.eclipse.egit.mylyn.ui.test ---
13:44:06 [INFO] 
13:44:06 [INFO] --- tycho-packaging-plugin:1.3.0:validate-version (default-validate-version) @ org.eclipse.egit.mylyn.ui.test ---
13:44:06 [INFO] 
13:44:06 [INFO] --- maven-enforcer-plugin:3.0.0-M2:enforce (enforce-maven) @ org.eclipse.egit.mylyn.ui.test ---
13:44:06 [INFO] 
13:44:06 [INFO] --- maven-resources-plugin:2.4.3:resources (default-resources) @ org.eclipse.egit.mylyn.ui.test ---
13:44:06 [INFO] Using 'UTF-8' encoding to copy filtered resources.
13:44:06 [INFO] skip non existing resourceDirectory /home/jenkins/workspace/egit.gerrit/repo/org.eclipse.egit.mylyn.ui.test/src/main/resources
13:44:06 [INFO] 
13:44:06 [INFO] --- tycho-compiler-plugin:1.3.0:compile (default-compile) @ org.eclipse.egit.mylyn.ui.test ---
13:44:06 [INFO] Nothing to compile - all classes are up to date
13:44:06 [INFO] 
13:44:06 [INFO] --- maven-resources-plugin:2.4.3:testResources (default-testResources) @ org.eclipse.egit.mylyn.ui.test ---
13:44:06 [INFO] Using 'UTF-8' encoding to copy filtered resources.
13:44:06 [INFO] skip non existing resourceDirectory /home/jenkins/workspace/egit.gerrit/repo/org.eclipse.egit.mylyn.ui.test/src/test/resources
13:44:06 [INFO] 
13:44:06 [INFO] --- target-platform-configuration:1.3.0:target-platform (default-target-platform) @ org.eclipse.egit.mylyn.ui.test ---
13:44:07 [INFO] 
13:44:07 [INFO] --- tycho-packaging-plugin:1.3.0:package-plugin (default-package-plugin) @ org.eclipse.egit.mylyn.ui.test ---
13:44:07 [INFO] Building jar: /home/jenkins/workspace/egit.gerrit/repo/org.eclipse.egit.mylyn.ui.test/target/org.eclipse.egit.mylyn.ui.test-5.4.0-SNAPSHOT.jar
13:44:07 [INFO] 
13:44:07 [INFO] --- tycho-p2-plugin:1.3.0:p2-metadata-default (default-p2-metadata-default) @ org.eclipse.egit.mylyn.ui.test ---
13:44:07 [INFO] 
13:44:07 [INFO] --- tycho-surefire-plugin:1.3.0:test (default-test) @ org.eclipse.egit.mylyn.ui.test ---
13:44:07 [INFO] Expected eclipse log file: /home/jenkins/workspace/egit.gerrit/repo/org.eclipse.egit.mylyn.ui.test/target/work/data/.metadata/.log
13:44:07 [INFO] Command line:
13:44:07 	[/opt/tools/java/oracle/jdk-8/1.8.0_202/jre/bin/java, -Dosgi.noShutdown=false, -Dosgi.os=linux, -Dosgi.ws=gtk, -Dosgi.arch=x86_64, -Declipse.consoleLog=true, -Degit.test.tmpdir=/home/jenkins/workspace/egit.gerrit/tmp/egit.tmp/, -Xmx512m, -Dosgi.clean=true, -jar, /home/jenkins/workspace/egit.gerrit/.repository/p2/osgi/bundle/org.eclipse.equinox.launcher/1.3.201.v20161025-1711/org.eclipse.equinox.launcher-1.3.201.v20161025-1711.jar, -data, /home/jenkins/workspace/egit.gerrit/repo/org.eclipse.egit.mylyn.ui.test/target/work/data, -install, /home/jenkins/workspace/egit.gerrit/repo/org.eclipse.egit.mylyn.ui.test/target/work, -configuration, /home/jenkins/workspace/egit.gerrit/repo/org.eclipse.egit.mylyn.ui.test/target/work/configuration, -application, org.eclipse.tycho.surefire.osgibooter.uitest, -testproperties, /home/jenkins/workspace/egit.gerrit/repo/org.eclipse.egit.mylyn.ui.test/target/surefire.properties, -testApplication, org.eclipse.ui.ide.workbench]
13:44:07 Picked up JAVA_TOOL_OPTIONS: -XX:+IgnoreUnrecognizedVMOptions -XX:+UseContainerSupport -XX:+UnlockExperimentalVMOptions -XX:+UseCGroupMemoryLimitForHeap
13:44:07 Picked up _JAVA_OPTIONS: -XX:MaxRAMPercentage=64.0
13:44:09 !SESSION 2019-03-24 17:44:07.952 -----------------------------------------------
13:44:09 eclipse.buildId=unknown
13:44:09 java.version=1.8.0_202
13:44:09 java.vendor=Oracle Corporation
13:44:09 BootLoader constants: OS=linux, ARCH=x86_64, WS=gtk, NL=en_US
13:44:09 Framework arguments:  -application org.eclipse.tycho.surefire.osgibooter.uitest -testproperties /home/jenkins/workspace/egit.gerrit/repo/org.eclipse.egit.mylyn.ui.test/target/surefire.properties -testApplication org.eclipse.ui.ide.workbench
13:44:09 Command-line arguments:  -data /home/jenkins/workspace/egit.gerrit/repo/org.eclipse.egit.mylyn.ui.test/target/work/data -application org.eclipse.tycho.surefire.osgibooter.uitest -testproperties /home/jenkins/workspace/egit.gerrit/repo/org.eclipse.egit.mylyn.ui.test/target/surefire.properties -testApplication org.eclipse.ui.ide.workbench
13:44:09 
13:44:09 !ENTRY org.eclipse.jdt.launching.macosx 4 0 2019-03-24 17:44:09.574
13:44:09 !MESSAGE FrameworkEvent ERROR
13:44:09 !STACK 0
13:44:09 org.osgi.framework.BundleException: Could not resolve module: org.eclipse.jdt.launching.macosx [246]
13:44:09   Unresolved requirement: Require-Capability: eclipse.platform; filter:="(osgi.os=macosx)"
13:44:09 
13:44:09 	at org.eclipse.osgi.container.Module.start(Module.java:444)
13:44:09 	at org.eclipse.osgi.container.ModuleContainer$ContainerStartLevel.incStartLevel(ModuleContainer.java:1620)
13:44:09 	at org.eclipse.osgi.container.ModuleContainer$ContainerStartLevel.incStartLevel(ModuleContainer.java:1599)
13:44:09 	at org.eclipse.osgi.container.ModuleContainer$ContainerStartLevel.doContainerStartLevel(ModuleContainer.java:1571)
13:44:09 	at org.eclipse.osgi.container.ModuleContainer$ContainerStartLevel.dispatchEvent(ModuleContainer.java:1514)
13:44:09 	at org.eclipse.osgi.container.ModuleContainer$ContainerStartLevel.dispatchEvent(ModuleContainer.java:1)
13:44:09 	at org.eclipse.osgi.framework.eventmgr.EventManager.dispatchEvent(EventManager.java:230)
13:44:09 	at org.eclipse.osgi.framework.eventmgr.EventManager$EventThread.run(EventManager.java:340)
13:44:09 
13:44:09 !ENTRY org.eclipse.jdt.launching.ui.macosx 4 0 2019-03-24 17:44:09.576
13:44:09 !MESSAGE FrameworkEvent ERROR
13:44:09 !STACK 0
13:44:09 org.osgi.framework.BundleException: Could not resolve module: org.eclipse.jdt.launching.ui.macosx [247]
13:44:09   Unresolved requirement: Require-Capability: eclipse.platform; filter:="(osgi.os=macosx)"
13:44:09 
13:44:09 	at org.eclipse.osgi.container.Module.start(Module.java:444)
13:44:09 	at org.eclipse.osgi.container.ModuleContainer$ContainerStartLevel.incStartLevel(ModuleContainer.java:1620)
13:44:09 	at org.eclipse.osgi.container.ModuleContainer$ContainerStartLevel.incStartLevel(ModuleContainer.java:1599)
13:44:09 	at org.eclipse.osgi.container.ModuleContainer$ContainerStartLevel.doContainerStartLevel(ModuleContainer.java:1571)
13:44:09 	at org.eclipse.osgi.container.ModuleContainer$ContainerStartLevel.dispatchEvent(ModuleContainer.java:1514)
13:44:09 	at org.eclipse.osgi.container.ModuleContainer$ContainerStartLevel.dispatchEvent(ModuleContainer.java:1)
13:44:09 	at org.eclipse.osgi.framework.eventmgr.EventManager.dispatchEvent(EventManager.java:230)
13:44:09 	at org.eclipse.osgi.framework.eventmgr.EventManager$EventThread.run(EventManager.java:340)
13:44:09 Launching application org.eclipse.ui.ide.workbench...
13:44:11 
13:44:11 !ENTRY org.eclipse.egit.core 1 0 2019-03-24 17:44:11.741
13:44:11 !MESSAGE Using Apache MINA sshd as ssh client.
13:44:12 
13:44:12 (SWT:2482): Gtk-WARNING **: 17:44:12.365: Negative content width -6 (allocation 1, extents 4x3) while allocating gadget (node toolbar, owner GtkToolbar)
13:44:12 
13:44:12 (SWT:2482): Gtk-WARNING **: 17:44:12.365: Negative content height -3 (allocation 1, extents 2x2) while allocating gadget (node toolbar, owner GtkToolbar)
13:44:12 
13:44:12 (SWT:2482): Gtk-WARNING **: 17:44:12.365: Negative content width -6 (allocation 1, extents 4x3) while allocating gadget (node toolbar, owner GtkToolbar)
13:44:12 
13:44:12 (SWT:2482): Gtk-WARNING **: 17:44:12.365: Negative content height -3 (allocation 1, extents 2x2) while allocating gadget (node toolbar, owner GtkToolbar)
13:44:12 
13:44:12 (SWT:2482): Gtk-WARNING **: 17:44:12.371: Negative content width -6 (allocation 1, extents 4x3) while allocating gadget (node toolbar, owner GtkToolbar)
13:44:12 
13:44:12 (SWT:2482): Gtk-WARNING **: 17:44:12.371: Negative content height -3 (allocation 1, extents 2x2) while allocating gadget (node toolbar, owner GtkToolbar)
13:44:12 
13:44:12 (SWT:2482): Gtk-WARNING **: 17:44:12.371: Negative content width -6 (allocation 1, extents 4x3) while allocating gadget (node toolbar, owner GtkToolbar)
13:44:12 
13:44:12 (SWT:2482): Gtk-WARNING **: 17:44:12.371: Negative content height -3 (allocation 1, extents 2x2) while allocating gadget (node toolbar, owner GtkToolbar)
13:44:12 
13:44:12 (SWT:2482): Gtk-WARNING **: 17:44:12.556: Negative content width -6 (allocation 1, extents 4x3) while allocating gadget (node toolbar, owner GtkToolbar)
13:44:12 
13:44:12 (SWT:2482): Gtk-WARNING **: 17:44:12.557: Negative content height -3 (allocation 1, extents 2x2) while allocating gadget (node toolbar, owner GtkToolbar)
13:44:12 
13:44:12 (SWT:2482): Gtk-WARNING **: 17:44:12.557: Negative content width -6 (allocation 1, extents 4x3) while allocating gadget (node toolbar, owner GtkToolbar)
13:44:12 
13:44:12 (SWT:2482): Gtk-WARNING **: 17:44:12.557: Negative content height -3 (allocation 1, extents 2x2) while allocating gadget (node toolbar, owner GtkToolbar)
13:44:12 
13:44:12 (SWT:2482): Gtk-WARNING **: 17:44:12.835: Negative content width -6 (allocation 1, extents 4x3) while allocating gadget (node toolbar, owner GtkToolbar)
13:44:12 
13:44:12 (SWT:2482): Gtk-WARNING **: 17:44:12.835: Negative content height -3 (allocation 1, extents 2x2) while allocating gadget (node toolbar, owner GtkToolbar)
13:44:12 
13:44:12 (SWT:2482): Gtk-WARNING **: 17:44:12.836: Negative content width -6 (allocation 1, extents 4x3) while allocating gadget (node toolbar, owner GtkToolbar)
13:44:12 
13:44:12 (SWT:2482): Gtk-WARNING **: 17:44:12.836: Negative content height -3 (allocation 1, extents 2x2) while allocating gadget (node toolbar, owner GtkToolbar)
13:44:12 
13:44:12 (SWT:2482): Gtk-WARNING **: 17:44:12.851: Negative content width -6 (allocation 1, extents 4x3) while allocating gadget (node toolbar, owner GtkToolbar)
13:44:12 
13:44:12 (SWT:2482): Gtk-WARNING **: 17:44:12.851: Negative content height -3 (allocation 1, extents 2x2) while allocating gadget (node toolbar, owner GtkToolbar)
13:44:12 
13:44:12 (SWT:2482): Gtk-WARNING **: 17:44:12.851: Negative content width -6 (allocation 1, extents 4x3) while allocating gadget (node toolbar, owner GtkToolbar)
13:44:12 
13:44:12 (SWT:2482): Gtk-WARNING **: 17:44:12.851: Negative content height -3 (allocation 1, extents 2x2) while allocating gadget (node toolbar, owner GtkToolbar)
13:44:12 
13:44:12 (SWT:2482): Gtk-WARNING **: 17:44:12.854: Negative content width -6 (allocation 1, extents 4x3) while allocating gadget (node toolbar, owner GtkToolbar)
13:44:12 
13:44:12 (SWT:2482): Gtk-WARNING **: 17:44:12.854: Negative content height -3 (allocation 1, extents 2x2) while allocating gadget (node toolbar, owner GtkToolbar)
13:44:12 
13:44:12 (SWT:2482): Gtk-WARNING **: 17:44:12.855: Negative content width -6 (allocation 1, extents 4x3) while allocating gadget (node toolbar, owner GtkToolbar)
13:44:12 
13:44:12 (SWT:2482): Gtk-WARNING **: 17:44:12.855: Negative content height -3 (allocation 1, extents 2x2) while allocating gadget (node toolbar, owner GtkToolbar)
13:44:12 
13:44:12 (SWT:2482): Gtk-WARNING **: 17:44:12.859: Negative content width -6 (allocation 1, extents 4x3) while allocating gadget (node toolbar, owner GtkToolbar)
13:44:12 
13:44:12 (SWT:2482): Gtk-WARNING **: 17:44:12.859: Negative content height -3 (allocation 1, extents 2x2) while allocating gadget (node toolbar, owner GtkToolbar)
13:44:12 
13:44:12 (SWT:2482): Gtk-WARNING **: 17:44:12.859: Negative content width -6 (allocation 1, extents 4x3) while allocating gadget (node toolbar, owner GtkToolbar)
13:44:12 
13:44:12 (SWT:2482): Gtk-WARNING **: 17:44:12.859: Negative content height -3 (allocation 1, extents 2x2) while allocating gadget (node toolbar, owner GtkToolbar)
13:44:13 
13:44:13 (SWT:2482): Gtk-WARNING **: 17:44:13.570: Negative content height -9 (allocation 1, extents 5x5) while allocating gadget (node button, owner GtkButton)
13:44:13 
13:44:13 (SWT:2482): Gtk-WARNING **: 17:44:13.639: Negative content width -6 (allocation 1, extents 4x3) while allocating gadget (node toolbar, owner GtkToolbar)
13:44:13 
13:44:13 (SWT:2482): Gtk-WARNING **: 17:44:13.639: Negative content height -3 (allocation 1, extents 2x2) while allocating gadget (node toolbar, owner GtkToolbar)
13:44:13 
13:44:13 (SWT:2482): Gtk-WARNING **: 17:44:13.639: Negative content width -6 (allocation 1, extents 4x3) while allocating gadget (node toolbar, owner GtkToolbar)
13:44:13 
13:44:13 (SWT:2482): Gtk-WARNING **: 17:44:13.639: Negative content height -3 (allocation 1, extents 2x2) while allocating gadget (node toolbar, owner GtkToolbar)
13:44:13 
13:44:13 (SWT:2482): Gtk-WARNING **: 17:44:13.647: Negative content width -6 (allocation 1, extents 4x3) while allocating gadget (node toolbar, owner GtkToolbar)
13:44:13 
13:44:13 (SWT:2482): Gtk-WARNING **: 17:44:13.647: Negative content height -3 (allocation 1, extents 2x2) while allocating gadget (node toolbar, owner GtkToolbar)
13:44:13 
13:44:13 (SWT:2482): Gtk-WARNING **: 17:44:13.648: Negative content width -6 (allocation 1, extents 4x3) while allocating gadget (node toolbar, owner GtkToolbar)
13:44:13 
13:44:13 (SWT:2482): Gtk-WARNING **: 17:44:13.648: Negative content height -3 (allocation 1, extents 2x2) while allocating gadget (node toolbar, owner GtkToolbar)
13:44:13 
13:44:13 (SWT:2482): Gtk-WARNING **: 17:44:13.673: Negative content width -6 (allocation 1, extents 4x3) while allocating gadget (node toolbar, owner GtkToolbar)
13:44:13 
13:44:13 (SWT:2482): Gtk-WARNING **: 17:44:13.676: Negative content width -6 (allocation 1, extents 4x3) while allocating gadget (node toolbar, owner GtkToolbar)
13:44:13 
13:44:13 (SWT:2482): Gtk-WARNING **: 17:44:13.681: Negative content width -6 (allocation 1, extents 4x3) while allocating gadget (node toolbar, owner GtkToolbar)
13:44:13 
13:44:13 (SWT:2482): Gtk-WARNING **: 17:44:13.683: Negative content width -6 (allocation 1, extents 4x3) while allocating gadget (node toolbar, owner GtkToolbar)
13:44:13 
13:44:13 (SWT:2482): Gtk-WARNING **: 17:44:13.685: Negative content width -6 (allocation 1, extents 4x3) while allocating gadget (node toolbar, owner GtkToolbar)
13:44:13 
13:44:13 (SWT:2482): Gtk-WARNING **: 17:44:13.686: Negative content width -1 (allocation 1, extents 1x1) while allocating gadget (node trough, owner GtkProgressBar)
13:44:13 
13:44:13 (SWT:2482): Gtk-WARNING **: 17:44:13.686: Negative content width -1 (allocation 1, extents 1x1) while allocating gadget (node trough, owner GtkProgressBar)
13:44:13 
13:44:13 (SWT:2482): Gtk-WARNING **: 17:44:13.721: Negative content width -6 (allocation 1, extents 4x3) while allocating gadget (node toolbar, owner GtkToolbar)
13:44:13 
13:44:13 (SWT:2482): Gtk-WARNING **: 17:44:13.734: Negative content width -6 (allocation 1, extents 4x3) while allocating gadget (node toolbar, owner GtkToolbar)
13:44:13 
13:44:13 (SWT:2482): Gtk-WARNING **: 17:44:13.738: Negative content width -6 (allocation 1, extents 4x3) while allocating gadget (node toolbar, owner GtkToolbar)
13:44:13 
13:44:13 (SWT:2482): Gtk-WARNING **: 17:44:13.739: Negative content width -6 (allocation 1, extents 4x3) while allocating gadget (node toolbar, owner GtkToolbar)
13:44:13 
13:44:13 (SWT:2482): Gtk-WARNING **: 17:44:13.743: Negative content width -6 (allocation 1, extents 4x3) while allocating gadget (node toolbar, owner GtkToolbar)
13:44:13 
13:44:13 (SWT:2482): Gtk-WARNING **: 17:44:13.744: Negative content width -6 (allocation 1, extents 4x3) while allocating gadget (node toolbar, owner GtkToolbar)
13:44:13 Running org.eclipse.egit.internal.mylyn.CommitHyperlinkDetectorTest
13:44:13 Tests run: 14, Failures: 0, Errors: 0, Skipped: 0, Time elapsed: 0.094 s - in org.eclipse.egit.internal.mylyn.CommitHyperlinkDetectorTest
13:44:13 testEndLine(org.eclipse.egit.internal.mylyn.CommitHyperlinkDetectorTest)  Time elapsed: 0.035 s
13:44:13 testGerritId(org.eclipse.egit.internal.mylyn.CommitHyperlinkDetectorTest)  Time elapsed: 0.004 s
13:44:13 testMiddleLine(org.eclipse.egit.internal.mylyn.CommitHyperlinkDetectorTest)  Time elapsed: 0.003 s
13:44:13 testOffsetOff(org.eclipse.egit.internal.mylyn.CommitHyperlinkDetectorTest)  Time elapsed: 0.003 s
13:44:13 testEmpty(org.eclipse.egit.internal.mylyn.CommitHyperlinkDetectorTest)  Time elapsed: 0.003 s
13:44:13 testBadLocation(org.eclipse.egit.internal.mylyn.CommitHyperlinkDetectorTest)  Time elapsed: 0.002 s
13:44:13 testEndSentence(org.eclipse.egit.internal.mylyn.CommitHyperlinkDetectorTest)  Time elapsed: 0.004 s
13:44:13 testMultiLine(org.eclipse.egit.internal.mylyn.CommitHyperlinkDetectorTest)  Time elapsed: 0.003 s
13:44:13 testBeginSentence(org.eclipse.egit.internal.mylyn.CommitHyperlinkDetectorTest)  Time elapsed: 0.003 s
13:44:13 testGerritIdWithinText(org.eclipse.egit.internal.mylyn.CommitHyperlinkDetectorTest)  Time elapsed: 0.003 s
13:44:13 testMultiId(org.eclipse.egit.internal.mylyn.CommitHyperlinkDetectorTest)  Time elapsed: 0.003 s
13:44:13 testSimpleId(org.eclipse.egit.internal.mylyn.CommitHyperlinkDetectorTest)  Time elapsed: 0.003 s
13:44:13 testNoDocument(org.eclipse.egit.internal.mylyn.CommitHyperlinkDetectorTest)  Time elapsed: 0.002 s
13:44:13 testOffsetMiddle(org.eclipse.egit.internal.mylyn.CommitHyperlinkDetectorTest)  Time elapsed: 0.002 s
13:44:13 
13:44:13 Results:
13:44:13 
13:44:13 Tests run: 14, Failures: 0, Errors: 0, Skipped: 0
13:44:13 
13:44:13 
13:44:13 (SWT:2482): Gtk-WARNING **: 17:44:13.965: Negative content width -6 (allocation 1, extents 4x3) while allocating gadget (node toolbar, owner GtkToolbar)
13:44:13 
13:44:13 (SWT:2482): Gtk-WARNING **: 17:44:13.966: Negative content width -6 (allocation 1, extents 4x3) while allocating gadget (node toolbar, owner GtkToolbar)
13:44:16 [INFO] All tests passed!
13:44:16 [INFO] 
13:44:16 [INFO] >>> maven-pmd-plugin:3.11.0:cpd-check (default) > :cpd @ org.eclipse.egit.mylyn.ui.test >>>
13:44:16 [INFO] 
13:44:16 [INFO] --- maven-pmd-plugin:3.11.0:cpd (cpd) @ org.eclipse.egit.mylyn.ui.test ---
13:44:16 [INFO] 
13:44:16 [INFO] <<< maven-pmd-plugin:3.11.0:cpd-check (default) < :cpd @ org.eclipse.egit.mylyn.ui.test <<<
13:44:16 [INFO] 
13:44:16 [INFO] 
13:44:16 [INFO] --- maven-pmd-plugin:3.11.0:cpd-check (default) @ org.eclipse.egit.mylyn.ui.test ---
13:44:16 [INFO] 
13:44:16 [INFO] ------------------------------------------------------------------------
13:44:16 [INFO] BUILD SUCCESS
13:44:16 [INFO] ------------------------------------------------------------------------
13:44:16 [INFO] Total time:  35.852 s
13:44:16 [INFO] Finished at: 2019-03-24T17:44:16Z
13:44:16 [INFO] ------------------------------------------------------------------------
13:44:17 Terminating xvnc.
13:48:19 [FINDBUGS] Collecting findbugs analysis files...
13:48:22 [FINDBUGS] Searching for all files in /home/jenkins/workspace/egit.gerrit that match the pattern repo/*/target/*bugsXml.xml
13:48:22 [FINDBUGS] Parsing 12 files in /home/jenkins/workspace/egit.gerrit
13:48:22 [FINDBUGS] Successfully parsed file /home/jenkins/workspace/egit.gerrit/repo/org.eclipse.egit.core.junit/target/spotbugsXml.xml with 4 unique warnings and 0 duplicates.
13:48:22 [FINDBUGS] Successfully parsed file /home/jenkins/workspace/egit.gerrit/repo/org.eclipse.egit.core.test/target/spotbugsXml.xml with 10 unique warnings and 0 duplicates.
13:48:22 [FINDBUGS] Successfully parsed file /home/jenkins/workspace/egit.gerrit/repo/org.eclipse.egit.core/target/spotbugsXml.xml with 21 unique warnings and 0 duplicates.
13:48:22 [FINDBUGS] Successfully parsed file /home/jenkins/workspace/egit.gerrit/repo/org.eclipse.egit.gitflow.test/target/spotbugsXml.xml with 21 unique warnings and 0 duplicates.
13:48:22 [FINDBUGS] Successfully parsed file /home/jenkins/workspace/egit.gerrit/repo/org.eclipse.egit.gitflow.ui/target/spotbugsXml.xml with 21 unique warnings and 0 duplicates.
13:48:22 [FINDBUGS] Successfully parsed file /home/jenkins/workspace/egit.gerrit/repo/org.eclipse.egit.gitflow/target/spotbugsXml.xml with 23 unique warnings and 0 duplicates.
13:48:22 [FINDBUGS] Successfully parsed file /home/jenkins/workspace/egit.gerrit/repo/org.eclipse.egit.mylyn.ui.test/target/spotbugsXml.xml with 23 unique warnings and 0 duplicates.
13:48:22 [FINDBUGS] Successfully parsed file /home/jenkins/workspace/egit.gerrit/repo/org.eclipse.egit.mylyn.ui/target/spotbugsXml.xml with 23 unique warnings and 0 duplicates.
13:48:22 [FINDBUGS] Successfully parsed file /home/jenkins/workspace/egit.gerrit/repo/org.eclipse.egit.ui.importer.tests/target/spotbugsXml.xml with 23 unique warnings and 0 duplicates.
13:48:22 [FINDBUGS] Successfully parsed file /home/jenkins/workspace/egit.gerrit/repo/org.eclipse.egit.ui.smartimport/target/spotbugsXml.xml with 23 unique warnings and 0 duplicates.
13:48:22 [FINDBUGS] Successfully parsed file /home/jenkins/workspace/egit.gerrit/repo/org.eclipse.egit.ui.test/target/spotbugsXml.xml with 45 unique warnings and 0 duplicates.
13:48:22 [FINDBUGS] Successfully parsed file /home/jenkins/workspace/egit.gerrit/repo/org.eclipse.egit.ui/target/spotbugsXml.xml with 80 unique warnings and 0 duplicates.
13:48:22 No credentials specified
13:48:22 <Git Blamer> Using GitBlamer to create author and commit information for all warnings.
13:48:22 <Git Blamer> GIT_COMMIT=bc8bffa131aa90f874172e5fe3f4903b9e266312, workspace=/home/jenkins/workspace/egit.gerrit/repo
13:48:22  > /usr/bin/git rev-parse bc8bffa131aa90f874172e5fe3f4903b9e266312^{commit} # timeout=10
13:48:29 <Git Blamer> Skipping file /home/jenkins/workspace/egit.gerrit/repo/org.eclipse.egit.ui.test/src/org/eclipse/egit/ui/view/repositories/GitRepositoriesViewTestBase.java, no result found.
13:48:29 [FINDBUGS] Computing warning deltas based on reference build #11580
13:48:33 [DRY] Collecting duplicate code analysis files...
13:48:33 [DRY] Searching for all files in /home/jenkins/workspace/egit.gerrit that match the pattern **/cpd.xml
13:48:33 [DRY] Parsing 19 files in /home/jenkins/workspace/egit.gerrit
13:48:33 [DRY] Successfully parsed file /home/jenkins/workspace/egit.gerrit/repo/org.eclipse.egit-feature/target/cpd.xml with 0 unique warnings and 0 duplicates.
13:48:33 [DRY] Successfully parsed file /home/jenkins/workspace/egit.gerrit/repo/org.eclipse.egit.core.junit/target/cpd.xml with 0 unique warnings and 0 duplicates.
13:48:33 [DRY] Successfully parsed file /home/jenkins/workspace/egit.gerrit/repo/org.eclipse.egit.core.test/target/cpd.xml with 0 unique warnings and 0 duplicates.
13:48:33 [DRY] Successfully parsed file /home/jenkins/workspace/egit.gerrit/repo/org.eclipse.egit.core/target/cpd.xml with 4 unique warnings and 0 duplicates.
13:48:33 [DRY] Successfully parsed file /home/jenkins/workspace/egit.gerrit/repo/org.eclipse.egit.doc/target/cpd.xml with 4 unique warnings and 0 duplicates.
13:48:33 [DRY] Successfully parsed file /home/jenkins/workspace/egit.gerrit/repo/org.eclipse.egit.gitflow-feature/target/cpd.xml with 4 unique warnings and 0 duplicates.
13:48:33 [DRY] Successfully parsed file /home/jenkins/workspace/egit.gerrit/repo/org.eclipse.egit.gitflow.test/target/cpd.xml with 4 unique warnings and 0 duplicates.
13:48:33 [DRY] Successfully parsed file /home/jenkins/workspace/egit.gerrit/repo/org.eclipse.egit.gitflow.ui/target/cpd.xml with 4 unique warnings and 0 duplicates.
13:48:33 [DRY] Successfully parsed file /home/jenkins/workspace/egit.gerrit/repo/org.eclipse.egit.gitflow/target/cpd.xml with 4 unique warnings and 0 duplicates.
13:48:33 [DRY] Successfully parsed file /home/jenkins/workspace/egit.gerrit/repo/org.eclipse.egit.mylyn-feature/target/cpd.xml with 4 unique warnings and 0 duplicates.
13:48:33 [DRY] Successfully parsed file /home/jenkins/workspace/egit.gerrit/repo/org.eclipse.egit.mylyn.ui.test/target/cpd.xml with 4 unique warnings and 0 duplicates.
13:48:33 [DRY] Successfully parsed file /home/jenkins/workspace/egit.gerrit/repo/org.eclipse.egit.mylyn.ui/target/cpd.xml with 4 unique warnings and 0 duplicates.
13:48:33 [DRY] Successfully parsed file /home/jenkins/workspace/egit.gerrit/repo/org.eclipse.egit.repository/target/cpd.xml with 4 unique warnings and 0 duplicates.
13:48:33 [DRY] Successfully parsed file /home/jenkins/workspace/egit.gerrit/repo/org.eclipse.egit.source-feature/target/cpd.xml with 4 unique warnings and 0 duplicates.
13:48:33 [DRY] Successfully parsed file /home/jenkins/workspace/egit.gerrit/repo/org.eclipse.egit.ui.importer.tests/target/cpd.xml with 4 unique warnings and 0 duplicates.
13:48:33 [DRY] Successfully parsed file /home/jenkins/workspace/egit.gerrit/repo/org.eclipse.egit.ui.smartimport/target/cpd.xml with 4 unique warnings and 0 duplicates.
13:48:33 [DRY] Successfully parsed file /home/jenkins/workspace/egit.gerrit/repo/org.eclipse.egit.ui.test/target/cpd.xml with 4 unique warnings and 0 duplicates.
13:48:33 [DRY] Successfully parsed file /home/jenkins/workspace/egit.gerrit/repo/org.eclipse.egit.ui/target/cpd.xml with 37 unique warnings and 0 duplicates.
13:48:33 [DRY] Successfully parsed file /home/jenkins/workspace/egit.gerrit/repo/org.eclipse.egit/target/cpd.xml with 37 unique warnings and 0 duplicates.
13:48:33 No credentials specified
13:48:33 <Git Blamer> Using GitBlamer to create author and commit information for all warnings.
13:48:33 <Git Blamer> GIT_COMMIT=bc8bffa131aa90f874172e5fe3f4903b9e266312, workspace=/home/jenkins/workspace/egit.gerrit/repo
13:48:33  > /usr/bin/git rev-parse bc8bffa131aa90f874172e5fe3f4903b9e266312^{commit} # timeout=10
13:48:37 [DRY] Computing warning deltas based on reference build #11580
13:48:37 Recording test results
13:48:38 Build step 'Publish JUnit test result report' changed build result to UNSTABLE
13:48:38 Archiving artifacts
13:48:41 Finished: UNSTABLE