UnstableConsole Output

Skipping 1,575 KB.. Full Log
e allocating gadget (node toolbar, owner GtkToolbar)
11:43:32 
11:43:32 (SWT:1468): Gtk-CRITICAL **: 15:43:32.418: gtk_box_gadget_distribute: assertion 'size >= 0' failed in GtkScrollbar
11:43:32 
11:43:32 (SWT:1468): Gtk-WARNING **: 15:43:32.425: Negative content width -6 (allocation 1, extents 4x3) while allocating gadget (node toolbar, owner GtkToolbar)
11:43:32 
11:43:32 (SWT:1468): Gtk-WARNING **: 15:43:32.462: Negative content width -6 (allocation 1, extents 4x3) while allocating gadget (node toolbar, owner GtkToolbar)
11:43:32 
11:43:32 (SWT:1468): Gtk-CRITICAL **: 15:43:32.543: gtk_box_gadget_distribute: assertion 'size >= 0' failed in GtkScrollbar
11:43:32 
11:43:32 (SWT:1468): Gtk-WARNING **: 15:43:32.549: Negative content width -6 (allocation 1, extents 4x3) while allocating gadget (node toolbar, owner GtkToolbar)
11:43:32 
11:43:32 (SWT:1468): Gtk-WARNING **: 15:43:32.583: Negative content width -6 (allocation 1, extents 4x3) while allocating gadget (node toolbar, owner GtkToolbar)
11:43:32 
11:43:32 (SWT:1468): Gtk-CRITICAL **: 15:43:32.664: gtk_box_gadget_distribute: assertion 'size >= 0' failed in GtkScrollbar
11:43:32 
11:43:32 (SWT:1468): Gtk-WARNING **: 15:43:32.671: Negative content width -6 (allocation 1, extents 4x3) while allocating gadget (node toolbar, owner GtkToolbar)
11:43:32 
11:43:32 (SWT:1468): Gtk-WARNING **: 15:43:32.704: Negative content width -6 (allocation 1, extents 4x3) while allocating gadget (node toolbar, owner GtkToolbar)
11:43:32 
11:43:32 (SWT:1468): Gtk-CRITICAL **: 15:43:32.789: gtk_box_gadget_distribute: assertion 'size >= 0' failed in GtkScrollbar
11:43:32 
11:43:32 (SWT:1468): Gtk-WARNING **: 15:43:32.795: Negative content width -6 (allocation 1, extents 4x3) while allocating gadget (node toolbar, owner GtkToolbar)
11:43:32 
11:43:32 (SWT:1468): Gtk-WARNING **: 15:43:32.831: Negative content width -6 (allocation 1, extents 4x3) while allocating gadget (node toolbar, owner GtkToolbar)
11:43:32 
11:43:32 (SWT:1468): Gtk-CRITICAL **: 15:43:32.915: gtk_box_gadget_distribute: assertion 'size >= 0' failed in GtkScrollbar
11:43:32 
11:43:32 (SWT:1468): Gtk-WARNING **: 15:43:32.921: Negative content width -6 (allocation 1, extents 4x3) while allocating gadget (node toolbar, owner GtkToolbar)
11:43:32 
11:43:32 (SWT:1468): Gtk-WARNING **: 15:43:32.977: Negative content width -6 (allocation 1, extents 4x3) while allocating gadget (node toolbar, owner GtkToolbar)
11:43:33 
11:43:33 (SWT:1468): Gtk-WARNING **: 15:43:33.737: Negative content width -6 (allocation 1, extents 4x3) while allocating gadget (node toolbar, owner GtkToolbar)
11:43:33 
11:43:33 (SWT:1468): Gtk-WARNING **: 15:43:33.738: Negative content width -6 (allocation 1, extents 4x3) while allocating gadget (node toolbar, owner GtkToolbar)
11:43:33 
11:43:33 (SWT:1468): Gtk-WARNING **: 15:43:33.750: Negative content width -6 (allocation 1, extents 4x3) while allocating gadget (node toolbar, owner GtkToolbar)
11:43:33 
11:43:33 (SWT:1468): Gtk-CRITICAL **: 15:43:33.774: gtk_box_gadget_distribute: assertion 'size >= 0' failed in GtkScrollbar
11:43:33 
11:43:33 (SWT:1468): Gtk-CRITICAL **: 15:43:33.801: gtk_box_gadget_distribute: assertion 'size >= 0' failed in GtkScrollbar
11:43:33 
11:43:33 (SWT:1468): Gtk-CRITICAL **: 15:43:33.817: gtk_box_gadget_distribute: assertion 'size >= 0' failed in GtkScrollbar
11:43:33 
11:43:33 (SWT:1468): Gtk-CRITICAL **: 15:43:33.834: gtk_box_gadget_distribute: assertion 'size >= 0' failed in GtkScrollbar
11:43:33 
11:43:33 (SWT:1468): Gtk-CRITICAL **: 15:43:33.851: gtk_box_gadget_distribute: assertion 'size >= 0' failed in GtkScrollbar
11:43:33 
11:43:33 (SWT:1468): Gtk-CRITICAL **: 15:43:33.869: gtk_box_gadget_distribute: assertion 'size >= 0' failed in GtkScrollbar
11:43:33 
11:43:33 (SWT:1468): Gtk-WARNING **: 15:43:33.938: Negative content width -6 (allocation 1, extents 4x3) while allocating gadget (node toolbar, owner GtkToolbar)
11:43:34 
11:43:34 (SWT:1468): Gtk-CRITICAL **: 15:43:34.037: gtk_box_gadget_distribute: assertion 'size >= 0' failed in GtkScrollbar
11:43:34 
11:43:34 (SWT:1468): Gtk-CRITICAL **: 15:43:34.053: gtk_box_gadget_distribute: assertion 'size >= 0' failed in GtkScrollbar
11:43:34 
11:43:34 (SWT:1468): Gtk-CRITICAL **: 15:43:34.058: gtk_box_gadget_distribute: assertion 'size >= 0' failed in GtkScrollbar
11:43:34 
11:43:34 (SWT:1468): Gtk-WARNING **: 15:43:34.060: Negative content width -6 (allocation 1, extents 4x3) while allocating gadget (node toolbar, owner GtkToolbar)
11:43:34 
11:43:34 (SWT:1468): Gtk-WARNING **: 15:43:34.094: Negative content width -6 (allocation 1, extents 4x3) while allocating gadget (node toolbar, owner GtkToolbar)
11:43:34 
11:43:34 (SWT:1468): Gtk-CRITICAL **: 15:43:34.179: gtk_box_gadget_distribute: assertion 'size >= 0' failed in GtkScrollbar
11:43:34 
11:43:34 (SWT:1468): Gtk-WARNING **: 15:43:34.185: Negative content width -6 (allocation 1, extents 4x3) while allocating gadget (node toolbar, owner GtkToolbar)
11:43:34 
11:43:34 (SWT:1468): Gtk-WARNING **: 15:43:34.218: Negative content width -6 (allocation 1, extents 4x3) while allocating gadget (node toolbar, owner GtkToolbar)
11:43:34 
11:43:34 (SWT:1468): Gtk-CRITICAL **: 15:43:34.301: gtk_box_gadget_distribute: assertion 'size >= 0' failed in GtkScrollbar
11:43:34 
11:43:34 (SWT:1468): Gtk-WARNING **: 15:43:34.307: Negative content width -6 (allocation 1, extents 4x3) while allocating gadget (node toolbar, owner GtkToolbar)
11:43:34 
11:43:34 (SWT:1468): Gtk-WARNING **: 15:43:34.341: Negative content width -6 (allocation 1, extents 4x3) while allocating gadget (node toolbar, owner GtkToolbar)
11:43:34 
11:43:34 (SWT:1468): Gtk-CRITICAL **: 15:43:34.422: gtk_box_gadget_distribute: assertion 'size >= 0' failed in GtkScrollbar
11:43:34 
11:43:34 (SWT:1468): Gtk-WARNING **: 15:43:34.428: Negative content width -6 (allocation 1, extents 4x3) while allocating gadget (node toolbar, owner GtkToolbar)
11:43:34 
11:43:34 (SWT:1468): Gtk-WARNING **: 15:43:34.462: Negative content width -6 (allocation 1, extents 4x3) while allocating gadget (node toolbar, owner GtkToolbar)
11:43:34 
11:43:34 (SWT:1468): Gtk-CRITICAL **: 15:43:34.542: gtk_box_gadget_distribute: assertion 'size >= 0' failed in GtkScrollbar
11:43:34 
11:43:34 (SWT:1468): Gtk-WARNING **: 15:43:34.548: Negative content width -6 (allocation 1, extents 4x3) while allocating gadget (node toolbar, owner GtkToolbar)
11:43:34 
11:43:34 (SWT:1468): Gtk-WARNING **: 15:43:34.582: Negative content width -6 (allocation 1, extents 4x3) while allocating gadget (node toolbar, owner GtkToolbar)
11:43:34 
11:43:34 (SWT:1468): Gtk-CRITICAL **: 15:43:34.666: gtk_box_gadget_distribute: assertion 'size >= 0' failed in GtkScrollbar
11:43:34 
11:43:34 (SWT:1468): Gtk-WARNING **: 15:43:34.672: Negative content width -6 (allocation 1, extents 4x3) while allocating gadget (node toolbar, owner GtkToolbar)
11:43:34 
11:43:34 (SWT:1468): Gtk-WARNING **: 15:43:34.706: Negative content width -6 (allocation 1, extents 4x3) while allocating gadget (node toolbar, owner GtkToolbar)
11:43:34 
11:43:34 (SWT:1468): Gtk-CRITICAL **: 15:43:34.793: gtk_box_gadget_distribute: assertion 'size >= 0' failed in GtkScrollbar
11:43:34 
11:43:34 (SWT:1468): Gtk-WARNING **: 15:43:34.799: Negative content width -6 (allocation 1, extents 4x3) while allocating gadget (node toolbar, owner GtkToolbar)
11:43:34 
11:43:34 (SWT:1468): Gtk-WARNING **: 15:43:34.847: Negative content width -6 (allocation 1, extents 4x3) while allocating gadget (node toolbar, owner GtkToolbar)
11:43:35 
11:43:35 (SWT:1468): Gtk-WARNING **: 15:43:35.650: Negative content width -6 (allocation 1, extents 4x3) while allocating gadget (node toolbar, owner GtkToolbar)
11:43:35 
11:43:35 (SWT:1468): Gtk-WARNING **: 15:43:35.651: Negative content width -6 (allocation 1, extents 4x3) while allocating gadget (node toolbar, owner GtkToolbar)
11:43:35 
11:43:35 (SWT:1468): Gtk-WARNING **: 15:43:35.663: Negative content width -6 (allocation 1, extents 4x3) while allocating gadget (node toolbar, owner GtkToolbar)
11:43:35 
11:43:35 (SWT:1468): Gtk-CRITICAL **: 15:43:35.684: gtk_box_gadget_distribute: assertion 'size >= 0' failed in GtkScrollbar
11:43:35 
11:43:35 (SWT:1468): Gtk-CRITICAL **: 15:43:35.711: gtk_box_gadget_distribute: assertion 'size >= 0' failed in GtkScrollbar
11:43:35 
11:43:35 (SWT:1468): Gtk-CRITICAL **: 15:43:35.728: gtk_box_gadget_distribute: assertion 'size >= 0' failed in GtkScrollbar
11:43:35 
11:43:35 (SWT:1468): Gtk-CRITICAL **: 15:43:35.745: gtk_box_gadget_distribute: assertion 'size >= 0' failed in GtkScrollbar
11:43:35 
11:43:35 (SWT:1468): Gtk-CRITICAL **: 15:43:35.760: gtk_box_gadget_distribute: assertion 'size >= 0' failed in GtkScrollbar
11:43:35 
11:43:35 (SWT:1468): Gtk-CRITICAL **: 15:43:35.784: gtk_box_gadget_distribute: assertion 'size >= 0' failed in GtkScrollbar
11:43:35 
11:43:35 (SWT:1468): Gtk-CRITICAL **: 15:43:35.794: gtk_box_gadget_distribute: assertion 'size >= 0' failed in GtkScrollbar
11:43:35 
11:43:35 (SWT:1468): Gtk-CRITICAL **: 15:43:35.843: gtk_box_gadget_distribute: assertion 'size >= 0' failed in GtkScrollbar
11:43:35 
11:43:35 (SWT:1468): Gtk-CRITICAL **: 15:43:35.886: gtk_box_gadget_distribute: assertion 'size >= 0' failed in GtkScrollbar
11:43:35 
11:43:35 (SWT:1468): Gtk-CRITICAL **: 15:43:35.905: gtk_box_gadget_distribute: assertion 'size >= 0' failed in GtkScrollbar
11:43:35 
11:43:35 (SWT:1468): Gtk-CRITICAL **: 15:43:35.937: gtk_box_gadget_distribute: assertion 'size >= 0' failed in GtkScrollbar
11:43:36 
11:43:36 (SWT:1468): Gtk-WARNING **: 15:43:36.105: Negative content width -6 (allocation 1, extents 4x3) while allocating gadget (node toolbar, owner GtkToolbar)
11:43:36 
11:43:36 (SWT:1468): Gtk-WARNING **: 15:43:36.865: Negative content width -6 (allocation 1, extents 4x3) while allocating gadget (node toolbar, owner GtkToolbar)
11:43:36 
11:43:36 (SWT:1468): Gtk-WARNING **: 15:43:36.866: Negative content width -6 (allocation 1, extents 4x3) while allocating gadget (node toolbar, owner GtkToolbar)
11:43:36 
11:43:36 (SWT:1468): Gtk-WARNING **: 15:43:36.879: Negative content width -6 (allocation 1, extents 4x3) while allocating gadget (node toolbar, owner GtkToolbar)
11:43:36 
11:43:36 (SWT:1468): Gtk-CRITICAL **: 15:43:36.901: gtk_box_gadget_distribute: assertion 'size >= 0' failed in GtkScrollbar
11:43:36 
11:43:36 (SWT:1468): Gtk-CRITICAL **: 15:43:36.916: gtk_box_gadget_distribute: assertion 'size >= 0' failed in GtkScrollbar
11:43:36 
11:43:36 (SWT:1468): Gtk-CRITICAL **: 15:43:36.933: gtk_box_gadget_distribute: assertion 'size >= 0' failed in GtkScrollbar
11:43:36 
11:43:36 (SWT:1468): Gtk-CRITICAL **: 15:43:36.949: gtk_box_gadget_distribute: assertion 'size >= 0' failed in GtkScrollbar
11:43:36 
11:43:36 (SWT:1468): Gtk-CRITICAL **: 15:43:36.966: gtk_box_gadget_distribute: assertion 'size >= 0' failed in GtkScrollbar
11:43:36 
11:43:36 (SWT:1468): Gtk-CRITICAL **: 15:43:36.983: gtk_box_gadget_distribute: assertion 'size >= 0' failed in GtkScrollbar
11:43:37 
11:43:37 (SWT:1468): Gtk-WARNING **: 15:43:37.016: Negative content width -6 (allocation 1, extents 4x3) while allocating gadget (node toolbar, owner GtkToolbar)
11:43:37 
11:43:37 (SWT:1468): Gtk-CRITICAL **: 15:43:37.082: gtk_box_gadget_distribute: assertion 'size >= 0' failed in GtkScrollbar
11:43:37 
11:43:37 (SWT:1468): Gtk-CRITICAL **: 15:43:37.099: gtk_box_gadget_distribute: assertion 'size >= 0' failed in GtkScrollbar
11:43:37 
11:43:37 (SWT:1468): Gtk-CRITICAL **: 15:43:37.104: gtk_box_gadget_distribute: assertion 'size >= 0' failed in GtkScrollbar
11:43:37 
11:43:37 (SWT:1468): Gtk-WARNING **: 15:43:37.106: Negative content width -6 (allocation 1, extents 4x3) while allocating gadget (node toolbar, owner GtkToolbar)
11:43:37 
11:43:37 (SWT:1468): Gtk-WARNING **: 15:43:37.141: Negative content width -6 (allocation 1, extents 4x3) while allocating gadget (node toolbar, owner GtkToolbar)
11:43:37 
11:43:37 (SWT:1468): Gtk-CRITICAL **: 15:43:37.222: gtk_box_gadget_distribute: assertion 'size >= 0' failed in GtkScrollbar
11:43:37 
11:43:37 (SWT:1468): Gtk-CRITICAL **: 15:43:37.226: gtk_box_gadget_distribute: assertion 'size >= 0' failed in GtkScrollbar
11:43:37 
11:43:37 (SWT:1468): Gtk-WARNING **: 15:43:37.229: Negative content width -6 (allocation 1, extents 4x3) while allocating gadget (node toolbar, owner GtkToolbar)
11:43:37 
11:43:37 (SWT:1468): Gtk-CRITICAL **: 15:43:37.242: gtk_box_gadget_distribute: assertion 'size >= 0' failed in GtkScrollbar
11:43:37 
11:43:37 (SWT:1468): Gtk-CRITICAL **: 15:43:37.247: gtk_box_gadget_distribute: assertion 'size >= 0' failed in GtkScrollbar
11:43:37 
11:43:37 (SWT:1468): Gtk-WARNING **: 15:43:37.275: Negative content width -6 (allocation 1, extents 4x3) while allocating gadget (node toolbar, owner GtkToolbar)
11:43:37 
11:43:37 (SWT:1468): Gtk-CRITICAL **: 15:43:37.394: gtk_box_gadget_distribute: assertion 'size >= 0' failed in GtkScrollbar
11:43:37 
11:43:37 (SWT:1468): Gtk-WARNING **: 15:43:37.400: Negative content width -6 (allocation 1, extents 4x3) while allocating gadget (node toolbar, owner GtkToolbar)
11:43:37 
11:43:37 (SWT:1468): Gtk-WARNING **: 15:43:37.433: Negative content width -6 (allocation 1, extents 4x3) while allocating gadget (node toolbar, owner GtkToolbar)
11:43:37 
11:43:37 (SWT:1468): Gtk-CRITICAL **: 15:43:37.515: gtk_box_gadget_distribute: assertion 'size >= 0' failed in GtkScrollbar
11:43:37 
11:43:37 (SWT:1468): Gtk-WARNING **: 15:43:37.521: Negative content width -6 (allocation 1, extents 4x3) while allocating gadget (node toolbar, owner GtkToolbar)
11:43:37 
11:43:37 (SWT:1468): Gtk-WARNING **: 15:43:37.553: Negative content width -6 (allocation 1, extents 4x3) while allocating gadget (node toolbar, owner GtkToolbar)
11:43:37 
11:43:37 (SWT:1468): Gtk-WARNING **: 15:43:37.676: Negative content width -6 (allocation 1, extents 4x3) while allocating gadget (node toolbar, owner GtkToolbar)
11:43:37 
11:43:37 (SWT:1468): Gtk-WARNING **: 15:43:37.711: Negative content width -6 (allocation 1, extents 4x3) while allocating gadget (node toolbar, owner GtkToolbar)
11:43:37 
11:43:37 (SWT:1468): Gtk-WARNING **: 15:43:37.837: Negative content width -6 (allocation 1, extents 4x3) while allocating gadget (node toolbar, owner GtkToolbar)
11:43:37 
11:43:37 (SWT:1468): Gtk-WARNING **: 15:43:37.889: Negative content width -6 (allocation 1, extents 4x3) while allocating gadget (node toolbar, owner GtkToolbar)
11:43:37 
11:43:37 (SWT:1468): Gtk-WARNING **: 15:43:37.981: Negative content width -6 (allocation 1, extents 4x3) while allocating gadget (node toolbar, owner GtkToolbar)
11:43:38 
11:43:38 (SWT:1468): Gtk-WARNING **: 15:43:38.016: Negative content width -6 (allocation 1, extents 4x3) while allocating gadget (node toolbar, owner GtkToolbar)
11:43:38 
11:43:38 (SWT:1468): Gtk-WARNING **: 15:43:38.106: Negative content width -6 (allocation 1, extents 4x3) while allocating gadget (node toolbar, owner GtkToolbar)
11:43:38 
11:43:38 (SWT:1468): Gtk-WARNING **: 15:43:38.153: Negative content width -6 (allocation 1, extents 4x3) while allocating gadget (node toolbar, owner GtkToolbar)
11:43:38 
11:43:38 (SWT:1468): Gtk-WARNING **: 15:43:38.243: Negative content width -6 (allocation 1, extents 4x3) while allocating gadget (node toolbar, owner GtkToolbar)
11:43:38 
11:43:38 (SWT:1468): Gtk-WARNING **: 15:43:38.294: Negative content width -6 (allocation 1, extents 4x3) while allocating gadget (node toolbar, owner GtkToolbar)
11:43:39 
11:43:39 (SWT:1468): Gtk-WARNING **: 15:43:39.157: Negative content width -6 (allocation 1, extents 4x3) while allocating gadget (node toolbar, owner GtkToolbar)
11:43:39 
11:43:39 (SWT:1468): Gtk-WARNING **: 15:43:39.158: Negative content width -6 (allocation 1, extents 4x3) while allocating gadget (node toolbar, owner GtkToolbar)
11:43:39 
11:43:39 (SWT:1468): Gtk-WARNING **: 15:43:39.170: Negative content width -6 (allocation 1, extents 4x3) while allocating gadget (node toolbar, owner GtkToolbar)
11:43:39 
11:43:39 (SWT:1468): Gtk-CRITICAL **: 15:43:39.189: gtk_box_gadget_distribute: assertion 'size >= 0' failed in GtkScrollbar
11:43:39 
11:43:39 (SWT:1468): Gtk-CRITICAL **: 15:43:39.218: gtk_box_gadget_distribute: assertion 'size >= 0' failed in GtkScrollbar
11:43:39 
11:43:39 (SWT:1468): Gtk-CRITICAL **: 15:43:39.234: gtk_box_gadget_distribute: assertion 'size >= 0' failed in GtkScrollbar
11:43:39 
11:43:39 (SWT:1468): Gtk-CRITICAL **: 15:43:39.251: gtk_box_gadget_distribute: assertion 'size >= 0' failed in GtkScrollbar
11:43:39 
11:43:39 (SWT:1468): Gtk-CRITICAL **: 15:43:39.267: gtk_box_gadget_distribute: assertion 'size >= 0' failed in GtkScrollbar
11:43:39 
11:43:39 (SWT:1468): Gtk-CRITICAL **: 15:43:39.291: gtk_box_gadget_distribute: assertion 'size >= 0' failed in GtkScrollbar
11:43:39 
11:43:39 (SWT:1468): Gtk-CRITICAL **: 15:43:39.301: gtk_box_gadget_distribute: assertion 'size >= 0' failed in GtkScrollbar
11:43:39 
11:43:39 (SWT:1468): Gtk-CRITICAL **: 15:43:39.317: gtk_box_gadget_distribute: assertion 'size >= 0' failed in GtkScrollbar
11:43:39 
11:43:39 (SWT:1468): Gtk-CRITICAL **: 15:43:39.334: gtk_box_gadget_distribute: assertion 'size >= 0' failed in GtkScrollbar
11:43:39 
11:43:39 (SWT:1468): Gtk-CRITICAL **: 15:43:39.351: gtk_box_gadget_distribute: assertion 'size >= 0' failed in GtkScrollbar
11:43:39 
11:43:39 (SWT:1468): Gtk-CRITICAL **: 15:43:39.367: gtk_box_gadget_distribute: assertion 'size >= 0' failed in GtkScrollbar
11:43:39 
11:43:39 (SWT:1468): Gtk-CRITICAL **: 15:43:39.385: gtk_box_gadget_distribute: assertion 'size >= 0' failed in GtkScrollbar
11:43:39 
11:43:39 (SWT:1468): Gtk-WARNING **: 15:43:39.404: Negative content width -6 (allocation 1, extents 4x3) while allocating gadget (node toolbar, owner GtkToolbar)
11:43:39 
11:43:39 (SWT:1468): Gtk-WARNING **: 15:43:39.404: Negative content height -3 (allocation 1, extents 2x2) while allocating gadget (node toolbar, owner GtkToolbar)
11:43:39 
11:43:39 (SWT:1468): Gtk-WARNING **: 15:43:39.404: Negative content width -6 (allocation 1, extents 4x3) while allocating gadget (node toolbar, owner GtkToolbar)
11:43:39 
11:43:39 (SWT:1468): Gtk-WARNING **: 15:43:39.404: Negative content height -3 (allocation 1, extents 2x2) while allocating gadget (node toolbar, owner GtkToolbar)
11:43:39 
11:43:39 (SWT:1468): Gtk-CRITICAL **: 15:43:39.452: gtk_box_gadget_distribute: assertion 'size >= 0' failed in GtkScrollbar
11:43:39 
11:43:39 (SWT:1468): Gtk-WARNING **: 15:43:39.547: Negative content width -6 (allocation 1, extents 4x3) while allocating gadget (node toolbar, owner GtkToolbar)
11:43:39 Tests run: 13, Failures: 0, Errors: 0, Skipped: 1, Time elapsed: 19.285 s - in org.eclipse.egit.ui.test.history.HistoryViewTest
11:43:39 testShowAllBranches(org.eclipse.egit.ui.test.history.HistoryViewTest)  Time elapsed: 1.961 s
11:43:39 testOpenHistoryOnFileFolderFilter(org.eclipse.egit.ui.test.history.HistoryViewTest)  Time elapsed: 1.925 s
11:43:39 testCheckOut(org.eclipse.egit.ui.test.history.HistoryViewTest)  Time elapsed: 1.151 s
11:43:39 testOpenHistoryOnProject(org.eclipse.egit.ui.test.history.HistoryViewTest)  Time elapsed: 0.929 s
11:43:39 testRevertFailure(org.eclipse.egit.ui.test.history.HistoryViewTest)  Time elapsed: 1.763 s
11:43:39 testRebaseAlreadyUpToDate(org.eclipse.egit.ui.test.history.HistoryViewTest) skipped
11:43:39 testAddBranch(org.eclipse.egit.ui.test.history.HistoryViewTest)  Time elapsed: 1.545 s
11:43:39 testAddCommit(org.eclipse.egit.ui.test.history.HistoryViewTest)  Time elapsed: 1.47 s
11:43:39 testOpenHistoryOnFileProjectFilter(org.eclipse.egit.ui.test.history.HistoryViewTest)  Time elapsed: 1.94 s
11:43:39 testOpenHistoryOnFileRepoFilter(org.eclipse.egit.ui.test.history.HistoryViewTest)  Time elapsed: 1.915 s
11:43:39 testAddTag(org.eclipse.egit.ui.test.history.HistoryViewTest)  Time elapsed: 1.209 s
11:43:39 testOpenHistoryOnFileNoFilter(org.eclipse.egit.ui.test.history.HistoryViewTest)  Time elapsed: 2.223 s
11:43:39 testOpenOfDeletedFile(org.eclipse.egit.ui.test.history.HistoryViewTest)  Time elapsed: 1.22 s
11:43:39 Running org.eclipse.egit.ui.test.trace.TraceConfigurationDialogTest
11:43:39 
11:43:39 (SWT:1468): Gtk-CRITICAL **: 15:43:39.733: gtk_box_gadget_distribute: assertion 'size >= 0' failed in GtkScrollbar
11:43:39 
11:43:39 (SWT:1468): Gtk-CRITICAL **: 15:43:39.787: gtk_box_gadget_distribute: assertion 'size >= 0' failed in GtkScrollbar
11:43:39 
11:43:39 (SWT:1468): Gtk-CRITICAL **: 15:43:39.843: gtk_box_gadget_distribute: assertion 'size >= 0' failed in GtkScrollbar
11:43:39 
11:43:39 (SWT:1468): Gtk-CRITICAL **: 15:43:39.899: gtk_box_gadget_distribute: assertion 'size >= 0' failed in GtkScrollbar
11:43:39 
11:43:39 (SWT:1468): Gtk-CRITICAL **: 15:43:39.954: gtk_box_gadget_distribute: assertion 'size >= 0' failed in GtkScrollbar
11:43:40 
11:43:40 (SWT:1468): Gtk-CRITICAL **: 15:43:40.013: gtk_box_gadget_distribute: assertion 'size >= 0' failed in GtkScrollbar
11:43:40 Tests run: 2, Failures: 0, Errors: 0, Skipped: 0, Time elapsed: 0.359 s - in org.eclipse.egit.ui.test.trace.TraceConfigurationDialogTest
11:43:40 testMainSwitch(org.eclipse.egit.ui.test.trace.TraceConfigurationDialogTest)  Time elapsed: 0.176 s
11:43:40 testTreeNode(org.eclipse.egit.ui.test.trace.TraceConfigurationDialogTest)  Time elapsed: 0.181 s
11:43:40 Running org.eclipse.egit.ui.internal.dialogs.HyperlinkTokenScannerTest
11:43:40 Tests run: 10, Failures: 0, Errors: 0, Skipped: 0, Time elapsed: 0.241 s - in org.eclipse.egit.ui.internal.dialogs.HyperlinkTokenScannerTest
11:43:40 tokenizeEmbeddedHyperlink(org.eclipse.egit.ui.internal.dialogs.HyperlinkTokenScannerTest)  Time elapsed: 0.003 s
11:43:40 tokenizeWithFailingDetector(org.eclipse.egit.ui.internal.dialogs.HyperlinkTokenScannerTest)  Time elapsed: 0 s
11:43:40 tokenizeWithoutDetectors(org.eclipse.egit.ui.internal.dialogs.HyperlinkTokenScannerTest)  Time elapsed: 0 s
11:43:40 tokenizeHyperlinksOutsideRegion(org.eclipse.egit.ui.internal.dialogs.HyperlinkTokenScannerTest)  Time elapsed: 0.001 s
11:43:40 tokenizeMultipleHyperlinksSimple(org.eclipse.egit.ui.internal.dialogs.HyperlinkTokenScannerTest)  Time elapsed: 0 s
11:43:40 tokenizeMultipleHyperlinksMultiline(org.eclipse.egit.ui.internal.dialogs.HyperlinkTokenScannerTest)  Time elapsed: 0.001 s
11:43:40 tokenizeLeadingHyperlink(org.eclipse.egit.ui.internal.dialogs.HyperlinkTokenScannerTest)  Time elapsed: 0 s
11:43:40 tokenizeEmpty(org.eclipse.egit.ui.internal.dialogs.HyperlinkTokenScannerTest)  Time elapsed: 0 s
11:43:40 tokenizeHyperlinksCutByRegion(org.eclipse.egit.ui.internal.dialogs.HyperlinkTokenScannerTest)  Time elapsed: 0.001 s
11:43:40 tokenizeNoHyperlinks(org.eclipse.egit.ui.internal.dialogs.HyperlinkTokenScannerTest)  Time elapsed: 0.001 s
11:43:40 Running org.eclipse.egit.ui.internal.dialogs.CommitMessageComponentTest
11:43:40 Tests run: 5, Failures: 0, Errors: 0, Skipped: 0, Time elapsed: 0.001 s - in org.eclipse.egit.ui.internal.dialogs.CommitMessageComponentTest
11:43:40 commitFormat_MultipleLines_notOk2(org.eclipse.egit.ui.internal.dialogs.CommitMessageComponentTest)  Time elapsed: 0 s
11:43:40 commitFormat_simple(org.eclipse.egit.ui.internal.dialogs.CommitMessageComponentTest)  Time elapsed: 0 s
11:43:40 commitFormat_MultipleLines_ok(org.eclipse.egit.ui.internal.dialogs.CommitMessageComponentTest)  Time elapsed: 0 s
11:43:40 commitFormat_trailingWhitespace_ok(org.eclipse.egit.ui.internal.dialogs.CommitMessageComponentTest)  Time elapsed: 0 s
11:43:40 commitFormat_MultipleLines_notOk(org.eclipse.egit.ui.internal.dialogs.CommitMessageComponentTest)  Time elapsed: 0 s
11:43:40 Running org.eclipse.egit.ui.internal.dialogs.CommitMessageBuilderTest
11:43:40 
11:43:40 !ENTRY org.eclipse.egit.ui 4 0 2019-03-24 15:43:40.439
11:43:40 !MESSAGE CrashingCommitMessageProvider fails on purpose.
11:43:40 !STACK 0
11:43:40 java.lang.IllegalStateException: CrashingCommitMessageProvider fails on purpose.
11:43:40 	at org.eclipse.egit.ui.internal.dialogs.CommitMessageBuilderTest$CrashingCommitMessageProvider.getMessage(CommitMessageBuilderTest.java:474)
11:43:40 	at org.eclipse.egit.ui.internal.dialogs.CommitMessageBuilder.build(CommitMessageBuilder.java:90)
11:43:40 	at org.eclipse.egit.ui.internal.dialogs.CommitMessageBuilderTest.commitMessageProvider_oneCrashingProvider(CommitMessageBuilderTest.java:99)
11:43:40 	at sun.reflect.NativeMethodAccessorImpl.invoke0(Native Method)
11:43:40 	at sun.reflect.NativeMethodAccessorImpl.invoke(NativeMethodAccessorImpl.java:62)
11:43:40 	at sun.reflect.DelegatingMethodAccessorImpl.invoke(DelegatingMethodAccessorImpl.java:43)
11:43:40 	at java.lang.reflect.Method.invoke(Method.java:498)
11:43:40 	at org.junit.runners.model.FrameworkMethod$1.runReflectiveCall(FrameworkMethod.java:50)
11:43:40 	at org.junit.internal.runners.model.ReflectiveCallable.run(ReflectiveCallable.java:12)
11:43:40 	at org.junit.runners.model.FrameworkMethod.invokeExplosively(FrameworkMethod.java:47)
11:43:40 	at org.junit.internal.runners.statements.InvokeMethod.evaluate(InvokeMethod.java:17)
11:43:40 	at org.junit.internal.runners.statements.RunBefores.evaluate(RunBefores.java:26)
11:43:40 	at org.junit.internal.runners.statements.RunAfters.evaluate(RunAfters.java:27)
11:43:40 	at org.junit.runners.ParentRunner.runLeaf(ParentRunner.java:325)
11:43:40 	at org.junit.runners.BlockJUnit4ClassRunner.runChild(BlockJUnit4ClassRunner.java:78)
11:43:40 	at org.junit.runners.BlockJUnit4ClassRunner.runChild(BlockJUnit4ClassRunner.java:57)
11:43:40 	at org.junit.runners.ParentRunner$3.run(ParentRunner.java:290)
11:43:40 	at org.junit.runners.ParentRunner$1.schedule(ParentRunner.java:71)
11:43:40 	at org.junit.runners.ParentRunner.runChildren(ParentRunner.java:288)
11:43:40 	at org.junit.runners.ParentRunner.access$000(ParentRunner.java:58)
11:43:40 	at org.junit.runners.ParentRunner$2.evaluate(ParentRunner.java:268)
11:43:40 	at org.junit.internal.runners.statements.RunBefores.evaluate(RunBefores.java:26)
11:43:40 	at org.junit.runners.ParentRunner.run(ParentRunner.java:363)
11:43:40 	at org.apache.maven.surefire.junit4.JUnit4Provider.execute(JUnit4Provider.java:365)
11:43:40 	at org.apache.maven.surefire.junit4.JUnit4Provider.executeWithRerun(JUnit4Provider.java:273)
11:43:40 	at org.apache.maven.surefire.junit4.JUnit4Provider.executeTestSet(JUnit4Provider.java:238)
11:43:40 	at org.apache.maven.surefire.junit4.JUnit4Provider.invoke(JUnit4Provider.java:159)
11:43:40 	at sun.reflect.NativeMethodAccessorImpl.invoke0(Native Method)
11:43:40 	at sun.reflect.NativeMethodAccessorImpl.invoke(NativeMethodAccessorImpl.java:62)
11:43:40 	at sun.reflect.DelegatingMethodAccessorImpl.invoke(DelegatingMethodAccessorImpl.java:43)
11:43:40 	at java.lang.reflect.Method.invoke(Method.java:498)
11:43:40 	at org.apache.maven.surefire.util.ReflectionUtils.invokeMethodWithArray2(ReflectionUtils.java:206)
11:43:40 	at org.apache.maven.surefire.booter.ProviderFactory$ProviderProxy.invoke(ProviderFactory.java:161)
11:43:40 	at org.apache.maven.surefire.booter.ProviderFactory.invokeProvider(ProviderFactory.java:84)
11:43:40 	at org.eclipse.tycho.surefire.osgibooter.OsgiSurefireBooter.run(OsgiSurefireBooter.java:110)
11:43:40 	at org.eclipse.tycho.surefire.osgibooter.AbstractUITestApplication.runTests(AbstractUITestApplication.java:44)
11:43:40 	at org.eclipse.e4.ui.internal.workbench.swt.E4Testable$1.run(E4Testable.java:73)
11:43:40 	at java.lang.Thread.run(Thread.java:748)
11:43:40 
11:43:40 !ENTRY org.eclipse.egit.ui 4 0 2019-03-24 15:43:40.640
11:43:40 !MESSAGE CrashingCommitMessageProviderWithCaretPositioning fails on purpose.
11:43:40 !STACK 0
11:43:40 java.lang.IllegalStateException: CrashingCommitMessageProviderWithCaretPositioning fails on purpose.
11:43:40 	at org.eclipse.egit.ui.internal.dialogs.CommitMessageBuilderTest$CrashingCommitMessageProviderWithCaretPositioning.getCommitMessageWithPosition(CommitMessageBuilderTest.java:491)
11:43:40 	at org.eclipse.egit.ui.internal.dialogs.CommitMessageBuilder.build(CommitMessageBuilder.java:81)
11:43:40 	at org.eclipse.egit.ui.internal.dialogs.CommitMessageBuilderTest.commitMessageProvider_oneCrashingProviderWithCaretPosition(CommitMessageBuilderTest.java:112)
11:43:40 	at sun.reflect.NativeMethodAccessorImpl.invoke0(Native Method)
11:43:40 	at sun.reflect.NativeMethodAccessorImpl.invoke(NativeMethodAccessorImpl.java:62)
11:43:40 	at sun.reflect.DelegatingMethodAccessorImpl.invoke(DelegatingMethodAccessorImpl.java:43)
11:43:40 	at java.lang.reflect.Method.invoke(Method.java:498)
11:43:40 	at org.junit.runners.model.FrameworkMethod$1.runReflectiveCall(FrameworkMethod.java:50)
11:43:40 	at org.junit.internal.runners.model.ReflectiveCallable.run(ReflectiveCallable.java:12)
11:43:40 	at org.junit.runners.model.FrameworkMethod.invokeExplosively(FrameworkMethod.java:47)
11:43:40 	at org.junit.internal.runners.statements.InvokeMethod.evaluate(InvokeMethod.java:17)
11:43:40 	at org.junit.internal.runners.statements.RunBefores.evaluate(RunBefores.java:26)
11:43:40 	at org.junit.internal.runners.statements.RunAfters.evaluate(RunAfters.java:27)
11:43:40 	at org.junit.runners.ParentRunner.runLeaf(ParentRunner.java:325)
11:43:40 	at org.junit.runners.BlockJUnit4ClassRunner.runChild(BlockJUnit4ClassRunner.java:78)
11:43:40 	at org.junit.runners.BlockJUnit4ClassRunner.runChild(BlockJUnit4ClassRunner.java:57)
11:43:40 	at org.junit.runners.ParentRunner$3.run(ParentRunner.java:290)
11:43:40 	at org.junit.runners.ParentRunner$1.schedule(ParentRunner.java:71)
11:43:40 	at org.junit.runners.ParentRunner.runChildren(ParentRunner.java:288)
11:43:40 	at org.junit.runners.ParentRunner.access$000(ParentRunner.java:58)
11:43:40 	at org.junit.runners.ParentRunner$2.evaluate(ParentRunner.java:268)
11:43:40 	at org.junit.internal.runners.statements.RunBefores.evaluate(RunBefores.java:26)
11:43:40 	at org.junit.runners.ParentRunner.run(ParentRunner.java:363)
11:43:40 	at org.apache.maven.surefire.junit4.JUnit4Provider.execute(JUnit4Provider.java:365)
11:43:40 	at org.apache.maven.surefire.junit4.JUnit4Provider.executeWithRerun(JUnit4Provider.java:273)
11:43:40 	at org.apache.maven.surefire.junit4.JUnit4Provider.executeTestSet(JUnit4Provider.java:238)
11:43:40 	at org.apache.maven.surefire.junit4.JUnit4Provider.invoke(JUnit4Provider.java:159)
11:43:40 	at sun.reflect.NativeMethodAccessorImpl.invoke0(Native Method)
11:43:40 	at sun.reflect.NativeMethodAccessorImpl.invoke(NativeMethodAccessorImpl.java:62)
11:43:40 	at sun.reflect.DelegatingMethodAccessorImpl.invoke(DelegatingMethodAccessorImpl.java:43)
11:43:40 	at java.lang.reflect.Method.invoke(Method.java:498)
11:43:40 	at org.apache.maven.surefire.util.ReflectionUtils.invokeMethodWithArray2(ReflectionUtils.java:206)
11:43:40 	at org.apache.maven.surefire.booter.ProviderFactory$ProviderProxy.invoke(ProviderFactory.java:161)
11:43:40 	at org.apache.maven.surefire.booter.ProviderFactory.invokeProvider(ProviderFactory.java:84)
11:43:40 	at org.eclipse.tycho.surefire.osgibooter.OsgiSurefireBooter.run(OsgiSurefireBooter.java:110)
11:43:40 	at org.eclipse.tycho.surefire.osgibooter.AbstractUITestApplication.runTests(AbstractUITestApplication.java:44)
11:43:40 	at org.eclipse.e4.ui.internal.workbench.swt.E4Testable$1.run(E4Testable.java:73)
11:43:40 	at java.lang.Thread.run(Thread.java:748)
11:43:40 
11:43:40 !ENTRY org.eclipse.egit.ui 4 0 2019-03-24 15:43:40.726
11:43:40 !MESSAGE CrashingCommitMessageProvider fails on purpose.
11:43:40 !STACK 0
11:43:40 java.lang.IllegalStateException: CrashingCommitMessageProvider fails on purpose.
11:43:40 	at org.eclipse.egit.ui.internal.dialogs.CommitMessageBuilderTest$CrashingCommitMessageProvider.getMessage(CommitMessageBuilderTest.java:474)
11:43:40 	at org.eclipse.egit.ui.internal.dialogs.CommitMessageBuilder.build(CommitMessageBuilder.java:90)
11:43:40 	at org.eclipse.egit.ui.internal.dialogs.CommitMessageBuilderTest.commitMessageProvider_twoProvidersFirstOneCrashing(CommitMessageBuilderTest.java:146)
11:43:40 	at sun.reflect.NativeMethodAccessorImpl.invoke0(Native Method)
11:43:40 	at sun.reflect.NativeMethodAccessorImpl.invoke(NativeMethodAccessorImpl.java:62)
11:43:40 	at sun.reflect.DelegatingMethodAccessorImpl.invoke(DelegatingMethodAccessorImpl.java:43)
11:43:40 	at java.lang.reflect.Method.invoke(Method.java:498)
11:43:40 	at org.junit.runners.model.FrameworkMethod$1.runReflectiveCall(FrameworkMethod.java:50)
11:43:40 	at org.junit.internal.runners.model.ReflectiveCallable.run(ReflectiveCallable.java:12)
11:43:40 	at org.junit.runners.model.FrameworkMethod.invokeExplosively(FrameworkMethod.java:47)
11:43:40 	at org.junit.internal.runners.statements.InvokeMethod.evaluate(InvokeMethod.java:17)
11:43:40 	at org.junit.internal.runners.statements.RunBefores.evaluate(RunBefores.java:26)
11:43:40 	at org.junit.internal.runners.statements.RunAfters.evaluate(RunAfters.java:27)
11:43:40 	at org.junit.runners.ParentRunner.runLeaf(ParentRunner.java:325)
11:43:40 	at org.junit.runners.BlockJUnit4ClassRunner.runChild(BlockJUnit4ClassRunner.java:78)
11:43:40 	at org.junit.runners.BlockJUnit4ClassRunner.runChild(BlockJUnit4ClassRunner.java:57)
11:43:40 	at org.junit.runners.ParentRunner$3.run(ParentRunner.java:290)
11:43:40 	at org.junit.runners.ParentRunner$1.schedule(ParentRunner.java:71)
11:43:40 	at org.junit.runners.ParentRunner.runChildren(ParentRunner.java:288)
11:43:40 	at org.junit.runners.ParentRunner.access$000(ParentRunner.java:58)
11:43:40 	at org.junit.runners.ParentRunner$2.evaluate(ParentRunner.java:268)
11:43:40 	at org.junit.internal.runners.statements.RunBefores.evaluate(RunBefores.java:26)
11:43:40 	at org.junit.runners.ParentRunner.run(ParentRunner.java:363)
11:43:40 	at org.apache.maven.surefire.junit4.JUnit4Provider.execute(JUnit4Provider.java:365)
11:43:40 	at org.apache.maven.surefire.junit4.JUnit4Provider.executeWithRerun(JUnit4Provider.java:273)
11:43:40 	at org.apache.maven.surefire.junit4.JUnit4Provider.executeTestSet(JUnit4Provider.java:238)
11:43:40 	at org.apache.maven.surefire.junit4.JUnit4Provider.invoke(JUnit4Provider.java:159)
11:43:40 	at sun.reflect.NativeMethodAccessorImpl.invoke0(Native Method)
11:43:40 	at sun.reflect.NativeMethodAccessorImpl.invoke(NativeMethodAccessorImpl.java:62)
11:43:40 	at sun.reflect.DelegatingMethodAccessorImpl.invoke(DelegatingMethodAccessorImpl.java:43)
11:43:40 	at java.lang.reflect.Method.invoke(Method.java:498)
11:43:40 	at org.apache.maven.surefire.util.ReflectionUtils.invokeMethodWithArray2(ReflectionUtils.java:206)
11:43:40 	at org.apache.maven.surefire.booter.ProviderFactory$ProviderProxy.invoke(ProviderFactory.java:161)
11:43:40 	at org.apache.maven.surefire.booter.ProviderFactory.invokeProvider(ProviderFactory.java:84)
11:43:40 	at org.eclipse.tycho.surefire.osgibooter.OsgiSurefireBooter.run(OsgiSurefireBooter.java:110)
11:43:40 	at org.eclipse.tycho.surefire.osgibooter.AbstractUITestApplication.runTests(AbstractUITestApplication.java:44)
11:43:40 	at org.eclipse.e4.ui.internal.workbench.swt.E4Testable$1.run(E4Testable.java:73)
11:43:40 	at java.lang.Thread.run(Thread.java:748)
11:43:41 
11:43:41 !ENTRY org.eclipse.egit.ui 4 0 2019-03-24 15:43:41.995
11:43:41 !MESSAGE CrashingCommitMessageProvider fails on purpose.
11:43:41 !STACK 0
11:43:41 java.lang.IllegalStateException: CrashingCommitMessageProvider fails on purpose.
11:43:41 	at org.eclipse.egit.ui.internal.dialogs.CommitMessageBuilderTest$CrashingCommitMessageProvider.getMessage(CommitMessageBuilderTest.java:474)
11:43:41 	at org.eclipse.egit.ui.internal.dialogs.CommitMessageBuilder.build(CommitMessageBuilder.java:90)
11:43:41 	at org.eclipse.egit.ui.internal.dialogs.CommitMessageBuilderTest.commitMessageProvider_multipleProvidersWithCrashAndNull(CommitMessageBuilderTest.java:165)
11:43:41 	at sun.reflect.NativeMethodAccessorImpl.invoke0(Native Method)
11:43:41 	at sun.reflect.NativeMethodAccessorImpl.invoke(NativeMethodAccessorImpl.java:62)
11:43:41 	at sun.reflect.DelegatingMethodAccessorImpl.invoke(DelegatingMethodAccessorImpl.java:43)
11:43:41 	at java.lang.reflect.Method.invoke(Method.java:498)
11:43:41 	at org.junit.runners.model.FrameworkMethod$1.runReflectiveCall(FrameworkMethod.java:50)
11:43:41 	at org.junit.internal.runners.model.ReflectiveCallable.run(ReflectiveCallable.java:12)
11:43:41 	at org.junit.runners.model.FrameworkMethod.invokeExplosively(FrameworkMethod.java:47)
11:43:41 	at org.junit.internal.runners.statements.InvokeMethod.evaluate(InvokeMethod.java:17)
11:43:41 	at org.junit.internal.runners.statements.RunBefores.evaluate(RunBefores.java:26)
11:43:41 	at org.junit.internal.runners.statements.RunAfters.evaluate(RunAfters.java:27)
11:43:41 	at org.junit.runners.ParentRunner.runLeaf(ParentRunner.java:325)
11:43:41 	at org.junit.runners.BlockJUnit4ClassRunner.runChild(BlockJUnit4ClassRunner.java:78)
11:43:41 	at org.junit.runners.BlockJUnit4ClassRunner.runChild(BlockJUnit4ClassRunner.java:57)
11:43:41 	at org.junit.runners.ParentRunner$3.run(ParentRunner.java:290)
11:43:41 	at org.junit.runners.ParentRunner$1.schedule(ParentRunner.java:71)
11:43:41 	at org.junit.runners.ParentRunner.runChildren(ParentRunner.java:288)
11:43:41 	at org.junit.runners.ParentRunner.access$000(ParentRunner.java:58)
11:43:41 	at org.junit.runners.ParentRunner$2.evaluate(ParentRunner.java:268)
11:43:41 	at org.junit.internal.runners.statements.RunBefores.evaluate(RunBefores.java:26)
11:43:41 	at org.junit.runners.ParentRunner.run(ParentRunner.java:363)
11:43:41 	at org.apache.maven.surefire.junit4.JUnit4Provider.execute(JUnit4Provider.java:365)
11:43:41 	at org.apache.maven.surefire.junit4.JUnit4Provider.executeWithRerun(JUnit4Provider.java:273)
11:43:41 	at org.apache.maven.surefire.junit4.JUnit4Provider.executeTestSet(JUnit4Provider.java:238)
11:43:41 	at org.apache.maven.surefire.junit4.JUnit4Provider.invoke(JUnit4Provider.java:159)
11:43:41 	at sun.reflect.NativeMethodAccessorImpl.invoke0(Native Method)
11:43:41 	at sun.reflect.NativeMethodAccessorImpl.invoke(NativeMethodAccessorImpl.java:62)
11:43:41 	at sun.reflect.DelegatingMethodAccessorImpl.invoke(DelegatingMethodAccessorImpl.java:43)
11:43:41 	at java.lang.reflect.Method.invoke(Method.java:498)
11:43:41 	at org.apache.maven.surefire.util.ReflectionUtils.invokeMethodWithArray2(ReflectionUtils.java:206)
11:43:41 	at org.apache.maven.surefire.booter.ProviderFactory$ProviderProxy.invoke(ProviderFactory.java:161)
11:43:41 	at org.apache.maven.surefire.booter.ProviderFactory.invokeProvider(ProviderFactory.java:84)
11:43:41 	at org.eclipse.tycho.surefire.osgibooter.OsgiSurefireBooter.run(OsgiSurefireBooter.java:110)
11:43:41 	at org.eclipse.tycho.surefire.osgibooter.AbstractUITestApplication.runTests(AbstractUITestApplication.java:44)
11:43:41 	at org.eclipse.e4.ui.internal.workbench.swt.E4Testable$1.run(E4Testable.java:73)
11:43:41 	at java.lang.Thread.run(Thread.java:748)
11:43:41 
11:43:41 !ENTRY org.eclipse.egit.ui 4 0 2019-03-24 15:43:41.996
11:43:41 !MESSAGE CrashingCommitMessageProvider fails on purpose.
11:43:41 !STACK 0
11:43:41 java.lang.IllegalStateException: CrashingCommitMessageProvider fails on purpose.
11:43:41 	at org.eclipse.egit.ui.internal.dialogs.CommitMessageBuilderTest$CrashingCommitMessageProvider.getMessage(CommitMessageBuilderTest.java:474)
11:43:41 	at org.eclipse.egit.ui.internal.dialogs.CommitMessageBuilder.build(CommitMessageBuilder.java:90)
11:43:41 	at org.eclipse.egit.ui.internal.dialogs.CommitMessageBuilderTest.commitMessageProvider_multipleProvidersWithCrashAndNull(CommitMessageBuilderTest.java:165)
11:43:41 	at sun.reflect.NativeMethodAccessorImpl.invoke0(Native Method)
11:43:41 	at sun.reflect.NativeMethodAccessorImpl.invoke(NativeMethodAccessorImpl.java:62)
11:43:41 	at sun.reflect.DelegatingMethodAccessorImpl.invoke(DelegatingMethodAccessorImpl.java:43)
11:43:41 	at java.lang.reflect.Method.invoke(Method.java:498)
11:43:41 	at org.junit.runners.model.FrameworkMethod$1.runReflectiveCall(FrameworkMethod.java:50)
11:43:41 	at org.junit.internal.runners.model.ReflectiveCallable.run(ReflectiveCallable.java:12)
11:43:41 	at org.junit.runners.model.FrameworkMethod.invokeExplosively(FrameworkMethod.java:47)
11:43:41 	at org.junit.internal.runners.statements.InvokeMethod.evaluate(InvokeMethod.java:17)
11:43:41 	at org.junit.internal.runners.statements.RunBefores.evaluate(RunBefores.java:26)
11:43:41 	at org.junit.internal.runners.statements.RunAfters.evaluate(RunAfters.java:27)
11:43:41 	at org.junit.runners.ParentRunner.runLeaf(ParentRunner.java:325)
11:43:41 	at org.junit.runners.BlockJUnit4ClassRunner.runChild(BlockJUnit4ClassRunner.java:78)
11:43:41 	at org.junit.runners.BlockJUnit4ClassRunner.runChild(BlockJUnit4ClassRunner.java:57)
11:43:41 	at org.junit.runners.ParentRunner$3.run(ParentRunner.java:290)
11:43:41 	at org.junit.runners.ParentRunner$1.schedule(ParentRunner.java:71)
11:43:41 	at org.junit.runners.ParentRunner.runChildren(ParentRunner.java:288)
11:43:41 	at org.junit.runners.ParentRunner.access$000(ParentRunner.java:58)
11:43:41 	at org.junit.runners.ParentRunner$2.evaluate(ParentRunner.java:268)
11:43:41 	at org.junit.internal.runners.statements.RunBefores.evaluate(RunBefores.java:26)
11:43:41 	at org.junit.runners.ParentRunner.run(ParentRunner.java:363)
11:43:41 	at org.apache.maven.surefire.junit4.JUnit4Provider.execute(JUnit4Provider.java:365)
11:43:41 	at org.apache.maven.surefire.junit4.JUnit4Provider.executeWithRerun(JUnit4Provider.java:273)
11:43:41 	at org.apache.maven.surefire.junit4.JUnit4Provider.executeTestSet(JUnit4Provider.java:238)
11:43:41 	at org.apache.maven.surefire.junit4.JUnit4Provider.invoke(JUnit4Provider.java:159)
11:43:41 	at sun.reflect.NativeMethodAccessorImpl.invoke0(Native Method)
11:43:41 	at sun.reflect.NativeMethodAccessorImpl.invoke(NativeMethodAccessorImpl.java:62)
11:43:41 	at sun.reflect.DelegatingMethodAccessorImpl.invoke(DelegatingMethodAccessorImpl.java:43)
11:43:41 	at java.lang.reflect.Method.invoke(Method.java:498)
11:43:41 	at org.apache.maven.surefire.util.ReflectionUtils.invokeMethodWithArray2(ReflectionUtils.java:206)
11:43:41 	at org.apache.maven.surefire.booter.ProviderFactory$ProviderProxy.invoke(ProviderFactory.java:161)
11:43:41 	at org.apache.maven.surefire.booter.ProviderFactory.invokeProvider(ProviderFactory.java:84)
11:43:41 	at org.eclipse.tycho.surefire.osgibooter.OsgiSurefireBooter.run(OsgiSurefireBooter.java:110)
11:43:41 	at org.eclipse.tycho.surefire.osgibooter.AbstractUITestApplication.runTests(AbstractUITestApplication.java:44)
11:43:41 	at org.eclipse.e4.ui.internal.workbench.swt.E4Testable$1.run(E4Testable.java:73)
11:43:41 	at java.lang.Thread.run(Thread.java:748)
11:43:42 
11:43:42 !ENTRY org.eclipse.egit.ui 2 0 2019-03-24 15:43:42.092
11:43:42 !MESSAGE The ICommitMessageProvider2 implementation org.eclipse.egit.ui.internal.dialogs.CommitMessageBuilderTest$3 provided the caret position -42, which exceeds the length of the commit message or is negative. The caret position is ignored.
11:43:43 
11:43:43 !ENTRY org.eclipse.egit.ui 2 0 2019-03-24 15:43:43.636
11:43:43 !MESSAGE Found multiple implementations of ICommitMessageProvider2. Ignoring caret positioning for org.eclipse.egit.ui.internal.dialogs.CommitMessageBuilderTest$3.
11:43:46 
11:43:46 !ENTRY org.eclipse.egit.ui 4 0 2019-03-24 15:43:46.542
11:43:46 !MESSAGE CrashingCommitMessageProvider fails on purpose.
11:43:46 !STACK 0
11:43:46 java.lang.IllegalStateException: CrashingCommitMessageProvider fails on purpose.
11:43:46 	at org.eclipse.egit.ui.internal.dialogs.CommitMessageBuilderTest$CrashingCommitMessageProvider.getMessage(CommitMessageBuilderTest.java:474)
11:43:46 	at org.eclipse.egit.ui.internal.dialogs.CommitMessageBuilder.build(CommitMessageBuilder.java:90)
11:43:46 	at org.eclipse.egit.ui.internal.dialogs.CommitMessageBuilderTest.commitMessageProvider_twoProvidersSecondOneCrashing(CommitMessageBuilderTest.java:130)
11:43:46 	at sun.reflect.NativeMethodAccessorImpl.invoke0(Native Method)
11:43:46 	at sun.reflect.NativeMethodAccessorImpl.invoke(NativeMethodAccessorImpl.java:62)
11:43:46 	at sun.reflect.DelegatingMethodAccessorImpl.invoke(DelegatingMethodAccessorImpl.java:43)
11:43:46 	at java.lang.reflect.Method.invoke(Method.java:498)
11:43:46 	at org.junit.runners.model.FrameworkMethod$1.runReflectiveCall(FrameworkMethod.java:50)
11:43:46 	at org.junit.internal.runners.model.ReflectiveCallable.run(ReflectiveCallable.java:12)
11:43:46 	at org.junit.runners.model.FrameworkMethod.invokeExplosively(FrameworkMethod.java:47)
11:43:46 	at org.junit.internal.runners.statements.InvokeMethod.evaluate(InvokeMethod.java:17)
11:43:46 	at org.junit.internal.runners.statements.RunBefores.evaluate(RunBefores.java:26)
11:43:46 	at org.junit.internal.runners.statements.RunAfters.evaluate(RunAfters.java:27)
11:43:46 	at org.junit.runners.ParentRunner.runLeaf(ParentRunner.java:325)
11:43:46 	at org.junit.runners.BlockJUnit4ClassRunner.runChild(BlockJUnit4ClassRunner.java:78)
11:43:46 	at org.junit.runners.BlockJUnit4ClassRunner.runChild(BlockJUnit4ClassRunner.java:57)
11:43:46 	at org.junit.runners.ParentRunner$3.run(ParentRunner.java:290)
11:43:46 	at org.junit.runners.ParentRunner$1.schedule(ParentRunner.java:71)
11:43:46 	at org.junit.runners.ParentRunner.runChildren(ParentRunner.java:288)
11:43:46 	at org.junit.runners.ParentRunner.access$000(ParentRunner.java:58)
11:43:46 	at org.junit.runners.ParentRunner$2.evaluate(ParentRunner.java:268)
11:43:46 	at org.junit.internal.runners.statements.RunBefores.evaluate(RunBefores.java:26)
11:43:46 	at org.junit.runners.ParentRunner.run(ParentRunner.java:363)
11:43:46 	at org.apache.maven.surefire.junit4.JUnit4Provider.execute(JUnit4Provider.java:365)
11:43:46 	at org.apache.maven.surefire.junit4.JUnit4Provider.executeWithRerun(JUnit4Provider.java:273)
11:43:46 	at org.apache.maven.surefire.junit4.JUnit4Provider.executeTestSet(JUnit4Provider.java:238)
11:43:46 	at org.apache.maven.surefire.junit4.JUnit4Provider.invoke(JUnit4Provider.java:159)
11:43:46 	at sun.reflect.NativeMethodAccessorImpl.invoke0(Native Method)
11:43:46 	at sun.reflect.NativeMethodAccessorImpl.invoke(NativeMethodAccessorImpl.java:62)
11:43:46 	at sun.reflect.DelegatingMethodAccessorImpl.invoke(DelegatingMethodAccessorImpl.java:43)
11:43:46 	at java.lang.reflect.Method.invoke(Method.java:498)
11:43:46 	at org.apache.maven.surefire.util.ReflectionUtils.invokeMethodWithArray2(ReflectionUtils.java:206)
11:43:46 	at org.apache.maven.surefire.booter.ProviderFactory$ProviderProxy.invoke(ProviderFactory.java:161)
11:43:46 	at org.apache.maven.surefire.booter.ProviderFactory.invokeProvider(ProviderFactory.java:84)
11:43:46 	at org.eclipse.tycho.surefire.osgibooter.OsgiSurefireBooter.run(OsgiSurefireBooter.java:110)
11:43:46 	at org.eclipse.tycho.surefire.osgibooter.AbstractUITestApplication.runTests(AbstractUITestApplication.java:44)
11:43:46 	at org.eclipse.e4.ui.internal.workbench.swt.E4Testable$1.run(E4Testable.java:73)
11:43:46 	at java.lang.Thread.run(Thread.java:748)
11:43:47 
11:43:47 !ENTRY org.eclipse.egit.ui 4 0 2019-03-24 15:43:47.606
11:43:47 !MESSAGE CrashingCommitMessageProvider fails on purpose.
11:43:47 !STACK 0
11:43:47 java.lang.IllegalStateException: CrashingCommitMessageProvider fails on purpose.
11:43:47 	at org.eclipse.egit.ui.internal.dialogs.CommitMessageBuilderTest$CrashingCommitMessageProvider.getMessage(CommitMessageBuilderTest.java:474)
11:43:47 	at org.eclipse.egit.ui.internal.dialogs.CommitMessageBuilder.build(CommitMessageBuilder.java:90)
11:43:47 	at org.eclipse.egit.ui.internal.dialogs.CommitMessageBuilderTest.commitMessageProvider_multipleProvidersWithCrashingAndNullAndOneCaretPositioning(CommitMessageBuilderTest.java:414)
11:43:47 	at sun.reflect.NativeMethodAccessorImpl.invoke0(Native Method)
11:43:47 	at sun.reflect.NativeMethodAccessorImpl.invoke(NativeMethodAccessorImpl.java:62)
11:43:47 	at sun.reflect.DelegatingMethodAccessorImpl.invoke(DelegatingMethodAccessorImpl.java:43)
11:43:47 	at java.lang.reflect.Method.invoke(Method.java:498)
11:43:47 	at org.junit.runners.model.FrameworkMethod$1.runReflectiveCall(FrameworkMethod.java:50)
11:43:47 	at org.junit.internal.runners.model.ReflectiveCallable.run(ReflectiveCallable.java:12)
11:43:47 	at org.junit.runners.model.FrameworkMethod.invokeExplosively(FrameworkMethod.java:47)
11:43:47 	at org.junit.internal.runners.statements.InvokeMethod.evaluate(InvokeMethod.java:17)
11:43:47 	at org.junit.internal.runners.statements.RunBefores.evaluate(RunBefores.java:26)
11:43:47 	at org.junit.internal.runners.statements.RunAfters.evaluate(RunAfters.java:27)
11:43:47 	at org.junit.runners.ParentRunner.runLeaf(ParentRunner.java:325)
11:43:47 	at org.junit.runners.BlockJUnit4ClassRunner.runChild(BlockJUnit4ClassRunner.java:78)
11:43:47 	at org.junit.runners.BlockJUnit4ClassRunner.runChild(BlockJUnit4ClassRunner.java:57)
11:43:47 	at org.junit.runners.ParentRunner$3.run(ParentRunner.java:290)
11:43:47 	at org.junit.runners.ParentRunner$1.schedule(ParentRunner.java:71)
11:43:47 	at org.junit.runners.ParentRunner.runChildren(ParentRunner.java:288)
11:43:47 	at org.junit.runners.ParentRunner.access$000(ParentRunner.java:58)
11:43:47 	at org.junit.runners.ParentRunner$2.evaluate(ParentRunner.java:268)
11:43:47 	at org.junit.internal.runners.statements.RunBefores.evaluate(RunBefores.java:26)
11:43:47 	at org.junit.runners.ParentRunner.run(ParentRunner.java:363)
11:43:47 	at org.apache.maven.surefire.junit4.JUnit4Provider.execute(JUnit4Provider.java:365)
11:43:47 	at org.apache.maven.surefire.junit4.JUnit4Provider.executeWithRerun(JUnit4Provider.java:273)
11:43:47 	at org.apache.maven.surefire.junit4.JUnit4Provider.executeTestSet(JUnit4Provider.java:238)
11:43:47 	at org.apache.maven.surefire.junit4.JUnit4Provider.invoke(JUnit4Provider.java:159)
11:43:47 	at sun.reflect.NativeMethodAccessorImpl.invoke0(Native Method)
11:43:47 	at sun.reflect.NativeMethodAccessorImpl.invoke(NativeMethodAccessorImpl.java:62)
11:43:47 	at sun.reflect.DelegatingMethodAccessorImpl.invoke(DelegatingMethodAccessorImpl.java:43)
11:43:47 	at java.lang.reflect.Method.invoke(Method.java:498)
11:43:47 	at org.apache.maven.surefire.util.ReflectionUtils.invokeMethodWithArray2(ReflectionUtils.java:206)
11:43:47 	at org.apache.maven.surefire.booter.ProviderFactory$ProviderProxy.invoke(ProviderFactory.java:161)
11:43:47 	at org.apache.maven.surefire.booter.ProviderFactory.invokeProvider(ProviderFactory.java:84)
11:43:47 	at org.eclipse.tycho.surefire.osgibooter.OsgiSurefireBooter.run(OsgiSurefireBooter.java:110)
11:43:47 	at org.eclipse.tycho.surefire.osgibooter.AbstractUITestApplication.runTests(AbstractUITestApplication.java:44)
11:43:47 	at org.eclipse.e4.ui.internal.workbench.swt.E4Testable$1.run(E4Testable.java:73)
11:43:47 	at java.lang.Thread.run(Thread.java:748)
11:43:47 
11:43:47 !ENTRY org.eclipse.egit.ui 4 0 2019-03-24 15:43:47.606
11:43:47 !MESSAGE CrashingCommitMessageProvider fails on purpose.
11:43:47 !STACK 0
11:43:47 java.lang.IllegalStateException: CrashingCommitMessageProvider fails on purpose.
11:43:47 	at org.eclipse.egit.ui.internal.dialogs.CommitMessageBuilderTest$CrashingCommitMessageProvider.getMessage(CommitMessageBuilderTest.java:474)
11:43:47 	at org.eclipse.egit.ui.internal.dialogs.CommitMessageBuilder.build(CommitMessageBuilder.java:90)
11:43:47 	at org.eclipse.egit.ui.internal.dialogs.CommitMessageBuilderTest.commitMessageProvider_multipleProvidersWithCrashingAndNullAndOneCaretPositioning(CommitMessageBuilderTest.java:414)
11:43:47 	at sun.reflect.NativeMethodAccessorImpl.invoke0(Native Method)
11:43:47 	at sun.reflect.NativeMethodAccessorImpl.invoke(NativeMethodAccessorImpl.java:62)
11:43:47 	at sun.reflect.DelegatingMethodAccessorImpl.invoke(DelegatingMethodAccessorImpl.java:43)
11:43:47 	at java.lang.reflect.Method.invoke(Method.java:498)
11:43:47 	at org.junit.runners.model.FrameworkMethod$1.runReflectiveCall(FrameworkMethod.java:50)
11:43:47 	at org.junit.internal.runners.model.ReflectiveCallable.run(ReflectiveCallable.java:12)
11:43:47 	at org.junit.runners.model.FrameworkMethod.invokeExplosively(FrameworkMethod.java:47)
11:43:47 	at org.junit.internal.runners.statements.InvokeMethod.evaluate(InvokeMethod.java:17)
11:43:47 	at org.junit.internal.runners.statements.RunBefores.evaluate(RunBefores.java:26)
11:43:47 	at org.junit.internal.runners.statements.RunAfters.evaluate(RunAfters.java:27)
11:43:47 	at org.junit.runners.ParentRunner.runLeaf(ParentRunner.java:325)
11:43:47 	at org.junit.runners.BlockJUnit4ClassRunner.runChild(BlockJUnit4ClassRunner.java:78)
11:43:47 	at org.junit.runners.BlockJUnit4ClassRunner.runChild(BlockJUnit4ClassRunner.java:57)
11:43:47 	at org.junit.runners.ParentRunner$3.run(ParentRunner.java:290)
11:43:47 	at org.junit.runners.ParentRunner$1.schedule(ParentRunner.java:71)
11:43:47 	at org.junit.runners.ParentRunner.runChildren(ParentRunner.java:288)
11:43:47 	at org.junit.runners.ParentRunner.access$000(ParentRunner.java:58)
11:43:47 	at org.junit.runners.ParentRunner$2.evaluate(ParentRunner.java:268)
11:43:47 	at org.junit.internal.runners.statements.RunBefores.evaluate(RunBefores.java:26)
11:43:47 	at org.junit.runners.ParentRunner.run(ParentRunner.java:363)
11:43:47 	at org.apache.maven.surefire.junit4.JUnit4Provider.execute(JUnit4Provider.java:365)
11:43:47 	at org.apache.maven.surefire.junit4.JUnit4Provider.executeWithRerun(JUnit4Provider.java:273)
11:43:47 	at org.apache.maven.surefire.junit4.JUnit4Provider.executeTestSet(JUnit4Provider.java:238)
11:43:47 	at org.apache.maven.surefire.junit4.JUnit4Provider.invoke(JUnit4Provider.java:159)
11:43:47 	at sun.reflect.NativeMethodAccessorImpl.invoke0(Native Method)
11:43:47 	at sun.reflect.NativeMethodAccessorImpl.invoke(NativeMethodAccessorImpl.java:62)
11:43:47 	at sun.reflect.DelegatingMethodAccessorImpl.invoke(DelegatingMethodAccessorImpl.java:43)
11:43:47 	at java.lang.reflect.Method.invoke(Method.java:498)
11:43:47 	at org.apache.maven.surefire.util.ReflectionUtils.invokeMethodWithArray2(ReflectionUtils.java:206)
11:43:47 	at org.apache.maven.surefire.booter.ProviderFactory$ProviderProxy.invoke(ProviderFactory.java:161)
11:43:47 	at org.apache.maven.surefire.booter.ProviderFactory.invokeProvider(ProviderFactory.java:84)
11:43:47 	at org.eclipse.tycho.surefire.osgibooter.OsgiSurefireBooter.run(OsgiSurefireBooter.java:110)
11:43:47 	at org.eclipse.tycho.surefire.osgibooter.AbstractUITestApplication.runTests(AbstractUITestApplication.java:44)
11:43:47 	at org.eclipse.e4.ui.internal.workbench.swt.E4Testable$1.run(E4Testable.java:73)
11:43:47 	at java.lang.Thread.run(Thread.java:748)
11:43:47 
11:43:47 !ENTRY org.eclipse.egit.ui 2 0 2019-03-24 15:43:47.863
11:43:47 !MESSAGE Found multiple implementations of ICommitMessageProvider2. Ignoring caret positioning for org.eclipse.egit.ui.internal.dialogs.CommitMessageBuilderTest$3.
11:43:47 
11:43:47 !ENTRY org.eclipse.egit.ui 2 0 2019-03-24 15:43:47.948
11:43:47 !MESSAGE The ICommitMessageProvider2 implementation org.eclipse.egit.ui.internal.dialogs.CommitMessageBuilderTest$3 provided the caret position 14, which exceeds the length of the commit message or is negative. The caret position is ignored.
11:43:47 Tests run: 20, Failures: 0, Errors: 0, Skipped: 0, Time elapsed: 7.654 s - in org.eclipse.egit.ui.internal.dialogs.CommitMessageBuilderTest
11:43:47 commitMessageProvider_oneCrashingProvider(org.eclipse.egit.ui.internal.dialogs.CommitMessageBuilderTest)  Time elapsed: 0.147 s
11:43:47 commitMessageProvider_twoProvidersSecondWithCaretPositioning(org.eclipse.egit.ui.internal.dialogs.CommitMessageBuilderTest)  Time elapsed: 0.092 s
11:43:47 commitMessageProvider_oneCrashingProviderWithCaretPosition(org.eclipse.egit.ui.internal.dialogs.CommitMessageBuilderTest)  Time elapsed: 0.106 s
11:43:47 commitMessageProvider_twoProvidersFirstOneCrashing(org.eclipse.egit.ui.internal.dialogs.CommitMessageBuilderTest)  Time elapsed: 0.086 s
11:43:47 commitMessageProvider_noProvider(org.eclipse.egit.ui.internal.dialogs.CommitMessageBuilderTest)  Time elapsed: 0.087 s
11:43:47 commitMessageProvider_oneProvider(org.eclipse.egit.ui.internal.dialogs.CommitMessageBuilderTest)  Time elapsed: 1.058 s
11:43:47 commitMessageProvider_multipleProvidersWithCrashAndNull(org.eclipse.egit.ui.internal.dialogs.CommitMessageBuilderTest)  Time elapsed: 0.124 s
11:43:47 commitMessageProvider_oneProviderWithInvalidNegativeCaretPosition(org.eclipse.egit.ui.internal.dialogs.CommitMessageBuilderTest)  Time elapsed: 0.095 s
11:43:47 commitMessageProvider_twoProvidersSecondWithUndefinedCaretPosition(org.eclipse.egit.ui.internal.dialogs.CommitMessageBuilderTest)  Time elapsed: 0.085 s
11:43:47 commitMessageProvider_twoProvidersWithCaretPositioningFirstWithUndefinedCaretPosition(org.eclipse.egit.ui.internal.dialogs.CommitMessageBuilderTest)  Time elapsed: 0.085 s
11:43:47 commitMessageProvider_oneProviderWithCaretPositionEqualsMessageLength(org.eclipse.egit.ui.internal.dialogs.CommitMessageBuilderTest)  Time elapsed: 1.143 s
11:43:47 commitMessageProvider_twoProvidersFirstWithCaretPositioning(org.eclipse.egit.ui.internal.dialogs.CommitMessageBuilderTest)  Time elapsed: 0.112 s
11:43:47 commitMessageProvider_twoProvidersWithCaretPositioningSecondWithUndefinedCaretPosition(org.eclipse.egit.ui.internal.dialogs.CommitMessageBuilderTest)  Time elapsed: 0.156 s
11:43:47 commitMessageProvider_oneProviderWithCaretPositioning(org.eclipse.egit.ui.internal.dialogs.CommitMessageBuilderTest)  Time elapsed: 0.087 s
11:43:47 commitMessageProvider_twoProvidersSecondWithCaretPositionZero(org.eclipse.egit.ui.internal.dialogs.CommitMessageBuilderTest)  Time elapsed: 0.087 s
11:43:47 commitMessageProvider_twoProviders(org.eclipse.egit.ui.internal.dialogs.CommitMessageBuilderTest)  Time elapsed: 2.286 s
11:43:47 commitMessageProvider_twoProvidersSecondOneCrashing(org.eclipse.egit.ui.internal.dialogs.CommitMessageBuilderTest)  Time elapsed: 0.416 s
11:43:47 commitMessageProvider_multipleProvidersWithCrashingAndNullAndOneCaretPositioning(org.eclipse.egit.ui.internal.dialogs.CommitMessageBuilderTest)  Time elapsed: 1.061 s
11:43:47 commitMessageProvider_twoProvidersWithCaretPositioning(org.eclipse.egit.ui.internal.dialogs.CommitMessageBuilderTest)  Time elapsed: 0.251 s
11:43:47 commitMessageProvider_oneProviderWithInvalidCaretPositionExceedingMessageLength(org.eclipse.egit.ui.internal.dialogs.CommitMessageBuilderTest)  Time elapsed: 0.085 s
11:43:47 Running org.eclipse.egit.ui.internal.dialogs.SpellcheckableMessageAreaTest
11:43:47 Tests run: 25, Failures: 0, Errors: 0, Skipped: 0, Time elapsed: 0.004 s - in org.eclipse.egit.ui.internal.dialogs.SpellcheckableMessageAreaTest
11:43:47 testWrappingLongWords(org.eclipse.egit.ui.internal.dialogs.SpellcheckableMessageAreaTest)  Time elapsed: 0 s
11:43:47 wrapOnlyCommitMessageBody(org.eclipse.egit.ui.internal.dialogs.SpellcheckableMessageAreaTest)  Time elapsed: 0 s
11:43:47 dontWrapMaximumLengthText(org.eclipse.egit.ui.internal.dialogs.SpellcheckableMessageAreaTest)  Time elapsed: 0 s
11:43:47 keepTrailingSpace(org.eclipse.egit.ui.internal.dialogs.SpellcheckableMessageAreaTest)  Time elapsed: 0 s
11:43:47 dontWrapShortMessage(org.eclipse.egit.ui.internal.dialogs.SpellcheckableMessageAreaTest)  Time elapsed: 0 s
11:43:47 lineAfterWrappedWordShouldNotBeJoined(org.eclipse.egit.ui.internal.dialogs.SpellcheckableMessageAreaTest)  Time elapsed: 0 s
11:43:47 lineAfterWrappedWordShouldNotBeJoined2(org.eclipse.egit.ui.internal.dialogs.SpellcheckableMessageAreaTest)  Time elapsed: 0 s
11:43:47 lineAfterWrappedWordShouldNotBeJoined3(org.eclipse.egit.ui.internal.dialogs.SpellcheckableMessageAreaTest)  Time elapsed: 0 s
11:43:47 dontWrapWordLongerThanOneLine(org.eclipse.egit.ui.internal.dialogs.SpellcheckableMessageAreaTest)  Time elapsed: 0.001 s
11:43:47 keepExistingNewlines(org.eclipse.egit.ui.internal.dialogs.SpellcheckableMessageAreaTest)  Time elapsed: 0 s
11:43:47 dontWrapShortText(org.eclipse.egit.ui.internal.dialogs.SpellcheckableMessageAreaTest)  Time elapsed: 0 s
11:43:47 dontWrapWordLongerThanOneLineAtStart(org.eclipse.egit.ui.internal.dialogs.SpellcheckableMessageAreaTest)  Time elapsed: 0 s
11:43:47 dontWrapAlreadyWrappedText(org.eclipse.egit.ui.internal.dialogs.SpellcheckableMessageAreaTest)  Time elapsed: 0 s
11:43:47 wrapOverlengthText2(org.eclipse.egit.ui.internal.dialogs.SpellcheckableMessageAreaTest)  Time elapsed: 0 s
11:43:47 lineAfterWrappedWordShouldNotBeJoinedIfItStartsWithASymbol(org.eclipse.egit.ui.internal.dialogs.SpellcheckableMessageAreaTest)  Time elapsed: 0 s
11:43:47 wrapAlternatingBlankNonBlank(org.eclipse.egit.ui.internal.dialogs.SpellcheckableMessageAreaTest)  Time elapsed: 0 s
11:43:47 keepWhitespace(org.eclipse.egit.ui.internal.dialogs.SpellcheckableMessageAreaTest)  Time elapsed: 0 s
11:43:47 lineAfterWrappedWordShouldNotBeJoinedIfItsEmpty(org.eclipse.egit.ui.internal.dialogs.SpellcheckableMessageAreaTest)  Time elapsed: 0 s
11:43:47 dontWrapLongCommitMessageFooter(org.eclipse.egit.ui.internal.dialogs.SpellcheckableMessageAreaTest)  Time elapsed: 0 s
11:43:47 lineAfterWrappedLineShouldBeJoinedAndFollowingLineWrappedCorrectly(org.eclipse.egit.ui.internal.dialogs.SpellcheckableMessageAreaTest)  Time elapsed: 0 s
11:43:47 wrapOverlengthText(org.eclipse.egit.ui.internal.dialogs.SpellcheckableMessageAreaTest)  Time elapsed: 0 s
11:43:47 dontWrapWordLongerThanOneLineAndKeepSpaceAtFront(org.eclipse.egit.ui.internal.dialogs.SpellcheckableMessageAreaTest)  Time elapsed: 0 s
11:43:47 wrapSecondLongLine(org.eclipse.egit.ui.internal.dialogs.SpellcheckableMessageAreaTest)  Time elapsed: 0 s
11:43:47 wrapOverlengthTextByOne(org.eclipse.egit.ui.internal.dialogs.SpellcheckableMessageAreaTest)  Time elapsed: 0 s
11:43:47 keepNewlineAtEnd(org.eclipse.egit.ui.internal.dialogs.SpellcheckableMessageAreaTest)  Time elapsed: 0 s
11:43:47 Running org.eclipse.egit.ui.internal.synchronize.model.GitModelRootTest
11:43:50 Tests run: 1, Failures: 0, Errors: 0, Skipped: 0, Time elapsed: 2.305 s - in org.eclipse.egit.ui.internal.synchronize.model.GitModelRootTest
11:43:50 shouldIgnoreEmptyRepositories(org.eclipse.egit.ui.internal.synchronize.model.GitModelRootTest)  Time elapsed: 2.299 s
11:43:50 Running org.eclipse.egit.ui.internal.synchronize.model.GitModelCommitTest
11:43:54 Tests run: 7, Failures: 0, Errors: 0, Skipped: 0, Time elapsed: 4.619 s - in org.eclipse.egit.ui.internal.synchronize.model.GitModelCommitTest
11:43:54 shouldReturnNotEqualForDifferentCommits(org.eclipse.egit.ui.internal.synchronize.model.GitModelCommitTest)  Time elapsed: 0.572 s
11:43:54 shouldReturnNotEqualWhenCommitTreeAndBlob(org.eclipse.egit.ui.internal.synchronize.model.GitModelCommitTest)  Time elapsed: 0.592 s
11:43:54 shouldReturnNotEqualWhenCommitTreeAndTree(org.eclipse.egit.ui.internal.synchronize.model.GitModelCommitTest)  Time elapsed: 0.571 s
11:43:54 shouldReturnNotEqualWhenCommitTreeAndCache(org.eclipse.egit.ui.internal.synchronize.model.GitModelCommitTest)  Time elapsed: 0.609 s
11:43:54 shouldReturnEqualForSameInstance(org.eclipse.egit.ui.internal.synchronize.model.GitModelCommitTest)  Time elapsed: 0.588 s
11:43:54 shouldReturnNotEqualForDifferentParents(org.eclipse.egit.ui.internal.synchronize.model.GitModelCommitTest)  Time elapsed: 1.133 s
11:43:54 shouldReturnEqualForSameCommits(org.eclipse.egit.ui.internal.synchronize.model.GitModelCommitTest)  Time elapsed: 0.537 s
11:43:54 Running org.eclipse.egit.ui.internal.synchronize.model.GitModelBlobTest
11:44:02 Tests run: 15, Failures: 0, Errors: 0, Skipped: 2, Time elapsed: 7.207 s - in org.eclipse.egit.ui.internal.synchronize.model.GitModelBlobTest
11:44:02 shouldReturnEqualSameData1(org.eclipse.egit.ui.internal.synchronize.model.GitModelBlobTest) skipped
11:44:02 shouldReturnNotEqualForDifferentLocation(org.eclipse.egit.ui.internal.synchronize.model.GitModelBlobTest)  Time elapsed: 0.563 s
11:44:02 shouldReturnNotEqualForBlobAndCommit(org.eclipse.egit.ui.internal.synchronize.model.GitModelBlobTest)  Time elapsed: 0.534 s
11:44:02 shouldReturnEqualForSameData(org.eclipse.egit.ui.internal.synchronize.model.GitModelBlobTest) skipped
11:44:02 shouldReturnNotEqualForDifferentFiles(org.eclipse.egit.ui.internal.synchronize.model.GitModelBlobTest)  Time elapsed: 0.533 s
11:44:02 shouldReturnNotEqualForBlobAndCacheFile(org.eclipse.egit.ui.internal.synchronize.model.GitModelBlobTest)  Time elapsed: 0.632 s
11:44:02 shouldReturnNotEqualForBlobAndTree(org.eclipse.egit.ui.internal.synchronize.model.GitModelBlobTest)  Time elapsed: 0.527 s
11:44:02 shouldBeSymmetric1(org.eclipse.egit.ui.internal.synchronize.model.GitModelBlobTest)  Time elapsed: 0.534 s
11:44:02 shouldBeSymmetric(org.eclipse.egit.ui.internal.synchronize.model.GitModelBlobTest)  Time elapsed: 0.534 s
11:44:02 shouldReturnEqualForSameInstance(org.eclipse.egit.ui.internal.synchronize.model.GitModelBlobTest)  Time elapsed: 0.536 s
11:44:02 shouldActAsResourceProvider(org.eclipse.egit.ui.internal.synchronize.model.GitModelBlobTest)  Time elapsed: 0.527 s
11:44:02 shouldReturnNotEqualForDifferentBaseObjectId2(org.eclipse.egit.ui.internal.synchronize.model.GitModelBlobTest)  Time elapsed: 0.622 s
11:44:02 shouldReturnNotEqualForDifferentBaseObjectId3(org.eclipse.egit.ui.internal.synchronize.model.GitModelBlobTest)  Time elapsed: 0.527 s
11:44:02 shouldReturnNotEqualForBlobAndWorkingFile(org.eclipse.egit.ui.internal.synchronize.model.GitModelBlobTest)  Time elapsed: 0.579 s
11:44:02 shouldReturnNotEqualForDifferentBaseObjectId(org.eclipse.egit.ui.internal.synchronize.model.GitModelBlobTest)  Time elapsed: 0.529 s
11:44:02 Running org.eclipse.egit.ui.internal.synchronize.model.GitModelTreeTest
11:44:05 Tests run: 6, Failures: 0, Errors: 0, Skipped: 0, Time elapsed: 3.288 s - in org.eclipse.egit.ui.internal.synchronize.model.GitModelTreeTest
11:44:05 shouldReturnNotEqualForDifferentLocation(org.eclipse.egit.ui.internal.synchronize.model.GitModelTreeTest)  Time elapsed: 0.538 s
11:44:05 shouldReturnNotEqualForTreeAndCacheTree(org.eclipse.egit.ui.internal.synchronize.model.GitModelTreeTest)  Time elapsed: 0.549 s
11:44:05 shouldReturnNotEqualForTreeAndCommit(org.eclipse.egit.ui.internal.synchronize.model.GitModelTreeTest)  Time elapsed: 0.551 s
11:44:05 shouldReturnEqualForSameBaseCommit(org.eclipse.egit.ui.internal.synchronize.model.GitModelTreeTest)  Time elapsed: 0.575 s
11:44:05 shouldReturnEqualForSameInstance(org.eclipse.egit.ui.internal.synchronize.model.GitModelTreeTest)  Time elapsed: 0.532 s
11:44:05 shouldReturnNotEqualForTreeAndBlob(org.eclipse.egit.ui.internal.synchronize.model.GitModelTreeTest)  Time elapsed: 0.528 s
11:44:05 Running org.eclipse.egit.ui.internal.synchronize.model.GitModelCacheFileTest
11:44:08 Tests run: 7, Failures: 0, Errors: 0, Skipped: 2, Time elapsed: 2.789 s - in org.eclipse.egit.ui.internal.synchronize.model.GitModelCacheFileTest
11:44:08 shouldReturnEqualForSameObjectIdsAndLocation(org.eclipse.egit.ui.internal.synchronize.model.GitModelCacheFileTest)  Time elapsed: 0.532 s
11:44:08 shouldReturnNotEqualWhenComparingCacheFileAndBlob(org.eclipse.egit.ui.internal.synchronize.model.GitModelCacheFileTest)  Time elapsed: 0.622 s
11:44:08 shouldReturnNotEqualForDifferentCacheIds(org.eclipse.egit.ui.internal.synchronize.model.GitModelCacheFileTest) skipped
11:44:08 shouldReturnEqualForSameInstance(org.eclipse.egit.ui.internal.synchronize.model.GitModelCacheFileTest)  Time elapsed: 0.542 s
11:44:08 shouldReturnNotEqualWhenComparingCacheFileAndWorkingFile(org.eclipse.egit.ui.internal.synchronize.model.GitModelCacheFileTest)  Time elapsed: 0.547 s
11:44:08 shouldReturnNotEqualForDifferentBaseIds(org.eclipse.egit.ui.internal.synchronize.model.GitModelCacheFileTest)  Time elapsed: 0.532 s
11:44:08 shouldReturnNotEqualForDifferentLocations(org.eclipse.egit.ui.internal.synchronize.model.GitModelCacheFileTest) skipped
11:44:08 Running org.eclipse.egit.ui.internal.synchronize.model.GitModelCacheTreeTest
11:44:10 Tests run: 4, Failures: 0, Errors: 0, Skipped: 0, Time elapsed: 2.201 s - in org.eclipse.egit.ui.internal.synchronize.model.GitModelCacheTreeTest
11:44:10 shouldReturnEqualForSameData(org.eclipse.egit.ui.internal.synchronize.model.GitModelCacheTreeTest)  Time elapsed: 0.532 s
11:44:10 shouldReturnNotEqualForDifferetnLocation(org.eclipse.egit.ui.internal.synchronize.model.GitModelCacheTreeTest)  Time elapsed: 0.546 s
11:44:10 shouldReturnEqualForSameInstance(org.eclipse.egit.ui.internal.synchronize.model.GitModelCacheTreeTest)  Time elapsed: 0.542 s
11:44:10 shouldReturnNotEqualWhenComparingCacheTreeAndTree(org.eclipse.egit.ui.internal.synchronize.model.GitModelCacheTreeTest)  Time elapsed: 0.571 s
11:44:10 Running org.eclipse.egit.ui.internal.synchronize.model.GitModelRepositoryTest
11:44:12 Tests run: 3, Failures: 0, Errors: 0, Skipped: 0, Time elapsed: 2.143 s - in org.eclipse.egit.ui.internal.synchronize.model.GitModelRepositoryTest
11:44:12 shouldReturnEqual(org.eclipse.egit.ui.internal.synchronize.model.GitModelRepositoryTest)  Time elapsed: 0.68 s
11:44:12 shouldReturnNotEqual(org.eclipse.egit.ui.internal.synchronize.model.GitModelRepositoryTest)  Time elapsed: 0.726 s
11:44:12 shouldReturnEqualForSameInstance(org.eclipse.egit.ui.internal.synchronize.model.GitModelRepositoryTest)  Time elapsed: 0.725 s
11:44:12 Running org.eclipse.egit.ui.internal.synchronize.model.GitModelWorkingTreeTest
11:44:13 Tests run: 2, Failures: 0, Errors: 0, Skipped: 0, Time elapsed: 1.163 s - in org.eclipse.egit.ui.internal.synchronize.model.GitModelWorkingTreeTest
11:44:13 shouldReturnNotEqualsWhenComparingWorkingTreeAndCache(org.eclipse.egit.ui.internal.synchronize.model.GitModelWorkingTreeTest)  Time elapsed: 0.529 s
11:44:13 shouldReturnEqualsForTheSameInstance(org.eclipse.egit.ui.internal.synchronize.model.GitModelWorkingTreeTest)  Time elapsed: 0.628 s
11:44:13 Running org.eclipse.egit.ui.internal.synchronize.model.GitModelWorkingFileTest
11:44:16 Tests run: 5, Failures: 0, Errors: 0, Skipped: 0, Time elapsed: 2.72 s - in org.eclipse.egit.ui.internal.synchronize.model.GitModelWorkingFileTest
11:44:16 shouldReturnNotEqualForDifferentLocation(org.eclipse.egit.ui.internal.synchronize.model.GitModelWorkingFileTest)  Time elapsed: 0.53 s
11:44:16 shouldReturnNotEqualWhenComparingWorkingFileAndCacheFile(org.eclipse.egit.ui.internal.synchronize.model.GitModelWorkingFileTest)  Time elapsed: 0.526 s
11:44:16 shouldReturnEqualForSameInstance(org.eclipse.egit.ui.internal.synchronize.model.GitModelWorkingFileTest)  Time elapsed: 0.525 s
11:44:16 shouldReturnNotEqualWhenComparingWorkingFileAndBlob(org.eclipse.egit.ui.internal.synchronize.model.GitModelWorkingFileTest)  Time elapsed: 0.601 s
11:44:16 shouldReturnEqualForSameLocation(org.eclipse.egit.ui.internal.synchronize.model.GitModelWorkingFileTest)  Time elapsed: 0.527 s
11:44:16 Running org.eclipse.egit.ui.internal.synchronize.model.GitModelCacheTest
11:44:20 Tests run: 6, Failures: 0, Errors: 0, Skipped: 0, Time elapsed: 3.964 s - in org.eclipse.egit.ui.internal.synchronize.model.GitModelCacheTest
11:44:20 shouldReturnChildren(org.eclipse.egit.ui.internal.synchronize.model.GitModelCacheTest)  Time elapsed: 0.532 s
11:44:20 shouldReturnNotEqualWhenCacheTreeAndCommit(org.eclipse.egit.ui.internal.synchronize.model.GitModelCacheTest)  Time elapsed: 0.623 s
11:44:20 shouldReturnEqualForSameInstance(org.eclipse.egit.ui.internal.synchronize.model.GitModelCacheTest)  Time elapsed: 0.537 s
11:44:20 shouldReturnEqualForSameCommits(org.eclipse.egit.ui.internal.synchronize.model.GitModelCacheTest)  Time elapsed: 0.524 s
11:44:20 shouldReturnNotEqualWhenComparingCacheAndWorkingTree(org.eclipse.egit.ui.internal.synchronize.model.GitModelCacheTest)  Time elapsed: 0.628 s
11:44:20 shouldReturnNotEqualForDifferentRepositories(org.eclipse.egit.ui.internal.synchronize.model.GitModelCacheTest)  Time elapsed: 1.105 s
11:44:20 Running org.eclipse.egit.ui.internal.synchronize.mapping.GitChangeSetSorterTest
11:44:20 Tests run: 23, Failures: 0, Errors: 0, Skipped: 0, Time elapsed: 0.375 s - in org.eclipse.egit.ui.internal.synchronize.mapping.GitChangeSetSorterTest
11:44:20 commitTreeShouldBeLessThanBlob(org.eclipse.egit.ui.internal.synchronize.mapping.GitChangeSetSorterTest)  Time elapsed: 0.032 s
11:44:20 commitTreeShouldBeLessThanTree(org.eclipse.egit.ui.internal.synchronize.mapping.GitChangeSetSorterTest)  Time elapsed: 0 s
11:44:20 blobShouldBeGreaterThanTree(org.eclipse.egit.ui.internal.synchronize.mapping.GitChangeSetSorterTest)  Time elapsed: 0 s
11:44:20 cacheTreeShouldBeLessThanCommit(org.eclipse.egit.ui.internal.synchronize.mapping.GitChangeSetSorterTest)  Time elapsed: 0 s
11:44:20 shouldOrderTreesAlphabetically(org.eclipse.egit.ui.internal.synchronize.mapping.GitChangeSetSorterTest)  Time elapsed: 0.338 s
11:44:20 commitTreeShouldBeGreaterThanCache(org.eclipse.egit.ui.internal.synchronize.mapping.GitChangeSetSorterTest)  Time elapsed: 0 s
11:44:20 blobShouldBeGreaterThanWorkingTree(org.eclipse.egit.ui.internal.synchronize.mapping.GitChangeSetSorterTest)  Time elapsed: 0 s
11:44:20 treeShouldBeGreaterThanCache(org.eclipse.egit.ui.internal.synchronize.mapping.GitChangeSetSorterTest)  Time elapsed: 0 s
11:44:20 treeShouldBeGreaterThanCommit(org.eclipse.egit.ui.internal.synchronize.mapping.GitChangeSetSorterTest)  Time elapsed: 0 s
11:44:20 workingTreeShouldBeLessThanCacheTree(org.eclipse.egit.ui.internal.synchronize.mapping.GitChangeSetSorterTest)  Time elapsed: 0 s
11:44:20 treeShouldBeGreaterThanWorkingTree(org.eclipse.egit.ui.internal.synchronize.mapping.GitChangeSetSorterTest)  Time elapsed: 0 s
11:44:20 blobShouldBeGreaterThanCache(org.eclipse.egit.ui.internal.synchronize.mapping.GitChangeSetSorterTest)  Time elapsed: 0 s
11:44:20 cacheTreeShouldBeLessThanBlob(org.eclipse.egit.ui.internal.synchronize.mapping.GitChangeSetSorterTest)  Time elapsed: 0 s
11:44:20 cacheTreeShouldBeLessThanTree(org.eclipse.egit.ui.internal.synchronize.mapping.GitChangeSetSorterTest)  Time elapsed: 0 s
11:44:20 shouldOrderBlobsAlphabetically(org.eclipse.egit.ui.internal.synchronize.mapping.GitChangeSetSorterTest)  Time elapsed: 0.001 s
11:44:20 commitTreeShouldBeGreaterThanWorkingTree(org.eclipse.egit.ui.internal.synchronize.mapping.GitChangeSetSorterTest)  Time elapsed: 0 s
11:44:20 treeShouldBeLessThanBlob(org.eclipse.egit.ui.internal.synchronize.mapping.GitChangeSetSorterTest)  Time elapsed: 0 s
11:44:20 cacheTreeShouldBeGreaterThanWorkingTree(org.eclipse.egit.ui.internal.synchronize.mapping.GitChangeSetSorterTest)  Time elapsed: 0 s
11:44:20 workingTreeShouldBeLessThanBlob(org.eclipse.egit.ui.internal.synchronize.mapping.GitChangeSetSorterTest)  Time elapsed: 0 s
11:44:20 workingTreeShouldBeLessThanTree(org.eclipse.egit.ui.internal.synchronize.mapping.GitChangeSetSorterTest)  Time elapsed: 0 s
11:44:20 shouldOrderCommitsByCommitDate(org.eclipse.egit.ui.internal.synchronize.mapping.GitChangeSetSorterTest)  Time elapsed: 0.001 s
11:44:20 workingTreeShouldBeLessThanCommit(org.eclipse.egit.ui.internal.synchronize.mapping.GitChangeSetSorterTest)  Time elapsed: 0 s
11:44:20 blobShouldBeGreaterThanCommit(org.eclipse.egit.ui.internal.synchronize.mapping.GitChangeSetSorterTest)  Time elapsed: 0 s
11:44:20 Running org.eclipse.egit.ui.internal.decorators.DecoratableWorkingSetTest
11:44:28 Tests run: 7, Failures: 0, Errors: 0, Skipped: 0, Time elapsed: 7.39 s - in org.eclipse.egit.ui.internal.decorators.DecoratableWorkingSetTest
11:44:28 testAnyConflictsIsConflicts(org.eclipse.egit.ui.internal.decorators.DecoratableWorkingSetTest)  Time elapsed: 0.958 s
11:44:28 testUntrackedContentIsUndecorated(org.eclipse.egit.ui.internal.decorators.DecoratableWorkingSetTest)  Time elapsed: 0.863 s
11:44:28 testAnyDirtyIsDirty(org.eclipse.egit.ui.internal.decorators.DecoratableWorkingSetTest)  Time elapsed: 1.43 s
11:44:28 testDecorationConflictingOverDirty(org.eclipse.egit.ui.internal.decorators.DecoratableWorkingSetTest)  Time elapsed: 1.53 s
11:44:28 testEmptyWorkingSetIsUndecorated(org.eclipse.egit.ui.internal.decorators.DecoratableWorkingSetTest)  Time elapsed: 0.66 s
11:44:28 testStagingStateHasNoInfluence_Modified(org.eclipse.egit.ui.internal.decorators.DecoratableWorkingSetTest)  Time elapsed: 0.733 s
11:44:28 testAnyTrackedIsTracked(org.eclipse.egit.ui.internal.decorators.DecoratableWorkingSetTest)  Time elapsed: 1.149 s
11:44:28 Running org.eclipse.egit.ui.internal.decorators.DecoratableResourceMappingTest
11:44:36 Tests run: 9, Failures: 0, Errors: 0, Skipped: 0, Time elapsed: 7.985 s - in org.eclipse.egit.ui.internal.decorators.DecoratableResourceMappingTest
11:44:36 testAnyConflictsIsConflicts(org.eclipse.egit.ui.internal.decorators.DecoratableResourceMappingTest)  Time elapsed: 0.859 s
11:44:36 testSameStagingStateIsState_Added(org.eclipse.egit.ui.internal.decorators.DecoratableResourceMappingTest)  Time elapsed: 1.156 s
11:44:36 testAnyDirtyIsDirty(org.eclipse.egit.ui.internal.decorators.DecoratableResourceMappingTest)  Time elapsed: 1.322 s
11:44:36 testMixedStagingStateIsModified_RemovedAdded(org.eclipse.egit.ui.internal.decorators.DecoratableResourceMappingTest)  Time elapsed: 0.746 s
11:44:36 testAllIgnoredIsUnstaged(org.eclipse.egit.ui.internal.decorators.DecoratableResourceMappingTest)  Time elapsed: 0.733 s
11:44:36 testDecorationConflictingOverDirty(org.eclipse.egit.ui.internal.decorators.DecoratableResourceMappingTest)  Time elapsed: 0.893 s
11:44:36 testMixedStagingStateIsModified_AddedNotStaged(org.eclipse.egit.ui.internal.decorators.DecoratableResourceMappingTest)  Time elapsed: 0.729 s
11:44:36 testNewResourceMappingIsUnstaged(org.eclipse.egit.ui.internal.decorators.DecoratableResourceMappingTest)  Time elapsed: 0.727 s
11:44:36 testAnyTrackedIsTracked(org.eclipse.egit.ui.internal.decorators.DecoratableResourceMappingTest)  Time elapsed: 0.781 s
11:44:36 Running org.eclipse.egit.ui.internal.decorators.DecoratableResourceAdapterTest
11:44:46 Tests run: 13, Failures: 0, Errors: 0, Skipped: 0, Time elapsed: 10.804 s - in org.eclipse.egit.ui.internal.decorators.DecoratableResourceAdapterTest
11:44:46 testDecorationDeletedFile(org.eclipse.egit.ui.internal.decorators.DecoratableResourceAdapterTest)  Time elapsed: 1.171 s
11:44:46 testDecorationModifiedFile(org.eclipse.egit.ui.internal.decorators.DecoratableResourceAdapterTest)  Time elapsed: 1.166 s
11:44:46 testDecorationEmptyProject(org.eclipse.egit.ui.internal.decorators.DecoratableResourceAdapterTest)  Time elapsed: 0.722 s
11:44:46 testDecorationConflictingFile(org.eclipse.egit.ui.internal.decorators.DecoratableResourceAdapterTest)  Time elapsed: 0.885 s
11:44:46 testDecorationNewEmptyFolder(org.eclipse.egit.ui.internal.decorators.DecoratableResourceAdapterTest)  Time elapsed: 0.751 s
11:44:46 testDecorationFolderPrefixOfOtherFolder(org.eclipse.egit.ui.internal.decorators.DecoratableResourceAdapterTest)  Time elapsed: 0.725 s
11:44:46 testDecorationNewFileInOneSubfolder(org.eclipse.egit.ui.internal.decorators.DecoratableResourceAdapterTest)  Time elapsed: 0.979 s
11:44:46 testDecorationNewFile(org.eclipse.egit.ui.internal.decorators.DecoratableResourceAdapterTest)  Time elapsed: 0.731 s
11:44:46 testDecorationNewFileInSubfolder(org.eclipse.egit.ui.internal.decorators.DecoratableResourceAdapterTest)  Time elapsed: 0.731 s
11:44:46 testDecorationCommittedFile(org.eclipse.egit.ui.internal.decorators.DecoratableResourceAdapterTest)  Time elapsed: 0.73 s
11:44:46 testDecorationFileInIgnoredFolder(org.eclipse.egit.ui.internal.decorators.DecoratableResourceAdapterTest)  Time elapsed: 0.726 s
11:44:46 testDecorationIgnoredFile(org.eclipse.egit.ui.internal.decorators.DecoratableResourceAdapterTest)  Time elapsed: 0.726 s
11:44:46 testDecorationAddedFile(org.eclipse.egit.ui.internal.decorators.DecoratableResourceAdapterTest)  Time elapsed: 0.729 s
11:44:46 Running org.eclipse.egit.ui.internal.push.PushToUpstreamTest
11:44:49 Tests run: 3, Failures: 0, Errors: 0, Skipped: 0, Time elapsed: 2.726 s - in org.eclipse.egit.ui.internal.push.PushToUpstreamTest
11:44:49 pushWithExistingUpstreamConfiguration(org.eclipse.egit.ui.internal.push.PushToUpstreamTest)  Time elapsed: 0.999 s
11:44:49 pushWithoutConfig(org.eclipse.egit.ui.internal.push.PushToUpstreamTest)  Time elapsed: 0.76 s
11:44:49 pushWithDefaultRemoteWithPushRefSpecs(org.eclipse.egit.ui.internal.push.PushToUpstreamTest)  Time elapsed: 0.956 s
11:44:49 Running org.eclipse.egit.ui.internal.push.PushBranchWizardTest
11:44:50 
11:44:50 (SWT:1468): Gtk-CRITICAL **: 15:44:50.598: gtk_box_gadget_distribute: assertion 'size >= 0' failed in GtkScrollbar
11:44:50 
11:44:50 (SWT:1468): Gtk-CRITICAL **: 15:44:50.599: gtk_box_gadget_distribute: assertion 'size >= 0' failed in GtkScrollbar
11:44:50 
11:44:50 (SWT:1468): Gtk-CRITICAL **: 15:44:50.601: gtk_box_gadget_distribute: assertion 'size >= 0' failed in GtkScrollbar
11:44:59 Tests run: 9, Failures: 0, Errors: 0, Skipped: 0, Time elapsed: 10.182 s - in org.eclipse.egit.ui.internal.push.PushBranchWizardTest
11:44:59 pushHeadToExistingRemote(org.eclipse.egit.ui.internal.push.PushBranchWizardTest)  Time elapsed: 1.148 s
11:44:59 pushWithRemoteUpstreamConfiguration(org.eclipse.egit.ui.internal.push.PushBranchWizardTest)  Time elapsed: 1.017 s
11:44:59 pushWithDifferentBranchName(org.eclipse.egit.ui.internal.push.PushBranchWizardTest)  Time elapsed: 1.317 s
11:44:59 pushToExistingRemoteAndSetRebase(org.eclipse.egit.ui.internal.push.PushBranchWizardTest)  Time elapsed: 1.037 s
11:44:59 pushToNewRemote(org.eclipse.egit.ui.internal.push.PushBranchWizardTest)  Time elapsed: 1.187 s
11:44:59 pushToExistingRemoteWithoutConfiguringUpstream(org.eclipse.egit.ui.internal.push.PushBranchWizardTest)  Time elapsed: 1.08 s
11:44:59 pushToExistingRemote(org.eclipse.egit.ui.internal.push.PushBranchWizardTest)  Time elapsed: 1.249 s
11:44:59 pushWhenNoRemoteExistsYet(org.eclipse.egit.ui.internal.push.PushBranchWizardTest)  Time elapsed: 1.068 s
11:44:59 pushWithLocalUpstreamConfiguration(org.eclipse.egit.ui.internal.push.PushBranchWizardTest)  Time elapsed: 1.053 s
11:44:59 Running org.eclipse.egit.ui.internal.push.PushTagsWizardTest
11:45:01 Tests run: 1, Failures: 0, Errors: 0, Skipped: 0, Time elapsed: 1.178 s - in org.eclipse.egit.ui.internal.push.PushTagsWizardTest
11:45:01 pushTag(org.eclipse.egit.ui.internal.push.PushTagsWizardTest)  Time elapsed: 1.173 s
11:45:01 Running org.eclipse.egit.ui.internal.branch.BranchProjectTrackerTest
11:45:02 Tests run: 1, Failures: 0, Errors: 0, Skipped: 0, Time elapsed: 1.006 s - in org.eclipse.egit.ui.internal.branch.BranchProjectTrackerTest
11:45:02 twoProjectsWithOnlyOneOnBranch(org.eclipse.egit.ui.internal.branch.BranchProjectTrackerTest)  Time elapsed: 1.002 s
11:45:02 Running org.eclipse.egit.ui.internal.actions.StashesMenuTest
11:45:03 
11:45:03 (SWT:1468): Gtk-WARNING **: 15:45:03.546: Negative content width -6 (allocation 1, extents 4x3) while allocating gadget (node toolbar, owner GtkToolbar)
11:45:03 
11:45:03 (SWT:1468): Gtk-WARNING **: 15:45:03.546: Negative content height -3 (allocation 1, extents 2x2) while allocating gadget (node toolbar, owner GtkToolbar)
11:45:03 
11:45:03 (SWT:1468): Gtk-WARNING **: 15:45:03.546: Negative content width -6 (allocation 1, extents 4x3) while allocating gadget (node toolbar, owner GtkToolbar)
11:45:03 
11:45:03 (SWT:1468): Gtk-WARNING **: 15:45:03.546: Negative content height -3 (allocation 1, extents 2x2) while allocating gadget (node toolbar, owner GtkToolbar)
11:45:03 
11:45:03 (SWT:1468): Gtk-WARNING **: 15:45:03.631: Negative content width -6 (allocation 1, extents 4x3) while allocating gadget (node toolbar, owner GtkToolbar)
11:45:03 
11:45:03 (SWT:1468): Gtk-WARNING **: 15:45:03.646: Negative content width -6 (allocation 1, extents 4x3) while allocating gadget (node toolbar, owner GtkToolbar)
11:45:03 Tests run: 2, Failures: 0, Errors: 0, Skipped: 0, Time elapsed: 1.796 s - in org.eclipse.egit.ui.internal.actions.StashesMenuTest
11:45:03 menuWithoutStashes(org.eclipse.egit.ui.internal.actions.StashesMenuTest)  Time elapsed: 0.697 s
11:45:03 stashAndApplyChanges(org.eclipse.egit.ui.internal.actions.StashesMenuTest)  Time elapsed: 1.093 s
11:45:03 Running org.eclipse.egit.ui.internal.actions.LinkedResourcesTest
11:45:05 Tests run: 2, Failures: 0, Errors: 0, Skipped: 0, Time elapsed: 1.11 s - in org.eclipse.egit.ui.internal.actions.LinkedResourcesTest
11:45:05 testSomeActionsWithoutLinkedResources(org.eclipse.egit.ui.internal.actions.LinkedResourcesTest)  Time elapsed: 0.536 s
11:45:05 testNoActionOnLinkedResources(org.eclipse.egit.ui.internal.actions.LinkedResourcesTest)  Time elapsed: 0.567 s
11:45:05 Running org.eclipse.egit.ui.internal.actions.SwitchToMenuTest
11:45:12 Tests run: 8, Failures: 0, Errors: 0, Skipped: 0, Time elapsed: 7.829 s - in org.eclipse.egit.ui.internal.actions.SwitchToMenuTest
11:45:12 multipleSelectionWithMultipleRepositoriesAndNoCommonBranches(org.eclipse.egit.ui.internal.actions.SwitchToMenuTest)  Time elapsed: 0.856 s
11:45:12 selectionWithProj1(org.eclipse.egit.ui.internal.actions.SwitchToMenuTest)  Time elapsed: 0.551 s
11:45:12 selectionNotAdaptableToRepository(org.eclipse.egit.ui.internal.actions.SwitchToMenuTest)  Time elapsed: 0.064 s
11:45:12 selectionWithProj1AndReflog(org.eclipse.egit.ui.internal.actions.SwitchToMenuTest)  Time elapsed: 0.562 s
11:45:12 validateMenuEntriesForMultiSelectionWithMultipleRepositories(org.eclipse.egit.ui.internal.actions.SwitchToMenuTest)  Time elapsed: 2.81 s
11:45:12 validateBranchSwitchingForForMultiSelectionWithMultipleRepositories(org.eclipse.egit.ui.internal.actions.SwitchToMenuTest)  Time elapsed: 1.321 s
11:45:12 selectionWithRepositoryHavingOver20Branches(org.eclipse.egit.ui.internal.actions.SwitchToMenuTest)  Time elapsed: 1.578 s
11:45:12 emptySelection(org.eclipse.egit.ui.internal.actions.SwitchToMenuTest)  Time elapsed: 0.063 s
11:45:12 Running org.eclipse.egit.ui.internal.fetch.FetchGerritChangeTest
11:45:12 Tests run: 15, Failures: 0, Errors: 0, Skipped: 0, Time elapsed: 0.011 s - in org.eclipse.egit.ui.internal.fetch.FetchGerritChangeTest
11:45:12 testChangeStringNoDigits(org.eclipse.egit.ui.internal.fetch.FetchGerritChangeTest)  Time elapsed: 0.007 s
11:45:12 testChangeStringOverflow(org.eclipse.egit.ui.internal.fetch.FetchGerritChangeTest)  Time elapsed: 0.001 s
11:45:12 testChangeStringTwoNumbers(org.eclipse.egit.ui.internal.fetch.FetchGerritChangeTest)  Time elapsed: 0.001 s
11:45:12 testFromRef(org.eclipse.egit.ui.internal.fetch.FetchGerritChangeTest)  Time elapsed: 0 s
11:45:12 testChangeStringNegative(org.eclipse.egit.ui.internal.fetch.FetchGerritChangeTest)  Time elapsed: 0 s
11:45:12 testChangeStringUri(org.eclipse.egit.ui.internal.fetch.FetchGerritChangeTest)  Time elapsed: 0 s
11:45:12 testRefFromChange(org.eclipse.egit.ui.internal.fetch.FetchGerritChangeTest)  Time elapsed: 0 s
11:45:12 testChangeStringUriNonsense(org.eclipse.egit.ui.internal.fetch.FetchGerritChangeTest)  Time elapsed: 0 s
11:45:12 testChangeStringThreeNumbers(org.eclipse.egit.ui.internal.fetch.FetchGerritChangeTest)  Time elapsed: 0 s
11:45:12 testChangeStringMultiline(org.eclipse.egit.ui.internal.fetch.FetchGerritChangeTest)  Time elapsed: 0 s
11:45:12 testChangeStringSingleNumber(org.eclipse.egit.ui.internal.fetch.FetchGerritChangeTest)  Time elapsed: 0 s
11:45:12 testChangeRefs(org.eclipse.egit.ui.internal.fetch.FetchGerritChangeTest)  Time elapsed: 0 s
11:45:12 testChangeStringEmpty(org.eclipse.egit.ui.internal.fetch.FetchGerritChangeTest)  Time elapsed: 0 s
11:45:12 testChangeStringNull(org.eclipse.egit.ui.internal.fetch.FetchGerritChangeTest)  Time elapsed: 0 s
11:45:12 testChangeStringZero(org.eclipse.egit.ui.internal.fetch.FetchGerritChangeTest)  Time elapsed: 0 s
11:45:12 Running org.eclipse.egit.ui.internal.submodules.SubmoduleFolderTest
11:45:14 
11:45:14 (SWT:1468): Gtk-WARNING **: 15:45:14.272: Negative content width -6 (allocation 1, extents 4x3) while allocating gadget (node toolbar, owner GtkToolbar)
11:45:14 
11:45:14 (SWT:1468): Gtk-WARNING **: 15:45:14.272: Negative content height -3 (allocation 1, extents 2x2) while allocating gadget (node toolbar, owner GtkToolbar)
11:45:14 
11:45:14 (SWT:1468): Gtk-WARNING **: 15:45:14.272: Negative content width -6 (allocation 1, extents 4x3) while allocating gadget (node toolbar, owner GtkToolbar)
11:45:14 
11:45:14 (SWT:1468): Gtk-WARNING **: 15:45:14.272: Negative content height -3 (allocation 1, extents 2x2) while allocating gadget (node toolbar, owner GtkToolbar)
11:45:14 
11:45:14 (SWT:1468): Gtk-WARNING **: 15:45:14.600: Negative content width -6 (allocation 1, extents 4x3) while allocating gadget (node toolbar, owner GtkToolbar)
11:45:14 
11:45:14 (SWT:1468): Gtk-WARNING **: 15:45:14.605: Negative content width -6 (allocation 1, extents 4x3) while allocating gadget (node toolbar, owner GtkToolbar)
11:45:14 
11:45:14 (SWT:1468): Gtk-WARNING **: 15:45:14.610: Negative content width -6 (allocation 1, extents 4x3) while allocating gadget (node toolbar, owner GtkToolbar)
11:45:14 
11:45:14 (SWT:1468): Gtk-WARNING **: 15:45:14.616: Negative content width -6 (allocation 1, extents 4x3) while allocating gadget (node toolbar, owner GtkToolbar)
11:45:14 
11:45:14 (SWT:1468): Gtk-WARNING **: 15:45:14.637: Negative content width -6 (allocation 1, extents 4x3) while allocating gadget (node toolbar, owner GtkToolbar)
11:45:14 
11:45:14 (SWT:1468): Gtk-WARNING **: 15:45:14.637: Negative content width -6 (allocation 1, extents 4x3) while allocating gadget (node toolbar, owner GtkToolbar)
11:45:14 
11:45:14 (SWT:1468): Gtk-WARNING **: 15:45:14.670: Negative content width -6 (allocation 1, extents 4x3) while allocating gadget (node toolbar, owner GtkToolbar)
11:45:14 
11:45:14 (SWT:1468): Gtk-WARNING **: 15:45:14.671: Negative content width -6 (allocation 1, extents 4x3) while allocating gadget (node toolbar, owner GtkToolbar)
11:45:21 
11:45:21 (SWT:1468): Gtk-WARNING **: 15:45:21.122: Negative content width -6 (allocation 1, extents 4x3) while allocating gadget (node toolbar, owner GtkToolbar)
11:45:21 
11:45:21 (SWT:1468): Gtk-WARNING **: 15:45:21.146: Negative content width -6 (allocation 1, extents 4x3) while allocating gadget (node toolbar, owner GtkToolbar)
11:45:21 
11:45:21 (SWT:1468): Gtk-WARNING **: 15:45:21.207: Negative content width -6 (allocation 1, extents 4x3) while allocating gadget (node toolbar, owner GtkToolbar)
11:45:21 
11:45:21 (SWT:1468): Gtk-WARNING **: 15:45:21.208: Negative content width -6 (allocation 1, extents 4x3) while allocating gadget (node toolbar, owner GtkToolbar)
11:45:21 
11:45:21 (SWT:1468): Gtk-CRITICAL **: 15:45:21.245: gtk_box_gadget_distribute: assertion 'size >= 0' failed in GtkScrollbar
11:45:21 
11:45:21 (SWT:1468): Gtk-CRITICAL **: 15:45:21.254: gtk_box_gadget_distribute: assertion 'size >= 0' failed in GtkScrollbar
11:45:21 
11:45:21 (SWT:1468): Gtk-CRITICAL **: 15:45:21.269: gtk_box_gadget_distribute: assertion 'size >= 0' failed in GtkScrollbar
11:45:21 
11:45:21 (SWT:1468): Gtk-CRITICAL **: 15:45:21.286: gtk_box_gadget_distribute: assertion 'size >= 0' failed in GtkScrollbar
11:45:21 
11:45:21 (SWT:1468): Gtk-CRITICAL **: 15:45:21.303: gtk_box_gadget_distribute: assertion 'size >= 0' failed in GtkScrollbar
11:45:21 
11:45:21 (SWT:1468): Gtk-CRITICAL **: 15:45:21.320: gtk_box_gadget_distribute: assertion 'size >= 0' failed in GtkScrollbar
11:45:21 
11:45:21 (SWT:1468): Gtk-CRITICAL **: 15:45:21.337: gtk_box_gadget_distribute: assertion 'size >= 0' failed in GtkScrollbar
11:45:21 
11:45:21 (SWT:1468): Gtk-WARNING **: 15:45:21.347: Negative content width -6 (allocation 1, extents 4x3) while allocating gadget (node toolbar, owner GtkToolbar)
11:45:21 
11:45:21 (SWT:1468): Gtk-WARNING **: 15:45:21.361: Negative content width -6 (allocation 1, extents 4x3) while allocating gadget (node toolbar, owner GtkToolbar)
11:45:21 
11:45:21 (SWT:1468): Gtk-CRITICAL **: 15:45:21.379: gtk_box_gadget_distribute: assertion 'size >= 0' failed in GtkScrollbar
11:45:21 
11:45:21 (SWT:1468): Gtk-WARNING **: 15:45:21.404: Negative content width -6 (allocation 1, extents 4x3) while allocating gadget (node toolbar, owner GtkToolbar)
11:45:21 
11:45:21 (SWT:1468): Gtk-CRITICAL **: 15:45:21.408: gtk_box_gadget_distribute: assertion 'size >= 0' failed in GtkScrollbar
11:45:21 
11:45:21 (SWT:1468): Gtk-CRITICAL **: 15:45:21.409: gtk_box_gadget_distribute: assertion 'size >= 0' failed in GtkScrollbar
11:45:21 
11:45:21 (SWT:1468): Gtk-WARNING **: 15:45:21.485: Negative content width -6 (allocation 1, extents 4x3) while allocating gadget (node toolbar, owner GtkToolbar)
11:45:28 Tests run: 9, Failures: 0, Errors: 0, Skipped: 0, Time elapsed: 16.032 s - in org.eclipse.egit.ui.internal.submodules.SubmoduleFolderTest
11:45:28 compareWithHeadInSubmoduleFolder(org.eclipse.egit.ui.internal.submodules.SubmoduleFolderTest)  Time elapsed: 2 s
11:45:28 testStageUnstageInSubRepo(org.eclipse.egit.ui.internal.submodules.SubmoduleFolderTest)  Time elapsed: 3.334 s
11:45:28 testDecoration(org.eclipse.egit.ui.internal.submodules.SubmoduleFolderTest)  Time elapsed: 1.784 s
11:45:28 testHistoryFromProjectExplorerIsFromSubRepository(org.eclipse.egit.ui.internal.submodules.SubmoduleFolderTest)  Time elapsed: 1.706 s
11:45:28 testParentFolderMapsToParentRepo(org.eclipse.egit.ui.internal.submodules.SubmoduleFolderTest)  Time elapsed: 1.255 s
11:45:28 testDisconnect(org.eclipse.egit.ui.internal.submodules.SubmoduleFolderTest)  Time elapsed: 1.961 s
11:45:28 testRepoRemoval(org.eclipse.egit.ui.internal.submodules.SubmoduleFolderTest)  Time elapsed: 1.359 s
11:45:28 testChildProjectMapsToSubRepo(org.eclipse.egit.ui.internal.submodules.SubmoduleFolderTest)  Time elapsed: 1.224 s
11:45:28 testChildFolderMapsToSubRepo(org.eclipse.egit.ui.internal.submodules.SubmoduleFolderTest)  Time elapsed: 1.349 s
11:45:28 Running org.eclipse.egit.ui.internal.CommonUtilsTest
11:45:28 Tests run: 10, Failures: 0, Errors: 0, Skipped: 0, Time elapsed: 0.088 s - in org.eclipse.egit.ui.internal.CommonUtilsTest
11:45:28 sortingShouldWorkForBigNumbers(org.eclipse.egit.ui.internal.CommonUtilsTest)  Time elapsed: 0.001 s
11:45:28 sortingShouldWorkForMixedParts(org.eclipse.egit.ui.internal.CommonUtilsTest)  Time elapsed: 0 s
11:45:28 sortingShouldWorkForNumbers(org.eclipse.egit.ui.internal.CommonUtilsTest)  Time elapsed: 0 s
11:45:28 testFooterOffset(org.eclipse.egit.ui.internal.CommonUtilsTest)  Time elapsed: 0 s
11:45:28 sortingShouldWorkForEqualAndEmptyStrings(org.eclipse.egit.ui.internal.CommonUtilsTest)  Time elapsed: 0 s
11:45:28 sortingShouldIgnoreCase(org.eclipse.egit.ui.internal.CommonUtilsTest)  Time elapsed: 0 s
11:45:28 testFooterOffsetNoFooter(org.eclipse.egit.ui.internal.CommonUtilsTest)  Time elapsed: 0 s
11:45:28 sortingShouldIgnoreLeadingZeros(org.eclipse.egit.ui.internal.CommonUtilsTest)  Time elapsed: 0 s
11:45:28 testResourceCompare(org.eclipse.egit.ui.internal.CommonUtilsTest)  Time elapsed: 0.086 s
11:45:28 sortingShouldWorkForEasyStrings(org.eclipse.egit.ui.internal.CommonUtilsTest)  Time elapsed: 0 s
11:45:28 Running org.eclipse.egit.ui.internal.selection.SelectionUtilsTest
11:45:29 Tests run: 1, Failures: 0, Errors: 0, Skipped: 0, Time elapsed: 0.078 s - in org.eclipse.egit.ui.internal.selection.SelectionUtilsTest
11:45:29 getSelectedResourcesShouldUseAllTraversals(org.eclipse.egit.ui.internal.selection.SelectionUtilsTest)  Time elapsed: 0.077 s
11:45:29 Running org.eclipse.egit.ui.internal.selection.SelectionForViewsTest
11:45:31 
11:45:31 (SWT:1468): Gtk-WARNING **: 15:45:31.013: Negative content width -9 (allocation 9, extents 9x9) while allocating gadget (node entry, owner GtkEntry)
11:45:31 
11:45:31 (SWT:1468): Gtk-CRITICAL **: 15:45:31.053: gtk_box_gadget_distribute: assertion 'size >= 0' failed in GtkScrollbar
11:45:31 
11:45:31 (SWT:1468): Gtk-CRITICAL **: 15:45:31.066: gtk_box_gadget_distribute: assertion 'size >= 0' failed in GtkScrollbar
11:45:31 
11:45:31 (SWT:1468): Gtk-WARNING **: 15:45:31.071: Negative content width -6 (allocation 1, extents 4x3) while allocating gadget (node toolbar, owner GtkToolbar)
11:45:31 
11:45:31 (SWT:1468): Gtk-CRITICAL **: 15:45:31.083: gtk_box_gadget_distribute: assertion 'size >= 0' failed in GtkScrollbar
11:45:31 
11:45:31 (SWT:1468): Gtk-CRITICAL **: 15:45:31.089: gtk_box_gadget_distribute: assertion 'size >= 0' failed in GtkScrollbar
11:45:31 
11:45:31 (SWT:1468): Gtk-WARNING **: 15:45:31.118: Negative content width -6 (allocation 1, extents 4x3) while allocating gadget (node toolbar, owner GtkToolbar)
11:45:31 
11:45:31 (SWT:1468): Gtk-WARNING **: 15:45:31.155: Negative content width -6 (allocation 1, extents 4x3) while allocating gadget (node toolbar, owner GtkToolbar)
11:45:31 
11:45:31 (SWT:1468): Gtk-WARNING **: 15:45:31.190: Negative content width -6 (allocation 1, extents 4x3) while allocating gadget (node toolbar, owner GtkToolbar)
11:45:31 
11:45:31 (SWT:1468): Gtk-WARNING **: 15:45:31.195: Negative content width -6 (allocation 1, extents 4x3) while allocating gadget (node toolbar, owner GtkToolbar)
11:45:31 
11:45:31 (SWT:1468): Gtk-WARNING **: 15:45:31.205: Negative content width -6 (allocation 1, extents 4x3) while allocating gadget (node toolbar, owner GtkToolbar)
11:45:31 
11:45:31 (SWT:1468): Gtk-WARNING **: 15:45:31.205: Negative content width -6 (allocation 1, extents 4x3) while allocating gadget (node toolbar, owner GtkToolbar)
11:45:31 
11:45:31 (SWT:1468): Gtk-WARNING **: 15:45:31.225: Negative content width -6 (allocation 1, extents 4x3) while allocating gadget (node toolbar, owner GtkToolbar)
11:45:31 
11:45:31 (SWT:1468): Gtk-WARNING **: 15:45:31.293: Negative content width -6 (allocation 1, extents 4x3) while allocating gadget (node toolbar, owner GtkToolbar)
11:45:31 
11:45:31 (SWT:1468): Gtk-WARNING **: 15:45:31.339: Negative content width -6 (allocation 1, extents 4x3) while allocating gadget (node toolbar, owner GtkToolbar)
11:45:31 
11:45:31 (SWT:1468): Gtk-WARNING **: 15:45:31.379: Negative content width -6 (allocation 1, extents 4x3) while allocating gadget (node toolbar, owner GtkToolbar)
11:45:31 
11:45:31 (SWT:1468): Gtk-CRITICAL **: 15:45:31.427: gtk_box_gadget_distribute: assertion 'size >= 0' failed in GtkScrollbar
11:45:31 
11:45:31 (SWT:1468): Gtk-CRITICAL **: 15:45:31.446: gtk_box_gadget_distribute: assertion 'size >= 0' failed in GtkScrollbar
11:45:31 
11:45:31 (SWT:1468): Gtk-CRITICAL **: 15:45:31.462: gtk_box_gadget_distribute: assertion 'size >= 0' failed in GtkScrollbar
11:45:31 
11:45:31 (SWT:1468): Gtk-CRITICAL **: 15:45:31.479: gtk_box_gadget_distribute: assertion 'size >= 0' failed in GtkScrollbar
11:45:31 
11:45:31 (SWT:1468): Gtk-CRITICAL **: 15:45:31.495: gtk_box_gadget_distribute: assertion 'size >= 0' failed in GtkScrollbar
11:45:31 
11:45:31 (SWT:1468): Gtk-CRITICAL **: 15:45:31.512: gtk_box_gadget_distribute: assertion 'size >= 0' failed in GtkScrollbar
11:45:31 
11:45:31 (SWT:1468): Gtk-CRITICAL **: 15:45:31.529: gtk_box_gadget_distribute: assertion 'size >= 0' failed in GtkScrollbar
11:45:31 
11:45:31 (SWT:1468): Gtk-CRITICAL **: 15:45:31.545: gtk_box_gadget_distribute: assertion 'size >= 0' failed in GtkScrollbar
11:45:31 
11:45:31 (SWT:1468): Gtk-CRITICAL **: 15:45:31.562: gtk_box_gadget_distribute: assertion 'size >= 0' failed in GtkScrollbar
11:45:31 
11:45:31 (SWT:1468): Gtk-CRITICAL **: 15:45:31.579: gtk_box_gadget_distribute: assertion 'size >= 0' failed in GtkScrollbar
11:45:31 
11:45:31 (SWT:1468): Gtk-CRITICAL **: 15:45:31.596: gtk_box_gadget_distribute: assertion 'size >= 0' failed in GtkScrollbar
11:45:31 
11:45:31 (SWT:1468): Gtk-CRITICAL **: 15:45:31.612: gtk_box_gadget_distribute: assertion 'size >= 0' failed in GtkScrollbar
11:45:31 
11:45:31 (SWT:1468): Gtk-CRITICAL **: 15:45:31.629: gtk_box_gadget_distribute: assertion 'size >= 0' failed in GtkScrollbar
11:45:31 
11:45:31 (SWT:1468): Gtk-CRITICAL **: 15:45:31.646: gtk_box_gadget_distribute: assertion 'size >= 0' failed in GtkScrollbar
11:45:31 
11:45:31 (SWT:1468): Gtk-WARNING **: 15:45:31.757: Negative content width -6 (allocation 1, extents 4x3) while allocating gadget (node toolbar, owner GtkToolbar)
11:45:31 
11:45:31 (SWT:1468): Gtk-WARNING **: 15:45:31.770: Negative content width -6 (allocation 1, extents 4x3) while allocating gadget (node toolbar, owner GtkToolbar)
11:45:33 
11:45:33 (SWT:1468): Gtk-WARNING **: 15:45:33.032: Negative content width -6 (allocation 1, extents 4x3) while allocating gadget (node toolbar, owner GtkToolbar)
11:45:33 
11:45:33 (SWT:1468): Gtk-WARNING **: 15:45:33.242: Negative content width -6 (allocation 1, extents 4x3) while allocating gadget (node toolbar, owner GtkToolbar)
11:45:33 
11:45:33 (SWT:1468): Gtk-WARNING **: 15:45:33.776: Negative content width -6 (allocation 1, extents 4x3) while allocating gadget (node toolbar, owner GtkToolbar)
11:45:33 
11:45:33 (SWT:1468): Gtk-WARNING **: 15:45:33.990: Negative content width -6 (allocation 1, extents 4x3) while allocating gadget (node toolbar, owner GtkToolbar)
11:45:34 
11:45:34 (SWT:1468): Gtk-CRITICAL **: 15:45:34.527: gtk_box_gadget_distribute: assertion 'size >= 0' failed in GtkScrollbar
11:45:34 
11:45:34 (SWT:1468): Gtk-WARNING **: 15:45:34.530: Negative content width -6 (allocation 1, extents 4x3) while allocating gadget (node toolbar, owner GtkToolbar)
11:45:34 
11:45:34 (SWT:1468): Gtk-WARNING **: 15:45:34.736: Negative content width -6 (allocation 1, extents 4x3) while allocating gadget (node toolbar, owner GtkToolbar)
11:45:35 
11:45:35 (SWT:1468): Gtk-CRITICAL **: 15:45:35.256: gtk_box_gadget_distribute: assertion 'size >= 0' failed in GtkScrollbar
11:45:35 
11:45:35 (SWT:1468): Gtk-WARNING **: 15:45:35.287: Negative content width -6 (allocation 1, extents 4x3) while allocating gadget (node toolbar, owner GtkToolbar)
11:45:35 
11:45:35 (SWT:1468): Gtk-CRITICAL **: 15:45:35.303: gtk_box_gadget_distribute: assertion 'size >= 0' failed in GtkScrollbar
11:45:35 
11:45:35 (SWT:1468): Gtk-CRITICAL **: 15:45:35.304: gtk_box_gadget_distribute: assertion 'size >= 0' failed in GtkScrollbar
11:45:35 
11:45:35 (SWT:1468): Gtk-WARNING **: 15:45:35.492: Negative content width -6 (allocation 1, extents 4x3) while allocating gadget (node toolbar, owner GtkToolbar)
11:45:38 
11:45:38 (SWT:1468): Gtk-WARNING **: 15:45:38.016: Negative content width -6 (allocation 1, extents 4x3) while allocating gadget (node toolbar, owner GtkToolbar)
11:45:38 
11:45:38 (SWT:1468): Gtk-WARNING **: 15:45:38.030: Negative content width -6 (allocation 1, extents 4x3) while allocating gadget (node toolbar, owner GtkToolbar)
11:45:38 
11:45:38 (SWT:1468): Gtk-WARNING **: 15:45:38.892: Negative content width -9 (allocation 9, extents 9x9) while allocating gadget (node entry, owner GtkEntry)
11:45:38 
11:45:38 (SWT:1468): Gtk-CRITICAL **: 15:45:38.937: gtk_box_gadget_distribute: assertion 'size >= 0' failed in GtkScrollbar
11:45:38 
11:45:38 (SWT:1468): Gtk-CRITICAL **: 15:45:38.951: gtk_box_gadget_distribute: assertion 'size >= 0' failed in GtkScrollbar
11:45:38 
11:45:38 (SWT:1468): Gtk-WARNING **: 15:45:38.957: Negative content width -6 (allocation 1, extents 4x3) while allocating gadget (node toolbar, owner GtkToolbar)
11:45:38 
11:45:38 (SWT:1468): Gtk-CRITICAL **: 15:45:38.967: gtk_box_gadget_distribute: assertion 'size >= 0' failed in GtkScrollbar
11:45:38 
11:45:38 (SWT:1468): Gtk-CRITICAL **: 15:45:38.973: gtk_box_gadget_distribute: assertion 'size >= 0' failed in GtkScrollbar
11:45:39 
11:45:39 (SWT:1468): Gtk-WARNING **: 15:45:39.043: Negative content width -6 (allocation 1, extents 4x3) while allocating gadget (node toolbar, owner GtkToolbar)
11:45:39 
11:45:39 (SWT:1468): Gtk-WARNING **: 15:45:39.081: Negative content width -6 (allocation 1, extents 4x3) while allocating gadget (node toolbar, owner GtkToolbar)
11:45:39 
11:45:39 (SWT:1468): Gtk-WARNING **: 15:45:39.086: Negative content width -6 (allocation 1, extents 4x3) while allocating gadget (node toolbar, owner GtkToolbar)
11:45:39 
11:45:39 (SWT:1468): Gtk-WARNING **: 15:45:39.097: Negative content width -6 (allocation 1, extents 4x3) while allocating gadget (node toolbar, owner GtkToolbar)
11:45:39 
11:45:39 (SWT:1468): Gtk-WARNING **: 15:45:39.097: Negative content width -6 (allocation 1, extents 4x3) while allocating gadget (node toolbar, owner GtkToolbar)
11:45:39 
11:45:39 (SWT:1468): Gtk-WARNING **: 15:45:39.119: Negative content width -6 (allocation 1, extents 4x3) while allocating gadget (node toolbar, owner GtkToolbar)
11:45:39 
11:45:39 (SWT:1468): Gtk-WARNING **: 15:45:39.187: Negative content width -6 (allocation 1, extents 4x3) while allocating gadget (node toolbar, owner GtkToolbar)
11:45:39 
11:45:39 (SWT:1468): Gtk-WARNING **: 15:45:39.236: Negative content width -6 (allocation 1, extents 4x3) while allocating gadget (node toolbar, owner GtkToolbar)
11:45:39 
11:45:39 (SWT:1468): Gtk-WARNING **: 15:45:39.282: Negative content width -6 (allocation 1, extents 4x3) while allocating gadget (node toolbar, owner GtkToolbar)
11:45:39 
11:45:39 (SWT:1468): Gtk-CRITICAL **: 15:45:39.317: gtk_box_gadget_distribute: assertion 'size >= 0' failed in GtkScrollbar
11:45:39 
11:45:39 (SWT:1468): Gtk-CRITICAL **: 15:45:39.343: gtk_box_gadget_distribute: assertion 'size >= 0' failed in GtkScrollbar
11:45:39 
11:45:39 (SWT:1468): Gtk-CRITICAL **: 15:45:39.360: gtk_box_gadget_distribute: assertion 'size >= 0' failed in GtkScrollbar
11:45:39 
11:45:39 (SWT:1468): Gtk-CRITICAL **: 15:45:39.375: gtk_box_gadget_distribute: assertion 'size >= 0' failed in GtkScrollbar
11:45:39 
11:45:39 (SWT:1468): Gtk-CRITICAL **: 15:45:39.394: gtk_box_gadget_distribute: assertion 'size >= 0' failed in GtkScrollbar
11:45:39 
11:45:39 (SWT:1468): Gtk-CRITICAL **: 15:45:39.417: gtk_box_gadget_distribute: assertion 'size >= 0' failed in GtkScrollbar
11:45:39 
11:45:39 (SWT:1468): Gtk-CRITICAL **: 15:45:39.433: gtk_box_gadget_distribute: assertion 'size >= 0' failed in GtkScrollbar
11:45:39 
11:45:39 (SWT:1468): Gtk-CRITICAL **: 15:45:39.449: gtk_box_gadget_distribute: assertion 'size >= 0' failed in GtkScrollbar
11:45:39 
11:45:39 (SWT:1468): Gtk-CRITICAL **: 15:45:39.466: gtk_box_gadget_distribute: assertion 'size >= 0' failed in GtkScrollbar
11:45:39 
11:45:39 (SWT:1468): Gtk-CRITICAL **: 15:45:39.483: gtk_box_gadget_distribute: assertion 'size >= 0' failed in GtkScrollbar
11:45:39 
11:45:39 (SWT:1468): Gtk-CRITICAL **: 15:45:39.500: gtk_box_gadget_distribute: assertion 'size >= 0' failed in GtkScrollbar
11:45:39 
11:45:39 (SWT:1468): Gtk-CRITICAL **: 15:45:39.516: gtk_box_gadget_distribute: assertion 'size >= 0' failed in GtkScrollbar
11:45:39 
11:45:39 (SWT:1468): Gtk-WARNING **: 15:45:39.697: Negative content width -6 (allocation 1, extents 4x3) while allocating gadget (node toolbar, owner GtkToolbar)
11:45:39 
11:45:39 (SWT:1468): Gtk-WARNING **: 15:45:39.710: Negative content width -6 (allocation 1, extents 4x3) while allocating gadget (node toolbar, owner GtkToolbar)
11:45:40 
11:45:40 (SWT:1468): Gtk-WARNING **: 15:45:40.973: Negative content width -6 (allocation 1, extents 4x3) while allocating gadget (node toolbar, owner GtkToolbar)
11:45:41 
11:45:41 (SWT:1468): Gtk-WARNING **: 15:45:41.185: Negative content width -6 (allocation 1, extents 4x3) while allocating gadget (node toolbar, owner GtkToolbar)
11:45:41 
11:45:41 (SWT:1468): Gtk-WARNING **: 15:45:41.719: Negative content width -6 (allocation 1, extents 4x3) while allocating gadget (node toolbar, owner GtkToolbar)
11:45:42 
11:45:42 (SWT:1468): Gtk-WARNING **: 15:45:41.929: Negative content width -6 (allocation 1, extents 4x3) while allocating gadget (node toolbar, owner GtkToolbar)
11:45:42 
11:45:42 (SWT:1468): Gtk-CRITICAL **: 15:45:42.467: gtk_box_gadget_distribute: assertion 'size >= 0' failed in GtkScrollbar
11:45:42 
11:45:42 (SWT:1468): Gtk-WARNING **: 15:45:42.470: Negative content width -6 (allocation 1, extents 4x3) while allocating gadget (node toolbar, owner GtkToolbar)
11:45:42 
11:45:42 (SWT:1468): Gtk-CRITICAL **: 15:45:42.484: gtk_box_gadget_distribute: assertion 'size >= 0' failed in GtkScrollbar
11:45:42 
11:45:42 (SWT:1468): Gtk-CRITICAL **: 15:45:42.485: gtk_box_gadget_distribute: assertion 'size >= 0' failed in GtkScrollbar
11:45:42 
11:45:42 (SWT:1468): Gtk-CRITICAL **: 15:45:42.504: gtk_box_gadget_distribute: assertion 'size >= 0' failed in GtkScrollbar
11:45:42 
11:45:42 (SWT:1468): Gtk-WARNING **: 15:45:42.679: Negative content width -6 (allocation 1, extents 4x3) while allocating gadget (node toolbar, owner GtkToolbar)
11:45:43 
11:45:43 (SWT:1468): Gtk-CRITICAL **: 15:45:43.196: gtk_box_gadget_distribute: assertion 'size >= 0' failed in GtkScrollbar
11:45:43 
11:45:43 (SWT:1468): Gtk-WARNING **: 15:45:43.218: Negative content width -6 (allocation 1, extents 4x3) while allocating gadget (node toolbar, owner GtkToolbar)
11:45:43 
11:45:43 (SWT:1468): Gtk-CRITICAL **: 15:45:43.226: gtk_box_gadget_distribute: assertion 'size >= 0' failed in GtkScrollbar
11:45:43 
11:45:43 (SWT:1468): Gtk-CRITICAL **: 15:45:43.236: gtk_box_gadget_distribute: assertion 'size >= 0' failed in GtkScrollbar
11:45:43 
11:45:43 (SWT:1468): Gtk-WARNING **: 15:45:43.430: Negative content width -6 (allocation 1, extents 4x3) while allocating gadget (node toolbar, owner GtkToolbar)
11:45:45 
11:45:45 (SWT:1468): Gtk-WARNING **: 15:45:45.236: Negative content width -6 (allocation 1, extents 4x3) while allocating gadget (node toolbar, owner GtkToolbar)
11:45:45 
11:45:45 (SWT:1468): Gtk-WARNING **: 15:45:45.248: Negative content width -6 (allocation 1, extents 4x3) while allocating gadget (node toolbar, owner GtkToolbar)
11:45:45 Tests run: 3, Failures: 0, Errors: 0, Skipped: 1, Time elapsed: 16.303 s - in org.eclipse.egit.ui.internal.selection.SelectionForViewsTest
11:45:45 testViewsReactOnRepoSwitchInStaging(org.eclipse.egit.ui.internal.selection.SelectionForViewsTest) skipped
11:45:45 testViewsReactOnBareRepoViewSelection(org.eclipse.egit.ui.internal.selection.SelectionForViewsTest)  Time elapsed: 9.075 s
11:45:45 testViewsReactOnRepoViewSelection(org.eclipse.egit.ui.internal.selection.SelectionForViewsTest)  Time elapsed: 7.217 s
11:45:45 Running org.eclipse.egit.ui.internal.CompareUtilsTest
11:45:47 Tests run: 2, Failures: 0, Errors: 0, Skipped: 0, Time elapsed: 1.647 s - in org.eclipse.egit.ui.internal.CompareUtilsTest
11:45:47 testIndexEditWithAttributes(org.eclipse.egit.ui.internal.CompareUtilsTest)  Time elapsed: 0.902 s
11:45:47 testIndexEdit(org.eclipse.egit.ui.internal.CompareUtilsTest)  Time elapsed: 0.738 s
11:45:47 Running org.eclipse.egit.ui.search.CommitSearchQueryTest
11:45:51 Tests run: 7, Failures: 0, Errors: 0, Skipped: 0, Time elapsed: 4.124 s - in org.eclipse.egit.ui.search.CommitSearchQueryTest
11:45:51 testQuery(org.eclipse.egit.ui.search.CommitSearchQueryTest)  Time elapsed: 0.529 s
11:45:51 testMatchMessage(org.eclipse.egit.ui.search.CommitSearchQueryTest)  Time elapsed: 0.624 s
11:45:51 testCaseInsensitive(org.eclipse.egit.ui.search.CommitSearchQueryTest)  Time elapsed: 0.634 s
11:45:51 testMatchCommit(org.eclipse.egit.ui.search.CommitSearchQueryTest)  Time elapsed: 0.524 s
11:45:51 testMatchParent(org.eclipse.egit.ui.search.CommitSearchQueryTest)  Time elapsed: 0.524 s
11:45:51 testMatchTree(org.eclipse.egit.ui.search.CommitSearchQueryTest)  Time elapsed: 0.611 s
11:45:51 testEmptyMatches(org.eclipse.egit.ui.search.CommitSearchQueryTest)  Time elapsed: 0.625 s
11:45:51 Running org.eclipse.egit.ui.search.CommitSearchDialogTest
11:45:51 
11:45:51 (SWT:1468): Gtk-WARNING **: 15:45:51.849: Negative content width -6 (allocation 1, extents 4x3) while allocating gadget (node toolbar, owner GtkToolbar)
11:45:51 
11:45:51 (SWT:1468): Gtk-WARNING **: 15:45:51.865: Negative content width -6 (allocation 1, extents 4x3) while allocating gadget (node toolbar, owner GtkToolbar)
11:45:51 
11:45:51 (SWT:1468): Gtk-WARNING **: 15:45:51.987: Negative content width -6 (allocation 1, extents 4x3) while allocating gadget (node toolbar, owner GtkToolbar)
11:45:52 
11:45:52 (SWT:1468): Gtk-WARNING **: 15:45:52.036: Negative content width -6 (allocation 1, extents 4x3) while allocating gadget (node toolbar, owner GtkToolbar)
11:45:52 
11:45:52 (SWT:1468): Gtk-WARNING **: 15:45:52.703: Negative content width -6 (allocation 1, extents 4x3) while allocating gadget (node toolbar, owner GtkToolbar)
11:45:52 Tests run: 1, Failures: 0, Errors: 0, Skipped: 0, Time elapsed: 1.691 s - in org.eclipse.egit.ui.search.CommitSearchDialogTest
11:45:52 openCommitTabOnSearchDialog(org.eclipse.egit.ui.search.CommitSearchDialogTest)  Time elapsed: 1.688 s
11:45:52 Running org.eclipse.egit.ui.submodule.SubmoduleUpdateTest
11:45:53 
11:45:53 (SWT:1468): Gtk-WARNING **: 15:45:53.541: Negative content width -6 (allocation 1, extents 4x3) while allocating gadget (node toolbar, owner GtkToolbar)
11:45:58 
11:45:58 (SWT:1468): Gtk-WARNING **: 15:45:58.495: Negative content width -6 (allocation 1, extents 4x3) while allocating gadget (node toolbar, owner GtkToolbar)
11:45:58 Tests run: 1, Failures: 0, Errors: 0, Skipped: 0, Time elapsed: 5.769 s - in org.eclipse.egit.ui.submodule.SubmoduleUpdateTest
11:45:58 updateSubmodule(org.eclipse.egit.ui.submodule.SubmoduleUpdateTest)  Time elapsed: 5.764 s
11:45:58 Running org.eclipse.egit.ui.submodule.SubmoduleAddTest
11:45:59 
11:45:59 (SWT:1468): Gtk-WARNING **: 15:45:59.329: Negative content width -6 (allocation 1, extents 4x3) while allocating gadget (node toolbar, owner GtkToolbar)
11:46:03 
11:46:03 (SWT:1468): Gtk-WARNING **: 15:46:03.326: Negative content width -6 (allocation 1, extents 4x3) while allocating gadget (node toolbar, owner GtkToolbar)
11:46:03 Tests run: 1, Failures: 0, Errors: 0, Skipped: 0, Time elapsed: 4.827 s - in org.eclipse.egit.ui.submodule.SubmoduleAddTest
11:46:03 addAtRoot(org.eclipse.egit.ui.submodule.SubmoduleAddTest)  Time elapsed: 4.82 s
11:46:03 Running org.eclipse.egit.ui.submodule.SubmoduleSyncTest
11:46:04 
11:46:04 (SWT:1468): Gtk-WARNING **: 15:46:04.132: Negative content width -6 (allocation 1, extents 4x3) while allocating gadget (node toolbar, owner GtkToolbar)
11:46:09 
11:46:09 (SWT:1468): Gtk-WARNING **: 15:46:09.033: Negative content width -6 (allocation 1, extents 4x3) while allocating gadget (node toolbar, owner GtkToolbar)
11:46:09 Tests run: 1, Failures: 0, Errors: 0, Skipped: 0, Time elapsed: 5.704 s - in org.eclipse.egit.ui.submodule.SubmoduleSyncTest
11:46:09 syncSubmodule(org.eclipse.egit.ui.submodule.SubmoduleSyncTest)  Time elapsed: 5.699 s
11:46:09 Running org.eclipse.egit.ui.operations.GitScopeUtilTest
11:46:12 Tests run: 5, Failures: 0, Errors: 0, Skipped: 0, Time elapsed: 3.824 s - in org.eclipse.egit.ui.operations.GitScopeUtilTest
11:46:12 relatedChangesWithPrompt(org.eclipse.egit.ui.operations.GitScopeUtilTest)  Time elapsed: 1.583 s
11:46:12 modelProviderWithExtensionFiles(org.eclipse.egit.ui.operations.GitScopeUtilTest)  Time elapsed: 0.556 s
11:46:12 relatedChangesWithInvalidParams(org.eclipse.egit.ui.operations.GitScopeUtilTest)  Time elapsed: 0.541 s
11:46:12 relatedChangesWithNullResources(org.eclipse.egit.ui.operations.GitScopeUtilTest)  Time elapsed: 0.528 s
11:46:12 relatedChangesWithEmptyResources(org.eclipse.egit.ui.operations.GitScopeUtilTest)  Time elapsed: 0.613 s
11:46:12 Running org.eclipse.egit.ui.prefpages.configuration.GlobalConfigurationPageTest
11:46:12 
11:46:12 !ENTRY org.eclipse.ui 2 2 2019-03-24 15:46:12.994
11:46:12 !MESSAGE Invalid preference category path: org.eclipse.ui.net.NetPreferences (bundle: org.eclipse.jsch.ui, page: org.eclipse.jsch.ui.SSHPreferences)
11:46:13 
11:46:13 (SWT:1468): Gtk-WARNING **: 15:46:13.011: Negative content width -13 (allocation 5, extents 9x9) while allocating gadget (node entry, owner GtkEntry)
11:46:13 
11:46:13 (SWT:1468): Gtk-WARNING **: 15:46:13.186: Negative content width -13 (allocation 5, extents 9x9) while allocating gadget (node entry, owner GtkEntry)
11:46:13 
11:46:13 (SWT:1468): Gtk-WARNING **: 15:46:13.334: Negative content width -13 (allocation 5, extents 9x9) while allocating gadget (node entry, owner GtkEntry)
11:46:13 
11:46:13 (SWT:1468): Gtk-WARNING **: 15:46:13.511: Negative content width -13 (allocation 5, extents 9x9) while allocating gadget (node entry, owner GtkEntry)
11:46:13 
11:46:13 (SWT:1468): Gtk-WARNING **: 15:46:13.612: Negative content width -13 (allocation 5, extents 9x9) while allocating gadget (node entry, owner GtkEntry)
11:46:13 
11:46:13 (SWT:1468): Gtk-WARNING **: 15:46:13.723: Negative content width -13 (allocation 5, extents 9x9) while allocating gadget (node entry, owner GtkEntry)
11:46:13 
11:46:13 (SWT:1468): Gtk-WARNING **: 15:46:13.876: Negative content width -13 (allocation 5, extents 9x9) while allocating gadget (node entry, owner GtkEntry)
11:46:13 
11:46:13 (SWT:1468): Gtk-WARNING **: 15:46:13.943: Negative content width -6 (allocation 1, extents 4x3) while allocating gadget (node toolbar, owner GtkToolbar)
11:46:13 
11:46:13 (SWT:1468): Gtk-WARNING **: 15:46:13.943: Negative content height -3 (allocation 1, extents 2x2) while allocating gadget (node toolbar, owner GtkToolbar)
11:46:13 
11:46:13 (SWT:1468): Gtk-WARNING **: 15:46:13.943: Negative content width -6 (allocation 1, extents 4x3) while allocating gadget (node toolbar, owner GtkToolbar)
11:46:13 
11:46:13 (SWT:1468): Gtk-WARNING **: 15:46:13.943: Negative content height -3 (allocation 1, extents 2x2) while allocating gadget (node toolbar, owner GtkToolbar)
11:46:14 
11:46:14 (SWT:1468): Gtk-WARNING **: 15:46:14.090: Negative content width -13 (allocation 5, extents 9x9) while allocating gadget (node entry, owner GtkEntry)
11:46:14 
11:46:14 (SWT:1468): Gtk-WARNING **: 15:46:14.239: Negative content width -13 (allocation 5, extents 9x9) while allocating gadget (node entry, owner GtkEntry)
11:46:14 
11:46:14 (SWT:1468): Gtk-WARNING **: 15:46:14.419: Negative content width -13 (allocation 5, extents 9x9) while allocating gadget (node entry, owner GtkEntry)
11:46:14 
11:46:14 (SWT:1468): Gtk-WARNING **: 15:46:14.561: Negative content width -13 (allocation 5, extents 9x9) while allocating gadget (node entry, owner GtkEntry)
11:46:14 
11:46:14 (SWT:1468): Gtk-WARNING **: 15:46:14.705: Negative content width -13 (allocation 5, extents 9x9) while allocating gadget (node entry, owner GtkEntry)
11:46:14 Tests run: 11, Failures: 0, Errors: 0, Skipped: 0, Time elapsed: 1.858 s - in org.eclipse.egit.ui.prefpages.configuration.GlobalConfigurationPageTest
11:46:14 testAddSubSectionEntry(org.eclipse.egit.ui.prefpages.configuration.GlobalConfigurationPageTest)  Time elapsed: 0.201 s
11:46:14 testAddSectionEntry(org.eclipse.egit.ui.prefpages.configuration.GlobalConfigurationPageTest)  Time elapsed: 0.146 s
11:46:14 testCanCreateSameEntryValue(org.eclipse.egit.ui.prefpages.configuration.GlobalConfigurationPageTest)  Time elapsed: 0.177 s
11:46:14 testNodes(org.eclipse.egit.ui.prefpages.configuration.GlobalConfigurationPageTest)  Time elapsed: 0.101 s
11:46:14 testRemoveValue(org.eclipse.egit.ui.prefpages.configuration.GlobalConfigurationPageTest)  Time elapsed: 0.111 s
11:46:14 testAddSubSectionEntryWithSuggestion(org.eclipse.egit.ui.prefpages.configuration.GlobalConfigurationPageTest)  Time elapsed: 0.154 s
11:46:14 testOpenEditor(org.eclipse.egit.ui.prefpages.configuration.GlobalConfigurationPageTest)  Time elapsed: 0.214 s
11:46:14 testSubsectionWithDot(org.eclipse.egit.ui.prefpages.configuration.GlobalConfigurationPageTest)  Time elapsed: 0.148 s
11:46:14 testChecksForKey(org.eclipse.egit.ui.prefpages.configuration.GlobalConfigurationPageTest)  Time elapsed: 0.18 s
11:46:14 testRemoveSubSection(org.eclipse.egit.ui.prefpages.configuration.GlobalConfigurationPageTest)  Time elapsed: 0.143 s
11:46:14 testRemoveSection(org.eclipse.egit.ui.prefpages.configuration.GlobalConfigurationPageTest)  Time elapsed: 0.143 s
11:46:14 Running org.eclipse.egit.ui.httpauth.PushTest
11:46:14 2019-03-24 15:46:14.962:INFO:oejs.Server:WorkbenchTestable: jetty-9.4.14.v20181114; built: 2019-01-14T17:18:45.591Z; git: c4550056e785fb5665914545889f21dc136ad9e6; jvm 1.8.0_202-b08
11:46:14 2019-03-24 15:46:14.964:INFO:oejsh.ContextHandler:WorkbenchTestable: Started o.e.j.s.ServletContextHandler@482b7bb4{/sbasic,null,AVAILABLE}
11:46:14 2019-03-24 15:46:14.968:INFO:oejs.AbstractConnector:WorkbenchTestable: Started ServerConnector@36c5732f{HTTP/1.1,[http/1.1]}{127.0.0.1:34997}
11:46:14 2019-03-24 15:46:14.968:INFO:oejs.Server:WorkbenchTestable: Started @793685ms
11:46:15 
11:46:15 (SWT:1468): Gtk-WARNING **: 15:46:15.384: Negative content width -11 (allocation 1, extents 6x6) while allocating gadget (node button, owner GtkButton)
11:46:15 
11:46:15 (SWT:1468): Gtk-WARNING **: 15:46:15.544: gtk_widget_size_allocate(): attempt to allocate widget with width 608 and height -1
11:46:15 
11:46:15 (SWT:1468): Gtk-WARNING **: 15:46:15.544: Negative content height -1 (allocation 1, extents 1x1) while allocating gadget (node scrolledwindow, owner GtkScrolledWindow)
11:46:15 
11:46:15 (SWT:1468): Gtk-WARNING **: 15:46:15.544: gtk_widget_size_allocate(): attempt to allocate widget with width 6 and height -25
11:46:15 
11:46:15 (SWT:1468): Gtk-CRITICAL **: 15:46:15.544: gtk_box_gadget_distribute: assertion 'size >= 0' failed in GtkScrollbar
11:46:15 
11:46:15 (SWT:1468): Gtk-WARNING **: 15:46:15.554: gtk_widget_size_allocate(): attempt to allocate widget with width 608 and height -1
11:46:16 2019-03-24 15:46:16.458:INFO:oejs.AbstractConnector:WorkbenchTestable: Stopped ServerConnector@36c5732f{HTTP/1.1,[http/1.1]}{127.0.0.1:0}
11:46:16 2019-03-24 15:46:16.459:INFO:oejsh.ContextHandler:WorkbenchTestable: Stopped o.e.j.s.ServletContextHandler@482b7bb4{/sbasic,null,UNAVAILABLE}
11:46:16 Tests run: 1, Failures: 0, Errors: 0, Skipped: 0, Time elapsed: 1.622 s - in org.eclipse.egit.ui.httpauth.PushTest
11:46:16 testPush(org.eclipse.egit.ui.httpauth.PushTest)  Time elapsed: 1.621 s
11:46:16 Running org.eclipse.egit.ui.variables.DynamicVariablesTest
11:46:20 Tests run: 4, Failures: 0, Errors: 0, Skipped: 0, Time elapsed: 4.414 s - in org.eclipse.egit.ui.variables.DynamicVariablesTest
11:46:20 testGitBranch(org.eclipse.egit.ui.variables.DynamicVariablesTest)  Time elapsed: 1.159 s
11:46:20 testGitPath(org.eclipse.egit.ui.variables.DynamicVariablesTest)  Time elapsed: 1.078 s
11:46:20 testGitWorkTree(org.eclipse.egit.ui.variables.DynamicVariablesTest)  Time elapsed: 1.093 s
11:46:20 testGitDir(org.eclipse.egit.ui.variables.DynamicVariablesTest)  Time elapsed: 1.084 s
11:46:20 
11:46:20 Results:
11:46:20 
11:46:20 Failures: 
11:46:20   GitRepositoriesViewRepoDeletionTest.testRemoveRepositoryRemoveFromCachesBug483664:278 Expected no IndexDiffCache entries expected:<[[]]> but was:<[[/home/jenkins/workspace/egit.gerrit/repo/org.eclipse.egit.ui.test/target/work/data/test2/.git]]>
11:46:20 
11:46:20 Tests run: 467, Failures: 1, Errors: 0, Skipped: 12
11:46:20 
11:46:21 
11:46:21 !ENTRY org.eclipse.core.resources 2 10035 2019-03-24 15:46:21.858
11:46:21 !MESSAGE The workspace will exit with unsaved changes in this session.
11:46:23 [INFO] ------------------------------------------------------------------------
11:46:23 [INFO] BUILD FAILURE
11:46:23 [INFO] ------------------------------------------------------------------------
11:46:23 [INFO] Total time:  13:40 min
11:46:23 [INFO] Finished at: 2019-03-24T15:46:23Z
11:46:23 [INFO] ------------------------------------------------------------------------
11:46:23 [ERROR] Failed to execute goal org.eclipse.tycho:tycho-surefire-plugin:1.3.0:test (default-test) on project org.eclipse.egit.ui.test: There are test failures.
11:46:23 [ERROR] 
11:46:23 [ERROR] Please refer to /home/jenkins/workspace/egit.gerrit/repo/org.eclipse.egit.ui.test/target/surefire-reports for the individual test results.
11:46:23 [ERROR] -> [Help 1]
11:46:23 org.apache.maven.lifecycle.LifecycleExecutionException: Failed to execute goal org.eclipse.tycho:tycho-surefire-plugin:1.3.0:test (default-test) on project org.eclipse.egit.ui.test: There are test failures.
11:46:23 
11:46:23 Please refer to /home/jenkins/workspace/egit.gerrit/repo/org.eclipse.egit.ui.test/target/surefire-reports for the individual test results.
11:46:23     at org.apache.maven.lifecycle.internal.MojoExecutor.execute (MojoExecutor.java:215)
11:46:23     at org.apache.maven.lifecycle.internal.MojoExecutor.execute (MojoExecutor.java:156)
11:46:23     at org.apache.maven.lifecycle.internal.MojoExecutor.execute (MojoExecutor.java:148)
11:46:23     at org.apache.maven.lifecycle.internal.LifecycleModuleBuilder.buildProject (LifecycleModuleBuilder.java:117)
11:46:23     at org.apache.maven.lifecycle.internal.LifecycleModuleBuilder.buildProject (LifecycleModuleBuilder.java:81)
11:46:23     at org.apache.maven.lifecycle.internal.builder.singlethreaded.SingleThreadedBuilder.build (SingleThreadedBuilder.java:56)
11:46:23     at org.apache.maven.lifecycle.internal.LifecycleStarter.execute (LifecycleStarter.java:128)
11:46:23     at org.apache.maven.DefaultMaven.doExecute (DefaultMaven.java:305)
11:46:23     at org.apache.maven.DefaultMaven.doExecute (DefaultMaven.java:192)
11:46:23     at org.apache.maven.DefaultMaven.execute (DefaultMaven.java:105)
11:46:23     at org.apache.maven.cli.MavenCli.execute (MavenCli.java:956)
11:46:23     at org.apache.maven.cli.MavenCli.doMain (MavenCli.java:288)
11:46:23     at org.apache.maven.cli.MavenCli.main (MavenCli.java:192)
11:46:23     at sun.reflect.NativeMethodAccessorImpl.invoke0 (Native Method)
11:46:23     at sun.reflect.NativeMethodAccessorImpl.invoke (NativeMethodAccessorImpl.java:62)
11:46:23     at sun.reflect.DelegatingMethodAccessorImpl.invoke (DelegatingMethodAccessorImpl.java:43)
11:46:23     at java.lang.reflect.Method.invoke (Method.java:498)
11:46:23     at org.codehaus.plexus.classworlds.launcher.Launcher.launchEnhanced (Launcher.java:289)
11:46:23     at org.codehaus.plexus.classworlds.launcher.Launcher.launch (Launcher.java:229)
11:46:23     at org.codehaus.plexus.classworlds.launcher.Launcher.mainWithExitCode (Launcher.java:415)
11:46:23     at org.codehaus.plexus.classworlds.launcher.Launcher.main (Launcher.java:356)
11:46:23 Caused by: org.apache.maven.plugin.MojoFailureException: There are test failures.
11:46:23 
11:46:23 Please refer to /home/jenkins/workspace/egit.gerrit/repo/org.eclipse.egit.ui.test/target/surefire-reports for the individual test results.
11:46:23     at org.eclipse.tycho.surefire.TestMojo.runTest (TestMojo.java:1044)
11:46:23     at org.eclipse.tycho.surefire.TestMojo.execute (TestMojo.java:693)
11:46:23     at org.apache.maven.plugin.DefaultBuildPluginManager.executeMojo (DefaultBuildPluginManager.java:137)
11:46:23     at org.apache.maven.lifecycle.internal.MojoExecutor.execute (MojoExecutor.java:210)
11:46:23     at org.apache.maven.lifecycle.internal.MojoExecutor.execute (MojoExecutor.java:156)
11:46:23     at org.apache.maven.lifecycle.internal.MojoExecutor.execute (MojoExecutor.java:148)
11:46:23     at org.apache.maven.lifecycle.internal.LifecycleModuleBuilder.buildProject (LifecycleModuleBuilder.java:117)
11:46:23     at org.apache.maven.lifecycle.internal.LifecycleModuleBuilder.buildProject (LifecycleModuleBuilder.java:81)
11:46:23     at org.apache.maven.lifecycle.internal.builder.singlethreaded.SingleThreadedBuilder.build (SingleThreadedBuilder.java:56)
11:46:23     at org.apache.maven.lifecycle.internal.LifecycleStarter.execute (LifecycleStarter.java:128)
11:46:23     at org.apache.maven.DefaultMaven.doExecute (DefaultMaven.java:305)
11:46:23     at org.apache.maven.DefaultMaven.doExecute (DefaultMaven.java:192)
11:46:23     at org.apache.maven.DefaultMaven.execute (DefaultMaven.java:105)
11:46:23     at org.apache.maven.cli.MavenCli.execute (MavenCli.java:956)
11:46:23     at org.apache.maven.cli.MavenCli.doMain (MavenCli.java:288)
11:46:23     at org.apache.maven.cli.MavenCli.main (MavenCli.java:192)
11:46:23     at sun.reflect.NativeMethodAccessorImpl.invoke0 (Native Method)
11:46:23     at sun.reflect.NativeMethodAccessorImpl.invoke (NativeMethodAccessorImpl.java:62)
11:46:23     at sun.reflect.DelegatingMethodAccessorImpl.invoke (DelegatingMethodAccessorImpl.java:43)
11:46:23     at java.lang.reflect.Method.invoke (Method.java:498)
11:46:23     at org.codehaus.plexus.classworlds.launcher.Launcher.launchEnhanced (Launcher.java:289)
11:46:23     at org.codehaus.plexus.classworlds.launcher.Launcher.launch (Launcher.java:229)
11:46:23     at org.codehaus.plexus.classworlds.launcher.Launcher.mainWithExitCode (Launcher.java:415)
11:46:23     at org.codehaus.plexus.classworlds.launcher.Launcher.main (Launcher.java:356)
11:46:23 [ERROR] 
11:46:23 [ERROR] Re-run Maven using the -X switch to enable full debug logging.
11:46:23 [ERROR] 
11:46:23 [ERROR] For more information about the errors and possible solutions, please read the following articles:
11:46:23 [ERROR] [Help 1] http://cwiki.apache.org/confluence/display/MAVEN/MojoFailureException
11:46:23 [INFO] Build failures were ignored.
11:46:24 [egit.gerrit] $ /opt/tools/apache-maven/latest/bin/mvn -f repo/org.eclipse.egit.mylyn.ui.test/pom.xml -DGERRIT_BRANCH=master -DGERRIT_PATCHSET_REVISION=3000aee9af8f207e7304259bba4b8ba422aeb981 -DGERRIT_HOST=gerrit-local -DGERRIT_CHANGE_OWNER_EMAIL=thomas.wolf@paranor.ch "-DGERRIT_EVENT_ACCOUNT_NAME=Thomas Wolf" -DTEST_PARAMS=-Declipse.consoleLog=true -DGERRIT_CHANGE_URL=https://git.eclipse.org/r/139383 -DGERRIT_PATCHSET_UPLOADER_EMAIL=thomas.wolf@paranor.ch -DGERRIT_EVENT_TYPE=patchset-created -DGERRIT_PROJECT=egit/egit -DGERRIT_CHANGE_NUMBER=139383 -DGERRIT_SCHEME=ssh '-DGERRIT_PATCHSET_UPLOADER=\"Thomas Wolf\" <thomas.wolf@paranor.ch>' -DGERRIT_PORT=29418 -DGERRIT_CHANGE_PRIVATE_STATE=false -DGERRIT_REFSPEC=refs/changes/83/139383/1 -DJGIT_VERSION=5.4.0-SNAPSHOT "-DGERRIT_PATCHSET_UPLOADER_NAME=Thomas Wolf" '-DGERRIT_CHANGE_OWNER=\"Thomas Wolf\" <thomas.wolf@paranor.ch>' -DGERRIT_CHANGE_COMMIT_MESSAGE=QWRkIG1pc3NpbmcgYnJhY2VzIGluIFJlcG9zaXRvcmllc1ZpZXdQcm9wZXJ0eVRlc3RlcgoKQ2hhbmdlLUlkOiBJZGFmNmNmODk2ZmJlMjA2N2M2ZjZjYjMzNDQ1MGVhYThlNDNhY2JjYgpTaWduZWQtb2ZmLWJ5OiBUaG9tYXMgV29sZiA8dGhvbWFzLndvbGZAcGFyYW5vci5jaD4= "-DGERRIT_NAME=Eclipse Gerrit" -DGERRIT_TOPIC= "-DGERRIT_CHANGE_SUBJECT=Add missing braces in RepositoriesViewPropertyTester" -DJGIT_SITE=https://repo.eclipse.org/content/unzip/snapshots.unzip/org/eclipse/jgit/org.eclipse.jgit.repository/${JGIT_VERSION}/org.eclipse.jgit.repository-${JGIT_VERSION}.zip-unzip/ '-DGERRIT_EVENT_ACCOUNT=\"Thomas Wolf\" <thomas.wolf@paranor.ch>' -DGERRIT_CHANGE_WIP_STATE=false -DGERRIT_CHANGE_ID=Idaf6cf896fbe2067c6f6cb334450eaa8e43acbcb -DGERRIT_EVENT_HASH=514542662 -DGERRIT_VERSION=2.14.6 -DGERRIT_EVENT_ACCOUNT_EMAIL=thomas.wolf@paranor.ch -DGERRIT_PATCHSET_NUMBER=1 "-DGERRIT_CHANGE_OWNER_NAME=Thomas Wolf" -Djava.io.tmpdir=/home/jenkins/workspace/egit.gerrit/tmp/ "-Dtest.vmparams=-Declipse.consoleLog=true -Degit.test.tmpdir=/home/jenkins/workspace/egit.gerrit/tmp/egit.tmp/" -Djgit-site=https://repo.eclipse.org/content/unzip/snapshots.unzip/org/eclipse/jgit/org.eclipse.jgit.repository/5.4.0-SNAPSHOT/org.eclipse.jgit.repository-5.4.0-SNAPSHOT.zip-unzip/ -Declipse.p2.mirrors=false -Dmaven.repo.local=/home/jenkins/workspace/egit.gerrit/.repository -B -e verify --fail-never -P other-os
11:46:24 Picked up JAVA_TOOL_OPTIONS: -XX:+IgnoreUnrecognizedVMOptions -XX:+UseContainerSupport -XX:+UnlockExperimentalVMOptions -XX:+UseCGroupMemoryLimitForHeap
11:46:24 Picked up _JAVA_OPTIONS: -XX:MaxRAMPercentage=64.0
11:46:24 [INFO] Error stacktraces are turned on.
11:46:25 [INFO] Scanning for projects...
11:46:27 [INFO] Computing target platform for MavenProject: org.eclipse.egit:org.eclipse.egit.mylyn.ui.test:5.4.0-SNAPSHOT @ /home/jenkins/workspace/egit.gerrit/repo/org.eclipse.egit.mylyn.ui.test/pom.xml
11:46:32 [INFO] Adding repository http://download.eclipse.org/jetty/updates/jetty-bundles-9.x/9.4.14.v20181114
11:46:32 [INFO] Fetching p2.index from http://download.eclipse.org/technology/swtbot/snapshots/
11:46:32 [INFO] Fetching p2.index from http://download.eclipse.org/technology/swtbot/snapshots/
11:46:32 [INFO] Adding repository http://download.eclipse.org/technology/swtbot/snapshots
11:46:32 [INFO] Fetching p2.index from http://download.eclipse.org/tools/orbit/downloads/drops/R20190226160451/repository/
11:46:32 [INFO] Fetching p2.index from http://download.eclipse.org/tools/orbit/downloads/drops/R20190226160451/repository/
11:46:32 [INFO] Adding repository http://download.eclipse.org/tools/orbit/downloads/drops/R20190226160451/repository
11:46:32 [INFO] Fetching p2.index from http://download.eclipse.org/tools/orbit/downloads/drops2/R20190226160451/repository/
11:46:32 [INFO] Fetching p2.index from http://download.eclipse.org/tools/orbit/downloads/drops2/R20190226160451/repository/
11:46:33 [INFO] Fetching p2.index from http://download.eclipse.org/releases/neon/
11:46:33 [INFO] Fetching p2.index from http://download.eclipse.org/releases/neon/
11:46:33 [INFO] Adding repository http://download.eclipse.org/releases/neon
11:46:33 [INFO] Fetching p2.index from http://download.eclipse.org/technology/epp/packages/neon/
11:46:33 [INFO] Fetching p2.index from http://download.eclipse.org/technology/epp/packages/neon/
11:46:33 [INFO] Fetching p2.index from http://download.eclipse.org/releases/neon/201705151400/
11:46:33 [INFO] Fetching p2.index from http://download.eclipse.org/releases/neon/201705151400/
11:46:35 [INFO] Fetching p2.index from http://download.eclipse.org/releases/neon/201703141400/
11:46:35 [INFO] Fetching p2.index from http://download.eclipse.org/releases/neon/201703141400/
11:46:36 [INFO] Fetching p2.index from http://download.eclipse.org/releases/neon/201703231000/
11:46:36 [INFO] Fetching p2.index from http://download.eclipse.org/releases/neon/201703231000/
11:46:38 [INFO] Fetching p2.index from http://download.eclipse.org/releases/neon/201606221000/
11:46:38 [INFO] Fetching p2.index from http://download.eclipse.org/releases/neon/201606221000/
11:46:39 [INFO] Fetching p2.index from http://download.eclipse.org/releases/neon/201609281000/
11:46:39 [INFO] Fetching p2.index from http://download.eclipse.org/releases/neon/201609281000/
11:46:41 [INFO] Fetching p2.index from http://download.eclipse.org/releases/neon/201610111000/
11:46:41 [INFO] Fetching p2.index from http://download.eclipse.org/releases/neon/201610111000/
11:46:42 [INFO] Fetching p2.index from http://download.eclipse.org/releases/neon/201612211000/
11:46:42 [INFO] Fetching p2.index from http://download.eclipse.org/releases/neon/201612211000/
11:46:49 [INFO] Fetching p2.index from https://repo.eclipse.org/content/unzip/snapshots.unzip/org/eclipse/jgit/org.eclipse.jgit.repository/5.4.0-SNAPSHOT/org.eclipse.jgit.repository-5.4.0-SNAPSHOT.zip-unzip/ (172B)
11:46:49 [INFO] Fetching p2.index from https://repo.eclipse.org/content/unzip/snapshots.unzip/org/eclipse/jgit/org.eclipse.jgit.repository/5.4.0-SNAPSHOT/org.eclipse.jgit.repository-5.4.0-SNAPSHOT.zip-unzip/ (172B)
11:46:49 [INFO] Adding repository https://repo.eclipse.org/content/unzip/snapshots.unzip/org/eclipse/jgit/org.eclipse.jgit.repository/5.4.0-SNAPSHOT/org.eclipse.jgit.repository-5.4.0-SNAPSHOT.zip-unzip
11:46:49 [INFO] Fetching p2.index from http://download.eclipse.org/cbi/updates/license/
11:46:49 [INFO] Fetching p2.index from http://download.eclipse.org/cbi/updates/license/
11:46:49 [INFO] Adding repository http://download.eclipse.org/cbi/updates/license
11:46:49 [INFO] Fetching p2.index from http://download.eclipse.org/cbi/updates/license/2.0.0.v20180130-0820/
11:46:49 [INFO] Fetching p2.index from http://download.eclipse.org/cbi/updates/license/2.0.0.v20180130-0820/
11:46:49 [INFO] Fetching p2.index from http://download.eclipse.org/cbi/updates/license/2.0.1.v20180423-1114/
11:46:49 [INFO] Fetching p2.index from http://download.eclipse.org/cbi/updates/license/2.0.1.v20180423-1114/
11:46:49 [INFO] Resolving dependencies of MavenProject: org.eclipse.egit:org.eclipse.egit.mylyn.ui.test:5.4.0-SNAPSHOT @ /home/jenkins/workspace/egit.gerrit/repo/org.eclipse.egit.mylyn.ui.test/pom.xml
11:46:50 [WARNING] The following locally built units have been used to resolve project dependencies:
11:46:50 [WARNING]   org.eclipse.egit.core/5.4.0.201903241522
11:46:50 [WARNING]   org.eclipse.egit.mylyn.feature.group/5.4.0.201903241522
11:46:50 [WARNING]   org.eclipse.egit/5.4.0.201903241522
11:46:50 [WARNING]   org.eclipse.egit.feature.group/5.4.0.201903241522
11:46:50 [WARNING]   org.eclipse.egit.feature.jar/5.4.0.201903241522
11:46:50 [WARNING]   org.eclipse.egit.mylyn.feature.jar/5.4.0.201903241522
11:46:50 [WARNING]   org.eclipse.egit.doc/5.4.0.201903241522
11:46:50 [WARNING]   org.eclipse.egit.ui/5.4.0.201903241522
11:46:50 [WARNING]   org.eclipse.egit.mylyn.ui/5.4.0.201903241522
11:46:50 [INFO] Resolving class path of MavenProject: org.eclipse.egit:org.eclipse.egit.mylyn.ui.test:5.4.0-SNAPSHOT @ /home/jenkins/workspace/egit.gerrit/repo/org.eclipse.egit.mylyn.ui.test/pom.xml
11:46:50 [INFO] 
11:46:50 [INFO] ----------< org.eclipse.egit:org.eclipse.egit.mylyn.ui.test >-----------
11:46:50 [INFO] Building EGit Mylyn UI Test Plug-in 5.4.0-SNAPSHOT
11:46:50 [INFO] ------------------------[ eclipse-test-plugin ]-------------------------
11:46:50 [INFO] 
11:46:50 [INFO] --- tycho-packaging-plugin:1.3.0:build-qualifier (default-build-qualifier) @ org.eclipse.egit.mylyn.ui.test ---
11:46:51 [INFO] The project's OSGi version is 5.4.0.201903241546
11:46:51 [INFO] 
11:46:51 [INFO] --- tycho-packaging-plugin:1.3.0:validate-id (default-validate-id) @ org.eclipse.egit.mylyn.ui.test ---
11:46:51 [INFO] 
11:46:51 [INFO] --- tycho-packaging-plugin:1.3.0:validate-version (default-validate-version) @ org.eclipse.egit.mylyn.ui.test ---
11:46:51 [INFO] 
11:46:51 [INFO] --- maven-enforcer-plugin:3.0.0-M2:enforce (enforce-maven) @ org.eclipse.egit.mylyn.ui.test ---
11:46:51 [INFO] 
11:46:51 [INFO] --- maven-resources-plugin:2.4.3:resources (default-resources) @ org.eclipse.egit.mylyn.ui.test ---
11:46:51 [INFO] Using 'UTF-8' encoding to copy filtered resources.
11:46:51 [INFO] skip non existing resourceDirectory /home/jenkins/workspace/egit.gerrit/repo/org.eclipse.egit.mylyn.ui.test/src/main/resources
11:46:51 [INFO] 
11:46:51 [INFO] --- tycho-compiler-plugin:1.3.0:compile (default-compile) @ org.eclipse.egit.mylyn.ui.test ---
11:46:51 [INFO] Nothing to compile - all classes are up to date
11:46:51 [INFO] 
11:46:51 [INFO] --- maven-resources-plugin:2.4.3:testResources (default-testResources) @ org.eclipse.egit.mylyn.ui.test ---
11:46:51 [INFO] Using 'UTF-8' encoding to copy filtered resources.
11:46:51 [INFO] skip non existing resourceDirectory /home/jenkins/workspace/egit.gerrit/repo/org.eclipse.egit.mylyn.ui.test/src/test/resources
11:46:51 [INFO] 
11:46:51 [INFO] --- target-platform-configuration:1.3.0:target-platform (default-target-platform) @ org.eclipse.egit.mylyn.ui.test ---
11:46:51 [INFO] 
11:46:51 [INFO] --- tycho-packaging-plugin:1.3.0:package-plugin (default-package-plugin) @ org.eclipse.egit.mylyn.ui.test ---
11:46:51 [INFO] Building jar: /home/jenkins/workspace/egit.gerrit/repo/org.eclipse.egit.mylyn.ui.test/target/org.eclipse.egit.mylyn.ui.test-5.4.0-SNAPSHOT.jar
11:46:51 [INFO] 
11:46:51 [INFO] --- tycho-p2-plugin:1.3.0:p2-metadata-default (default-p2-metadata-default) @ org.eclipse.egit.mylyn.ui.test ---
11:46:51 [INFO] 
11:46:51 [INFO] --- tycho-surefire-plugin:1.3.0:test (default-test) @ org.eclipse.egit.mylyn.ui.test ---
11:46:52 [INFO] Expected eclipse log file: /home/jenkins/workspace/egit.gerrit/repo/org.eclipse.egit.mylyn.ui.test/target/work/data/.metadata/.log
11:46:52 [INFO] Command line:
11:46:52 	[/opt/tools/java/oracle/jdk-8/1.8.0_202/jre/bin/java, -Dosgi.noShutdown=false, -Dosgi.os=linux, -Dosgi.ws=gtk, -Dosgi.arch=x86_64, -Declipse.consoleLog=true, -Degit.test.tmpdir=/home/jenkins/workspace/egit.gerrit/tmp/egit.tmp/, -Xmx512m, -Dosgi.clean=true, -jar, /home/jenkins/workspace/egit.gerrit/.repository/p2/osgi/bundle/org.eclipse.equinox.launcher/1.3.201.v20161025-1711/org.eclipse.equinox.launcher-1.3.201.v20161025-1711.jar, -data, /home/jenkins/workspace/egit.gerrit/repo/org.eclipse.egit.mylyn.ui.test/target/work/data, -install, /home/jenkins/workspace/egit.gerrit/repo/org.eclipse.egit.mylyn.ui.test/target/work, -configuration, /home/jenkins/workspace/egit.gerrit/repo/org.eclipse.egit.mylyn.ui.test/target/work/configuration, -application, org.eclipse.tycho.surefire.osgibooter.uitest, -testproperties, /home/jenkins/workspace/egit.gerrit/repo/org.eclipse.egit.mylyn.ui.test/target/surefire.properties, -testApplication, org.eclipse.ui.ide.workbench]
11:46:52 Picked up JAVA_TOOL_OPTIONS: -XX:+IgnoreUnrecognizedVMOptions -XX:+UseContainerSupport -XX:+UnlockExperimentalVMOptions -XX:+UseCGroupMemoryLimitForHeap
11:46:52 Picked up _JAVA_OPTIONS: -XX:MaxRAMPercentage=64.0
11:46:54 !SESSION 2019-03-24 15:46:52.417 -----------------------------------------------
11:46:54 eclipse.buildId=unknown
11:46:54 java.version=1.8.0_202
11:46:54 java.vendor=Oracle Corporation
11:46:54 BootLoader constants: OS=linux, ARCH=x86_64, WS=gtk, NL=en_US
11:46:54 Framework arguments:  -application org.eclipse.tycho.surefire.osgibooter.uitest -testproperties /home/jenkins/workspace/egit.gerrit/repo/org.eclipse.egit.mylyn.ui.test/target/surefire.properties -testApplication org.eclipse.ui.ide.workbench
11:46:54 Command-line arguments:  -data /home/jenkins/workspace/egit.gerrit/repo/org.eclipse.egit.mylyn.ui.test/target/work/data -application org.eclipse.tycho.surefire.osgibooter.uitest -testproperties /home/jenkins/workspace/egit.gerrit/repo/org.eclipse.egit.mylyn.ui.test/target/surefire.properties -testApplication org.eclipse.ui.ide.workbench
11:46:54 
11:46:54 !ENTRY org.eclipse.jdt.launching.macosx 4 0 2019-03-24 15:46:54.155
11:46:54 !MESSAGE FrameworkEvent ERROR
11:46:54 !STACK 0
11:46:54 org.osgi.framework.BundleException: Could not resolve module: org.eclipse.jdt.launching.macosx [246]
11:46:54   Unresolved requirement: Require-Capability: eclipse.platform; filter:="(osgi.os=macosx)"
11:46:54 
11:46:54 	at org.eclipse.osgi.container.Module.start(Module.java:444)
11:46:54 	at org.eclipse.osgi.container.ModuleContainer$ContainerStartLevel.incStartLevel(ModuleContainer.java:1620)
11:46:54 	at org.eclipse.osgi.container.ModuleContainer$ContainerStartLevel.incStartLevel(ModuleContainer.java:1599)
11:46:54 	at org.eclipse.osgi.container.ModuleContainer$ContainerStartLevel.doContainerStartLevel(ModuleContainer.java:1571)
11:46:54 	at org.eclipse.osgi.container.ModuleContainer$ContainerStartLevel.dispatchEvent(ModuleContainer.java:1514)
11:46:54 	at org.eclipse.osgi.container.ModuleContainer$ContainerStartLevel.dispatchEvent(ModuleContainer.java:1)
11:46:54 	at org.eclipse.osgi.framework.eventmgr.EventManager.dispatchEvent(EventManager.java:230)
11:46:54 	at org.eclipse.osgi.framework.eventmgr.EventManager$EventThread.run(EventManager.java:340)
11:46:54 
11:46:54 !ENTRY org.eclipse.jdt.launching.ui.macosx 4 0 2019-03-24 15:46:54.156
11:46:54 !MESSAGE FrameworkEvent ERROR
11:46:54 !STACK 0
11:46:54 org.osgi.framework.BundleException: Could not resolve module: org.eclipse.jdt.launching.ui.macosx [247]
11:46:54   Unresolved requirement: Require-Capability: eclipse.platform; filter:="(osgi.os=macosx)"
11:46:54 
11:46:54 	at org.eclipse.osgi.container.Module.start(Module.java:444)
11:46:54 	at org.eclipse.osgi.container.ModuleContainer$ContainerStartLevel.incStartLevel(ModuleContainer.java:1620)
11:46:54 	at org.eclipse.osgi.container.ModuleContainer$ContainerStartLevel.incStartLevel(ModuleContainer.java:1599)
11:46:54 	at org.eclipse.osgi.container.ModuleContainer$ContainerStartLevel.doContainerStartLevel(ModuleContainer.java:1571)
11:46:54 	at org.eclipse.osgi.container.ModuleContainer$ContainerStartLevel.dispatchEvent(ModuleContainer.java:1514)
11:46:54 	at org.eclipse.osgi.container.ModuleContainer$ContainerStartLevel.dispatchEvent(ModuleContainer.java:1)
11:46:54 	at org.eclipse.osgi.framework.eventmgr.EventManager.dispatchEvent(EventManager.java:230)
11:46:54 	at org.eclipse.osgi.framework.eventmgr.EventManager$EventThread.run(EventManager.java:340)
11:46:54 Launching application org.eclipse.ui.ide.workbench...
11:46:56 
11:46:56 !ENTRY org.eclipse.egit.core 1 0 2019-03-24 15:46:56.429
11:46:56 !MESSAGE Using Apache MINA sshd as ssh client.
11:46:57 
11:46:57 (SWT:2462): Gtk-WARNING **: 15:46:57.095: Negative content width -6 (allocation 1, extents 4x3) while allocating gadget (node toolbar, owner GtkToolbar)
11:46:57 
11:46:57 (SWT:2462): Gtk-WARNING **: 15:46:57.096: Negative content height -3 (allocation 1, extents 2x2) while allocating gadget (node toolbar, owner GtkToolbar)
11:46:57 
11:46:57 (SWT:2462): Gtk-WARNING **: 15:46:57.096: Negative content width -6 (allocation 1, extents 4x3) while allocating gadget (node toolbar, owner GtkToolbar)
11:46:57 
11:46:57 (SWT:2462): Gtk-WARNING **: 15:46:57.096: Negative content height -3 (allocation 1, extents 2x2) while allocating gadget (node toolbar, owner GtkToolbar)
11:46:57 
11:46:57 (SWT:2462): Gtk-WARNING **: 15:46:57.101: Negative content width -6 (allocation 1, extents 4x3) while allocating gadget (node toolbar, owner GtkToolbar)
11:46:57 
11:46:57 (SWT:2462): Gtk-WARNING **: 15:46:57.101: Negative content height -3 (allocation 1, extents 2x2) while allocating gadget (node toolbar, owner GtkToolbar)
11:46:57 
11:46:57 (SWT:2462): Gtk-WARNING **: 15:46:57.101: Negative content width -6 (allocation 1, extents 4x3) while allocating gadget (node toolbar, owner GtkToolbar)
11:46:57 
11:46:57 (SWT:2462): Gtk-WARNING **: 15:46:57.101: Negative content height -3 (allocation 1, extents 2x2) while allocating gadget (node toolbar, owner GtkToolbar)
11:46:57 
11:46:57 (SWT:2462): Gtk-WARNING **: 15:46:57.552: Negative content width -6 (allocation 1, extents 4x3) while allocating gadget (node toolbar, owner GtkToolbar)
11:46:57 
11:46:57 (SWT:2462): Gtk-WARNING **: 15:46:57.552: Negative content height -3 (allocation 1, extents 2x2) while allocating gadget (node toolbar, owner GtkToolbar)
11:46:57 
11:46:57 (SWT:2462): Gtk-WARNING **: 15:46:57.552: Negative content width -6 (allocation 1, extents 4x3) while allocating gadget (node toolbar, owner GtkToolbar)
11:46:57 
11:46:57 (SWT:2462): Gtk-WARNING **: 15:46:57.552: Negative content height -3 (allocation 1, extents 2x2) while allocating gadget (node toolbar, owner GtkToolbar)
11:46:57 
11:46:57 (SWT:2462): Gtk-WARNING **: 15:46:57.890: Negative content width -6 (allocation 1, extents 4x3) while allocating gadget (node toolbar, owner GtkToolbar)
11:46:57 
11:46:57 (SWT:2462): Gtk-WARNING **: 15:46:57.890: Negative content height -3 (allocation 1, extents 2x2) while allocating gadget (node toolbar, owner GtkToolbar)
11:46:57 
11:46:57 (SWT:2462): Gtk-WARNING **: 15:46:57.890: Negative content width -6 (allocation 1, extents 4x3) while allocating gadget (node toolbar, owner GtkToolbar)
11:46:57 
11:46:57 (SWT:2462): Gtk-WARNING **: 15:46:57.890: Negative content height -3 (allocation 1, extents 2x2) while allocating gadget (node toolbar, owner GtkToolbar)
11:46:57 
11:46:57 (SWT:2462): Gtk-WARNING **: 15:46:57.904: Negative content width -6 (allocation 1, extents 4x3) while allocating gadget (node toolbar, owner GtkToolbar)
11:46:57 
11:46:57 (SWT:2462): Gtk-WARNING **: 15:46:57.905: Negative content height -3 (allocation 1, extents 2x2) while allocating gadget (node toolbar, owner GtkToolbar)
11:46:57 
11:46:57 (SWT:2462): Gtk-WARNING **: 15:46:57.905: Negative content width -6 (allocation 1, extents 4x3) while allocating gadget (node toolbar, owner GtkToolbar)
11:46:57 
11:46:57 (SWT:2462): Gtk-WARNING **: 15:46:57.905: Negative content height -3 (allocation 1, extents 2x2) while allocating gadget (node toolbar, owner GtkToolbar)
11:46:57 
11:46:57 (SWT:2462): Gtk-WARNING **: 15:46:57.908: Negative content width -6 (allocation 1, extents 4x3) while allocating gadget (node toolbar, owner GtkToolbar)
11:46:57 
11:46:57 (SWT:2462): Gtk-WARNING **: 15:46:57.908: Negative content height -3 (allocation 1, extents 2x2) while allocating gadget (node toolbar, owner GtkToolbar)
11:46:57 
11:46:57 (SWT:2462): Gtk-WARNING **: 15:46:57.908: Negative content width -6 (allocation 1, extents 4x3) while allocating gadget (node toolbar, owner GtkToolbar)
11:46:57 
11:46:57 (SWT:2462): Gtk-WARNING **: 15:46:57.908: Negative content height -3 (allocation 1, extents 2x2) while allocating gadget (node toolbar, owner GtkToolbar)
11:46:57 
11:46:57 (SWT:2462): Gtk-WARNING **: 15:46:57.912: Negative content width -6 (allocation 1, extents 4x3) while allocating gadget (node toolbar, owner GtkToolbar)
11:46:57 
11:46:57 (SWT:2462): Gtk-WARNING **: 15:46:57.912: Negative content height -3 (allocation 1, extents 2x2) while allocating gadget (node toolbar, owner GtkToolbar)
11:46:57 
11:46:57 (SWT:2462): Gtk-WARNING **: 15:46:57.912: Negative content width -6 (allocation 1, extents 4x3) while allocating gadget (node toolbar, owner GtkToolbar)
11:46:57 
11:46:57 (SWT:2462): Gtk-WARNING **: 15:46:57.912: Negative content height -3 (allocation 1, extents 2x2) while allocating gadget (node toolbar, owner GtkToolbar)
11:46:58 
11:46:58 (SWT:2462): Gtk-WARNING **: 15:46:58.314: Negative content width -6 (allocation 1, extents 4x3) while allocating gadget (node toolbar, owner GtkToolbar)
11:46:58 
11:46:58 (SWT:2462): Gtk-WARNING **: 15:46:58.314: Negative content height -3 (allocation 1, extents 2x2) while allocating gadget (node toolbar, owner GtkToolbar)
11:46:58 
11:46:58 (SWT:2462): Gtk-WARNING **: 15:46:58.314: Negative content width -6 (allocation 1, extents 4x3) while allocating gadget (node toolbar, owner GtkToolbar)
11:46:58 
11:46:58 (SWT:2462): Gtk-WARNING **: 15:46:58.314: Negative content height -3 (allocation 1, extents 2x2) while allocating gadget (node toolbar, owner GtkToolbar)
11:46:58 
11:46:58 (SWT:2462): Gtk-WARNING **: 15:46:58.325: Negative content width -6 (allocation 1, extents 4x3) while allocating gadget (node toolbar, owner GtkToolbar)
11:46:58 
11:46:58 (SWT:2462): Gtk-WARNING **: 15:46:58.325: Negative content height -3 (allocation 1, extents 2x2) while allocating gadget (node toolbar, owner GtkToolbar)
11:46:58 
11:46:58 (SWT:2462): Gtk-WARNING **: 15:46:58.325: Negative content width -6 (allocation 1, extents 4x3) while allocating gadget (node toolbar, owner GtkToolbar)
11:46:58 
11:46:58 (SWT:2462): Gtk-WARNING **: 15:46:58.325: Negative content height -3 (allocation 1, extents 2x2) while allocating gadget (node toolbar, owner GtkToolbar)
11:46:58 
11:46:58 (SWT:2462): Gtk-WARNING **: 15:46:58.690: Negative content height -9 (allocation 1, extents 5x5) while allocating gadget (node button, owner GtkButton)
11:46:58 
11:46:58 (SWT:2462): Gtk-WARNING **: 15:46:58.754: Negative content width -6 (allocation 1, extents 4x3) while allocating gadget (node toolbar, owner GtkToolbar)
11:46:58 
11:46:58 (SWT:2462): Gtk-WARNING **: 15:46:58.758: Negative content width -6 (allocation 1, extents 4x3) while allocating gadget (node toolbar, owner GtkToolbar)
11:46:58 
11:46:58 (SWT:2462): Gtk-WARNING **: 15:46:58.763: Negative content width -6 (allocation 1, extents 4x3) while allocating gadget (node toolbar, owner GtkToolbar)
11:46:58 
11:46:58 (SWT:2462): Gtk-WARNING **: 15:46:58.765: Negative content width -6 (allocation 1, extents 4x3) while allocating gadget (node toolbar, owner GtkToolbar)
11:46:58 
11:46:58 (SWT:2462): Gtk-WARNING **: 15:46:58.768: Negative content width -6 (allocation 1, extents 4x3) while allocating gadget (node toolbar, owner GtkToolbar)
11:46:58 
11:46:58 (SWT:2462): Gtk-WARNING **: 15:46:58.768: Negative content width -1 (allocation 1, extents 1x1) while allocating gadget (node trough, owner GtkProgressBar)
11:46:58 
11:46:58 (SWT:2462): Gtk-WARNING **: 15:46:58.768: Negative content width -1 (allocation 1, extents 1x1) while allocating gadget (node trough, owner GtkProgressBar)
11:46:58 
11:46:58 (SWT:2462): Gtk-WARNING **: 15:46:58.826: Negative content width -6 (allocation 1, extents 4x3) while allocating gadget (node toolbar, owner GtkToolbar)
11:46:58 
11:46:58 (SWT:2462): Gtk-WARNING **: 15:46:58.827: Negative content width -6 (allocation 1, extents 4x3) while allocating gadget (node toolbar, owner GtkToolbar)
11:46:58 
11:46:58 (SWT:2462): Gtk-WARNING **: 15:46:58.832: Negative content width -6 (allocation 1, extents 4x3) while allocating gadget (node toolbar, owner GtkToolbar)
11:46:58 
11:46:58 (SWT:2462): Gtk-WARNING **: 15:46:58.833: Negative content width -6 (allocation 1, extents 4x3) while allocating gadget (node toolbar, owner GtkToolbar)
11:46:58 
11:46:58 (SWT:2462): Gtk-WARNING **: 15:46:58.837: Negative content width -6 (allocation 1, extents 4x3) while allocating gadget (node toolbar, owner GtkToolbar)
11:46:58 
11:46:58 (SWT:2462): Gtk-WARNING **: 15:46:58.837: Negative content width -6 (allocation 1, extents 4x3) while allocating gadget (node toolbar, owner GtkToolbar)
11:46:58 Running org.eclipse.egit.internal.mylyn.CommitHyperlinkDetectorTest
11:46:59 Tests run: 14, Failures: 0, Errors: 0, Skipped: 0, Time elapsed: 0.106 s - in org.eclipse.egit.internal.mylyn.CommitHyperlinkDetectorTest
11:46:59 testEndLine(org.eclipse.egit.internal.mylyn.CommitHyperlinkDetectorTest)  Time elapsed: 0.045 s
11:46:59 testGerritId(org.eclipse.egit.internal.mylyn.CommitHyperlinkDetectorTest)  Time elapsed: 0.003 s
11:46:59 testMiddleLine(org.eclipse.egit.internal.mylyn.CommitHyperlinkDetectorTest)  Time elapsed: 0.004 s
11:46:59 testOffsetOff(org.eclipse.egit.internal.mylyn.CommitHyperlinkDetectorTest)  Time elapsed: 0.003 s
11:46:59 testEmpty(org.eclipse.egit.internal.mylyn.CommitHyperlinkDetectorTest)  Time elapsed: 0.002 s
11:46:59 testBadLocation(org.eclipse.egit.internal.mylyn.CommitHyperlinkDetectorTest)  Time elapsed: 0.003 s
11:46:59 testEndSentence(org.eclipse.egit.internal.mylyn.CommitHyperlinkDetectorTest)  Time elapsed: 0.003 s
11:46:59 testMultiLine(org.eclipse.egit.internal.mylyn.CommitHyperlinkDetectorTest)  Time elapsed: 0.003 s
11:46:59 testBeginSentence(org.eclipse.egit.internal.mylyn.CommitHyperlinkDetectorTest)  Time elapsed: 0.003 s
11:46:59 testGerritIdWithinText(org.eclipse.egit.internal.mylyn.CommitHyperlinkDetectorTest)  Time elapsed: 0.003 s
11:46:59 testMultiId(org.eclipse.egit.internal.mylyn.CommitHyperlinkDetectorTest)  Time elapsed: 0.003 s
11:46:59 testSimpleId(org.eclipse.egit.internal.mylyn.CommitHyperlinkDetectorTest)  Time elapsed: 0.003 s
11:46:59 testNoDocument(org.eclipse.egit.internal.mylyn.CommitHyperlinkDetectorTest)  Time elapsed: 0.002 s
11:46:59 testOffsetMiddle(org.eclipse.egit.internal.mylyn.CommitHyperlinkDetectorTest)  Time elapsed: 0.003 s
11:46:59 
11:46:59 Results:
11:46:59 
11:46:59 Tests run: 14, Failures: 0, Errors: 0, Skipped: 0
11:46:59 
11:46:59 
11:46:59 (SWT:2462): Gtk-WARNING **: 15:46:59.099: Negative content width -6 (allocation 1, extents 4x3) while allocating gadget (node toolbar, owner GtkToolbar)
11:46:59 
11:46:59 (SWT:2462): Gtk-WARNING **: 15:46:59.100: Negative content width -6 (allocation 1, extents 4x3) while allocating gadget (node toolbar, owner GtkToolbar)
11:47:01 [INFO] All tests passed!
11:47:01 [INFO] 
11:47:01 [INFO] >>> maven-pmd-plugin:3.11.0:cpd-check (default) > :cpd @ org.eclipse.egit.mylyn.ui.test >>>
11:47:01 [INFO] 
11:47:01 [INFO] --- maven-pmd-plugin:3.11.0:cpd (cpd) @ org.eclipse.egit.mylyn.ui.test ---
11:47:02 [INFO] 
11:47:02 [INFO] <<< maven-pmd-plugin:3.11.0:cpd-check (default) < :cpd @ org.eclipse.egit.mylyn.ui.test <<<
11:47:02 [INFO] 
11:47:02 [INFO] 
11:47:02 [INFO] --- maven-pmd-plugin:3.11.0:cpd-check (default) @ org.eclipse.egit.mylyn.ui.test ---
11:47:02 [INFO] 
11:47:02 [INFO] ------------------------------------------------------------------------
11:47:02 [INFO] BUILD SUCCESS
11:47:02 [INFO] ------------------------------------------------------------------------
11:47:02 [INFO] Total time:  37.491 s
11:47:02 [INFO] Finished at: 2019-03-24T15:47:02Z
11:47:02 [INFO] ------------------------------------------------------------------------
11:47:03 Terminating xvnc.
11:49:04 [FINDBUGS] Collecting findbugs analysis files...
11:49:07 [FINDBUGS] Searching for all files in /home/jenkins/workspace/egit.gerrit that match the pattern repo/*/target/*bugsXml.xml
11:49:07 [FINDBUGS] Parsing 12 files in /home/jenkins/workspace/egit.gerrit
11:49:07 [FINDBUGS] Successfully parsed file /home/jenkins/workspace/egit.gerrit/repo/org.eclipse.egit.core.junit/target/spotbugsXml.xml with 4 unique warnings and 0 duplicates.
11:49:07 [FINDBUGS] Successfully parsed file /home/jenkins/workspace/egit.gerrit/repo/org.eclipse.egit.core.test/target/spotbugsXml.xml with 10 unique warnings and 0 duplicates.
11:49:07 [FINDBUGS] Successfully parsed file /home/jenkins/workspace/egit.gerrit/repo/org.eclipse.egit.core/target/spotbugsXml.xml with 21 unique warnings and 0 duplicates.
11:49:07 [FINDBUGS] Successfully parsed file /home/jenkins/workspace/egit.gerrit/repo/org.eclipse.egit.gitflow.test/target/spotbugsXml.xml with 21 unique warnings and 0 duplicates.
11:49:07 [FINDBUGS] Successfully parsed file /home/jenkins/workspace/egit.gerrit/repo/org.eclipse.egit.gitflow.ui/target/spotbugsXml.xml with 21 unique warnings and 0 duplicates.
11:49:07 [FINDBUGS] Successfully parsed file /home/jenkins/workspace/egit.gerrit/repo/org.eclipse.egit.gitflow/target/spotbugsXml.xml with 23 unique warnings and 0 duplicates.
11:49:07 [FINDBUGS] Successfully parsed file /home/jenkins/workspace/egit.gerrit/repo/org.eclipse.egit.mylyn.ui.test/target/spotbugsXml.xml with 23 unique warnings and 0 duplicates.
11:49:07 [FINDBUGS] Successfully parsed file /home/jenkins/workspace/egit.gerrit/repo/org.eclipse.egit.mylyn.ui/target/spotbugsXml.xml with 23 unique warnings and 0 duplicates.
11:49:07 [FINDBUGS] Successfully parsed file /home/jenkins/workspace/egit.gerrit/repo/org.eclipse.egit.ui.importer.tests/target/spotbugsXml.xml with 23 unique warnings and 0 duplicates.
11:49:07 [FINDBUGS] Successfully parsed file /home/jenkins/workspace/egit.gerrit/repo/org.eclipse.egit.ui.smartimport/target/spotbugsXml.xml with 23 unique warnings and 0 duplicates.
11:49:07 [FINDBUGS] Successfully parsed file /home/jenkins/workspace/egit.gerrit/repo/org.eclipse.egit.ui.test/target/spotbugsXml.xml with 45 unique warnings and 0 duplicates.
11:49:07 [FINDBUGS] Successfully parsed file /home/jenkins/workspace/egit.gerrit/repo/org.eclipse.egit.ui/target/spotbugsXml.xml with 80 unique warnings and 0 duplicates.
11:49:07 No credentials specified
11:49:07 <Git Blamer> Using GitBlamer to create author and commit information for all warnings.
11:49:07 <Git Blamer> GIT_COMMIT=3000aee9af8f207e7304259bba4b8ba422aeb981, workspace=/home/jenkins/workspace/egit.gerrit/repo
11:49:07  > /usr/bin/git rev-parse 3000aee9af8f207e7304259bba4b8ba422aeb981^{commit} # timeout=10
11:49:14 <Git Blamer> Skipping file /home/jenkins/workspace/egit.gerrit/repo/org.eclipse.egit.ui.test/src/org/eclipse/egit/ui/view/repositories/GitRepositoriesViewTestBase.java, no result found.
11:49:14 [FINDBUGS] Computing warning deltas based on reference build #11578
11:49:16 [DRY] Collecting duplicate code analysis files...
11:49:16 [DRY] Searching for all files in /home/jenkins/workspace/egit.gerrit that match the pattern **/cpd.xml
11:49:16 [DRY] Parsing 19 files in /home/jenkins/workspace/egit.gerrit
11:49:16 [DRY] Successfully parsed file /home/jenkins/workspace/egit.gerrit/repo/org.eclipse.egit-feature/target/cpd.xml with 0 unique warnings and 0 duplicates.
11:49:16 [DRY] Successfully parsed file /home/jenkins/workspace/egit.gerrit/repo/org.eclipse.egit.core.junit/target/cpd.xml with 0 unique warnings and 0 duplicates.
11:49:16 [DRY] Successfully parsed file /home/jenkins/workspace/egit.gerrit/repo/org.eclipse.egit.core.test/target/cpd.xml with 0 unique warnings and 0 duplicates.
11:49:16 [DRY] Successfully parsed file /home/jenkins/workspace/egit.gerrit/repo/org.eclipse.egit.core/target/cpd.xml with 4 unique warnings and 0 duplicates.
11:49:16 [DRY] Successfully parsed file /home/jenkins/workspace/egit.gerrit/repo/org.eclipse.egit.doc/target/cpd.xml with 4 unique warnings and 0 duplicates.
11:49:16 [DRY] Successfully parsed file /home/jenkins/workspace/egit.gerrit/repo/org.eclipse.egit.gitflow-feature/target/cpd.xml with 4 unique warnings and 0 duplicates.
11:49:16 [DRY] Successfully parsed file /home/jenkins/workspace/egit.gerrit/repo/org.eclipse.egit.gitflow.test/target/cpd.xml with 4 unique warnings and 0 duplicates.
11:49:16 [DRY] Successfully parsed file /home/jenkins/workspace/egit.gerrit/repo/org.eclipse.egit.gitflow.ui/target/cpd.xml with 4 unique warnings and 0 duplicates.
11:49:16 [DRY] Successfully parsed file /home/jenkins/workspace/egit.gerrit/repo/org.eclipse.egit.gitflow/target/cpd.xml with 4 unique warnings and 0 duplicates.
11:49:16 [DRY] Successfully parsed file /home/jenkins/workspace/egit.gerrit/repo/org.eclipse.egit.mylyn-feature/target/cpd.xml with 4 unique warnings and 0 duplicates.
11:49:16 [DRY] Successfully parsed file /home/jenkins/workspace/egit.gerrit/repo/org.eclipse.egit.mylyn.ui.test/target/cpd.xml with 4 unique warnings and 0 duplicates.
11:49:16 [DRY] Successfully parsed file /home/jenkins/workspace/egit.gerrit/repo/org.eclipse.egit.mylyn.ui/target/cpd.xml with 4 unique warnings and 0 duplicates.
11:49:16 [DRY] Successfully parsed file /home/jenkins/workspace/egit.gerrit/repo/org.eclipse.egit.repository/target/cpd.xml with 4 unique warnings and 0 duplicates.
11:49:16 [DRY] Successfully parsed file /home/jenkins/workspace/egit.gerrit/repo/org.eclipse.egit.source-feature/target/cpd.xml with 4 unique warnings and 0 duplicates.
11:49:16 [DRY] Successfully parsed file /home/jenkins/workspace/egit.gerrit/repo/org.eclipse.egit.ui.importer.tests/target/cpd.xml with 4 unique warnings and 0 duplicates.
11:49:16 [DRY] Successfully parsed file /home/jenkins/workspace/egit.gerrit/repo/org.eclipse.egit.ui.smartimport/target/cpd.xml with 4 unique warnings and 0 duplicates.
11:49:16 [DRY] Successfully parsed file /home/jenkins/workspace/egit.gerrit/repo/org.eclipse.egit.ui.test/target/cpd.xml with 4 unique warnings and 0 duplicates.
11:49:16 [DRY] Successfully parsed file /home/jenkins/workspace/egit.gerrit/repo/org.eclipse.egit.ui/target/cpd.xml with 37 unique warnings and 0 duplicates.
11:49:16 [DRY] Successfully parsed file /home/jenkins/workspace/egit.gerrit/repo/org.eclipse.egit/target/cpd.xml with 37 unique warnings and 0 duplicates.
11:49:16 No credentials specified
11:49:16 <Git Blamer> Using GitBlamer to create author and commit information for all warnings.
11:49:16 <Git Blamer> GIT_COMMIT=3000aee9af8f207e7304259bba4b8ba422aeb981, workspace=/home/jenkins/workspace/egit.gerrit/repo
11:49:16  > /usr/bin/git rev-parse 3000aee9af8f207e7304259bba4b8ba422aeb981^{commit} # timeout=10
11:49:20 [DRY] Computing warning deltas based on reference build #11578
11:49:20 Recording test results
11:49:21 Build step 'Publish JUnit test result report' changed build result to UNSTABLE
11:49:21 Archiving artifacts
11:49:25 Finished: UNSTABLE