UnstableConsole Output

Skipping 1,574 KB.. Full Log
olbar, owner GtkToolbar)
21:20:58 
21:20:58 (SWT:1471): Gtk-WARNING **: 01:20:58.386: Negative content width -6 (allocation 1, extents 4x3) while allocating gadget (node toolbar, owner GtkToolbar)
21:20:59 
21:20:59 (SWT:1471): Gtk-WARNING **: 01:20:59.234: Negative content width -6 (allocation 1, extents 4x3) while allocating gadget (node toolbar, owner GtkToolbar)
21:20:59 
21:20:59 (SWT:1471): Gtk-WARNING **: 01:20:59.235: Negative content width -6 (allocation 1, extents 4x3) while allocating gadget (node toolbar, owner GtkToolbar)
21:20:59 
21:20:59 (SWT:1471): Gtk-WARNING **: 01:20:59.248: Negative content width -6 (allocation 1, extents 4x3) while allocating gadget (node toolbar, owner GtkToolbar)
21:20:59 
21:20:59 (SWT:1471): Gtk-CRITICAL **: 01:20:59.271: gtk_box_gadget_distribute: assertion 'size >= 0' failed in GtkScrollbar
21:20:59 
21:20:59 (SWT:1471): Gtk-CRITICAL **: 01:20:59.298: gtk_box_gadget_distribute: assertion 'size >= 0' failed in GtkScrollbar
21:20:59 
21:20:59 (SWT:1471): Gtk-CRITICAL **: 01:20:59.314: gtk_box_gadget_distribute: assertion 'size >= 0' failed in GtkScrollbar
21:20:59 
21:20:59 (SWT:1471): Gtk-CRITICAL **: 01:20:59.331: gtk_box_gadget_distribute: assertion 'size >= 0' failed in GtkScrollbar
21:20:59 
21:20:59 (SWT:1471): Gtk-CRITICAL **: 01:20:59.347: gtk_box_gadget_distribute: assertion 'size >= 0' failed in GtkScrollbar
21:20:59 
21:20:59 (SWT:1471): Gtk-WARNING **: 01:20:59.380: Negative content width -6 (allocation 1, extents 4x3) while allocating gadget (node toolbar, owner GtkToolbar)
21:20:59 
21:20:59 (SWT:1471): Gtk-CRITICAL **: 01:20:59.463: gtk_box_gadget_distribute: assertion 'size >= 0' failed in GtkScrollbar
21:20:59 
21:20:59 (SWT:1471): Gtk-CRITICAL **: 01:20:59.482: gtk_box_gadget_distribute: assertion 'size >= 0' failed in GtkScrollbar
21:20:59 
21:20:59 (SWT:1471): Gtk-CRITICAL **: 01:20:59.488: gtk_box_gadget_distribute: assertion 'size >= 0' failed in GtkScrollbar
21:20:59 
21:20:59 (SWT:1471): Gtk-WARNING **: 01:20:59.490: Negative content width -6 (allocation 1, extents 4x3) while allocating gadget (node toolbar, owner GtkToolbar)
21:20:59 
21:20:59 (SWT:1471): Gtk-WARNING **: 01:20:59.532: Negative content width -6 (allocation 1, extents 4x3) while allocating gadget (node toolbar, owner GtkToolbar)
21:20:59 
21:20:59 (SWT:1471): Gtk-CRITICAL **: 01:20:59.626: gtk_box_gadget_distribute: assertion 'size >= 0' failed in GtkScrollbar
21:20:59 
21:20:59 (SWT:1471): Gtk-WARNING **: 01:20:59.632: Negative content width -6 (allocation 1, extents 4x3) while allocating gadget (node toolbar, owner GtkToolbar)
21:20:59 
21:20:59 (SWT:1471): Gtk-WARNING **: 01:20:59.673: Negative content width -6 (allocation 1, extents 4x3) while allocating gadget (node toolbar, owner GtkToolbar)
21:20:59 
21:20:59 (SWT:1471): Gtk-CRITICAL **: 01:20:59.763: gtk_box_gadget_distribute: assertion 'size >= 0' failed in GtkScrollbar
21:20:59 
21:20:59 (SWT:1471): Gtk-WARNING **: 01:20:59.770: Negative content width -6 (allocation 1, extents 4x3) while allocating gadget (node toolbar, owner GtkToolbar)
21:20:59 
21:20:59 (SWT:1471): Gtk-WARNING **: 01:20:59.807: Negative content width -6 (allocation 1, extents 4x3) while allocating gadget (node toolbar, owner GtkToolbar)
21:20:59 
21:20:59 (SWT:1471): Gtk-CRITICAL **: 01:20:59.896: gtk_box_gadget_distribute: assertion 'size >= 0' failed in GtkScrollbar
21:20:59 
21:20:59 (SWT:1471): Gtk-WARNING **: 01:20:59.902: Negative content width -6 (allocation 1, extents 4x3) while allocating gadget (node toolbar, owner GtkToolbar)
21:20:59 
21:20:59 (SWT:1471): Gtk-WARNING **: 01:20:59.940: Negative content width -6 (allocation 1, extents 4x3) while allocating gadget (node toolbar, owner GtkToolbar)
21:21:00 
21:21:00 (SWT:1471): Gtk-CRITICAL **: 01:21:00.028: gtk_box_gadget_distribute: assertion 'size >= 0' failed in GtkScrollbar
21:21:00 
21:21:00 (SWT:1471): Gtk-WARNING **: 01:21:00.035: Negative content width -6 (allocation 1, extents 4x3) while allocating gadget (node toolbar, owner GtkToolbar)
21:21:00 
21:21:00 (SWT:1471): Gtk-WARNING **: 01:21:00.072: Negative content width -6 (allocation 1, extents 4x3) while allocating gadget (node toolbar, owner GtkToolbar)
21:21:00 
21:21:00 (SWT:1471): Gtk-CRITICAL **: 01:21:00.163: gtk_box_gadget_distribute: assertion 'size >= 0' failed in GtkScrollbar
21:21:00 
21:21:00 (SWT:1471): Gtk-WARNING **: 01:21:00.169: Negative content width -6 (allocation 1, extents 4x3) while allocating gadget (node toolbar, owner GtkToolbar)
21:21:00 
21:21:00 (SWT:1471): Gtk-WARNING **: 01:21:00.206: Negative content width -6 (allocation 1, extents 4x3) while allocating gadget (node toolbar, owner GtkToolbar)
21:21:00 
21:21:00 (SWT:1471): Gtk-CRITICAL **: 01:21:00.299: gtk_box_gadget_distribute: assertion 'size >= 0' failed in GtkScrollbar
21:21:00 
21:21:00 (SWT:1471): Gtk-WARNING **: 01:21:00.305: Negative content width -6 (allocation 1, extents 4x3) while allocating gadget (node toolbar, owner GtkToolbar)
21:21:00 
21:21:00 (SWT:1471): Gtk-WARNING **: 01:21:00.366: Negative content width -6 (allocation 1, extents 4x3) while allocating gadget (node toolbar, owner GtkToolbar)
21:21:01 
21:21:01 (SWT:1471): Gtk-WARNING **: 01:21:01.198: Negative content width -6 (allocation 1, extents 4x3) while allocating gadget (node toolbar, owner GtkToolbar)
21:21:01 
21:21:01 (SWT:1471): Gtk-WARNING **: 01:21:01.198: Negative content width -6 (allocation 1, extents 4x3) while allocating gadget (node toolbar, owner GtkToolbar)
21:21:01 
21:21:01 (SWT:1471): Gtk-WARNING **: 01:21:01.212: Negative content width -6 (allocation 1, extents 4x3) while allocating gadget (node toolbar, owner GtkToolbar)
21:21:01 
21:21:01 (SWT:1471): Gtk-CRITICAL **: 01:21:01.239: gtk_box_gadget_distribute: assertion 'size >= 0' failed in GtkScrollbar
21:21:01 
21:21:01 (SWT:1471): Gtk-CRITICAL **: 01:21:01.266: gtk_box_gadget_distribute: assertion 'size >= 0' failed in GtkScrollbar
21:21:01 
21:21:01 (SWT:1471): Gtk-CRITICAL **: 01:21:01.282: gtk_box_gadget_distribute: assertion 'size >= 0' failed in GtkScrollbar
21:21:01 
21:21:01 (SWT:1471): Gtk-CRITICAL **: 01:21:01.300: gtk_box_gadget_distribute: assertion 'size >= 0' failed in GtkScrollbar
21:21:01 
21:21:01 (SWT:1471): Gtk-CRITICAL **: 01:21:01.315: gtk_box_gadget_distribute: assertion 'size >= 0' failed in GtkScrollbar
21:21:01 
21:21:01 (SWT:1471): Gtk-CRITICAL **: 01:21:01.404: gtk_box_gadget_distribute: assertion 'size >= 0' failed in GtkScrollbar
21:21:01 
21:21:01 (SWT:1471): Gtk-CRITICAL **: 01:21:01.413: gtk_box_gadget_distribute: assertion 'size >= 0' failed in GtkScrollbar
21:21:01 
21:21:01 (SWT:1471): Gtk-CRITICAL **: 01:21:01.460: gtk_box_gadget_distribute: assertion 'size >= 0' failed in GtkScrollbar
21:21:02 
21:21:02 (SWT:1471): Gtk-WARNING **: 01:21:02.080: Negative content width -6 (allocation 1, extents 4x3) while allocating gadget (node toolbar, owner GtkToolbar)
21:21:02 
21:21:02 (SWT:1471): Gtk-WARNING **: 01:21:02.957: Negative content width -6 (allocation 1, extents 4x3) while allocating gadget (node toolbar, owner GtkToolbar)
21:21:02 
21:21:02 (SWT:1471): Gtk-WARNING **: 01:21:02.958: Negative content width -6 (allocation 1, extents 4x3) while allocating gadget (node toolbar, owner GtkToolbar)
21:21:02 
21:21:02 (SWT:1471): Gtk-WARNING **: 01:21:02.974: Negative content width -6 (allocation 1, extents 4x3) while allocating gadget (node toolbar, owner GtkToolbar)
21:21:03 
21:21:03 (SWT:1471): Gtk-CRITICAL **: 01:21:03.001: gtk_box_gadget_distribute: assertion 'size >= 0' failed in GtkScrollbar
21:21:03 
21:21:03 (SWT:1471): Gtk-CRITICAL **: 01:21:03.028: gtk_box_gadget_distribute: assertion 'size >= 0' failed in GtkScrollbar
21:21:03 
21:21:03 (SWT:1471): Gtk-CRITICAL **: 01:21:03.044: gtk_box_gadget_distribute: assertion 'size >= 0' failed in GtkScrollbar
21:21:03 
21:21:03 (SWT:1471): Gtk-CRITICAL **: 01:21:03.061: gtk_box_gadget_distribute: assertion 'size >= 0' failed in GtkScrollbar
21:21:03 
21:21:03 (SWT:1471): Gtk-CRITICAL **: 01:21:03.077: gtk_box_gadget_distribute: assertion 'size >= 0' failed in GtkScrollbar
21:21:03 
21:21:03 (SWT:1471): Gtk-CRITICAL **: 01:21:03.097: gtk_box_gadget_distribute: assertion 'size >= 0' failed in GtkScrollbar
21:21:03 
21:21:03 (SWT:1471): Gtk-WARNING **: 01:21:03.131: Negative content width -6 (allocation 1, extents 4x3) while allocating gadget (node toolbar, owner GtkToolbar)
21:21:03 
21:21:03 (SWT:1471): Gtk-CRITICAL **: 01:21:03.256: gtk_box_gadget_distribute: assertion 'size >= 0' failed in GtkScrollbar
21:21:03 
21:21:03 (SWT:1471): Gtk-CRITICAL **: 01:21:03.276: gtk_box_gadget_distribute: assertion 'size >= 0' failed in GtkScrollbar
21:21:03 
21:21:03 (SWT:1471): Gtk-CRITICAL **: 01:21:03.281: gtk_box_gadget_distribute: assertion 'size >= 0' failed in GtkScrollbar
21:21:03 
21:21:03 (SWT:1471): Gtk-WARNING **: 01:21:03.284: Negative content width -6 (allocation 1, extents 4x3) while allocating gadget (node toolbar, owner GtkToolbar)
21:21:03 
21:21:03 (SWT:1471): Gtk-WARNING **: 01:21:03.323: Negative content width -6 (allocation 1, extents 4x3) while allocating gadget (node toolbar, owner GtkToolbar)
21:21:03 
21:21:03 (SWT:1471): Gtk-CRITICAL **: 01:21:03.457: gtk_box_gadget_distribute: assertion 'size >= 0' failed in GtkScrollbar
21:21:03 
21:21:03 (SWT:1471): Gtk-WARNING **: 01:21:03.465: Negative content width -6 (allocation 1, extents 4x3) while allocating gadget (node toolbar, owner GtkToolbar)
21:21:03 
21:21:03 (SWT:1471): Gtk-CRITICAL **: 01:21:03.482: gtk_box_gadget_distribute: assertion 'size >= 0' failed in GtkScrollbar
21:21:03 
21:21:03 (SWT:1471): Gtk-CRITICAL **: 01:21:03.489: gtk_box_gadget_distribute: assertion 'size >= 0' failed in GtkScrollbar
21:21:03 
21:21:03 (SWT:1471): Gtk-WARNING **: 01:21:03.516: Negative content width -6 (allocation 1, extents 4x3) while allocating gadget (node toolbar, owner GtkToolbar)
21:21:03 
21:21:03 (SWT:1471): Gtk-CRITICAL **: 01:21:03.644: gtk_box_gadget_distribute: assertion 'size >= 0' failed in GtkScrollbar
21:21:03 
21:21:03 (SWT:1471): Gtk-WARNING **: 01:21:03.650: Negative content width -6 (allocation 1, extents 4x3) while allocating gadget (node toolbar, owner GtkToolbar)
21:21:03 
21:21:03 (SWT:1471): Gtk-WARNING **: 01:21:03.684: Negative content width -6 (allocation 1, extents 4x3) while allocating gadget (node toolbar, owner GtkToolbar)
21:21:03 
21:21:03 (SWT:1471): Gtk-CRITICAL **: 01:21:03.769: gtk_box_gadget_distribute: assertion 'size >= 0' failed in GtkScrollbar
21:21:03 
21:21:03 (SWT:1471): Gtk-WARNING **: 01:21:03.775: Negative content width -6 (allocation 1, extents 4x3) while allocating gadget (node toolbar, owner GtkToolbar)
21:21:03 
21:21:03 (SWT:1471): Gtk-WARNING **: 01:21:03.809: Negative content width -6 (allocation 1, extents 4x3) while allocating gadget (node toolbar, owner GtkToolbar)
21:21:03 
21:21:03 (SWT:1471): Gtk-WARNING **: 01:21:03.899: Negative content width -6 (allocation 1, extents 4x3) while allocating gadget (node toolbar, owner GtkToolbar)
21:21:03 
21:21:03 (SWT:1471): Gtk-WARNING **: 01:21:03.936: Negative content width -6 (allocation 1, extents 4x3) while allocating gadget (node toolbar, owner GtkToolbar)
21:21:04 
21:21:04 (SWT:1471): Gtk-WARNING **: 01:21:04.032: Negative content width -6 (allocation 1, extents 4x3) while allocating gadget (node toolbar, owner GtkToolbar)
21:21:04 
21:21:04 (SWT:1471): Gtk-WARNING **: 01:21:04.081: Negative content width -6 (allocation 1, extents 4x3) while allocating gadget (node toolbar, owner GtkToolbar)
21:21:04 
21:21:04 (SWT:1471): Gtk-WARNING **: 01:21:04.185: Negative content width -6 (allocation 1, extents 4x3) while allocating gadget (node toolbar, owner GtkToolbar)
21:21:04 
21:21:04 (SWT:1471): Gtk-WARNING **: 01:21:04.226: Negative content width -6 (allocation 1, extents 4x3) while allocating gadget (node toolbar, owner GtkToolbar)
21:21:04 
21:21:04 (SWT:1471): Gtk-WARNING **: 01:21:04.316: Negative content width -6 (allocation 1, extents 4x3) while allocating gadget (node toolbar, owner GtkToolbar)
21:21:04 
21:21:04 (SWT:1471): Gtk-WARNING **: 01:21:04.363: Negative content width -6 (allocation 1, extents 4x3) while allocating gadget (node toolbar, owner GtkToolbar)
21:21:04 
21:21:04 (SWT:1471): Gtk-WARNING **: 01:21:04.461: Negative content width -6 (allocation 1, extents 4x3) while allocating gadget (node toolbar, owner GtkToolbar)
21:21:04 
21:21:04 (SWT:1471): Gtk-WARNING **: 01:21:04.535: Negative content width -6 (allocation 1, extents 4x3) while allocating gadget (node toolbar, owner GtkToolbar)
21:21:05 
21:21:05 (SWT:1471): Gtk-WARNING **: 01:21:05.411: Negative content width -6 (allocation 1, extents 4x3) while allocating gadget (node toolbar, owner GtkToolbar)
21:21:05 
21:21:05 (SWT:1471): Gtk-WARNING **: 01:21:05.412: Negative content width -6 (allocation 1, extents 4x3) while allocating gadget (node toolbar, owner GtkToolbar)
21:21:05 
21:21:05 (SWT:1471): Gtk-WARNING **: 01:21:05.425: Negative content width -6 (allocation 1, extents 4x3) while allocating gadget (node toolbar, owner GtkToolbar)
21:21:05 
21:21:05 (SWT:1471): Gtk-CRITICAL **: 01:21:05.446: gtk_box_gadget_distribute: assertion 'size >= 0' failed in GtkScrollbar
21:21:05 
21:21:05 (SWT:1471): Gtk-CRITICAL **: 01:21:05.475: gtk_box_gadget_distribute: assertion 'size >= 0' failed in GtkScrollbar
21:21:05 
21:21:05 (SWT:1471): Gtk-CRITICAL **: 01:21:05.491: gtk_box_gadget_distribute: assertion 'size >= 0' failed in GtkScrollbar
21:21:05 
21:21:05 (SWT:1471): Gtk-CRITICAL **: 01:21:05.508: gtk_box_gadget_distribute: assertion 'size >= 0' failed in GtkScrollbar
21:21:05 
21:21:05 (SWT:1471): Gtk-CRITICAL **: 01:21:05.525: gtk_box_gadget_distribute: assertion 'size >= 0' failed in GtkScrollbar
21:21:05 
21:21:05 (SWT:1471): Gtk-CRITICAL **: 01:21:05.548: gtk_box_gadget_distribute: assertion 'size >= 0' failed in GtkScrollbar
21:21:05 
21:21:05 (SWT:1471): Gtk-CRITICAL **: 01:21:05.558: gtk_box_gadget_distribute: assertion 'size >= 0' failed in GtkScrollbar
21:21:05 
21:21:05 (SWT:1471): Gtk-CRITICAL **: 01:21:05.575: gtk_box_gadget_distribute: assertion 'size >= 0' failed in GtkScrollbar
21:21:05 
21:21:05 (SWT:1471): Gtk-CRITICAL **: 01:21:05.590: gtk_box_gadget_distribute: assertion 'size >= 0' failed in GtkScrollbar
21:21:05 
21:21:05 (SWT:1471): Gtk-CRITICAL **: 01:21:05.607: gtk_box_gadget_distribute: assertion 'size >= 0' failed in GtkScrollbar
21:21:05 
21:21:05 (SWT:1471): Gtk-CRITICAL **: 01:21:05.623: gtk_box_gadget_distribute: assertion 'size >= 0' failed in GtkScrollbar
21:21:05 
21:21:05 (SWT:1471): Gtk-CRITICAL **: 01:21:05.640: gtk_box_gadget_distribute: assertion 'size >= 0' failed in GtkScrollbar
21:21:05 
21:21:05 (SWT:1471): Gtk-WARNING **: 01:21:05.660: Negative content width -6 (allocation 1, extents 4x3) while allocating gadget (node toolbar, owner GtkToolbar)
21:21:05 
21:21:05 (SWT:1471): Gtk-WARNING **: 01:21:05.660: Negative content height -3 (allocation 1, extents 2x2) while allocating gadget (node toolbar, owner GtkToolbar)
21:21:05 
21:21:05 (SWT:1471): Gtk-WARNING **: 01:21:05.660: Negative content width -6 (allocation 1, extents 4x3) while allocating gadget (node toolbar, owner GtkToolbar)
21:21:05 
21:21:05 (SWT:1471): Gtk-WARNING **: 01:21:05.660: Negative content height -3 (allocation 1, extents 2x2) while allocating gadget (node toolbar, owner GtkToolbar)
21:21:05 
21:21:05 (SWT:1471): Gtk-CRITICAL **: 01:21:05.713: gtk_box_gadget_distribute: assertion 'size >= 0' failed in GtkScrollbar
21:21:05 
21:21:05 (SWT:1471): Gtk-WARNING **: 01:21:05.807: Negative content width -6 (allocation 1, extents 4x3) while allocating gadget (node toolbar, owner GtkToolbar)
21:21:05 Tests run: 13, Failures: 0, Errors: 0, Skipped: 1, Time elapsed: 21.172 s - in org.eclipse.egit.ui.test.history.HistoryViewTest
21:21:05 testShowAllBranches(org.eclipse.egit.ui.test.history.HistoryViewTest)  Time elapsed: 2.031 s
21:21:05 testOpenHistoryOnFileFolderFilter(org.eclipse.egit.ui.test.history.HistoryViewTest)  Time elapsed: 2.021 s
21:21:05 testCheckOut(org.eclipse.egit.ui.test.history.HistoryViewTest)  Time elapsed: 1.242 s
21:21:05 testOpenHistoryOnProject(org.eclipse.egit.ui.test.history.HistoryViewTest)  Time elapsed: 0.969 s
21:21:05 testRevertFailure(org.eclipse.egit.ui.test.history.HistoryViewTest)  Time elapsed: 2.17 s
21:21:05 testRebaseAlreadyUpToDate(org.eclipse.egit.ui.test.history.HistoryViewTest) skipped
21:21:05 testAddBranch(org.eclipse.egit.ui.test.history.HistoryViewTest)  Time elapsed: 1.243 s
21:21:05 testAddCommit(org.eclipse.egit.ui.test.history.HistoryViewTest)  Time elapsed: 1.752 s
21:21:05 testOpenHistoryOnFileProjectFilter(org.eclipse.egit.ui.test.history.HistoryViewTest)  Time elapsed: 2.326 s
21:21:05 testOpenHistoryOnFileRepoFilter(org.eclipse.egit.ui.test.history.HistoryViewTest)  Time elapsed: 1.983 s
21:21:05 testAddTag(org.eclipse.egit.ui.test.history.HistoryViewTest)  Time elapsed: 1.676 s
21:21:05 testOpenHistoryOnFileNoFilter(org.eclipse.egit.ui.test.history.HistoryViewTest)  Time elapsed: 2.501 s
21:21:05 testOpenOfDeletedFile(org.eclipse.egit.ui.test.history.HistoryViewTest)  Time elapsed: 1.225 s
21:21:05 Running org.eclipse.egit.ui.test.trace.TraceConfigurationDialogTest
21:21:06 
21:21:06 (SWT:1471): Gtk-CRITICAL **: 01:21:06.001: gtk_box_gadget_distribute: assertion 'size >= 0' failed in GtkScrollbar
21:21:06 
21:21:06 (SWT:1471): Gtk-CRITICAL **: 01:21:06.012: gtk_box_gadget_distribute: assertion 'size >= 0' failed in GtkScrollbar
21:21:06 
21:21:06 (SWT:1471): Gtk-CRITICAL **: 01:21:06.067: gtk_box_gadget_distribute: assertion 'size >= 0' failed in GtkScrollbar
21:21:06 
21:21:06 (SWT:1471): Gtk-CRITICAL **: 01:21:06.127: gtk_box_gadget_distribute: assertion 'size >= 0' failed in GtkScrollbar
21:21:06 
21:21:06 (SWT:1471): Gtk-CRITICAL **: 01:21:06.188: gtk_box_gadget_distribute: assertion 'size >= 0' failed in GtkScrollbar
21:21:06 
21:21:06 (SWT:1471): Gtk-CRITICAL **: 01:21:06.245: gtk_box_gadget_distribute: assertion 'size >= 0' failed in GtkScrollbar
21:21:06 
21:21:06 (SWT:1471): Gtk-CRITICAL **: 01:21:06.313: gtk_box_gadget_distribute: assertion 'size >= 0' failed in GtkScrollbar
21:21:06 Tests run: 2, Failures: 0, Errors: 0, Skipped: 0, Time elapsed: 0.406 s - in org.eclipse.egit.ui.test.trace.TraceConfigurationDialogTest
21:21:06 testMainSwitch(org.eclipse.egit.ui.test.trace.TraceConfigurationDialogTest)  Time elapsed: 0.198 s
21:21:06 testTreeNode(org.eclipse.egit.ui.test.trace.TraceConfigurationDialogTest)  Time elapsed: 0.206 s
21:21:06 Running org.eclipse.egit.ui.internal.dialogs.HyperlinkTokenScannerTest
21:21:06 Tests run: 10, Failures: 0, Errors: 0, Skipped: 0, Time elapsed: 0.193 s - in org.eclipse.egit.ui.internal.dialogs.HyperlinkTokenScannerTest
21:21:06 tokenizeEmbeddedHyperlink(org.eclipse.egit.ui.internal.dialogs.HyperlinkTokenScannerTest)  Time elapsed: 0.003 s
21:21:06 tokenizeWithFailingDetector(org.eclipse.egit.ui.internal.dialogs.HyperlinkTokenScannerTest)  Time elapsed: 0.001 s
21:21:06 tokenizeWithoutDetectors(org.eclipse.egit.ui.internal.dialogs.HyperlinkTokenScannerTest)  Time elapsed: 0.001 s
21:21:06 tokenizeHyperlinksOutsideRegion(org.eclipse.egit.ui.internal.dialogs.HyperlinkTokenScannerTest)  Time elapsed: 0 s
21:21:06 tokenizeMultipleHyperlinksSimple(org.eclipse.egit.ui.internal.dialogs.HyperlinkTokenScannerTest)  Time elapsed: 0 s
21:21:06 tokenizeMultipleHyperlinksMultiline(org.eclipse.egit.ui.internal.dialogs.HyperlinkTokenScannerTest)  Time elapsed: 0.001 s
21:21:06 tokenizeLeadingHyperlink(org.eclipse.egit.ui.internal.dialogs.HyperlinkTokenScannerTest)  Time elapsed: 0.001 s
21:21:06 tokenizeEmpty(org.eclipse.egit.ui.internal.dialogs.HyperlinkTokenScannerTest)  Time elapsed: 0 s
21:21:06 tokenizeHyperlinksCutByRegion(org.eclipse.egit.ui.internal.dialogs.HyperlinkTokenScannerTest)  Time elapsed: 0.001 s
21:21:06 tokenizeNoHyperlinks(org.eclipse.egit.ui.internal.dialogs.HyperlinkTokenScannerTest)  Time elapsed: 0 s
21:21:06 Running org.eclipse.egit.ui.internal.dialogs.CommitMessageComponentTest
21:21:06 Tests run: 5, Failures: 0, Errors: 0, Skipped: 0, Time elapsed: 0.001 s - in org.eclipse.egit.ui.internal.dialogs.CommitMessageComponentTest
21:21:06 commitFormat_MultipleLines_notOk2(org.eclipse.egit.ui.internal.dialogs.CommitMessageComponentTest)  Time elapsed: 0 s
21:21:06 commitFormat_simple(org.eclipse.egit.ui.internal.dialogs.CommitMessageComponentTest)  Time elapsed: 0 s
21:21:06 commitFormat_MultipleLines_ok(org.eclipse.egit.ui.internal.dialogs.CommitMessageComponentTest)  Time elapsed: 0 s
21:21:06 commitFormat_trailingWhitespace_ok(org.eclipse.egit.ui.internal.dialogs.CommitMessageComponentTest)  Time elapsed: 0 s
21:21:06 commitFormat_MultipleLines_notOk(org.eclipse.egit.ui.internal.dialogs.CommitMessageComponentTest)  Time elapsed: 0 s
21:21:06 Running org.eclipse.egit.ui.internal.dialogs.CommitMessageBuilderTest
21:21:06 
21:21:06 !ENTRY org.eclipse.egit.ui 4 0 2019-03-22 01:21:06.747
21:21:06 !MESSAGE CrashingCommitMessageProvider fails on purpose.
21:21:06 !STACK 0
21:21:06 java.lang.IllegalStateException: CrashingCommitMessageProvider fails on purpose.
21:21:06 	at org.eclipse.egit.ui.internal.dialogs.CommitMessageBuilderTest$CrashingCommitMessageProvider.getMessage(CommitMessageBuilderTest.java:474)
21:21:06 	at org.eclipse.egit.ui.internal.dialogs.CommitMessageBuilder.build(CommitMessageBuilder.java:90)
21:21:06 	at org.eclipse.egit.ui.internal.dialogs.CommitMessageBuilderTest.commitMessageProvider_oneCrashingProvider(CommitMessageBuilderTest.java:99)
21:21:06 	at sun.reflect.NativeMethodAccessorImpl.invoke0(Native Method)
21:21:06 	at sun.reflect.NativeMethodAccessorImpl.invoke(NativeMethodAccessorImpl.java:62)
21:21:06 	at sun.reflect.DelegatingMethodAccessorImpl.invoke(DelegatingMethodAccessorImpl.java:43)
21:21:06 	at java.lang.reflect.Method.invoke(Method.java:498)
21:21:06 	at org.junit.runners.model.FrameworkMethod$1.runReflectiveCall(FrameworkMethod.java:50)
21:21:06 	at org.junit.internal.runners.model.ReflectiveCallable.run(ReflectiveCallable.java:12)
21:21:06 	at org.junit.runners.model.FrameworkMethod.invokeExplosively(FrameworkMethod.java:47)
21:21:06 	at org.junit.internal.runners.statements.InvokeMethod.evaluate(InvokeMethod.java:17)
21:21:06 	at org.junit.internal.runners.statements.RunBefores.evaluate(RunBefores.java:26)
21:21:06 	at org.junit.internal.runners.statements.RunAfters.evaluate(RunAfters.java:27)
21:21:06 	at org.junit.runners.ParentRunner.runLeaf(ParentRunner.java:325)
21:21:06 	at org.junit.runners.BlockJUnit4ClassRunner.runChild(BlockJUnit4ClassRunner.java:78)
21:21:06 	at org.junit.runners.BlockJUnit4ClassRunner.runChild(BlockJUnit4ClassRunner.java:57)
21:21:06 	at org.junit.runners.ParentRunner$3.run(ParentRunner.java:290)
21:21:06 	at org.junit.runners.ParentRunner$1.schedule(ParentRunner.java:71)
21:21:06 	at org.junit.runners.ParentRunner.runChildren(ParentRunner.java:288)
21:21:06 	at org.junit.runners.ParentRunner.access$000(ParentRunner.java:58)
21:21:06 	at org.junit.runners.ParentRunner$2.evaluate(ParentRunner.java:268)
21:21:06 	at org.junit.internal.runners.statements.RunBefores.evaluate(RunBefores.java:26)
21:21:06 	at org.junit.runners.ParentRunner.run(ParentRunner.java:363)
21:21:06 	at org.apache.maven.surefire.junit4.JUnit4Provider.execute(JUnit4Provider.java:365)
21:21:06 	at org.apache.maven.surefire.junit4.JUnit4Provider.executeWithRerun(JUnit4Provider.java:273)
21:21:06 	at org.apache.maven.surefire.junit4.JUnit4Provider.executeTestSet(JUnit4Provider.java:238)
21:21:06 	at org.apache.maven.surefire.junit4.JUnit4Provider.invoke(JUnit4Provider.java:159)
21:21:06 	at sun.reflect.NativeMethodAccessorImpl.invoke0(Native Method)
21:21:06 	at sun.reflect.NativeMethodAccessorImpl.invoke(NativeMethodAccessorImpl.java:62)
21:21:06 	at sun.reflect.DelegatingMethodAccessorImpl.invoke(DelegatingMethodAccessorImpl.java:43)
21:21:06 	at java.lang.reflect.Method.invoke(Method.java:498)
21:21:06 	at org.apache.maven.surefire.util.ReflectionUtils.invokeMethodWithArray2(ReflectionUtils.java:206)
21:21:06 	at org.apache.maven.surefire.booter.ProviderFactory$ProviderProxy.invoke(ProviderFactory.java:161)
21:21:06 	at org.apache.maven.surefire.booter.ProviderFactory.invokeProvider(ProviderFactory.java:84)
21:21:06 	at org.eclipse.tycho.surefire.osgibooter.OsgiSurefireBooter.run(OsgiSurefireBooter.java:110)
21:21:06 	at org.eclipse.tycho.surefire.osgibooter.AbstractUITestApplication.runTests(AbstractUITestApplication.java:44)
21:21:06 	at org.eclipse.e4.ui.internal.workbench.swt.E4Testable$1.run(E4Testable.java:73)
21:21:06 	at java.lang.Thread.run(Thread.java:748)
21:21:06 
21:21:06 !ENTRY org.eclipse.egit.ui 4 0 2019-03-22 01:21:06.965
21:21:06 !MESSAGE CrashingCommitMessageProviderWithCaretPositioning fails on purpose.
21:21:06 !STACK 0
21:21:06 java.lang.IllegalStateException: CrashingCommitMessageProviderWithCaretPositioning fails on purpose.
21:21:06 	at org.eclipse.egit.ui.internal.dialogs.CommitMessageBuilderTest$CrashingCommitMessageProviderWithCaretPositioning.getCommitMessageWithPosition(CommitMessageBuilderTest.java:491)
21:21:06 	at org.eclipse.egit.ui.internal.dialogs.CommitMessageBuilder.build(CommitMessageBuilder.java:81)
21:21:06 	at org.eclipse.egit.ui.internal.dialogs.CommitMessageBuilderTest.commitMessageProvider_oneCrashingProviderWithCaretPosition(CommitMessageBuilderTest.java:112)
21:21:06 	at sun.reflect.NativeMethodAccessorImpl.invoke0(Native Method)
21:21:06 	at sun.reflect.NativeMethodAccessorImpl.invoke(NativeMethodAccessorImpl.java:62)
21:21:06 	at sun.reflect.DelegatingMethodAccessorImpl.invoke(DelegatingMethodAccessorImpl.java:43)
21:21:06 	at java.lang.reflect.Method.invoke(Method.java:498)
21:21:06 	at org.junit.runners.model.FrameworkMethod$1.runReflectiveCall(FrameworkMethod.java:50)
21:21:06 	at org.junit.internal.runners.model.ReflectiveCallable.run(ReflectiveCallable.java:12)
21:21:06 	at org.junit.runners.model.FrameworkMethod.invokeExplosively(FrameworkMethod.java:47)
21:21:06 	at org.junit.internal.runners.statements.InvokeMethod.evaluate(InvokeMethod.java:17)
21:21:06 	at org.junit.internal.runners.statements.RunBefores.evaluate(RunBefores.java:26)
21:21:06 	at org.junit.internal.runners.statements.RunAfters.evaluate(RunAfters.java:27)
21:21:06 	at org.junit.runners.ParentRunner.runLeaf(ParentRunner.java:325)
21:21:06 	at org.junit.runners.BlockJUnit4ClassRunner.runChild(BlockJUnit4ClassRunner.java:78)
21:21:06 	at org.junit.runners.BlockJUnit4ClassRunner.runChild(BlockJUnit4ClassRunner.java:57)
21:21:06 	at org.junit.runners.ParentRunner$3.run(ParentRunner.java:290)
21:21:06 	at org.junit.runners.ParentRunner$1.schedule(ParentRunner.java:71)
21:21:06 	at org.junit.runners.ParentRunner.runChildren(ParentRunner.java:288)
21:21:06 	at org.junit.runners.ParentRunner.access$000(ParentRunner.java:58)
21:21:06 	at org.junit.runners.ParentRunner$2.evaluate(ParentRunner.java:268)
21:21:06 	at org.junit.internal.runners.statements.RunBefores.evaluate(RunBefores.java:26)
21:21:06 	at org.junit.runners.ParentRunner.run(ParentRunner.java:363)
21:21:06 	at org.apache.maven.surefire.junit4.JUnit4Provider.execute(JUnit4Provider.java:365)
21:21:06 	at org.apache.maven.surefire.junit4.JUnit4Provider.executeWithRerun(JUnit4Provider.java:273)
21:21:06 	at org.apache.maven.surefire.junit4.JUnit4Provider.executeTestSet(JUnit4Provider.java:238)
21:21:06 	at org.apache.maven.surefire.junit4.JUnit4Provider.invoke(JUnit4Provider.java:159)
21:21:06 	at sun.reflect.NativeMethodAccessorImpl.invoke0(Native Method)
21:21:06 	at sun.reflect.NativeMethodAccessorImpl.invoke(NativeMethodAccessorImpl.java:62)
21:21:06 	at sun.reflect.DelegatingMethodAccessorImpl.invoke(DelegatingMethodAccessorImpl.java:43)
21:21:06 	at java.lang.reflect.Method.invoke(Method.java:498)
21:21:06 	at org.apache.maven.surefire.util.ReflectionUtils.invokeMethodWithArray2(ReflectionUtils.java:206)
21:21:06 	at org.apache.maven.surefire.booter.ProviderFactory$ProviderProxy.invoke(ProviderFactory.java:161)
21:21:06 	at org.apache.maven.surefire.booter.ProviderFactory.invokeProvider(ProviderFactory.java:84)
21:21:06 	at org.eclipse.tycho.surefire.osgibooter.OsgiSurefireBooter.run(OsgiSurefireBooter.java:110)
21:21:06 	at org.eclipse.tycho.surefire.osgibooter.AbstractUITestApplication.runTests(AbstractUITestApplication.java:44)
21:21:06 	at org.eclipse.e4.ui.internal.workbench.swt.E4Testable$1.run(E4Testable.java:73)
21:21:06 	at java.lang.Thread.run(Thread.java:748)
21:21:08 
21:21:08 !ENTRY org.eclipse.egit.ui 4 0 2019-03-22 01:21:08.154
21:21:08 !MESSAGE CrashingCommitMessageProvider fails on purpose.
21:21:08 !STACK 0
21:21:08 java.lang.IllegalStateException: CrashingCommitMessageProvider fails on purpose.
21:21:08 	at org.eclipse.egit.ui.internal.dialogs.CommitMessageBuilderTest$CrashingCommitMessageProvider.getMessage(CommitMessageBuilderTest.java:474)
21:21:08 	at org.eclipse.egit.ui.internal.dialogs.CommitMessageBuilder.build(CommitMessageBuilder.java:90)
21:21:08 	at org.eclipse.egit.ui.internal.dialogs.CommitMessageBuilderTest.commitMessageProvider_twoProvidersFirstOneCrashing(CommitMessageBuilderTest.java:146)
21:21:08 	at sun.reflect.NativeMethodAccessorImpl.invoke0(Native Method)
21:21:08 	at sun.reflect.NativeMethodAccessorImpl.invoke(NativeMethodAccessorImpl.java:62)
21:21:08 	at sun.reflect.DelegatingMethodAccessorImpl.invoke(DelegatingMethodAccessorImpl.java:43)
21:21:08 	at java.lang.reflect.Method.invoke(Method.java:498)
21:21:08 	at org.junit.runners.model.FrameworkMethod$1.runReflectiveCall(FrameworkMethod.java:50)
21:21:08 	at org.junit.internal.runners.model.ReflectiveCallable.run(ReflectiveCallable.java:12)
21:21:08 	at org.junit.runners.model.FrameworkMethod.invokeExplosively(FrameworkMethod.java:47)
21:21:08 	at org.junit.internal.runners.statements.InvokeMethod.evaluate(InvokeMethod.java:17)
21:21:08 	at org.junit.internal.runners.statements.RunBefores.evaluate(RunBefores.java:26)
21:21:08 	at org.junit.internal.runners.statements.RunAfters.evaluate(RunAfters.java:27)
21:21:08 	at org.junit.runners.ParentRunner.runLeaf(ParentRunner.java:325)
21:21:08 	at org.junit.runners.BlockJUnit4ClassRunner.runChild(BlockJUnit4ClassRunner.java:78)
21:21:08 	at org.junit.runners.BlockJUnit4ClassRunner.runChild(BlockJUnit4ClassRunner.java:57)
21:21:08 	at org.junit.runners.ParentRunner$3.run(ParentRunner.java:290)
21:21:08 	at org.junit.runners.ParentRunner$1.schedule(ParentRunner.java:71)
21:21:08 	at org.junit.runners.ParentRunner.runChildren(ParentRunner.java:288)
21:21:08 	at org.junit.runners.ParentRunner.access$000(ParentRunner.java:58)
21:21:08 	at org.junit.runners.ParentRunner$2.evaluate(ParentRunner.java:268)
21:21:08 	at org.junit.internal.runners.statements.RunBefores.evaluate(RunBefores.java:26)
21:21:08 	at org.junit.runners.ParentRunner.run(ParentRunner.java:363)
21:21:08 	at org.apache.maven.surefire.junit4.JUnit4Provider.execute(JUnit4Provider.java:365)
21:21:08 	at org.apache.maven.surefire.junit4.JUnit4Provider.executeWithRerun(JUnit4Provider.java:273)
21:21:08 	at org.apache.maven.surefire.junit4.JUnit4Provider.executeTestSet(JUnit4Provider.java:238)
21:21:08 	at org.apache.maven.surefire.junit4.JUnit4Provider.invoke(JUnit4Provider.java:159)
21:21:08 	at sun.reflect.NativeMethodAccessorImpl.invoke0(Native Method)
21:21:08 	at sun.reflect.NativeMethodAccessorImpl.invoke(NativeMethodAccessorImpl.java:62)
21:21:08 	at sun.reflect.DelegatingMethodAccessorImpl.invoke(DelegatingMethodAccessorImpl.java:43)
21:21:08 	at java.lang.reflect.Method.invoke(Method.java:498)
21:21:08 	at org.apache.maven.surefire.util.ReflectionUtils.invokeMethodWithArray2(ReflectionUtils.java:206)
21:21:08 	at org.apache.maven.surefire.booter.ProviderFactory$ProviderProxy.invoke(ProviderFactory.java:161)
21:21:08 	at org.apache.maven.surefire.booter.ProviderFactory.invokeProvider(ProviderFactory.java:84)
21:21:08 	at org.eclipse.tycho.surefire.osgibooter.OsgiSurefireBooter.run(OsgiSurefireBooter.java:110)
21:21:08 	at org.eclipse.tycho.surefire.osgibooter.AbstractUITestApplication.runTests(AbstractUITestApplication.java:44)
21:21:08 	at org.eclipse.e4.ui.internal.workbench.swt.E4Testable$1.run(E4Testable.java:73)
21:21:08 	at java.lang.Thread.run(Thread.java:748)
21:21:08 
21:21:08 !ENTRY org.eclipse.egit.ui 4 0 2019-03-22 01:21:08.449
21:21:08 !MESSAGE CrashingCommitMessageProvider fails on purpose.
21:21:08 !STACK 0
21:21:08 java.lang.IllegalStateException: CrashingCommitMessageProvider fails on purpose.
21:21:08 	at org.eclipse.egit.ui.internal.dialogs.CommitMessageBuilderTest$CrashingCommitMessageProvider.getMessage(CommitMessageBuilderTest.java:474)
21:21:08 	at org.eclipse.egit.ui.internal.dialogs.CommitMessageBuilder.build(CommitMessageBuilder.java:90)
21:21:08 	at org.eclipse.egit.ui.internal.dialogs.CommitMessageBuilderTest.commitMessageProvider_multipleProvidersWithCrashAndNull(CommitMessageBuilderTest.java:165)
21:21:08 	at sun.reflect.NativeMethodAccessorImpl.invoke0(Native Method)
21:21:08 	at sun.reflect.NativeMethodAccessorImpl.invoke(NativeMethodAccessorImpl.java:62)
21:21:08 	at sun.reflect.DelegatingMethodAccessorImpl.invoke(DelegatingMethodAccessorImpl.java:43)
21:21:08 	at java.lang.reflect.Method.invoke(Method.java:498)
21:21:08 	at org.junit.runners.model.FrameworkMethod$1.runReflectiveCall(FrameworkMethod.java:50)
21:21:08 	at org.junit.internal.runners.model.ReflectiveCallable.run(ReflectiveCallable.java:12)
21:21:08 	at org.junit.runners.model.FrameworkMethod.invokeExplosively(FrameworkMethod.java:47)
21:21:08 	at org.junit.internal.runners.statements.InvokeMethod.evaluate(InvokeMethod.java:17)
21:21:08 	at org.junit.internal.runners.statements.RunBefores.evaluate(RunBefores.java:26)
21:21:08 	at org.junit.internal.runners.statements.RunAfters.evaluate(RunAfters.java:27)
21:21:08 	at org.junit.runners.ParentRunner.runLeaf(ParentRunner.java:325)
21:21:08 	at org.junit.runners.BlockJUnit4ClassRunner.runChild(BlockJUnit4ClassRunner.java:78)
21:21:08 	at org.junit.runners.BlockJUnit4ClassRunner.runChild(BlockJUnit4ClassRunner.java:57)
21:21:08 	at org.junit.runners.ParentRunner$3.run(ParentRunner.java:290)
21:21:08 	at org.junit.runners.ParentRunner$1.schedule(ParentRunner.java:71)
21:21:08 	at org.junit.runners.ParentRunner.runChildren(ParentRunner.java:288)
21:21:08 	at org.junit.runners.ParentRunner.access$000(ParentRunner.java:58)
21:21:08 	at org.junit.runners.ParentRunner$2.evaluate(ParentRunner.java:268)
21:21:08 	at org.junit.internal.runners.statements.RunBefores.evaluate(RunBefores.java:26)
21:21:08 	at org.junit.runners.ParentRunner.run(ParentRunner.java:363)
21:21:08 	at org.apache.maven.surefire.junit4.JUnit4Provider.execute(JUnit4Provider.java:365)
21:21:08 	at org.apache.maven.surefire.junit4.JUnit4Provider.executeWithRerun(JUnit4Provider.java:273)
21:21:08 	at org.apache.maven.surefire.junit4.JUnit4Provider.executeTestSet(JUnit4Provider.java:238)
21:21:08 	at org.apache.maven.surefire.junit4.JUnit4Provider.invoke(JUnit4Provider.java:159)
21:21:08 	at sun.reflect.NativeMethodAccessorImpl.invoke0(Native Method)
21:21:08 	at sun.reflect.NativeMethodAccessorImpl.invoke(NativeMethodAccessorImpl.java:62)
21:21:08 	at sun.reflect.DelegatingMethodAccessorImpl.invoke(DelegatingMethodAccessorImpl.java:43)
21:21:08 	at java.lang.reflect.Method.invoke(Method.java:498)
21:21:08 	at org.apache.maven.surefire.util.ReflectionUtils.invokeMethodWithArray2(ReflectionUtils.java:206)
21:21:08 	at org.apache.maven.surefire.booter.ProviderFactory$ProviderProxy.invoke(ProviderFactory.java:161)
21:21:08 	at org.apache.maven.surefire.booter.ProviderFactory.invokeProvider(ProviderFactory.java:84)
21:21:08 	at org.eclipse.tycho.surefire.osgibooter.OsgiSurefireBooter.run(OsgiSurefireBooter.java:110)
21:21:08 	at org.eclipse.tycho.surefire.osgibooter.AbstractUITestApplication.runTests(AbstractUITestApplication.java:44)
21:21:08 	at org.eclipse.e4.ui.internal.workbench.swt.E4Testable$1.run(E4Testable.java:73)
21:21:08 	at java.lang.Thread.run(Thread.java:748)
21:21:08 
21:21:08 !ENTRY org.eclipse.egit.ui 4 0 2019-03-22 01:21:08.450
21:21:08 !MESSAGE CrashingCommitMessageProvider fails on purpose.
21:21:08 !STACK 0
21:21:08 java.lang.IllegalStateException: CrashingCommitMessageProvider fails on purpose.
21:21:08 	at org.eclipse.egit.ui.internal.dialogs.CommitMessageBuilderTest$CrashingCommitMessageProvider.getMessage(CommitMessageBuilderTest.java:474)
21:21:08 	at org.eclipse.egit.ui.internal.dialogs.CommitMessageBuilder.build(CommitMessageBuilder.java:90)
21:21:08 	at org.eclipse.egit.ui.internal.dialogs.CommitMessageBuilderTest.commitMessageProvider_multipleProvidersWithCrashAndNull(CommitMessageBuilderTest.java:165)
21:21:08 	at sun.reflect.NativeMethodAccessorImpl.invoke0(Native Method)
21:21:08 	at sun.reflect.NativeMethodAccessorImpl.invoke(NativeMethodAccessorImpl.java:62)
21:21:08 	at sun.reflect.DelegatingMethodAccessorImpl.invoke(DelegatingMethodAccessorImpl.java:43)
21:21:08 	at java.lang.reflect.Method.invoke(Method.java:498)
21:21:08 	at org.junit.runners.model.FrameworkMethod$1.runReflectiveCall(FrameworkMethod.java:50)
21:21:08 	at org.junit.internal.runners.model.ReflectiveCallable.run(ReflectiveCallable.java:12)
21:21:08 	at org.junit.runners.model.FrameworkMethod.invokeExplosively(FrameworkMethod.java:47)
21:21:08 	at org.junit.internal.runners.statements.InvokeMethod.evaluate(InvokeMethod.java:17)
21:21:08 	at org.junit.internal.runners.statements.RunBefores.evaluate(RunBefores.java:26)
21:21:08 	at org.junit.internal.runners.statements.RunAfters.evaluate(RunAfters.java:27)
21:21:08 	at org.junit.runners.ParentRunner.runLeaf(ParentRunner.java:325)
21:21:08 	at org.junit.runners.BlockJUnit4ClassRunner.runChild(BlockJUnit4ClassRunner.java:78)
21:21:08 	at org.junit.runners.BlockJUnit4ClassRunner.runChild(BlockJUnit4ClassRunner.java:57)
21:21:08 	at org.junit.runners.ParentRunner$3.run(ParentRunner.java:290)
21:21:08 	at org.junit.runners.ParentRunner$1.schedule(ParentRunner.java:71)
21:21:08 	at org.junit.runners.ParentRunner.runChildren(ParentRunner.java:288)
21:21:08 	at org.junit.runners.ParentRunner.access$000(ParentRunner.java:58)
21:21:08 	at org.junit.runners.ParentRunner$2.evaluate(ParentRunner.java:268)
21:21:08 	at org.junit.internal.runners.statements.RunBefores.evaluate(RunBefores.java:26)
21:21:08 	at org.junit.runners.ParentRunner.run(ParentRunner.java:363)
21:21:08 	at org.apache.maven.surefire.junit4.JUnit4Provider.execute(JUnit4Provider.java:365)
21:21:08 	at org.apache.maven.surefire.junit4.JUnit4Provider.executeWithRerun(JUnit4Provider.java:273)
21:21:08 	at org.apache.maven.surefire.junit4.JUnit4Provider.executeTestSet(JUnit4Provider.java:238)
21:21:08 	at org.apache.maven.surefire.junit4.JUnit4Provider.invoke(JUnit4Provider.java:159)
21:21:08 	at sun.reflect.NativeMethodAccessorImpl.invoke0(Native Method)
21:21:08 	at sun.reflect.NativeMethodAccessorImpl.invoke(NativeMethodAccessorImpl.java:62)
21:21:08 	at sun.reflect.DelegatingMethodAccessorImpl.invoke(DelegatingMethodAccessorImpl.java:43)
21:21:08 	at java.lang.reflect.Method.invoke(Method.java:498)
21:21:08 	at org.apache.maven.surefire.util.ReflectionUtils.invokeMethodWithArray2(ReflectionUtils.java:206)
21:21:08 	at org.apache.maven.surefire.booter.ProviderFactory$ProviderProxy.invoke(ProviderFactory.java:161)
21:21:08 	at org.apache.maven.surefire.booter.ProviderFactory.invokeProvider(ProviderFactory.java:84)
21:21:08 	at org.eclipse.tycho.surefire.osgibooter.OsgiSurefireBooter.run(OsgiSurefireBooter.java:110)
21:21:08 	at org.eclipse.tycho.surefire.osgibooter.AbstractUITestApplication.runTests(AbstractUITestApplication.java:44)
21:21:08 	at org.eclipse.e4.ui.internal.workbench.swt.E4Testable$1.run(E4Testable.java:73)
21:21:08 	at java.lang.Thread.run(Thread.java:748)
21:21:08 
21:21:08 !ENTRY org.eclipse.egit.ui 2 0 2019-03-22 01:21:08.547
21:21:08 !MESSAGE The ICommitMessageProvider2 implementation org.eclipse.egit.ui.internal.dialogs.CommitMessageBuilderTest$3 provided the caret position -42, which exceeds the length of the commit message or is negative. The caret position is ignored.
21:21:10 
21:21:10 !ENTRY org.eclipse.egit.ui 2 0 2019-03-22 01:21:10.461
21:21:10 !MESSAGE Found multiple implementations of ICommitMessageProvider2. Ignoring caret positioning for org.eclipse.egit.ui.internal.dialogs.CommitMessageBuilderTest$3.
21:21:11 
21:21:11 !ENTRY org.eclipse.egit.ui 4 0 2019-03-22 01:21:11.688
21:21:11 !MESSAGE CrashingCommitMessageProvider fails on purpose.
21:21:11 !STACK 0
21:21:11 java.lang.IllegalStateException: CrashingCommitMessageProvider fails on purpose.
21:21:11 	at org.eclipse.egit.ui.internal.dialogs.CommitMessageBuilderTest$CrashingCommitMessageProvider.getMessage(CommitMessageBuilderTest.java:474)
21:21:11 	at org.eclipse.egit.ui.internal.dialogs.CommitMessageBuilder.build(CommitMessageBuilder.java:90)
21:21:11 	at org.eclipse.egit.ui.internal.dialogs.CommitMessageBuilderTest.commitMessageProvider_twoProvidersSecondOneCrashing(CommitMessageBuilderTest.java:130)
21:21:11 	at sun.reflect.NativeMethodAccessorImpl.invoke0(Native Method)
21:21:11 	at sun.reflect.NativeMethodAccessorImpl.invoke(NativeMethodAccessorImpl.java:62)
21:21:11 	at sun.reflect.DelegatingMethodAccessorImpl.invoke(DelegatingMethodAccessorImpl.java:43)
21:21:11 	at java.lang.reflect.Method.invoke(Method.java:498)
21:21:11 	at org.junit.runners.model.FrameworkMethod$1.runReflectiveCall(FrameworkMethod.java:50)
21:21:11 	at org.junit.internal.runners.model.ReflectiveCallable.run(ReflectiveCallable.java:12)
21:21:11 	at org.junit.runners.model.FrameworkMethod.invokeExplosively(FrameworkMethod.java:47)
21:21:11 	at org.junit.internal.runners.statements.InvokeMethod.evaluate(InvokeMethod.java:17)
21:21:11 	at org.junit.internal.runners.statements.RunBefores.evaluate(RunBefores.java:26)
21:21:11 	at org.junit.internal.runners.statements.RunAfters.evaluate(RunAfters.java:27)
21:21:11 	at org.junit.runners.ParentRunner.runLeaf(ParentRunner.java:325)
21:21:11 	at org.junit.runners.BlockJUnit4ClassRunner.runChild(BlockJUnit4ClassRunner.java:78)
21:21:11 	at org.junit.runners.BlockJUnit4ClassRunner.runChild(BlockJUnit4ClassRunner.java:57)
21:21:11 	at org.junit.runners.ParentRunner$3.run(ParentRunner.java:290)
21:21:11 	at org.junit.runners.ParentRunner$1.schedule(ParentRunner.java:71)
21:21:11 	at org.junit.runners.ParentRunner.runChildren(ParentRunner.java:288)
21:21:11 	at org.junit.runners.ParentRunner.access$000(ParentRunner.java:58)
21:21:11 	at org.junit.runners.ParentRunner$2.evaluate(ParentRunner.java:268)
21:21:11 	at org.junit.internal.runners.statements.RunBefores.evaluate(RunBefores.java:26)
21:21:11 	at org.junit.runners.ParentRunner.run(ParentRunner.java:363)
21:21:11 	at org.apache.maven.surefire.junit4.JUnit4Provider.execute(JUnit4Provider.java:365)
21:21:11 	at org.apache.maven.surefire.junit4.JUnit4Provider.executeWithRerun(JUnit4Provider.java:273)
21:21:11 	at org.apache.maven.surefire.junit4.JUnit4Provider.executeTestSet(JUnit4Provider.java:238)
21:21:11 	at org.apache.maven.surefire.junit4.JUnit4Provider.invoke(JUnit4Provider.java:159)
21:21:11 	at sun.reflect.NativeMethodAccessorImpl.invoke0(Native Method)
21:21:11 	at sun.reflect.NativeMethodAccessorImpl.invoke(NativeMethodAccessorImpl.java:62)
21:21:11 	at sun.reflect.DelegatingMethodAccessorImpl.invoke(DelegatingMethodAccessorImpl.java:43)
21:21:11 	at java.lang.reflect.Method.invoke(Method.java:498)
21:21:11 	at org.apache.maven.surefire.util.ReflectionUtils.invokeMethodWithArray2(ReflectionUtils.java:206)
21:21:11 	at org.apache.maven.surefire.booter.ProviderFactory$ProviderProxy.invoke(ProviderFactory.java:161)
21:21:11 	at org.apache.maven.surefire.booter.ProviderFactory.invokeProvider(ProviderFactory.java:84)
21:21:11 	at org.eclipse.tycho.surefire.osgibooter.OsgiSurefireBooter.run(OsgiSurefireBooter.java:110)
21:21:11 	at org.eclipse.tycho.surefire.osgibooter.AbstractUITestApplication.runTests(AbstractUITestApplication.java:44)
21:21:11 	at org.eclipse.e4.ui.internal.workbench.swt.E4Testable$1.run(E4Testable.java:73)
21:21:11 	at java.lang.Thread.run(Thread.java:748)
21:21:11 
21:21:11 !ENTRY org.eclipse.egit.ui 4 0 2019-03-22 01:21:11.800
21:21:11 !MESSAGE CrashingCommitMessageProvider fails on purpose.
21:21:11 !STACK 0
21:21:11 java.lang.IllegalStateException: CrashingCommitMessageProvider fails on purpose.
21:21:11 	at org.eclipse.egit.ui.internal.dialogs.CommitMessageBuilderTest$CrashingCommitMessageProvider.getMessage(CommitMessageBuilderTest.java:474)
21:21:11 	at org.eclipse.egit.ui.internal.dialogs.CommitMessageBuilder.build(CommitMessageBuilder.java:90)
21:21:11 	at org.eclipse.egit.ui.internal.dialogs.CommitMessageBuilderTest.commitMessageProvider_multipleProvidersWithCrashingAndNullAndOneCaretPositioning(CommitMessageBuilderTest.java:414)
21:21:11 	at sun.reflect.NativeMethodAccessorImpl.invoke0(Native Method)
21:21:11 	at sun.reflect.NativeMethodAccessorImpl.invoke(NativeMethodAccessorImpl.java:62)
21:21:11 	at sun.reflect.DelegatingMethodAccessorImpl.invoke(DelegatingMethodAccessorImpl.java:43)
21:21:11 	at java.lang.reflect.Method.invoke(Method.java:498)
21:21:11 	at org.junit.runners.model.FrameworkMethod$1.runReflectiveCall(FrameworkMethod.java:50)
21:21:11 	at org.junit.internal.runners.model.ReflectiveCallable.run(ReflectiveCallable.java:12)
21:21:11 	at org.junit.runners.model.FrameworkMethod.invokeExplosively(FrameworkMethod.java:47)
21:21:11 	at org.junit.internal.runners.statements.InvokeMethod.evaluate(InvokeMethod.java:17)
21:21:11 	at org.junit.internal.runners.statements.RunBefores.evaluate(RunBefores.java:26)
21:21:11 	at org.junit.internal.runners.statements.RunAfters.evaluate(RunAfters.java:27)
21:21:11 	at org.junit.runners.ParentRunner.runLeaf(ParentRunner.java:325)
21:21:11 	at org.junit.runners.BlockJUnit4ClassRunner.runChild(BlockJUnit4ClassRunner.java:78)
21:21:11 	at org.junit.runners.BlockJUnit4ClassRunner.runChild(BlockJUnit4ClassRunner.java:57)
21:21:11 	at org.junit.runners.ParentRunner$3.run(ParentRunner.java:290)
21:21:11 	at org.junit.runners.ParentRunner$1.schedule(ParentRunner.java:71)
21:21:11 	at org.junit.runners.ParentRunner.runChildren(ParentRunner.java:288)
21:21:11 	at org.junit.runners.ParentRunner.access$000(ParentRunner.java:58)
21:21:11 	at org.junit.runners.ParentRunner$2.evaluate(ParentRunner.java:268)
21:21:11 	at org.junit.internal.runners.statements.RunBefores.evaluate(RunBefores.java:26)
21:21:11 	at org.junit.runners.ParentRunner.run(ParentRunner.java:363)
21:21:11 	at org.apache.maven.surefire.junit4.JUnit4Provider.execute(JUnit4Provider.java:365)
21:21:11 	at org.apache.maven.surefire.junit4.JUnit4Provider.executeWithRerun(JUnit4Provider.java:273)
21:21:11 	at org.apache.maven.surefire.junit4.JUnit4Provider.executeTestSet(JUnit4Provider.java:238)
21:21:11 	at org.apache.maven.surefire.junit4.JUnit4Provider.invoke(JUnit4Provider.java:159)
21:21:11 	at sun.reflect.NativeMethodAccessorImpl.invoke0(Native Method)
21:21:11 	at sun.reflect.NativeMethodAccessorImpl.invoke(NativeMethodAccessorImpl.java:62)
21:21:11 	at sun.reflect.DelegatingMethodAccessorImpl.invoke(DelegatingMethodAccessorImpl.java:43)
21:21:11 	at java.lang.reflect.Method.invoke(Method.java:498)
21:21:11 	at org.apache.maven.surefire.util.ReflectionUtils.invokeMethodWithArray2(ReflectionUtils.java:206)
21:21:11 	at org.apache.maven.surefire.booter.ProviderFactory$ProviderProxy.invoke(ProviderFactory.java:161)
21:21:11 	at org.apache.maven.surefire.booter.ProviderFactory.invokeProvider(ProviderFactory.java:84)
21:21:11 	at org.eclipse.tycho.surefire.osgibooter.OsgiSurefireBooter.run(OsgiSurefireBooter.java:110)
21:21:11 	at org.eclipse.tycho.surefire.osgibooter.AbstractUITestApplication.runTests(AbstractUITestApplication.java:44)
21:21:11 	at org.eclipse.e4.ui.internal.workbench.swt.E4Testable$1.run(E4Testable.java:73)
21:21:11 	at java.lang.Thread.run(Thread.java:748)
21:21:11 
21:21:11 !ENTRY org.eclipse.egit.ui 4 0 2019-03-22 01:21:11.801
21:21:11 !MESSAGE CrashingCommitMessageProvider fails on purpose.
21:21:11 !STACK 0
21:21:11 java.lang.IllegalStateException: CrashingCommitMessageProvider fails on purpose.
21:21:11 	at org.eclipse.egit.ui.internal.dialogs.CommitMessageBuilderTest$CrashingCommitMessageProvider.getMessage(CommitMessageBuilderTest.java:474)
21:21:11 	at org.eclipse.egit.ui.internal.dialogs.CommitMessageBuilder.build(CommitMessageBuilder.java:90)
21:21:11 	at org.eclipse.egit.ui.internal.dialogs.CommitMessageBuilderTest.commitMessageProvider_multipleProvidersWithCrashingAndNullAndOneCaretPositioning(CommitMessageBuilderTest.java:414)
21:21:11 	at sun.reflect.NativeMethodAccessorImpl.invoke0(Native Method)
21:21:11 	at sun.reflect.NativeMethodAccessorImpl.invoke(NativeMethodAccessorImpl.java:62)
21:21:11 	at sun.reflect.DelegatingMethodAccessorImpl.invoke(DelegatingMethodAccessorImpl.java:43)
21:21:11 	at java.lang.reflect.Method.invoke(Method.java:498)
21:21:11 	at org.junit.runners.model.FrameworkMethod$1.runReflectiveCall(FrameworkMethod.java:50)
21:21:11 	at org.junit.internal.runners.model.ReflectiveCallable.run(ReflectiveCallable.java:12)
21:21:11 	at org.junit.runners.model.FrameworkMethod.invokeExplosively(FrameworkMethod.java:47)
21:21:11 	at org.junit.internal.runners.statements.InvokeMethod.evaluate(InvokeMethod.java:17)
21:21:11 	at org.junit.internal.runners.statements.RunBefores.evaluate(RunBefores.java:26)
21:21:11 	at org.junit.internal.runners.statements.RunAfters.evaluate(RunAfters.java:27)
21:21:11 	at org.junit.runners.ParentRunner.runLeaf(ParentRunner.java:325)
21:21:11 	at org.junit.runners.BlockJUnit4ClassRunner.runChild(BlockJUnit4ClassRunner.java:78)
21:21:11 	at org.junit.runners.BlockJUnit4ClassRunner.runChild(BlockJUnit4ClassRunner.java:57)
21:21:11 	at org.junit.runners.ParentRunner$3.run(ParentRunner.java:290)
21:21:11 	at org.junit.runners.ParentRunner$1.schedule(ParentRunner.java:71)
21:21:11 	at org.junit.runners.ParentRunner.runChildren(ParentRunner.java:288)
21:21:11 	at org.junit.runners.ParentRunner.access$000(ParentRunner.java:58)
21:21:11 	at org.junit.runners.ParentRunner$2.evaluate(ParentRunner.java:268)
21:21:11 	at org.junit.internal.runners.statements.RunBefores.evaluate(RunBefores.java:26)
21:21:11 	at org.junit.runners.ParentRunner.run(ParentRunner.java:363)
21:21:11 	at org.apache.maven.surefire.junit4.JUnit4Provider.execute(JUnit4Provider.java:365)
21:21:11 	at org.apache.maven.surefire.junit4.JUnit4Provider.executeWithRerun(JUnit4Provider.java:273)
21:21:11 	at org.apache.maven.surefire.junit4.JUnit4Provider.executeTestSet(JUnit4Provider.java:238)
21:21:11 	at org.apache.maven.surefire.junit4.JUnit4Provider.invoke(JUnit4Provider.java:159)
21:21:11 	at sun.reflect.NativeMethodAccessorImpl.invoke0(Native Method)
21:21:11 	at sun.reflect.NativeMethodAccessorImpl.invoke(NativeMethodAccessorImpl.java:62)
21:21:11 	at sun.reflect.DelegatingMethodAccessorImpl.invoke(DelegatingMethodAccessorImpl.java:43)
21:21:11 	at java.lang.reflect.Method.invoke(Method.java:498)
21:21:11 	at org.apache.maven.surefire.util.ReflectionUtils.invokeMethodWithArray2(ReflectionUtils.java:206)
21:21:11 	at org.apache.maven.surefire.booter.ProviderFactory$ProviderProxy.invoke(ProviderFactory.java:161)
21:21:11 	at org.apache.maven.surefire.booter.ProviderFactory.invokeProvider(ProviderFactory.java:84)
21:21:11 	at org.eclipse.tycho.surefire.osgibooter.OsgiSurefireBooter.run(OsgiSurefireBooter.java:110)
21:21:11 	at org.eclipse.tycho.surefire.osgibooter.AbstractUITestApplication.runTests(AbstractUITestApplication.java:44)
21:21:11 	at org.eclipse.e4.ui.internal.workbench.swt.E4Testable$1.run(E4Testable.java:73)
21:21:11 	at java.lang.Thread.run(Thread.java:748)
21:21:11 
21:21:11 !ENTRY org.eclipse.egit.ui 2 0 2019-03-22 01:21:11.897
21:21:11 !MESSAGE Found multiple implementations of ICommitMessageProvider2. Ignoring caret positioning for org.eclipse.egit.ui.internal.dialogs.CommitMessageBuilderTest$3.
21:21:11 
21:21:11 !ENTRY org.eclipse.egit.ui 2 0 2019-03-22 01:21:11.984
21:21:11 !MESSAGE The ICommitMessageProvider2 implementation org.eclipse.egit.ui.internal.dialogs.CommitMessageBuilderTest$3 provided the caret position 14, which exceeds the length of the commit message or is negative. The caret position is ignored.
21:21:11 Tests run: 20, Failures: 0, Errors: 0, Skipped: 0, Time elapsed: 5.429 s - in org.eclipse.egit.ui.internal.dialogs.CommitMessageBuilderTest
21:21:11 commitMessageProvider_oneCrashingProvider(org.eclipse.egit.ui.internal.dialogs.CommitMessageBuilderTest)  Time elapsed: 0.181 s
21:21:11 commitMessageProvider_twoProvidersSecondWithCaretPositioning(org.eclipse.egit.ui.internal.dialogs.CommitMessageBuilderTest)  Time elapsed: 0.091 s
21:21:11 commitMessageProvider_oneCrashingProviderWithCaretPosition(org.eclipse.egit.ui.internal.dialogs.CommitMessageBuilderTest)  Time elapsed: 0.122 s
21:21:11 commitMessageProvider_twoProvidersFirstOneCrashing(org.eclipse.egit.ui.internal.dialogs.CommitMessageBuilderTest)  Time elapsed: 1.202 s
21:21:11 commitMessageProvider_noProvider(org.eclipse.egit.ui.internal.dialogs.CommitMessageBuilderTest)  Time elapsed: 0.104 s
21:21:11 commitMessageProvider_oneProvider(org.eclipse.egit.ui.internal.dialogs.CommitMessageBuilderTest)  Time elapsed: 0.089 s
21:21:11 commitMessageProvider_multipleProvidersWithCrashAndNull(org.eclipse.egit.ui.internal.dialogs.CommitMessageBuilderTest)  Time elapsed: 0.092 s
21:21:11 commitMessageProvider_oneProviderWithInvalidNegativeCaretPosition(org.eclipse.egit.ui.internal.dialogs.CommitMessageBuilderTest)  Time elapsed: 0.094 s
21:21:11 commitMessageProvider_twoProvidersSecondWithUndefinedCaretPosition(org.eclipse.egit.ui.internal.dialogs.CommitMessageBuilderTest)  Time elapsed: 1.144 s
21:21:11 commitMessageProvider_twoProvidersWithCaretPositioningFirstWithUndefinedCaretPosition(org.eclipse.egit.ui.internal.dialogs.CommitMessageBuilderTest)  Time elapsed: 0.5 s
21:21:11 commitMessageProvider_oneProviderWithCaretPositionEqualsMessageLength(org.eclipse.egit.ui.internal.dialogs.CommitMessageBuilderTest)  Time elapsed: 0.09 s
21:21:11 commitMessageProvider_twoProvidersFirstWithCaretPositioning(org.eclipse.egit.ui.internal.dialogs.CommitMessageBuilderTest)  Time elapsed: 0.089 s
21:21:11 commitMessageProvider_twoProvidersWithCaretPositioningSecondWithUndefinedCaretPosition(org.eclipse.egit.ui.internal.dialogs.CommitMessageBuilderTest)  Time elapsed: 0.09 s
21:21:11 commitMessageProvider_oneProviderWithCaretPositioning(org.eclipse.egit.ui.internal.dialogs.CommitMessageBuilderTest)  Time elapsed: 0.147 s
21:21:11 commitMessageProvider_twoProvidersSecondWithCaretPositionZero(org.eclipse.egit.ui.internal.dialogs.CommitMessageBuilderTest)  Time elapsed: 0.667 s
21:21:11 commitMessageProvider_twoProviders(org.eclipse.egit.ui.internal.dialogs.CommitMessageBuilderTest)  Time elapsed: 0.159 s
21:21:11 commitMessageProvider_twoProvidersSecondOneCrashing(org.eclipse.egit.ui.internal.dialogs.CommitMessageBuilderTest)  Time elapsed: 0.251 s
21:21:11 commitMessageProvider_multipleProvidersWithCrashingAndNullAndOneCaretPositioning(org.eclipse.egit.ui.internal.dialogs.CommitMessageBuilderTest)  Time elapsed: 0.113 s
21:21:11 commitMessageProvider_twoProvidersWithCaretPositioning(org.eclipse.egit.ui.internal.dialogs.CommitMessageBuilderTest)  Time elapsed: 0.094 s
21:21:11 commitMessageProvider_oneProviderWithInvalidCaretPositionExceedingMessageLength(org.eclipse.egit.ui.internal.dialogs.CommitMessageBuilderTest)  Time elapsed: 0.087 s
21:21:11 Running org.eclipse.egit.ui.internal.dialogs.SpellcheckableMessageAreaTest
21:21:11 Tests run: 25, Failures: 0, Errors: 0, Skipped: 0, Time elapsed: 0.004 s - in org.eclipse.egit.ui.internal.dialogs.SpellcheckableMessageAreaTest
21:21:11 testWrappingLongWords(org.eclipse.egit.ui.internal.dialogs.SpellcheckableMessageAreaTest)  Time elapsed: 0.001 s
21:21:11 wrapOnlyCommitMessageBody(org.eclipse.egit.ui.internal.dialogs.SpellcheckableMessageAreaTest)  Time elapsed: 0 s
21:21:11 dontWrapMaximumLengthText(org.eclipse.egit.ui.internal.dialogs.SpellcheckableMessageAreaTest)  Time elapsed: 0 s
21:21:11 keepTrailingSpace(org.eclipse.egit.ui.internal.dialogs.SpellcheckableMessageAreaTest)  Time elapsed: 0 s
21:21:11 dontWrapShortMessage(org.eclipse.egit.ui.internal.dialogs.SpellcheckableMessageAreaTest)  Time elapsed: 0 s
21:21:11 lineAfterWrappedWordShouldNotBeJoined(org.eclipse.egit.ui.internal.dialogs.SpellcheckableMessageAreaTest)  Time elapsed: 0 s
21:21:11 lineAfterWrappedWordShouldNotBeJoined2(org.eclipse.egit.ui.internal.dialogs.SpellcheckableMessageAreaTest)  Time elapsed: 0 s
21:21:11 lineAfterWrappedWordShouldNotBeJoined3(org.eclipse.egit.ui.internal.dialogs.SpellcheckableMessageAreaTest)  Time elapsed: 0 s
21:21:11 dontWrapWordLongerThanOneLine(org.eclipse.egit.ui.internal.dialogs.SpellcheckableMessageAreaTest)  Time elapsed: 0 s
21:21:11 keepExistingNewlines(org.eclipse.egit.ui.internal.dialogs.SpellcheckableMessageAreaTest)  Time elapsed: 0 s
21:21:11 dontWrapShortText(org.eclipse.egit.ui.internal.dialogs.SpellcheckableMessageAreaTest)  Time elapsed: 0 s
21:21:11 dontWrapWordLongerThanOneLineAtStart(org.eclipse.egit.ui.internal.dialogs.SpellcheckableMessageAreaTest)  Time elapsed: 0 s
21:21:11 dontWrapAlreadyWrappedText(org.eclipse.egit.ui.internal.dialogs.SpellcheckableMessageAreaTest)  Time elapsed: 0 s
21:21:11 wrapOverlengthText2(org.eclipse.egit.ui.internal.dialogs.SpellcheckableMessageAreaTest)  Time elapsed: 0 s
21:21:11 lineAfterWrappedWordShouldNotBeJoinedIfItStartsWithASymbol(org.eclipse.egit.ui.internal.dialogs.SpellcheckableMessageAreaTest)  Time elapsed: 0 s
21:21:11 wrapAlternatingBlankNonBlank(org.eclipse.egit.ui.internal.dialogs.SpellcheckableMessageAreaTest)  Time elapsed: 0 s
21:21:11 keepWhitespace(org.eclipse.egit.ui.internal.dialogs.SpellcheckableMessageAreaTest)  Time elapsed: 0 s
21:21:11 lineAfterWrappedWordShouldNotBeJoinedIfItsEmpty(org.eclipse.egit.ui.internal.dialogs.SpellcheckableMessageAreaTest)  Time elapsed: 0 s
21:21:11 dontWrapLongCommitMessageFooter(org.eclipse.egit.ui.internal.dialogs.SpellcheckableMessageAreaTest)  Time elapsed: 0 s
21:21:11 lineAfterWrappedLineShouldBeJoinedAndFollowingLineWrappedCorrectly(org.eclipse.egit.ui.internal.dialogs.SpellcheckableMessageAreaTest)  Time elapsed: 0 s
21:21:11 wrapOverlengthText(org.eclipse.egit.ui.internal.dialogs.SpellcheckableMessageAreaTest)  Time elapsed: 0 s
21:21:11 dontWrapWordLongerThanOneLineAndKeepSpaceAtFront(org.eclipse.egit.ui.internal.dialogs.SpellcheckableMessageAreaTest)  Time elapsed: 0 s
21:21:11 wrapSecondLongLine(org.eclipse.egit.ui.internal.dialogs.SpellcheckableMessageAreaTest)  Time elapsed: 0 s
21:21:11 wrapOverlengthTextByOne(org.eclipse.egit.ui.internal.dialogs.SpellcheckableMessageAreaTest)  Time elapsed: 0 s
21:21:11 keepNewlineAtEnd(org.eclipse.egit.ui.internal.dialogs.SpellcheckableMessageAreaTest)  Time elapsed: 0 s
21:21:11 Running org.eclipse.egit.ui.internal.synchronize.model.GitModelRootTest
21:21:13 Tests run: 1, Failures: 0, Errors: 0, Skipped: 0, Time elapsed: 1.334 s - in org.eclipse.egit.ui.internal.synchronize.model.GitModelRootTest
21:21:13 shouldIgnoreEmptyRepositories(org.eclipse.egit.ui.internal.synchronize.model.GitModelRootTest)  Time elapsed: 1.325 s
21:21:13 Running org.eclipse.egit.ui.internal.synchronize.model.GitModelCommitTest
21:21:17 Tests run: 7, Failures: 0, Errors: 0, Skipped: 0, Time elapsed: 4.613 s - in org.eclipse.egit.ui.internal.synchronize.model.GitModelCommitTest
21:21:17 shouldReturnNotEqualForDifferentCommits(org.eclipse.egit.ui.internal.synchronize.model.GitModelCommitTest)  Time elapsed: 0.592 s
21:21:17 shouldReturnNotEqualWhenCommitTreeAndBlob(org.eclipse.egit.ui.internal.synchronize.model.GitModelCommitTest)  Time elapsed: 0.578 s
21:21:17 shouldReturnNotEqualWhenCommitTreeAndTree(org.eclipse.egit.ui.internal.synchronize.model.GitModelCommitTest)  Time elapsed: 0.577 s
21:21:17 shouldReturnNotEqualWhenCommitTreeAndCache(org.eclipse.egit.ui.internal.synchronize.model.GitModelCommitTest)  Time elapsed: 0.592 s
21:21:17 shouldReturnEqualForSameInstance(org.eclipse.egit.ui.internal.synchronize.model.GitModelCommitTest)  Time elapsed: 0.537 s
21:21:17 shouldReturnNotEqualForDifferentParents(org.eclipse.egit.ui.internal.synchronize.model.GitModelCommitTest)  Time elapsed: 1.188 s
21:21:17 shouldReturnEqualForSameCommits(org.eclipse.egit.ui.internal.synchronize.model.GitModelCommitTest)  Time elapsed: 0.529 s
21:21:17 Running org.eclipse.egit.ui.internal.synchronize.model.GitModelBlobTest
21:21:25 Tests run: 15, Failures: 0, Errors: 0, Skipped: 2, Time elapsed: 7.176 s - in org.eclipse.egit.ui.internal.synchronize.model.GitModelBlobTest
21:21:25 shouldReturnEqualSameData1(org.eclipse.egit.ui.internal.synchronize.model.GitModelBlobTest) skipped
21:21:25 shouldReturnNotEqualForDifferentLocation(org.eclipse.egit.ui.internal.synchronize.model.GitModelBlobTest)  Time elapsed: 0.556 s
21:21:25 shouldReturnNotEqualForBlobAndCommit(org.eclipse.egit.ui.internal.synchronize.model.GitModelBlobTest)  Time elapsed: 0.525 s
21:21:25 shouldReturnEqualForSameData(org.eclipse.egit.ui.internal.synchronize.model.GitModelBlobTest) skipped
21:21:25 shouldReturnNotEqualForDifferentFiles(org.eclipse.egit.ui.internal.synchronize.model.GitModelBlobTest)  Time elapsed: 0.534 s
21:21:25 shouldReturnNotEqualForBlobAndCacheFile(org.eclipse.egit.ui.internal.synchronize.model.GitModelBlobTest)  Time elapsed: 0.66 s
21:21:25 shouldReturnNotEqualForBlobAndTree(org.eclipse.egit.ui.internal.synchronize.model.GitModelBlobTest)  Time elapsed: 0.532 s
21:21:25 shouldBeSymmetric1(org.eclipse.egit.ui.internal.synchronize.model.GitModelBlobTest)  Time elapsed: 0.541 s
21:21:25 shouldBeSymmetric(org.eclipse.egit.ui.internal.synchronize.model.GitModelBlobTest)  Time elapsed: 0.535 s
21:21:25 shouldReturnEqualForSameInstance(org.eclipse.egit.ui.internal.synchronize.model.GitModelBlobTest)  Time elapsed: 0.526 s
21:21:25 shouldActAsResourceProvider(org.eclipse.egit.ui.internal.synchronize.model.GitModelBlobTest)  Time elapsed: 0.53 s
21:21:25 shouldReturnNotEqualForDifferentBaseObjectId2(org.eclipse.egit.ui.internal.synchronize.model.GitModelBlobTest)  Time elapsed: 0.527 s
21:21:25 shouldReturnNotEqualForDifferentBaseObjectId3(org.eclipse.egit.ui.internal.synchronize.model.GitModelBlobTest)  Time elapsed: 0.539 s
21:21:25 shouldReturnNotEqualForBlobAndWorkingFile(org.eclipse.egit.ui.internal.synchronize.model.GitModelBlobTest)  Time elapsed: 0.608 s
21:21:25 shouldReturnNotEqualForDifferentBaseObjectId(org.eclipse.egit.ui.internal.synchronize.model.GitModelBlobTest)  Time elapsed: 0.534 s
21:21:25 Running org.eclipse.egit.ui.internal.synchronize.model.GitModelTreeTest
21:21:28 Tests run: 6, Failures: 0, Errors: 0, Skipped: 0, Time elapsed: 3.278 s - in org.eclipse.egit.ui.internal.synchronize.model.GitModelTreeTest
21:21:28 shouldReturnNotEqualForDifferentLocation(org.eclipse.egit.ui.internal.synchronize.model.GitModelTreeTest)  Time elapsed: 0.528 s
21:21:28 shouldReturnNotEqualForTreeAndCacheTree(org.eclipse.egit.ui.internal.synchronize.model.GitModelTreeTest)  Time elapsed: 0.555 s
21:21:28 shouldReturnNotEqualForTreeAndCommit(org.eclipse.egit.ui.internal.synchronize.model.GitModelTreeTest)  Time elapsed: 0.554 s
21:21:28 shouldReturnEqualForSameBaseCommit(org.eclipse.egit.ui.internal.synchronize.model.GitModelTreeTest)  Time elapsed: 0.568 s
21:21:28 shouldReturnEqualForSameInstance(org.eclipse.egit.ui.internal.synchronize.model.GitModelTreeTest)  Time elapsed: 0.526 s
21:21:28 shouldReturnNotEqualForTreeAndBlob(org.eclipse.egit.ui.internal.synchronize.model.GitModelTreeTest)  Time elapsed: 0.532 s
21:21:28 Running org.eclipse.egit.ui.internal.synchronize.model.GitModelCacheFileTest
21:21:31 Tests run: 7, Failures: 0, Errors: 0, Skipped: 2, Time elapsed: 2.908 s - in org.eclipse.egit.ui.internal.synchronize.model.GitModelCacheFileTest
21:21:31 shouldReturnEqualForSameObjectIdsAndLocation(org.eclipse.egit.ui.internal.synchronize.model.GitModelCacheFileTest)  Time elapsed: 0.624 s
21:21:31 shouldReturnNotEqualWhenComparingCacheFileAndBlob(org.eclipse.egit.ui.internal.synchronize.model.GitModelCacheFileTest)  Time elapsed: 0.546 s
21:21:31 shouldReturnNotEqualForDifferentCacheIds(org.eclipse.egit.ui.internal.synchronize.model.GitModelCacheFileTest) skipped
21:21:31 shouldReturnEqualForSameInstance(org.eclipse.egit.ui.internal.synchronize.model.GitModelCacheFileTest)  Time elapsed: 0.625 s
21:21:31 shouldReturnNotEqualWhenComparingCacheFileAndWorkingFile(org.eclipse.egit.ui.internal.synchronize.model.GitModelCacheFileTest)  Time elapsed: 0.573 s
21:21:31 shouldReturnNotEqualForDifferentBaseIds(org.eclipse.egit.ui.internal.synchronize.model.GitModelCacheFileTest)  Time elapsed: 0.528 s
21:21:31 shouldReturnNotEqualForDifferentLocations(org.eclipse.egit.ui.internal.synchronize.model.GitModelCacheFileTest) skipped
21:21:31 Running org.eclipse.egit.ui.internal.synchronize.model.GitModelCacheTreeTest
21:21:33 Tests run: 4, Failures: 0, Errors: 0, Skipped: 0, Time elapsed: 2.174 s - in org.eclipse.egit.ui.internal.synchronize.model.GitModelCacheTreeTest
21:21:33 shouldReturnEqualForSameData(org.eclipse.egit.ui.internal.synchronize.model.GitModelCacheTreeTest)  Time elapsed: 0.534 s
21:21:33 shouldReturnNotEqualForDifferetnLocation(org.eclipse.egit.ui.internal.synchronize.model.GitModelCacheTreeTest)  Time elapsed: 0.527 s
21:21:33 shouldReturnEqualForSameInstance(org.eclipse.egit.ui.internal.synchronize.model.GitModelCacheTreeTest)  Time elapsed: 0.533 s
21:21:33 shouldReturnNotEqualWhenComparingCacheTreeAndTree(org.eclipse.egit.ui.internal.synchronize.model.GitModelCacheTreeTest)  Time elapsed: 0.569 s
21:21:33 Running org.eclipse.egit.ui.internal.synchronize.model.GitModelRepositoryTest
21:21:35 Tests run: 3, Failures: 0, Errors: 0, Skipped: 0, Time elapsed: 1.969 s - in org.eclipse.egit.ui.internal.synchronize.model.GitModelRepositoryTest
21:21:35 shouldReturnEqual(org.eclipse.egit.ui.internal.synchronize.model.GitModelRepositoryTest)  Time elapsed: 0.653 s
21:21:35 shouldReturnNotEqual(org.eclipse.egit.ui.internal.synchronize.model.GitModelRepositoryTest)  Time elapsed: 0.671 s
21:21:35 shouldReturnEqualForSameInstance(org.eclipse.egit.ui.internal.synchronize.model.GitModelRepositoryTest)  Time elapsed: 0.633 s
21:21:35 Running org.eclipse.egit.ui.internal.synchronize.model.GitModelWorkingTreeTest
21:21:36 Tests run: 2, Failures: 0, Errors: 0, Skipped: 0, Time elapsed: 1.07 s - in org.eclipse.egit.ui.internal.synchronize.model.GitModelWorkingTreeTest
21:21:36 shouldReturnNotEqualsWhenComparingWorkingTreeAndCache(org.eclipse.egit.ui.internal.synchronize.model.GitModelWorkingTreeTest)  Time elapsed: 0.537 s
21:21:36 shouldReturnEqualsForTheSameInstance(org.eclipse.egit.ui.internal.synchronize.model.GitModelWorkingTreeTest)  Time elapsed: 0.527 s
21:21:36 Running org.eclipse.egit.ui.internal.synchronize.model.GitModelWorkingFileTest
21:21:39 Tests run: 5, Failures: 0, Errors: 0, Skipped: 0, Time elapsed: 2.704 s - in org.eclipse.egit.ui.internal.synchronize.model.GitModelWorkingFileTest
21:21:39 shouldReturnNotEqualForDifferentLocation(org.eclipse.egit.ui.internal.synchronize.model.GitModelWorkingFileTest)  Time elapsed: 0.528 s
21:21:39 shouldReturnNotEqualWhenComparingWorkingFileAndCacheFile(org.eclipse.egit.ui.internal.synchronize.model.GitModelWorkingFileTest)  Time elapsed: 0.527 s
21:21:39 shouldReturnEqualForSameInstance(org.eclipse.egit.ui.internal.synchronize.model.GitModelWorkingFileTest)  Time elapsed: 0.523 s
21:21:39 shouldReturnNotEqualWhenComparingWorkingFileAndBlob(org.eclipse.egit.ui.internal.synchronize.model.GitModelWorkingFileTest)  Time elapsed: 0.587 s
21:21:39 shouldReturnEqualForSameLocation(org.eclipse.egit.ui.internal.synchronize.model.GitModelWorkingFileTest)  Time elapsed: 0.527 s
21:21:39 Running org.eclipse.egit.ui.internal.synchronize.model.GitModelCacheTest
21:21:43 Tests run: 6, Failures: 0, Errors: 0, Skipped: 0, Time elapsed: 4.046 s - in org.eclipse.egit.ui.internal.synchronize.model.GitModelCacheTest
21:21:43 shouldReturnChildren(org.eclipse.egit.ui.internal.synchronize.model.GitModelCacheTest)  Time elapsed: 0.623 s
21:21:43 shouldReturnNotEqualWhenCacheTreeAndCommit(org.eclipse.egit.ui.internal.synchronize.model.GitModelCacheTest)  Time elapsed: 0.527 s
21:21:43 shouldReturnEqualForSameInstance(org.eclipse.egit.ui.internal.synchronize.model.GitModelCacheTest)  Time elapsed: 0.524 s
21:21:43 shouldReturnEqualForSameCommits(org.eclipse.egit.ui.internal.synchronize.model.GitModelCacheTest)  Time elapsed: 0.622 s
21:21:43 shouldReturnNotEqualWhenComparingCacheAndWorkingTree(org.eclipse.egit.ui.internal.synchronize.model.GitModelCacheTest)  Time elapsed: 0.622 s
21:21:43 shouldReturnNotEqualForDifferentRepositories(org.eclipse.egit.ui.internal.synchronize.model.GitModelCacheTest)  Time elapsed: 1.111 s
21:21:43 Running org.eclipse.egit.ui.internal.synchronize.mapping.GitChangeSetSorterTest
21:21:43 Tests run: 23, Failures: 0, Errors: 0, Skipped: 0, Time elapsed: 0.389 s - in org.eclipse.egit.ui.internal.synchronize.mapping.GitChangeSetSorterTest
21:21:43 commitTreeShouldBeLessThanBlob(org.eclipse.egit.ui.internal.synchronize.mapping.GitChangeSetSorterTest)  Time elapsed: 0.029 s
21:21:43 commitTreeShouldBeLessThanTree(org.eclipse.egit.ui.internal.synchronize.mapping.GitChangeSetSorterTest)  Time elapsed: 0 s
21:21:43 blobShouldBeGreaterThanTree(org.eclipse.egit.ui.internal.synchronize.mapping.GitChangeSetSorterTest)  Time elapsed: 0 s
21:21:43 cacheTreeShouldBeLessThanCommit(org.eclipse.egit.ui.internal.synchronize.mapping.GitChangeSetSorterTest)  Time elapsed: 0 s
21:21:43 shouldOrderTreesAlphabetically(org.eclipse.egit.ui.internal.synchronize.mapping.GitChangeSetSorterTest)  Time elapsed: 0.356 s
21:21:43 commitTreeShouldBeGreaterThanCache(org.eclipse.egit.ui.internal.synchronize.mapping.GitChangeSetSorterTest)  Time elapsed: 0 s
21:21:43 blobShouldBeGreaterThanWorkingTree(org.eclipse.egit.ui.internal.synchronize.mapping.GitChangeSetSorterTest)  Time elapsed: 0 s
21:21:43 treeShouldBeGreaterThanCache(org.eclipse.egit.ui.internal.synchronize.mapping.GitChangeSetSorterTest)  Time elapsed: 0 s
21:21:43 treeShouldBeGreaterThanCommit(org.eclipse.egit.ui.internal.synchronize.mapping.GitChangeSetSorterTest)  Time elapsed: 0 s
21:21:43 workingTreeShouldBeLessThanCacheTree(org.eclipse.egit.ui.internal.synchronize.mapping.GitChangeSetSorterTest)  Time elapsed: 0 s
21:21:43 treeShouldBeGreaterThanWorkingTree(org.eclipse.egit.ui.internal.synchronize.mapping.GitChangeSetSorterTest)  Time elapsed: 0.001 s
21:21:43 blobShouldBeGreaterThanCache(org.eclipse.egit.ui.internal.synchronize.mapping.GitChangeSetSorterTest)  Time elapsed: 0 s
21:21:43 cacheTreeShouldBeLessThanBlob(org.eclipse.egit.ui.internal.synchronize.mapping.GitChangeSetSorterTest)  Time elapsed: 0 s
21:21:43 cacheTreeShouldBeLessThanTree(org.eclipse.egit.ui.internal.synchronize.mapping.GitChangeSetSorterTest)  Time elapsed: 0 s
21:21:43 shouldOrderBlobsAlphabetically(org.eclipse.egit.ui.internal.synchronize.mapping.GitChangeSetSorterTest)  Time elapsed: 0 s
21:21:43 commitTreeShouldBeGreaterThanWorkingTree(org.eclipse.egit.ui.internal.synchronize.mapping.GitChangeSetSorterTest)  Time elapsed: 0 s
21:21:43 treeShouldBeLessThanBlob(org.eclipse.egit.ui.internal.synchronize.mapping.GitChangeSetSorterTest)  Time elapsed: 0 s
21:21:43 cacheTreeShouldBeGreaterThanWorkingTree(org.eclipse.egit.ui.internal.synchronize.mapping.GitChangeSetSorterTest)  Time elapsed: 0 s
21:21:43 workingTreeShouldBeLessThanBlob(org.eclipse.egit.ui.internal.synchronize.mapping.GitChangeSetSorterTest)  Time elapsed: 0 s
21:21:43 workingTreeShouldBeLessThanTree(org.eclipse.egit.ui.internal.synchronize.mapping.GitChangeSetSorterTest)  Time elapsed: 0 s
21:21:43 shouldOrderCommitsByCommitDate(org.eclipse.egit.ui.internal.synchronize.mapping.GitChangeSetSorterTest)  Time elapsed: 0.001 s
21:21:43 workingTreeShouldBeLessThanCommit(org.eclipse.egit.ui.internal.synchronize.mapping.GitChangeSetSorterTest)  Time elapsed: 0 s
21:21:43 blobShouldBeGreaterThanCommit(org.eclipse.egit.ui.internal.synchronize.mapping.GitChangeSetSorterTest)  Time elapsed: 0 s
21:21:43 Running org.eclipse.egit.ui.internal.decorators.DecoratableWorkingSetTest
21:21:50 Tests run: 7, Failures: 0, Errors: 0, Skipped: 0, Time elapsed: 7.245 s - in org.eclipse.egit.ui.internal.decorators.DecoratableWorkingSetTest
21:21:50 testAnyConflictsIsConflicts(org.eclipse.egit.ui.internal.decorators.DecoratableWorkingSetTest)  Time elapsed: 1.171 s
21:21:50 testUntrackedContentIsUndecorated(org.eclipse.egit.ui.internal.decorators.DecoratableWorkingSetTest)  Time elapsed: 0.718 s
21:21:50 testAnyDirtyIsDirty(org.eclipse.egit.ui.internal.decorators.DecoratableWorkingSetTest)  Time elapsed: 1.361 s
21:21:50 testDecorationConflictingOverDirty(org.eclipse.egit.ui.internal.decorators.DecoratableWorkingSetTest)  Time elapsed: 1.178 s
21:21:50 testEmptyWorkingSetIsUndecorated(org.eclipse.egit.ui.internal.decorators.DecoratableWorkingSetTest)  Time elapsed: 0.702 s
21:21:50 testStagingStateHasNoInfluence_Modified(org.eclipse.egit.ui.internal.decorators.DecoratableWorkingSetTest)  Time elapsed: 0.733 s
21:21:50 testAnyTrackedIsTracked(org.eclipse.egit.ui.internal.decorators.DecoratableWorkingSetTest)  Time elapsed: 1.34 s
21:21:50 Running org.eclipse.egit.ui.internal.decorators.DecoratableResourceMappingTest
21:21:58 Tests run: 9, Failures: 0, Errors: 0, Skipped: 0, Time elapsed: 7.224 s - in org.eclipse.egit.ui.internal.decorators.DecoratableResourceMappingTest
21:21:58 testAnyConflictsIsConflicts(org.eclipse.egit.ui.internal.decorators.DecoratableResourceMappingTest)  Time elapsed: 0.943 s
21:21:58 testSameStagingStateIsState_Added(org.eclipse.egit.ui.internal.decorators.DecoratableResourceMappingTest)  Time elapsed: 0.731 s
21:21:58 testAnyDirtyIsDirty(org.eclipse.egit.ui.internal.decorators.DecoratableResourceMappingTest)  Time elapsed: 0.733 s
21:21:58 testMixedStagingStateIsModified_RemovedAdded(org.eclipse.egit.ui.internal.decorators.DecoratableResourceMappingTest)  Time elapsed: 0.738 s
21:21:58 testAllIgnoredIsUnstaged(org.eclipse.egit.ui.internal.decorators.DecoratableResourceMappingTest)  Time elapsed: 0.75 s
21:21:58 testDecorationConflictingOverDirty(org.eclipse.egit.ui.internal.decorators.DecoratableResourceMappingTest)  Time elapsed: 0.92 s
21:21:58 testMixedStagingStateIsModified_AddedNotStaged(org.eclipse.egit.ui.internal.decorators.DecoratableResourceMappingTest)  Time elapsed: 0.731 s
21:21:58 testNewResourceMappingIsUnstaged(org.eclipse.egit.ui.internal.decorators.DecoratableResourceMappingTest)  Time elapsed: 0.841 s
21:21:58 testAnyTrackedIsTracked(org.eclipse.egit.ui.internal.decorators.DecoratableResourceMappingTest)  Time elapsed: 0.795 s
21:21:58 Running org.eclipse.egit.ui.internal.decorators.DecoratableResourceAdapterTest
21:22:09 Tests run: 13, Failures: 0, Errors: 0, Skipped: 0, Time elapsed: 10.882 s - in org.eclipse.egit.ui.internal.decorators.DecoratableResourceAdapterTest
21:22:09 testDecorationDeletedFile(org.eclipse.egit.ui.internal.decorators.DecoratableResourceAdapterTest)  Time elapsed: 1.029 s
21:22:09 testDecorationModifiedFile(org.eclipse.egit.ui.internal.decorators.DecoratableResourceAdapterTest)  Time elapsed: 0.747 s
21:22:09 testDecorationEmptyProject(org.eclipse.egit.ui.internal.decorators.DecoratableResourceAdapterTest)  Time elapsed: 0.782 s
21:22:09 testDecorationConflictingFile(org.eclipse.egit.ui.internal.decorators.DecoratableResourceAdapterTest)  Time elapsed: 1.579 s
21:22:09 testDecorationNewEmptyFolder(org.eclipse.egit.ui.internal.decorators.DecoratableResourceAdapterTest)  Time elapsed: 0.755 s
21:22:09 testDecorationFolderPrefixOfOtherFolder(org.eclipse.egit.ui.internal.decorators.DecoratableResourceAdapterTest)  Time elapsed: 0.726 s
21:22:09 testDecorationNewFileInOneSubfolder(org.eclipse.egit.ui.internal.decorators.DecoratableResourceAdapterTest)  Time elapsed: 0.829 s
21:22:09 testDecorationNewFile(org.eclipse.egit.ui.internal.decorators.DecoratableResourceAdapterTest)  Time elapsed: 0.738 s
21:22:09 testDecorationNewFileInSubfolder(org.eclipse.egit.ui.internal.decorators.DecoratableResourceAdapterTest)  Time elapsed: 0.739 s
21:22:09 testDecorationCommittedFile(org.eclipse.egit.ui.internal.decorators.DecoratableResourceAdapterTest)  Time elapsed: 0.741 s
21:22:09 testDecorationFileInIgnoredFolder(org.eclipse.egit.ui.internal.decorators.DecoratableResourceAdapterTest)  Time elapsed: 0.728 s
21:22:09 testDecorationIgnoredFile(org.eclipse.egit.ui.internal.decorators.DecoratableResourceAdapterTest)  Time elapsed: 0.727 s
21:22:09 testDecorationAddedFile(org.eclipse.egit.ui.internal.decorators.DecoratableResourceAdapterTest)  Time elapsed: 0.729 s
21:22:09 Running org.eclipse.egit.ui.internal.push.PushToUpstreamTest
21:22:11 Tests run: 3, Failures: 0, Errors: 0, Skipped: 0, Time elapsed: 2.871 s - in org.eclipse.egit.ui.internal.push.PushToUpstreamTest
21:22:11 pushWithExistingUpstreamConfiguration(org.eclipse.egit.ui.internal.push.PushToUpstreamTest)  Time elapsed: 1.182 s
21:22:11 pushWithoutConfig(org.eclipse.egit.ui.internal.push.PushToUpstreamTest)  Time elapsed: 0.789 s
21:22:11 pushWithDefaultRemoteWithPushRefSpecs(org.eclipse.egit.ui.internal.push.PushToUpstreamTest)  Time elapsed: 0.891 s
21:22:11 Running org.eclipse.egit.ui.internal.push.PushBranchWizardTest
21:22:12 
21:22:12 (SWT:1471): Gtk-CRITICAL **: 01:22:12.744: gtk_box_gadget_distribute: assertion 'size >= 0' failed in GtkScrollbar
21:22:12 
21:22:12 (SWT:1471): Gtk-CRITICAL **: 01:22:12.745: gtk_box_gadget_distribute: assertion 'size >= 0' failed in GtkScrollbar
21:22:12 
21:22:12 (SWT:1471): Gtk-CRITICAL **: 01:22:12.747: gtk_box_gadget_distribute: assertion 'size >= 0' failed in GtkScrollbar
21:22:12 
21:22:12 (SWT:1471): Gtk-CRITICAL **: 01:22:12.750: gtk_box_gadget_distribute: assertion 'size >= 0' failed in GtkScrollbar
21:22:21 Tests run: 9, Failures: 0, Errors: 0, Skipped: 0, Time elapsed: 9.892 s - in org.eclipse.egit.ui.internal.push.PushBranchWizardTest
21:22:21 pushHeadToExistingRemote(org.eclipse.egit.ui.internal.push.PushBranchWizardTest)  Time elapsed: 1.087 s
21:22:21 pushWithRemoteUpstreamConfiguration(org.eclipse.egit.ui.internal.push.PushBranchWizardTest)  Time elapsed: 1.08 s
21:22:21 pushWithDifferentBranchName(org.eclipse.egit.ui.internal.push.PushBranchWizardTest)  Time elapsed: 1.068 s
21:22:21 pushToExistingRemoteAndSetRebase(org.eclipse.egit.ui.internal.push.PushBranchWizardTest)  Time elapsed: 1.078 s
21:22:21 pushToNewRemote(org.eclipse.egit.ui.internal.push.PushBranchWizardTest)  Time elapsed: 1.251 s
21:22:21 pushToExistingRemoteWithoutConfiguringUpstream(org.eclipse.egit.ui.internal.push.PushBranchWizardTest)  Time elapsed: 1.102 s
21:22:21 pushToExistingRemote(org.eclipse.egit.ui.internal.push.PushBranchWizardTest)  Time elapsed: 1.057 s
21:22:21 pushWhenNoRemoteExistsYet(org.eclipse.egit.ui.internal.push.PushBranchWizardTest)  Time elapsed: 1.129 s
21:22:21 pushWithLocalUpstreamConfiguration(org.eclipse.egit.ui.internal.push.PushBranchWizardTest)  Time elapsed: 1.012 s
21:22:21 Running org.eclipse.egit.ui.internal.push.PushTagsWizardTest
21:22:22 Tests run: 1, Failures: 0, Errors: 0, Skipped: 0, Time elapsed: 1.156 s - in org.eclipse.egit.ui.internal.push.PushTagsWizardTest
21:22:22 pushTag(org.eclipse.egit.ui.internal.push.PushTagsWizardTest)  Time elapsed: 1.151 s
21:22:22 Running org.eclipse.egit.ui.internal.branch.BranchProjectTrackerTest
21:22:23 Tests run: 1, Failures: 0, Errors: 0, Skipped: 0, Time elapsed: 0.998 s - in org.eclipse.egit.ui.internal.branch.BranchProjectTrackerTest
21:22:23 twoProjectsWithOnlyOneOnBranch(org.eclipse.egit.ui.internal.branch.BranchProjectTrackerTest)  Time elapsed: 0.995 s
21:22:23 Running org.eclipse.egit.ui.internal.actions.StashesMenuTest
21:22:25 
21:22:25 (SWT:1471): Gtk-WARNING **: 01:22:25.373: Negative content width -6 (allocation 1, extents 4x3) while allocating gadget (node toolbar, owner GtkToolbar)
21:22:25 
21:22:25 (SWT:1471): Gtk-WARNING **: 01:22:25.373: Negative content height -3 (allocation 1, extents 2x2) while allocating gadget (node toolbar, owner GtkToolbar)
21:22:25 
21:22:25 (SWT:1471): Gtk-WARNING **: 01:22:25.373: Negative content width -6 (allocation 1, extents 4x3) while allocating gadget (node toolbar, owner GtkToolbar)
21:22:25 
21:22:25 (SWT:1471): Gtk-WARNING **: 01:22:25.373: Negative content height -3 (allocation 1, extents 2x2) while allocating gadget (node toolbar, owner GtkToolbar)
21:22:25 
21:22:25 (SWT:1471): Gtk-WARNING **: 01:22:25.454: Negative content width -6 (allocation 1, extents 4x3) while allocating gadget (node toolbar, owner GtkToolbar)
21:22:25 
21:22:25 (SWT:1471): Gtk-WARNING **: 01:22:25.470: Negative content width -6 (allocation 1, extents 4x3) while allocating gadget (node toolbar, owner GtkToolbar)
21:22:25 Tests run: 2, Failures: 0, Errors: 0, Skipped: 0, Time elapsed: 1.787 s - in org.eclipse.egit.ui.internal.actions.StashesMenuTest
21:22:25 menuWithoutStashes(org.eclipse.egit.ui.internal.actions.StashesMenuTest)  Time elapsed: 0.659 s
21:22:25 stashAndApplyChanges(org.eclipse.egit.ui.internal.actions.StashesMenuTest)  Time elapsed: 1.119 s
21:22:25 Running org.eclipse.egit.ui.internal.actions.LinkedResourcesTest
21:22:26 Tests run: 2, Failures: 0, Errors: 0, Skipped: 0, Time elapsed: 1.092 s - in org.eclipse.egit.ui.internal.actions.LinkedResourcesTest
21:22:26 testSomeActionsWithoutLinkedResources(org.eclipse.egit.ui.internal.actions.LinkedResourcesTest)  Time elapsed: 0.539 s
21:22:26 testNoActionOnLinkedResources(org.eclipse.egit.ui.internal.actions.LinkedResourcesTest)  Time elapsed: 0.547 s
21:22:26 Running org.eclipse.egit.ui.internal.actions.SwitchToMenuTest
21:22:35 Tests run: 8, Failures: 0, Errors: 0, Skipped: 0, Time elapsed: 8.662 s - in org.eclipse.egit.ui.internal.actions.SwitchToMenuTest
21:22:35 multipleSelectionWithMultipleRepositoriesAndNoCommonBranches(org.eclipse.egit.ui.internal.actions.SwitchToMenuTest)  Time elapsed: 0.844 s
21:22:35 selectionWithProj1(org.eclipse.egit.ui.internal.actions.SwitchToMenuTest)  Time elapsed: 0.552 s
21:22:35 selectionNotAdaptableToRepository(org.eclipse.egit.ui.internal.actions.SwitchToMenuTest)  Time elapsed: 0.063 s
21:22:35 selectionWithProj1AndReflog(org.eclipse.egit.ui.internal.actions.SwitchToMenuTest)  Time elapsed: 0.719 s
21:22:35 validateMenuEntriesForMultiSelectionWithMultipleRepositories(org.eclipse.egit.ui.internal.actions.SwitchToMenuTest)  Time elapsed: 2.958 s
21:22:35 validateBranchSwitchingForForMultiSelectionWithMultipleRepositories(org.eclipse.egit.ui.internal.actions.SwitchToMenuTest)  Time elapsed: 1.854 s
21:22:35 selectionWithRepositoryHavingOver20Branches(org.eclipse.egit.ui.internal.actions.SwitchToMenuTest)  Time elapsed: 1.587 s
21:22:35 emptySelection(org.eclipse.egit.ui.internal.actions.SwitchToMenuTest)  Time elapsed: 0.061 s
21:22:35 Running org.eclipse.egit.ui.internal.fetch.FetchGerritChangeTest
21:22:35 Tests run: 15, Failures: 0, Errors: 0, Skipped: 0, Time elapsed: 0.009 s - in org.eclipse.egit.ui.internal.fetch.FetchGerritChangeTest
21:22:35 testChangeStringNoDigits(org.eclipse.egit.ui.internal.fetch.FetchGerritChangeTest)  Time elapsed: 0.006 s
21:22:35 testChangeStringOverflow(org.eclipse.egit.ui.internal.fetch.FetchGerritChangeTest)  Time elapsed: 0 s
21:22:35 testChangeStringTwoNumbers(org.eclipse.egit.ui.internal.fetch.FetchGerritChangeTest)  Time elapsed: 0.001 s
21:22:35 testFromRef(org.eclipse.egit.ui.internal.fetch.FetchGerritChangeTest)  Time elapsed: 0 s
21:22:35 testChangeStringNegative(org.eclipse.egit.ui.internal.fetch.FetchGerritChangeTest)  Time elapsed: 0 s
21:22:35 testChangeStringUri(org.eclipse.egit.ui.internal.fetch.FetchGerritChangeTest)  Time elapsed: 0.001 s
21:22:35 testRefFromChange(org.eclipse.egit.ui.internal.fetch.FetchGerritChangeTest)  Time elapsed: 0 s
21:22:35 testChangeStringUriNonsense(org.eclipse.egit.ui.internal.fetch.FetchGerritChangeTest)  Time elapsed: 0 s
21:22:35 testChangeStringThreeNumbers(org.eclipse.egit.ui.internal.fetch.FetchGerritChangeTest)  Time elapsed: 0 s
21:22:35 testChangeStringMultiline(org.eclipse.egit.ui.internal.fetch.FetchGerritChangeTest)  Time elapsed: 0 s
21:22:35 testChangeStringSingleNumber(org.eclipse.egit.ui.internal.fetch.FetchGerritChangeTest)  Time elapsed: 0 s
21:22:35 testChangeRefs(org.eclipse.egit.ui.internal.fetch.FetchGerritChangeTest)  Time elapsed: 0 s
21:22:35 testChangeStringEmpty(org.eclipse.egit.ui.internal.fetch.FetchGerritChangeTest)  Time elapsed: 0 s
21:22:35 testChangeStringNull(org.eclipse.egit.ui.internal.fetch.FetchGerritChangeTest)  Time elapsed: 0 s
21:22:35 testChangeStringZero(org.eclipse.egit.ui.internal.fetch.FetchGerritChangeTest)  Time elapsed: 0 s
21:22:35 Running org.eclipse.egit.ui.internal.submodules.SubmoduleFolderTest
21:22:36 
21:22:36 (SWT:1471): Gtk-WARNING **: 01:22:36.853: Negative content width -6 (allocation 1, extents 4x3) while allocating gadget (node toolbar, owner GtkToolbar)
21:22:36 
21:22:36 (SWT:1471): Gtk-WARNING **: 01:22:36.853: Negative content height -3 (allocation 1, extents 2x2) while allocating gadget (node toolbar, owner GtkToolbar)
21:22:36 
21:22:36 (SWT:1471): Gtk-WARNING **: 01:22:36.853: Negative content width -6 (allocation 1, extents 4x3) while allocating gadget (node toolbar, owner GtkToolbar)
21:22:36 
21:22:36 (SWT:1471): Gtk-WARNING **: 01:22:36.853: Negative content height -3 (allocation 1, extents 2x2) while allocating gadget (node toolbar, owner GtkToolbar)
21:22:37 
21:22:37 (SWT:1471): Gtk-WARNING **: 01:22:37.172: Negative content width -6 (allocation 1, extents 4x3) while allocating gadget (node toolbar, owner GtkToolbar)
21:22:37 
21:22:37 (SWT:1471): Gtk-WARNING **: 01:22:37.176: Negative content width -6 (allocation 1, extents 4x3) while allocating gadget (node toolbar, owner GtkToolbar)
21:22:37 
21:22:37 (SWT:1471): Gtk-WARNING **: 01:22:37.181: Negative content width -6 (allocation 1, extents 4x3) while allocating gadget (node toolbar, owner GtkToolbar)
21:22:37 
21:22:37 (SWT:1471): Gtk-WARNING **: 01:22:37.188: Negative content width -6 (allocation 1, extents 4x3) while allocating gadget (node toolbar, owner GtkToolbar)
21:22:37 
21:22:37 (SWT:1471): Gtk-WARNING **: 01:22:37.210: Negative content width -6 (allocation 1, extents 4x3) while allocating gadget (node toolbar, owner GtkToolbar)
21:22:37 
21:22:37 (SWT:1471): Gtk-WARNING **: 01:22:37.211: Negative content width -6 (allocation 1, extents 4x3) while allocating gadget (node toolbar, owner GtkToolbar)
21:22:37 
21:22:37 (SWT:1471): Gtk-WARNING **: 01:22:37.244: Negative content width -6 (allocation 1, extents 4x3) while allocating gadget (node toolbar, owner GtkToolbar)
21:22:37 
21:22:37 (SWT:1471): Gtk-WARNING **: 01:22:37.245: Negative content width -6 (allocation 1, extents 4x3) while allocating gadget (node toolbar, owner GtkToolbar)
21:22:44 
21:22:44 (SWT:1471): Gtk-WARNING **: 01:22:44.066: Negative content width -6 (allocation 1, extents 4x3) while allocating gadget (node toolbar, owner GtkToolbar)
21:22:44 
21:22:44 (SWT:1471): Gtk-WARNING **: 01:22:44.088: Negative content width -6 (allocation 1, extents 4x3) while allocating gadget (node toolbar, owner GtkToolbar)
21:22:44 
21:22:44 (SWT:1471): Gtk-WARNING **: 01:22:44.141: Negative content width -6 (allocation 1, extents 4x3) while allocating gadget (node toolbar, owner GtkToolbar)
21:22:44 
21:22:44 (SWT:1471): Gtk-WARNING **: 01:22:44.142: Negative content width -6 (allocation 1, extents 4x3) while allocating gadget (node toolbar, owner GtkToolbar)
21:22:44 
21:22:44 (SWT:1471): Gtk-CRITICAL **: 01:22:44.178: gtk_box_gadget_distribute: assertion 'size >= 0' failed in GtkScrollbar
21:22:44 
21:22:44 (SWT:1471): Gtk-CRITICAL **: 01:22:44.188: gtk_box_gadget_distribute: assertion 'size >= 0' failed in GtkScrollbar
21:22:44 
21:22:44 (SWT:1471): Gtk-CRITICAL **: 01:22:44.203: gtk_box_gadget_distribute: assertion 'size >= 0' failed in GtkScrollbar
21:22:44 
21:22:44 (SWT:1471): Gtk-CRITICAL **: 01:22:44.219: gtk_box_gadget_distribute: assertion 'size >= 0' failed in GtkScrollbar
21:22:44 
21:22:44 (SWT:1471): Gtk-CRITICAL **: 01:22:44.235: gtk_box_gadget_distribute: assertion 'size >= 0' failed in GtkScrollbar
21:22:44 
21:22:44 (SWT:1471): Gtk-CRITICAL **: 01:22:44.253: gtk_box_gadget_distribute: assertion 'size >= 0' failed in GtkScrollbar
21:22:44 
21:22:44 (SWT:1471): Gtk-CRITICAL **: 01:22:44.270: gtk_box_gadget_distribute: assertion 'size >= 0' failed in GtkScrollbar
21:22:44 
21:22:44 (SWT:1471): Gtk-WARNING **: 01:22:44.280: Negative content width -6 (allocation 1, extents 4x3) while allocating gadget (node toolbar, owner GtkToolbar)
21:22:44 
21:22:44 (SWT:1471): Gtk-WARNING **: 01:22:44.296: Negative content width -6 (allocation 1, extents 4x3) while allocating gadget (node toolbar, owner GtkToolbar)
21:22:44 
21:22:44 (SWT:1471): Gtk-CRITICAL **: 01:22:44.315: gtk_box_gadget_distribute: assertion 'size >= 0' failed in GtkScrollbar
21:22:44 
21:22:44 (SWT:1471): Gtk-WARNING **: 01:22:44.339: Negative content width -6 (allocation 1, extents 4x3) while allocating gadget (node toolbar, owner GtkToolbar)
21:22:44 
21:22:44 (SWT:1471): Gtk-CRITICAL **: 01:22:44.343: gtk_box_gadget_distribute: assertion 'size >= 0' failed in GtkScrollbar
21:22:44 
21:22:44 (SWT:1471): Gtk-CRITICAL **: 01:22:44.344: gtk_box_gadget_distribute: assertion 'size >= 0' failed in GtkScrollbar
21:22:44 
21:22:44 (SWT:1471): Gtk-WARNING **: 01:22:44.384: Negative content width -6 (allocation 1, extents 4x3) while allocating gadget (node toolbar, owner GtkToolbar)
21:22:51 Tests run: 9, Failures: 0, Errors: 0, Skipped: 0, Time elapsed: 16.194 s - in org.eclipse.egit.ui.internal.submodules.SubmoduleFolderTest
21:22:51 compareWithHeadInSubmoduleFolder(org.eclipse.egit.ui.internal.submodules.SubmoduleFolderTest)  Time elapsed: 1.924 s
21:22:51 testStageUnstageInSubRepo(org.eclipse.egit.ui.internal.submodules.SubmoduleFolderTest)  Time elapsed: 3.208 s
21:22:51 testDecoration(org.eclipse.egit.ui.internal.submodules.SubmoduleFolderTest)  Time elapsed: 2.291 s
21:22:51 testHistoryFromProjectExplorerIsFromSubRepository(org.eclipse.egit.ui.internal.submodules.SubmoduleFolderTest)  Time elapsed: 1.523 s
21:22:51 testParentFolderMapsToParentRepo(org.eclipse.egit.ui.internal.submodules.SubmoduleFolderTest)  Time elapsed: 1.143 s
21:22:51 testDisconnect(org.eclipse.egit.ui.internal.submodules.SubmoduleFolderTest)  Time elapsed: 1.969 s
21:22:51 testRepoRemoval(org.eclipse.egit.ui.internal.submodules.SubmoduleFolderTest)  Time elapsed: 1.671 s
21:22:51 testChildProjectMapsToSubRepo(org.eclipse.egit.ui.internal.submodules.SubmoduleFolderTest)  Time elapsed: 1.257 s
21:22:51 testChildFolderMapsToSubRepo(org.eclipse.egit.ui.internal.submodules.SubmoduleFolderTest)  Time elapsed: 1.155 s
21:22:51 Running org.eclipse.egit.ui.internal.CommonUtilsTest
21:22:51 Tests run: 10, Failures: 0, Errors: 0, Skipped: 0, Time elapsed: 0.097 s - in org.eclipse.egit.ui.internal.CommonUtilsTest
21:22:51 sortingShouldWorkForBigNumbers(org.eclipse.egit.ui.internal.CommonUtilsTest)  Time elapsed: 0.001 s
21:22:51 sortingShouldWorkForMixedParts(org.eclipse.egit.ui.internal.CommonUtilsTest)  Time elapsed: 0 s
21:22:51 sortingShouldWorkForNumbers(org.eclipse.egit.ui.internal.CommonUtilsTest)  Time elapsed: 0 s
21:22:51 testFooterOffset(org.eclipse.egit.ui.internal.CommonUtilsTest)  Time elapsed: 0 s
21:22:51 sortingShouldWorkForEqualAndEmptyStrings(org.eclipse.egit.ui.internal.CommonUtilsTest)  Time elapsed: 0 s
21:22:51 sortingShouldIgnoreCase(org.eclipse.egit.ui.internal.CommonUtilsTest)  Time elapsed: 0 s
21:22:51 testFooterOffsetNoFooter(org.eclipse.egit.ui.internal.CommonUtilsTest)  Time elapsed: 0 s
21:22:51 sortingShouldIgnoreLeadingZeros(org.eclipse.egit.ui.internal.CommonUtilsTest)  Time elapsed: 0 s
21:22:51 testResourceCompare(org.eclipse.egit.ui.internal.CommonUtilsTest)  Time elapsed: 0.096 s
21:22:51 sortingShouldWorkForEasyStrings(org.eclipse.egit.ui.internal.CommonUtilsTest)  Time elapsed: 0 s
21:22:51 Running org.eclipse.egit.ui.internal.selection.SelectionUtilsTest
21:22:51 Tests run: 1, Failures: 0, Errors: 0, Skipped: 0, Time elapsed: 0.065 s - in org.eclipse.egit.ui.internal.selection.SelectionUtilsTest
21:22:51 getSelectedResourcesShouldUseAllTraversals(org.eclipse.egit.ui.internal.selection.SelectionUtilsTest)  Time elapsed: 0.065 s
21:22:51 Running org.eclipse.egit.ui.internal.selection.SelectionForViewsTest
21:22:53 
21:22:53 (SWT:1471): Gtk-WARNING **: 01:22:53.776: Negative content width -9 (allocation 9, extents 9x9) while allocating gadget (node entry, owner GtkEntry)
21:22:53 
21:22:53 (SWT:1471): Gtk-CRITICAL **: 01:22:53.815: gtk_box_gadget_distribute: assertion 'size >= 0' failed in GtkScrollbar
21:22:53 
21:22:53 (SWT:1471): Gtk-CRITICAL **: 01:22:53.828: gtk_box_gadget_distribute: assertion 'size >= 0' failed in GtkScrollbar
21:22:53 
21:22:53 (SWT:1471): Gtk-WARNING **: 01:22:53.833: Negative content width -6 (allocation 1, extents 4x3) while allocating gadget (node toolbar, owner GtkToolbar)
21:22:53 
21:22:53 (SWT:1471): Gtk-CRITICAL **: 01:22:53.844: gtk_box_gadget_distribute: assertion 'size >= 0' failed in GtkScrollbar
21:22:53 
21:22:53 (SWT:1471): Gtk-CRITICAL **: 01:22:53.851: gtk_box_gadget_distribute: assertion 'size >= 0' failed in GtkScrollbar
21:22:53 
21:22:53 (SWT:1471): Gtk-WARNING **: 01:22:53.881: Negative content width -6 (allocation 1, extents 4x3) while allocating gadget (node toolbar, owner GtkToolbar)
21:22:53 
21:22:53 (SWT:1471): Gtk-WARNING **: 01:22:53.919: Negative content width -6 (allocation 1, extents 4x3) while allocating gadget (node toolbar, owner GtkToolbar)
21:22:53 
21:22:53 (SWT:1471): Gtk-WARNING **: 01:22:53.957: Negative content width -6 (allocation 1, extents 4x3) while allocating gadget (node toolbar, owner GtkToolbar)
21:22:53 
21:22:53 (SWT:1471): Gtk-WARNING **: 01:22:53.962: Negative content width -6 (allocation 1, extents 4x3) while allocating gadget (node toolbar, owner GtkToolbar)
21:22:53 
21:22:53 (SWT:1471): Gtk-WARNING **: 01:22:53.971: Negative content width -6 (allocation 1, extents 4x3) while allocating gadget (node toolbar, owner GtkToolbar)
21:22:53 
21:22:53 (SWT:1471): Gtk-WARNING **: 01:22:53.971: Negative content width -6 (allocation 1, extents 4x3) while allocating gadget (node toolbar, owner GtkToolbar)
21:22:53 
21:22:53 (SWT:1471): Gtk-WARNING **: 01:22:53.992: Negative content width -6 (allocation 1, extents 4x3) while allocating gadget (node toolbar, owner GtkToolbar)
21:22:54 
21:22:54 (SWT:1471): Gtk-WARNING **: 01:22:54.063: Negative content width -6 (allocation 1, extents 4x3) while allocating gadget (node toolbar, owner GtkToolbar)
21:22:54 
21:22:54 (SWT:1471): Gtk-WARNING **: 01:22:54.111: Negative content width -6 (allocation 1, extents 4x3) while allocating gadget (node toolbar, owner GtkToolbar)
21:22:54 
21:22:54 (SWT:1471): Gtk-WARNING **: 01:22:54.152: Negative content width -6 (allocation 1, extents 4x3) while allocating gadget (node toolbar, owner GtkToolbar)
21:22:54 
21:22:54 (SWT:1471): Gtk-CRITICAL **: 01:22:54.197: gtk_box_gadget_distribute: assertion 'size >= 0' failed in GtkScrollbar
21:22:54 
21:22:54 (SWT:1471): Gtk-CRITICAL **: 01:22:54.216: gtk_box_gadget_distribute: assertion 'size >= 0' failed in GtkScrollbar
21:22:54 
21:22:54 (SWT:1471): Gtk-CRITICAL **: 01:22:54.233: gtk_box_gadget_distribute: assertion 'size >= 0' failed in GtkScrollbar
21:22:54 
21:22:54 (SWT:1471): Gtk-CRITICAL **: 01:22:54.250: gtk_box_gadget_distribute: assertion 'size >= 0' failed in GtkScrollbar
21:22:54 
21:22:54 (SWT:1471): Gtk-CRITICAL **: 01:22:54.267: gtk_box_gadget_distribute: assertion 'size >= 0' failed in GtkScrollbar
21:22:54 
21:22:54 (SWT:1471): Gtk-CRITICAL **: 01:22:54.283: gtk_box_gadget_distribute: assertion 'size >= 0' failed in GtkScrollbar
21:22:54 
21:22:54 (SWT:1471): Gtk-CRITICAL **: 01:22:54.299: gtk_box_gadget_distribute: assertion 'size >= 0' failed in GtkScrollbar
21:22:54 
21:22:54 (SWT:1471): Gtk-CRITICAL **: 01:22:54.317: gtk_box_gadget_distribute: assertion 'size >= 0' failed in GtkScrollbar
21:22:54 
21:22:54 (SWT:1471): Gtk-CRITICAL **: 01:22:54.333: gtk_box_gadget_distribute: assertion 'size >= 0' failed in GtkScrollbar
21:22:54 
21:22:54 (SWT:1471): Gtk-CRITICAL **: 01:22:54.350: gtk_box_gadget_distribute: assertion 'size >= 0' failed in GtkScrollbar
21:22:54 
21:22:54 (SWT:1471): Gtk-CRITICAL **: 01:22:54.366: gtk_box_gadget_distribute: assertion 'size >= 0' failed in GtkScrollbar
21:22:54 
21:22:54 (SWT:1471): Gtk-CRITICAL **: 01:22:54.383: gtk_box_gadget_distribute: assertion 'size >= 0' failed in GtkScrollbar
21:22:54 
21:22:54 (SWT:1471): Gtk-CRITICAL **: 01:22:54.400: gtk_box_gadget_distribute: assertion 'size >= 0' failed in GtkScrollbar
21:22:54 
21:22:54 (SWT:1471): Gtk-CRITICAL **: 01:22:54.416: gtk_box_gadget_distribute: assertion 'size >= 0' failed in GtkScrollbar
21:22:54 
21:22:54 (SWT:1471): Gtk-WARNING **: 01:22:54.531: Negative content width -6 (allocation 1, extents 4x3) while allocating gadget (node toolbar, owner GtkToolbar)
21:22:54 
21:22:54 (SWT:1471): Gtk-WARNING **: 01:22:54.544: Negative content width -6 (allocation 1, extents 4x3) while allocating gadget (node toolbar, owner GtkToolbar)
21:22:55 
21:22:55 (SWT:1471): Gtk-WARNING **: 01:22:55.809: Negative content width -6 (allocation 1, extents 4x3) while allocating gadget (node toolbar, owner GtkToolbar)
21:22:56 
21:22:56 (SWT:1471): Gtk-WARNING **: 01:22:56.019: Negative content width -6 (allocation 1, extents 4x3) while allocating gadget (node toolbar, owner GtkToolbar)
21:22:56 
21:22:56 (SWT:1471): Gtk-WARNING **: 01:22:56.554: Negative content width -6 (allocation 1, extents 4x3) while allocating gadget (node toolbar, owner GtkToolbar)
21:22:56 
21:22:56 (SWT:1471): Gtk-WARNING **: 01:22:56.764: Negative content width -6 (allocation 1, extents 4x3) while allocating gadget (node toolbar, owner GtkToolbar)
21:22:57 
21:22:57 (SWT:1471): Gtk-CRITICAL **: 01:22:57.299: gtk_box_gadget_distribute: assertion 'size >= 0' failed in GtkScrollbar
21:22:57 
21:22:57 (SWT:1471): Gtk-WARNING **: 01:22:57.303: Negative content width -6 (allocation 1, extents 4x3) while allocating gadget (node toolbar, owner GtkToolbar)
21:22:57 
21:22:57 (SWT:1471): Gtk-WARNING **: 01:22:57.512: Negative content width -6 (allocation 1, extents 4x3) while allocating gadget (node toolbar, owner GtkToolbar)
21:22:58 
21:22:58 (SWT:1471): Gtk-CRITICAL **: 01:22:58.031: gtk_box_gadget_distribute: assertion 'size >= 0' failed in GtkScrollbar
21:22:58 
21:22:58 (SWT:1471): Gtk-WARNING **: 01:22:58.054: Negative content width -6 (allocation 1, extents 4x3) while allocating gadget (node toolbar, owner GtkToolbar)
21:22:58 
21:22:58 (SWT:1471): Gtk-CRITICAL **: 01:22:58.070: gtk_box_gadget_distribute: assertion 'size >= 0' failed in GtkScrollbar
21:22:58 
21:22:58 (SWT:1471): Gtk-CRITICAL **: 01:22:58.078: gtk_box_gadget_distribute: assertion 'size >= 0' failed in GtkScrollbar
21:22:58 
21:22:58 (SWT:1471): Gtk-WARNING **: 01:22:58.264: Negative content width -6 (allocation 1, extents 4x3) while allocating gadget (node toolbar, owner GtkToolbar)
21:23:00 
21:23:00 (SWT:1471): Gtk-WARNING **: 01:23:00.775: Negative content width -6 (allocation 1, extents 4x3) while allocating gadget (node toolbar, owner GtkToolbar)
21:23:00 
21:23:00 (SWT:1471): Gtk-WARNING **: 01:23:00.789: Negative content width -6 (allocation 1, extents 4x3) while allocating gadget (node toolbar, owner GtkToolbar)
21:23:01 
21:23:01 (SWT:1471): Gtk-WARNING **: 01:23:01.733: Negative content width -9 (allocation 9, extents 9x9) while allocating gadget (node entry, owner GtkEntry)
21:23:01 
21:23:01 (SWT:1471): Gtk-CRITICAL **: 01:23:01.774: gtk_box_gadget_distribute: assertion 'size >= 0' failed in GtkScrollbar
21:23:01 
21:23:01 (SWT:1471): Gtk-CRITICAL **: 01:23:01.787: gtk_box_gadget_distribute: assertion 'size >= 0' failed in GtkScrollbar
21:23:01 
21:23:01 (SWT:1471): Gtk-WARNING **: 01:23:01.793: Negative content width -6 (allocation 1, extents 4x3) while allocating gadget (node toolbar, owner GtkToolbar)
21:23:01 
21:23:01 (SWT:1471): Gtk-CRITICAL **: 01:23:01.802: gtk_box_gadget_distribute: assertion 'size >= 0' failed in GtkScrollbar
21:23:01 
21:23:01 (SWT:1471): Gtk-CRITICAL **: 01:23:01.808: gtk_box_gadget_distribute: assertion 'size >= 0' failed in GtkScrollbar
21:23:01 
21:23:01 (SWT:1471): Gtk-WARNING **: 01:23:01.878: Negative content width -6 (allocation 1, extents 4x3) while allocating gadget (node toolbar, owner GtkToolbar)
21:23:01 
21:23:01 (SWT:1471): Gtk-WARNING **: 01:23:01.915: Negative content width -6 (allocation 1, extents 4x3) while allocating gadget (node toolbar, owner GtkToolbar)
21:23:01 
21:23:01 (SWT:1471): Gtk-WARNING **: 01:23:01.920: Negative content width -6 (allocation 1, extents 4x3) while allocating gadget (node toolbar, owner GtkToolbar)
21:23:01 
21:23:01 (SWT:1471): Gtk-WARNING **: 01:23:01.930: Negative content width -6 (allocation 1, extents 4x3) while allocating gadget (node toolbar, owner GtkToolbar)
21:23:01 
21:23:01 (SWT:1471): Gtk-WARNING **: 01:23:01.930: Negative content width -6 (allocation 1, extents 4x3) while allocating gadget (node toolbar, owner GtkToolbar)
21:23:01 
21:23:01 (SWT:1471): Gtk-WARNING **: 01:23:01.951: Negative content width -6 (allocation 1, extents 4x3) while allocating gadget (node toolbar, owner GtkToolbar)
21:23:02 
21:23:02 (SWT:1471): Gtk-WARNING **: 01:23:02.018: Negative content width -6 (allocation 1, extents 4x3) while allocating gadget (node toolbar, owner GtkToolbar)
21:23:02 
21:23:02 (SWT:1471): Gtk-WARNING **: 01:23:02.065: Negative content width -6 (allocation 1, extents 4x3) while allocating gadget (node toolbar, owner GtkToolbar)
21:23:02 
21:23:02 (SWT:1471): Gtk-WARNING **: 01:23:02.106: Negative content width -6 (allocation 1, extents 4x3) while allocating gadget (node toolbar, owner GtkToolbar)
21:23:02 
21:23:02 (SWT:1471): Gtk-CRITICAL **: 01:23:02.150: gtk_box_gadget_distribute: assertion 'size >= 0' failed in GtkScrollbar
21:23:02 
21:23:02 (SWT:1471): Gtk-CRITICAL **: 01:23:02.170: gtk_box_gadget_distribute: assertion 'size >= 0' failed in GtkScrollbar
21:23:02 
21:23:02 (SWT:1471): Gtk-CRITICAL **: 01:23:02.187: gtk_box_gadget_distribute: assertion 'size >= 0' failed in GtkScrollbar
21:23:02 
21:23:02 (SWT:1471): Gtk-CRITICAL **: 01:23:02.203: gtk_box_gadget_distribute: assertion 'size >= 0' failed in GtkScrollbar
21:23:02 
21:23:02 (SWT:1471): Gtk-CRITICAL **: 01:23:02.220: gtk_box_gadget_distribute: assertion 'size >= 0' failed in GtkScrollbar
21:23:02 
21:23:02 (SWT:1471): Gtk-CRITICAL **: 01:23:02.237: gtk_box_gadget_distribute: assertion 'size >= 0' failed in GtkScrollbar
21:23:02 
21:23:02 (SWT:1471): Gtk-CRITICAL **: 01:23:02.253: gtk_box_gadget_distribute: assertion 'size >= 0' failed in GtkScrollbar
21:23:02 
21:23:02 (SWT:1471): Gtk-CRITICAL **: 01:23:02.270: gtk_box_gadget_distribute: assertion 'size >= 0' failed in GtkScrollbar
21:23:02 
21:23:02 (SWT:1471): Gtk-CRITICAL **: 01:23:02.286: gtk_box_gadget_distribute: assertion 'size >= 0' failed in GtkScrollbar
21:23:02 
21:23:02 (SWT:1471): Gtk-CRITICAL **: 01:23:02.303: gtk_box_gadget_distribute: assertion 'size >= 0' failed in GtkScrollbar
21:23:02 
21:23:02 (SWT:1471): Gtk-WARNING **: 01:23:02.312: Negative content width -6 (allocation 1, extents 4x3) while allocating gadget (node toolbar, owner GtkToolbar)
21:23:02 
21:23:02 (SWT:1471): Gtk-WARNING **: 01:23:02.325: Negative content width -6 (allocation 1, extents 4x3) while allocating gadget (node toolbar, owner GtkToolbar)
21:23:03 
21:23:03 (SWT:1471): Gtk-WARNING **: 01:23:03.593: Negative content width -6 (allocation 1, extents 4x3) while allocating gadget (node toolbar, owner GtkToolbar)
21:23:03 
21:23:03 (SWT:1471): Gtk-WARNING **: 01:23:03.806: Negative content width -6 (allocation 1, extents 4x3) while allocating gadget (node toolbar, owner GtkToolbar)
21:23:04 
21:23:04 (SWT:1471): Gtk-WARNING **: 01:23:04.341: Negative content width -6 (allocation 1, extents 4x3) while allocating gadget (node toolbar, owner GtkToolbar)
21:23:04 
21:23:04 (SWT:1471): Gtk-WARNING **: 01:23:04.552: Negative content width -6 (allocation 1, extents 4x3) while allocating gadget (node toolbar, owner GtkToolbar)
21:23:05 
21:23:05 (SWT:1471): Gtk-CRITICAL **: 01:23:05.088: gtk_box_gadget_distribute: assertion 'size >= 0' failed in GtkScrollbar
21:23:05 
21:23:05 (SWT:1471): Gtk-WARNING **: 01:23:05.092: Negative content width -6 (allocation 1, extents 4x3) while allocating gadget (node toolbar, owner GtkToolbar)
21:23:05 
21:23:05 (SWT:1471): Gtk-CRITICAL **: 01:23:05.107: gtk_box_gadget_distribute: assertion 'size >= 0' failed in GtkScrollbar
21:23:05 
21:23:05 (SWT:1471): Gtk-CRITICAL **: 01:23:05.108: gtk_box_gadget_distribute: assertion 'size >= 0' failed in GtkScrollbar
21:23:05 
21:23:05 (SWT:1471): Gtk-CRITICAL **: 01:23:05.128: gtk_box_gadget_distribute: assertion 'size >= 0' failed in GtkScrollbar
21:23:05 
21:23:05 (SWT:1471): Gtk-WARNING **: 01:23:05.302: Negative content width -6 (allocation 1, extents 4x3) while allocating gadget (node toolbar, owner GtkToolbar)
21:23:05 
21:23:05 (SWT:1471): Gtk-CRITICAL **: 01:23:05.820: gtk_box_gadget_distribute: assertion 'size >= 0' failed in GtkScrollbar
21:23:05 
21:23:05 (SWT:1471): Gtk-WARNING **: 01:23:05.844: Negative content width -6 (allocation 1, extents 4x3) while allocating gadget (node toolbar, owner GtkToolbar)
21:23:05 
21:23:05 (SWT:1471): Gtk-CRITICAL **: 01:23:05.852: gtk_box_gadget_distribute: assertion 'size >= 0' failed in GtkScrollbar
21:23:05 
21:23:05 (SWT:1471): Gtk-CRITICAL **: 01:23:05.856: gtk_box_gadget_distribute: assertion 'size >= 0' failed in GtkScrollbar
21:23:06 
21:23:06 (SWT:1471): Gtk-WARNING **: 01:23:06.053: Negative content width -6 (allocation 1, extents 4x3) while allocating gadget (node toolbar, owner GtkToolbar)
21:23:07 
21:23:07 (SWT:1471): Gtk-WARNING **: 01:23:07.969: Negative content width -6 (allocation 1, extents 4x3) while allocating gadget (node toolbar, owner GtkToolbar)
21:23:07 
21:23:07 (SWT:1471): Gtk-WARNING **: 01:23:07.982: Negative content width -6 (allocation 1, extents 4x3) while allocating gadget (node toolbar, owner GtkToolbar)
21:23:08 Tests run: 3, Failures: 0, Errors: 0, Skipped: 1, Time elapsed: 16.17 s - in org.eclipse.egit.ui.internal.selection.SelectionForViewsTest
21:23:08 testViewsReactOnRepoSwitchInStaging(org.eclipse.egit.ui.internal.selection.SelectionForViewsTest) skipped
21:23:08 testViewsReactOnBareRepoViewSelection(org.eclipse.egit.ui.internal.selection.SelectionForViewsTest)  Time elapsed: 8.958 s
21:23:08 testViewsReactOnRepoViewSelection(org.eclipse.egit.ui.internal.selection.SelectionForViewsTest)  Time elapsed: 7.202 s
21:23:08 Running org.eclipse.egit.ui.internal.CompareUtilsTest
21:23:10 Tests run: 2, Failures: 0, Errors: 0, Skipped: 0, Time elapsed: 2.137 s - in org.eclipse.egit.ui.internal.CompareUtilsTest
21:23:10 testIndexEditWithAttributes(org.eclipse.egit.ui.internal.CompareUtilsTest)  Time elapsed: 1.33 s
21:23:10 testIndexEdit(org.eclipse.egit.ui.internal.CompareUtilsTest)  Time elapsed: 0.8 s
21:23:10 Running org.eclipse.egit.ui.search.CommitSearchQueryTest
21:23:14 Tests run: 7, Failures: 0, Errors: 0, Skipped: 0, Time elapsed: 3.898 s - in org.eclipse.egit.ui.search.CommitSearchQueryTest
21:23:14 testQuery(org.eclipse.egit.ui.search.CommitSearchQueryTest)  Time elapsed: 0.541 s
21:23:14 testMatchMessage(org.eclipse.egit.ui.search.CommitSearchQueryTest)  Time elapsed: 0.532 s
21:23:14 testCaseInsensitive(org.eclipse.egit.ui.search.CommitSearchQueryTest)  Time elapsed: 0.541 s
21:23:14 testMatchCommit(org.eclipse.egit.ui.search.CommitSearchQueryTest)  Time elapsed: 0.624 s
21:23:14 testMatchParent(org.eclipse.egit.ui.search.CommitSearchQueryTest)  Time elapsed: 0.53 s
21:23:14 testMatchTree(org.eclipse.egit.ui.search.CommitSearchQueryTest)  Time elapsed: 0.539 s
21:23:14 testEmptyMatches(org.eclipse.egit.ui.search.CommitSearchQueryTest)  Time elapsed: 0.529 s
21:23:14 Running org.eclipse.egit.ui.search.CommitSearchDialogTest
21:23:14 
21:23:14 (SWT:1471): Gtk-WARNING **: 01:23:14.842: Negative content width -6 (allocation 1, extents 4x3) while allocating gadget (node toolbar, owner GtkToolbar)
21:23:14 
21:23:14 (SWT:1471): Gtk-WARNING **: 01:23:14.859: Negative content width -6 (allocation 1, extents 4x3) while allocating gadget (node toolbar, owner GtkToolbar)
21:23:14 
21:23:14 (SWT:1471): Gtk-WARNING **: 01:23:14.927: Negative content width -6 (allocation 1, extents 4x3) while allocating gadget (node toolbar, owner GtkToolbar)
21:23:14 
21:23:14 (SWT:1471): Gtk-WARNING **: 01:23:14.970: Negative content width -6 (allocation 1, extents 4x3) while allocating gadget (node toolbar, owner GtkToolbar)
21:23:15 
21:23:15 (SWT:1471): Gtk-WARNING **: 01:23:15.642: Negative content width -6 (allocation 1, extents 4x3) while allocating gadget (node toolbar, owner GtkToolbar)
21:23:15 Tests run: 1, Failures: 0, Errors: 0, Skipped: 0, Time elapsed: 1.633 s - in org.eclipse.egit.ui.search.CommitSearchDialogTest
21:23:15 openCommitTabOnSearchDialog(org.eclipse.egit.ui.search.CommitSearchDialogTest)  Time elapsed: 1.629 s
21:23:15 Running org.eclipse.egit.ui.submodule.SubmoduleUpdateTest
21:23:16 
21:23:16 (SWT:1471): Gtk-WARNING **: 01:23:16.487: Negative content width -6 (allocation 1, extents 4x3) while allocating gadget (node toolbar, owner GtkToolbar)
21:23:21 
21:23:21 (SWT:1471): Gtk-WARNING **: 01:23:21.416: Negative content width -6 (allocation 1, extents 4x3) while allocating gadget (node toolbar, owner GtkToolbar)
21:23:21 Tests run: 1, Failures: 0, Errors: 0, Skipped: 0, Time elapsed: 5.739 s - in org.eclipse.egit.ui.submodule.SubmoduleUpdateTest
21:23:21 updateSubmodule(org.eclipse.egit.ui.submodule.SubmoduleUpdateTest)  Time elapsed: 5.734 s
21:23:21 Running org.eclipse.egit.ui.submodule.SubmoduleAddTest
21:23:22 
21:23:22 (SWT:1471): Gtk-WARNING **: 01:23:22.223: Negative content width -6 (allocation 1, extents 4x3) while allocating gadget (node toolbar, owner GtkToolbar)
21:23:26 
21:23:26 (SWT:1471): Gtk-WARNING **: 01:23:26.201: Negative content width -6 (allocation 1, extents 4x3) while allocating gadget (node toolbar, owner GtkToolbar)
21:23:26 Tests run: 1, Failures: 0, Errors: 0, Skipped: 0, Time elapsed: 4.783 s - in org.eclipse.egit.ui.submodule.SubmoduleAddTest
21:23:26 addAtRoot(org.eclipse.egit.ui.submodule.SubmoduleAddTest)  Time elapsed: 4.778 s
21:23:26 Running org.eclipse.egit.ui.submodule.SubmoduleSyncTest
21:23:26 
21:23:26 (SWT:1471): Gtk-WARNING **: 01:23:26.999: Negative content width -6 (allocation 1, extents 4x3) while allocating gadget (node toolbar, owner GtkToolbar)
21:23:31 
21:23:31 (SWT:1471): Gtk-WARNING **: 01:23:31.869: Negative content width -6 (allocation 1, extents 4x3) while allocating gadget (node toolbar, owner GtkToolbar)
21:23:31 Tests run: 1, Failures: 0, Errors: 0, Skipped: 0, Time elapsed: 5.667 s - in org.eclipse.egit.ui.submodule.SubmoduleSyncTest
21:23:31 syncSubmodule(org.eclipse.egit.ui.submodule.SubmoduleSyncTest)  Time elapsed: 5.662 s
21:23:31 Running org.eclipse.egit.ui.operations.GitScopeUtilTest
21:23:36 Tests run: 5, Failures: 0, Errors: 0, Skipped: 0, Time elapsed: 4.112 s - in org.eclipse.egit.ui.operations.GitScopeUtilTest
21:23:36 relatedChangesWithPrompt(org.eclipse.egit.ui.operations.GitScopeUtilTest)  Time elapsed: 1.703 s
21:23:36 modelProviderWithExtensionFiles(org.eclipse.egit.ui.operations.GitScopeUtilTest)  Time elapsed: 0.612 s
21:23:36 relatedChangesWithInvalidParams(org.eclipse.egit.ui.operations.GitScopeUtilTest)  Time elapsed: 0.528 s
21:23:36 relatedChangesWithNullResources(org.eclipse.egit.ui.operations.GitScopeUtilTest)  Time elapsed: 0.642 s
21:23:36 relatedChangesWithEmptyResources(org.eclipse.egit.ui.operations.GitScopeUtilTest)  Time elapsed: 0.622 s
21:23:36 Running org.eclipse.egit.ui.prefpages.configuration.GlobalConfigurationPageTest
21:23:36 
21:23:36 !ENTRY org.eclipse.ui 2 2 2019-03-22 01:23:36.121
21:23:36 !MESSAGE Invalid preference category path: org.eclipse.ui.net.NetPreferences (bundle: org.eclipse.jsch.ui, page: org.eclipse.jsch.ui.SSHPreferences)
21:23:36 
21:23:36 (SWT:1471): Gtk-WARNING **: 01:23:36.140: Negative content width -13 (allocation 5, extents 9x9) while allocating gadget (node entry, owner GtkEntry)
21:23:36 
21:23:36 (SWT:1471): Gtk-WARNING **: 01:23:36.330: Negative content width -13 (allocation 5, extents 9x9) while allocating gadget (node entry, owner GtkEntry)
21:23:36 
21:23:36 (SWT:1471): Gtk-WARNING **: 01:23:36.485: Negative content width -13 (allocation 5, extents 9x9) while allocating gadget (node entry, owner GtkEntry)
21:23:36 
21:23:36 (SWT:1471): Gtk-WARNING **: 01:23:36.625: Negative content width -13 (allocation 5, extents 9x9) while allocating gadget (node entry, owner GtkEntry)
21:23:36 
21:23:36 (SWT:1471): Gtk-WARNING **: 01:23:36.722: Negative content width -13 (allocation 5, extents 9x9) while allocating gadget (node entry, owner GtkEntry)
21:23:36 
21:23:36 (SWT:1471): Gtk-WARNING **: 01:23:36.830: Negative content width -13 (allocation 5, extents 9x9) while allocating gadget (node entry, owner GtkEntry)
21:23:36 
21:23:36 (SWT:1471): Gtk-WARNING **: 01:23:36.988: Negative content width -13 (allocation 5, extents 9x9) while allocating gadget (node entry, owner GtkEntry)
21:23:37 
21:23:37 (SWT:1471): Gtk-WARNING **: 01:23:37.055: Negative content width -6 (allocation 1, extents 4x3) while allocating gadget (node toolbar, owner GtkToolbar)
21:23:37 
21:23:37 (SWT:1471): Gtk-WARNING **: 01:23:37.055: Negative content height -3 (allocation 1, extents 2x2) while allocating gadget (node toolbar, owner GtkToolbar)
21:23:37 
21:23:37 (SWT:1471): Gtk-WARNING **: 01:23:37.056: Negative content width -6 (allocation 1, extents 4x3) while allocating gadget (node toolbar, owner GtkToolbar)
21:23:37 
21:23:37 (SWT:1471): Gtk-WARNING **: 01:23:37.056: Negative content height -3 (allocation 1, extents 2x2) while allocating gadget (node toolbar, owner GtkToolbar)
21:23:37 
21:23:37 (SWT:1471): Gtk-WARNING **: 01:23:37.204: Negative content width -13 (allocation 5, extents 9x9) while allocating gadget (node entry, owner GtkEntry)
21:23:37 
21:23:37 (SWT:1471): Gtk-WARNING **: 01:23:37.356: Negative content width -13 (allocation 5, extents 9x9) while allocating gadget (node entry, owner GtkEntry)
21:23:37 
21:23:37 (SWT:1471): Gtk-WARNING **: 01:23:37.540: Negative content width -13 (allocation 5, extents 9x9) while allocating gadget (node entry, owner GtkEntry)
21:23:37 
21:23:37 (SWT:1471): Gtk-WARNING **: 01:23:37.686: Negative content width -13 (allocation 5, extents 9x9) while allocating gadget (node entry, owner GtkEntry)
21:23:37 
21:23:37 (SWT:1471): Gtk-WARNING **: 01:23:37.838: Negative content width -13 (allocation 5, extents 9x9) while allocating gadget (node entry, owner GtkEntry)
21:23:38 Tests run: 11, Failures: 0, Errors: 0, Skipped: 0, Time elapsed: 1.873 s - in org.eclipse.egit.ui.prefpages.configuration.GlobalConfigurationPageTest
21:23:38 testAddSubSectionEntry(org.eclipse.egit.ui.prefpages.configuration.GlobalConfigurationPageTest)  Time elapsed: 0.22 s
21:23:38 testAddSectionEntry(org.eclipse.egit.ui.prefpages.configuration.GlobalConfigurationPageTest)  Time elapsed: 0.155 s
21:23:38 testCanCreateSameEntryValue(org.eclipse.egit.ui.prefpages.configuration.GlobalConfigurationPageTest)  Time elapsed: 0.14 s
21:23:38 testNodes(org.eclipse.egit.ui.prefpages.configuration.GlobalConfigurationPageTest)  Time elapsed: 0.097 s
21:23:38 testRemoveValue(org.eclipse.egit.ui.prefpages.configuration.GlobalConfigurationPageTest)  Time elapsed: 0.108 s
21:23:38 testAddSubSectionEntryWithSuggestion(org.eclipse.egit.ui.prefpages.configuration.GlobalConfigurationPageTest)  Time elapsed: 0.158 s
21:23:38 testOpenEditor(org.eclipse.egit.ui.prefpages.configuration.GlobalConfigurationPageTest)  Time elapsed: 0.215 s
21:23:38 testSubsectionWithDot(org.eclipse.egit.ui.prefpages.configuration.GlobalConfigurationPageTest)  Time elapsed: 0.153 s
21:23:38 testChecksForKey(org.eclipse.egit.ui.prefpages.configuration.GlobalConfigurationPageTest)  Time elapsed: 0.183 s
21:23:38 testRemoveSubSection(org.eclipse.egit.ui.prefpages.configuration.GlobalConfigurationPageTest)  Time elapsed: 0.147 s
21:23:38 testRemoveSection(org.eclipse.egit.ui.prefpages.configuration.GlobalConfigurationPageTest)  Time elapsed: 0.15 s
21:23:38 Running org.eclipse.egit.ui.httpauth.PushTest
21:23:38 2019-03-22 01:23:38.143:INFO:oejs.Server:WorkbenchTestable: jetty-9.4.14.v20181114; built: 2019-01-14T17:18:45.591Z; git: c4550056e785fb5665914545889f21dc136ad9e6; jvm 1.8.0_202-b08
21:23:38 2019-03-22 01:23:38.145:INFO:oejsh.ContextHandler:WorkbenchTestable: Started o.e.j.s.ServletContextHandler@6e7c4b99{/sbasic,null,AVAILABLE}
21:23:38 2019-03-22 01:23:38.148:INFO:oejs.AbstractConnector:WorkbenchTestable: Started ServerConnector@7e51f08{HTTP/1.1,[http/1.1]}{127.0.0.1:38543}
21:23:38 2019-03-22 01:23:38.148:INFO:oejs.Server:WorkbenchTestable: Started @796998ms
21:23:38 
21:23:38 (SWT:1471): Gtk-WARNING **: 01:23:38.459: Negative content width -11 (allocation 1, extents 6x6) while allocating gadget (node button, owner GtkButton)
21:23:38 
21:23:38 (SWT:1471): Gtk-WARNING **: 01:23:38.620: gtk_widget_size_allocate(): attempt to allocate widget with width 608 and height -1
21:23:38 
21:23:38 (SWT:1471): Gtk-WARNING **: 01:23:38.620: Negative content height -1 (allocation 1, extents 1x1) while allocating gadget (node scrolledwindow, owner GtkScrolledWindow)
21:23:38 
21:23:38 (SWT:1471): Gtk-WARNING **: 01:23:38.621: gtk_widget_size_allocate(): attempt to allocate widget with width 6 and height -25
21:23:38 
21:23:38 (SWT:1471): Gtk-CRITICAL **: 01:23:38.621: gtk_box_gadget_distribute: assertion 'size >= 0' failed in GtkScrollbar
21:23:38 
21:23:38 (SWT:1471): Gtk-WARNING **: 01:23:38.631: gtk_widget_size_allocate(): attempt to allocate widget with width 608 and height -1
21:23:39 2019-03-22 01:23:39.532:INFO:oejs.AbstractConnector:WorkbenchTestable: Stopped ServerConnector@7e51f08{HTTP/1.1,[http/1.1]}{127.0.0.1:0}
21:23:39 2019-03-22 01:23:39.532:INFO:oejsh.ContextHandler:WorkbenchTestable: Stopped o.e.j.s.ServletContextHandler@6e7c4b99{/sbasic,null,UNAVAILABLE}
21:23:39 Tests run: 1, Failures: 0, Errors: 0, Skipped: 0, Time elapsed: 1.53 s - in org.eclipse.egit.ui.httpauth.PushTest
21:23:39 testPush(org.eclipse.egit.ui.httpauth.PushTest)  Time elapsed: 1.529 s
21:23:39 Running org.eclipse.egit.ui.variables.DynamicVariablesTest
21:23:44 Tests run: 4, Failures: 0, Errors: 0, Skipped: 0, Time elapsed: 4.475 s - in org.eclipse.egit.ui.variables.DynamicVariablesTest
21:23:44 testGitBranch(org.eclipse.egit.ui.variables.DynamicVariablesTest)  Time elapsed: 1.169 s
21:23:44 testGitPath(org.eclipse.egit.ui.variables.DynamicVariablesTest)  Time elapsed: 1.083 s
21:23:44 testGitWorkTree(org.eclipse.egit.ui.variables.DynamicVariablesTest)  Time elapsed: 1.132 s
21:23:44 testGitDir(org.eclipse.egit.ui.variables.DynamicVariablesTest)  Time elapsed: 1.09 s
21:23:44 
21:23:44 Results:
21:23:44 
21:23:44 Failures: 
21:23:44   GitRepositoriesViewRepoDeletionTest.testRemoveRepositoryRemoveFromCachesBug483664:278 Expected no IndexDiffCache entries expected:<[[]]> but was:<[[/home/jenkins/workspace/egit.gerrit/tmp/egit.tmp/7e27e1eeb45c4d169643674ce51ac9a0/LocalRepositoriesTests15_testRepositoryViewStartFinishEnablement/FirstRepository/.git, /home/jenkins/workspace/egit.gerrit/repo/org.eclipse.egit.ui.test/target/work/data/test1247467049767508/.git]]>
21:23:44 
21:23:44 Tests run: 467, Failures: 1, Errors: 0, Skipped: 12
21:23:44 
21:23:45 
21:23:45 !ENTRY org.eclipse.core.jobs 4 2 2019-03-22 01:23:45.124
21:23:45 !MESSAGE An internal error occurred during: "Git decorator updates (Git object decorations).".
21:23:45 !STACK 0
21:23:45 org.eclipse.swt.SWTException: Device is disposed
21:23:45 	at org.eclipse.swt.SWT.error(SWT.java:4533)
21:23:45 	at org.eclipse.swt.SWT.error(SWT.java:4448)
21:23:45 	at org.eclipse.swt.SWT.error(SWT.java:4419)
21:23:45 	at org.eclipse.swt.widgets.Display.error(Display.java:1236)
21:23:45 	at org.eclipse.swt.widgets.Display.asyncExec(Display.java:775)
21:23:45 	at org.eclipse.egit.ui.internal.decorators.GitDecorator.fireLabelEvent(GitDecorator.java:79)
21:23:45 	at org.eclipse.egit.ui.internal.decorators.GitDecorator$EventJob.run(GitDecorator.java:125)
21:23:45 	at org.eclipse.core.internal.jobs.Worker.run(Worker.java:55)
21:23:45 
21:23:45 !ENTRY org.eclipse.core.jobs 4 2 2019-03-22 01:23:45.124
21:23:45 !MESSAGE An internal error occurred during: "Git decorator updates (Git resource decorations).".
21:23:45 !STACK 0
21:23:45 org.eclipse.swt.SWTException: Device is disposed
21:23:45 	at org.eclipse.swt.SWT.error(SWT.java:4533)
21:23:45 	at org.eclipse.swt.SWT.error(SWT.java:4448)
21:23:45 	at org.eclipse.swt.SWT.error(SWT.java:4419)
21:23:45 	at org.eclipse.swt.widgets.Display.error(Display.java:1236)
21:23:45 	at org.eclipse.swt.widgets.Display.asyncExec(Display.java:775)
21:23:45 	at org.eclipse.egit.ui.internal.decorators.GitDecorator.fireLabelEvent(GitDecorator.java:79)
21:23:45 	at org.eclipse.egit.ui.internal.decorators.GitDecorator$EventJob.run(GitDecorator.java:125)
21:23:45 	at org.eclipse.core.internal.jobs.Worker.run(Worker.java:55)
21:23:45 
21:23:45 !ENTRY org.eclipse.core.jobs 4 2 2019-03-22 01:23:45.124
21:23:45 !MESSAGE An internal error occurred during: "Git decorator updates (Git resource decorations).".
21:23:45 !STACK 0
21:23:45 org.eclipse.swt.SWTException: Device is disposed
21:23:45 	at org.eclipse.swt.SWT.error(SWT.java:4533)
21:23:45 	at org.eclipse.swt.SWT.error(SWT.java:4448)
21:23:45 	at org.eclipse.swt.SWT.error(SWT.java:4419)
21:23:45 	at org.eclipse.swt.widgets.Display.error(Display.java:1236)
21:23:45 	at org.eclipse.swt.widgets.Display.asyncExec(Display.java:775)
21:23:45 	at org.eclipse.egit.ui.internal.decorators.GitDecorator.fireLabelEvent(GitDecorator.java:79)
21:23:45 	at org.eclipse.egit.ui.internal.decorators.GitDecorator$EventJob.run(GitDecorator.java:125)
21:23:45 	at org.eclipse.core.internal.jobs.Worker.run(Worker.java:55)
21:23:45 
21:23:45 !ENTRY org.eclipse.core.resources 2 10035 2019-03-22 01:23:45.768
21:23:45 !MESSAGE The workspace will exit with unsaved changes in this session.
21:23:46 [INFO] ------------------------------------------------------------------------
21:23:46 [INFO] BUILD FAILURE
21:23:46 [INFO] ------------------------------------------------------------------------
21:23:46 [INFO] Total time: 13:48 min
21:23:46 [INFO] Finished at: 2019-03-22T01:23:46Z
21:23:46 [INFO] ------------------------------------------------------------------------
21:23:46 [ERROR] Failed to execute goal org.eclipse.tycho:tycho-surefire-plugin:1.3.0:test (default-test) on project org.eclipse.egit.ui.test: There are test failures.
21:23:46 [ERROR] 
21:23:46 [ERROR] Please refer to /home/jenkins/workspace/egit.gerrit/repo/org.eclipse.egit.ui.test/target/surefire-reports for the individual test results.
21:23:46 [ERROR] -> [Help 1]
21:23:46 org.apache.maven.lifecycle.LifecycleExecutionException: Failed to execute goal org.eclipse.tycho:tycho-surefire-plugin:1.3.0:test (default-test) on project org.eclipse.egit.ui.test: There are test failures.
21:23:46 
21:23:46 Please refer to /home/jenkins/workspace/egit.gerrit/repo/org.eclipse.egit.ui.test/target/surefire-reports for the individual test results.
21:23:46     at org.apache.maven.lifecycle.internal.MojoExecutor.execute (MojoExecutor.java:213)
21:23:46     at org.apache.maven.lifecycle.internal.MojoExecutor.execute (MojoExecutor.java:154)
21:23:46     at org.apache.maven.lifecycle.internal.MojoExecutor.execute (MojoExecutor.java:146)
21:23:46     at org.apache.maven.lifecycle.internal.LifecycleModuleBuilder.buildProject (LifecycleModuleBuilder.java:117)
21:23:46     at org.apache.maven.lifecycle.internal.LifecycleModuleBuilder.buildProject (LifecycleModuleBuilder.java:81)
21:23:46     at org.apache.maven.lifecycle.internal.builder.singlethreaded.SingleThreadedBuilder.build (SingleThreadedBuilder.java:56)
21:23:46     at org.apache.maven.lifecycle.internal.LifecycleStarter.execute (LifecycleStarter.java:128)
21:23:46     at org.apache.maven.DefaultMaven.doExecute (DefaultMaven.java:305)
21:23:46     at org.apache.maven.DefaultMaven.doExecute (DefaultMaven.java:192)
21:23:46     at org.apache.maven.DefaultMaven.execute (DefaultMaven.java:105)
21:23:46     at org.apache.maven.cli.MavenCli.execute (MavenCli.java:954)
21:23:46     at org.apache.maven.cli.MavenCli.doMain (MavenCli.java:288)
21:23:46     at org.apache.maven.cli.MavenCli.main (MavenCli.java:192)
21:23:46     at sun.reflect.NativeMethodAccessorImpl.invoke0 (Native Method)
21:23:46     at sun.reflect.NativeMethodAccessorImpl.invoke (NativeMethodAccessorImpl.java:62)
21:23:46     at sun.reflect.DelegatingMethodAccessorImpl.invoke (DelegatingMethodAccessorImpl.java:43)
21:23:46     at java.lang.reflect.Method.invoke (Method.java:498)
21:23:46     at org.codehaus.plexus.classworlds.launcher.Launcher.launchEnhanced (Launcher.java:289)
21:23:46     at org.codehaus.plexus.classworlds.launcher.Launcher.launch (Launcher.java:229)
21:23:46     at org.codehaus.plexus.classworlds.launcher.Launcher.mainWithExitCode (Launcher.java:415)
21:23:46     at org.codehaus.plexus.classworlds.launcher.Launcher.main (Launcher.java:356)
21:23:46 Caused by: org.apache.maven.plugin.MojoFailureException: There are test failures.
21:23:46 
21:23:46 Please refer to /home/jenkins/workspace/egit.gerrit/repo/org.eclipse.egit.ui.test/target/surefire-reports for the individual test results.
21:23:46     at org.eclipse.tycho.surefire.TestMojo.runTest (TestMojo.java:1044)
21:23:46     at org.eclipse.tycho.surefire.TestMojo.execute (TestMojo.java:693)
21:23:46     at org.apache.maven.plugin.DefaultBuildPluginManager.executeMojo (DefaultBuildPluginManager.java:137)
21:23:46     at org.apache.maven.lifecycle.internal.MojoExecutor.execute (MojoExecutor.java:208)
21:23:46     at org.apache.maven.lifecycle.internal.MojoExecutor.execute (MojoExecutor.java:154)
21:23:46     at org.apache.maven.lifecycle.internal.MojoExecutor.execute (MojoExecutor.java:146)
21:23:46     at org.apache.maven.lifecycle.internal.LifecycleModuleBuilder.buildProject (LifecycleModuleBuilder.java:117)
21:23:46     at org.apache.maven.lifecycle.internal.LifecycleModuleBuilder.buildProject (LifecycleModuleBuilder.java:81)
21:23:46     at org.apache.maven.lifecycle.internal.builder.singlethreaded.SingleThreadedBuilder.build (SingleThreadedBuilder.java:56)
21:23:46     at org.apache.maven.lifecycle.internal.LifecycleStarter.execute (LifecycleStarter.java:128)
21:23:46     at org.apache.maven.DefaultMaven.doExecute (DefaultMaven.java:305)
21:23:46     at org.apache.maven.DefaultMaven.doExecute (DefaultMaven.java:192)
21:23:46     at org.apache.maven.DefaultMaven.execute (DefaultMaven.java:105)
21:23:46     at org.apache.maven.cli.MavenCli.execute (MavenCli.java:954)
21:23:46     at org.apache.maven.cli.MavenCli.doMain (MavenCli.java:288)
21:23:46     at org.apache.maven.cli.MavenCli.main (MavenCli.java:192)
21:23:46     at sun.reflect.NativeMethodAccessorImpl.invoke0 (Native Method)
21:23:46     at sun.reflect.NativeMethodAccessorImpl.invoke (NativeMethodAccessorImpl.java:62)
21:23:46     at sun.reflect.DelegatingMethodAccessorImpl.invoke (DelegatingMethodAccessorImpl.java:43)
21:23:46     at java.lang.reflect.Method.invoke (Method.java:498)
21:23:46     at org.codehaus.plexus.classworlds.launcher.Launcher.launchEnhanced (Launcher.java:289)
21:23:46     at org.codehaus.plexus.classworlds.launcher.Launcher.launch (Launcher.java:229)
21:23:46     at org.codehaus.plexus.classworlds.launcher.Launcher.mainWithExitCode (Launcher.java:415)
21:23:46     at org.codehaus.plexus.classworlds.launcher.Launcher.main (Launcher.java:356)
21:23:46 [ERROR] 
21:23:46 [ERROR] Re-run Maven using the -X switch to enable full debug logging.
21:23:46 [ERROR] 
21:23:46 [ERROR] For more information about the errors and possible solutions, please read the following articles:
21:23:46 [ERROR] [Help 1] http://cwiki.apache.org/confluence/display/MAVEN/MojoFailureException
21:23:46 [INFO] Build failures were ignored.
21:23:47 [egit.gerrit] $ /opt/tools/apache-maven/latest/bin/mvn -f repo/org.eclipse.egit.mylyn.ui.test/pom.xml -DGERRIT_BRANCH=master -DGERRIT_PATCHSET_REVISION=df1a467b47432ab761dcf0c4f0f48869e23a70c2 -DGERRIT_HOST=gerrit-local -DGERRIT_CHANGE_OWNER_EMAIL=thomas.wolf@paranor.ch "-DGERRIT_EVENT_ACCOUNT_NAME=Thomas Wolf" -DTEST_PARAMS=-Declipse.consoleLog=true -DGERRIT_CHANGE_URL=https://git.eclipse.org/r/138782 -DGERRIT_PATCHSET_UPLOADER_EMAIL=thomas.wolf@paranor.ch -DGERRIT_EVENT_TYPE=patchset-created -DGERRIT_PROJECT=egit/egit -DGERRIT_CHANGE_NUMBER=138782 -DGERRIT_SCHEME=ssh '-DGERRIT_PATCHSET_UPLOADER=\"Thomas Wolf\" <thomas.wolf@paranor.ch>' -DGERRIT_PORT=29418 -DGERRIT_CHANGE_PRIVATE_STATE=false -DGERRIT_REFSPEC=refs/changes/82/138782/2 -DJGIT_VERSION=5.4.0-SNAPSHOT "-DGERRIT_PATCHSET_UPLOADER_NAME=Thomas Wolf" '-DGERRIT_CHANGE_OWNER=\"Thomas Wolf\" <thomas.wolf@paranor.ch>' -DGERRIT_CHANGE_COMMIT_MESSAGE=VW5pZnkgIlNob3cgaW4gSGlzdG9yeSIgY29tbWFuZHMKClVzZSB0aGUgc2FtZSBjb21tYW5kIGlkIGZvciBib3RoIHRoZSAiVGVhbSIgc3ViLW1lbnUgYW5kIGZvciB0aGUKY29tbWl0IGVkaXRvci4gUmVtb3ZlIHRoZSBleHRyYSBjb21tYW5kIGZvciB0aGUgY29tbWl0IGVkaXRvciBmcm9tCnBsdWdpbi54bWwsIGJ1dCBsZWF2ZSB0aGUgdHdvIGRpZmZlcmVudCBoYW5kbGVycy4KCkJ1ZzogNTQ1MDMxCkNoYW5nZS1JZDogSWY5ZjUzMGMwMzJiNmE3Y2ZlMTFmOTBjZGMxOWYxYmMwMGY5ODhiODMKU2lnbmVkLW9mZi1ieTogVGhvbWFzIFdvbGYgPHRob21hcy53b2xmQHBhcmFub3IuY2g+ "-DGERRIT_NAME=Eclipse Gerrit" -DGERRIT_TOPIC=unify_commands '-DGERRIT_CHANGE_SUBJECT=Unify \"Show in History\" commands' -DJGIT_SITE=https://repo.eclipse.org/content/unzip/snapshots.unzip/org/eclipse/jgit/org.eclipse.jgit.repository/${JGIT_VERSION}/org.eclipse.jgit.repository-${JGIT_VERSION}.zip-unzip/ '-DGERRIT_EVENT_ACCOUNT=\"Thomas Wolf\" <thomas.wolf@paranor.ch>' -DGERRIT_CHANGE_WIP_STATE=false -DGERRIT_CHANGE_ID=If9f530c032b6a7cfe11f90cdc19f1bc00f988b83 -DGERRIT_EVENT_HASH=171265957 -DGERRIT_VERSION=2.14.6 -DGERRIT_EVENT_ACCOUNT_EMAIL=thomas.wolf@paranor.ch -DGERRIT_PATCHSET_NUMBER=2 "-DGERRIT_CHANGE_OWNER_NAME=Thomas Wolf" -Djava.io.tmpdir=/home/jenkins/workspace/egit.gerrit/tmp/ "-Dtest.vmparams=-Declipse.consoleLog=true -Degit.test.tmpdir=/home/jenkins/workspace/egit.gerrit/tmp/egit.tmp/" -Djgit-site=https://repo.eclipse.org/content/unzip/snapshots.unzip/org/eclipse/jgit/org.eclipse.jgit.repository/5.4.0-SNAPSHOT/org.eclipse.jgit.repository-5.4.0-SNAPSHOT.zip-unzip/ -Declipse.p2.mirrors=false -Dmaven.repo.local=/home/jenkins/workspace/egit.gerrit/.repository -B -e verify --fail-never -P other-os
21:23:47 Picked up JAVA_TOOL_OPTIONS: -XX:+IgnoreUnrecognizedVMOptions -XX:+UseContainerSupport -XX:+UnlockExperimentalVMOptions -XX:+UseCGroupMemoryLimitForHeap
21:23:47 Picked up _JAVA_OPTIONS: -XX:MaxRAMPercentage=64.0
21:23:48 [INFO] Error stacktraces are turned on.
21:23:48 [INFO] Scanning for projects...
21:23:50 [INFO] Computing target platform for MavenProject: org.eclipse.egit:org.eclipse.egit.mylyn.ui.test:5.4.0-SNAPSHOT @ /home/jenkins/workspace/egit.gerrit/repo/org.eclipse.egit.mylyn.ui.test/pom.xml
21:23:55 [INFO] Adding repository http://download.eclipse.org/jetty/updates/jetty-bundles-9.x/9.4.14.v20181114
21:23:55 [INFO] Fetching p2.index from http://download.eclipse.org/technology/swtbot/snapshots/
21:23:55 [INFO] Fetching p2.index from http://download.eclipse.org/technology/swtbot/snapshots/
21:23:55 [INFO] Adding repository http://download.eclipse.org/technology/swtbot/snapshots
21:23:55 [INFO] Fetching p2.index from http://download.eclipse.org/tools/orbit/downloads/drops/R20190226160451/repository/
21:23:55 [INFO] Fetching p2.index from http://download.eclipse.org/tools/orbit/downloads/drops/R20190226160451/repository/
21:23:55 [INFO] Adding repository http://download.eclipse.org/tools/orbit/downloads/drops/R20190226160451/repository
21:23:55 [INFO] Fetching p2.index from http://download.eclipse.org/tools/orbit/downloads/drops2/R20190226160451/repository/
21:23:55 [INFO] Fetching p2.index from http://download.eclipse.org/tools/orbit/downloads/drops2/R20190226160451/repository/
21:23:56 [INFO] Fetching p2.index from http://download.eclipse.org/releases/neon/
21:23:56 [INFO] Fetching p2.index from http://download.eclipse.org/releases/neon/
21:23:56 [INFO] Adding repository http://download.eclipse.org/releases/neon
21:23:56 [INFO] Fetching p2.index from http://download.eclipse.org/technology/epp/packages/neon/
21:23:56 [INFO] Fetching p2.index from http://download.eclipse.org/technology/epp/packages/neon/
21:23:56 [INFO] Fetching p2.index from http://download.eclipse.org/releases/neon/201705151400/
21:23:56 [INFO] Fetching p2.index from http://download.eclipse.org/releases/neon/201705151400/
21:23:58 [INFO] Fetching p2.index from http://download.eclipse.org/releases/neon/201703141400/
21:23:58 [INFO] Fetching p2.index from http://download.eclipse.org/releases/neon/201703141400/
21:23:59 [INFO] Fetching p2.index from http://download.eclipse.org/releases/neon/201703231000/
21:23:59 [INFO] Fetching p2.index from http://download.eclipse.org/releases/neon/201703231000/
21:24:00 [INFO] Fetching p2.index from http://download.eclipse.org/releases/neon/201606221000/
21:24:00 [INFO] Fetching p2.index from http://download.eclipse.org/releases/neon/201606221000/
21:24:02 [INFO] Fetching p2.index from http://download.eclipse.org/releases/neon/201609281000/
21:24:02 [INFO] Fetching p2.index from http://download.eclipse.org/releases/neon/201609281000/
21:24:03 [INFO] Fetching p2.index from http://download.eclipse.org/releases/neon/201610111000/
21:24:03 [INFO] Fetching p2.index from http://download.eclipse.org/releases/neon/201610111000/
21:24:04 [INFO] Fetching p2.index from http://download.eclipse.org/releases/neon/201612211000/
21:24:04 [INFO] Fetching p2.index from http://download.eclipse.org/releases/neon/201612211000/
21:24:11 [INFO] Fetching p2.index from https://repo.eclipse.org/content/unzip/snapshots.unzip/org/eclipse/jgit/org.eclipse.jgit.repository/5.4.0-SNAPSHOT/org.eclipse.jgit.repository-5.4.0-SNAPSHOT.zip-unzip/ (172B)
21:24:11 [INFO] Fetching p2.index from https://repo.eclipse.org/content/unzip/snapshots.unzip/org/eclipse/jgit/org.eclipse.jgit.repository/5.4.0-SNAPSHOT/org.eclipse.jgit.repository-5.4.0-SNAPSHOT.zip-unzip/ (172B)
21:24:11 [INFO] Adding repository https://repo.eclipse.org/content/unzip/snapshots.unzip/org/eclipse/jgit/org.eclipse.jgit.repository/5.4.0-SNAPSHOT/org.eclipse.jgit.repository-5.4.0-SNAPSHOT.zip-unzip
21:24:11 [INFO] Fetching p2.index from http://download.eclipse.org/cbi/updates/license/
21:24:11 [INFO] Fetching p2.index from http://download.eclipse.org/cbi/updates/license/
21:24:11 [INFO] Adding repository http://download.eclipse.org/cbi/updates/license
21:24:11 [INFO] Fetching p2.index from http://download.eclipse.org/cbi/updates/license/2.0.0.v20180130-0820/
21:24:11 [INFO] Fetching p2.index from http://download.eclipse.org/cbi/updates/license/2.0.0.v20180130-0820/
21:24:11 [INFO] Fetching p2.index from http://download.eclipse.org/cbi/updates/license/2.0.1.v20180423-1114/
21:24:11 [INFO] Fetching p2.index from http://download.eclipse.org/cbi/updates/license/2.0.1.v20180423-1114/
21:24:12 [INFO] Resolving dependencies of MavenProject: org.eclipse.egit:org.eclipse.egit.mylyn.ui.test:5.4.0-SNAPSHOT @ /home/jenkins/workspace/egit.gerrit/repo/org.eclipse.egit.mylyn.ui.test/pom.xml
21:24:12 [WARNING] The following locally built units have been used to resolve project dependencies:
21:24:12 [WARNING]   org.eclipse.egit.mylyn.ui/5.4.0.201903220058
21:24:12 [WARNING]   org.eclipse.egit.feature.jar/5.4.0.201903220058
21:24:12 [WARNING]   org.eclipse.egit.mylyn.feature.jar/5.4.0.201903220058
21:24:12 [WARNING]   org.eclipse.egit.mylyn.feature.group/5.4.0.201903220058
21:24:12 [WARNING]   org.eclipse.egit.core/5.4.0.201903220058
21:24:12 [WARNING]   org.eclipse.egit.doc/5.4.0.201903220058
21:24:12 [WARNING]   org.eclipse.egit.ui/5.4.0.201903220058
21:24:12 [WARNING]   org.eclipse.egit/5.4.0.201903220058
21:24:12 [WARNING]   org.eclipse.egit.feature.group/5.4.0.201903220058
21:24:12 [INFO] Resolving class path of MavenProject: org.eclipse.egit:org.eclipse.egit.mylyn.ui.test:5.4.0-SNAPSHOT @ /home/jenkins/workspace/egit.gerrit/repo/org.eclipse.egit.mylyn.ui.test/pom.xml
21:24:13 [INFO] 
21:24:13 [INFO] ----------< org.eclipse.egit:org.eclipse.egit.mylyn.ui.test >-----------
21:24:13 [INFO] Building EGit Mylyn UI Test Plug-in 5.4.0-SNAPSHOT
21:24:13 [INFO] ------------------------[ eclipse-test-plugin ]-------------------------
21:24:13 [INFO] 
21:24:13 [INFO] --- tycho-packaging-plugin:1.3.0:build-qualifier (default-build-qualifier) @ org.eclipse.egit.mylyn.ui.test ---
21:24:13 [INFO] The project's OSGi version is 5.4.0.201903220123
21:24:13 [INFO] 
21:24:13 [INFO] --- tycho-packaging-plugin:1.3.0:validate-id (default-validate-id) @ org.eclipse.egit.mylyn.ui.test ---
21:24:13 [INFO] 
21:24:13 [INFO] --- tycho-packaging-plugin:1.3.0:validate-version (default-validate-version) @ org.eclipse.egit.mylyn.ui.test ---
21:24:13 [INFO] 
21:24:13 [INFO] --- maven-enforcer-plugin:3.0.0-M2:enforce (enforce-maven) @ org.eclipse.egit.mylyn.ui.test ---
21:24:13 [INFO] 
21:24:13 [INFO] --- maven-resources-plugin:2.4.3:resources (default-resources) @ org.eclipse.egit.mylyn.ui.test ---
21:24:13 [INFO] Using 'UTF-8' encoding to copy filtered resources.
21:24:13 [INFO] skip non existing resourceDirectory /home/jenkins/workspace/egit.gerrit/repo/org.eclipse.egit.mylyn.ui.test/src/main/resources
21:24:13 [INFO] 
21:24:13 [INFO] --- tycho-compiler-plugin:1.3.0:compile (default-compile) @ org.eclipse.egit.mylyn.ui.test ---
21:24:13 [INFO] Nothing to compile - all classes are up to date
21:24:13 [INFO] 
21:24:13 [INFO] --- maven-resources-plugin:2.4.3:testResources (default-testResources) @ org.eclipse.egit.mylyn.ui.test ---
21:24:13 [INFO] Using 'UTF-8' encoding to copy filtered resources.
21:24:13 [INFO] skip non existing resourceDirectory /home/jenkins/workspace/egit.gerrit/repo/org.eclipse.egit.mylyn.ui.test/src/test/resources
21:24:13 [INFO] 
21:24:13 [INFO] --- target-platform-configuration:1.3.0:target-platform (default-target-platform) @ org.eclipse.egit.mylyn.ui.test ---
21:24:13 [INFO] 
21:24:13 [INFO] --- tycho-packaging-plugin:1.3.0:package-plugin (default-package-plugin) @ org.eclipse.egit.mylyn.ui.test ---
21:24:13 [INFO] Building jar: /home/jenkins/workspace/egit.gerrit/repo/org.eclipse.egit.mylyn.ui.test/target/org.eclipse.egit.mylyn.ui.test-5.4.0-SNAPSHOT.jar
21:24:13 [INFO] 
21:24:13 [INFO] --- tycho-p2-plugin:1.3.0:p2-metadata-default (default-p2-metadata-default) @ org.eclipse.egit.mylyn.ui.test ---
21:24:13 [INFO] 
21:24:13 [INFO] --- tycho-surefire-plugin:1.3.0:test (default-test) @ org.eclipse.egit.mylyn.ui.test ---
21:24:14 [INFO] Expected eclipse log file: /home/jenkins/workspace/egit.gerrit/repo/org.eclipse.egit.mylyn.ui.test/target/work/data/.metadata/.log
21:24:14 [INFO] Command line:
21:24:14 	[/opt/tools/java/oracle/jdk-8/1.8.0_202/jre/bin/java, -Dosgi.noShutdown=false, -Dosgi.os=linux, -Dosgi.ws=gtk, -Dosgi.arch=x86_64, -Declipse.consoleLog=true, -Degit.test.tmpdir=/home/jenkins/workspace/egit.gerrit/tmp/egit.tmp/, -Xmx512m, -Dosgi.clean=true, -jar, /home/jenkins/workspace/egit.gerrit/.repository/p2/osgi/bundle/org.eclipse.equinox.launcher/1.3.201.v20161025-1711/org.eclipse.equinox.launcher-1.3.201.v20161025-1711.jar, -data, /home/jenkins/workspace/egit.gerrit/repo/org.eclipse.egit.mylyn.ui.test/target/work/data, -install, /home/jenkins/workspace/egit.gerrit/repo/org.eclipse.egit.mylyn.ui.test/target/work, -configuration, /home/jenkins/workspace/egit.gerrit/repo/org.eclipse.egit.mylyn.ui.test/target/work/configuration, -application, org.eclipse.tycho.surefire.osgibooter.uitest, -testproperties, /home/jenkins/workspace/egit.gerrit/repo/org.eclipse.egit.mylyn.ui.test/target/surefire.properties, -testApplication, org.eclipse.ui.ide.workbench]
21:24:14 Picked up JAVA_TOOL_OPTIONS: -XX:+IgnoreUnrecognizedVMOptions -XX:+UseContainerSupport -XX:+UnlockExperimentalVMOptions -XX:+UseCGroupMemoryLimitForHeap
21:24:14 Picked up _JAVA_OPTIONS: -XX:MaxRAMPercentage=64.0
21:24:16 !SESSION 2019-03-22 01:24:14.701 -----------------------------------------------
21:24:16 eclipse.buildId=unknown
21:24:16 java.version=1.8.0_202
21:24:16 java.vendor=Oracle Corporation
21:24:16 BootLoader constants: OS=linux, ARCH=x86_64, WS=gtk, NL=en_US
21:24:16 Framework arguments:  -application org.eclipse.tycho.surefire.osgibooter.uitest -testproperties /home/jenkins/workspace/egit.gerrit/repo/org.eclipse.egit.mylyn.ui.test/target/surefire.properties -testApplication org.eclipse.ui.ide.workbench
21:24:16 Command-line arguments:  -data /home/jenkins/workspace/egit.gerrit/repo/org.eclipse.egit.mylyn.ui.test/target/work/data -application org.eclipse.tycho.surefire.osgibooter.uitest -testproperties /home/jenkins/workspace/egit.gerrit/repo/org.eclipse.egit.mylyn.ui.test/target/surefire.properties -testApplication org.eclipse.ui.ide.workbench
21:24:16 
21:24:16 !ENTRY org.eclipse.jdt.launching.macosx 4 0 2019-03-22 01:24:16.542
21:24:16 !MESSAGE FrameworkEvent ERROR
21:24:16 !STACK 0
21:24:16 org.osgi.framework.BundleException: Could not resolve module: org.eclipse.jdt.launching.macosx [246]
21:24:16   Unresolved requirement: Require-Capability: eclipse.platform; filter:="(osgi.os=macosx)"
21:24:16 
21:24:16 	at org.eclipse.osgi.container.Module.start(Module.java:444)
21:24:16 	at org.eclipse.osgi.container.ModuleContainer$ContainerStartLevel.incStartLevel(ModuleContainer.java:1620)
21:24:16 	at org.eclipse.osgi.container.ModuleContainer$ContainerStartLevel.incStartLevel(ModuleContainer.java:1599)
21:24:16 	at org.eclipse.osgi.container.ModuleContainer$ContainerStartLevel.doContainerStartLevel(ModuleContainer.java:1571)
21:24:16 	at org.eclipse.osgi.container.ModuleContainer$ContainerStartLevel.dispatchEvent(ModuleContainer.java:1514)
21:24:16 	at org.eclipse.osgi.container.ModuleContainer$ContainerStartLevel.dispatchEvent(ModuleContainer.java:1)
21:24:16 	at org.eclipse.osgi.framework.eventmgr.EventManager.dispatchEvent(EventManager.java:230)
21:24:16 	at org.eclipse.osgi.framework.eventmgr.EventManager$EventThread.run(EventManager.java:340)
21:24:16 
21:24:16 !ENTRY org.eclipse.jdt.launching.ui.macosx 4 0 2019-03-22 01:24:16.544
21:24:16 !MESSAGE FrameworkEvent ERROR
21:24:16 !STACK 0
21:24:16 org.osgi.framework.BundleException: Could not resolve module: org.eclipse.jdt.launching.ui.macosx [247]
21:24:16   Unresolved requirement: Require-Capability: eclipse.platform; filter:="(osgi.os=macosx)"
21:24:16 
21:24:16 	at org.eclipse.osgi.container.Module.start(Module.java:444)
21:24:16 	at org.eclipse.osgi.container.ModuleContainer$ContainerStartLevel.incStartLevel(ModuleContainer.java:1620)
21:24:16 	at org.eclipse.osgi.container.ModuleContainer$ContainerStartLevel.incStartLevel(ModuleContainer.java:1599)
21:24:16 	at org.eclipse.osgi.container.ModuleContainer$ContainerStartLevel.doContainerStartLevel(ModuleContainer.java:1571)
21:24:16 	at org.eclipse.osgi.container.ModuleContainer$ContainerStartLevel.dispatchEvent(ModuleContainer.java:1514)
21:24:16 	at org.eclipse.osgi.container.ModuleContainer$ContainerStartLevel.dispatchEvent(ModuleContainer.java:1)
21:24:16 	at org.eclipse.osgi.framework.eventmgr.EventManager.dispatchEvent(EventManager.java:230)
21:24:16 	at org.eclipse.osgi.framework.eventmgr.EventManager$EventThread.run(EventManager.java:340)
21:24:16 Launching application org.eclipse.ui.ide.workbench...
21:24:18 
21:24:18 !ENTRY org.eclipse.egit.core 1 0 2019-03-22 01:24:18.820
21:24:18 !MESSAGE Using Apache MINA sshd as ssh client.
21:24:19 
21:24:19 (SWT:2496): Gtk-WARNING **: 01:24:19.545: Negative content width -6 (allocation 1, extents 4x3) while allocating gadget (node toolbar, owner GtkToolbar)
21:24:19 
21:24:19 (SWT:2496): Gtk-WARNING **: 01:24:19.545: Negative content height -3 (allocation 1, extents 2x2) while allocating gadget (node toolbar, owner GtkToolbar)
21:24:19 
21:24:19 (SWT:2496): Gtk-WARNING **: 01:24:19.545: Negative content width -6 (allocation 1, extents 4x3) while allocating gadget (node toolbar, owner GtkToolbar)
21:24:19 
21:24:19 (SWT:2496): Gtk-WARNING **: 01:24:19.545: Negative content height -3 (allocation 1, extents 2x2) while allocating gadget (node toolbar, owner GtkToolbar)
21:24:19 
21:24:19 (SWT:2496): Gtk-WARNING **: 01:24:19.551: Negative content width -6 (allocation 1, extents 4x3) while allocating gadget (node toolbar, owner GtkToolbar)
21:24:19 
21:24:19 (SWT:2496): Gtk-WARNING **: 01:24:19.551: Negative content height -3 (allocation 1, extents 2x2) while allocating gadget (node toolbar, owner GtkToolbar)
21:24:19 
21:24:19 (SWT:2496): Gtk-WARNING **: 01:24:19.551: Negative content width -6 (allocation 1, extents 4x3) while allocating gadget (node toolbar, owner GtkToolbar)
21:24:19 
21:24:19 (SWT:2496): Gtk-WARNING **: 01:24:19.551: Negative content height -3 (allocation 1, extents 2x2) while allocating gadget (node toolbar, owner GtkToolbar)
21:24:20 
21:24:20 (SWT:2496): Gtk-WARNING **: 01:24:20.070: Negative content width -6 (allocation 1, extents 4x3) while allocating gadget (node toolbar, owner GtkToolbar)
21:24:20 
21:24:20 (SWT:2496): Gtk-WARNING **: 01:24:20.070: Negative content height -3 (allocation 1, extents 2x2) while allocating gadget (node toolbar, owner GtkToolbar)
21:24:20 
21:24:20 (SWT:2496): Gtk-WARNING **: 01:24:20.070: Negative content width -6 (allocation 1, extents 4x3) while allocating gadget (node toolbar, owner GtkToolbar)
21:24:20 
21:24:20 (SWT:2496): Gtk-WARNING **: 01:24:20.070: Negative content height -3 (allocation 1, extents 2x2) while allocating gadget (node toolbar, owner GtkToolbar)
21:24:20 
21:24:20 (SWT:2496): Gtk-WARNING **: 01:24:20.451: Negative content width -6 (allocation 1, extents 4x3) while allocating gadget (node toolbar, owner GtkToolbar)
21:24:20 
21:24:20 (SWT:2496): Gtk-WARNING **: 01:24:20.451: Negative content height -3 (allocation 1, extents 2x2) while allocating gadget (node toolbar, owner GtkToolbar)
21:24:20 
21:24:20 (SWT:2496): Gtk-WARNING **: 01:24:20.451: Negative content width -6 (allocation 1, extents 4x3) while allocating gadget (node toolbar, owner GtkToolbar)
21:24:20 
21:24:20 (SWT:2496): Gtk-WARNING **: 01:24:20.451: Negative content height -3 (allocation 1, extents 2x2) while allocating gadget (node toolbar, owner GtkToolbar)
21:24:20 
21:24:20 (SWT:2496): Gtk-WARNING **: 01:24:20.467: Negative content width -6 (allocation 1, extents 4x3) while allocating gadget (node toolbar, owner GtkToolbar)
21:24:20 
21:24:20 (SWT:2496): Gtk-WARNING **: 01:24:20.467: Negative content height -3 (allocation 1, extents 2x2) while allocating gadget (node toolbar, owner GtkToolbar)
21:24:20 
21:24:20 (SWT:2496): Gtk-WARNING **: 01:24:20.467: Negative content width -6 (allocation 1, extents 4x3) while allocating gadget (node toolbar, owner GtkToolbar)
21:24:20 
21:24:20 (SWT:2496): Gtk-WARNING **: 01:24:20.467: Negative content height -3 (allocation 1, extents 2x2) while allocating gadget (node toolbar, owner GtkToolbar)
21:24:20 
21:24:20 (SWT:2496): Gtk-WARNING **: 01:24:20.470: Negative content width -6 (allocation 1, extents 4x3) while allocating gadget (node toolbar, owner GtkToolbar)
21:24:20 
21:24:20 (SWT:2496): Gtk-WARNING **: 01:24:20.470: Negative content height -3 (allocation 1, extents 2x2) while allocating gadget (node toolbar, owner GtkToolbar)
21:24:20 
21:24:20 (SWT:2496): Gtk-WARNING **: 01:24:20.470: Negative content width -6 (allocation 1, extents 4x3) while allocating gadget (node toolbar, owner GtkToolbar)
21:24:20 
21:24:20 (SWT:2496): Gtk-WARNING **: 01:24:20.470: Negative content height -3 (allocation 1, extents 2x2) while allocating gadget (node toolbar, owner GtkToolbar)
21:24:20 
21:24:20 (SWT:2496): Gtk-WARNING **: 01:24:20.475: Negative content width -6 (allocation 1, extents 4x3) while allocating gadget (node toolbar, owner GtkToolbar)
21:24:20 
21:24:20 (SWT:2496): Gtk-WARNING **: 01:24:20.475: Negative content height -3 (allocation 1, extents 2x2) while allocating gadget (node toolbar, owner GtkToolbar)
21:24:20 
21:24:20 (SWT:2496): Gtk-WARNING **: 01:24:20.475: Negative content width -6 (allocation 1, extents 4x3) while allocating gadget (node toolbar, owner GtkToolbar)
21:24:20 
21:24:20 (SWT:2496): Gtk-WARNING **: 01:24:20.475: Negative content height -3 (allocation 1, extents 2x2) while allocating gadget (node toolbar, owner GtkToolbar)
21:24:21 
21:24:21 (SWT:2496): Gtk-WARNING **: 01:24:21.200: Negative content height -9 (allocation 1, extents 5x5) while allocating gadget (node button, owner GtkButton)
21:24:21 
21:24:21 (SWT:2496): Gtk-WARNING **: 01:24:21.284: Negative content width -6 (allocation 1, extents 4x3) while allocating gadget (node toolbar, owner GtkToolbar)
21:24:21 
21:24:21 (SWT:2496): Gtk-WARNING **: 01:24:21.284: Negative content height -3 (allocation 1, extents 2x2) while allocating gadget (node toolbar, owner GtkToolbar)
21:24:21 
21:24:21 (SWT:2496): Gtk-WARNING **: 01:24:21.284: Negative content width -6 (allocation 1, extents 4x3) while allocating gadget (node toolbar, owner GtkToolbar)
21:24:21 
21:24:21 (SWT:2496): Gtk-WARNING **: 01:24:21.284: Negative content height -3 (allocation 1, extents 2x2) while allocating gadget (node toolbar, owner GtkToolbar)
21:24:21 
21:24:21 (SWT:2496): Gtk-WARNING **: 01:24:21.293: Negative content width -6 (allocation 1, extents 4x3) while allocating gadget (node toolbar, owner GtkToolbar)
21:24:21 
21:24:21 (SWT:2496): Gtk-WARNING **: 01:24:21.293: Negative content height -3 (allocation 1, extents 2x2) while allocating gadget (node toolbar, owner GtkToolbar)
21:24:21 
21:24:21 (SWT:2496): Gtk-WARNING **: 01:24:21.294: Negative content width -6 (allocation 1, extents 4x3) while allocating gadget (node toolbar, owner GtkToolbar)
21:24:21 
21:24:21 (SWT:2496): Gtk-WARNING **: 01:24:21.294: Negative content height -3 (allocation 1, extents 2x2) while allocating gadget (node toolbar, owner GtkToolbar)
21:24:21 
21:24:21 (SWT:2496): Gtk-WARNING **: 01:24:21.321: Negative content width -6 (allocation 1, extents 4x3) while allocating gadget (node toolbar, owner GtkToolbar)
21:24:21 
21:24:21 (SWT:2496): Gtk-WARNING **: 01:24:21.324: Negative content width -6 (allocation 1, extents 4x3) while allocating gadget (node toolbar, owner GtkToolbar)
21:24:21 
21:24:21 (SWT:2496): Gtk-WARNING **: 01:24:21.330: Negative content width -6 (allocation 1, extents 4x3) while allocating gadget (node toolbar, owner GtkToolbar)
21:24:21 
21:24:21 (SWT:2496): Gtk-WARNING **: 01:24:21.332: Negative content width -6 (allocation 1, extents 4x3) while allocating gadget (node toolbar, owner GtkToolbar)
21:24:21 
21:24:21 (SWT:2496): Gtk-WARNING **: 01:24:21.335: Negative content width -6 (allocation 1, extents 4x3) while allocating gadget (node toolbar, owner GtkToolbar)
21:24:21 
21:24:21 (SWT:2496): Gtk-WARNING **: 01:24:21.335: Negative content width -1 (allocation 1, extents 1x1) while allocating gadget (node trough, owner GtkProgressBar)
21:24:21 
21:24:21 (SWT:2496): Gtk-WARNING **: 01:24:21.335: Negative content width -1 (allocation 1, extents 1x1) while allocating gadget (node trough, owner GtkProgressBar)
21:24:21 
21:24:21 (SWT:2496): Gtk-WARNING **: 01:24:21.374: Negative content width -6 (allocation 1, extents 4x3) while allocating gadget (node toolbar, owner GtkToolbar)
21:24:21 
21:24:21 (SWT:2496): Gtk-WARNING **: 01:24:21.375: Negative content width -6 (allocation 1, extents 4x3) while allocating gadget (node toolbar, owner GtkToolbar)
21:24:21 
21:24:21 (SWT:2496): Gtk-WARNING **: 01:24:21.379: Negative content width -6 (allocation 1, extents 4x3) while allocating gadget (node toolbar, owner GtkToolbar)
21:24:21 
21:24:21 (SWT:2496): Gtk-WARNING **: 01:24:21.379: Negative content width -6 (allocation 1, extents 4x3) while allocating gadget (node toolbar, owner GtkToolbar)
21:24:21 
21:24:21 (SWT:2496): Gtk-WARNING **: 01:24:21.383: Negative content width -6 (allocation 1, extents 4x3) while allocating gadget (node toolbar, owner GtkToolbar)
21:24:21 
21:24:21 (SWT:2496): Gtk-WARNING **: 01:24:21.384: Negative content width -6 (allocation 1, extents 4x3) while allocating gadget (node toolbar, owner GtkToolbar)
21:24:21 Running org.eclipse.egit.internal.mylyn.CommitHyperlinkDetectorTest
21:24:21 Tests run: 14, Failures: 0, Errors: 0, Skipped: 0, Time elapsed: 0.115 s - in org.eclipse.egit.internal.mylyn.CommitHyperlinkDetectorTest
21:24:21 testEndLine(org.eclipse.egit.internal.mylyn.CommitHyperlinkDetectorTest)  Time elapsed: 0.054 s
21:24:21 testGerritId(org.eclipse.egit.internal.mylyn.CommitHyperlinkDetectorTest)  Time elapsed: 0.003 s
21:24:21 testMiddleLine(org.eclipse.egit.internal.mylyn.CommitHyperlinkDetectorTest)  Time elapsed: 0.004 s
21:24:21 testOffsetOff(org.eclipse.egit.internal.mylyn.CommitHyperlinkDetectorTest)  Time elapsed: 0.002 s
21:24:21 testEmpty(org.eclipse.egit.internal.mylyn.CommitHyperlinkDetectorTest)  Time elapsed: 0.003 s
21:24:21 testBadLocation(org.eclipse.egit.internal.mylyn.CommitHyperlinkDetectorTest)  Time elapsed: 0.003 s
21:24:21 testEndSentence(org.eclipse.egit.internal.mylyn.CommitHyperlinkDetectorTest)  Time elapsed: 0.003 s
21:24:21 testMultiLine(org.eclipse.egit.internal.mylyn.CommitHyperlinkDetectorTest)  Time elapsed: 0.003 s
21:24:21 testBeginSentence(org.eclipse.egit.internal.mylyn.CommitHyperlinkDetectorTest)  Time elapsed: 0.003 s
21:24:21 testGerritIdWithinText(org.eclipse.egit.internal.mylyn.CommitHyperlinkDetectorTest)  Time elapsed: 0.002 s
21:24:21 testMultiId(org.eclipse.egit.internal.mylyn.CommitHyperlinkDetectorTest)  Time elapsed: 0.003 s
21:24:21 testSimpleId(org.eclipse.egit.internal.mylyn.CommitHyperlinkDetectorTest)  Time elapsed: 0.003 s
21:24:21 testNoDocument(org.eclipse.egit.internal.mylyn.CommitHyperlinkDetectorTest)  Time elapsed: 0.003 s
21:24:21 testOffsetMiddle(org.eclipse.egit.internal.mylyn.CommitHyperlinkDetectorTest)  Time elapsed: 0.002 s
21:24:21 
21:24:21 Results:
21:24:21 
21:24:21 Tests run: 14, Failures: 0, Errors: 0, Skipped: 0
21:24:21 
21:24:21 
21:24:21 (SWT:2496): Gtk-WARNING **: 01:24:21.666: Negative content width -6 (allocation 1, extents 4x3) while allocating gadget (node toolbar, owner GtkToolbar)
21:24:21 
21:24:21 (SWT:2496): Gtk-WARNING **: 01:24:21.667: Negative content width -6 (allocation 1, extents 4x3) while allocating gadget (node toolbar, owner GtkToolbar)
21:24:24 [INFO] All tests passed!
21:24:24 [INFO] 
21:24:24 [INFO] >>> maven-pmd-plugin:3.11.0:cpd-check (default) > :cpd @ org.eclipse.egit.mylyn.ui.test >>>
21:24:24 [INFO] 
21:24:24 [INFO] --- maven-pmd-plugin:3.11.0:cpd (cpd) @ org.eclipse.egit.mylyn.ui.test ---
21:24:24 [INFO] 
21:24:24 [INFO] <<< maven-pmd-plugin:3.11.0:cpd-check (default) < :cpd @ org.eclipse.egit.mylyn.ui.test <<<
21:24:24 [INFO] 
21:24:24 [INFO] 
21:24:24 [INFO] --- maven-pmd-plugin:3.11.0:cpd-check (default) @ org.eclipse.egit.mylyn.ui.test ---
21:24:24 [INFO] 
21:24:24 [INFO] ------------------------------------------------------------------------
21:24:24 [INFO] BUILD SUCCESS
21:24:24 [INFO] ------------------------------------------------------------------------
21:24:24 [INFO] Total time: 36.865 s
21:24:24 [INFO] Finished at: 2019-03-22T01:24:24Z
21:24:24 [INFO] ------------------------------------------------------------------------
21:24:25 Terminating xvnc.
21:28:27 [FINDBUGS] Collecting findbugs analysis files...
21:28:31 [FINDBUGS] Searching for all files in /home/jenkins/workspace/egit.gerrit that match the pattern repo/*/target/*bugsXml.xml
21:28:31 [FINDBUGS] Parsing 12 files in /home/jenkins/workspace/egit.gerrit
21:28:31 [FINDBUGS] Successfully parsed file /home/jenkins/workspace/egit.gerrit/repo/org.eclipse.egit.core.junit/target/spotbugsXml.xml with 4 unique warnings and 0 duplicates.
21:28:31 [FINDBUGS] Successfully parsed file /home/jenkins/workspace/egit.gerrit/repo/org.eclipse.egit.core.test/target/spotbugsXml.xml with 10 unique warnings and 0 duplicates.
21:28:31 [FINDBUGS] Successfully parsed file /home/jenkins/workspace/egit.gerrit/repo/org.eclipse.egit.core/target/spotbugsXml.xml with 21 unique warnings and 0 duplicates.
21:28:31 [FINDBUGS] Successfully parsed file /home/jenkins/workspace/egit.gerrit/repo/org.eclipse.egit.gitflow.test/target/spotbugsXml.xml with 21 unique warnings and 0 duplicates.
21:28:31 [FINDBUGS] Successfully parsed file /home/jenkins/workspace/egit.gerrit/repo/org.eclipse.egit.gitflow.ui/target/spotbugsXml.xml with 21 unique warnings and 0 duplicates.
21:28:31 [FINDBUGS] Successfully parsed file /home/jenkins/workspace/egit.gerrit/repo/org.eclipse.egit.gitflow/target/spotbugsXml.xml with 23 unique warnings and 0 duplicates.
21:28:31 [FINDBUGS] Successfully parsed file /home/jenkins/workspace/egit.gerrit/repo/org.eclipse.egit.mylyn.ui.test/target/spotbugsXml.xml with 23 unique warnings and 0 duplicates.
21:28:31 [FINDBUGS] Successfully parsed file /home/jenkins/workspace/egit.gerrit/repo/org.eclipse.egit.mylyn.ui/target/spotbugsXml.xml with 23 unique warnings and 0 duplicates.
21:28:31 [FINDBUGS] Successfully parsed file /home/jenkins/workspace/egit.gerrit/repo/org.eclipse.egit.ui.importer.tests/target/spotbugsXml.xml with 23 unique warnings and 0 duplicates.
21:28:31 [FINDBUGS] Successfully parsed file /home/jenkins/workspace/egit.gerrit/repo/org.eclipse.egit.ui.smartimport/target/spotbugsXml.xml with 23 unique warnings and 0 duplicates.
21:28:31 [FINDBUGS] Successfully parsed file /home/jenkins/workspace/egit.gerrit/repo/org.eclipse.egit.ui.test/target/spotbugsXml.xml with 45 unique warnings and 0 duplicates.
21:28:31 [FINDBUGS] Successfully parsed file /home/jenkins/workspace/egit.gerrit/repo/org.eclipse.egit.ui/target/spotbugsXml.xml with 80 unique warnings and 0 duplicates.
21:28:31 No credentials specified
21:28:31 <Git Blamer> Using GitBlamer to create author and commit information for all warnings.
21:28:31 <Git Blamer> GIT_COMMIT=df1a467b47432ab761dcf0c4f0f48869e23a70c2, workspace=/home/jenkins/workspace/egit.gerrit/repo
21:28:31  > /usr/bin/git rev-parse df1a467b47432ab761dcf0c4f0f48869e23a70c2^{commit} # timeout=10
21:28:38 <Git Blamer> Skipping file /home/jenkins/workspace/egit.gerrit/repo/org.eclipse.egit.ui.test/src/org/eclipse/egit/ui/view/repositories/GitRepositoriesViewTestBase.java, no result found.
21:28:38 [FINDBUGS] Computing warning deltas based on reference build #11575
21:28:39 [DRY] Collecting duplicate code analysis files...
21:28:39 [DRY] Searching for all files in /home/jenkins/workspace/egit.gerrit that match the pattern **/cpd.xml
21:28:39 [DRY] Parsing 19 files in /home/jenkins/workspace/egit.gerrit
21:28:39 [DRY] Successfully parsed file /home/jenkins/workspace/egit.gerrit/repo/org.eclipse.egit-feature/target/cpd.xml with 0 unique warnings and 0 duplicates.
21:28:39 [DRY] Successfully parsed file /home/jenkins/workspace/egit.gerrit/repo/org.eclipse.egit.core.junit/target/cpd.xml with 0 unique warnings and 0 duplicates.
21:28:39 [DRY] Successfully parsed file /home/jenkins/workspace/egit.gerrit/repo/org.eclipse.egit.core.test/target/cpd.xml with 0 unique warnings and 0 duplicates.
21:28:39 [DRY] Successfully parsed file /home/jenkins/workspace/egit.gerrit/repo/org.eclipse.egit.core/target/cpd.xml with 4 unique warnings and 0 duplicates.
21:28:39 [DRY] Successfully parsed file /home/jenkins/workspace/egit.gerrit/repo/org.eclipse.egit.doc/target/cpd.xml with 4 unique warnings and 0 duplicates.
21:28:39 [DRY] Successfully parsed file /home/jenkins/workspace/egit.gerrit/repo/org.eclipse.egit.gitflow-feature/target/cpd.xml with 4 unique warnings and 0 duplicates.
21:28:39 [DRY] Successfully parsed file /home/jenkins/workspace/egit.gerrit/repo/org.eclipse.egit.gitflow.test/target/cpd.xml with 4 unique warnings and 0 duplicates.
21:28:39 [DRY] Successfully parsed file /home/jenkins/workspace/egit.gerrit/repo/org.eclipse.egit.gitflow.ui/target/cpd.xml with 4 unique warnings and 0 duplicates.
21:28:39 [DRY] Successfully parsed file /home/jenkins/workspace/egit.gerrit/repo/org.eclipse.egit.gitflow/target/cpd.xml with 4 unique warnings and 0 duplicates.
21:28:39 [DRY] Successfully parsed file /home/jenkins/workspace/egit.gerrit/repo/org.eclipse.egit.mylyn-feature/target/cpd.xml with 4 unique warnings and 0 duplicates.
21:28:39 [DRY] Successfully parsed file /home/jenkins/workspace/egit.gerrit/repo/org.eclipse.egit.mylyn.ui.test/target/cpd.xml with 4 unique warnings and 0 duplicates.
21:28:39 [DRY] Successfully parsed file /home/jenkins/workspace/egit.gerrit/repo/org.eclipse.egit.mylyn.ui/target/cpd.xml with 4 unique warnings and 0 duplicates.
21:28:39 [DRY] Successfully parsed file /home/jenkins/workspace/egit.gerrit/repo/org.eclipse.egit.repository/target/cpd.xml with 4 unique warnings and 0 duplicates.
21:28:39 [DRY] Successfully parsed file /home/jenkins/workspace/egit.gerrit/repo/org.eclipse.egit.source-feature/target/cpd.xml with 4 unique warnings and 0 duplicates.
21:28:39 [DRY] Successfully parsed file /home/jenkins/workspace/egit.gerrit/repo/org.eclipse.egit.ui.importer.tests/target/cpd.xml with 4 unique warnings and 0 duplicates.
21:28:39 [DRY] Successfully parsed file /home/jenkins/workspace/egit.gerrit/repo/org.eclipse.egit.ui.smartimport/target/cpd.xml with 4 unique warnings and 0 duplicates.
21:28:39 [DRY] Successfully parsed file /home/jenkins/workspace/egit.gerrit/repo/org.eclipse.egit.ui.test/target/cpd.xml with 4 unique warnings and 0 duplicates.
21:28:39 [DRY] Successfully parsed file /home/jenkins/workspace/egit.gerrit/repo/org.eclipse.egit.ui/target/cpd.xml with 37 unique warnings and 0 duplicates.
21:28:39 [DRY] Successfully parsed file /home/jenkins/workspace/egit.gerrit/repo/org.eclipse.egit/target/cpd.xml with 37 unique warnings and 0 duplicates.
21:28:39 No credentials specified
21:28:39 <Git Blamer> Using GitBlamer to create author and commit information for all warnings.
21:28:39 <Git Blamer> GIT_COMMIT=df1a467b47432ab761dcf0c4f0f48869e23a70c2, workspace=/home/jenkins/workspace/egit.gerrit/repo
21:28:39  > /usr/bin/git rev-parse df1a467b47432ab761dcf0c4f0f48869e23a70c2^{commit} # timeout=10
21:28:43 [DRY] Computing warning deltas based on reference build #11575
21:28:44 Recording test results
21:28:44 Build step 'Publish JUnit test result report' changed build result to UNSTABLE
21:28:44 Archiving artifacts
21:28:48 Finished: UNSTABLE