UnstableConsole Output

Skipping 1,585 KB.. Full Log
tent width -6 (allocation 1, extents 4x3) while allocating gadget (node toolbar, owner GtkToolbar)
18:39:41 
18:39:41 (SWT:1454): Gtk-WARNING **: 22:39:41.924: Negative content width -6 (allocation 1, extents 4x3) while allocating gadget (node toolbar, owner GtkToolbar)
18:39:42 
18:39:42 (SWT:1454): Gtk-CRITICAL **: 22:39:42.018: gtk_box_gadget_distribute: assertion 'size >= 0' failed in GtkScrollbar
18:39:42 
18:39:42 (SWT:1454): Gtk-WARNING **: 22:39:42.025: Negative content width -6 (allocation 1, extents 4x3) while allocating gadget (node toolbar, owner GtkToolbar)
18:39:42 
18:39:42 (SWT:1454): Gtk-WARNING **: 22:39:42.101: Negative content width -6 (allocation 1, extents 4x3) while allocating gadget (node toolbar, owner GtkToolbar)
18:39:43 
18:39:43 (SWT:1454): Gtk-WARNING **: 22:39:43.002: Negative content width -6 (allocation 1, extents 4x3) while allocating gadget (node toolbar, owner GtkToolbar)
18:39:43 
18:39:43 (SWT:1454): Gtk-WARNING **: 22:39:43.003: Negative content width -6 (allocation 1, extents 4x3) while allocating gadget (node toolbar, owner GtkToolbar)
18:39:43 
18:39:43 (SWT:1454): Gtk-WARNING **: 22:39:43.015: Negative content width -6 (allocation 1, extents 4x3) while allocating gadget (node toolbar, owner GtkToolbar)
18:39:43 
18:39:43 (SWT:1454): Gtk-CRITICAL **: 22:39:43.040: gtk_box_gadget_distribute: assertion 'size >= 0' failed in GtkScrollbar
18:39:43 
18:39:43 (SWT:1454): Gtk-CRITICAL **: 22:39:43.069: gtk_box_gadget_distribute: assertion 'size >= 0' failed in GtkScrollbar
18:39:43 
18:39:43 (SWT:1454): Gtk-CRITICAL **: 22:39:43.084: gtk_box_gadget_distribute: assertion 'size >= 0' failed in GtkScrollbar
18:39:43 
18:39:43 (SWT:1454): Gtk-CRITICAL **: 22:39:43.101: gtk_box_gadget_distribute: assertion 'size >= 0' failed in GtkScrollbar
18:39:43 
18:39:43 (SWT:1454): Gtk-CRITICAL **: 22:39:43.117: gtk_box_gadget_distribute: assertion 'size >= 0' failed in GtkScrollbar
18:39:43 
18:39:43 (SWT:1454): Gtk-CRITICAL **: 22:39:43.135: gtk_box_gadget_distribute: assertion 'size >= 0' failed in GtkScrollbar
18:39:43 
18:39:43 (SWT:1454): Gtk-WARNING **: 22:39:43.166: Negative content width -6 (allocation 1, extents 4x3) while allocating gadget (node toolbar, owner GtkToolbar)
18:39:43 
18:39:43 (SWT:1454): Gtk-CRITICAL **: 22:39:43.243: gtk_box_gadget_distribute: assertion 'size >= 0' failed in GtkScrollbar
18:39:43 
18:39:43 (SWT:1454): Gtk-CRITICAL **: 22:39:43.263: gtk_box_gadget_distribute: assertion 'size >= 0' failed in GtkScrollbar
18:39:43 
18:39:43 (SWT:1454): Gtk-CRITICAL **: 22:39:43.268: gtk_box_gadget_distribute: assertion 'size >= 0' failed in GtkScrollbar
18:39:43 
18:39:43 (SWT:1454): Gtk-WARNING **: 22:39:43.271: Negative content width -6 (allocation 1, extents 4x3) while allocating gadget (node toolbar, owner GtkToolbar)
18:39:43 
18:39:43 (SWT:1454): Gtk-WARNING **: 22:39:43.310: Negative content width -6 (allocation 1, extents 4x3) while allocating gadget (node toolbar, owner GtkToolbar)
18:39:43 
18:39:43 (SWT:1454): Gtk-CRITICAL **: 22:39:43.403: gtk_box_gadget_distribute: assertion 'size >= 0' failed in GtkScrollbar
18:39:43 
18:39:43 (SWT:1454): Gtk-WARNING **: 22:39:43.411: Negative content width -6 (allocation 1, extents 4x3) while allocating gadget (node toolbar, owner GtkToolbar)
18:39:43 
18:39:43 (SWT:1454): Gtk-WARNING **: 22:39:43.452: Negative content width -6 (allocation 1, extents 4x3) while allocating gadget (node toolbar, owner GtkToolbar)
18:39:43 
18:39:43 (SWT:1454): Gtk-CRITICAL **: 22:39:43.550: gtk_box_gadget_distribute: assertion 'size >= 0' failed in GtkScrollbar
18:39:43 
18:39:43 (SWT:1454): Gtk-WARNING **: 22:39:43.557: Negative content width -6 (allocation 1, extents 4x3) while allocating gadget (node toolbar, owner GtkToolbar)
18:39:43 
18:39:43 (SWT:1454): Gtk-WARNING **: 22:39:43.605: Negative content width -6 (allocation 1, extents 4x3) while allocating gadget (node toolbar, owner GtkToolbar)
18:39:43 
18:39:43 (SWT:1454): Gtk-CRITICAL **: 22:39:43.703: gtk_box_gadget_distribute: assertion 'size >= 0' failed in GtkScrollbar
18:39:43 
18:39:43 (SWT:1454): Gtk-WARNING **: 22:39:43.710: Negative content width -6 (allocation 1, extents 4x3) while allocating gadget (node toolbar, owner GtkToolbar)
18:39:43 
18:39:43 (SWT:1454): Gtk-WARNING **: 22:39:43.753: Negative content width -6 (allocation 1, extents 4x3) while allocating gadget (node toolbar, owner GtkToolbar)
18:39:43 
18:39:43 (SWT:1454): Gtk-CRITICAL **: 22:39:43.850: gtk_box_gadget_distribute: assertion 'size >= 0' failed in GtkScrollbar
18:39:43 
18:39:43 (SWT:1454): Gtk-WARNING **: 22:39:43.857: Negative content width -6 (allocation 1, extents 4x3) while allocating gadget (node toolbar, owner GtkToolbar)
18:39:43 
18:39:43 (SWT:1454): Gtk-WARNING **: 22:39:43.965: Negative content width -6 (allocation 1, extents 4x3) while allocating gadget (node toolbar, owner GtkToolbar)
18:39:44 
18:39:44 (SWT:1454): Gtk-CRITICAL **: 22:39:44.122: gtk_box_gadget_distribute: assertion 'size >= 0' failed in GtkScrollbar
18:39:44 
18:39:44 (SWT:1454): Gtk-WARNING **: 22:39:44.129: Negative content width -6 (allocation 1, extents 4x3) while allocating gadget (node toolbar, owner GtkToolbar)
18:39:44 
18:39:44 (SWT:1454): Gtk-WARNING **: 22:39:44.169: Negative content width -6 (allocation 1, extents 4x3) while allocating gadget (node toolbar, owner GtkToolbar)
18:39:44 
18:39:44 (SWT:1454): Gtk-CRITICAL **: 22:39:44.261: gtk_box_gadget_distribute: assertion 'size >= 0' failed in GtkScrollbar
18:39:44 
18:39:44 (SWT:1454): Gtk-WARNING **: 22:39:44.268: Negative content width -6 (allocation 1, extents 4x3) while allocating gadget (node toolbar, owner GtkToolbar)
18:39:44 
18:39:44 (SWT:1454): Gtk-WARNING **: 22:39:44.380: Negative content width -6 (allocation 1, extents 4x3) while allocating gadget (node toolbar, owner GtkToolbar)
18:39:45 
18:39:45 (SWT:1454): Gtk-WARNING **: 22:39:45.187: Negative content width -6 (allocation 1, extents 4x3) while allocating gadget (node toolbar, owner GtkToolbar)
18:39:45 
18:39:45 (SWT:1454): Gtk-WARNING **: 22:39:45.188: Negative content width -6 (allocation 1, extents 4x3) while allocating gadget (node toolbar, owner GtkToolbar)
18:39:45 
18:39:45 (SWT:1454): Gtk-WARNING **: 22:39:45.202: Negative content width -6 (allocation 1, extents 4x3) while allocating gadget (node toolbar, owner GtkToolbar)
18:39:45 
18:39:45 (SWT:1454): Gtk-CRITICAL **: 22:39:45.235: gtk_box_gadget_distribute: assertion 'size >= 0' failed in GtkScrollbar
18:39:45 
18:39:45 (SWT:1454): Gtk-CRITICAL **: 22:39:45.249: gtk_box_gadget_distribute: assertion 'size >= 0' failed in GtkScrollbar
18:39:45 
18:39:45 (SWT:1454): Gtk-CRITICAL **: 22:39:45.264: gtk_box_gadget_distribute: assertion 'size >= 0' failed in GtkScrollbar
18:39:45 
18:39:45 (SWT:1454): Gtk-CRITICAL **: 22:39:45.282: gtk_box_gadget_distribute: assertion 'size >= 0' failed in GtkScrollbar
18:39:45 
18:39:45 (SWT:1454): Gtk-CRITICAL **: 22:39:45.297: gtk_box_gadget_distribute: assertion 'size >= 0' failed in GtkScrollbar
18:39:45 
18:39:45 (SWT:1454): Gtk-CRITICAL **: 22:39:45.324: gtk_box_gadget_distribute: assertion 'size >= 0' failed in GtkScrollbar
18:39:45 
18:39:45 (SWT:1454): Gtk-CRITICAL **: 22:39:45.391: gtk_box_gadget_distribute: assertion 'size >= 0' failed in GtkScrollbar
18:39:45 
18:39:45 (SWT:1454): Gtk-CRITICAL **: 22:39:45.447: gtk_box_gadget_distribute: assertion 'size >= 0' failed in GtkScrollbar
18:39:45 
18:39:45 (SWT:1454): Gtk-WARNING **: 22:39:45.870: Negative content width -6 (allocation 1, extents 4x3) while allocating gadget (node toolbar, owner GtkToolbar)
18:39:46 
18:39:46 (SWT:1454): Gtk-WARNING **: 22:39:46.954: Negative content width -6 (allocation 1, extents 4x3) while allocating gadget (node toolbar, owner GtkToolbar)
18:39:46 
18:39:46 (SWT:1454): Gtk-WARNING **: 22:39:46.955: Negative content width -6 (allocation 1, extents 4x3) while allocating gadget (node toolbar, owner GtkToolbar)
18:39:46 
18:39:46 (SWT:1454): Gtk-WARNING **: 22:39:46.968: Negative content width -6 (allocation 1, extents 4x3) while allocating gadget (node toolbar, owner GtkToolbar)
18:39:46 
18:39:46 (SWT:1454): Gtk-CRITICAL **: 22:39:46.990: gtk_box_gadget_distribute: assertion 'size >= 0' failed in GtkScrollbar
18:39:47 
18:39:47 (SWT:1454): Gtk-CRITICAL **: 22:39:47.018: gtk_box_gadget_distribute: assertion 'size >= 0' failed in GtkScrollbar
18:39:47 
18:39:47 (SWT:1454): Gtk-CRITICAL **: 22:39:47.033: gtk_box_gadget_distribute: assertion 'size >= 0' failed in GtkScrollbar
18:39:47 
18:39:47 (SWT:1454): Gtk-CRITICAL **: 22:39:47.050: gtk_box_gadget_distribute: assertion 'size >= 0' failed in GtkScrollbar
18:39:47 
18:39:47 (SWT:1454): Gtk-CRITICAL **: 22:39:47.066: gtk_box_gadget_distribute: assertion 'size >= 0' failed in GtkScrollbar
18:39:47 
18:39:47 (SWT:1454): Gtk-CRITICAL **: 22:39:47.091: gtk_box_gadget_distribute: assertion 'size >= 0' failed in GtkScrollbar
18:39:47 
18:39:47 (SWT:1454): Gtk-CRITICAL **: 22:39:47.100: gtk_box_gadget_distribute: assertion 'size >= 0' failed in GtkScrollbar
18:39:47 
18:39:47 (SWT:1454): Gtk-WARNING **: 22:39:47.134: Negative content width -6 (allocation 1, extents 4x3) while allocating gadget (node toolbar, owner GtkToolbar)
18:39:47 
18:39:47 (SWT:1454): Gtk-CRITICAL **: 22:39:47.222: gtk_box_gadget_distribute: assertion 'size >= 0' failed in GtkScrollbar
18:39:47 
18:39:47 (SWT:1454): Gtk-CRITICAL **: 22:39:47.242: gtk_box_gadget_distribute: assertion 'size >= 0' failed in GtkScrollbar
18:39:47 
18:39:47 (SWT:1454): Gtk-CRITICAL **: 22:39:47.248: gtk_box_gadget_distribute: assertion 'size >= 0' failed in GtkScrollbar
18:39:47 
18:39:47 (SWT:1454): Gtk-WARNING **: 22:39:47.250: Negative content width -6 (allocation 1, extents 4x3) while allocating gadget (node toolbar, owner GtkToolbar)
18:39:47 
18:39:47 (SWT:1454): Gtk-WARNING **: 22:39:47.289: Negative content width -6 (allocation 1, extents 4x3) while allocating gadget (node toolbar, owner GtkToolbar)
18:39:47 
18:39:47 (SWT:1454): Gtk-CRITICAL **: 22:39:47.382: gtk_box_gadget_distribute: assertion 'size >= 0' failed in GtkScrollbar
18:39:47 
18:39:47 (SWT:1454): Gtk-WARNING **: 22:39:47.391: Negative content width -6 (allocation 1, extents 4x3) while allocating gadget (node toolbar, owner GtkToolbar)
18:39:47 
18:39:47 (SWT:1454): Gtk-CRITICAL **: 22:39:47.405: gtk_box_gadget_distribute: assertion 'size >= 0' failed in GtkScrollbar
18:39:47 
18:39:47 (SWT:1454): Gtk-CRITICAL **: 22:39:47.412: gtk_box_gadget_distribute: assertion 'size >= 0' failed in GtkScrollbar
18:39:47 
18:39:47 (SWT:1454): Gtk-WARNING **: 22:39:47.443: Negative content width -6 (allocation 1, extents 4x3) while allocating gadget (node toolbar, owner GtkToolbar)
18:39:47 
18:39:47 (SWT:1454): Gtk-CRITICAL **: 22:39:47.563: gtk_box_gadget_distribute: assertion 'size >= 0' failed in GtkScrollbar
18:39:47 
18:39:47 (SWT:1454): Gtk-WARNING **: 22:39:47.569: Negative content width -6 (allocation 1, extents 4x3) while allocating gadget (node toolbar, owner GtkToolbar)
18:39:47 
18:39:47 (SWT:1454): Gtk-WARNING **: 22:39:47.616: Negative content width -6 (allocation 1, extents 4x3) while allocating gadget (node toolbar, owner GtkToolbar)
18:39:47 
18:39:47 (SWT:1454): Gtk-CRITICAL **: 22:39:47.709: gtk_box_gadget_distribute: assertion 'size >= 0' failed in GtkScrollbar
18:39:47 
18:39:47 (SWT:1454): Gtk-WARNING **: 22:39:47.715: Negative content width -6 (allocation 1, extents 4x3) while allocating gadget (node toolbar, owner GtkToolbar)
18:39:47 
18:39:47 (SWT:1454): Gtk-WARNING **: 22:39:47.751: Negative content width -6 (allocation 1, extents 4x3) while allocating gadget (node toolbar, owner GtkToolbar)
18:39:47 
18:39:47 (SWT:1454): Gtk-WARNING **: 22:39:47.845: Negative content width -6 (allocation 1, extents 4x3) while allocating gadget (node toolbar, owner GtkToolbar)
18:39:47 
18:39:47 (SWT:1454): Gtk-WARNING **: 22:39:47.883: Negative content width -6 (allocation 1, extents 4x3) while allocating gadget (node toolbar, owner GtkToolbar)
18:39:47 
18:39:47 (SWT:1454): Gtk-WARNING **: 22:39:47.984: Negative content width -6 (allocation 1, extents 4x3) while allocating gadget (node toolbar, owner GtkToolbar)
18:39:48 
18:39:48 (SWT:1454): Gtk-WARNING **: 22:39:48.044: Negative content width -6 (allocation 1, extents 4x3) while allocating gadget (node toolbar, owner GtkToolbar)
18:39:48 
18:39:48 (SWT:1454): Gtk-WARNING **: 22:39:48.147: Negative content width -6 (allocation 1, extents 4x3) while allocating gadget (node toolbar, owner GtkToolbar)
18:39:48 
18:39:48 (SWT:1454): Gtk-WARNING **: 22:39:48.192: Negative content width -6 (allocation 1, extents 4x3) while allocating gadget (node toolbar, owner GtkToolbar)
18:39:48 
18:39:48 (SWT:1454): Gtk-WARNING **: 22:39:48.285: Negative content width -6 (allocation 1, extents 4x3) while allocating gadget (node toolbar, owner GtkToolbar)
18:39:48 
18:39:48 (SWT:1454): Gtk-WARNING **: 22:39:48.334: Negative content width -6 (allocation 1, extents 4x3) while allocating gadget (node toolbar, owner GtkToolbar)
18:39:48 
18:39:48 (SWT:1454): Gtk-WARNING **: 22:39:48.472: Negative content width -6 (allocation 1, extents 4x3) while allocating gadget (node toolbar, owner GtkToolbar)
18:39:48 
18:39:48 (SWT:1454): Gtk-WARNING **: 22:39:48.543: Negative content width -6 (allocation 1, extents 4x3) while allocating gadget (node toolbar, owner GtkToolbar)
18:39:49 
18:39:49 (SWT:1454): Gtk-WARNING **: 22:39:49.485: Negative content width -6 (allocation 1, extents 4x3) while allocating gadget (node toolbar, owner GtkToolbar)
18:39:49 
18:39:49 (SWT:1454): Gtk-WARNING **: 22:39:49.486: Negative content width -6 (allocation 1, extents 4x3) while allocating gadget (node toolbar, owner GtkToolbar)
18:39:49 
18:39:49 (SWT:1454): Gtk-WARNING **: 22:39:49.499: Negative content width -6 (allocation 1, extents 4x3) while allocating gadget (node toolbar, owner GtkToolbar)
18:39:49 
18:39:49 (SWT:1454): Gtk-CRITICAL **: 22:39:49.524: gtk_box_gadget_distribute: assertion 'size >= 0' failed in GtkScrollbar
18:39:49 
18:39:49 (SWT:1454): Gtk-CRITICAL **: 22:39:49.553: gtk_box_gadget_distribute: assertion 'size >= 0' failed in GtkScrollbar
18:39:49 
18:39:49 (SWT:1454): Gtk-CRITICAL **: 22:39:49.569: gtk_box_gadget_distribute: assertion 'size >= 0' failed in GtkScrollbar
18:39:49 
18:39:49 (SWT:1454): Gtk-CRITICAL **: 22:39:49.586: gtk_box_gadget_distribute: assertion 'size >= 0' failed in GtkScrollbar
18:39:49 
18:39:49 (SWT:1454): Gtk-CRITICAL **: 22:39:49.602: gtk_box_gadget_distribute: assertion 'size >= 0' failed in GtkScrollbar
18:39:49 
18:39:49 (SWT:1454): Gtk-CRITICAL **: 22:39:49.627: gtk_box_gadget_distribute: assertion 'size >= 0' failed in GtkScrollbar
18:39:49 
18:39:49 (SWT:1454): Gtk-CRITICAL **: 22:39:49.637: gtk_box_gadget_distribute: assertion 'size >= 0' failed in GtkScrollbar
18:39:49 
18:39:49 (SWT:1454): Gtk-CRITICAL **: 22:39:49.652: gtk_box_gadget_distribute: assertion 'size >= 0' failed in GtkScrollbar
18:39:49 
18:39:49 (SWT:1454): Gtk-CRITICAL **: 22:39:49.669: gtk_box_gadget_distribute: assertion 'size >= 0' failed in GtkScrollbar
18:39:49 
18:39:49 (SWT:1454): Gtk-CRITICAL **: 22:39:49.685: gtk_box_gadget_distribute: assertion 'size >= 0' failed in GtkScrollbar
18:39:49 
18:39:49 (SWT:1454): Gtk-CRITICAL **: 22:39:49.702: gtk_box_gadget_distribute: assertion 'size >= 0' failed in GtkScrollbar
18:39:49 
18:39:49 (SWT:1454): Gtk-CRITICAL **: 22:39:49.727: gtk_box_gadget_distribute: assertion 'size >= 0' failed in GtkScrollbar
18:39:49 
18:39:49 (SWT:1454): Gtk-CRITICAL **: 22:39:49.738: gtk_box_gadget_distribute: assertion 'size >= 0' failed in GtkScrollbar
18:39:49 
18:39:49 (SWT:1454): Gtk-WARNING **: 22:39:49.753: Negative content width -6 (allocation 1, extents 4x3) while allocating gadget (node toolbar, owner GtkToolbar)
18:39:49 
18:39:49 (SWT:1454): Gtk-WARNING **: 22:39:49.754: Negative content height -3 (allocation 1, extents 2x2) while allocating gadget (node toolbar, owner GtkToolbar)
18:39:49 
18:39:49 (SWT:1454): Gtk-WARNING **: 22:39:49.754: Negative content width -6 (allocation 1, extents 4x3) while allocating gadget (node toolbar, owner GtkToolbar)
18:39:49 
18:39:49 (SWT:1454): Gtk-WARNING **: 22:39:49.754: Negative content height -3 (allocation 1, extents 2x2) while allocating gadget (node toolbar, owner GtkToolbar)
18:39:49 
18:39:49 (SWT:1454): Gtk-WARNING **: 22:39:49.888: Negative content width -6 (allocation 1, extents 4x3) while allocating gadget (node toolbar, owner GtkToolbar)
18:39:50 Tests run: 13, Failures: 0, Errors: 0, Skipped: 1, Time elapsed: 24.212 s - in org.eclipse.egit.ui.test.history.HistoryViewTest
18:39:50 testShowAllBranches(org.eclipse.egit.ui.test.history.HistoryViewTest)  Time elapsed: 2.892 s
18:39:50 testOpenHistoryOnFileFolderFilter(org.eclipse.egit.ui.test.history.HistoryViewTest)  Time elapsed: 4.088 s
18:39:50 testCheckOut(org.eclipse.egit.ui.test.history.HistoryViewTest)  Time elapsed: 1.375 s
18:39:50 testOpenHistoryOnProject(org.eclipse.egit.ui.test.history.HistoryViewTest)  Time elapsed: 0.96 s
18:39:50 testRevertFailure(org.eclipse.egit.ui.test.history.HistoryViewTest)  Time elapsed: 2.14 s
18:39:50 testRebaseAlreadyUpToDate(org.eclipse.egit.ui.test.history.HistoryViewTest) skipped
18:39:50 testAddBranch(org.eclipse.egit.ui.test.history.HistoryViewTest)  Time elapsed: 1.247 s
18:39:50 testAddCommit(org.eclipse.egit.ui.test.history.HistoryViewTest)  Time elapsed: 1.615 s
18:39:50 testOpenHistoryOnFileProjectFilter(org.eclipse.egit.ui.test.history.HistoryViewTest)  Time elapsed: 2.156 s
18:39:50 testOpenHistoryOnFileRepoFilter(org.eclipse.egit.ui.test.history.HistoryViewTest)  Time elapsed: 2.205 s
18:39:50 testAddTag(org.eclipse.egit.ui.test.history.HistoryViewTest)  Time elapsed: 1.483 s
18:39:50 testOpenHistoryOnFileNoFilter(org.eclipse.egit.ui.test.history.HistoryViewTest)  Time elapsed: 2.697 s
18:39:50 testOpenOfDeletedFile(org.eclipse.egit.ui.test.history.HistoryViewTest)  Time elapsed: 1.321 s
18:39:50 Running org.eclipse.egit.ui.test.trace.TraceConfigurationDialogTest
18:39:50 
18:39:50 (SWT:1454): Gtk-CRITICAL **: 22:39:50.083: gtk_box_gadget_distribute: assertion 'size >= 0' failed in GtkScrollbar
18:39:50 
18:39:50 (SWT:1454): Gtk-CRITICAL **: 22:39:50.146: gtk_box_gadget_distribute: assertion 'size >= 0' failed in GtkScrollbar
18:39:50 
18:39:50 (SWT:1454): Gtk-CRITICAL **: 22:39:50.211: gtk_box_gadget_distribute: assertion 'size >= 0' failed in GtkScrollbar
18:39:50 
18:39:50 (SWT:1454): Gtk-CRITICAL **: 22:39:50.290: gtk_box_gadget_distribute: assertion 'size >= 0' failed in GtkScrollbar
18:39:50 
18:39:50 (SWT:1454): Gtk-CRITICAL **: 22:39:50.348: gtk_box_gadget_distribute: assertion 'size >= 0' failed in GtkScrollbar
18:39:50 
18:39:50 (SWT:1454): Gtk-CRITICAL **: 22:39:50.410: gtk_box_gadget_distribute: assertion 'size >= 0' failed in GtkScrollbar
18:39:50 Tests run: 2, Failures: 0, Errors: 0, Skipped: 0, Time elapsed: 0.428 s - in org.eclipse.egit.ui.test.trace.TraceConfigurationDialogTest
18:39:50 testMainSwitch(org.eclipse.egit.ui.test.trace.TraceConfigurationDialogTest)  Time elapsed: 0.222 s
18:39:50 testTreeNode(org.eclipse.egit.ui.test.trace.TraceConfigurationDialogTest)  Time elapsed: 0.205 s
18:39:50 Running org.eclipse.egit.ui.internal.dialogs.HyperlinkTokenScannerTest
18:39:50 Tests run: 10, Failures: 0, Errors: 0, Skipped: 0, Time elapsed: 0.222 s - in org.eclipse.egit.ui.internal.dialogs.HyperlinkTokenScannerTest
18:39:50 tokenizeEmbeddedHyperlink(org.eclipse.egit.ui.internal.dialogs.HyperlinkTokenScannerTest)  Time elapsed: 0.013 s
18:39:50 tokenizeWithFailingDetector(org.eclipse.egit.ui.internal.dialogs.HyperlinkTokenScannerTest)  Time elapsed: 0.001 s
18:39:50 tokenizeWithoutDetectors(org.eclipse.egit.ui.internal.dialogs.HyperlinkTokenScannerTest)  Time elapsed: 0 s
18:39:50 tokenizeHyperlinksOutsideRegion(org.eclipse.egit.ui.internal.dialogs.HyperlinkTokenScannerTest)  Time elapsed: 0.001 s
18:39:50 tokenizeMultipleHyperlinksSimple(org.eclipse.egit.ui.internal.dialogs.HyperlinkTokenScannerTest)  Time elapsed: 0 s
18:39:50 tokenizeMultipleHyperlinksMultiline(org.eclipse.egit.ui.internal.dialogs.HyperlinkTokenScannerTest)  Time elapsed: 0.001 s
18:39:50 tokenizeLeadingHyperlink(org.eclipse.egit.ui.internal.dialogs.HyperlinkTokenScannerTest)  Time elapsed: 0 s
18:39:50 tokenizeEmpty(org.eclipse.egit.ui.internal.dialogs.HyperlinkTokenScannerTest)  Time elapsed: 0.001 s
18:39:50 tokenizeHyperlinksCutByRegion(org.eclipse.egit.ui.internal.dialogs.HyperlinkTokenScannerTest)  Time elapsed: 0.001 s
18:39:50 tokenizeNoHyperlinks(org.eclipse.egit.ui.internal.dialogs.HyperlinkTokenScannerTest)  Time elapsed: 0 s
18:39:50 Running org.eclipse.egit.ui.internal.dialogs.CommitMessageComponentTest
18:39:50 Tests run: 5, Failures: 0, Errors: 0, Skipped: 0, Time elapsed: 0.001 s - in org.eclipse.egit.ui.internal.dialogs.CommitMessageComponentTest
18:39:50 commitFormat_MultipleLines_notOk2(org.eclipse.egit.ui.internal.dialogs.CommitMessageComponentTest)  Time elapsed: 0 s
18:39:50 commitFormat_simple(org.eclipse.egit.ui.internal.dialogs.CommitMessageComponentTest)  Time elapsed: 0 s
18:39:50 commitFormat_MultipleLines_ok(org.eclipse.egit.ui.internal.dialogs.CommitMessageComponentTest)  Time elapsed: 0 s
18:39:50 commitFormat_trailingWhitespace_ok(org.eclipse.egit.ui.internal.dialogs.CommitMessageComponentTest)  Time elapsed: 0 s
18:39:50 commitFormat_MultipleLines_notOk(org.eclipse.egit.ui.internal.dialogs.CommitMessageComponentTest)  Time elapsed: 0 s
18:39:50 Running org.eclipse.egit.ui.internal.dialogs.CommitMessageBuilderTest
18:39:51 
18:39:51 !ENTRY org.eclipse.egit.ui 4 0 2019-03-21 22:39:51.116
18:39:51 !MESSAGE CrashingCommitMessageProvider fails on purpose.
18:39:51 !STACK 0
18:39:51 java.lang.IllegalStateException: CrashingCommitMessageProvider fails on purpose.
18:39:51 	at org.eclipse.egit.ui.internal.dialogs.CommitMessageBuilderTest$CrashingCommitMessageProvider.getMessage(CommitMessageBuilderTest.java:474)
18:39:51 	at org.eclipse.egit.ui.internal.dialogs.CommitMessageBuilder.build(CommitMessageBuilder.java:90)
18:39:51 	at org.eclipse.egit.ui.internal.dialogs.CommitMessageBuilderTest.commitMessageProvider_oneCrashingProvider(CommitMessageBuilderTest.java:99)
18:39:51 	at sun.reflect.NativeMethodAccessorImpl.invoke0(Native Method)
18:39:51 	at sun.reflect.NativeMethodAccessorImpl.invoke(NativeMethodAccessorImpl.java:62)
18:39:51 	at sun.reflect.DelegatingMethodAccessorImpl.invoke(DelegatingMethodAccessorImpl.java:43)
18:39:51 	at java.lang.reflect.Method.invoke(Method.java:498)
18:39:51 	at org.junit.runners.model.FrameworkMethod$1.runReflectiveCall(FrameworkMethod.java:50)
18:39:51 	at org.junit.internal.runners.model.ReflectiveCallable.run(ReflectiveCallable.java:12)
18:39:51 	at org.junit.runners.model.FrameworkMethod.invokeExplosively(FrameworkMethod.java:47)
18:39:51 	at org.junit.internal.runners.statements.InvokeMethod.evaluate(InvokeMethod.java:17)
18:39:51 	at org.junit.internal.runners.statements.RunBefores.evaluate(RunBefores.java:26)
18:39:51 	at org.junit.internal.runners.statements.RunAfters.evaluate(RunAfters.java:27)
18:39:51 	at org.junit.runners.ParentRunner.runLeaf(ParentRunner.java:325)
18:39:51 	at org.junit.runners.BlockJUnit4ClassRunner.runChild(BlockJUnit4ClassRunner.java:78)
18:39:51 	at org.junit.runners.BlockJUnit4ClassRunner.runChild(BlockJUnit4ClassRunner.java:57)
18:39:51 	at org.junit.runners.ParentRunner$3.run(ParentRunner.java:290)
18:39:51 	at org.junit.runners.ParentRunner$1.schedule(ParentRunner.java:71)
18:39:51 	at org.junit.runners.ParentRunner.runChildren(ParentRunner.java:288)
18:39:51 	at org.junit.runners.ParentRunner.access$000(ParentRunner.java:58)
18:39:51 	at org.junit.runners.ParentRunner$2.evaluate(ParentRunner.java:268)
18:39:51 	at org.junit.internal.runners.statements.RunBefores.evaluate(RunBefores.java:26)
18:39:51 	at org.junit.runners.ParentRunner.run(ParentRunner.java:363)
18:39:51 	at org.apache.maven.surefire.junit4.JUnit4Provider.execute(JUnit4Provider.java:365)
18:39:51 	at org.apache.maven.surefire.junit4.JUnit4Provider.executeWithRerun(JUnit4Provider.java:273)
18:39:51 	at org.apache.maven.surefire.junit4.JUnit4Provider.executeTestSet(JUnit4Provider.java:238)
18:39:51 	at org.apache.maven.surefire.junit4.JUnit4Provider.invoke(JUnit4Provider.java:159)
18:39:51 	at sun.reflect.NativeMethodAccessorImpl.invoke0(Native Method)
18:39:51 	at sun.reflect.NativeMethodAccessorImpl.invoke(NativeMethodAccessorImpl.java:62)
18:39:51 	at sun.reflect.DelegatingMethodAccessorImpl.invoke(DelegatingMethodAccessorImpl.java:43)
18:39:51 	at java.lang.reflect.Method.invoke(Method.java:498)
18:39:51 	at org.apache.maven.surefire.util.ReflectionUtils.invokeMethodWithArray2(ReflectionUtils.java:206)
18:39:51 	at org.apache.maven.surefire.booter.ProviderFactory$ProviderProxy.invoke(ProviderFactory.java:161)
18:39:51 	at org.apache.maven.surefire.booter.ProviderFactory.invokeProvider(ProviderFactory.java:84)
18:39:51 	at org.eclipse.tycho.surefire.osgibooter.OsgiSurefireBooter.run(OsgiSurefireBooter.java:110)
18:39:51 	at org.eclipse.tycho.surefire.osgibooter.AbstractUITestApplication.runTests(AbstractUITestApplication.java:44)
18:39:51 	at org.eclipse.e4.ui.internal.workbench.swt.E4Testable$1.run(E4Testable.java:73)
18:39:51 	at java.lang.Thread.run(Thread.java:748)
18:39:58 
18:39:58 !ENTRY org.eclipse.egit.ui 4 0 2019-03-21 22:39:58.072
18:39:58 !MESSAGE CrashingCommitMessageProviderWithCaretPositioning fails on purpose.
18:39:58 !STACK 0
18:39:58 java.lang.IllegalStateException: CrashingCommitMessageProviderWithCaretPositioning fails on purpose.
18:39:58 	at org.eclipse.egit.ui.internal.dialogs.CommitMessageBuilderTest$CrashingCommitMessageProviderWithCaretPositioning.getCommitMessageWithPosition(CommitMessageBuilderTest.java:491)
18:39:58 	at org.eclipse.egit.ui.internal.dialogs.CommitMessageBuilder.build(CommitMessageBuilder.java:81)
18:39:58 	at org.eclipse.egit.ui.internal.dialogs.CommitMessageBuilderTest.commitMessageProvider_oneCrashingProviderWithCaretPosition(CommitMessageBuilderTest.java:112)
18:39:58 	at sun.reflect.NativeMethodAccessorImpl.invoke0(Native Method)
18:39:58 	at sun.reflect.NativeMethodAccessorImpl.invoke(NativeMethodAccessorImpl.java:62)
18:39:58 	at sun.reflect.DelegatingMethodAccessorImpl.invoke(DelegatingMethodAccessorImpl.java:43)
18:39:58 	at java.lang.reflect.Method.invoke(Method.java:498)
18:39:58 	at org.junit.runners.model.FrameworkMethod$1.runReflectiveCall(FrameworkMethod.java:50)
18:39:58 	at org.junit.internal.runners.model.ReflectiveCallable.run(ReflectiveCallable.java:12)
18:39:58 	at org.junit.runners.model.FrameworkMethod.invokeExplosively(FrameworkMethod.java:47)
18:39:58 	at org.junit.internal.runners.statements.InvokeMethod.evaluate(InvokeMethod.java:17)
18:39:58 	at org.junit.internal.runners.statements.RunBefores.evaluate(RunBefores.java:26)
18:39:58 	at org.junit.internal.runners.statements.RunAfters.evaluate(RunAfters.java:27)
18:39:58 	at org.junit.runners.ParentRunner.runLeaf(ParentRunner.java:325)
18:39:58 	at org.junit.runners.BlockJUnit4ClassRunner.runChild(BlockJUnit4ClassRunner.java:78)
18:39:58 	at org.junit.runners.BlockJUnit4ClassRunner.runChild(BlockJUnit4ClassRunner.java:57)
18:39:58 	at org.junit.runners.ParentRunner$3.run(ParentRunner.java:290)
18:39:58 	at org.junit.runners.ParentRunner$1.schedule(ParentRunner.java:71)
18:39:58 	at org.junit.runners.ParentRunner.runChildren(ParentRunner.java:288)
18:39:58 	at org.junit.runners.ParentRunner.access$000(ParentRunner.java:58)
18:39:58 	at org.junit.runners.ParentRunner$2.evaluate(ParentRunner.java:268)
18:39:58 	at org.junit.internal.runners.statements.RunBefores.evaluate(RunBefores.java:26)
18:39:58 	at org.junit.runners.ParentRunner.run(ParentRunner.java:363)
18:39:58 	at org.apache.maven.surefire.junit4.JUnit4Provider.execute(JUnit4Provider.java:365)
18:39:58 	at org.apache.maven.surefire.junit4.JUnit4Provider.executeWithRerun(JUnit4Provider.java:273)
18:39:58 	at org.apache.maven.surefire.junit4.JUnit4Provider.executeTestSet(JUnit4Provider.java:238)
18:39:58 	at org.apache.maven.surefire.junit4.JUnit4Provider.invoke(JUnit4Provider.java:159)
18:39:58 	at sun.reflect.NativeMethodAccessorImpl.invoke0(Native Method)
18:39:58 	at sun.reflect.NativeMethodAccessorImpl.invoke(NativeMethodAccessorImpl.java:62)
18:39:58 	at sun.reflect.DelegatingMethodAccessorImpl.invoke(DelegatingMethodAccessorImpl.java:43)
18:39:58 	at java.lang.reflect.Method.invoke(Method.java:498)
18:39:58 	at org.apache.maven.surefire.util.ReflectionUtils.invokeMethodWithArray2(ReflectionUtils.java:206)
18:39:58 	at org.apache.maven.surefire.booter.ProviderFactory$ProviderProxy.invoke(ProviderFactory.java:161)
18:39:58 	at org.apache.maven.surefire.booter.ProviderFactory.invokeProvider(ProviderFactory.java:84)
18:39:58 	at org.eclipse.tycho.surefire.osgibooter.OsgiSurefireBooter.run(OsgiSurefireBooter.java:110)
18:39:58 	at org.eclipse.tycho.surefire.osgibooter.AbstractUITestApplication.runTests(AbstractUITestApplication.java:44)
18:39:58 	at org.eclipse.e4.ui.internal.workbench.swt.E4Testable$1.run(E4Testable.java:73)
18:39:58 	at java.lang.Thread.run(Thread.java:748)
18:39:58 
18:39:58 !ENTRY org.eclipse.egit.ui 4 0 2019-03-21 22:39:58.180
18:39:58 !MESSAGE CrashingCommitMessageProvider fails on purpose.
18:39:58 !STACK 0
18:39:58 java.lang.IllegalStateException: CrashingCommitMessageProvider fails on purpose.
18:39:58 	at org.eclipse.egit.ui.internal.dialogs.CommitMessageBuilderTest$CrashingCommitMessageProvider.getMessage(CommitMessageBuilderTest.java:474)
18:39:58 	at org.eclipse.egit.ui.internal.dialogs.CommitMessageBuilder.build(CommitMessageBuilder.java:90)
18:39:58 	at org.eclipse.egit.ui.internal.dialogs.CommitMessageBuilderTest.commitMessageProvider_twoProvidersFirstOneCrashing(CommitMessageBuilderTest.java:146)
18:39:58 	at sun.reflect.NativeMethodAccessorImpl.invoke0(Native Method)
18:39:58 	at sun.reflect.NativeMethodAccessorImpl.invoke(NativeMethodAccessorImpl.java:62)
18:39:58 	at sun.reflect.DelegatingMethodAccessorImpl.invoke(DelegatingMethodAccessorImpl.java:43)
18:39:58 	at java.lang.reflect.Method.invoke(Method.java:498)
18:39:58 	at org.junit.runners.model.FrameworkMethod$1.runReflectiveCall(FrameworkMethod.java:50)
18:39:58 	at org.junit.internal.runners.model.ReflectiveCallable.run(ReflectiveCallable.java:12)
18:39:58 	at org.junit.runners.model.FrameworkMethod.invokeExplosively(FrameworkMethod.java:47)
18:39:58 	at org.junit.internal.runners.statements.InvokeMethod.evaluate(InvokeMethod.java:17)
18:39:58 	at org.junit.internal.runners.statements.RunBefores.evaluate(RunBefores.java:26)
18:39:58 	at org.junit.internal.runners.statements.RunAfters.evaluate(RunAfters.java:27)
18:39:58 	at org.junit.runners.ParentRunner.runLeaf(ParentRunner.java:325)
18:39:58 	at org.junit.runners.BlockJUnit4ClassRunner.runChild(BlockJUnit4ClassRunner.java:78)
18:39:58 	at org.junit.runners.BlockJUnit4ClassRunner.runChild(BlockJUnit4ClassRunner.java:57)
18:39:58 	at org.junit.runners.ParentRunner$3.run(ParentRunner.java:290)
18:39:58 	at org.junit.runners.ParentRunner$1.schedule(ParentRunner.java:71)
18:39:58 	at org.junit.runners.ParentRunner.runChildren(ParentRunner.java:288)
18:39:58 	at org.junit.runners.ParentRunner.access$000(ParentRunner.java:58)
18:39:58 	at org.junit.runners.ParentRunner$2.evaluate(ParentRunner.java:268)
18:39:58 	at org.junit.internal.runners.statements.RunBefores.evaluate(RunBefores.java:26)
18:39:58 	at org.junit.runners.ParentRunner.run(ParentRunner.java:363)
18:39:58 	at org.apache.maven.surefire.junit4.JUnit4Provider.execute(JUnit4Provider.java:365)
18:39:58 	at org.apache.maven.surefire.junit4.JUnit4Provider.executeWithRerun(JUnit4Provider.java:273)
18:39:58 	at org.apache.maven.surefire.junit4.JUnit4Provider.executeTestSet(JUnit4Provider.java:238)
18:39:58 	at org.apache.maven.surefire.junit4.JUnit4Provider.invoke(JUnit4Provider.java:159)
18:39:58 	at sun.reflect.NativeMethodAccessorImpl.invoke0(Native Method)
18:39:58 	at sun.reflect.NativeMethodAccessorImpl.invoke(NativeMethodAccessorImpl.java:62)
18:39:58 	at sun.reflect.DelegatingMethodAccessorImpl.invoke(DelegatingMethodAccessorImpl.java:43)
18:39:58 	at java.lang.reflect.Method.invoke(Method.java:498)
18:39:58 	at org.apache.maven.surefire.util.ReflectionUtils.invokeMethodWithArray2(ReflectionUtils.java:206)
18:39:58 	at org.apache.maven.surefire.booter.ProviderFactory$ProviderProxy.invoke(ProviderFactory.java:161)
18:39:58 	at org.apache.maven.surefire.booter.ProviderFactory.invokeProvider(ProviderFactory.java:84)
18:39:58 	at org.eclipse.tycho.surefire.osgibooter.OsgiSurefireBooter.run(OsgiSurefireBooter.java:110)
18:39:58 	at org.eclipse.tycho.surefire.osgibooter.AbstractUITestApplication.runTests(AbstractUITestApplication.java:44)
18:39:58 	at org.eclipse.e4.ui.internal.workbench.swt.E4Testable$1.run(E4Testable.java:73)
18:39:58 	at java.lang.Thread.run(Thread.java:748)
18:39:59 
18:39:59 !ENTRY org.eclipse.egit.ui 4 0 2019-03-21 22:39:59.673
18:39:59 !MESSAGE CrashingCommitMessageProvider fails on purpose.
18:39:59 !STACK 0
18:39:59 java.lang.IllegalStateException: CrashingCommitMessageProvider fails on purpose.
18:39:59 	at org.eclipse.egit.ui.internal.dialogs.CommitMessageBuilderTest$CrashingCommitMessageProvider.getMessage(CommitMessageBuilderTest.java:474)
18:39:59 	at org.eclipse.egit.ui.internal.dialogs.CommitMessageBuilder.build(CommitMessageBuilder.java:90)
18:39:59 	at org.eclipse.egit.ui.internal.dialogs.CommitMessageBuilderTest.commitMessageProvider_multipleProvidersWithCrashAndNull(CommitMessageBuilderTest.java:165)
18:39:59 	at sun.reflect.NativeMethodAccessorImpl.invoke0(Native Method)
18:39:59 	at sun.reflect.NativeMethodAccessorImpl.invoke(NativeMethodAccessorImpl.java:62)
18:39:59 	at sun.reflect.DelegatingMethodAccessorImpl.invoke(DelegatingMethodAccessorImpl.java:43)
18:39:59 	at java.lang.reflect.Method.invoke(Method.java:498)
18:39:59 	at org.junit.runners.model.FrameworkMethod$1.runReflectiveCall(FrameworkMethod.java:50)
18:39:59 	at org.junit.internal.runners.model.ReflectiveCallable.run(ReflectiveCallable.java:12)
18:39:59 	at org.junit.runners.model.FrameworkMethod.invokeExplosively(FrameworkMethod.java:47)
18:39:59 	at org.junit.internal.runners.statements.InvokeMethod.evaluate(InvokeMethod.java:17)
18:39:59 	at org.junit.internal.runners.statements.RunBefores.evaluate(RunBefores.java:26)
18:39:59 	at org.junit.internal.runners.statements.RunAfters.evaluate(RunAfters.java:27)
18:39:59 	at org.junit.runners.ParentRunner.runLeaf(ParentRunner.java:325)
18:39:59 	at org.junit.runners.BlockJUnit4ClassRunner.runChild(BlockJUnit4ClassRunner.java:78)
18:39:59 	at org.junit.runners.BlockJUnit4ClassRunner.runChild(BlockJUnit4ClassRunner.java:57)
18:39:59 	at org.junit.runners.ParentRunner$3.run(ParentRunner.java:290)
18:39:59 	at org.junit.runners.ParentRunner$1.schedule(ParentRunner.java:71)
18:39:59 	at org.junit.runners.ParentRunner.runChildren(ParentRunner.java:288)
18:39:59 	at org.junit.runners.ParentRunner.access$000(ParentRunner.java:58)
18:39:59 	at org.junit.runners.ParentRunner$2.evaluate(ParentRunner.java:268)
18:39:59 	at org.junit.internal.runners.statements.RunBefores.evaluate(RunBefores.java:26)
18:39:59 	at org.junit.runners.ParentRunner.run(ParentRunner.java:363)
18:39:59 	at org.apache.maven.surefire.junit4.JUnit4Provider.execute(JUnit4Provider.java:365)
18:39:59 	at org.apache.maven.surefire.junit4.JUnit4Provider.executeWithRerun(JUnit4Provider.java:273)
18:39:59 	at org.apache.maven.surefire.junit4.JUnit4Provider.executeTestSet(JUnit4Provider.java:238)
18:39:59 	at org.apache.maven.surefire.junit4.JUnit4Provider.invoke(JUnit4Provider.java:159)
18:39:59 	at sun.reflect.NativeMethodAccessorImpl.invoke0(Native Method)
18:39:59 	at sun.reflect.NativeMethodAccessorImpl.invoke(NativeMethodAccessorImpl.java:62)
18:39:59 	at sun.reflect.DelegatingMethodAccessorImpl.invoke(DelegatingMethodAccessorImpl.java:43)
18:39:59 	at java.lang.reflect.Method.invoke(Method.java:498)
18:39:59 	at org.apache.maven.surefire.util.ReflectionUtils.invokeMethodWithArray2(ReflectionUtils.java:206)
18:39:59 	at org.apache.maven.surefire.booter.ProviderFactory$ProviderProxy.invoke(ProviderFactory.java:161)
18:39:59 	at org.apache.maven.surefire.booter.ProviderFactory.invokeProvider(ProviderFactory.java:84)
18:39:59 	at org.eclipse.tycho.surefire.osgibooter.OsgiSurefireBooter.run(OsgiSurefireBooter.java:110)
18:39:59 	at org.eclipse.tycho.surefire.osgibooter.AbstractUITestApplication.runTests(AbstractUITestApplication.java:44)
18:39:59 	at org.eclipse.e4.ui.internal.workbench.swt.E4Testable$1.run(E4Testable.java:73)
18:39:59 	at java.lang.Thread.run(Thread.java:748)
18:39:59 
18:39:59 !ENTRY org.eclipse.egit.ui 4 0 2019-03-21 22:39:59.675
18:39:59 !MESSAGE CrashingCommitMessageProvider fails on purpose.
18:39:59 !STACK 0
18:39:59 java.lang.IllegalStateException: CrashingCommitMessageProvider fails on purpose.
18:39:59 	at org.eclipse.egit.ui.internal.dialogs.CommitMessageBuilderTest$CrashingCommitMessageProvider.getMessage(CommitMessageBuilderTest.java:474)
18:39:59 	at org.eclipse.egit.ui.internal.dialogs.CommitMessageBuilder.build(CommitMessageBuilder.java:90)
18:39:59 	at org.eclipse.egit.ui.internal.dialogs.CommitMessageBuilderTest.commitMessageProvider_multipleProvidersWithCrashAndNull(CommitMessageBuilderTest.java:165)
18:39:59 	at sun.reflect.NativeMethodAccessorImpl.invoke0(Native Method)
18:39:59 	at sun.reflect.NativeMethodAccessorImpl.invoke(NativeMethodAccessorImpl.java:62)
18:39:59 	at sun.reflect.DelegatingMethodAccessorImpl.invoke(DelegatingMethodAccessorImpl.java:43)
18:39:59 	at java.lang.reflect.Method.invoke(Method.java:498)
18:39:59 	at org.junit.runners.model.FrameworkMethod$1.runReflectiveCall(FrameworkMethod.java:50)
18:39:59 	at org.junit.internal.runners.model.ReflectiveCallable.run(ReflectiveCallable.java:12)
18:39:59 	at org.junit.runners.model.FrameworkMethod.invokeExplosively(FrameworkMethod.java:47)
18:39:59 	at org.junit.internal.runners.statements.InvokeMethod.evaluate(InvokeMethod.java:17)
18:39:59 	at org.junit.internal.runners.statements.RunBefores.evaluate(RunBefores.java:26)
18:39:59 	at org.junit.internal.runners.statements.RunAfters.evaluate(RunAfters.java:27)
18:39:59 	at org.junit.runners.ParentRunner.runLeaf(ParentRunner.java:325)
18:39:59 	at org.junit.runners.BlockJUnit4ClassRunner.runChild(BlockJUnit4ClassRunner.java:78)
18:39:59 	at org.junit.runners.BlockJUnit4ClassRunner.runChild(BlockJUnit4ClassRunner.java:57)
18:39:59 	at org.junit.runners.ParentRunner$3.run(ParentRunner.java:290)
18:39:59 	at org.junit.runners.ParentRunner$1.schedule(ParentRunner.java:71)
18:39:59 	at org.junit.runners.ParentRunner.runChildren(ParentRunner.java:288)
18:39:59 	at org.junit.runners.ParentRunner.access$000(ParentRunner.java:58)
18:39:59 	at org.junit.runners.ParentRunner$2.evaluate(ParentRunner.java:268)
18:39:59 	at org.junit.internal.runners.statements.RunBefores.evaluate(RunBefores.java:26)
18:39:59 	at org.junit.runners.ParentRunner.run(ParentRunner.java:363)
18:39:59 	at org.apache.maven.surefire.junit4.JUnit4Provider.execute(JUnit4Provider.java:365)
18:39:59 	at org.apache.maven.surefire.junit4.JUnit4Provider.executeWithRerun(JUnit4Provider.java:273)
18:39:59 	at org.apache.maven.surefire.junit4.JUnit4Provider.executeTestSet(JUnit4Provider.java:238)
18:39:59 	at org.apache.maven.surefire.junit4.JUnit4Provider.invoke(JUnit4Provider.java:159)
18:39:59 	at sun.reflect.NativeMethodAccessorImpl.invoke0(Native Method)
18:39:59 	at sun.reflect.NativeMethodAccessorImpl.invoke(NativeMethodAccessorImpl.java:62)
18:39:59 	at sun.reflect.DelegatingMethodAccessorImpl.invoke(DelegatingMethodAccessorImpl.java:43)
18:39:59 	at java.lang.reflect.Method.invoke(Method.java:498)
18:39:59 	at org.apache.maven.surefire.util.ReflectionUtils.invokeMethodWithArray2(ReflectionUtils.java:206)
18:39:59 	at org.apache.maven.surefire.booter.ProviderFactory$ProviderProxy.invoke(ProviderFactory.java:161)
18:39:59 	at org.apache.maven.surefire.booter.ProviderFactory.invokeProvider(ProviderFactory.java:84)
18:39:59 	at org.eclipse.tycho.surefire.osgibooter.OsgiSurefireBooter.run(OsgiSurefireBooter.java:110)
18:39:59 	at org.eclipse.tycho.surefire.osgibooter.AbstractUITestApplication.runTests(AbstractUITestApplication.java:44)
18:39:59 	at org.eclipse.e4.ui.internal.workbench.swt.E4Testable$1.run(E4Testable.java:73)
18:39:59 	at java.lang.Thread.run(Thread.java:748)
18:39:59 
18:39:59 !ENTRY org.eclipse.egit.ui 2 0 2019-03-21 22:39:59.763
18:39:59 !MESSAGE The ICommitMessageProvider2 implementation org.eclipse.egit.ui.internal.dialogs.CommitMessageBuilderTest$3 provided the caret position -42, which exceeds the length of the commit message or is negative. The caret position is ignored.
18:40:02 
18:40:02 !ENTRY org.eclipse.egit.ui 2 0 2019-03-21 22:40:02.458
18:40:02 !MESSAGE Found multiple implementations of ICommitMessageProvider2. Ignoring caret positioning for org.eclipse.egit.ui.internal.dialogs.CommitMessageBuilderTest$3.
18:40:03 
18:40:03 (SWT:1454): Gtk-WARNING **: 22:40:03.241: Negative content width -1 (allocation 1, extents 1x1) while allocating gadget (node trough, owner GtkProgressBar)
18:40:08 
18:40:08 !ENTRY org.eclipse.egit.ui 4 0 2019-03-21 22:40:08.947
18:40:08 !MESSAGE CrashingCommitMessageProvider fails on purpose.
18:40:08 !STACK 0
18:40:08 java.lang.IllegalStateException: CrashingCommitMessageProvider fails on purpose.
18:40:08 	at org.eclipse.egit.ui.internal.dialogs.CommitMessageBuilderTest$CrashingCommitMessageProvider.getMessage(CommitMessageBuilderTest.java:474)
18:40:08 	at org.eclipse.egit.ui.internal.dialogs.CommitMessageBuilder.build(CommitMessageBuilder.java:90)
18:40:08 	at org.eclipse.egit.ui.internal.dialogs.CommitMessageBuilderTest.commitMessageProvider_twoProvidersSecondOneCrashing(CommitMessageBuilderTest.java:130)
18:40:08 	at sun.reflect.NativeMethodAccessorImpl.invoke0(Native Method)
18:40:08 	at sun.reflect.NativeMethodAccessorImpl.invoke(NativeMethodAccessorImpl.java:62)
18:40:08 	at sun.reflect.DelegatingMethodAccessorImpl.invoke(DelegatingMethodAccessorImpl.java:43)
18:40:08 	at java.lang.reflect.Method.invoke(Method.java:498)
18:40:08 	at org.junit.runners.model.FrameworkMethod$1.runReflectiveCall(FrameworkMethod.java:50)
18:40:08 	at org.junit.internal.runners.model.ReflectiveCallable.run(ReflectiveCallable.java:12)
18:40:08 	at org.junit.runners.model.FrameworkMethod.invokeExplosively(FrameworkMethod.java:47)
18:40:08 	at org.junit.internal.runners.statements.InvokeMethod.evaluate(InvokeMethod.java:17)
18:40:08 	at org.junit.internal.runners.statements.RunBefores.evaluate(RunBefores.java:26)
18:40:08 	at org.junit.internal.runners.statements.RunAfters.evaluate(RunAfters.java:27)
18:40:08 	at org.junit.runners.ParentRunner.runLeaf(ParentRunner.java:325)
18:40:08 	at org.junit.runners.BlockJUnit4ClassRunner.runChild(BlockJUnit4ClassRunner.java:78)
18:40:08 	at org.junit.runners.BlockJUnit4ClassRunner.runChild(BlockJUnit4ClassRunner.java:57)
18:40:08 	at org.junit.runners.ParentRunner$3.run(ParentRunner.java:290)
18:40:08 	at org.junit.runners.ParentRunner$1.schedule(ParentRunner.java:71)
18:40:08 	at org.junit.runners.ParentRunner.runChildren(ParentRunner.java:288)
18:40:08 	at org.junit.runners.ParentRunner.access$000(ParentRunner.java:58)
18:40:08 	at org.junit.runners.ParentRunner$2.evaluate(ParentRunner.java:268)
18:40:08 	at org.junit.internal.runners.statements.RunBefores.evaluate(RunBefores.java:26)
18:40:08 	at org.junit.runners.ParentRunner.run(ParentRunner.java:363)
18:40:08 	at org.apache.maven.surefire.junit4.JUnit4Provider.execute(JUnit4Provider.java:365)
18:40:08 	at org.apache.maven.surefire.junit4.JUnit4Provider.executeWithRerun(JUnit4Provider.java:273)
18:40:08 	at org.apache.maven.surefire.junit4.JUnit4Provider.executeTestSet(JUnit4Provider.java:238)
18:40:08 	at org.apache.maven.surefire.junit4.JUnit4Provider.invoke(JUnit4Provider.java:159)
18:40:08 	at sun.reflect.NativeMethodAccessorImpl.invoke0(Native Method)
18:40:08 	at sun.reflect.NativeMethodAccessorImpl.invoke(NativeMethodAccessorImpl.java:62)
18:40:08 	at sun.reflect.DelegatingMethodAccessorImpl.invoke(DelegatingMethodAccessorImpl.java:43)
18:40:08 	at java.lang.reflect.Method.invoke(Method.java:498)
18:40:08 	at org.apache.maven.surefire.util.ReflectionUtils.invokeMethodWithArray2(ReflectionUtils.java:206)
18:40:08 	at org.apache.maven.surefire.booter.ProviderFactory$ProviderProxy.invoke(ProviderFactory.java:161)
18:40:08 	at org.apache.maven.surefire.booter.ProviderFactory.invokeProvider(ProviderFactory.java:84)
18:40:08 	at org.eclipse.tycho.surefire.osgibooter.OsgiSurefireBooter.run(OsgiSurefireBooter.java:110)
18:40:08 	at org.eclipse.tycho.surefire.osgibooter.AbstractUITestApplication.runTests(AbstractUITestApplication.java:44)
18:40:08 	at org.eclipse.e4.ui.internal.workbench.swt.E4Testable$1.run(E4Testable.java:73)
18:40:08 	at java.lang.Thread.run(Thread.java:748)
18:40:09 
18:40:09 !ENTRY org.eclipse.egit.ui 4 0 2019-03-21 22:40:09.338
18:40:09 !MESSAGE CrashingCommitMessageProvider fails on purpose.
18:40:09 !STACK 0
18:40:09 java.lang.IllegalStateException: CrashingCommitMessageProvider fails on purpose.
18:40:09 	at org.eclipse.egit.ui.internal.dialogs.CommitMessageBuilderTest$CrashingCommitMessageProvider.getMessage(CommitMessageBuilderTest.java:474)
18:40:09 	at org.eclipse.egit.ui.internal.dialogs.CommitMessageBuilder.build(CommitMessageBuilder.java:90)
18:40:09 	at org.eclipse.egit.ui.internal.dialogs.CommitMessageBuilderTest.commitMessageProvider_multipleProvidersWithCrashingAndNullAndOneCaretPositioning(CommitMessageBuilderTest.java:414)
18:40:09 	at sun.reflect.NativeMethodAccessorImpl.invoke0(Native Method)
18:40:09 	at sun.reflect.NativeMethodAccessorImpl.invoke(NativeMethodAccessorImpl.java:62)
18:40:09 	at sun.reflect.DelegatingMethodAccessorImpl.invoke(DelegatingMethodAccessorImpl.java:43)
18:40:09 	at java.lang.reflect.Method.invoke(Method.java:498)
18:40:09 	at org.junit.runners.model.FrameworkMethod$1.runReflectiveCall(FrameworkMethod.java:50)
18:40:09 	at org.junit.internal.runners.model.ReflectiveCallable.run(ReflectiveCallable.java:12)
18:40:09 	at org.junit.runners.model.FrameworkMethod.invokeExplosively(FrameworkMethod.java:47)
18:40:09 	at org.junit.internal.runners.statements.InvokeMethod.evaluate(InvokeMethod.java:17)
18:40:09 	at org.junit.internal.runners.statements.RunBefores.evaluate(RunBefores.java:26)
18:40:09 	at org.junit.internal.runners.statements.RunAfters.evaluate(RunAfters.java:27)
18:40:09 	at org.junit.runners.ParentRunner.runLeaf(ParentRunner.java:325)
18:40:09 	at org.junit.runners.BlockJUnit4ClassRunner.runChild(BlockJUnit4ClassRunner.java:78)
18:40:09 	at org.junit.runners.BlockJUnit4ClassRunner.runChild(BlockJUnit4ClassRunner.java:57)
18:40:09 	at org.junit.runners.ParentRunner$3.run(ParentRunner.java:290)
18:40:09 	at org.junit.runners.ParentRunner$1.schedule(ParentRunner.java:71)
18:40:09 	at org.junit.runners.ParentRunner.runChildren(ParentRunner.java:288)
18:40:09 	at org.junit.runners.ParentRunner.access$000(ParentRunner.java:58)
18:40:09 	at org.junit.runners.ParentRunner$2.evaluate(ParentRunner.java:268)
18:40:09 	at org.junit.internal.runners.statements.RunBefores.evaluate(RunBefores.java:26)
18:40:09 	at org.junit.runners.ParentRunner.run(ParentRunner.java:363)
18:40:09 	at org.apache.maven.surefire.junit4.JUnit4Provider.execute(JUnit4Provider.java:365)
18:40:09 	at org.apache.maven.surefire.junit4.JUnit4Provider.executeWithRerun(JUnit4Provider.java:273)
18:40:09 	at org.apache.maven.surefire.junit4.JUnit4Provider.executeTestSet(JUnit4Provider.java:238)
18:40:09 	at org.apache.maven.surefire.junit4.JUnit4Provider.invoke(JUnit4Provider.java:159)
18:40:09 	at sun.reflect.NativeMethodAccessorImpl.invoke0(Native Method)
18:40:09 	at sun.reflect.NativeMethodAccessorImpl.invoke(NativeMethodAccessorImpl.java:62)
18:40:09 	at sun.reflect.DelegatingMethodAccessorImpl.invoke(DelegatingMethodAccessorImpl.java:43)
18:40:09 	at java.lang.reflect.Method.invoke(Method.java:498)
18:40:09 	at org.apache.maven.surefire.util.ReflectionUtils.invokeMethodWithArray2(ReflectionUtils.java:206)
18:40:09 	at org.apache.maven.surefire.booter.ProviderFactory$ProviderProxy.invoke(ProviderFactory.java:161)
18:40:09 	at org.apache.maven.surefire.booter.ProviderFactory.invokeProvider(ProviderFactory.java:84)
18:40:09 	at org.eclipse.tycho.surefire.osgibooter.OsgiSurefireBooter.run(OsgiSurefireBooter.java:110)
18:40:09 	at org.eclipse.tycho.surefire.osgibooter.AbstractUITestApplication.runTests(AbstractUITestApplication.java:44)
18:40:09 	at org.eclipse.e4.ui.internal.workbench.swt.E4Testable$1.run(E4Testable.java:73)
18:40:09 	at java.lang.Thread.run(Thread.java:748)
18:40:09 
18:40:09 !ENTRY org.eclipse.egit.ui 4 0 2019-03-21 22:40:09.339
18:40:09 !MESSAGE CrashingCommitMessageProvider fails on purpose.
18:40:09 !STACK 0
18:40:09 java.lang.IllegalStateException: CrashingCommitMessageProvider fails on purpose.
18:40:09 	at org.eclipse.egit.ui.internal.dialogs.CommitMessageBuilderTest$CrashingCommitMessageProvider.getMessage(CommitMessageBuilderTest.java:474)
18:40:09 	at org.eclipse.egit.ui.internal.dialogs.CommitMessageBuilder.build(CommitMessageBuilder.java:90)
18:40:09 	at org.eclipse.egit.ui.internal.dialogs.CommitMessageBuilderTest.commitMessageProvider_multipleProvidersWithCrashingAndNullAndOneCaretPositioning(CommitMessageBuilderTest.java:414)
18:40:09 	at sun.reflect.NativeMethodAccessorImpl.invoke0(Native Method)
18:40:09 	at sun.reflect.NativeMethodAccessorImpl.invoke(NativeMethodAccessorImpl.java:62)
18:40:09 	at sun.reflect.DelegatingMethodAccessorImpl.invoke(DelegatingMethodAccessorImpl.java:43)
18:40:09 	at java.lang.reflect.Method.invoke(Method.java:498)
18:40:09 	at org.junit.runners.model.FrameworkMethod$1.runReflectiveCall(FrameworkMethod.java:50)
18:40:09 	at org.junit.internal.runners.model.ReflectiveCallable.run(ReflectiveCallable.java:12)
18:40:09 	at org.junit.runners.model.FrameworkMethod.invokeExplosively(FrameworkMethod.java:47)
18:40:09 	at org.junit.internal.runners.statements.InvokeMethod.evaluate(InvokeMethod.java:17)
18:40:09 	at org.junit.internal.runners.statements.RunBefores.evaluate(RunBefores.java:26)
18:40:09 	at org.junit.internal.runners.statements.RunAfters.evaluate(RunAfters.java:27)
18:40:09 	at org.junit.runners.ParentRunner.runLeaf(ParentRunner.java:325)
18:40:09 	at org.junit.runners.BlockJUnit4ClassRunner.runChild(BlockJUnit4ClassRunner.java:78)
18:40:09 	at org.junit.runners.BlockJUnit4ClassRunner.runChild(BlockJUnit4ClassRunner.java:57)
18:40:09 	at org.junit.runners.ParentRunner$3.run(ParentRunner.java:290)
18:40:09 	at org.junit.runners.ParentRunner$1.schedule(ParentRunner.java:71)
18:40:09 	at org.junit.runners.ParentRunner.runChildren(ParentRunner.java:288)
18:40:09 	at org.junit.runners.ParentRunner.access$000(ParentRunner.java:58)
18:40:09 	at org.junit.runners.ParentRunner$2.evaluate(ParentRunner.java:268)
18:40:09 	at org.junit.internal.runners.statements.RunBefores.evaluate(RunBefores.java:26)
18:40:09 	at org.junit.runners.ParentRunner.run(ParentRunner.java:363)
18:40:09 	at org.apache.maven.surefire.junit4.JUnit4Provider.execute(JUnit4Provider.java:365)
18:40:09 	at org.apache.maven.surefire.junit4.JUnit4Provider.executeWithRerun(JUnit4Provider.java:273)
18:40:09 	at org.apache.maven.surefire.junit4.JUnit4Provider.executeTestSet(JUnit4Provider.java:238)
18:40:09 	at org.apache.maven.surefire.junit4.JUnit4Provider.invoke(JUnit4Provider.java:159)
18:40:09 	at sun.reflect.NativeMethodAccessorImpl.invoke0(Native Method)
18:40:09 	at sun.reflect.NativeMethodAccessorImpl.invoke(NativeMethodAccessorImpl.java:62)
18:40:09 	at sun.reflect.DelegatingMethodAccessorImpl.invoke(DelegatingMethodAccessorImpl.java:43)
18:40:09 	at java.lang.reflect.Method.invoke(Method.java:498)
18:40:09 	at org.apache.maven.surefire.util.ReflectionUtils.invokeMethodWithArray2(ReflectionUtils.java:206)
18:40:09 	at org.apache.maven.surefire.booter.ProviderFactory$ProviderProxy.invoke(ProviderFactory.java:161)
18:40:09 	at org.apache.maven.surefire.booter.ProviderFactory.invokeProvider(ProviderFactory.java:84)
18:40:09 	at org.eclipse.tycho.surefire.osgibooter.OsgiSurefireBooter.run(OsgiSurefireBooter.java:110)
18:40:09 	at org.eclipse.tycho.surefire.osgibooter.AbstractUITestApplication.runTests(AbstractUITestApplication.java:44)
18:40:09 	at org.eclipse.e4.ui.internal.workbench.swt.E4Testable$1.run(E4Testable.java:73)
18:40:09 	at java.lang.Thread.run(Thread.java:748)
18:40:09 
18:40:09 !ENTRY org.eclipse.egit.ui 2 0 2019-03-21 22:40:09.428
18:40:09 !MESSAGE Found multiple implementations of ICommitMessageProvider2. Ignoring caret positioning for org.eclipse.egit.ui.internal.dialogs.CommitMessageBuilderTest$3.
18:40:10 
18:40:10 !ENTRY org.eclipse.egit.ui 2 0 2019-03-21 22:40:10.470
18:40:10 !MESSAGE The ICommitMessageProvider2 implementation org.eclipse.egit.ui.internal.dialogs.CommitMessageBuilderTest$3 provided the caret position 14, which exceeds the length of the commit message or is negative. The caret position is ignored.
18:40:10 Tests run: 20, Failures: 0, Errors: 0, Skipped: 0, Time elapsed: 19.791 s - in org.eclipse.egit.ui.internal.dialogs.CommitMessageBuilderTest
18:40:10 commitMessageProvider_oneCrashingProvider(org.eclipse.egit.ui.internal.dialogs.CommitMessageBuilderTest)  Time elapsed: 0.45 s
18:40:10 commitMessageProvider_twoProvidersSecondWithCaretPositioning(org.eclipse.egit.ui.internal.dialogs.CommitMessageBuilderTest)  Time elapsed: 6.726 s
18:40:10 commitMessageProvider_oneCrashingProviderWithCaretPosition(org.eclipse.egit.ui.internal.dialogs.CommitMessageBuilderTest)  Time elapsed: 0.215 s
18:40:10 commitMessageProvider_twoProvidersFirstOneCrashing(org.eclipse.egit.ui.internal.dialogs.CommitMessageBuilderTest)  Time elapsed: 0.101 s
18:40:10 commitMessageProvider_noProvider(org.eclipse.egit.ui.internal.dialogs.CommitMessageBuilderTest)  Time elapsed: 0.091 s
18:40:10 commitMessageProvider_oneProvider(org.eclipse.egit.ui.internal.dialogs.CommitMessageBuilderTest)  Time elapsed: 1.103 s
18:40:10 commitMessageProvider_multipleProvidersWithCrashAndNull(org.eclipse.egit.ui.internal.dialogs.CommitMessageBuilderTest)  Time elapsed: 0.301 s
18:40:10 commitMessageProvider_oneProviderWithInvalidNegativeCaretPosition(org.eclipse.egit.ui.internal.dialogs.CommitMessageBuilderTest)  Time elapsed: 0.142 s
18:40:10 commitMessageProvider_twoProvidersSecondWithUndefinedCaretPosition(org.eclipse.egit.ui.internal.dialogs.CommitMessageBuilderTest)  Time elapsed: 1.106 s
18:40:10 commitMessageProvider_twoProvidersWithCaretPositioningFirstWithUndefinedCaretPosition(org.eclipse.egit.ui.internal.dialogs.CommitMessageBuilderTest)  Time elapsed: 0.195 s
18:40:10 commitMessageProvider_oneProviderWithCaretPositionEqualsMessageLength(org.eclipse.egit.ui.internal.dialogs.CommitMessageBuilderTest)  Time elapsed: 0.198 s
18:40:10 commitMessageProvider_twoProvidersFirstWithCaretPositioning(org.eclipse.egit.ui.internal.dialogs.CommitMessageBuilderTest)  Time elapsed: 0.096 s
18:40:10 commitMessageProvider_twoProvidersWithCaretPositioningSecondWithUndefinedCaretPosition(org.eclipse.egit.ui.internal.dialogs.CommitMessageBuilderTest)  Time elapsed: 1.051 s
18:40:10 commitMessageProvider_oneProviderWithCaretPositioning(org.eclipse.egit.ui.internal.dialogs.CommitMessageBuilderTest)  Time elapsed: 0.108 s
18:40:10 commitMessageProvider_twoProvidersSecondWithCaretPositionZero(org.eclipse.egit.ui.internal.dialogs.CommitMessageBuilderTest)  Time elapsed: 0.09 s
18:40:10 commitMessageProvider_twoProviders(org.eclipse.egit.ui.internal.dialogs.CommitMessageBuilderTest)  Time elapsed: 4.045 s
18:40:10 commitMessageProvider_twoProvidersSecondOneCrashing(org.eclipse.egit.ui.internal.dialogs.CommitMessageBuilderTest)  Time elapsed: 2.245 s
18:40:10 commitMessageProvider_multipleProvidersWithCrashingAndNullAndOneCaretPositioning(org.eclipse.egit.ui.internal.dialogs.CommitMessageBuilderTest)  Time elapsed: 0.385 s
18:40:10 commitMessageProvider_twoProvidersWithCaretPositioning(org.eclipse.egit.ui.internal.dialogs.CommitMessageBuilderTest)  Time elapsed: 0.09 s
18:40:10 commitMessageProvider_oneProviderWithInvalidCaretPositionExceedingMessageLength(org.eclipse.egit.ui.internal.dialogs.CommitMessageBuilderTest)  Time elapsed: 1.047 s
18:40:10 Running org.eclipse.egit.ui.internal.dialogs.SpellcheckableMessageAreaTest
18:40:10 Tests run: 25, Failures: 0, Errors: 0, Skipped: 0, Time elapsed: 0.006 s - in org.eclipse.egit.ui.internal.dialogs.SpellcheckableMessageAreaTest
18:40:10 testWrappingLongWords(org.eclipse.egit.ui.internal.dialogs.SpellcheckableMessageAreaTest)  Time elapsed: 0 s
18:40:10 wrapOnlyCommitMessageBody(org.eclipse.egit.ui.internal.dialogs.SpellcheckableMessageAreaTest)  Time elapsed: 0.001 s
18:40:10 dontWrapMaximumLengthText(org.eclipse.egit.ui.internal.dialogs.SpellcheckableMessageAreaTest)  Time elapsed: 0 s
18:40:10 keepTrailingSpace(org.eclipse.egit.ui.internal.dialogs.SpellcheckableMessageAreaTest)  Time elapsed: 0 s
18:40:10 dontWrapShortMessage(org.eclipse.egit.ui.internal.dialogs.SpellcheckableMessageAreaTest)  Time elapsed: 0 s
18:40:10 lineAfterWrappedWordShouldNotBeJoined(org.eclipse.egit.ui.internal.dialogs.SpellcheckableMessageAreaTest)  Time elapsed: 0 s
18:40:10 lineAfterWrappedWordShouldNotBeJoined2(org.eclipse.egit.ui.internal.dialogs.SpellcheckableMessageAreaTest)  Time elapsed: 0 s
18:40:10 lineAfterWrappedWordShouldNotBeJoined3(org.eclipse.egit.ui.internal.dialogs.SpellcheckableMessageAreaTest)  Time elapsed: 0 s
18:40:10 dontWrapWordLongerThanOneLine(org.eclipse.egit.ui.internal.dialogs.SpellcheckableMessageAreaTest)  Time elapsed: 0 s
18:40:10 keepExistingNewlines(org.eclipse.egit.ui.internal.dialogs.SpellcheckableMessageAreaTest)  Time elapsed: 0 s
18:40:10 dontWrapShortText(org.eclipse.egit.ui.internal.dialogs.SpellcheckableMessageAreaTest)  Time elapsed: 0 s
18:40:10 dontWrapWordLongerThanOneLineAtStart(org.eclipse.egit.ui.internal.dialogs.SpellcheckableMessageAreaTest)  Time elapsed: 0 s
18:40:10 dontWrapAlreadyWrappedText(org.eclipse.egit.ui.internal.dialogs.SpellcheckableMessageAreaTest)  Time elapsed: 0 s
18:40:10 wrapOverlengthText2(org.eclipse.egit.ui.internal.dialogs.SpellcheckableMessageAreaTest)  Time elapsed: 0 s
18:40:10 lineAfterWrappedWordShouldNotBeJoinedIfItStartsWithASymbol(org.eclipse.egit.ui.internal.dialogs.SpellcheckableMessageAreaTest)  Time elapsed: 0 s
18:40:10 wrapAlternatingBlankNonBlank(org.eclipse.egit.ui.internal.dialogs.SpellcheckableMessageAreaTest)  Time elapsed: 0.001 s
18:40:10 keepWhitespace(org.eclipse.egit.ui.internal.dialogs.SpellcheckableMessageAreaTest)  Time elapsed: 0 s
18:40:10 lineAfterWrappedWordShouldNotBeJoinedIfItsEmpty(org.eclipse.egit.ui.internal.dialogs.SpellcheckableMessageAreaTest)  Time elapsed: 0 s
18:40:10 dontWrapLongCommitMessageFooter(org.eclipse.egit.ui.internal.dialogs.SpellcheckableMessageAreaTest)  Time elapsed: 0 s
18:40:10 lineAfterWrappedLineShouldBeJoinedAndFollowingLineWrappedCorrectly(org.eclipse.egit.ui.internal.dialogs.SpellcheckableMessageAreaTest)  Time elapsed: 0 s
18:40:10 wrapOverlengthText(org.eclipse.egit.ui.internal.dialogs.SpellcheckableMessageAreaTest)  Time elapsed: 0 s
18:40:10 dontWrapWordLongerThanOneLineAndKeepSpaceAtFront(org.eclipse.egit.ui.internal.dialogs.SpellcheckableMessageAreaTest)  Time elapsed: 0 s
18:40:10 wrapSecondLongLine(org.eclipse.egit.ui.internal.dialogs.SpellcheckableMessageAreaTest)  Time elapsed: 0 s
18:40:10 wrapOverlengthTextByOne(org.eclipse.egit.ui.internal.dialogs.SpellcheckableMessageAreaTest)  Time elapsed: 0 s
18:40:10 keepNewlineAtEnd(org.eclipse.egit.ui.internal.dialogs.SpellcheckableMessageAreaTest)  Time elapsed: 0 s
18:40:10 Running org.eclipse.egit.ui.internal.synchronize.model.GitModelRootTest
18:40:11 Tests run: 1, Failures: 0, Errors: 0, Skipped: 0, Time elapsed: 1.325 s - in org.eclipse.egit.ui.internal.synchronize.model.GitModelRootTest
18:40:11 shouldIgnoreEmptyRepositories(org.eclipse.egit.ui.internal.synchronize.model.GitModelRootTest)  Time elapsed: 1.314 s
18:40:11 Running org.eclipse.egit.ui.internal.synchronize.model.GitModelCommitTest
18:40:16 Tests run: 7, Failures: 0, Errors: 0, Skipped: 0, Time elapsed: 4.79 s - in org.eclipse.egit.ui.internal.synchronize.model.GitModelCommitTest
18:40:16 shouldReturnNotEqualForDifferentCommits(org.eclipse.egit.ui.internal.synchronize.model.GitModelCommitTest)  Time elapsed: 0.606 s
18:40:16 shouldReturnNotEqualWhenCommitTreeAndBlob(org.eclipse.egit.ui.internal.synchronize.model.GitModelCommitTest)  Time elapsed: 0.677 s
18:40:16 shouldReturnNotEqualWhenCommitTreeAndTree(org.eclipse.egit.ui.internal.synchronize.model.GitModelCommitTest)  Time elapsed: 0.59 s
18:40:16 shouldReturnNotEqualWhenCommitTreeAndCache(org.eclipse.egit.ui.internal.synchronize.model.GitModelCommitTest)  Time elapsed: 0.569 s
18:40:16 shouldReturnEqualForSameInstance(org.eclipse.egit.ui.internal.synchronize.model.GitModelCommitTest)  Time elapsed: 0.568 s
18:40:16 shouldReturnNotEqualForDifferentParents(org.eclipse.egit.ui.internal.synchronize.model.GitModelCommitTest)  Time elapsed: 1.118 s
18:40:16 shouldReturnEqualForSameCommits(org.eclipse.egit.ui.internal.synchronize.model.GitModelCommitTest)  Time elapsed: 0.642 s
18:40:16 Running org.eclipse.egit.ui.internal.synchronize.model.GitModelBlobTest
18:40:24 Tests run: 15, Failures: 0, Errors: 0, Skipped: 2, Time elapsed: 8.363 s - in org.eclipse.egit.ui.internal.synchronize.model.GitModelBlobTest
18:40:24 shouldReturnEqualSameData1(org.eclipse.egit.ui.internal.synchronize.model.GitModelBlobTest) skipped
18:40:24 shouldReturnNotEqualForDifferentLocation(org.eclipse.egit.ui.internal.synchronize.model.GitModelBlobTest)  Time elapsed: 0.566 s
18:40:24 shouldReturnNotEqualForBlobAndCommit(org.eclipse.egit.ui.internal.synchronize.model.GitModelBlobTest)  Time elapsed: 0.531 s
18:40:24 shouldReturnEqualForSameData(org.eclipse.egit.ui.internal.synchronize.model.GitModelBlobTest) skipped
18:40:24 shouldReturnNotEqualForDifferentFiles(org.eclipse.egit.ui.internal.synchronize.model.GitModelBlobTest)  Time elapsed: 0.542 s
18:40:24 shouldReturnNotEqualForBlobAndCacheFile(org.eclipse.egit.ui.internal.synchronize.model.GitModelBlobTest)  Time elapsed: 0.691 s
18:40:24 shouldReturnNotEqualForBlobAndTree(org.eclipse.egit.ui.internal.synchronize.model.GitModelBlobTest)  Time elapsed: 0.589 s
18:40:24 shouldBeSymmetric1(org.eclipse.egit.ui.internal.synchronize.model.GitModelBlobTest)  Time elapsed: 0.53 s
18:40:24 shouldBeSymmetric(org.eclipse.egit.ui.internal.synchronize.model.GitModelBlobTest)  Time elapsed: 0.546 s
18:40:24 shouldReturnEqualForSameInstance(org.eclipse.egit.ui.internal.synchronize.model.GitModelBlobTest)  Time elapsed: 0.656 s
18:40:24 shouldActAsResourceProvider(org.eclipse.egit.ui.internal.synchronize.model.GitModelBlobTest)  Time elapsed: 0.533 s
18:40:24 shouldReturnNotEqualForDifferentBaseObjectId2(org.eclipse.egit.ui.internal.synchronize.model.GitModelBlobTest)  Time elapsed: 0.551 s
18:40:24 shouldReturnNotEqualForDifferentBaseObjectId3(org.eclipse.egit.ui.internal.synchronize.model.GitModelBlobTest)  Time elapsed: 0.54 s
18:40:24 shouldReturnNotEqualForBlobAndWorkingFile(org.eclipse.egit.ui.internal.synchronize.model.GitModelBlobTest)  Time elapsed: 0.569 s
18:40:24 shouldReturnNotEqualForDifferentBaseObjectId(org.eclipse.egit.ui.internal.synchronize.model.GitModelBlobTest)  Time elapsed: 1.49 s
18:40:24 Running org.eclipse.egit.ui.internal.synchronize.model.GitModelTreeTest
18:40:28 Tests run: 6, Failures: 0, Errors: 0, Skipped: 0, Time elapsed: 3.398 s - in org.eclipse.egit.ui.internal.synchronize.model.GitModelTreeTest
18:40:28 shouldReturnNotEqualForDifferentLocation(org.eclipse.egit.ui.internal.synchronize.model.GitModelTreeTest)  Time elapsed: 0.532 s
18:40:28 shouldReturnNotEqualForTreeAndCacheTree(org.eclipse.egit.ui.internal.synchronize.model.GitModelTreeTest)  Time elapsed: 0.554 s
18:40:28 shouldReturnNotEqualForTreeAndCommit(org.eclipse.egit.ui.internal.synchronize.model.GitModelTreeTest)  Time elapsed: 0.602 s
18:40:28 shouldReturnEqualForSameBaseCommit(org.eclipse.egit.ui.internal.synchronize.model.GitModelTreeTest)  Time elapsed: 0.562 s
18:40:28 shouldReturnEqualForSameInstance(org.eclipse.egit.ui.internal.synchronize.model.GitModelTreeTest)  Time elapsed: 0.579 s
18:40:28 shouldReturnNotEqualForTreeAndBlob(org.eclipse.egit.ui.internal.synchronize.model.GitModelTreeTest)  Time elapsed: 0.551 s
18:40:28 Running org.eclipse.egit.ui.internal.synchronize.model.GitModelCacheFileTest
18:40:31 Tests run: 7, Failures: 0, Errors: 0, Skipped: 2, Time elapsed: 2.903 s - in org.eclipse.egit.ui.internal.synchronize.model.GitModelCacheFileTest
18:40:31 shouldReturnEqualForSameObjectIdsAndLocation(org.eclipse.egit.ui.internal.synchronize.model.GitModelCacheFileTest)  Time elapsed: 0.529 s
18:40:31 shouldReturnNotEqualWhenComparingCacheFileAndBlob(org.eclipse.egit.ui.internal.synchronize.model.GitModelCacheFileTest)  Time elapsed: 0.539 s
18:40:31 shouldReturnNotEqualForDifferentCacheIds(org.eclipse.egit.ui.internal.synchronize.model.GitModelCacheFileTest) skipped
18:40:31 shouldReturnEqualForSameInstance(org.eclipse.egit.ui.internal.synchronize.model.GitModelCacheFileTest)  Time elapsed: 0.546 s
18:40:31 shouldReturnNotEqualWhenComparingCacheFileAndWorkingFile(org.eclipse.egit.ui.internal.synchronize.model.GitModelCacheFileTest)  Time elapsed: 0.745 s
18:40:31 shouldReturnNotEqualForDifferentBaseIds(org.eclipse.egit.ui.internal.synchronize.model.GitModelCacheFileTest)  Time elapsed: 0.532 s
18:40:31 shouldReturnNotEqualForDifferentLocations(org.eclipse.egit.ui.internal.synchronize.model.GitModelCacheFileTest) skipped
18:40:31 Running org.eclipse.egit.ui.internal.synchronize.model.GitModelCacheTreeTest
18:40:33 Tests run: 4, Failures: 0, Errors: 0, Skipped: 0, Time elapsed: 2.302 s - in org.eclipse.egit.ui.internal.synchronize.model.GitModelCacheTreeTest
18:40:33 shouldReturnEqualForSameData(org.eclipse.egit.ui.internal.synchronize.model.GitModelCacheTreeTest)  Time elapsed: 0.622 s
18:40:33 shouldReturnNotEqualForDifferetnLocation(org.eclipse.egit.ui.internal.synchronize.model.GitModelCacheTreeTest)  Time elapsed: 0.53 s
18:40:33 shouldReturnEqualForSameInstance(org.eclipse.egit.ui.internal.synchronize.model.GitModelCacheTreeTest)  Time elapsed: 0.529 s
18:40:33 shouldReturnNotEqualWhenComparingCacheTreeAndTree(org.eclipse.egit.ui.internal.synchronize.model.GitModelCacheTreeTest)  Time elapsed: 0.61 s
18:40:33 Running org.eclipse.egit.ui.internal.synchronize.model.GitModelRepositoryTest
18:40:35 Tests run: 3, Failures: 0, Errors: 0, Skipped: 0, Time elapsed: 2.147 s - in org.eclipse.egit.ui.internal.synchronize.model.GitModelRepositoryTest
18:40:35 shouldReturnEqual(org.eclipse.egit.ui.internal.synchronize.model.GitModelRepositoryTest)  Time elapsed: 0.739 s
18:40:35 shouldReturnNotEqual(org.eclipse.egit.ui.internal.synchronize.model.GitModelRepositoryTest)  Time elapsed: 0.668 s
18:40:35 shouldReturnEqualForSameInstance(org.eclipse.egit.ui.internal.synchronize.model.GitModelRepositoryTest)  Time elapsed: 0.729 s
18:40:35 Running org.eclipse.egit.ui.internal.synchronize.model.GitModelWorkingTreeTest
18:40:36 Tests run: 2, Failures: 0, Errors: 0, Skipped: 0, Time elapsed: 1.057 s - in org.eclipse.egit.ui.internal.synchronize.model.GitModelWorkingTreeTest
18:40:36 shouldReturnNotEqualsWhenComparingWorkingTreeAndCache(org.eclipse.egit.ui.internal.synchronize.model.GitModelWorkingTreeTest)  Time elapsed: 0.525 s
18:40:36 shouldReturnEqualsForTheSameInstance(org.eclipse.egit.ui.internal.synchronize.model.GitModelWorkingTreeTest)  Time elapsed: 0.527 s
18:40:36 Running org.eclipse.egit.ui.internal.synchronize.model.GitModelWorkingFileTest
18:40:39 Tests run: 5, Failures: 0, Errors: 0, Skipped: 0, Time elapsed: 2.769 s - in org.eclipse.egit.ui.internal.synchronize.model.GitModelWorkingFileTest
18:40:39 shouldReturnNotEqualForDifferentLocation(org.eclipse.egit.ui.internal.synchronize.model.GitModelWorkingFileTest)  Time elapsed: 0.527 s
18:40:39 shouldReturnNotEqualWhenComparingWorkingFileAndCacheFile(org.eclipse.egit.ui.internal.synchronize.model.GitModelWorkingFileTest)  Time elapsed: 0.548 s
18:40:39 shouldReturnEqualForSameInstance(org.eclipse.egit.ui.internal.synchronize.model.GitModelWorkingFileTest)  Time elapsed: 0.56 s
18:40:39 shouldReturnNotEqualWhenComparingWorkingFileAndBlob(org.eclipse.egit.ui.internal.synchronize.model.GitModelWorkingFileTest)  Time elapsed: 0.562 s
18:40:39 shouldReturnEqualForSameLocation(org.eclipse.egit.ui.internal.synchronize.model.GitModelWorkingFileTest)  Time elapsed: 0.559 s
18:40:39 Running org.eclipse.egit.ui.internal.synchronize.model.GitModelCacheTest
18:40:43 Tests run: 6, Failures: 0, Errors: 0, Skipped: 0, Time elapsed: 4.252 s - in org.eclipse.egit.ui.internal.synchronize.model.GitModelCacheTest
18:40:43 shouldReturnChildren(org.eclipse.egit.ui.internal.synchronize.model.GitModelCacheTest)  Time elapsed: 0.531 s
18:40:43 shouldReturnNotEqualWhenCacheTreeAndCommit(org.eclipse.egit.ui.internal.synchronize.model.GitModelCacheTest)  Time elapsed: 0.545 s
18:40:43 shouldReturnEqualForSameInstance(org.eclipse.egit.ui.internal.synchronize.model.GitModelCacheTest)  Time elapsed: 0.531 s
18:40:43 shouldReturnEqualForSameCommits(org.eclipse.egit.ui.internal.synchronize.model.GitModelCacheTest)  Time elapsed: 0.661 s
18:40:43 shouldReturnNotEqualWhenComparingCacheAndWorkingTree(org.eclipse.egit.ui.internal.synchronize.model.GitModelCacheTest)  Time elapsed: 0.818 s
18:40:43 shouldReturnNotEqualForDifferentRepositories(org.eclipse.egit.ui.internal.synchronize.model.GitModelCacheTest)  Time elapsed: 1.151 s
18:40:43 Running org.eclipse.egit.ui.internal.synchronize.mapping.GitChangeSetSorterTest
18:40:44 Tests run: 23, Failures: 0, Errors: 0, Skipped: 0, Time elapsed: 0.34 s - in org.eclipse.egit.ui.internal.synchronize.mapping.GitChangeSetSorterTest
18:40:44 commitTreeShouldBeLessThanBlob(org.eclipse.egit.ui.internal.synchronize.mapping.GitChangeSetSorterTest)  Time elapsed: 0.029 s
18:40:44 commitTreeShouldBeLessThanTree(org.eclipse.egit.ui.internal.synchronize.mapping.GitChangeSetSorterTest)  Time elapsed: 0 s
18:40:44 blobShouldBeGreaterThanTree(org.eclipse.egit.ui.internal.synchronize.mapping.GitChangeSetSorterTest)  Time elapsed: 0 s
18:40:44 cacheTreeShouldBeLessThanCommit(org.eclipse.egit.ui.internal.synchronize.mapping.GitChangeSetSorterTest)  Time elapsed: 0 s
18:40:44 shouldOrderTreesAlphabetically(org.eclipse.egit.ui.internal.synchronize.mapping.GitChangeSetSorterTest)  Time elapsed: 0.307 s
18:40:44 commitTreeShouldBeGreaterThanCache(org.eclipse.egit.ui.internal.synchronize.mapping.GitChangeSetSorterTest)  Time elapsed: 0 s
18:40:44 blobShouldBeGreaterThanWorkingTree(org.eclipse.egit.ui.internal.synchronize.mapping.GitChangeSetSorterTest)  Time elapsed: 0 s
18:40:44 treeShouldBeGreaterThanCache(org.eclipse.egit.ui.internal.synchronize.mapping.GitChangeSetSorterTest)  Time elapsed: 0 s
18:40:44 treeShouldBeGreaterThanCommit(org.eclipse.egit.ui.internal.synchronize.mapping.GitChangeSetSorterTest)  Time elapsed: 0 s
18:40:44 workingTreeShouldBeLessThanCacheTree(org.eclipse.egit.ui.internal.synchronize.mapping.GitChangeSetSorterTest)  Time elapsed: 0 s
18:40:44 treeShouldBeGreaterThanWorkingTree(org.eclipse.egit.ui.internal.synchronize.mapping.GitChangeSetSorterTest)  Time elapsed: 0 s
18:40:44 blobShouldBeGreaterThanCache(org.eclipse.egit.ui.internal.synchronize.mapping.GitChangeSetSorterTest)  Time elapsed: 0 s
18:40:44 cacheTreeShouldBeLessThanBlob(org.eclipse.egit.ui.internal.synchronize.mapping.GitChangeSetSorterTest)  Time elapsed: 0.001 s
18:40:44 cacheTreeShouldBeLessThanTree(org.eclipse.egit.ui.internal.synchronize.mapping.GitChangeSetSorterTest)  Time elapsed: 0 s
18:40:44 shouldOrderBlobsAlphabetically(org.eclipse.egit.ui.internal.synchronize.mapping.GitChangeSetSorterTest)  Time elapsed: 0 s
18:40:44 commitTreeShouldBeGreaterThanWorkingTree(org.eclipse.egit.ui.internal.synchronize.mapping.GitChangeSetSorterTest)  Time elapsed: 0 s
18:40:44 treeShouldBeLessThanBlob(org.eclipse.egit.ui.internal.synchronize.mapping.GitChangeSetSorterTest)  Time elapsed: 0 s
18:40:44 cacheTreeShouldBeGreaterThanWorkingTree(org.eclipse.egit.ui.internal.synchronize.mapping.GitChangeSetSorterTest)  Time elapsed: 0 s
18:40:44 workingTreeShouldBeLessThanBlob(org.eclipse.egit.ui.internal.synchronize.mapping.GitChangeSetSorterTest)  Time elapsed: 0 s
18:40:44 workingTreeShouldBeLessThanTree(org.eclipse.egit.ui.internal.synchronize.mapping.GitChangeSetSorterTest)  Time elapsed: 0 s
18:40:44 shouldOrderCommitsByCommitDate(org.eclipse.egit.ui.internal.synchronize.mapping.GitChangeSetSorterTest)  Time elapsed: 0.001 s
18:40:44 workingTreeShouldBeLessThanCommit(org.eclipse.egit.ui.internal.synchronize.mapping.GitChangeSetSorterTest)  Time elapsed: 0 s
18:40:44 blobShouldBeGreaterThanCommit(org.eclipse.egit.ui.internal.synchronize.mapping.GitChangeSetSorterTest)  Time elapsed: 0 s
18:40:44 Running org.eclipse.egit.ui.internal.decorators.DecoratableWorkingSetTest
18:40:50 Tests run: 7, Failures: 0, Errors: 0, Skipped: 0, Time elapsed: 6.685 s - in org.eclipse.egit.ui.internal.decorators.DecoratableWorkingSetTest
18:40:50 testAnyConflictsIsConflicts(org.eclipse.egit.ui.internal.decorators.DecoratableWorkingSetTest)  Time elapsed: 1.184 s
18:40:50 testUntrackedContentIsUndecorated(org.eclipse.egit.ui.internal.decorators.DecoratableWorkingSetTest)  Time elapsed: 1.167 s
18:40:50 testAnyDirtyIsDirty(org.eclipse.egit.ui.internal.decorators.DecoratableWorkingSetTest)  Time elapsed: 0.909 s
18:40:50 testDecorationConflictingOverDirty(org.eclipse.egit.ui.internal.decorators.DecoratableWorkingSetTest)  Time elapsed: 0.977 s
18:40:50 testEmptyWorkingSetIsUndecorated(org.eclipse.egit.ui.internal.decorators.DecoratableWorkingSetTest)  Time elapsed: 0.753 s
18:40:50 testStagingStateHasNoInfluence_Modified(org.eclipse.egit.ui.internal.decorators.DecoratableWorkingSetTest)  Time elapsed: 0.863 s
18:40:50 testAnyTrackedIsTracked(org.eclipse.egit.ui.internal.decorators.DecoratableWorkingSetTest)  Time elapsed: 0.792 s
18:40:50 Running org.eclipse.egit.ui.internal.decorators.DecoratableResourceMappingTest
18:41:00 Tests run: 9, Failures: 0, Errors: 0, Skipped: 0, Time elapsed: 9.256 s - in org.eclipse.egit.ui.internal.decorators.DecoratableResourceMappingTest
18:41:00 testAnyConflictsIsConflicts(org.eclipse.egit.ui.internal.decorators.DecoratableResourceMappingTest)  Time elapsed: 0.938 s
18:41:00 testSameStagingStateIsState_Added(org.eclipse.egit.ui.internal.decorators.DecoratableResourceMappingTest)  Time elapsed: 0.735 s
18:41:00 testAnyDirtyIsDirty(org.eclipse.egit.ui.internal.decorators.DecoratableResourceMappingTest)  Time elapsed: 0.771 s
18:41:00 testMixedStagingStateIsModified_RemovedAdded(org.eclipse.egit.ui.internal.decorators.DecoratableResourceMappingTest)  Time elapsed: 2.218 s
18:41:00 testAllIgnoredIsUnstaged(org.eclipse.egit.ui.internal.decorators.DecoratableResourceMappingTest)  Time elapsed: 0.735 s
18:41:00 testDecorationConflictingOverDirty(org.eclipse.egit.ui.internal.decorators.DecoratableResourceMappingTest)  Time elapsed: 1.384 s
18:41:00 testMixedStagingStateIsModified_AddedNotStaged(org.eclipse.egit.ui.internal.decorators.DecoratableResourceMappingTest)  Time elapsed: 0.774 s
18:41:00 testNewResourceMappingIsUnstaged(org.eclipse.egit.ui.internal.decorators.DecoratableResourceMappingTest)  Time elapsed: 0.814 s
18:41:00 testAnyTrackedIsTracked(org.eclipse.egit.ui.internal.decorators.DecoratableResourceMappingTest)  Time elapsed: 0.844 s
18:41:00 Running org.eclipse.egit.ui.internal.decorators.DecoratableResourceAdapterTest
18:41:10 Tests run: 13, Failures: 0, Errors: 0, Skipped: 0, Time elapsed: 10.712 s - in org.eclipse.egit.ui.internal.decorators.DecoratableResourceAdapterTest
18:41:10 testDecorationDeletedFile(org.eclipse.egit.ui.internal.decorators.DecoratableResourceAdapterTest)  Time elapsed: 1.068 s
18:41:10 testDecorationModifiedFile(org.eclipse.egit.ui.internal.decorators.DecoratableResourceAdapterTest)  Time elapsed: 0.912 s
18:41:10 testDecorationEmptyProject(org.eclipse.egit.ui.internal.decorators.DecoratableResourceAdapterTest)  Time elapsed: 0.635 s
18:41:10 testDecorationConflictingFile(org.eclipse.egit.ui.internal.decorators.DecoratableResourceAdapterTest)  Time elapsed: 1.102 s
18:41:10 testDecorationNewEmptyFolder(org.eclipse.egit.ui.internal.decorators.DecoratableResourceAdapterTest)  Time elapsed: 0.761 s
18:41:10 testDecorationFolderPrefixOfOtherFolder(org.eclipse.egit.ui.internal.decorators.DecoratableResourceAdapterTest)  Time elapsed: 0.861 s
18:41:10 testDecorationNewFileInOneSubfolder(org.eclipse.egit.ui.internal.decorators.DecoratableResourceAdapterTest)  Time elapsed: 0.916 s
18:41:10 testDecorationNewFile(org.eclipse.egit.ui.internal.decorators.DecoratableResourceAdapterTest)  Time elapsed: 0.727 s
18:41:10 testDecorationNewFileInSubfolder(org.eclipse.egit.ui.internal.decorators.DecoratableResourceAdapterTest)  Time elapsed: 0.729 s
18:41:10 testDecorationCommittedFile(org.eclipse.egit.ui.internal.decorators.DecoratableResourceAdapterTest)  Time elapsed: 0.785 s
18:41:10 testDecorationFileInIgnoredFolder(org.eclipse.egit.ui.internal.decorators.DecoratableResourceAdapterTest)  Time elapsed: 0.727 s
18:41:10 testDecorationIgnoredFile(org.eclipse.egit.ui.internal.decorators.DecoratableResourceAdapterTest)  Time elapsed: 0.728 s
18:41:10 testDecorationAddedFile(org.eclipse.egit.ui.internal.decorators.DecoratableResourceAdapterTest)  Time elapsed: 0.73 s
18:41:10 Running org.eclipse.egit.ui.internal.push.PushToUpstreamTest
18:41:13 
18:41:13 (SWT:1454): Gtk-WARNING **: 22:41:13.523: Negative content width -1 (allocation 1, extents 1x1) while allocating gadget (node trough, owner GtkProgressBar)
18:41:13 Tests run: 3, Failures: 0, Errors: 0, Skipped: 0, Time elapsed: 2.871 s - in org.eclipse.egit.ui.internal.push.PushToUpstreamTest
18:41:13 pushWithExistingUpstreamConfiguration(org.eclipse.egit.ui.internal.push.PushToUpstreamTest)  Time elapsed: 1.091 s
18:41:13 pushWithoutConfig(org.eclipse.egit.ui.internal.push.PushToUpstreamTest)  Time elapsed: 0.874 s
18:41:13 pushWithDefaultRemoteWithPushRefSpecs(org.eclipse.egit.ui.internal.push.PushToUpstreamTest)  Time elapsed: 0.896 s
18:41:13 Running org.eclipse.egit.ui.internal.push.PushBranchWizardTest
18:41:14 
18:41:14 (SWT:1454): Gtk-CRITICAL **: 22:41:14.523: gtk_box_gadget_distribute: assertion 'size >= 0' failed in GtkScrollbar
18:41:14 
18:41:14 (SWT:1454): Gtk-CRITICAL **: 22:41:14.524: gtk_box_gadget_distribute: assertion 'size >= 0' failed in GtkScrollbar
18:41:14 
18:41:14 (SWT:1454): Gtk-CRITICAL **: 22:41:14.528: gtk_box_gadget_distribute: assertion 'size >= 0' failed in GtkScrollbar
18:41:14 
18:41:14 (SWT:1454): Gtk-CRITICAL **: 22:41:14.533: gtk_box_gadget_distribute: assertion 'size >= 0' failed in GtkScrollbar
18:41:25 Tests run: 9, Failures: 0, Errors: 0, Skipped: 0, Time elapsed: 11.324 s - in org.eclipse.egit.ui.internal.push.PushBranchWizardTest
18:41:25 pushHeadToExistingRemote(org.eclipse.egit.ui.internal.push.PushBranchWizardTest)  Time elapsed: 1.086 s
18:41:25 pushWithRemoteUpstreamConfiguration(org.eclipse.egit.ui.internal.push.PushBranchWizardTest)  Time elapsed: 1.123 s
18:41:25 pushWithDifferentBranchName(org.eclipse.egit.ui.internal.push.PushBranchWizardTest)  Time elapsed: 1.07 s
18:41:25 pushToExistingRemoteAndSetRebase(org.eclipse.egit.ui.internal.push.PushBranchWizardTest)  Time elapsed: 2.168 s
18:41:25 pushToNewRemote(org.eclipse.egit.ui.internal.push.PushBranchWizardTest)  Time elapsed: 1.249 s
18:41:25 pushToExistingRemoteWithoutConfiguringUpstream(org.eclipse.egit.ui.internal.push.PushBranchWizardTest)  Time elapsed: 1.03 s
18:41:25 pushToExistingRemote(org.eclipse.egit.ui.internal.push.PushBranchWizardTest)  Time elapsed: 1.056 s
18:41:25 pushWhenNoRemoteExistsYet(org.eclipse.egit.ui.internal.push.PushBranchWizardTest)  Time elapsed: 1.093 s
18:41:25 pushWithLocalUpstreamConfiguration(org.eclipse.egit.ui.internal.push.PushBranchWizardTest)  Time elapsed: 1.421 s
18:41:25 Running org.eclipse.egit.ui.internal.push.PushTagsWizardTest
18:41:26 Tests run: 1, Failures: 0, Errors: 0, Skipped: 0, Time elapsed: 1.075 s - in org.eclipse.egit.ui.internal.push.PushTagsWizardTest
18:41:26 pushTag(org.eclipse.egit.ui.internal.push.PushTagsWizardTest)  Time elapsed: 1.071 s
18:41:26 Running org.eclipse.egit.ui.internal.branch.BranchProjectTrackerTest
18:41:27 Tests run: 1, Failures: 0, Errors: 0, Skipped: 0, Time elapsed: 1.072 s - in org.eclipse.egit.ui.internal.branch.BranchProjectTrackerTest
18:41:27 twoProjectsWithOnlyOneOnBranch(org.eclipse.egit.ui.internal.branch.BranchProjectTrackerTest)  Time elapsed: 1.068 s
18:41:27 Running org.eclipse.egit.ui.internal.actions.StashesMenuTest
18:41:28 
18:41:28 (SWT:1454): Gtk-WARNING **: 22:41:28.829: Negative content width -6 (allocation 1, extents 4x3) while allocating gadget (node toolbar, owner GtkToolbar)
18:41:28 
18:41:28 (SWT:1454): Gtk-WARNING **: 22:41:28.829: Negative content height -3 (allocation 1, extents 2x2) while allocating gadget (node toolbar, owner GtkToolbar)
18:41:28 
18:41:28 (SWT:1454): Gtk-WARNING **: 22:41:28.829: Negative content width -6 (allocation 1, extents 4x3) while allocating gadget (node toolbar, owner GtkToolbar)
18:41:28 
18:41:28 (SWT:1454): Gtk-WARNING **: 22:41:28.829: Negative content height -3 (allocation 1, extents 2x2) while allocating gadget (node toolbar, owner GtkToolbar)
18:41:28 
18:41:28 (SWT:1454): Gtk-WARNING **: 22:41:28.909: Negative content width -6 (allocation 1, extents 4x3) while allocating gadget (node toolbar, owner GtkToolbar)
18:41:28 
18:41:28 (SWT:1454): Gtk-WARNING **: 22:41:28.925: Negative content width -6 (allocation 1, extents 4x3) while allocating gadget (node toolbar, owner GtkToolbar)
18:41:29 Tests run: 2, Failures: 0, Errors: 0, Skipped: 0, Time elapsed: 2.104 s - in org.eclipse.egit.ui.internal.actions.StashesMenuTest
18:41:29 menuWithoutStashes(org.eclipse.egit.ui.internal.actions.StashesMenuTest)  Time elapsed: 0.657 s
18:41:29 stashAndApplyChanges(org.eclipse.egit.ui.internal.actions.StashesMenuTest)  Time elapsed: 1.44 s
18:41:29 Running org.eclipse.egit.ui.internal.actions.LinkedResourcesTest
18:41:30 Tests run: 2, Failures: 0, Errors: 0, Skipped: 0, Time elapsed: 1.129 s - in org.eclipse.egit.ui.internal.actions.LinkedResourcesTest
18:41:30 testSomeActionsWithoutLinkedResources(org.eclipse.egit.ui.internal.actions.LinkedResourcesTest)  Time elapsed: 0.544 s
18:41:30 testNoActionOnLinkedResources(org.eclipse.egit.ui.internal.actions.LinkedResourcesTest)  Time elapsed: 0.579 s
18:41:30 Running org.eclipse.egit.ui.internal.actions.SwitchToMenuTest
18:41:37 Tests run: 8, Failures: 0, Errors: 0, Skipped: 0, Time elapsed: 7.53 s - in org.eclipse.egit.ui.internal.actions.SwitchToMenuTest
18:41:37 multipleSelectionWithMultipleRepositoriesAndNoCommonBranches(org.eclipse.egit.ui.internal.actions.SwitchToMenuTest)  Time elapsed: 0.834 s
18:41:37 selectionWithProj1(org.eclipse.egit.ui.internal.actions.SwitchToMenuTest)  Time elapsed: 0.534 s
18:41:37 selectionNotAdaptableToRepository(org.eclipse.egit.ui.internal.actions.SwitchToMenuTest)  Time elapsed: 0.064 s
18:41:37 selectionWithProj1AndReflog(org.eclipse.egit.ui.internal.actions.SwitchToMenuTest)  Time elapsed: 0.563 s
18:41:37 validateMenuEntriesForMultiSelectionWithMultipleRepositories(org.eclipse.egit.ui.internal.actions.SwitchToMenuTest)  Time elapsed: 2.814 s
18:41:37 validateBranchSwitchingForForMultiSelectionWithMultipleRepositories(org.eclipse.egit.ui.internal.actions.SwitchToMenuTest)  Time elapsed: 1.054 s
18:41:37 selectionWithRepositoryHavingOver20Branches(org.eclipse.egit.ui.internal.actions.SwitchToMenuTest)  Time elapsed: 1.583 s
18:41:37 emptySelection(org.eclipse.egit.ui.internal.actions.SwitchToMenuTest)  Time elapsed: 0.062 s
18:41:37 Running org.eclipse.egit.ui.internal.fetch.FetchGerritChangeTest
18:41:37 Tests run: 15, Failures: 0, Errors: 0, Skipped: 0, Time elapsed: 0.006 s - in org.eclipse.egit.ui.internal.fetch.FetchGerritChangeTest
18:41:37 testChangeStringNoDigits(org.eclipse.egit.ui.internal.fetch.FetchGerritChangeTest)  Time elapsed: 0.003 s
18:41:37 testChangeStringOverflow(org.eclipse.egit.ui.internal.fetch.FetchGerritChangeTest)  Time elapsed: 0 s
18:41:37 testChangeStringTwoNumbers(org.eclipse.egit.ui.internal.fetch.FetchGerritChangeTest)  Time elapsed: 0.001 s
18:41:37 testFromRef(org.eclipse.egit.ui.internal.fetch.FetchGerritChangeTest)  Time elapsed: 0 s
18:41:37 testChangeStringNegative(org.eclipse.egit.ui.internal.fetch.FetchGerritChangeTest)  Time elapsed: 0 s
18:41:37 testChangeStringUri(org.eclipse.egit.ui.internal.fetch.FetchGerritChangeTest)  Time elapsed: 0 s
18:41:37 testRefFromChange(org.eclipse.egit.ui.internal.fetch.FetchGerritChangeTest)  Time elapsed: 0 s
18:41:37 testChangeStringUriNonsense(org.eclipse.egit.ui.internal.fetch.FetchGerritChangeTest)  Time elapsed: 0 s
18:41:37 testChangeStringThreeNumbers(org.eclipse.egit.ui.internal.fetch.FetchGerritChangeTest)  Time elapsed: 0 s
18:41:37 testChangeStringMultiline(org.eclipse.egit.ui.internal.fetch.FetchGerritChangeTest)  Time elapsed: 0 s
18:41:37 testChangeStringSingleNumber(org.eclipse.egit.ui.internal.fetch.FetchGerritChangeTest)  Time elapsed: 0 s
18:41:37 testChangeRefs(org.eclipse.egit.ui.internal.fetch.FetchGerritChangeTest)  Time elapsed: 0 s
18:41:37 testChangeStringEmpty(org.eclipse.egit.ui.internal.fetch.FetchGerritChangeTest)  Time elapsed: 0 s
18:41:37 testChangeStringNull(org.eclipse.egit.ui.internal.fetch.FetchGerritChangeTest)  Time elapsed: 0 s
18:41:37 testChangeStringZero(org.eclipse.egit.ui.internal.fetch.FetchGerritChangeTest)  Time elapsed: 0 s
18:41:37 Running org.eclipse.egit.ui.internal.submodules.SubmoduleFolderTest
18:41:39 
18:41:39 (SWT:1454): Gtk-WARNING **: 22:41:39.317: Negative content width -6 (allocation 1, extents 4x3) while allocating gadget (node toolbar, owner GtkToolbar)
18:41:39 
18:41:39 (SWT:1454): Gtk-WARNING **: 22:41:39.317: Negative content height -3 (allocation 1, extents 2x2) while allocating gadget (node toolbar, owner GtkToolbar)
18:41:39 
18:41:39 (SWT:1454): Gtk-WARNING **: 22:41:39.317: Negative content width -6 (allocation 1, extents 4x3) while allocating gadget (node toolbar, owner GtkToolbar)
18:41:39 
18:41:39 (SWT:1454): Gtk-WARNING **: 22:41:39.317: Negative content height -3 (allocation 1, extents 2x2) while allocating gadget (node toolbar, owner GtkToolbar)
18:41:39 
18:41:39 (SWT:1454): Gtk-WARNING **: 22:41:39.720: Negative content width -6 (allocation 1, extents 4x3) while allocating gadget (node toolbar, owner GtkToolbar)
18:41:39 
18:41:39 (SWT:1454): Gtk-WARNING **: 22:41:39.725: Negative content width -6 (allocation 1, extents 4x3) while allocating gadget (node toolbar, owner GtkToolbar)
18:41:39 
18:41:39 (SWT:1454): Gtk-WARNING **: 22:41:39.729: Negative content width -6 (allocation 1, extents 4x3) while allocating gadget (node toolbar, owner GtkToolbar)
18:41:39 
18:41:39 (SWT:1454): Gtk-WARNING **: 22:41:39.736: Negative content width -6 (allocation 1, extents 4x3) while allocating gadget (node toolbar, owner GtkToolbar)
18:41:39 
18:41:39 (SWT:1454): Gtk-WARNING **: 22:41:39.758: Negative content width -6 (allocation 1, extents 4x3) while allocating gadget (node toolbar, owner GtkToolbar)
18:41:39 
18:41:39 (SWT:1454): Gtk-WARNING **: 22:41:39.759: Negative content width -6 (allocation 1, extents 4x3) while allocating gadget (node toolbar, owner GtkToolbar)
18:41:39 
18:41:39 (SWT:1454): Gtk-WARNING **: 22:41:39.794: Negative content width -6 (allocation 1, extents 4x3) while allocating gadget (node toolbar, owner GtkToolbar)
18:41:39 
18:41:39 (SWT:1454): Gtk-WARNING **: 22:41:39.795: Negative content width -6 (allocation 1, extents 4x3) while allocating gadget (node toolbar, owner GtkToolbar)
18:41:46 
18:41:46 (SWT:1454): Gtk-WARNING **: 22:41:46.470: Negative content width -6 (allocation 1, extents 4x3) while allocating gadget (node toolbar, owner GtkToolbar)
18:41:46 
18:41:46 (SWT:1454): Gtk-WARNING **: 22:41:46.488: Negative content width -6 (allocation 1, extents 4x3) while allocating gadget (node toolbar, owner GtkToolbar)
18:41:46 
18:41:46 (SWT:1454): Gtk-WARNING **: 22:41:46.536: Negative content width -6 (allocation 1, extents 4x3) while allocating gadget (node toolbar, owner GtkToolbar)
18:41:46 
18:41:46 (SWT:1454): Gtk-WARNING **: 22:41:46.537: Negative content width -6 (allocation 1, extents 4x3) while allocating gadget (node toolbar, owner GtkToolbar)
18:41:46 
18:41:46 (SWT:1454): Gtk-CRITICAL **: 22:41:46.570: gtk_box_gadget_distribute: assertion 'size >= 0' failed in GtkScrollbar
18:41:46 
18:41:46 (SWT:1454): Gtk-WARNING **: 22:41:46.576: Negative content width -6 (allocation 1, extents 4x3) while allocating gadget (node toolbar, owner GtkToolbar)
18:41:46 
18:41:46 (SWT:1454): Gtk-WARNING **: 22:41:46.591: Negative content width -6 (allocation 1, extents 4x3) while allocating gadget (node toolbar, owner GtkToolbar)
18:41:46 
18:41:46 (SWT:1454): Gtk-CRITICAL **: 22:41:46.611: gtk_box_gadget_distribute: assertion 'size >= 0' failed in GtkScrollbar
18:41:46 
18:41:46 (SWT:1454): Gtk-WARNING **: 22:41:46.635: Negative content width -6 (allocation 1, extents 4x3) while allocating gadget (node toolbar, owner GtkToolbar)
18:41:46 
18:41:46 (SWT:1454): Gtk-CRITICAL **: 22:41:46.639: gtk_box_gadget_distribute: assertion 'size >= 0' failed in GtkScrollbar
18:41:46 
18:41:46 (SWT:1454): Gtk-CRITICAL **: 22:41:46.640: gtk_box_gadget_distribute: assertion 'size >= 0' failed in GtkScrollbar
18:41:46 
18:41:46 (SWT:1454): Gtk-WARNING **: 22:41:46.685: Negative content width -6 (allocation 1, extents 4x3) while allocating gadget (node toolbar, owner GtkToolbar)
18:41:54 Tests run: 9, Failures: 0, Errors: 0, Skipped: 0, Time elapsed: 16.757 s - in org.eclipse.egit.ui.internal.submodules.SubmoduleFolderTest
18:41:54 compareWithHeadInSubmoduleFolder(org.eclipse.egit.ui.internal.submodules.SubmoduleFolderTest)  Time elapsed: 2.049 s
18:41:54 testStageUnstageInSubRepo(org.eclipse.egit.ui.internal.submodules.SubmoduleFolderTest)  Time elapsed: 3.056 s
18:41:54 testDecoration(org.eclipse.egit.ui.internal.submodules.SubmoduleFolderTest)  Time elapsed: 2.261 s
18:41:54 testHistoryFromProjectExplorerIsFromSubRepository(org.eclipse.egit.ui.internal.submodules.SubmoduleFolderTest)  Time elapsed: 1.731 s
18:41:54 testParentFolderMapsToParentRepo(org.eclipse.egit.ui.internal.submodules.SubmoduleFolderTest)  Time elapsed: 1.258 s
18:41:54 testDisconnect(org.eclipse.egit.ui.internal.submodules.SubmoduleFolderTest)  Time elapsed: 1.902 s
18:41:54 testRepoRemoval(org.eclipse.egit.ui.internal.submodules.SubmoduleFolderTest)  Time elapsed: 1.394 s
18:41:54 testChildProjectMapsToSubRepo(org.eclipse.egit.ui.internal.submodules.SubmoduleFolderTest)  Time elapsed: 1.101 s
18:41:54 testChildFolderMapsToSubRepo(org.eclipse.egit.ui.internal.submodules.SubmoduleFolderTest)  Time elapsed: 1.948 s
18:41:54 Running org.eclipse.egit.ui.internal.CommonUtilsTest
18:41:54 Tests run: 10, Failures: 0, Errors: 0, Skipped: 0, Time elapsed: 0.191 s - in org.eclipse.egit.ui.internal.CommonUtilsTest
18:41:54 sortingShouldWorkForBigNumbers(org.eclipse.egit.ui.internal.CommonUtilsTest)  Time elapsed: 0 s
18:41:54 sortingShouldWorkForMixedParts(org.eclipse.egit.ui.internal.CommonUtilsTest)  Time elapsed: 0 s
18:41:54 sortingShouldWorkForNumbers(org.eclipse.egit.ui.internal.CommonUtilsTest)  Time elapsed: 0 s
18:41:54 testFooterOffset(org.eclipse.egit.ui.internal.CommonUtilsTest)  Time elapsed: 0.001 s
18:41:54 sortingShouldWorkForEqualAndEmptyStrings(org.eclipse.egit.ui.internal.CommonUtilsTest)  Time elapsed: 0 s
18:41:54 sortingShouldIgnoreCase(org.eclipse.egit.ui.internal.CommonUtilsTest)  Time elapsed: 0 s
18:41:54 testFooterOffsetNoFooter(org.eclipse.egit.ui.internal.CommonUtilsTest)  Time elapsed: 0 s
18:41:54 sortingShouldIgnoreLeadingZeros(org.eclipse.egit.ui.internal.CommonUtilsTest)  Time elapsed: 0 s
18:41:54 testResourceCompare(org.eclipse.egit.ui.internal.CommonUtilsTest)  Time elapsed: 0.189 s
18:41:54 sortingShouldWorkForEasyStrings(org.eclipse.egit.ui.internal.CommonUtilsTest)  Time elapsed: 0 s
18:41:54 Running org.eclipse.egit.ui.internal.selection.SelectionUtilsTest
18:41:54 Tests run: 1, Failures: 0, Errors: 0, Skipped: 0, Time elapsed: 0.063 s - in org.eclipse.egit.ui.internal.selection.SelectionUtilsTest
18:41:54 getSelectedResourcesShouldUseAllTraversals(org.eclipse.egit.ui.internal.selection.SelectionUtilsTest)  Time elapsed: 0.063 s
18:41:54 Running org.eclipse.egit.ui.internal.selection.SelectionForViewsTest
18:41:56 
18:41:56 (SWT:1454): Gtk-WARNING **: 22:41:56.890: Negative content width -9 (allocation 9, extents 9x9) while allocating gadget (node entry, owner GtkEntry)
18:41:56 
18:41:56 (SWT:1454): Gtk-CRITICAL **: 22:41:56.932: gtk_box_gadget_distribute: assertion 'size >= 0' failed in GtkScrollbar
18:41:56 
18:41:56 (SWT:1454): Gtk-CRITICAL **: 22:41:56.945: gtk_box_gadget_distribute: assertion 'size >= 0' failed in GtkScrollbar
18:41:56 
18:41:56 (SWT:1454): Gtk-WARNING **: 22:41:56.951: Negative content width -6 (allocation 1, extents 4x3) while allocating gadget (node toolbar, owner GtkToolbar)
18:41:56 
18:41:56 (SWT:1454): Gtk-CRITICAL **: 22:41:56.960: gtk_box_gadget_distribute: assertion 'size >= 0' failed in GtkScrollbar
18:41:56 
18:41:56 (SWT:1454): Gtk-WARNING **: 22:41:56.990: Negative content width -6 (allocation 1, extents 4x3) while allocating gadget (node toolbar, owner GtkToolbar)
18:41:57 
18:41:57 (SWT:1454): Gtk-WARNING **: 22:41:57.029: Negative content width -6 (allocation 1, extents 4x3) while allocating gadget (node toolbar, owner GtkToolbar)
18:41:57 
18:41:57 (SWT:1454): Gtk-WARNING **: 22:41:57.066: Negative content width -6 (allocation 1, extents 4x3) while allocating gadget (node toolbar, owner GtkToolbar)
18:41:57 
18:41:57 (SWT:1454): Gtk-WARNING **: 22:41:57.071: Negative content width -6 (allocation 1, extents 4x3) while allocating gadget (node toolbar, owner GtkToolbar)
18:41:57 
18:41:57 (SWT:1454): Gtk-WARNING **: 22:41:57.081: Negative content width -6 (allocation 1, extents 4x3) while allocating gadget (node toolbar, owner GtkToolbar)
18:41:57 
18:41:57 (SWT:1454): Gtk-WARNING **: 22:41:57.081: Negative content width -6 (allocation 1, extents 4x3) while allocating gadget (node toolbar, owner GtkToolbar)
18:41:57 
18:41:57 (SWT:1454): Gtk-WARNING **: 22:41:57.103: Negative content width -6 (allocation 1, extents 4x3) while allocating gadget (node toolbar, owner GtkToolbar)
18:41:57 
18:41:57 (SWT:1454): Gtk-WARNING **: 22:41:57.200: Negative content width -6 (allocation 1, extents 4x3) while allocating gadget (node toolbar, owner GtkToolbar)
18:41:57 
18:41:57 (SWT:1454): Gtk-WARNING **: 22:41:57.246: Negative content width -6 (allocation 1, extents 4x3) while allocating gadget (node toolbar, owner GtkToolbar)
18:41:57 
18:41:57 (SWT:1454): Gtk-WARNING **: 22:41:57.285: Negative content width -6 (allocation 1, extents 4x3) while allocating gadget (node toolbar, owner GtkToolbar)
18:41:57 
18:41:57 (SWT:1454): Gtk-CRITICAL **: 22:41:57.331: gtk_box_gadget_distribute: assertion 'size >= 0' failed in GtkScrollbar
18:41:57 
18:41:57 (SWT:1454): Gtk-CRITICAL **: 22:41:57.349: gtk_box_gadget_distribute: assertion 'size >= 0' failed in GtkScrollbar
18:41:57 
18:41:57 (SWT:1454): Gtk-CRITICAL **: 22:41:57.367: gtk_box_gadget_distribute: assertion 'size >= 0' failed in GtkScrollbar
18:41:57 
18:41:57 (SWT:1454): Gtk-CRITICAL **: 22:41:57.383: gtk_box_gadget_distribute: assertion 'size >= 0' failed in GtkScrollbar
18:41:57 
18:41:57 (SWT:1454): Gtk-CRITICAL **: 22:41:57.399: gtk_box_gadget_distribute: assertion 'size >= 0' failed in GtkScrollbar
18:41:57 
18:41:57 (SWT:1454): Gtk-CRITICAL **: 22:41:57.417: gtk_box_gadget_distribute: assertion 'size >= 0' failed in GtkScrollbar
18:41:57 
18:41:57 (SWT:1454): Gtk-CRITICAL **: 22:41:57.433: gtk_box_gadget_distribute: assertion 'size >= 0' failed in GtkScrollbar
18:41:57 
18:41:57 (SWT:1454): Gtk-CRITICAL **: 22:41:57.450: gtk_box_gadget_distribute: assertion 'size >= 0' failed in GtkScrollbar
18:41:57 
18:41:57 (SWT:1454): Gtk-CRITICAL **: 22:41:57.466: gtk_box_gadget_distribute: assertion 'size >= 0' failed in GtkScrollbar
18:41:57 
18:41:57 (SWT:1454): Gtk-CRITICAL **: 22:41:57.483: gtk_box_gadget_distribute: assertion 'size >= 0' failed in GtkScrollbar
18:41:57 
18:41:57 (SWT:1454): Gtk-CRITICAL **: 22:41:57.499: gtk_box_gadget_distribute: assertion 'size >= 0' failed in GtkScrollbar
18:41:57 
18:41:57 (SWT:1454): Gtk-CRITICAL **: 22:41:57.516: gtk_box_gadget_distribute: assertion 'size >= 0' failed in GtkScrollbar
18:41:57 
18:41:57 (SWT:1454): Gtk-CRITICAL **: 22:41:57.532: gtk_box_gadget_distribute: assertion 'size >= 0' failed in GtkScrollbar
18:41:57 
18:41:57 (SWT:1454): Gtk-CRITICAL **: 22:41:57.549: gtk_box_gadget_distribute: assertion 'size >= 0' failed in GtkScrollbar
18:41:57 
18:41:57 (SWT:1454): Gtk-WARNING **: 22:41:57.663: Negative content width -6 (allocation 1, extents 4x3) while allocating gadget (node toolbar, owner GtkToolbar)
18:41:57 
18:41:57 (SWT:1454): Gtk-WARNING **: 22:41:57.676: Negative content width -6 (allocation 1, extents 4x3) while allocating gadget (node toolbar, owner GtkToolbar)
18:41:58 
18:41:58 (SWT:1454): Gtk-WARNING **: 22:41:58.939: Negative content width -6 (allocation 1, extents 4x3) while allocating gadget (node toolbar, owner GtkToolbar)
18:41:59 
18:41:59 (SWT:1454): Gtk-WARNING **: 22:41:59.148: Negative content width -6 (allocation 1, extents 4x3) while allocating gadget (node toolbar, owner GtkToolbar)
18:41:59 
18:41:59 (SWT:1454): Gtk-WARNING **: 22:41:59.681: Negative content width -6 (allocation 1, extents 4x3) while allocating gadget (node toolbar, owner GtkToolbar)
18:41:59 
18:41:59 (SWT:1454): Gtk-WARNING **: 22:41:59.889: Negative content width -6 (allocation 1, extents 4x3) while allocating gadget (node toolbar, owner GtkToolbar)
18:42:00 
18:42:00 (SWT:1454): Gtk-CRITICAL **: 22:42:00.424: gtk_box_gadget_distribute: assertion 'size >= 0' failed in GtkScrollbar
18:42:00 
18:42:00 (SWT:1454): Gtk-WARNING **: 22:42:00.427: Negative content width -6 (allocation 1, extents 4x3) while allocating gadget (node toolbar, owner GtkToolbar)
18:42:00 
18:42:00 (SWT:1454): Gtk-WARNING **: 22:42:00.636: Negative content width -6 (allocation 1, extents 4x3) while allocating gadget (node toolbar, owner GtkToolbar)
18:42:01 
18:42:01 (SWT:1454): Gtk-CRITICAL **: 22:42:01.053: gtk_box_gadget_distribute: assertion 'size >= 0' failed in GtkScrollbar
18:42:01 
18:42:01 (SWT:1454): Gtk-WARNING **: 22:42:01.076: Negative content width -6 (allocation 1, extents 4x3) while allocating gadget (node toolbar, owner GtkToolbar)
18:42:01 
18:42:01 (SWT:1454): Gtk-CRITICAL **: 22:42:01.092: gtk_box_gadget_distribute: assertion 'size >= 0' failed in GtkScrollbar
18:42:01 
18:42:01 (SWT:1454): Gtk-CRITICAL **: 22:42:01.096: gtk_box_gadget_distribute: assertion 'size >= 0' failed in GtkScrollbar
18:42:01 
18:42:01 (SWT:1454): Gtk-WARNING **: 22:42:01.283: Negative content width -6 (allocation 1, extents 4x3) while allocating gadget (node toolbar, owner GtkToolbar)
18:42:03 
18:42:03 (SWT:1454): Gtk-WARNING **: 22:42:03.888: Negative content width -6 (allocation 1, extents 4x3) while allocating gadget (node toolbar, owner GtkToolbar)
18:42:03 
18:42:03 (SWT:1454): Gtk-WARNING **: 22:42:03.902: Negative content width -6 (allocation 1, extents 4x3) while allocating gadget (node toolbar, owner GtkToolbar)
18:42:04 
18:42:04 (SWT:1454): Gtk-WARNING **: 22:42:04.800: Negative content width -9 (allocation 9, extents 9x9) while allocating gadget (node entry, owner GtkEntry)
18:42:04 
18:42:04 (SWT:1454): Gtk-CRITICAL **: 22:42:04.840: gtk_box_gadget_distribute: assertion 'size >= 0' failed in GtkScrollbar
18:42:04 
18:42:04 (SWT:1454): Gtk-CRITICAL **: 22:42:04.852: gtk_box_gadget_distribute: assertion 'size >= 0' failed in GtkScrollbar
18:42:04 
18:42:04 (SWT:1454): Gtk-WARNING **: 22:42:04.858: Negative content width -6 (allocation 1, extents 4x3) while allocating gadget (node toolbar, owner GtkToolbar)
18:42:04 
18:42:04 (SWT:1454): Gtk-CRITICAL **: 22:42:04.867: gtk_box_gadget_distribute: assertion 'size >= 0' failed in GtkScrollbar
18:42:04 
18:42:04 (SWT:1454): Gtk-WARNING **: 22:42:04.931: Negative content width -6 (allocation 1, extents 4x3) while allocating gadget (node toolbar, owner GtkToolbar)
18:42:04 
18:42:04 (SWT:1454): Gtk-WARNING **: 22:42:04.968: Negative content width -6 (allocation 1, extents 4x3) while allocating gadget (node toolbar, owner GtkToolbar)
18:42:04 
18:42:04 (SWT:1454): Gtk-WARNING **: 22:42:04.973: Negative content width -6 (allocation 1, extents 4x3) while allocating gadget (node toolbar, owner GtkToolbar)
18:42:04 
18:42:04 (SWT:1454): Gtk-WARNING **: 22:42:04.982: Negative content width -6 (allocation 1, extents 4x3) while allocating gadget (node toolbar, owner GtkToolbar)
18:42:04 
18:42:04 (SWT:1454): Gtk-WARNING **: 22:42:04.983: Negative content width -6 (allocation 1, extents 4x3) while allocating gadget (node toolbar, owner GtkToolbar)
18:42:05 
18:42:05 (SWT:1454): Gtk-WARNING **: 22:42:05.005: Negative content width -6 (allocation 1, extents 4x3) while allocating gadget (node toolbar, owner GtkToolbar)
18:42:05 
18:42:05 (SWT:1454): Gtk-WARNING **: 22:42:05.082: Negative content width -6 (allocation 1, extents 4x3) while allocating gadget (node toolbar, owner GtkToolbar)
18:42:05 
18:42:05 (SWT:1454): Gtk-WARNING **: 22:42:05.130: Negative content width -6 (allocation 1, extents 4x3) while allocating gadget (node toolbar, owner GtkToolbar)
18:42:05 
18:42:05 (SWT:1454): Gtk-WARNING **: 22:42:05.172: Negative content width -6 (allocation 1, extents 4x3) while allocating gadget (node toolbar, owner GtkToolbar)
18:42:05 
18:42:05 (SWT:1454): Gtk-CRITICAL **: 22:42:05.214: gtk_box_gadget_distribute: assertion 'size >= 0' failed in GtkScrollbar
18:42:05 
18:42:05 (SWT:1454): Gtk-CRITICAL **: 22:42:05.236: gtk_box_gadget_distribute: assertion 'size >= 0' failed in GtkScrollbar
18:42:05 
18:42:05 (SWT:1454): Gtk-CRITICAL **: 22:42:05.253: gtk_box_gadget_distribute: assertion 'size >= 0' failed in GtkScrollbar
18:42:05 
18:42:05 (SWT:1454): Gtk-CRITICAL **: 22:42:05.269: gtk_box_gadget_distribute: assertion 'size >= 0' failed in GtkScrollbar
18:42:05 
18:42:05 (SWT:1454): Gtk-CRITICAL **: 22:42:05.287: gtk_box_gadget_distribute: assertion 'size >= 0' failed in GtkScrollbar
18:42:05 
18:42:05 (SWT:1454): Gtk-CRITICAL **: 22:42:05.302: gtk_box_gadget_distribute: assertion 'size >= 0' failed in GtkScrollbar
18:42:05 
18:42:05 (SWT:1454): Gtk-CRITICAL **: 22:42:05.320: gtk_box_gadget_distribute: assertion 'size >= 0' failed in GtkScrollbar
18:42:05 
18:42:05 (SWT:1454): Gtk-CRITICAL **: 22:42:05.336: gtk_box_gadget_distribute: assertion 'size >= 0' failed in GtkScrollbar
18:42:05 
18:42:05 (SWT:1454): Gtk-CRITICAL **: 22:42:05.352: gtk_box_gadget_distribute: assertion 'size >= 0' failed in GtkScrollbar
18:42:05 
18:42:05 (SWT:1454): Gtk-CRITICAL **: 22:42:05.369: gtk_box_gadget_distribute: assertion 'size >= 0' failed in GtkScrollbar
18:42:05 
18:42:05 (SWT:1454): Gtk-CRITICAL **: 22:42:05.389: gtk_box_gadget_distribute: assertion 'size >= 0' failed in GtkScrollbar
18:42:05 
18:42:05 (SWT:1454): Gtk-CRITICAL **: 22:42:05.403: gtk_box_gadget_distribute: assertion 'size >= 0' failed in GtkScrollbar
18:42:05 
18:42:05 (SWT:1454): Gtk-CRITICAL **: 22:42:05.420: gtk_box_gadget_distribute: assertion 'size >= 0' failed in GtkScrollbar
18:42:05 
18:42:05 (SWT:1454): Gtk-CRITICAL **: 22:42:05.436: gtk_box_gadget_distribute: assertion 'size >= 0' failed in GtkScrollbar
18:42:05 
18:42:05 (SWT:1454): Gtk-WARNING **: 22:42:05.541: Negative content width -6 (allocation 1, extents 4x3) while allocating gadget (node toolbar, owner GtkToolbar)
18:42:05 
18:42:05 (SWT:1454): Gtk-WARNING **: 22:42:05.552: Negative content width -6 (allocation 1, extents 4x3) while allocating gadget (node toolbar, owner GtkToolbar)
18:42:06 
18:42:06 (SWT:1454): Gtk-WARNING **: 22:42:06.619: Negative content width -6 (allocation 1, extents 4x3) while allocating gadget (node toolbar, owner GtkToolbar)
18:42:06 
18:42:06 (SWT:1454): Gtk-WARNING **: 22:42:06.831: Negative content width -6 (allocation 1, extents 4x3) while allocating gadget (node toolbar, owner GtkToolbar)
18:42:07 
18:42:07 (SWT:1454): Gtk-WARNING **: 22:42:07.367: Negative content width -6 (allocation 1, extents 4x3) while allocating gadget (node toolbar, owner GtkToolbar)
18:42:07 
18:42:07 (SWT:1454): Gtk-WARNING **: 22:42:07.579: Negative content width -6 (allocation 1, extents 4x3) while allocating gadget (node toolbar, owner GtkToolbar)
18:42:08 
18:42:08 (SWT:1454): Gtk-CRITICAL **: 22:42:08.119: gtk_box_gadget_distribute: assertion 'size >= 0' failed in GtkScrollbar
18:42:08 
18:42:08 (SWT:1454): Gtk-WARNING **: 22:42:08.123: Negative content width -6 (allocation 1, extents 4x3) while allocating gadget (node toolbar, owner GtkToolbar)
18:42:08 
18:42:08 (SWT:1454): Gtk-CRITICAL **: 22:42:08.139: gtk_box_gadget_distribute: assertion 'size >= 0' failed in GtkScrollbar
18:42:08 
18:42:08 (SWT:1454): Gtk-CRITICAL **: 22:42:08.140: gtk_box_gadget_distribute: assertion 'size >= 0' failed in GtkScrollbar
18:42:08 
18:42:08 (SWT:1454): Gtk-CRITICAL **: 22:42:08.161: gtk_box_gadget_distribute: assertion 'size >= 0' failed in GtkScrollbar
18:42:08 
18:42:08 (SWT:1454): Gtk-WARNING **: 22:42:08.331: Negative content width -6 (allocation 1, extents 4x3) while allocating gadget (node toolbar, owner GtkToolbar)
18:42:08 
18:42:08 (SWT:1454): Gtk-CRITICAL **: 22:42:08.849: gtk_box_gadget_distribute: assertion 'size >= 0' failed in GtkScrollbar
18:42:08 
18:42:08 (SWT:1454): Gtk-WARNING **: 22:42:08.875: Negative content width -6 (allocation 1, extents 4x3) while allocating gadget (node toolbar, owner GtkToolbar)
18:42:08 
18:42:08 (SWT:1454): Gtk-CRITICAL **: 22:42:08.883: gtk_box_gadget_distribute: assertion 'size >= 0' failed in GtkScrollbar
18:42:08 
18:42:08 (SWT:1454): Gtk-CRITICAL **: 22:42:08.892: gtk_box_gadget_distribute: assertion 'size >= 0' failed in GtkScrollbar
18:42:09 
18:42:09 (SWT:1454): Gtk-WARNING **: 22:42:09.085: Negative content width -6 (allocation 1, extents 4x3) while allocating gadget (node toolbar, owner GtkToolbar)
18:42:10 
18:42:10 (SWT:1454): Gtk-WARNING **: 22:42:10.897: Negative content width -6 (allocation 1, extents 4x3) while allocating gadget (node toolbar, owner GtkToolbar)
18:42:10 
18:42:10 (SWT:1454): Gtk-WARNING **: 22:42:10.910: Negative content width -6 (allocation 1, extents 4x3) while allocating gadget (node toolbar, owner GtkToolbar)
18:42:11 Tests run: 3, Failures: 0, Errors: 0, Skipped: 1, Time elapsed: 16.035 s - in org.eclipse.egit.ui.internal.selection.SelectionForViewsTest
18:42:11 testViewsReactOnRepoSwitchInStaging(org.eclipse.egit.ui.internal.selection.SelectionForViewsTest) skipped
18:42:11 testViewsReactOnBareRepoViewSelection(org.eclipse.egit.ui.internal.selection.SelectionForViewsTest)  Time elapsed: 9.057 s
18:42:11 testViewsReactOnRepoViewSelection(org.eclipse.egit.ui.internal.selection.SelectionForViewsTest)  Time elapsed: 6.968 s
18:42:11 Running org.eclipse.egit.ui.internal.CompareUtilsTest
18:42:12 Tests run: 2, Failures: 0, Errors: 0, Skipped: 0, Time elapsed: 1.941 s - in org.eclipse.egit.ui.internal.CompareUtilsTest
18:42:12 testIndexEditWithAttributes(org.eclipse.egit.ui.internal.CompareUtilsTest)  Time elapsed: 1.047 s
18:42:12 testIndexEdit(org.eclipse.egit.ui.internal.CompareUtilsTest)  Time elapsed: 0.885 s
18:42:12 Running org.eclipse.egit.ui.search.CommitSearchQueryTest
18:42:17 Tests run: 7, Failures: 0, Errors: 0, Skipped: 0, Time elapsed: 4.17 s - in org.eclipse.egit.ui.search.CommitSearchQueryTest
18:42:17 testQuery(org.eclipse.egit.ui.search.CommitSearchQueryTest)  Time elapsed: 0.638 s
18:42:17 testMatchMessage(org.eclipse.egit.ui.search.CommitSearchQueryTest)  Time elapsed: 0.527 s
18:42:17 testCaseInsensitive(org.eclipse.egit.ui.search.CommitSearchQueryTest)  Time elapsed: 0.539 s
18:42:17 testMatchCommit(org.eclipse.egit.ui.search.CommitSearchQueryTest)  Time elapsed: 0.573 s
18:42:17 testMatchParent(org.eclipse.egit.ui.search.CommitSearchQueryTest)  Time elapsed: 0.626 s
18:42:17 testMatchTree(org.eclipse.egit.ui.search.CommitSearchQueryTest)  Time elapsed: 0.573 s
18:42:17 testEmptyMatches(org.eclipse.egit.ui.search.CommitSearchQueryTest)  Time elapsed: 0.656 s
18:42:17 Running org.eclipse.egit.ui.search.CommitSearchDialogTest
18:42:17 
18:42:17 (SWT:1454): Gtk-WARNING **: 22:42:17.841: Negative content width -6 (allocation 1, extents 4x3) while allocating gadget (node toolbar, owner GtkToolbar)
18:42:17 
18:42:17 (SWT:1454): Gtk-WARNING **: 22:42:17.860: Negative content width -6 (allocation 1, extents 4x3) while allocating gadget (node toolbar, owner GtkToolbar)
18:42:17 
18:42:17 (SWT:1454): Gtk-WARNING **: 22:42:17.942: Negative content width -6 (allocation 1, extents 4x3) while allocating gadget (node toolbar, owner GtkToolbar)
18:42:17 
18:42:17 (SWT:1454): Gtk-WARNING **: 22:42:17.990: Negative content width -6 (allocation 1, extents 4x3) while allocating gadget (node toolbar, owner GtkToolbar)
18:42:18 
18:42:18 (SWT:1454): Gtk-WARNING **: 22:42:18.654: Negative content width -6 (allocation 1, extents 4x3) while allocating gadget (node toolbar, owner GtkToolbar)
18:42:18 Tests run: 1, Failures: 0, Errors: 0, Skipped: 0, Time elapsed: 1.616 s - in org.eclipse.egit.ui.search.CommitSearchDialogTest
18:42:18 openCommitTabOnSearchDialog(org.eclipse.egit.ui.search.CommitSearchDialogTest)  Time elapsed: 1.612 s
18:42:18 Running org.eclipse.egit.ui.submodule.SubmoduleUpdateTest
18:42:19 
18:42:19 (SWT:1454): Gtk-WARNING **: 22:42:19.481: Negative content width -6 (allocation 1, extents 4x3) while allocating gadget (node toolbar, owner GtkToolbar)
18:42:24 
18:42:24 (SWT:1454): Gtk-WARNING **: 22:42:24.378: Negative content width -6 (allocation 1, extents 4x3) while allocating gadget (node toolbar, owner GtkToolbar)
18:42:24 Tests run: 1, Failures: 0, Errors: 0, Skipped: 0, Time elapsed: 5.915 s - in org.eclipse.egit.ui.submodule.SubmoduleUpdateTest
18:42:24 updateSubmodule(org.eclipse.egit.ui.submodule.SubmoduleUpdateTest)  Time elapsed: 5.91 s
18:42:24 Running org.eclipse.egit.ui.submodule.SubmoduleAddTest
18:42:25 
18:42:25 (SWT:1454): Gtk-WARNING **: 22:42:25.375: Negative content width -6 (allocation 1, extents 4x3) while allocating gadget (node toolbar, owner GtkToolbar)
18:42:26 
18:42:26 (SWT:1454): Gtk-WARNING **: 22:42:26.617: Negative content width -1 (allocation 1, extents 1x1) while allocating gadget (node trough, owner GtkProgressBar)
18:42:26 
18:42:26 (SWT:1454): Gtk-WARNING **: 22:42:26.624: Negative content width -1 (allocation 1, extents 1x1) while allocating gadget (node trough, owner GtkProgressBar)
18:42:26 
18:42:26 (SWT:1454): Gtk-WARNING **: 22:42:26.634: Negative content width -1 (allocation 1, extents 1x1) while allocating gadget (node trough, owner GtkProgressBar)
18:42:29 
18:42:29 (SWT:1454): Gtk-WARNING **: 22:42:29.489: Negative content width -6 (allocation 1, extents 4x3) while allocating gadget (node toolbar, owner GtkToolbar)
18:42:29 Tests run: 1, Failures: 0, Errors: 0, Skipped: 0, Time elapsed: 4.918 s - in org.eclipse.egit.ui.submodule.SubmoduleAddTest
18:42:29 addAtRoot(org.eclipse.egit.ui.submodule.SubmoduleAddTest)  Time elapsed: 4.912 s
18:42:29 Running org.eclipse.egit.ui.submodule.SubmoduleSyncTest
18:42:30 
18:42:30 (SWT:1454): Gtk-WARNING **: 22:42:30.283: Negative content width -6 (allocation 1, extents 4x3) while allocating gadget (node toolbar, owner GtkToolbar)
18:42:30 
18:42:30 (SWT:1454): Gtk-WARNING **: 22:42:30.663: Negative content width -1 (allocation 1, extents 1x1) while allocating gadget (node trough, owner GtkProgressBar)
18:42:35 
18:42:35 (SWT:1454): Gtk-WARNING **: 22:42:35.266: Negative content width -6 (allocation 1, extents 4x3) while allocating gadget (node toolbar, owner GtkToolbar)
18:42:35 Tests run: 1, Failures: 0, Errors: 0, Skipped: 0, Time elapsed: 5.773 s - in org.eclipse.egit.ui.submodule.SubmoduleSyncTest
18:42:35 syncSubmodule(org.eclipse.egit.ui.submodule.SubmoduleSyncTest)  Time elapsed: 5.767 s
18:42:35 Running org.eclipse.egit.ui.operations.GitScopeUtilTest
18:42:39 Tests run: 5, Failures: 0, Errors: 0, Skipped: 0, Time elapsed: 3.987 s - in org.eclipse.egit.ui.operations.GitScopeUtilTest
18:42:39 relatedChangesWithPrompt(org.eclipse.egit.ui.operations.GitScopeUtilTest)  Time elapsed: 1.655 s
18:42:39 modelProviderWithExtensionFiles(org.eclipse.egit.ui.operations.GitScopeUtilTest)  Time elapsed: 0.573 s
18:42:39 relatedChangesWithInvalidParams(org.eclipse.egit.ui.operations.GitScopeUtilTest)  Time elapsed: 0.633 s
18:42:39 relatedChangesWithNullResources(org.eclipse.egit.ui.operations.GitScopeUtilTest)  Time elapsed: 0.53 s
18:42:39 relatedChangesWithEmptyResources(org.eclipse.egit.ui.operations.GitScopeUtilTest)  Time elapsed: 0.595 s
18:42:39 Running org.eclipse.egit.ui.prefpages.configuration.GlobalConfigurationPageTest
18:42:39 
18:42:39 !ENTRY org.eclipse.ui 2 2 2019-03-21 22:42:39.384
18:42:39 !MESSAGE Invalid preference category path: org.eclipse.ui.net.NetPreferences (bundle: org.eclipse.jsch.ui, page: org.eclipse.jsch.ui.SSHPreferences)
18:42:39 
18:42:39 (SWT:1454): Gtk-WARNING **: 22:42:39.400: Negative content width -13 (allocation 5, extents 9x9) while allocating gadget (node entry, owner GtkEntry)
18:42:39 
18:42:39 (SWT:1454): Gtk-WARNING **: 22:42:39.625: Negative content width -13 (allocation 5, extents 9x9) while allocating gadget (node entry, owner GtkEntry)
18:42:39 
18:42:39 (SWT:1454): Gtk-WARNING **: 22:42:39.779: Negative content width -13 (allocation 5, extents 9x9) while allocating gadget (node entry, owner GtkEntry)
18:42:39 
18:42:39 (SWT:1454): Gtk-WARNING **: 22:42:39.927: Negative content width -13 (allocation 5, extents 9x9) while allocating gadget (node entry, owner GtkEntry)
18:42:40 
18:42:40 (SWT:1454): Gtk-WARNING **: 22:42:40.018: Negative content width -13 (allocation 5, extents 9x9) while allocating gadget (node entry, owner GtkEntry)
18:42:40 
18:42:40 (SWT:1454): Gtk-WARNING **: 22:42:40.121: Negative content width -13 (allocation 5, extents 9x9) while allocating gadget (node entry, owner GtkEntry)
18:42:40 
18:42:40 (SWT:1454): Gtk-WARNING **: 22:42:40.276: Negative content width -13 (allocation 5, extents 9x9) while allocating gadget (node entry, owner GtkEntry)
18:42:40 
18:42:40 (SWT:1454): Gtk-WARNING **: 22:42:40.342: Negative content width -6 (allocation 1, extents 4x3) while allocating gadget (node toolbar, owner GtkToolbar)
18:42:40 
18:42:40 (SWT:1454): Gtk-WARNING **: 22:42:40.342: Negative content height -3 (allocation 1, extents 2x2) while allocating gadget (node toolbar, owner GtkToolbar)
18:42:40 
18:42:40 (SWT:1454): Gtk-WARNING **: 22:42:40.342: Negative content width -6 (allocation 1, extents 4x3) while allocating gadget (node toolbar, owner GtkToolbar)
18:42:40 
18:42:40 (SWT:1454): Gtk-WARNING **: 22:42:40.342: Negative content height -3 (allocation 1, extents 2x2) while allocating gadget (node toolbar, owner GtkToolbar)
18:42:40 
18:42:40 (SWT:1454): Gtk-WARNING **: 22:42:40.497: Negative content width -13 (allocation 5, extents 9x9) while allocating gadget (node entry, owner GtkEntry)
18:42:40 
18:42:40 (SWT:1454): Gtk-WARNING **: 22:42:40.650: Negative content width -13 (allocation 5, extents 9x9) while allocating gadget (node entry, owner GtkEntry)
18:42:40 
18:42:40 (SWT:1454): Gtk-WARNING **: 22:42:40.829: Negative content width -13 (allocation 5, extents 9x9) while allocating gadget (node entry, owner GtkEntry)
18:42:40 
18:42:40 (SWT:1454): Gtk-WARNING **: 22:42:40.972: Negative content width -13 (allocation 5, extents 9x9) while allocating gadget (node entry, owner GtkEntry)
18:42:41 
18:42:41 (SWT:1454): Gtk-WARNING **: 22:42:41.118: Negative content width -13 (allocation 5, extents 9x9) while allocating gadget (node entry, owner GtkEntry)
18:42:41 Tests run: 11, Failures: 0, Errors: 0, Skipped: 0, Time elapsed: 1.876 s - in org.eclipse.egit.ui.prefpages.configuration.GlobalConfigurationPageTest
18:42:41 testAddSubSectionEntry(org.eclipse.egit.ui.prefpages.configuration.GlobalConfigurationPageTest)  Time elapsed: 0.248 s
18:42:41 testAddSectionEntry(org.eclipse.egit.ui.prefpages.configuration.GlobalConfigurationPageTest)  Time elapsed: 0.153 s
18:42:41 testCanCreateSameEntryValue(org.eclipse.egit.ui.prefpages.configuration.GlobalConfigurationPageTest)  Time elapsed: 0.148 s
18:42:41 testNodes(org.eclipse.egit.ui.prefpages.configuration.GlobalConfigurationPageTest)  Time elapsed: 0.092 s
18:42:41 testRemoveValue(org.eclipse.egit.ui.prefpages.configuration.GlobalConfigurationPageTest)  Time elapsed: 0.102 s
18:42:41 testAddSubSectionEntryWithSuggestion(org.eclipse.egit.ui.prefpages.configuration.GlobalConfigurationPageTest)  Time elapsed: 0.156 s
18:42:41 testOpenEditor(org.eclipse.egit.ui.prefpages.configuration.GlobalConfigurationPageTest)  Time elapsed: 0.22 s
18:42:41 testSubsectionWithDot(org.eclipse.egit.ui.prefpages.configuration.GlobalConfigurationPageTest)  Time elapsed: 0.153 s
18:42:41 testChecksForKey(org.eclipse.egit.ui.prefpages.configuration.GlobalConfigurationPageTest)  Time elapsed: 0.18 s
18:42:41 testRemoveSubSection(org.eclipse.egit.ui.prefpages.configuration.GlobalConfigurationPageTest)  Time elapsed: 0.142 s
18:42:41 testRemoveSection(org.eclipse.egit.ui.prefpages.configuration.GlobalConfigurationPageTest)  Time elapsed: 0.146 s
18:42:41 Running org.eclipse.egit.ui.httpauth.PushTest
18:42:41 2019-03-21 22:42:41.367:INFO:oejs.Server:WorkbenchTestable: jetty-9.4.14.v20181114; built: 2019-01-14T17:18:45.591Z; git: c4550056e785fb5665914545889f21dc136ad9e6; jvm 1.8.0_202-b08
18:42:41 2019-03-21 22:42:41.369:INFO:oejsh.ContextHandler:WorkbenchTestable: Started o.e.j.s.ServletContextHandler@13d5b399{/sbasic,null,AVAILABLE}
18:42:41 2019-03-21 22:42:41.373:INFO:oejs.AbstractConnector:WorkbenchTestable: Started ServerConnector@614daf2e{HTTP/1.1,[http/1.1]}{127.0.0.1:37324}
18:42:41 2019-03-21 22:42:41.373:INFO:oejs.Server:WorkbenchTestable: Started @822597ms
18:42:41 
18:42:41 (SWT:1454): Gtk-WARNING **: 22:42:41.741: Negative content width -11 (allocation 1, extents 6x6) while allocating gadget (node button, owner GtkButton)
18:42:41 
18:42:41 (SWT:1454): Gtk-WARNING **: 22:42:41.882: gtk_widget_size_allocate(): attempt to allocate widget with width 608 and height -1
18:42:41 
18:42:41 (SWT:1454): Gtk-WARNING **: 22:42:41.883: Negative content height -1 (allocation 1, extents 1x1) while allocating gadget (node scrolledwindow, owner GtkScrolledWindow)
18:42:41 
18:42:41 (SWT:1454): Gtk-WARNING **: 22:42:41.883: gtk_widget_size_allocate(): attempt to allocate widget with width 6 and height -25
18:42:41 
18:42:41 (SWT:1454): Gtk-CRITICAL **: 22:42:41.883: gtk_box_gadget_distribute: assertion 'size >= 0' failed in GtkScrollbar
18:42:41 
18:42:41 (SWT:1454): Gtk-WARNING **: 22:42:41.893: gtk_widget_size_allocate(): attempt to allocate widget with width 608 and height -1
18:42:41 
18:42:41 (SWT:1454): Gtk-WARNING **: 22:42:41.912: gtk_widget_size_allocate(): attempt to allocate widget with width 608 and height -1
18:42:42 
18:42:42 (SWT:1454): Gtk-WARNING **: 22:42:42.268: Negative content width -1 (allocation 1, extents 1x1) while allocating gadget (node trough, owner GtkProgressBar)
18:42:42 
18:42:42 (SWT:1454): Gtk-WARNING **: 22:42:42.274: Negative content width -1 (allocation 1, extents 1x1) while allocating gadget (node trough, owner GtkProgressBar)
18:42:42 
18:42:42 (SWT:1454): Gtk-WARNING **: 22:42:42.280: Negative content width -1 (allocation 1, extents 1x1) while allocating gadget (node trough, owner GtkProgressBar)
18:42:42 2019-03-21 22:42:42.829:INFO:oejs.AbstractConnector:WorkbenchTestable: Stopped ServerConnector@614daf2e{HTTP/1.1,[http/1.1]}{127.0.0.1:0}
18:42:42 2019-03-21 22:42:42.829:INFO:oejsh.ContextHandler:WorkbenchTestable: Stopped o.e.j.s.ServletContextHandler@13d5b399{/sbasic,null,UNAVAILABLE}
18:42:42 Tests run: 1, Failures: 0, Errors: 0, Skipped: 0, Time elapsed: 1.584 s - in org.eclipse.egit.ui.httpauth.PushTest
18:42:42 testPush(org.eclipse.egit.ui.httpauth.PushTest)  Time elapsed: 1.582 s
18:42:42 Running org.eclipse.egit.ui.variables.DynamicVariablesTest
18:42:47 Tests run: 4, Failures: 0, Errors: 0, Skipped: 0, Time elapsed: 4.888 s - in org.eclipse.egit.ui.variables.DynamicVariablesTest
18:42:47 testGitBranch(org.eclipse.egit.ui.variables.DynamicVariablesTest)  Time elapsed: 1.544 s
18:42:47 testGitPath(org.eclipse.egit.ui.variables.DynamicVariablesTest)  Time elapsed: 1.077 s
18:42:47 testGitWorkTree(org.eclipse.egit.ui.variables.DynamicVariablesTest)  Time elapsed: 1.113 s
18:42:47 testGitDir(org.eclipse.egit.ui.variables.DynamicVariablesTest)  Time elapsed: 1.151 s
18:42:47 
18:42:47 Results:
18:42:47 
18:42:47 Failures: 
18:42:47   GitRepositoriesViewRepoDeletionTest.testRemoveRepositoryRemoveFromCachesBug483664:278 Expected no IndexDiffCache entries expected:<[[]]> but was:<[[/home/jenkins/workspace/egit.gerrit/tmp/egit.tmp/2ab08dc213764b77a9dbbb1255a57d97/LocalRepositoriesTests15_testRepositoryViewStartFinishEnablement/FirstRepository/.git]]>
18:42:47 
18:42:47 Tests run: 467, Failures: 1, Errors: 0, Skipped: 12
18:42:47 
18:42:48 
18:42:48 !ENTRY org.eclipse.core.resources 2 10035 2019-03-21 22:42:48.700
18:42:48 !MESSAGE The workspace will exit with unsaved changes in this session.
18:42:49 [INFO] ------------------------------------------------------------------------
18:42:49 [INFO] BUILD FAILURE
18:42:49 [INFO] ------------------------------------------------------------------------
18:42:49 [INFO] Total time: 14:13 min
18:42:49 [INFO] Finished at: 2019-03-21T22:42:49Z
18:42:49 [INFO] ------------------------------------------------------------------------
18:42:49 [ERROR] Failed to execute goal org.eclipse.tycho:tycho-surefire-plugin:1.3.0:test (default-test) on project org.eclipse.egit.ui.test: There are test failures.
18:42:49 [ERROR] 
18:42:49 [ERROR] Please refer to /home/jenkins/workspace/egit.gerrit/repo/org.eclipse.egit.ui.test/target/surefire-reports for the individual test results.
18:42:49 [ERROR] -> [Help 1]
18:42:49 org.apache.maven.lifecycle.LifecycleExecutionException: Failed to execute goal org.eclipse.tycho:tycho-surefire-plugin:1.3.0:test (default-test) on project org.eclipse.egit.ui.test: There are test failures.
18:42:49 
18:42:49 Please refer to /home/jenkins/workspace/egit.gerrit/repo/org.eclipse.egit.ui.test/target/surefire-reports for the individual test results.
18:42:49     at org.apache.maven.lifecycle.internal.MojoExecutor.execute (MojoExecutor.java:213)
18:42:49     at org.apache.maven.lifecycle.internal.MojoExecutor.execute (MojoExecutor.java:154)
18:42:49     at org.apache.maven.lifecycle.internal.MojoExecutor.execute (MojoExecutor.java:146)
18:42:49     at org.apache.maven.lifecycle.internal.LifecycleModuleBuilder.buildProject (LifecycleModuleBuilder.java:117)
18:42:49     at org.apache.maven.lifecycle.internal.LifecycleModuleBuilder.buildProject (LifecycleModuleBuilder.java:81)
18:42:49     at org.apache.maven.lifecycle.internal.builder.singlethreaded.SingleThreadedBuilder.build (SingleThreadedBuilder.java:56)
18:42:49     at org.apache.maven.lifecycle.internal.LifecycleStarter.execute (LifecycleStarter.java:128)
18:42:49     at org.apache.maven.DefaultMaven.doExecute (DefaultMaven.java:305)
18:42:49     at org.apache.maven.DefaultMaven.doExecute (DefaultMaven.java:192)
18:42:49     at org.apache.maven.DefaultMaven.execute (DefaultMaven.java:105)
18:42:49     at org.apache.maven.cli.MavenCli.execute (MavenCli.java:954)
18:42:49     at org.apache.maven.cli.MavenCli.doMain (MavenCli.java:288)
18:42:49     at org.apache.maven.cli.MavenCli.main (MavenCli.java:192)
18:42:49     at sun.reflect.NativeMethodAccessorImpl.invoke0 (Native Method)
18:42:49     at sun.reflect.NativeMethodAccessorImpl.invoke (NativeMethodAccessorImpl.java:62)
18:42:49     at sun.reflect.DelegatingMethodAccessorImpl.invoke (DelegatingMethodAccessorImpl.java:43)
18:42:49     at java.lang.reflect.Method.invoke (Method.java:498)
18:42:49     at org.codehaus.plexus.classworlds.launcher.Launcher.launchEnhanced (Launcher.java:289)
18:42:49     at org.codehaus.plexus.classworlds.launcher.Launcher.launch (Launcher.java:229)
18:42:49     at org.codehaus.plexus.classworlds.launcher.Launcher.mainWithExitCode (Launcher.java:415)
18:42:49     at org.codehaus.plexus.classworlds.launcher.Launcher.main (Launcher.java:356)
18:42:49 Caused by: org.apache.maven.plugin.MojoFailureException: There are test failures.
18:42:49 
18:42:49 Please refer to /home/jenkins/workspace/egit.gerrit/repo/org.eclipse.egit.ui.test/target/surefire-reports for the individual test results.
18:42:49     at org.eclipse.tycho.surefire.TestMojo.runTest (TestMojo.java:1044)
18:42:49     at org.eclipse.tycho.surefire.TestMojo.execute (TestMojo.java:693)
18:42:49     at org.apache.maven.plugin.DefaultBuildPluginManager.executeMojo (DefaultBuildPluginManager.java:137)
18:42:49     at org.apache.maven.lifecycle.internal.MojoExecutor.execute (MojoExecutor.java:208)
18:42:49     at org.apache.maven.lifecycle.internal.MojoExecutor.execute (MojoExecutor.java:154)
18:42:49     at org.apache.maven.lifecycle.internal.MojoExecutor.execute (MojoExecutor.java:146)
18:42:49     at org.apache.maven.lifecycle.internal.LifecycleModuleBuilder.buildProject (LifecycleModuleBuilder.java:117)
18:42:49     at org.apache.maven.lifecycle.internal.LifecycleModuleBuilder.buildProject (LifecycleModuleBuilder.java:81)
18:42:49     at org.apache.maven.lifecycle.internal.builder.singlethreaded.SingleThreadedBuilder.build (SingleThreadedBuilder.java:56)
18:42:49     at org.apache.maven.lifecycle.internal.LifecycleStarter.execute (LifecycleStarter.java:128)
18:42:49     at org.apache.maven.DefaultMaven.doExecute (DefaultMaven.java:305)
18:42:49     at org.apache.maven.DefaultMaven.doExecute (DefaultMaven.java:192)
18:42:49     at org.apache.maven.DefaultMaven.execute (DefaultMaven.java:105)
18:42:49     at org.apache.maven.cli.MavenCli.execute (MavenCli.java:954)
18:42:49     at org.apache.maven.cli.MavenCli.doMain (MavenCli.java:288)
18:42:49     at org.apache.maven.cli.MavenCli.main (MavenCli.java:192)
18:42:49     at sun.reflect.NativeMethodAccessorImpl.invoke0 (Native Method)
18:42:49     at sun.reflect.NativeMethodAccessorImpl.invoke (NativeMethodAccessorImpl.java:62)
18:42:49     at sun.reflect.DelegatingMethodAccessorImpl.invoke (DelegatingMethodAccessorImpl.java:43)
18:42:49     at java.lang.reflect.Method.invoke (Method.java:498)
18:42:49     at org.codehaus.plexus.classworlds.launcher.Launcher.launchEnhanced (Launcher.java:289)
18:42:49     at org.codehaus.plexus.classworlds.launcher.Launcher.launch (Launcher.java:229)
18:42:49     at org.codehaus.plexus.classworlds.launcher.Launcher.mainWithExitCode (Launcher.java:415)
18:42:49     at org.codehaus.plexus.classworlds.launcher.Launcher.main (Launcher.java:356)
18:42:49 [ERROR] 
18:42:49 [ERROR] Re-run Maven using the -X switch to enable full debug logging.
18:42:49 [ERROR] 
18:42:49 [ERROR] For more information about the errors and possible solutions, please read the following articles:
18:42:49 [ERROR] [Help 1] http://cwiki.apache.org/confluence/display/MAVEN/MojoFailureException
18:42:49 [INFO] Build failures were ignored.
18:42:50 [egit.gerrit] $ /opt/tools/apache-maven/latest/bin/mvn -f repo/org.eclipse.egit.mylyn.ui.test/pom.xml -DGERRIT_BRANCH=master -DGERRIT_PATCHSET_REVISION=7014e6ce9596bdfdd9cda6ad7e9e93eac1cb727d -DGERRIT_HOST=gerrit-local -DGERRIT_CHANGE_OWNER_EMAIL=thomas.wolf@paranor.ch "-DGERRIT_EVENT_ACCOUNT_NAME=Thomas Wolf" -DTEST_PARAMS=-Declipse.consoleLog=true -DGERRIT_CHANGE_URL=https://git.eclipse.org/r/138777 -DGERRIT_PATCHSET_UPLOADER_EMAIL=thomas.wolf@paranor.ch -DGERRIT_EVENT_TYPE=patchset-created -DGERRIT_PROJECT=egit/egit -DGERRIT_CHANGE_NUMBER=138777 -DGERRIT_SCHEME=ssh '-DGERRIT_PATCHSET_UPLOADER=\"Thomas Wolf\" <thomas.wolf@paranor.ch>' -DGERRIT_PORT=29418 -DGERRIT_CHANGE_PRIVATE_STATE=false -DGERRIT_REFSPEC=refs/changes/77/138777/2 -DJGIT_VERSION=5.4.0-SNAPSHOT "-DGERRIT_PATCHSET_UPLOADER_NAME=Thomas Wolf" '-DGERRIT_CHANGE_OWNER=\"Thomas Wolf\" <thomas.wolf@paranor.ch>' -DGERRIT_CHANGE_COMMIT_MESSAGE=UmVtb3ZlIHVudXNlZCBjb21tYW5kIElEIGZvciAiRGVsZXRlIFN0YXNoLi4uIgoKRUdpdCBoYXMgdHdvIGNvbW1hbmQgSURzIGZvciBkZWxldGluZyBzdGFzaGVzLiBUaGUgb25lIGZyb20gdGhlCmNvbW1pdCBlZGl0b3IncyBoYW5kbGVyIGhhZCBubyBjYXRlZ29yeSwgYnV0IHRoZSBvdGhlciBvbmUgaGFkIG5vCmhhbmRsZXIgYW5kIGFwcGVhcmVkIG5vd2hlcmUsIGJlY2F1c2UgdGhlIGhhbmRsZXIgaXMgYm91bmQgdG8gdGhlCnN0YW5kYXJkICJkZWxldGUiIGNvbW1hbmQuCgpVc2UgdGhlIG9uZSB3aXRoIHRoZSBjYXRlZ29yeSBmb3IgdGhlIGNvbW1pdCBlZGl0b3IncyBoYW5kbGVyLiBUaGlzCmVuYWJsZXMgYSB1c2VyIHRvIGRlZmluZSBhIGtleSBiaW5kaW5nIGZvciB0aGlzIGhhbmRsZXIgYW5kIGludm9rZQppdCBpbiB0aGUgY29tbWl0IGVkaXRvciB2aWEgdGhlIGtleWJvYXJkLgoKQ29udHJhcnkgdG8gdGhlICJBcHBseSBTdGFzaCIgY2FzZSwgdGhlIGhhbmRsZXJzIGZyb20gdGhlIGNvbW1pdAplZGl0b3IgYW5kIGZyb20gdGhlIHJlcG9zaXRvcmllcyB2aWV3IGFyZSBub3Qgc2ltaWxhciBlbm91Z2ggdG8Kd2FycmFudCBhIGNvZGUgcmVmYWN0b3JpbmcuIE1heWJlIGlmIG9uZSBtYWRlIHRoZSBTdGFzaGVkQ29tbWl0Tm9kZQphZGFwdCB0byBJUmVwb3NpdG9yeUNvbW1pdCwgYnV0IHRoZW4gb25lIGhhcyB0byBiZSBjYXJlZnVsIHRoYXQgbm8Kb3RoZXIgY29tbWFuZHMgZ2V0IGVuYWJsZWQgaW5hZHZlcnRlbnRseSBvbiBzdWNoIG5vZGVzLgoKQnVnOiA1NDUwMzEKQ2hhbmdlLUlkOiBJNWRkM2UwZTQ5NzQ2YmFiY2I4MjU0NzhkMTZiZTBlYWRhYjVkZmEzOApTaWduZWQtb2ZmLWJ5OiBUaG9tYXMgV29sZiA8dGhvbWFzLndvbGZAcGFyYW5vci5jaD4= "-DGERRIT_NAME=Eclipse Gerrit" -DGERRIT_TOPIC=unify_commands '-DGERRIT_CHANGE_SUBJECT=Remove unused command ID for \"Delete Stash...\"' -DJGIT_SITE=https://repo.eclipse.org/content/unzip/snapshots.unzip/org/eclipse/jgit/org.eclipse.jgit.repository/${JGIT_VERSION}/org.eclipse.jgit.repository-${JGIT_VERSION}.zip-unzip/ '-DGERRIT_EVENT_ACCOUNT=\"Thomas Wolf\" <thomas.wolf@paranor.ch>' -DGERRIT_CHANGE_WIP_STATE=false -DGERRIT_CHANGE_ID=I5dd3e0e49746babcb825478d16be0eadab5dfa38 -DGERRIT_EVENT_HASH=2020323182 -DGERRIT_VERSION=2.14.6 -DGERRIT_EVENT_ACCOUNT_EMAIL=thomas.wolf@paranor.ch -DGERRIT_PATCHSET_NUMBER=2 "-DGERRIT_CHANGE_OWNER_NAME=Thomas Wolf" -Djava.io.tmpdir=/home/jenkins/workspace/egit.gerrit/tmp/ "-Dtest.vmparams=-Declipse.consoleLog=true -Degit.test.tmpdir=/home/jenkins/workspace/egit.gerrit/tmp/egit.tmp/" -Djgit-site=https://repo.eclipse.org/content/unzip/snapshots.unzip/org/eclipse/jgit/org.eclipse.jgit.repository/5.4.0-SNAPSHOT/org.eclipse.jgit.repository-5.4.0-SNAPSHOT.zip-unzip/ -Declipse.p2.mirrors=false -Dmaven.repo.local=/home/jenkins/workspace/egit.gerrit/.repository -B -e verify --fail-never -P other-os
18:42:50 Picked up JAVA_TOOL_OPTIONS: -XX:+IgnoreUnrecognizedVMOptions -XX:+UseContainerSupport -XX:+UnlockExperimentalVMOptions -XX:+UseCGroupMemoryLimitForHeap
18:42:50 Picked up _JAVA_OPTIONS: -XX:MaxRAMPercentage=64.0
18:42:51 [INFO] Error stacktraces are turned on.
18:42:51 [INFO] Scanning for projects...
18:42:53 [INFO] Computing target platform for MavenProject: org.eclipse.egit:org.eclipse.egit.mylyn.ui.test:5.4.0-SNAPSHOT @ /home/jenkins/workspace/egit.gerrit/repo/org.eclipse.egit.mylyn.ui.test/pom.xml
18:42:59 [INFO] Adding repository http://download.eclipse.org/jetty/updates/jetty-bundles-9.x/9.4.14.v20181114
18:42:59 [INFO] Fetching p2.index from http://download.eclipse.org/technology/swtbot/snapshots/
18:42:59 [INFO] Adding repository http://download.eclipse.org/technology/swtbot/snapshots
18:42:59 [INFO] Fetching p2.index from http://download.eclipse.org/tools/orbit/downloads/drops/R20190226160451/repository/
18:42:59 [INFO] Fetching p2.index from http://download.eclipse.org/tools/orbit/downloads/drops/R20190226160451/repository/
18:42:59 [INFO] Adding repository http://download.eclipse.org/tools/orbit/downloads/drops/R20190226160451/repository
18:42:59 [INFO] Fetching p2.index from http://download.eclipse.org/tools/orbit/downloads/drops2/R20190226160451/repository/
18:42:59 [INFO] Fetching p2.index from http://download.eclipse.org/tools/orbit/downloads/drops2/R20190226160451/repository/
18:42:59 [INFO] Fetching p2.index from http://download.eclipse.org/releases/neon/
18:42:59 [INFO] Fetching p2.index from http://download.eclipse.org/releases/neon/
18:42:59 [INFO] Adding repository http://download.eclipse.org/releases/neon
18:42:59 [INFO] Fetching p2.index from http://download.eclipse.org/technology/epp/packages/neon/
18:42:59 [INFO] Fetching p2.index from http://download.eclipse.org/technology/epp/packages/neon/
18:43:00 [INFO] Fetching p2.index from http://download.eclipse.org/releases/neon/201705151400/
18:43:00 [INFO] Fetching p2.index from http://download.eclipse.org/releases/neon/201705151400/
18:43:01 [INFO] Fetching p2.index from http://download.eclipse.org/releases/neon/201703141400/
18:43:01 [INFO] Fetching p2.index from http://download.eclipse.org/releases/neon/201703141400/
18:43:03 [INFO] Fetching p2.index from http://download.eclipse.org/releases/neon/201703231000/
18:43:03 [INFO] Fetching p2.index from http://download.eclipse.org/releases/neon/201703231000/
18:43:04 [INFO] Fetching p2.index from http://download.eclipse.org/releases/neon/201606221000/
18:43:04 [INFO] Fetching p2.index from http://download.eclipse.org/releases/neon/201606221000/
18:43:05 [INFO] Fetching p2.index from http://download.eclipse.org/releases/neon/201609281000/
18:43:05 [INFO] Fetching p2.index from http://download.eclipse.org/releases/neon/201609281000/
18:43:07 [INFO] Fetching p2.index from http://download.eclipse.org/releases/neon/201610111000/
18:43:08 [INFO] Fetching p2.index from http://download.eclipse.org/releases/neon/201612211000/
18:43:08 [INFO] Fetching p2.index from http://download.eclipse.org/releases/neon/201612211000/
18:43:15 [INFO] Fetching p2.index from https://repo.eclipse.org/content/unzip/snapshots.unzip/org/eclipse/jgit/org.eclipse.jgit.repository/5.4.0-SNAPSHOT/org.eclipse.jgit.repository-5.4.0-SNAPSHOT.zip-unzip/ (172B)
18:43:15 [INFO] Fetching p2.index from https://repo.eclipse.org/content/unzip/snapshots.unzip/org/eclipse/jgit/org.eclipse.jgit.repository/5.4.0-SNAPSHOT/org.eclipse.jgit.repository-5.4.0-SNAPSHOT.zip-unzip/ (172B)
18:43:15 [INFO] Adding repository https://repo.eclipse.org/content/unzip/snapshots.unzip/org/eclipse/jgit/org.eclipse.jgit.repository/5.4.0-SNAPSHOT/org.eclipse.jgit.repository-5.4.0-SNAPSHOT.zip-unzip
18:43:15 [INFO] Fetching p2.index from http://download.eclipse.org/cbi/updates/license/
18:43:15 [INFO] Fetching p2.index from http://download.eclipse.org/cbi/updates/license/
18:43:15 [INFO] Adding repository http://download.eclipse.org/cbi/updates/license
18:43:15 [INFO] Fetching p2.index from http://download.eclipse.org/cbi/updates/license/2.0.0.v20180130-0820/
18:43:15 [INFO] Fetching p2.index from http://download.eclipse.org/cbi/updates/license/2.0.0.v20180130-0820/
18:43:15 [INFO] Fetching p2.index from http://download.eclipse.org/cbi/updates/license/2.0.1.v20180423-1114/
18:43:15 [INFO] Fetching p2.index from http://download.eclipse.org/cbi/updates/license/2.0.1.v20180423-1114/
18:43:15 [INFO] Resolving dependencies of MavenProject: org.eclipse.egit:org.eclipse.egit.mylyn.ui.test:5.4.0-SNAPSHOT @ /home/jenkins/workspace/egit.gerrit/repo/org.eclipse.egit.mylyn.ui.test/pom.xml
18:43:16 [WARNING] The following locally built units have been used to resolve project dependencies:
18:43:16 [WARNING]   org.eclipse.egit.mylyn.feature.jar/5.4.0.201903212218
18:43:16 [WARNING]   org.eclipse.egit.ui/5.4.0.201903212218
18:43:16 [WARNING]   org.eclipse.egit/5.4.0.201903212218
18:43:16 [WARNING]   org.eclipse.egit.feature.group/5.4.0.201903212218
18:43:16 [WARNING]   org.eclipse.egit.feature.jar/5.4.0.201903212218
18:43:16 [WARNING]   org.eclipse.egit.mylyn.ui/5.4.0.201903212218
18:43:16 [WARNING]   org.eclipse.egit.doc/5.4.0.201903212218
18:43:16 [WARNING]   org.eclipse.egit.core/5.4.0.201903212218
18:43:16 [WARNING]   org.eclipse.egit.mylyn.feature.group/5.4.0.201903212218
18:43:16 [INFO] Resolving class path of MavenProject: org.eclipse.egit:org.eclipse.egit.mylyn.ui.test:5.4.0-SNAPSHOT @ /home/jenkins/workspace/egit.gerrit/repo/org.eclipse.egit.mylyn.ui.test/pom.xml
18:43:17 [INFO] 
18:43:17 [INFO] ----------< org.eclipse.egit:org.eclipse.egit.mylyn.ui.test >-----------
18:43:17 [INFO] Building EGit Mylyn UI Test Plug-in 5.4.0-SNAPSHOT
18:43:17 [INFO] ------------------------[ eclipse-test-plugin ]-------------------------
18:43:17 [INFO] 
18:43:17 [INFO] --- tycho-packaging-plugin:1.3.0:build-qualifier (default-build-qualifier) @ org.eclipse.egit.mylyn.ui.test ---
18:43:17 [INFO] The project's OSGi version is 5.4.0.201903212242
18:43:17 [INFO] 
18:43:17 [INFO] --- tycho-packaging-plugin:1.3.0:validate-id (default-validate-id) @ org.eclipse.egit.mylyn.ui.test ---
18:43:17 [INFO] 
18:43:17 [INFO] --- tycho-packaging-plugin:1.3.0:validate-version (default-validate-version) @ org.eclipse.egit.mylyn.ui.test ---
18:43:17 [INFO] 
18:43:17 [INFO] --- maven-enforcer-plugin:3.0.0-M2:enforce (enforce-maven) @ org.eclipse.egit.mylyn.ui.test ---
18:43:17 [INFO] 
18:43:17 [INFO] --- maven-resources-plugin:2.4.3:resources (default-resources) @ org.eclipse.egit.mylyn.ui.test ---
18:43:17 [INFO] Using 'UTF-8' encoding to copy filtered resources.
18:43:17 [INFO] skip non existing resourceDirectory /home/jenkins/workspace/egit.gerrit/repo/org.eclipse.egit.mylyn.ui.test/src/main/resources
18:43:17 [INFO] 
18:43:17 [INFO] --- tycho-compiler-plugin:1.3.0:compile (default-compile) @ org.eclipse.egit.mylyn.ui.test ---
18:43:17 [INFO] Nothing to compile - all classes are up to date
18:43:17 [INFO] 
18:43:17 [INFO] --- maven-resources-plugin:2.4.3:testResources (default-testResources) @ org.eclipse.egit.mylyn.ui.test ---
18:43:17 [INFO] Using 'UTF-8' encoding to copy filtered resources.
18:43:17 [INFO] skip non existing resourceDirectory /home/jenkins/workspace/egit.gerrit/repo/org.eclipse.egit.mylyn.ui.test/src/test/resources
18:43:17 [INFO] 
18:43:17 [INFO] --- target-platform-configuration:1.3.0:target-platform (default-target-platform) @ org.eclipse.egit.mylyn.ui.test ---
18:43:17 [INFO] 
18:43:17 [INFO] --- tycho-packaging-plugin:1.3.0:package-plugin (default-package-plugin) @ org.eclipse.egit.mylyn.ui.test ---
18:43:18 [INFO] Building jar: /home/jenkins/workspace/egit.gerrit/repo/org.eclipse.egit.mylyn.ui.test/target/org.eclipse.egit.mylyn.ui.test-5.4.0-SNAPSHOT.jar
18:43:18 [INFO] 
18:43:18 [INFO] --- tycho-p2-plugin:1.3.0:p2-metadata-default (default-p2-metadata-default) @ org.eclipse.egit.mylyn.ui.test ---
18:43:18 [INFO] 
18:43:18 [INFO] --- tycho-surefire-plugin:1.3.0:test (default-test) @ org.eclipse.egit.mylyn.ui.test ---
18:43:18 [INFO] Expected eclipse log file: /home/jenkins/workspace/egit.gerrit/repo/org.eclipse.egit.mylyn.ui.test/target/work/data/.metadata/.log
18:43:18 [INFO] Command line:
18:43:18 	[/opt/tools/java/oracle/jdk-8/1.8.0_202/jre/bin/java, -Dosgi.noShutdown=false, -Dosgi.os=linux, -Dosgi.ws=gtk, -Dosgi.arch=x86_64, -Declipse.consoleLog=true, -Degit.test.tmpdir=/home/jenkins/workspace/egit.gerrit/tmp/egit.tmp/, -Xmx512m, -Dosgi.clean=true, -jar, /home/jenkins/workspace/egit.gerrit/.repository/p2/osgi/bundle/org.eclipse.equinox.launcher/1.3.201.v20161025-1711/org.eclipse.equinox.launcher-1.3.201.v20161025-1711.jar, -data, /home/jenkins/workspace/egit.gerrit/repo/org.eclipse.egit.mylyn.ui.test/target/work/data, -install, /home/jenkins/workspace/egit.gerrit/repo/org.eclipse.egit.mylyn.ui.test/target/work, -configuration, /home/jenkins/workspace/egit.gerrit/repo/org.eclipse.egit.mylyn.ui.test/target/work/configuration, -application, org.eclipse.tycho.surefire.osgibooter.uitest, -testproperties, /home/jenkins/workspace/egit.gerrit/repo/org.eclipse.egit.mylyn.ui.test/target/surefire.properties, -testApplication, org.eclipse.ui.ide.workbench]
18:43:18 Picked up JAVA_TOOL_OPTIONS: -XX:+IgnoreUnrecognizedVMOptions -XX:+UseContainerSupport -XX:+UnlockExperimentalVMOptions -XX:+UseCGroupMemoryLimitForHeap
18:43:18 Picked up _JAVA_OPTIONS: -XX:MaxRAMPercentage=64.0
18:43:20 !SESSION 2019-03-21 22:43:18.902 -----------------------------------------------
18:43:20 eclipse.buildId=unknown
18:43:20 java.version=1.8.0_202
18:43:20 java.vendor=Oracle Corporation
18:43:20 BootLoader constants: OS=linux, ARCH=x86_64, WS=gtk, NL=en_US
18:43:20 Framework arguments:  -application org.eclipse.tycho.surefire.osgibooter.uitest -testproperties /home/jenkins/workspace/egit.gerrit/repo/org.eclipse.egit.mylyn.ui.test/target/surefire.properties -testApplication org.eclipse.ui.ide.workbench
18:43:20 Command-line arguments:  -data /home/jenkins/workspace/egit.gerrit/repo/org.eclipse.egit.mylyn.ui.test/target/work/data -application org.eclipse.tycho.surefire.osgibooter.uitest -testproperties /home/jenkins/workspace/egit.gerrit/repo/org.eclipse.egit.mylyn.ui.test/target/surefire.properties -testApplication org.eclipse.ui.ide.workbench
18:43:20 
18:43:20 !ENTRY org.eclipse.jdt.launching.macosx 4 0 2019-03-21 22:43:20.533
18:43:20 !MESSAGE FrameworkEvent ERROR
18:43:20 !STACK 0
18:43:20 org.osgi.framework.BundleException: Could not resolve module: org.eclipse.jdt.launching.macosx [246]
18:43:20   Unresolved requirement: Require-Capability: eclipse.platform; filter:="(osgi.os=macosx)"
18:43:20 
18:43:20 	at org.eclipse.osgi.container.Module.start(Module.java:444)
18:43:20 	at org.eclipse.osgi.container.ModuleContainer$ContainerStartLevel.incStartLevel(ModuleContainer.java:1620)
18:43:20 	at org.eclipse.osgi.container.ModuleContainer$ContainerStartLevel.incStartLevel(ModuleContainer.java:1599)
18:43:20 	at org.eclipse.osgi.container.ModuleContainer$ContainerStartLevel.doContainerStartLevel(ModuleContainer.java:1571)
18:43:20 	at org.eclipse.osgi.container.ModuleContainer$ContainerStartLevel.dispatchEvent(ModuleContainer.java:1514)
18:43:20 	at org.eclipse.osgi.container.ModuleContainer$ContainerStartLevel.dispatchEvent(ModuleContainer.java:1)
18:43:20 	at org.eclipse.osgi.framework.eventmgr.EventManager.dispatchEvent(EventManager.java:230)
18:43:20 	at org.eclipse.osgi.framework.eventmgr.EventManager$EventThread.run(EventManager.java:340)
18:43:20 
18:43:20 !ENTRY org.eclipse.jdt.launching.ui.macosx 4 0 2019-03-21 22:43:20.534
18:43:20 !MESSAGE FrameworkEvent ERROR
18:43:20 !STACK 0
18:43:20 org.osgi.framework.BundleException: Could not resolve module: org.eclipse.jdt.launching.ui.macosx [247]
18:43:20   Unresolved requirement: Require-Capability: eclipse.platform; filter:="(osgi.os=macosx)"
18:43:20 
18:43:20 	at org.eclipse.osgi.container.Module.start(Module.java:444)
18:43:20 	at org.eclipse.osgi.container.ModuleContainer$ContainerStartLevel.incStartLevel(ModuleContainer.java:1620)
18:43:20 	at org.eclipse.osgi.container.ModuleContainer$ContainerStartLevel.incStartLevel(ModuleContainer.java:1599)
18:43:20 	at org.eclipse.osgi.container.ModuleContainer$ContainerStartLevel.doContainerStartLevel(ModuleContainer.java:1571)
18:43:20 	at org.eclipse.osgi.container.ModuleContainer$ContainerStartLevel.dispatchEvent(ModuleContainer.java:1514)
18:43:20 	at org.eclipse.osgi.container.ModuleContainer$ContainerStartLevel.dispatchEvent(ModuleContainer.java:1)
18:43:20 	at org.eclipse.osgi.framework.eventmgr.EventManager.dispatchEvent(EventManager.java:230)
18:43:20 	at org.eclipse.osgi.framework.eventmgr.EventManager$EventThread.run(EventManager.java:340)
18:43:20 Launching application org.eclipse.ui.ide.workbench...
18:43:22 
18:43:22 !ENTRY org.eclipse.egit.core 1 0 2019-03-21 22:43:22.845
18:43:22 !MESSAGE Using Apache MINA sshd as ssh client.
18:43:23 
18:43:23 (SWT:2466): Gtk-WARNING **: 22:43:23.506: Negative content width -6 (allocation 1, extents 4x3) while allocating gadget (node toolbar, owner GtkToolbar)
18:43:23 
18:43:23 (SWT:2466): Gtk-WARNING **: 22:43:23.506: Negative content height -3 (allocation 1, extents 2x2) while allocating gadget (node toolbar, owner GtkToolbar)
18:43:23 
18:43:23 (SWT:2466): Gtk-WARNING **: 22:43:23.506: Negative content width -6 (allocation 1, extents 4x3) while allocating gadget (node toolbar, owner GtkToolbar)
18:43:23 
18:43:23 (SWT:2466): Gtk-WARNING **: 22:43:23.506: Negative content height -3 (allocation 1, extents 2x2) while allocating gadget (node toolbar, owner GtkToolbar)
18:43:23 
18:43:23 (SWT:2466): Gtk-WARNING **: 22:43:23.512: Negative content width -6 (allocation 1, extents 4x3) while allocating gadget (node toolbar, owner GtkToolbar)
18:43:23 
18:43:23 (SWT:2466): Gtk-WARNING **: 22:43:23.512: Negative content height -3 (allocation 1, extents 2x2) while allocating gadget (node toolbar, owner GtkToolbar)
18:43:23 
18:43:23 (SWT:2466): Gtk-WARNING **: 22:43:23.512: Negative content width -6 (allocation 1, extents 4x3) while allocating gadget (node toolbar, owner GtkToolbar)
18:43:23 
18:43:23 (SWT:2466): Gtk-WARNING **: 22:43:23.512: Negative content height -3 (allocation 1, extents 2x2) while allocating gadget (node toolbar, owner GtkToolbar)
18:43:23 
18:43:23 (SWT:2466): Gtk-WARNING **: 22:43:23.709: Negative content width -6 (allocation 1, extents 4x3) while allocating gadget (node toolbar, owner GtkToolbar)
18:43:23 
18:43:23 (SWT:2466): Gtk-WARNING **: 22:43:23.709: Negative content height -3 (allocation 1, extents 2x2) while allocating gadget (node toolbar, owner GtkToolbar)
18:43:23 
18:43:23 (SWT:2466): Gtk-WARNING **: 22:43:23.709: Negative content width -6 (allocation 1, extents 4x3) while allocating gadget (node toolbar, owner GtkToolbar)
18:43:23 
18:43:23 (SWT:2466): Gtk-WARNING **: 22:43:23.709: Negative content height -3 (allocation 1, extents 2x2) while allocating gadget (node toolbar, owner GtkToolbar)
18:43:23 
18:43:23 (SWT:2466): Gtk-WARNING **: 22:43:23.995: Negative content width -6 (allocation 1, extents 4x3) while allocating gadget (node toolbar, owner GtkToolbar)
18:43:23 
18:43:23 (SWT:2466): Gtk-WARNING **: 22:43:23.996: Negative content height -3 (allocation 1, extents 2x2) while allocating gadget (node toolbar, owner GtkToolbar)
18:43:23 
18:43:23 (SWT:2466): Gtk-WARNING **: 22:43:23.996: Negative content width -6 (allocation 1, extents 4x3) while allocating gadget (node toolbar, owner GtkToolbar)
18:43:23 
18:43:23 (SWT:2466): Gtk-WARNING **: 22:43:23.996: Negative content height -3 (allocation 1, extents 2x2) while allocating gadget (node toolbar, owner GtkToolbar)
18:43:24 
18:43:24 (SWT:2466): Gtk-WARNING **: 22:43:24.010: Negative content width -6 (allocation 1, extents 4x3) while allocating gadget (node toolbar, owner GtkToolbar)
18:43:24 
18:43:24 (SWT:2466): Gtk-WARNING **: 22:43:24.010: Negative content height -3 (allocation 1, extents 2x2) while allocating gadget (node toolbar, owner GtkToolbar)
18:43:24 
18:43:24 (SWT:2466): Gtk-WARNING **: 22:43:24.010: Negative content width -6 (allocation 1, extents 4x3) while allocating gadget (node toolbar, owner GtkToolbar)
18:43:24 
18:43:24 (SWT:2466): Gtk-WARNING **: 22:43:24.011: Negative content height -3 (allocation 1, extents 2x2) while allocating gadget (node toolbar, owner GtkToolbar)
18:43:24 
18:43:24 (SWT:2466): Gtk-WARNING **: 22:43:24.014: Negative content width -6 (allocation 1, extents 4x3) while allocating gadget (node toolbar, owner GtkToolbar)
18:43:24 
18:43:24 (SWT:2466): Gtk-WARNING **: 22:43:24.014: Negative content height -3 (allocation 1, extents 2x2) while allocating gadget (node toolbar, owner GtkToolbar)
18:43:24 
18:43:24 (SWT:2466): Gtk-WARNING **: 22:43:24.014: Negative content width -6 (allocation 1, extents 4x3) while allocating gadget (node toolbar, owner GtkToolbar)
18:43:24 
18:43:24 (SWT:2466): Gtk-WARNING **: 22:43:24.014: Negative content height -3 (allocation 1, extents 2x2) while allocating gadget (node toolbar, owner GtkToolbar)
18:43:24 
18:43:24 (SWT:2466): Gtk-WARNING **: 22:43:24.019: Negative content width -6 (allocation 1, extents 4x3) while allocating gadget (node toolbar, owner GtkToolbar)
18:43:24 
18:43:24 (SWT:2466): Gtk-WARNING **: 22:43:24.019: Negative content height -3 (allocation 1, extents 2x2) while allocating gadget (node toolbar, owner GtkToolbar)
18:43:24 
18:43:24 (SWT:2466): Gtk-WARNING **: 22:43:24.019: Negative content width -6 (allocation 1, extents 4x3) while allocating gadget (node toolbar, owner GtkToolbar)
18:43:24 
18:43:24 (SWT:2466): Gtk-WARNING **: 22:43:24.019: Negative content height -3 (allocation 1, extents 2x2) while allocating gadget (node toolbar, owner GtkToolbar)
18:43:24 
18:43:24 (SWT:2466): Gtk-WARNING **: 22:43:24.414: Negative content width -6 (allocation 1, extents 4x3) while allocating gadget (node toolbar, owner GtkToolbar)
18:43:24 
18:43:24 (SWT:2466): Gtk-WARNING **: 22:43:24.414: Negative content height -3 (allocation 1, extents 2x2) while allocating gadget (node toolbar, owner GtkToolbar)
18:43:24 
18:43:24 (SWT:2466): Gtk-WARNING **: 22:43:24.414: Negative content width -6 (allocation 1, extents 4x3) while allocating gadget (node toolbar, owner GtkToolbar)
18:43:24 
18:43:24 (SWT:2466): Gtk-WARNING **: 22:43:24.414: Negative content height -3 (allocation 1, extents 2x2) while allocating gadget (node toolbar, owner GtkToolbar)
18:43:24 
18:43:24 (SWT:2466): Gtk-WARNING **: 22:43:24.424: Negative content width -6 (allocation 1, extents 4x3) while allocating gadget (node toolbar, owner GtkToolbar)
18:43:24 
18:43:24 (SWT:2466): Gtk-WARNING **: 22:43:24.424: Negative content height -3 (allocation 1, extents 2x2) while allocating gadget (node toolbar, owner GtkToolbar)
18:43:24 
18:43:24 (SWT:2466): Gtk-WARNING **: 22:43:24.424: Negative content width -6 (allocation 1, extents 4x3) while allocating gadget (node toolbar, owner GtkToolbar)
18:43:24 
18:43:24 (SWT:2466): Gtk-WARNING **: 22:43:24.424: Negative content height -3 (allocation 1, extents 2x2) while allocating gadget (node toolbar, owner GtkToolbar)
18:43:24 
18:43:24 (SWT:2466): Gtk-WARNING **: 22:43:24.778: Negative content height -9 (allocation 1, extents 5x5) while allocating gadget (node button, owner GtkButton)
18:43:24 
18:43:24 (SWT:2466): Gtk-WARNING **: 22:43:24.838: Negative content width -6 (allocation 1, extents 4x3) while allocating gadget (node toolbar, owner GtkToolbar)
18:43:24 
18:43:24 (SWT:2466): Gtk-WARNING **: 22:43:24.841: Negative content width -6 (allocation 1, extents 4x3) while allocating gadget (node toolbar, owner GtkToolbar)
18:43:24 
18:43:24 (SWT:2466): Gtk-WARNING **: 22:43:24.847: Negative content width -6 (allocation 1, extents 4x3) while allocating gadget (node toolbar, owner GtkToolbar)
18:43:24 
18:43:24 (SWT:2466): Gtk-WARNING **: 22:43:24.849: Negative content width -6 (allocation 1, extents 4x3) while allocating gadget (node toolbar, owner GtkToolbar)
18:43:24 
18:43:24 (SWT:2466): Gtk-WARNING **: 22:43:24.852: Negative content width -6 (allocation 1, extents 4x3) while allocating gadget (node toolbar, owner GtkToolbar)
18:43:24 
18:43:24 (SWT:2466): Gtk-WARNING **: 22:43:24.852: Negative content width -1 (allocation 1, extents 1x1) while allocating gadget (node trough, owner GtkProgressBar)
18:43:24 
18:43:24 (SWT:2466): Gtk-WARNING **: 22:43:24.852: Negative content width -1 (allocation 1, extents 1x1) while allocating gadget (node trough, owner GtkProgressBar)
18:43:24 
18:43:24 (SWT:2466): Gtk-WARNING **: 22:43:24.889: Negative content width -6 (allocation 1, extents 4x3) while allocating gadget (node toolbar, owner GtkToolbar)
18:43:24 
18:43:24 (SWT:2466): Gtk-WARNING **: 22:43:24.890: Negative content width -6 (allocation 1, extents 4x3) while allocating gadget (node toolbar, owner GtkToolbar)
18:43:24 
18:43:24 (SWT:2466): Gtk-WARNING **: 22:43:24.894: Negative content width -6 (allocation 1, extents 4x3) while allocating gadget (node toolbar, owner GtkToolbar)
18:43:24 
18:43:24 (SWT:2466): Gtk-WARNING **: 22:43:24.895: Negative content width -6 (allocation 1, extents 4x3) while allocating gadget (node toolbar, owner GtkToolbar)
18:43:24 
18:43:24 (SWT:2466): Gtk-WARNING **: 22:43:24.899: Negative content width -6 (allocation 1, extents 4x3) while allocating gadget (node toolbar, owner GtkToolbar)
18:43:24 
18:43:24 (SWT:2466): Gtk-WARNING **: 22:43:24.900: Negative content width -6 (allocation 1, extents 4x3) while allocating gadget (node toolbar, owner GtkToolbar)
18:43:25 Running org.eclipse.egit.internal.mylyn.CommitHyperlinkDetectorTest
18:43:25 Tests run: 14, Failures: 0, Errors: 0, Skipped: 0, Time elapsed: 0.106 s - in org.eclipse.egit.internal.mylyn.CommitHyperlinkDetectorTest
18:43:25 testEndLine(org.eclipse.egit.internal.mylyn.CommitHyperlinkDetectorTest)  Time elapsed: 0.042 s
18:43:25 testGerritId(org.eclipse.egit.internal.mylyn.CommitHyperlinkDetectorTest)  Time elapsed: 0.003 s
18:43:25 testMiddleLine(org.eclipse.egit.internal.mylyn.CommitHyperlinkDetectorTest)  Time elapsed: 0.004 s
18:43:25 testOffsetOff(org.eclipse.egit.internal.mylyn.CommitHyperlinkDetectorTest)  Time elapsed: 0.003 s
18:43:25 testEmpty(org.eclipse.egit.internal.mylyn.CommitHyperlinkDetectorTest)  Time elapsed: 0.003 s
18:43:25 testBadLocation(org.eclipse.egit.internal.mylyn.CommitHyperlinkDetectorTest)  Time elapsed: 0.002 s
18:43:25 testEndSentence(org.eclipse.egit.internal.mylyn.CommitHyperlinkDetectorTest)  Time elapsed: 0.003 s
18:43:25 testMultiLine(org.eclipse.egit.internal.mylyn.CommitHyperlinkDetectorTest)  Time elapsed: 0.004 s
18:43:25 testBeginSentence(org.eclipse.egit.internal.mylyn.CommitHyperlinkDetectorTest)  Time elapsed: 0.003 s
18:43:25 testGerritIdWithinText(org.eclipse.egit.internal.mylyn.CommitHyperlinkDetectorTest)  Time elapsed: 0.002 s
18:43:25 testMultiId(org.eclipse.egit.internal.mylyn.CommitHyperlinkDetectorTest)  Time elapsed: 0.004 s
18:43:25 testSimpleId(org.eclipse.egit.internal.mylyn.CommitHyperlinkDetectorTest)  Time elapsed: 0.002 s
18:43:25 testNoDocument(org.eclipse.egit.internal.mylyn.CommitHyperlinkDetectorTest)  Time elapsed: 0.002 s
18:43:25 testOffsetMiddle(org.eclipse.egit.internal.mylyn.CommitHyperlinkDetectorTest)  Time elapsed: 0.003 s
18:43:25 
18:43:25 Results:
18:43:25 
18:43:25 Tests run: 14, Failures: 0, Errors: 0, Skipped: 0
18:43:25 
18:43:25 
18:43:25 (SWT:2466): Gtk-WARNING **: 22:43:25.176: Negative content width -6 (allocation 1, extents 4x3) while allocating gadget (node toolbar, owner GtkToolbar)
18:43:25 
18:43:25 (SWT:2466): Gtk-WARNING **: 22:43:25.177: Negative content width -6 (allocation 1, extents 4x3) while allocating gadget (node toolbar, owner GtkToolbar)
18:43:27 [INFO] All tests passed!
18:43:27 [INFO] 
18:43:27 [INFO] >>> maven-pmd-plugin:3.11.0:cpd-check (default) > :cpd @ org.eclipse.egit.mylyn.ui.test >>>
18:43:27 [INFO] 
18:43:27 [INFO] --- maven-pmd-plugin:3.11.0:cpd (cpd) @ org.eclipse.egit.mylyn.ui.test ---
18:43:28 [INFO] 
18:43:28 [INFO] <<< maven-pmd-plugin:3.11.0:cpd-check (default) < :cpd @ org.eclipse.egit.mylyn.ui.test <<<
18:43:28 [INFO] 
18:43:28 [INFO] 
18:43:28 [INFO] --- maven-pmd-plugin:3.11.0:cpd-check (default) @ org.eclipse.egit.mylyn.ui.test ---
18:43:28 [INFO] 
18:43:28 [INFO] ------------------------------------------------------------------------
18:43:28 [INFO] BUILD SUCCESS
18:43:28 [INFO] ------------------------------------------------------------------------
18:43:28 [INFO] Total time: 36.786 s
18:43:28 [INFO] Finished at: 2019-03-21T22:43:28Z
18:43:28 [INFO] ------------------------------------------------------------------------
18:43:28 Terminating xvnc.
18:47:30 [FINDBUGS] Collecting findbugs analysis files...
18:47:33 [FINDBUGS] Searching for all files in /home/jenkins/workspace/egit.gerrit that match the pattern repo/*/target/*bugsXml.xml
18:47:33 [FINDBUGS] Parsing 12 files in /home/jenkins/workspace/egit.gerrit
18:47:33 [FINDBUGS] Successfully parsed file /home/jenkins/workspace/egit.gerrit/repo/org.eclipse.egit.core.junit/target/spotbugsXml.xml with 4 unique warnings and 0 duplicates.
18:47:33 [FINDBUGS] Successfully parsed file /home/jenkins/workspace/egit.gerrit/repo/org.eclipse.egit.core.test/target/spotbugsXml.xml with 10 unique warnings and 0 duplicates.
18:47:33 [FINDBUGS] Successfully parsed file /home/jenkins/workspace/egit.gerrit/repo/org.eclipse.egit.core/target/spotbugsXml.xml with 21 unique warnings and 0 duplicates.
18:47:33 [FINDBUGS] Successfully parsed file /home/jenkins/workspace/egit.gerrit/repo/org.eclipse.egit.gitflow.test/target/spotbugsXml.xml with 21 unique warnings and 0 duplicates.
18:47:33 [FINDBUGS] Successfully parsed file /home/jenkins/workspace/egit.gerrit/repo/org.eclipse.egit.gitflow.ui/target/spotbugsXml.xml with 21 unique warnings and 0 duplicates.
18:47:33 [FINDBUGS] Successfully parsed file /home/jenkins/workspace/egit.gerrit/repo/org.eclipse.egit.gitflow/target/spotbugsXml.xml with 23 unique warnings and 0 duplicates.
18:47:33 [FINDBUGS] Successfully parsed file /home/jenkins/workspace/egit.gerrit/repo/org.eclipse.egit.mylyn.ui.test/target/spotbugsXml.xml with 23 unique warnings and 0 duplicates.
18:47:33 [FINDBUGS] Successfully parsed file /home/jenkins/workspace/egit.gerrit/repo/org.eclipse.egit.mylyn.ui/target/spotbugsXml.xml with 23 unique warnings and 0 duplicates.
18:47:33 [FINDBUGS] Successfully parsed file /home/jenkins/workspace/egit.gerrit/repo/org.eclipse.egit.ui.importer.tests/target/spotbugsXml.xml with 23 unique warnings and 0 duplicates.
18:47:33 [FINDBUGS] Successfully parsed file /home/jenkins/workspace/egit.gerrit/repo/org.eclipse.egit.ui.smartimport/target/spotbugsXml.xml with 23 unique warnings and 0 duplicates.
18:47:33 [FINDBUGS] Successfully parsed file /home/jenkins/workspace/egit.gerrit/repo/org.eclipse.egit.ui.test/target/spotbugsXml.xml with 45 unique warnings and 0 duplicates.
18:47:33 [FINDBUGS] Successfully parsed file /home/jenkins/workspace/egit.gerrit/repo/org.eclipse.egit.ui/target/spotbugsXml.xml with 80 unique warnings and 0 duplicates.
18:47:33 No credentials specified
18:47:33 <Git Blamer> Using GitBlamer to create author and commit information for all warnings.
18:47:33 <Git Blamer> GIT_COMMIT=7014e6ce9596bdfdd9cda6ad7e9e93eac1cb727d, workspace=/home/jenkins/workspace/egit.gerrit/repo
18:47:34  > /usr/bin/git rev-parse 7014e6ce9596bdfdd9cda6ad7e9e93eac1cb727d^{commit} # timeout=10
18:47:41 <Git Blamer> Skipping file /home/jenkins/workspace/egit.gerrit/repo/org.eclipse.egit.ui.test/src/org/eclipse/egit/ui/view/repositories/GitRepositoriesViewTestBase.java, no result found.
18:47:41 [FINDBUGS] Computing warning deltas based on reference build #11570
18:47:41 [DRY] Collecting duplicate code analysis files...
18:47:41 [DRY] Searching for all files in /home/jenkins/workspace/egit.gerrit that match the pattern **/cpd.xml
18:47:41 [DRY] Parsing 19 files in /home/jenkins/workspace/egit.gerrit
18:47:41 [DRY] Successfully parsed file /home/jenkins/workspace/egit.gerrit/repo/org.eclipse.egit-feature/target/cpd.xml with 0 unique warnings and 0 duplicates.
18:47:41 [DRY] Successfully parsed file /home/jenkins/workspace/egit.gerrit/repo/org.eclipse.egit.core.junit/target/cpd.xml with 0 unique warnings and 0 duplicates.
18:47:41 [DRY] Successfully parsed file /home/jenkins/workspace/egit.gerrit/repo/org.eclipse.egit.core.test/target/cpd.xml with 0 unique warnings and 0 duplicates.
18:47:41 [DRY] Successfully parsed file /home/jenkins/workspace/egit.gerrit/repo/org.eclipse.egit.core/target/cpd.xml with 4 unique warnings and 0 duplicates.
18:47:41 [DRY] Successfully parsed file /home/jenkins/workspace/egit.gerrit/repo/org.eclipse.egit.doc/target/cpd.xml with 4 unique warnings and 0 duplicates.
18:47:41 [DRY] Successfully parsed file /home/jenkins/workspace/egit.gerrit/repo/org.eclipse.egit.gitflow-feature/target/cpd.xml with 4 unique warnings and 0 duplicates.
18:47:41 [DRY] Successfully parsed file /home/jenkins/workspace/egit.gerrit/repo/org.eclipse.egit.gitflow.test/target/cpd.xml with 4 unique warnings and 0 duplicates.
18:47:41 [DRY] Successfully parsed file /home/jenkins/workspace/egit.gerrit/repo/org.eclipse.egit.gitflow.ui/target/cpd.xml with 4 unique warnings and 0 duplicates.
18:47:41 [DRY] Successfully parsed file /home/jenkins/workspace/egit.gerrit/repo/org.eclipse.egit.gitflow/target/cpd.xml with 4 unique warnings and 0 duplicates.
18:47:41 [DRY] Successfully parsed file /home/jenkins/workspace/egit.gerrit/repo/org.eclipse.egit.mylyn-feature/target/cpd.xml with 4 unique warnings and 0 duplicates.
18:47:41 [DRY] Successfully parsed file /home/jenkins/workspace/egit.gerrit/repo/org.eclipse.egit.mylyn.ui.test/target/cpd.xml with 4 unique warnings and 0 duplicates.
18:47:41 [DRY] Successfully parsed file /home/jenkins/workspace/egit.gerrit/repo/org.eclipse.egit.mylyn.ui/target/cpd.xml with 4 unique warnings and 0 duplicates.
18:47:41 [DRY] Successfully parsed file /home/jenkins/workspace/egit.gerrit/repo/org.eclipse.egit.repository/target/cpd.xml with 4 unique warnings and 0 duplicates.
18:47:41 [DRY] Successfully parsed file /home/jenkins/workspace/egit.gerrit/repo/org.eclipse.egit.source-feature/target/cpd.xml with 4 unique warnings and 0 duplicates.
18:47:41 [DRY] Successfully parsed file /home/jenkins/workspace/egit.gerrit/repo/org.eclipse.egit.ui.importer.tests/target/cpd.xml with 4 unique warnings and 0 duplicates.
18:47:41 [DRY] Successfully parsed file /home/jenkins/workspace/egit.gerrit/repo/org.eclipse.egit.ui.smartimport/target/cpd.xml with 4 unique warnings and 0 duplicates.
18:47:41 [DRY] Successfully parsed file /home/jenkins/workspace/egit.gerrit/repo/org.eclipse.egit.ui.test/target/cpd.xml with 4 unique warnings and 0 duplicates.
18:47:41 [DRY] Successfully parsed file /home/jenkins/workspace/egit.gerrit/repo/org.eclipse.egit.ui/target/cpd.xml with 37 unique warnings and 0 duplicates.
18:47:41 [DRY] Successfully parsed file /home/jenkins/workspace/egit.gerrit/repo/org.eclipse.egit/target/cpd.xml with 37 unique warnings and 0 duplicates.
18:47:41 No credentials specified
18:47:41 <Git Blamer> Using GitBlamer to create author and commit information for all warnings.
18:47:41 <Git Blamer> GIT_COMMIT=7014e6ce9596bdfdd9cda6ad7e9e93eac1cb727d, workspace=/home/jenkins/workspace/egit.gerrit/repo
18:47:41  > /usr/bin/git rev-parse 7014e6ce9596bdfdd9cda6ad7e9e93eac1cb727d^{commit} # timeout=10
18:47:46 [DRY] Computing warning deltas based on reference build #11570
18:47:46 Recording test results
18:47:46 Build step 'Publish JUnit test result report' changed build result to UNSTABLE
18:47:46 Archiving artifacts
18:47:51 Finished: UNSTABLE