FailedConsole Output

Skipping 984 KB.. Full Log
10:46:43 [2021-02-15T15:46:43.275Z] 	at sun.reflect.NativeMethodAccessorImpl.invoke0(Native Method)
10:46:43 [2021-02-15T15:46:43.275Z] 	at sun.reflect.NativeMethodAccessorImpl.invoke(NativeMethodAccessorImpl.java:62)
10:46:43 [2021-02-15T15:46:43.275Z] 	at sun.reflect.DelegatingMethodAccessorImpl.invoke(DelegatingMethodAccessorImpl.java:43)
10:46:43 [2021-02-15T15:46:43.275Z] 	at java.lang.reflect.Method.invoke(Method.java:498)
10:46:43 [2021-02-15T15:46:43.275Z] 	at org.junit.runners.model.FrameworkMethod$1.runReflectiveCall(FrameworkMethod.java:59)
10:46:43 [2021-02-15T15:46:43.275Z] 	at org.junit.internal.runners.model.ReflectiveCallable.run(ReflectiveCallable.java:12)
10:46:43 [2021-02-15T15:46:43.275Z] 	at org.junit.runners.model.FrameworkMethod.invokeExplosively(FrameworkMethod.java:56)
10:46:43 [2021-02-15T15:46:43.276Z] 	at org.junit.internal.runners.statements.InvokeMethod.evaluate(InvokeMethod.java:17)
10:46:43 [2021-02-15T15:46:43.276Z] 	at org.junit.internal.runners.statements.RunBefores.evaluate(RunBefores.java:26)
10:46:43 [2021-02-15T15:46:43.276Z] 	at org.junit.internal.runners.statements.RunAfters.evaluate(RunAfters.java:27)
10:46:43 [2021-02-15T15:46:43.276Z] 	at org.junit.runners.ParentRunner$3.evaluate(ParentRunner.java:306)
10:46:43 [2021-02-15T15:46:43.276Z] 	at org.junit.runners.BlockJUnit4ClassRunner$1.evaluate(BlockJUnit4ClassRunner.java:100)
10:46:43 [2021-02-15T15:46:43.276Z] 	at org.junit.runners.ParentRunner.runLeaf(ParentRunner.java:366)
10:46:43 [2021-02-15T15:46:43.276Z] 	at org.junit.runners.BlockJUnit4ClassRunner.runChild(BlockJUnit4ClassRunner.java:103)
10:46:43 [2021-02-15T15:46:43.276Z] 	at org.junit.runners.BlockJUnit4ClassRunner.runChild(BlockJUnit4ClassRunner.java:63)
10:46:43 [2021-02-15T15:46:43.276Z] 	at org.junit.runners.ParentRunner$4.run(ParentRunner.java:331)
10:46:43 [2021-02-15T15:46:43.276Z] 	at org.junit.runners.ParentRunner$1.schedule(ParentRunner.java:79)
10:46:43 [2021-02-15T15:46:43.276Z] 	at org.junit.runners.ParentRunner.runChildren(ParentRunner.java:329)
10:46:43 [2021-02-15T15:46:43.276Z] 	at org.junit.runners.ParentRunner.access$100(ParentRunner.java:66)
10:46:43 [2021-02-15T15:46:43.276Z] 	at org.junit.runners.ParentRunner$2.evaluate(ParentRunner.java:293)
10:46:43 [2021-02-15T15:46:43.276Z] 	at org.junit.internal.runners.statements.RunBefores.evaluate(RunBefores.java:26)
10:46:43 [2021-02-15T15:46:43.276Z] 	at org.junit.runners.ParentRunner$3.evaluate(ParentRunner.java:306)
10:46:43 [2021-02-15T15:46:43.276Z] 	at org.junit.runners.ParentRunner.run(ParentRunner.java:413)
10:46:43 [2021-02-15T15:46:43.276Z] 	at org.apache.maven.surefire.junit4.JUnit4Provider.execute(JUnit4Provider.java:365)
10:46:43 [2021-02-15T15:46:43.276Z] 	at org.apache.maven.surefire.junit4.JUnit4Provider.executeWithRerun(JUnit4Provider.java:273)
10:46:43 [2021-02-15T15:46:43.276Z] 	at org.apache.maven.surefire.junit4.JUnit4Provider.executeTestSet(JUnit4Provider.java:238)
10:46:43 [2021-02-15T15:46:43.276Z] 	at org.apache.maven.surefire.junit4.JUnit4Provider.invoke(JUnit4Provider.java:159)
10:46:43 [2021-02-15T15:46:43.276Z] 	at sun.reflect.NativeMethodAccessorImpl.invoke0(Native Method)
10:46:43 [2021-02-15T15:46:43.276Z] 	at sun.reflect.NativeMethodAccessorImpl.invoke(NativeMethodAccessorImpl.java:62)
10:46:43 [2021-02-15T15:46:43.276Z] 	at sun.reflect.DelegatingMethodAccessorImpl.invoke(DelegatingMethodAccessorImpl.java:43)
10:46:43 [2021-02-15T15:46:43.276Z] 	at java.lang.reflect.Method.invoke(Method.java:498)
10:46:43 [2021-02-15T15:46:43.276Z] 	at org.apache.maven.surefire.util.ReflectionUtils.invokeMethodWithArray2(ReflectionUtils.java:206)
10:46:43 [2021-02-15T15:46:43.276Z] 	at org.apache.maven.surefire.booter.ProviderFactory$ProviderProxy.invoke(ProviderFactory.java:161)
10:46:43 [2021-02-15T15:46:43.276Z] 	at org.apache.maven.surefire.booter.ProviderFactory.invokeProvider(ProviderFactory.java:84)
10:46:43 [2021-02-15T15:46:43.276Z] 	at org.eclipse.tycho.surefire.osgibooter.OsgiSurefireBooter.run(OsgiSurefireBooter.java:113)
10:46:43 [2021-02-15T15:46:43.276Z] 	at org.eclipse.tycho.surefire.osgibooter.AbstractUITestApplication.runTests(AbstractUITestApplication.java:44)
10:46:43 [2021-02-15T15:46:43.276Z] 	at org.eclipse.e4.ui.internal.workbench.swt.E4Testable$1.run(E4Testable.java:73)
10:46:43 [2021-02-15T15:46:43.276Z] 	at java.lang.Thread.run(Thread.java:748)
10:46:44 [2021-02-15T15:46:44.647Z] 
10:46:44 [2021-02-15T15:46:44.647Z] !ENTRY org.eclipse.egit.ui 4 0 2021-02-15 15:46:44.250
10:46:44 [2021-02-15T15:46:44.648Z] !MESSAGE CrashingCommitMessageProviderWithCaretPositioning fails on purpose.
10:46:44 [2021-02-15T15:46:44.648Z] !STACK 0
10:46:44 [2021-02-15T15:46:44.648Z] java.lang.IllegalStateException: CrashingCommitMessageProviderWithCaretPositioning fails on purpose.
10:46:44 [2021-02-15T15:46:44.648Z] 	at org.eclipse.egit.ui.internal.dialogs.CommitMessageBuilderTest$CrashingCommitMessageProviderWithCaretPositioning.getCommitMessageWithPosition(CommitMessageBuilderTest.java:491)
10:46:44 [2021-02-15T15:46:44.648Z] 	at org.eclipse.egit.ui.internal.dialogs.CommitMessageBuilder.build(CommitMessageBuilder.java:81)
10:46:44 [2021-02-15T15:46:44.648Z] 	at org.eclipse.egit.ui.internal.dialogs.CommitMessageBuilderTest.commitMessageProvider_oneCrashingProviderWithCaretPosition(CommitMessageBuilderTest.java:112)
10:46:44 [2021-02-15T15:46:44.648Z] 	at sun.reflect.NativeMethodAccessorImpl.invoke0(Native Method)
10:46:44 [2021-02-15T15:46:44.648Z] 	at sun.reflect.NativeMethodAccessorImpl.invoke(NativeMethodAccessorImpl.java:62)
10:46:44 [2021-02-15T15:46:44.648Z] 	at sun.reflect.DelegatingMethodAccessorImpl.invoke(DelegatingMethodAccessorImpl.java:43)
10:46:44 [2021-02-15T15:46:44.648Z] 	at java.lang.reflect.Method.invoke(Method.java:498)
10:46:44 [2021-02-15T15:46:44.648Z] 	at org.junit.runners.model.FrameworkMethod$1.runReflectiveCall(FrameworkMethod.java:59)
10:46:44 [2021-02-15T15:46:44.648Z] 	at org.junit.internal.runners.model.ReflectiveCallable.run(ReflectiveCallable.java:12)
10:46:44 [2021-02-15T15:46:44.648Z] 	at org.junit.runners.model.FrameworkMethod.invokeExplosively(FrameworkMethod.java:56)
10:46:44 [2021-02-15T15:46:44.648Z] 	at org.junit.internal.runners.statements.InvokeMethod.evaluate(InvokeMethod.java:17)
10:46:44 [2021-02-15T15:46:44.648Z] 	at org.junit.internal.runners.statements.RunBefores.evaluate(RunBefores.java:26)
10:46:44 [2021-02-15T15:46:44.648Z] 	at org.junit.internal.runners.statements.RunAfters.evaluate(RunAfters.java:27)
10:46:44 [2021-02-15T15:46:44.648Z] 	at org.junit.runners.ParentRunner$3.evaluate(ParentRunner.java:306)
10:46:44 [2021-02-15T15:46:44.648Z] 	at org.junit.runners.BlockJUnit4ClassRunner$1.evaluate(BlockJUnit4ClassRunner.java:100)
10:46:44 [2021-02-15T15:46:44.648Z] 	at org.junit.runners.ParentRunner.runLeaf(ParentRunner.java:366)
10:46:44 [2021-02-15T15:46:44.648Z] 	at org.junit.runners.BlockJUnit4ClassRunner.runChild(BlockJUnit4ClassRunner.java:103)
10:46:44 [2021-02-15T15:46:44.648Z] 	at org.junit.runners.BlockJUnit4ClassRunner.runChild(BlockJUnit4ClassRunner.java:63)
10:46:44 [2021-02-15T15:46:44.648Z] 	at org.junit.runners.ParentRunner$4.run(ParentRunner.java:331)
10:46:44 [2021-02-15T15:46:44.648Z] 	at org.junit.runners.ParentRunner$1.schedule(ParentRunner.java:79)
10:46:44 [2021-02-15T15:46:44.648Z] 	at org.junit.runners.ParentRunner.runChildren(ParentRunner.java:329)
10:46:44 [2021-02-15T15:46:44.648Z] 	at org.junit.runners.ParentRunner.access$100(ParentRunner.java:66)
10:46:44 [2021-02-15T15:46:44.648Z] 	at org.junit.runners.ParentRunner$2.evaluate(ParentRunner.java:293)
10:46:44 [2021-02-15T15:46:44.648Z] 	at org.junit.internal.runners.statements.RunBefores.evaluate(RunBefores.java:26)
10:46:44 [2021-02-15T15:46:44.648Z] 	at org.junit.runners.ParentRunner$3.evaluate(ParentRunner.java:306)
10:46:44 [2021-02-15T15:46:44.648Z] 	at org.junit.runners.ParentRunner.run(ParentRunner.java:413)
10:46:44 [2021-02-15T15:46:44.648Z] 	at org.apache.maven.surefire.junit4.JUnit4Provider.execute(JUnit4Provider.java:365)
10:46:44 [2021-02-15T15:46:44.648Z] 	at org.apache.maven.surefire.junit4.JUnit4Provider.executeWithRerun(JUnit4Provider.java:273)
10:46:44 [2021-02-15T15:46:44.648Z] 	at org.apache.maven.surefire.junit4.JUnit4Provider.executeTestSet(JUnit4Provider.java:238)
10:46:44 [2021-02-15T15:46:44.648Z] 	at org.apache.maven.surefire.junit4.JUnit4Provider.invoke(JUnit4Provider.java:159)
10:46:44 [2021-02-15T15:46:44.648Z] 	at sun.reflect.NativeMethodAccessorImpl.invoke0(Native Method)
10:46:44 [2021-02-15T15:46:44.648Z] 	at sun.reflect.NativeMethodAccessorImpl.invoke(NativeMethodAccessorImpl.java:62)
10:46:44 [2021-02-15T15:46:44.648Z] 	at sun.reflect.DelegatingMethodAccessorImpl.invoke(DelegatingMethodAccessorImpl.java:43)
10:46:44 [2021-02-15T15:46:44.648Z] 	at java.lang.reflect.Method.invoke(Method.java:498)
10:46:44 [2021-02-15T15:46:44.648Z] 	at org.apache.maven.surefire.util.ReflectionUtils.invokeMethodWithArray2(ReflectionUtils.java:206)
10:46:44 [2021-02-15T15:46:44.648Z] 	at org.apache.maven.surefire.booter.ProviderFactory$ProviderProxy.invoke(ProviderFactory.java:161)
10:46:44 [2021-02-15T15:46:44.648Z] 	at org.apache.maven.surefire.booter.ProviderFactory.invokeProvider(ProviderFactory.java:84)
10:46:44 [2021-02-15T15:46:44.648Z] 	at org.eclipse.tycho.surefire.osgibooter.OsgiSurefireBooter.run(OsgiSurefireBooter.java:113)
10:46:44 [2021-02-15T15:46:44.648Z] 	at org.eclipse.tycho.surefire.osgibooter.AbstractUITestApplication.runTests(AbstractUITestApplication.java:44)
10:46:44 [2021-02-15T15:46:44.648Z] 	at org.eclipse.e4.ui.internal.workbench.swt.E4Testable$1.run(E4Testable.java:73)
10:46:44 [2021-02-15T15:46:44.648Z] 	at java.lang.Thread.run(Thread.java:748)
10:46:44 [2021-02-15T15:46:44.648Z] 
10:46:44 [2021-02-15T15:46:44.648Z] !ENTRY org.eclipse.egit.ui 4 0 2021-02-15 15:46:44.453
10:46:44 [2021-02-15T15:46:44.648Z] !MESSAGE CrashingCommitMessageProvider fails on purpose.
10:46:44 [2021-02-15T15:46:44.648Z] !STACK 0
10:46:44 [2021-02-15T15:46:44.648Z] java.lang.IllegalStateException: CrashingCommitMessageProvider fails on purpose.
10:46:44 [2021-02-15T15:46:44.648Z] 	at org.eclipse.egit.ui.internal.dialogs.CommitMessageBuilderTest$CrashingCommitMessageProvider.getMessage(CommitMessageBuilderTest.java:474)
10:46:44 [2021-02-15T15:46:44.648Z] 	at org.eclipse.egit.ui.internal.dialogs.CommitMessageBuilder.build(CommitMessageBuilder.java:90)
10:46:44 [2021-02-15T15:46:44.648Z] 	at org.eclipse.egit.ui.internal.dialogs.CommitMessageBuilderTest.commitMessageProvider_twoProvidersFirstOneCrashing(CommitMessageBuilderTest.java:146)
10:46:44 [2021-02-15T15:46:44.648Z] 	at sun.reflect.NativeMethodAccessorImpl.invoke0(Native Method)
10:46:44 [2021-02-15T15:46:44.648Z] 	at sun.reflect.NativeMethodAccessorImpl.invoke(NativeMethodAccessorImpl.java:62)
10:46:44 [2021-02-15T15:46:44.648Z] 	at sun.reflect.DelegatingMethodAccessorImpl.invoke(DelegatingMethodAccessorImpl.java:43)
10:46:44 [2021-02-15T15:46:44.648Z] 	at java.lang.reflect.Method.invoke(Method.java:498)
10:46:44 [2021-02-15T15:46:44.648Z] 	at org.junit.runners.model.FrameworkMethod$1.runReflectiveCall(FrameworkMethod.java:59)
10:46:44 [2021-02-15T15:46:44.648Z] 	at org.junit.internal.runners.model.ReflectiveCallable.run(ReflectiveCallable.java:12)
10:46:44 [2021-02-15T15:46:44.648Z] 	at org.junit.runners.model.FrameworkMethod.invokeExplosively(FrameworkMethod.java:56)
10:46:44 [2021-02-15T15:46:44.648Z] 	at org.junit.internal.runners.statements.InvokeMethod.evaluate(InvokeMethod.java:17)
10:46:44 [2021-02-15T15:46:44.648Z] 	at org.junit.internal.runners.statements.RunBefores.evaluate(RunBefores.java:26)
10:46:44 [2021-02-15T15:46:44.648Z] 	at org.junit.internal.runners.statements.RunAfters.evaluate(RunAfters.java:27)
10:46:44 [2021-02-15T15:46:44.648Z] 	at org.junit.runners.ParentRunner$3.evaluate(ParentRunner.java:306)
10:46:44 [2021-02-15T15:46:44.648Z] 	at org.junit.runners.BlockJUnit4ClassRunner$1.evaluate(BlockJUnit4ClassRunner.java:100)
10:46:44 [2021-02-15T15:46:44.648Z] 	at org.junit.runners.ParentRunner.runLeaf(ParentRunner.java:366)
10:46:44 [2021-02-15T15:46:44.648Z] 	at org.junit.runners.BlockJUnit4ClassRunner.runChild(BlockJUnit4ClassRunner.java:103)
10:46:44 [2021-02-15T15:46:44.648Z] 	at org.junit.runners.BlockJUnit4ClassRunner.runChild(BlockJUnit4ClassRunner.java:63)
10:46:44 [2021-02-15T15:46:44.648Z] 	at org.junit.runners.ParentRunner$4.run(ParentRunner.java:331)
10:46:44 [2021-02-15T15:46:44.648Z] 	at org.junit.runners.ParentRunner$1.schedule(ParentRunner.java:79)
10:46:44 [2021-02-15T15:46:44.648Z] 	at org.junit.runners.ParentRunner.runChildren(ParentRunner.java:329)
10:46:44 [2021-02-15T15:46:44.648Z] 	at org.junit.runners.ParentRunner.access$100(ParentRunner.java:66)
10:46:44 [2021-02-15T15:46:44.648Z] 	at org.junit.runners.ParentRunner$2.evaluate(ParentRunner.java:293)
10:46:44 [2021-02-15T15:46:44.648Z] 	at org.junit.internal.runners.statements.RunBefores.evaluate(RunBefores.java:26)
10:46:44 [2021-02-15T15:46:44.648Z] 	at org.junit.runners.ParentRunner$3.evaluate(ParentRunner.java:306)
10:46:44 [2021-02-15T15:46:44.648Z] 	at org.junit.runners.ParentRunner.run(ParentRunner.java:413)
10:46:44 [2021-02-15T15:46:44.648Z] 	at org.apache.maven.surefire.junit4.JUnit4Provider.execute(JUnit4Provider.java:365)
10:46:44 [2021-02-15T15:46:44.648Z] 	at org.apache.maven.surefire.junit4.JUnit4Provider.executeWithRerun(JUnit4Provider.java:273)
10:46:44 [2021-02-15T15:46:44.648Z] 	at org.apache.maven.surefire.junit4.JUnit4Provider.executeTestSet(JUnit4Provider.java:238)
10:46:44 [2021-02-15T15:46:44.648Z] 	at org.apache.maven.surefire.junit4.JUnit4Provider.invoke(JUnit4Provider.java:159)
10:46:44 [2021-02-15T15:46:44.648Z] 	at sun.reflect.NativeMethodAccessorImpl.invoke0(Native Method)
10:46:44 [2021-02-15T15:46:44.649Z] 	at sun.reflect.NativeMethodAccessorImpl.invoke(NativeMethodAccessorImpl.java:62)
10:46:44 [2021-02-15T15:46:44.649Z] 	at sun.reflect.DelegatingMethodAccessorImpl.invoke(DelegatingMethodAccessorImpl.java:43)
10:46:44 [2021-02-15T15:46:44.649Z] 	at java.lang.reflect.Method.invoke(Method.java:498)
10:46:44 [2021-02-15T15:46:44.649Z] 	at org.apache.maven.surefire.util.ReflectionUtils.invokeMethodWithArray2(ReflectionUtils.java:206)
10:46:44 [2021-02-15T15:46:44.649Z] 	at org.apache.maven.surefire.booter.ProviderFactory$ProviderProxy.invoke(ProviderFactory.java:161)
10:46:44 [2021-02-15T15:46:44.649Z] 	at org.apache.maven.surefire.booter.ProviderFactory.invokeProvider(ProviderFactory.java:84)
10:46:44 [2021-02-15T15:46:44.649Z] 	at org.eclipse.tycho.surefire.osgibooter.OsgiSurefireBooter.run(OsgiSurefireBooter.java:113)
10:46:44 [2021-02-15T15:46:44.649Z] 	at org.eclipse.tycho.surefire.osgibooter.AbstractUITestApplication.runTests(AbstractUITestApplication.java:44)
10:46:44 [2021-02-15T15:46:44.649Z] 	at org.eclipse.e4.ui.internal.workbench.swt.E4Testable$1.run(E4Testable.java:73)
10:46:44 [2021-02-15T15:46:44.649Z] 	at java.lang.Thread.run(Thread.java:748)
10:46:46 [2021-02-15T15:46:46.019Z] 
10:46:46 [2021-02-15T15:46:46.019Z] !ENTRY org.eclipse.egit.ui 4 0 2021-02-15 15:46:45.801
10:46:46 [2021-02-15T15:46:46.019Z] !MESSAGE CrashingCommitMessageProvider fails on purpose.
10:46:46 [2021-02-15T15:46:46.019Z] !STACK 0
10:46:46 [2021-02-15T15:46:46.019Z] java.lang.IllegalStateException: CrashingCommitMessageProvider fails on purpose.
10:46:46 [2021-02-15T15:46:46.019Z] 	at org.eclipse.egit.ui.internal.dialogs.CommitMessageBuilderTest$CrashingCommitMessageProvider.getMessage(CommitMessageBuilderTest.java:474)
10:46:46 [2021-02-15T15:46:46.019Z] 	at org.eclipse.egit.ui.internal.dialogs.CommitMessageBuilder.build(CommitMessageBuilder.java:90)
10:46:46 [2021-02-15T15:46:46.019Z] 	at org.eclipse.egit.ui.internal.dialogs.CommitMessageBuilderTest.commitMessageProvider_multipleProvidersWithCrashAndNull(CommitMessageBuilderTest.java:165)
10:46:46 [2021-02-15T15:46:46.019Z] 	at sun.reflect.NativeMethodAccessorImpl.invoke0(Native Method)
10:46:46 [2021-02-15T15:46:46.019Z] 	at sun.reflect.NativeMethodAccessorImpl.invoke(NativeMethodAccessorImpl.java:62)
10:46:46 [2021-02-15T15:46:46.019Z] 	at sun.reflect.DelegatingMethodAccessorImpl.invoke(DelegatingMethodAccessorImpl.java:43)
10:46:46 [2021-02-15T15:46:46.019Z] 	at java.lang.reflect.Method.invoke(Method.java:498)
10:46:46 [2021-02-15T15:46:46.020Z] 	at org.junit.runners.model.FrameworkMethod$1.runReflectiveCall(FrameworkMethod.java:59)
10:46:46 [2021-02-15T15:46:46.020Z] 	at org.junit.internal.runners.model.ReflectiveCallable.run(ReflectiveCallable.java:12)
10:46:46 [2021-02-15T15:46:46.020Z] 	at org.junit.runners.model.FrameworkMethod.invokeExplosively(FrameworkMethod.java:56)
10:46:46 [2021-02-15T15:46:46.020Z] 	at org.junit.internal.runners.statements.InvokeMethod.evaluate(InvokeMethod.java:17)
10:46:46 [2021-02-15T15:46:46.020Z] 	at org.junit.internal.runners.statements.RunBefores.evaluate(RunBefores.java:26)
10:46:46 [2021-02-15T15:46:46.020Z] 	at org.junit.internal.runners.statements.RunAfters.evaluate(RunAfters.java:27)
10:46:46 [2021-02-15T15:46:46.020Z] 	at org.junit.runners.ParentRunner$3.evaluate(ParentRunner.java:306)
10:46:46 [2021-02-15T15:46:46.020Z] 	at org.junit.runners.BlockJUnit4ClassRunner$1.evaluate(BlockJUnit4ClassRunner.java:100)
10:46:46 [2021-02-15T15:46:46.020Z] 	at org.junit.runners.ParentRunner.runLeaf(ParentRunner.java:366)
10:46:46 [2021-02-15T15:46:46.020Z] 	at org.junit.runners.BlockJUnit4ClassRunner.runChild(BlockJUnit4ClassRunner.java:103)
10:46:46 [2021-02-15T15:46:46.020Z] 	at org.junit.runners.BlockJUnit4ClassRunner.runChild(BlockJUnit4ClassRunner.java:63)
10:46:46 [2021-02-15T15:46:46.020Z] 	at org.junit.runners.ParentRunner$4.run(ParentRunner.java:331)
10:46:46 [2021-02-15T15:46:46.020Z] 	at org.junit.runners.ParentRunner$1.schedule(ParentRunner.java:79)
10:46:46 [2021-02-15T15:46:46.020Z] 	at org.junit.runners.ParentRunner.runChildren(ParentRunner.java:329)
10:46:46 [2021-02-15T15:46:46.020Z] 	at org.junit.runners.ParentRunner.access$100(ParentRunner.java:66)
10:46:46 [2021-02-15T15:46:46.020Z] 	at org.junit.runners.ParentRunner$2.evaluate(ParentRunner.java:293)
10:46:46 [2021-02-15T15:46:46.020Z] 	at org.junit.internal.runners.statements.RunBefores.evaluate(RunBefores.java:26)
10:46:46 [2021-02-15T15:46:46.020Z] 	at org.junit.runners.ParentRunner$3.evaluate(ParentRunner.java:306)
10:46:46 [2021-02-15T15:46:46.020Z] 	at org.junit.runners.ParentRunner.run(ParentRunner.java:413)
10:46:46 [2021-02-15T15:46:46.020Z] 	at org.apache.maven.surefire.junit4.JUnit4Provider.execute(JUnit4Provider.java:365)
10:46:46 [2021-02-15T15:46:46.020Z] 	at org.apache.maven.surefire.junit4.JUnit4Provider.executeWithRerun(JUnit4Provider.java:273)
10:46:46 [2021-02-15T15:46:46.020Z] 	at org.apache.maven.surefire.junit4.JUnit4Provider.executeTestSet(JUnit4Provider.java:238)
10:46:46 [2021-02-15T15:46:46.020Z] 	at org.apache.maven.surefire.junit4.JUnit4Provider.invoke(JUnit4Provider.java:159)
10:46:46 [2021-02-15T15:46:46.020Z] 	at sun.reflect.NativeMethodAccessorImpl.invoke0(Native Method)
10:46:46 [2021-02-15T15:46:46.020Z] 	at sun.reflect.NativeMethodAccessorImpl.invoke(NativeMethodAccessorImpl.java:62)
10:46:46 [2021-02-15T15:46:46.020Z] 	at sun.reflect.DelegatingMethodAccessorImpl.invoke(DelegatingMethodAccessorImpl.java:43)
10:46:46 [2021-02-15T15:46:46.020Z] 	at java.lang.reflect.Method.invoke(Method.java:498)
10:46:46 [2021-02-15T15:46:46.020Z] 	at org.apache.maven.surefire.util.ReflectionUtils.invokeMethodWithArray2(ReflectionUtils.java:206)
10:46:46 [2021-02-15T15:46:46.020Z] 	at org.apache.maven.surefire.booter.ProviderFactory$ProviderProxy.invoke(ProviderFactory.java:161)
10:46:46 [2021-02-15T15:46:46.020Z] 	at org.apache.maven.surefire.booter.ProviderFactory.invokeProvider(ProviderFactory.java:84)
10:46:46 [2021-02-15T15:46:46.020Z] 	at org.eclipse.tycho.surefire.osgibooter.OsgiSurefireBooter.run(OsgiSurefireBooter.java:113)
10:46:46 [2021-02-15T15:46:46.020Z] 	at org.eclipse.tycho.surefire.osgibooter.AbstractUITestApplication.runTests(AbstractUITestApplication.java:44)
10:46:46 [2021-02-15T15:46:46.020Z] 	at org.eclipse.e4.ui.internal.workbench.swt.E4Testable$1.run(E4Testable.java:73)
10:46:46 [2021-02-15T15:46:46.020Z] 	at java.lang.Thread.run(Thread.java:748)
10:46:46 [2021-02-15T15:46:46.020Z] 
10:46:46 [2021-02-15T15:46:46.020Z] !ENTRY org.eclipse.egit.ui 4 0 2021-02-15 15:46:45.802
10:46:46 [2021-02-15T15:46:46.020Z] !MESSAGE CrashingCommitMessageProvider fails on purpose.
10:46:46 [2021-02-15T15:46:46.020Z] !STACK 0
10:46:46 [2021-02-15T15:46:46.020Z] java.lang.IllegalStateException: CrashingCommitMessageProvider fails on purpose.
10:46:46 [2021-02-15T15:46:46.020Z] 	at org.eclipse.egit.ui.internal.dialogs.CommitMessageBuilderTest$CrashingCommitMessageProvider.getMessage(CommitMessageBuilderTest.java:474)
10:46:46 [2021-02-15T15:46:46.020Z] 	at org.eclipse.egit.ui.internal.dialogs.CommitMessageBuilder.build(CommitMessageBuilder.java:90)
10:46:46 [2021-02-15T15:46:46.020Z] 	at org.eclipse.egit.ui.internal.dialogs.CommitMessageBuilderTest.commitMessageProvider_multipleProvidersWithCrashAndNull(CommitMessageBuilderTest.java:165)
10:46:46 [2021-02-15T15:46:46.020Z] 	at sun.reflect.NativeMethodAccessorImpl.invoke0(Native Method)
10:46:46 [2021-02-15T15:46:46.020Z] 	at sun.reflect.NativeMethodAccessorImpl.invoke(NativeMethodAccessorImpl.java:62)
10:46:46 [2021-02-15T15:46:46.020Z] 	at sun.reflect.DelegatingMethodAccessorImpl.invoke(DelegatingMethodAccessorImpl.java:43)
10:46:46 [2021-02-15T15:46:46.020Z] 	at java.lang.reflect.Method.invoke(Method.java:498)
10:46:46 [2021-02-15T15:46:46.020Z] 	at org.junit.runners.model.FrameworkMethod$1.runReflectiveCall(FrameworkMethod.java:59)
10:46:46 [2021-02-15T15:46:46.020Z] 	at org.junit.internal.runners.model.ReflectiveCallable.run(ReflectiveCallable.java:12)
10:46:46 [2021-02-15T15:46:46.020Z] 	at org.junit.runners.model.FrameworkMethod.invokeExplosively(FrameworkMethod.java:56)
10:46:46 [2021-02-15T15:46:46.020Z] 	at org.junit.internal.runners.statements.InvokeMethod.evaluate(InvokeMethod.java:17)
10:46:46 [2021-02-15T15:46:46.020Z] 	at org.junit.internal.runners.statements.RunBefores.evaluate(RunBefores.java:26)
10:46:46 [2021-02-15T15:46:46.020Z] 	at org.junit.internal.runners.statements.RunAfters.evaluate(RunAfters.java:27)
10:46:46 [2021-02-15T15:46:46.020Z] 	at org.junit.runners.ParentRunner$3.evaluate(ParentRunner.java:306)
10:46:46 [2021-02-15T15:46:46.020Z] 	at org.junit.runners.BlockJUnit4ClassRunner$1.evaluate(BlockJUnit4ClassRunner.java:100)
10:46:46 [2021-02-15T15:46:46.020Z] 	at org.junit.runners.ParentRunner.runLeaf(ParentRunner.java:366)
10:46:46 [2021-02-15T15:46:46.020Z] 	at org.junit.runners.BlockJUnit4ClassRunner.runChild(BlockJUnit4ClassRunner.java:103)
10:46:46 [2021-02-15T15:46:46.020Z] 	at org.junit.runners.BlockJUnit4ClassRunner.runChild(BlockJUnit4ClassRunner.java:63)
10:46:46 [2021-02-15T15:46:46.020Z] 	at org.junit.runners.ParentRunner$4.run(ParentRunner.java:331)
10:46:46 [2021-02-15T15:46:46.020Z] 	at org.junit.runners.ParentRunner$1.schedule(ParentRunner.java:79)
10:46:46 [2021-02-15T15:46:46.020Z] 	at org.junit.runners.ParentRunner.runChildren(ParentRunner.java:329)
10:46:46 [2021-02-15T15:46:46.020Z] 	at org.junit.runners.ParentRunner.access$100(ParentRunner.java:66)
10:46:46 [2021-02-15T15:46:46.020Z] 	at org.junit.runners.ParentRunner$2.evaluate(ParentRunner.java:293)
10:46:46 [2021-02-15T15:46:46.020Z] 	at org.junit.internal.runners.statements.RunBefores.evaluate(RunBefores.java:26)
10:46:46 [2021-02-15T15:46:46.020Z] 	at org.junit.runners.ParentRunner$3.evaluate(ParentRunner.java:306)
10:46:46 [2021-02-15T15:46:46.020Z] 	at org.junit.runners.ParentRunner.run(ParentRunner.java:413)
10:46:46 [2021-02-15T15:46:46.020Z] 	at org.apache.maven.surefire.junit4.JUnit4Provider.execute(JUnit4Provider.java:365)
10:46:46 [2021-02-15T15:46:46.020Z] 	at org.apache.maven.surefire.junit4.JUnit4Provider.executeWithRerun(JUnit4Provider.java:273)
10:46:46 [2021-02-15T15:46:46.020Z] 	at org.apache.maven.surefire.junit4.JUnit4Provider.executeTestSet(JUnit4Provider.java:238)
10:46:46 [2021-02-15T15:46:46.020Z] 	at org.apache.maven.surefire.junit4.JUnit4Provider.invoke(JUnit4Provider.java:159)
10:46:46 [2021-02-15T15:46:46.020Z] 	at sun.reflect.NativeMethodAccessorImpl.invoke0(Native Method)
10:46:46 [2021-02-15T15:46:46.020Z] 	at sun.reflect.NativeMethodAccessorImpl.invoke(NativeMethodAccessorImpl.java:62)
10:46:46 [2021-02-15T15:46:46.020Z] 	at sun.reflect.DelegatingMethodAccessorImpl.invoke(DelegatingMethodAccessorImpl.java:43)
10:46:46 [2021-02-15T15:46:46.020Z] 	at java.lang.reflect.Method.invoke(Method.java:498)
10:46:46 [2021-02-15T15:46:46.020Z] 	at org.apache.maven.surefire.util.ReflectionUtils.invokeMethodWithArray2(ReflectionUtils.java:206)
10:46:46 [2021-02-15T15:46:46.020Z] 	at org.apache.maven.surefire.booter.ProviderFactory$ProviderProxy.invoke(ProviderFactory.java:161)
10:46:46 [2021-02-15T15:46:46.020Z] 	at org.apache.maven.surefire.booter.ProviderFactory.invokeProvider(ProviderFactory.java:84)
10:46:46 [2021-02-15T15:46:46.020Z] 	at org.eclipse.tycho.surefire.osgibooter.OsgiSurefireBooter.run(OsgiSurefireBooter.java:113)
10:46:46 [2021-02-15T15:46:46.021Z] 	at org.eclipse.tycho.surefire.osgibooter.AbstractUITestApplication.runTests(AbstractUITestApplication.java:44)
10:46:46 [2021-02-15T15:46:46.021Z] 	at org.eclipse.e4.ui.internal.workbench.swt.E4Testable$1.run(E4Testable.java:73)
10:46:46 [2021-02-15T15:46:46.021Z] 	at java.lang.Thread.run(Thread.java:748)
10:46:46 [2021-02-15T15:46:46.021Z] 
10:46:46 [2021-02-15T15:46:46.021Z] !ENTRY org.eclipse.egit.ui 2 0 2021-02-15 15:46:45.928
10:46:46 [2021-02-15T15:46:46.021Z] !MESSAGE The ICommitMessageProvider2 implementation org.eclipse.egit.ui.internal.dialogs.CommitMessageBuilderTest$3 provided the caret position -42, which exceeds the length of the commit message or is negative. The caret position is ignored.
10:46:47 [2021-02-15T15:46:47.917Z] 
10:46:47 [2021-02-15T15:46:47.917Z] !ENTRY org.eclipse.egit.ui 2 0 2021-02-15 15:46:47.477
10:46:47 [2021-02-15T15:46:47.917Z] !MESSAGE Found multiple implementations of ICommitMessageProvider2. Ignoring caret positioning for org.eclipse.egit.ui.internal.dialogs.CommitMessageBuilderTest$3.
10:46:49 [2021-02-15T15:46:49.288Z] 
10:46:49 [2021-02-15T15:46:49.288Z] !ENTRY org.eclipse.egit.ui 4 0 2021-02-15 15:46:48.991
10:46:49 [2021-02-15T15:46:49.288Z] !MESSAGE CrashingCommitMessageProvider fails on purpose.
10:46:49 [2021-02-15T15:46:49.288Z] !STACK 0
10:46:49 [2021-02-15T15:46:49.288Z] java.lang.IllegalStateException: CrashingCommitMessageProvider fails on purpose.
10:46:49 [2021-02-15T15:46:49.288Z] 	at org.eclipse.egit.ui.internal.dialogs.CommitMessageBuilderTest$CrashingCommitMessageProvider.getMessage(CommitMessageBuilderTest.java:474)
10:46:49 [2021-02-15T15:46:49.288Z] 	at org.eclipse.egit.ui.internal.dialogs.CommitMessageBuilder.build(CommitMessageBuilder.java:90)
10:46:49 [2021-02-15T15:46:49.288Z] 	at org.eclipse.egit.ui.internal.dialogs.CommitMessageBuilderTest.commitMessageProvider_twoProvidersSecondOneCrashing(CommitMessageBuilderTest.java:130)
10:46:49 [2021-02-15T15:46:49.288Z] 	at sun.reflect.NativeMethodAccessorImpl.invoke0(Native Method)
10:46:49 [2021-02-15T15:46:49.288Z] 	at sun.reflect.NativeMethodAccessorImpl.invoke(NativeMethodAccessorImpl.java:62)
10:46:49 [2021-02-15T15:46:49.288Z] 	at sun.reflect.DelegatingMethodAccessorImpl.invoke(DelegatingMethodAccessorImpl.java:43)
10:46:49 [2021-02-15T15:46:49.288Z] 	at java.lang.reflect.Method.invoke(Method.java:498)
10:46:49 [2021-02-15T15:46:49.288Z] 	at org.junit.runners.model.FrameworkMethod$1.runReflectiveCall(FrameworkMethod.java:59)
10:46:49 [2021-02-15T15:46:49.288Z] 	at org.junit.internal.runners.model.ReflectiveCallable.run(ReflectiveCallable.java:12)
10:46:49 [2021-02-15T15:46:49.288Z] 	at org.junit.runners.model.FrameworkMethod.invokeExplosively(FrameworkMethod.java:56)
10:46:49 [2021-02-15T15:46:49.288Z] 	at org.junit.internal.runners.statements.InvokeMethod.evaluate(InvokeMethod.java:17)
10:46:49 [2021-02-15T15:46:49.288Z] 	at org.junit.internal.runners.statements.RunBefores.evaluate(RunBefores.java:26)
10:46:49 [2021-02-15T15:46:49.288Z] 	at org.junit.internal.runners.statements.RunAfters.evaluate(RunAfters.java:27)
10:46:49 [2021-02-15T15:46:49.288Z] 	at org.junit.runners.ParentRunner$3.evaluate(ParentRunner.java:306)
10:46:49 [2021-02-15T15:46:49.288Z] 	at org.junit.runners.BlockJUnit4ClassRunner$1.evaluate(BlockJUnit4ClassRunner.java:100)
10:46:49 [2021-02-15T15:46:49.288Z] 	at org.junit.runners.ParentRunner.runLeaf(ParentRunner.java:366)
10:46:49 [2021-02-15T15:46:49.288Z] 	at org.junit.runners.BlockJUnit4ClassRunner.runChild(BlockJUnit4ClassRunner.java:103)
10:46:49 [2021-02-15T15:46:49.288Z] 	at org.junit.runners.BlockJUnit4ClassRunner.runChild(BlockJUnit4ClassRunner.java:63)
10:46:49 [2021-02-15T15:46:49.288Z] 	at org.junit.runners.ParentRunner$4.run(ParentRunner.java:331)
10:46:49 [2021-02-15T15:46:49.288Z] 	at org.junit.runners.ParentRunner$1.schedule(ParentRunner.java:79)
10:46:49 [2021-02-15T15:46:49.288Z] 	at org.junit.runners.ParentRunner.runChildren(ParentRunner.java:329)
10:46:49 [2021-02-15T15:46:49.288Z] 	at org.junit.runners.ParentRunner.access$100(ParentRunner.java:66)
10:46:49 [2021-02-15T15:46:49.288Z] 	at org.junit.runners.ParentRunner$2.evaluate(ParentRunner.java:293)
10:46:49 [2021-02-15T15:46:49.288Z] 	at org.junit.internal.runners.statements.RunBefores.evaluate(RunBefores.java:26)
10:46:49 [2021-02-15T15:46:49.288Z] 	at org.junit.runners.ParentRunner$3.evaluate(ParentRunner.java:306)
10:46:49 [2021-02-15T15:46:49.288Z] 	at org.junit.runners.ParentRunner.run(ParentRunner.java:413)
10:46:49 [2021-02-15T15:46:49.288Z] 	at org.apache.maven.surefire.junit4.JUnit4Provider.execute(JUnit4Provider.java:365)
10:46:49 [2021-02-15T15:46:49.288Z] 	at org.apache.maven.surefire.junit4.JUnit4Provider.executeWithRerun(JUnit4Provider.java:273)
10:46:49 [2021-02-15T15:46:49.288Z] 	at org.apache.maven.surefire.junit4.JUnit4Provider.executeTestSet(JUnit4Provider.java:238)
10:46:49 [2021-02-15T15:46:49.288Z] 	at org.apache.maven.surefire.junit4.JUnit4Provider.invoke(JUnit4Provider.java:159)
10:46:49 [2021-02-15T15:46:49.288Z] 	at sun.reflect.NativeMethodAccessorImpl.invoke0(Native Method)
10:46:49 [2021-02-15T15:46:49.288Z] 	at sun.reflect.NativeMethodAccessorImpl.invoke(NativeMethodAccessorImpl.java:62)
10:46:49 [2021-02-15T15:46:49.288Z] 	at sun.reflect.DelegatingMethodAccessorImpl.invoke(DelegatingMethodAccessorImpl.java:43)
10:46:49 [2021-02-15T15:46:49.288Z] 	at java.lang.reflect.Method.invoke(Method.java:498)
10:46:49 [2021-02-15T15:46:49.288Z] 	at org.apache.maven.surefire.util.ReflectionUtils.invokeMethodWithArray2(ReflectionUtils.java:206)
10:46:49 [2021-02-15T15:46:49.288Z] 	at org.apache.maven.surefire.booter.ProviderFactory$ProviderProxy.invoke(ProviderFactory.java:161)
10:46:49 [2021-02-15T15:46:49.288Z] 	at org.apache.maven.surefire.booter.ProviderFactory.invokeProvider(ProviderFactory.java:84)
10:46:49 [2021-02-15T15:46:49.288Z] 	at org.eclipse.tycho.surefire.osgibooter.OsgiSurefireBooter.run(OsgiSurefireBooter.java:113)
10:46:49 [2021-02-15T15:46:49.288Z] 	at org.eclipse.tycho.surefire.osgibooter.AbstractUITestApplication.runTests(AbstractUITestApplication.java:44)
10:46:49 [2021-02-15T15:46:49.288Z] 	at org.eclipse.e4.ui.internal.workbench.swt.E4Testable$1.run(E4Testable.java:73)
10:46:49 [2021-02-15T15:46:49.289Z] 	at java.lang.Thread.run(Thread.java:748)
10:46:49 [2021-02-15T15:46:49.289Z] 
10:46:49 [2021-02-15T15:46:49.289Z] !ENTRY org.eclipse.egit.ui 4 0 2021-02-15 15:46:49.087
10:46:49 [2021-02-15T15:46:49.289Z] !MESSAGE CrashingCommitMessageProvider fails on purpose.
10:46:49 [2021-02-15T15:46:49.289Z] !STACK 0
10:46:49 [2021-02-15T15:46:49.289Z] java.lang.IllegalStateException: CrashingCommitMessageProvider fails on purpose.
10:46:49 [2021-02-15T15:46:49.289Z] 	at org.eclipse.egit.ui.internal.dialogs.CommitMessageBuilderTest$CrashingCommitMessageProvider.getMessage(CommitMessageBuilderTest.java:474)
10:46:49 [2021-02-15T15:46:49.289Z] 	at org.eclipse.egit.ui.internal.dialogs.CommitMessageBuilder.build(CommitMessageBuilder.java:90)
10:46:49 [2021-02-15T15:46:49.289Z] 	at org.eclipse.egit.ui.internal.dialogs.CommitMessageBuilderTest.commitMessageProvider_multipleProvidersWithCrashingAndNullAndOneCaretPositioning(CommitMessageBuilderTest.java:414)
10:46:49 [2021-02-15T15:46:49.289Z] 	at sun.reflect.NativeMethodAccessorImpl.invoke0(Native Method)
10:46:49 [2021-02-15T15:46:49.289Z] 	at sun.reflect.NativeMethodAccessorImpl.invoke(NativeMethodAccessorImpl.java:62)
10:46:49 [2021-02-15T15:46:49.289Z] 	at sun.reflect.DelegatingMethodAccessorImpl.invoke(DelegatingMethodAccessorImpl.java:43)
10:46:49 [2021-02-15T15:46:49.289Z] 	at java.lang.reflect.Method.invoke(Method.java:498)
10:46:49 [2021-02-15T15:46:49.289Z] 	at org.junit.runners.model.FrameworkMethod$1.runReflectiveCall(FrameworkMethod.java:59)
10:46:49 [2021-02-15T15:46:49.289Z] 	at org.junit.internal.runners.model.ReflectiveCallable.run(ReflectiveCallable.java:12)
10:46:49 [2021-02-15T15:46:49.289Z] 	at org.junit.runners.model.FrameworkMethod.invokeExplosively(FrameworkMethod.java:56)
10:46:49 [2021-02-15T15:46:49.289Z] 	at org.junit.internal.runners.statements.InvokeMethod.evaluate(InvokeMethod.java:17)
10:46:49 [2021-02-15T15:46:49.289Z] 	at org.junit.internal.runners.statements.RunBefores.evaluate(RunBefores.java:26)
10:46:49 [2021-02-15T15:46:49.289Z] 	at org.junit.internal.runners.statements.RunAfters.evaluate(RunAfters.java:27)
10:46:49 [2021-02-15T15:46:49.289Z] 	at org.junit.runners.ParentRunner$3.evaluate(ParentRunner.java:306)
10:46:49 [2021-02-15T15:46:49.289Z] 	at org.junit.runners.BlockJUnit4ClassRunner$1.evaluate(BlockJUnit4ClassRunner.java:100)
10:46:49 [2021-02-15T15:46:49.289Z] 	at org.junit.runners.ParentRunner.runLeaf(ParentRunner.java:366)
10:46:49 [2021-02-15T15:46:49.289Z] 	at org.junit.runners.BlockJUnit4ClassRunner.runChild(BlockJUnit4ClassRunner.java:103)
10:46:49 [2021-02-15T15:46:49.289Z] 	at org.junit.runners.BlockJUnit4ClassRunner.runChild(BlockJUnit4ClassRunner.java:63)
10:46:49 [2021-02-15T15:46:49.289Z] 	at org.junit.runners.ParentRunner$4.run(ParentRunner.java:331)
10:46:49 [2021-02-15T15:46:49.289Z] 	at org.junit.runners.ParentRunner$1.schedule(ParentRunner.java:79)
10:46:49 [2021-02-15T15:46:49.289Z] 	at org.junit.runners.ParentRunner.runChildren(ParentRunner.java:329)
10:46:49 [2021-02-15T15:46:49.289Z] 	at org.junit.runners.ParentRunner.access$100(ParentRunner.java:66)
10:46:49 [2021-02-15T15:46:49.289Z] 	at org.junit.runners.ParentRunner$2.evaluate(ParentRunner.java:293)
10:46:49 [2021-02-15T15:46:49.289Z] 	at org.junit.internal.runners.statements.RunBefores.evaluate(RunBefores.java:26)
10:46:49 [2021-02-15T15:46:49.289Z] 	at org.junit.runners.ParentRunner$3.evaluate(ParentRunner.java:306)
10:46:49 [2021-02-15T15:46:49.289Z] 	at org.junit.runners.ParentRunner.run(ParentRunner.java:413)
10:46:49 [2021-02-15T15:46:49.289Z] 	at org.apache.maven.surefire.junit4.JUnit4Provider.execute(JUnit4Provider.java:365)
10:46:49 [2021-02-15T15:46:49.289Z] 	at org.apache.maven.surefire.junit4.JUnit4Provider.executeWithRerun(JUnit4Provider.java:273)
10:46:49 [2021-02-15T15:46:49.289Z] 	at org.apache.maven.surefire.junit4.JUnit4Provider.executeTestSet(JUnit4Provider.java:238)
10:46:49 [2021-02-15T15:46:49.289Z] 	at org.apache.maven.surefire.junit4.JUnit4Provider.invoke(JUnit4Provider.java:159)
10:46:49 [2021-02-15T15:46:49.289Z] 	at sun.reflect.NativeMethodAccessorImpl.invoke0(Native Method)
10:46:49 [2021-02-15T15:46:49.289Z] 	at sun.reflect.NativeMethodAccessorImpl.invoke(NativeMethodAccessorImpl.java:62)
10:46:49 [2021-02-15T15:46:49.289Z] 	at sun.reflect.DelegatingMethodAccessorImpl.invoke(DelegatingMethodAccessorImpl.java:43)
10:46:49 [2021-02-15T15:46:49.289Z] 	at java.lang.reflect.Method.invoke(Method.java:498)
10:46:49 [2021-02-15T15:46:49.289Z] 	at org.apache.maven.surefire.util.ReflectionUtils.invokeMethodWithArray2(ReflectionUtils.java:206)
10:46:49 [2021-02-15T15:46:49.289Z] 	at org.apache.maven.surefire.booter.ProviderFactory$ProviderProxy.invoke(ProviderFactory.java:161)
10:46:49 [2021-02-15T15:46:49.289Z] 	at org.apache.maven.surefire.booter.ProviderFactory.invokeProvider(ProviderFactory.java:84)
10:46:49 [2021-02-15T15:46:49.289Z] 	at org.eclipse.tycho.surefire.osgibooter.OsgiSurefireBooter.run(OsgiSurefireBooter.java:113)
10:46:49 [2021-02-15T15:46:49.289Z] 	at org.eclipse.tycho.surefire.osgibooter.AbstractUITestApplication.runTests(AbstractUITestApplication.java:44)
10:46:49 [2021-02-15T15:46:49.289Z] 	at org.eclipse.e4.ui.internal.workbench.swt.E4Testable$1.run(E4Testable.java:73)
10:46:49 [2021-02-15T15:46:49.289Z] 	at java.lang.Thread.run(Thread.java:748)
10:46:49 [2021-02-15T15:46:49.289Z] 
10:46:49 [2021-02-15T15:46:49.289Z] !ENTRY org.eclipse.egit.ui 4 0 2021-02-15 15:46:49.088
10:46:49 [2021-02-15T15:46:49.289Z] !MESSAGE CrashingCommitMessageProvider fails on purpose.
10:46:49 [2021-02-15T15:46:49.289Z] !STACK 0
10:46:49 [2021-02-15T15:46:49.289Z] java.lang.IllegalStateException: CrashingCommitMessageProvider fails on purpose.
10:46:49 [2021-02-15T15:46:49.289Z] 	at org.eclipse.egit.ui.internal.dialogs.CommitMessageBuilderTest$CrashingCommitMessageProvider.getMessage(CommitMessageBuilderTest.java:474)
10:46:49 [2021-02-15T15:46:49.289Z] 	at org.eclipse.egit.ui.internal.dialogs.CommitMessageBuilder.build(CommitMessageBuilder.java:90)
10:46:49 [2021-02-15T15:46:49.289Z] 	at org.eclipse.egit.ui.internal.dialogs.CommitMessageBuilderTest.commitMessageProvider_multipleProvidersWithCrashingAndNullAndOneCaretPositioning(CommitMessageBuilderTest.java:414)
10:46:49 [2021-02-15T15:46:49.289Z] 	at sun.reflect.NativeMethodAccessorImpl.invoke0(Native Method)
10:46:49 [2021-02-15T15:46:49.289Z] 	at sun.reflect.NativeMethodAccessorImpl.invoke(NativeMethodAccessorImpl.java:62)
10:46:49 [2021-02-15T15:46:49.289Z] 	at sun.reflect.DelegatingMethodAccessorImpl.invoke(DelegatingMethodAccessorImpl.java:43)
10:46:49 [2021-02-15T15:46:49.289Z] 	at java.lang.reflect.Method.invoke(Method.java:498)
10:46:49 [2021-02-15T15:46:49.289Z] 	at org.junit.runners.model.FrameworkMethod$1.runReflectiveCall(FrameworkMethod.java:59)
10:46:49 [2021-02-15T15:46:49.289Z] 	at org.junit.internal.runners.model.ReflectiveCallable.run(ReflectiveCallable.java:12)
10:46:49 [2021-02-15T15:46:49.289Z] 	at org.junit.runners.model.FrameworkMethod.invokeExplosively(FrameworkMethod.java:56)
10:46:49 [2021-02-15T15:46:49.289Z] 	at org.junit.internal.runners.statements.InvokeMethod.evaluate(InvokeMethod.java:17)
10:46:49 [2021-02-15T15:46:49.289Z] 	at org.junit.internal.runners.statements.RunBefores.evaluate(RunBefores.java:26)
10:46:49 [2021-02-15T15:46:49.289Z] 	at org.junit.internal.runners.statements.RunAfters.evaluate(RunAfters.java:27)
10:46:49 [2021-02-15T15:46:49.289Z] 	at org.junit.runners.ParentRunner$3.evaluate(ParentRunner.java:306)
10:46:49 [2021-02-15T15:46:49.289Z] 	at org.junit.runners.BlockJUnit4ClassRunner$1.evaluate(BlockJUnit4ClassRunner.java:100)
10:46:49 [2021-02-15T15:46:49.289Z] 	at org.junit.runners.ParentRunner.runLeaf(ParentRunner.java:366)
10:46:49 [2021-02-15T15:46:49.289Z] 	at org.junit.runners.BlockJUnit4ClassRunner.runChild(BlockJUnit4ClassRunner.java:103)
10:46:49 [2021-02-15T15:46:49.289Z] 	at org.junit.runners.BlockJUnit4ClassRunner.runChild(BlockJUnit4ClassRunner.java:63)
10:46:49 [2021-02-15T15:46:49.289Z] 	at org.junit.runners.ParentRunner$4.run(ParentRunner.java:331)
10:46:49 [2021-02-15T15:46:49.289Z] 	at org.junit.runners.ParentRunner$1.schedule(ParentRunner.java:79)
10:46:49 [2021-02-15T15:46:49.289Z] 	at org.junit.runners.ParentRunner.runChildren(ParentRunner.java:329)
10:46:49 [2021-02-15T15:46:49.289Z] 	at org.junit.runners.ParentRunner.access$100(ParentRunner.java:66)
10:46:49 [2021-02-15T15:46:49.289Z] 	at org.junit.runners.ParentRunner$2.evaluate(ParentRunner.java:293)
10:46:49 [2021-02-15T15:46:49.289Z] 	at org.junit.internal.runners.statements.RunBefores.evaluate(RunBefores.java:26)
10:46:49 [2021-02-15T15:46:49.289Z] 	at org.junit.runners.ParentRunner$3.evaluate(ParentRunner.java:306)
10:46:49 [2021-02-15T15:46:49.289Z] 	at org.junit.runners.ParentRunner.run(ParentRunner.java:413)
10:46:49 [2021-02-15T15:46:49.289Z] 	at org.apache.maven.surefire.junit4.JUnit4Provider.execute(JUnit4Provider.java:365)
10:46:49 [2021-02-15T15:46:49.289Z] 	at org.apache.maven.surefire.junit4.JUnit4Provider.executeWithRerun(JUnit4Provider.java:273)
10:46:49 [2021-02-15T15:46:49.289Z] 	at org.apache.maven.surefire.junit4.JUnit4Provider.executeTestSet(JUnit4Provider.java:238)
10:46:49 [2021-02-15T15:46:49.289Z] 	at org.apache.maven.surefire.junit4.JUnit4Provider.invoke(JUnit4Provider.java:159)
10:46:49 [2021-02-15T15:46:49.289Z] 	at sun.reflect.NativeMethodAccessorImpl.invoke0(Native Method)
10:46:49 [2021-02-15T15:46:49.289Z] 	at sun.reflect.NativeMethodAccessorImpl.invoke(NativeMethodAccessorImpl.java:62)
10:46:49 [2021-02-15T15:46:49.289Z] 	at sun.reflect.DelegatingMethodAccessorImpl.invoke(DelegatingMethodAccessorImpl.java:43)
10:46:49 [2021-02-15T15:46:49.289Z] 	at java.lang.reflect.Method.invoke(Method.java:498)
10:46:49 [2021-02-15T15:46:49.289Z] 	at org.apache.maven.surefire.util.ReflectionUtils.invokeMethodWithArray2(ReflectionUtils.java:206)
10:46:49 [2021-02-15T15:46:49.289Z] 	at org.apache.maven.surefire.booter.ProviderFactory$ProviderProxy.invoke(ProviderFactory.java:161)
10:46:49 [2021-02-15T15:46:49.290Z] 	at org.apache.maven.surefire.booter.ProviderFactory.invokeProvider(ProviderFactory.java:84)
10:46:49 [2021-02-15T15:46:49.290Z] 	at org.eclipse.tycho.surefire.osgibooter.OsgiSurefireBooter.run(OsgiSurefireBooter.java:113)
10:46:49 [2021-02-15T15:46:49.290Z] 	at org.eclipse.tycho.surefire.osgibooter.AbstractUITestApplication.runTests(AbstractUITestApplication.java:44)
10:46:49 [2021-02-15T15:46:49.290Z] 	at org.eclipse.e4.ui.internal.workbench.swt.E4Testable$1.run(E4Testable.java:73)
10:46:49 [2021-02-15T15:46:49.290Z] 	at java.lang.Thread.run(Thread.java:748)
10:46:49 [2021-02-15T15:46:49.290Z] 
10:46:49 [2021-02-15T15:46:49.290Z] !ENTRY org.eclipse.egit.ui 2 0 2021-02-15 15:46:49.210
10:46:49 [2021-02-15T15:46:49.290Z] !MESSAGE Found multiple implementations of ICommitMessageProvider2. Ignoring caret positioning for org.eclipse.egit.ui.internal.dialogs.CommitMessageBuilderTest$3.
10:46:49 [2021-02-15T15:46:49.546Z] 
10:46:49 [2021-02-15T15:46:49.546Z] !ENTRY org.eclipse.egit.ui 2 0 2021-02-15 15:46:49.326
10:46:49 [2021-02-15T15:46:49.546Z] !MESSAGE The ICommitMessageProvider2 implementation org.eclipse.egit.ui.internal.dialogs.CommitMessageBuilderTest$3 provided the caret position 14, which exceeds the length of the commit message or is negative. The caret position is ignored.
10:46:49 [2021-02-15T15:46:49.546Z] Tests run: 20, Failures: 0, Errors: 0, Skipped: 0, Time elapsed: 6.382 s - in org.eclipse.egit.ui.internal.dialogs.CommitMessageBuilderTest
10:46:49 [2021-02-15T15:46:49.546Z] commitMessageProvider_oneCrashingProvider(org.eclipse.egit.ui.internal.dialogs.CommitMessageBuilderTest)  Time elapsed: 0.126 s
10:46:49 [2021-02-15T15:46:49.546Z] commitMessageProvider_twoProvidersSecondWithCaretPositioning(org.eclipse.egit.ui.internal.dialogs.CommitMessageBuilderTest)  Time elapsed: 0.12 s
10:46:49 [2021-02-15T15:46:49.546Z] commitMessageProvider_oneCrashingProviderWithCaretPosition(org.eclipse.egit.ui.internal.dialogs.CommitMessageBuilderTest)  Time elapsed: 1.076 s
10:46:49 [2021-02-15T15:46:49.546Z] commitMessageProvider_twoProvidersFirstOneCrashing(org.eclipse.egit.ui.internal.dialogs.CommitMessageBuilderTest)  Time elapsed: 0.182 s
10:46:49 [2021-02-15T15:46:49.546Z] commitMessageProvider_noProvider(org.eclipse.egit.ui.internal.dialogs.CommitMessageBuilderTest)  Time elapsed: 0.107 s
10:46:49 [2021-02-15T15:46:49.546Z] commitMessageProvider_oneProvider(org.eclipse.egit.ui.internal.dialogs.CommitMessageBuilderTest)  Time elapsed: 0.098 s
10:46:49 [2021-02-15T15:46:49.546Z] commitMessageProvider_multipleProvidersWithCrashAndNull(org.eclipse.egit.ui.internal.dialogs.CommitMessageBuilderTest)  Time elapsed: 1.153 s
10:46:49 [2021-02-15T15:46:49.546Z] commitMessageProvider_oneProviderWithInvalidNegativeCaretPosition(org.eclipse.egit.ui.internal.dialogs.CommitMessageBuilderTest)  Time elapsed: 0.116 s
10:46:49 [2021-02-15T15:46:49.546Z] commitMessageProvider_twoProvidersSecondWithUndefinedCaretPosition(org.eclipse.egit.ui.internal.dialogs.CommitMessageBuilderTest)  Time elapsed: 0.095 s
10:46:49 [2021-02-15T15:46:49.546Z] commitMessageProvider_twoProvidersWithCaretPositioningFirstWithUndefinedCaretPosition(org.eclipse.egit.ui.internal.dialogs.CommitMessageBuilderTest)  Time elapsed: 0.103 s
10:46:49 [2021-02-15T15:46:49.546Z] commitMessageProvider_oneProviderWithCaretPositionEqualsMessageLength(org.eclipse.egit.ui.internal.dialogs.CommitMessageBuilderTest)  Time elapsed: 0.108 s
10:46:49 [2021-02-15T15:46:49.546Z] commitMessageProvider_twoProvidersFirstWithCaretPositioning(org.eclipse.egit.ui.internal.dialogs.CommitMessageBuilderTest)  Time elapsed: 1.112 s
10:46:49 [2021-02-15T15:46:49.547Z] commitMessageProvider_twoProvidersWithCaretPositioningSecondWithUndefinedCaretPosition(org.eclipse.egit.ui.internal.dialogs.CommitMessageBuilderTest)  Time elapsed: 0.129 s
10:46:49 [2021-02-15T15:46:49.547Z] commitMessageProvider_oneProviderWithCaretPositioning(org.eclipse.egit.ui.internal.dialogs.CommitMessageBuilderTest)  Time elapsed: 0.1 s
10:46:49 [2021-02-15T15:46:49.547Z] commitMessageProvider_twoProvidersSecondWithCaretPositionZero(org.eclipse.egit.ui.internal.dialogs.CommitMessageBuilderTest)  Time elapsed: 0.087 s
10:46:49 [2021-02-15T15:46:49.547Z] commitMessageProvider_twoProviders(org.eclipse.egit.ui.internal.dialogs.CommitMessageBuilderTest)  Time elapsed: 1.219 s
10:46:49 [2021-02-15T15:46:49.547Z] commitMessageProvider_twoProvidersSecondOneCrashing(org.eclipse.egit.ui.internal.dialogs.CommitMessageBuilderTest)  Time elapsed: 0.108 s
10:46:49 [2021-02-15T15:46:49.547Z] commitMessageProvider_multipleProvidersWithCrashingAndNullAndOneCaretPositioning(org.eclipse.egit.ui.internal.dialogs.CommitMessageBuilderTest)  Time elapsed: 0.098 s
10:46:49 [2021-02-15T15:46:49.547Z] commitMessageProvider_twoProvidersWithCaretPositioning(org.eclipse.egit.ui.internal.dialogs.CommitMessageBuilderTest)  Time elapsed: 0.121 s
10:46:49 [2021-02-15T15:46:49.547Z] commitMessageProvider_oneProviderWithInvalidCaretPositionExceedingMessageLength(org.eclipse.egit.ui.internal.dialogs.CommitMessageBuilderTest)  Time elapsed: 0.121 s
10:46:49 [2021-02-15T15:46:49.547Z] Running org.eclipse.egit.ui.internal.dialogs.SpellcheckableMessageAreaTest
10:46:49 [2021-02-15T15:46:49.547Z] Tests run: 25, Failures: 0, Errors: 0, Skipped: 0, Time elapsed: 0.003 s - in org.eclipse.egit.ui.internal.dialogs.SpellcheckableMessageAreaTest
10:46:49 [2021-02-15T15:46:49.547Z] testWrappingLongWords(org.eclipse.egit.ui.internal.dialogs.SpellcheckableMessageAreaTest)  Time elapsed: 0.001 s
10:46:49 [2021-02-15T15:46:49.547Z] wrapOnlyCommitMessageBody(org.eclipse.egit.ui.internal.dialogs.SpellcheckableMessageAreaTest)  Time elapsed: 0 s
10:46:49 [2021-02-15T15:46:49.547Z] dontWrapMaximumLengthText(org.eclipse.egit.ui.internal.dialogs.SpellcheckableMessageAreaTest)  Time elapsed: 0 s
10:46:49 [2021-02-15T15:46:49.547Z] keepTrailingSpace(org.eclipse.egit.ui.internal.dialogs.SpellcheckableMessageAreaTest)  Time elapsed: 0 s
10:46:49 [2021-02-15T15:46:49.547Z] dontWrapShortMessage(org.eclipse.egit.ui.internal.dialogs.SpellcheckableMessageAreaTest)  Time elapsed: 0 s
10:46:49 [2021-02-15T15:46:49.547Z] lineAfterWrappedWordShouldNotBeJoined(org.eclipse.egit.ui.internal.dialogs.SpellcheckableMessageAreaTest)  Time elapsed: 0 s
10:46:49 [2021-02-15T15:46:49.547Z] lineAfterWrappedWordShouldNotBeJoined2(org.eclipse.egit.ui.internal.dialogs.SpellcheckableMessageAreaTest)  Time elapsed: 0 s
10:46:49 [2021-02-15T15:46:49.547Z] lineAfterWrappedWordShouldNotBeJoined3(org.eclipse.egit.ui.internal.dialogs.SpellcheckableMessageAreaTest)  Time elapsed: 0 s
10:46:49 [2021-02-15T15:46:49.547Z] dontWrapWordLongerThanOneLine(org.eclipse.egit.ui.internal.dialogs.SpellcheckableMessageAreaTest)  Time elapsed: 0 s
10:46:49 [2021-02-15T15:46:49.547Z] keepExistingNewlines(org.eclipse.egit.ui.internal.dialogs.SpellcheckableMessageAreaTest)  Time elapsed: 0 s
10:46:49 [2021-02-15T15:46:49.547Z] dontWrapShortText(org.eclipse.egit.ui.internal.dialogs.SpellcheckableMessageAreaTest)  Time elapsed: 0 s
10:46:49 [2021-02-15T15:46:49.547Z] dontWrapWordLongerThanOneLineAtStart(org.eclipse.egit.ui.internal.dialogs.SpellcheckableMessageAreaTest)  Time elapsed: 0 s
10:46:49 [2021-02-15T15:46:49.547Z] dontWrapAlreadyWrappedText(org.eclipse.egit.ui.internal.dialogs.SpellcheckableMessageAreaTest)  Time elapsed: 0 s
10:46:49 [2021-02-15T15:46:49.547Z] wrapOverlengthText2(org.eclipse.egit.ui.internal.dialogs.SpellcheckableMessageAreaTest)  Time elapsed: 0 s
10:46:49 [2021-02-15T15:46:49.547Z] lineAfterWrappedWordShouldNotBeJoinedIfItStartsWithASymbol(org.eclipse.egit.ui.internal.dialogs.SpellcheckableMessageAreaTest)  Time elapsed: 0 s
10:46:49 [2021-02-15T15:46:49.547Z] wrapAlternatingBlankNonBlank(org.eclipse.egit.ui.internal.dialogs.SpellcheckableMessageAreaTest)  Time elapsed: 0 s
10:46:49 [2021-02-15T15:46:49.547Z] keepWhitespace(org.eclipse.egit.ui.internal.dialogs.SpellcheckableMessageAreaTest)  Time elapsed: 0 s
10:46:49 [2021-02-15T15:46:49.547Z] lineAfterWrappedWordShouldNotBeJoinedIfItsEmpty(org.eclipse.egit.ui.internal.dialogs.SpellcheckableMessageAreaTest)  Time elapsed: 0 s
10:46:49 [2021-02-15T15:46:49.547Z] dontWrapLongCommitMessageFooter(org.eclipse.egit.ui.internal.dialogs.SpellcheckableMessageAreaTest)  Time elapsed: 0 s
10:46:49 [2021-02-15T15:46:49.547Z] lineAfterWrappedLineShouldBeJoinedAndFollowingLineWrappedCorrectly(org.eclipse.egit.ui.internal.dialogs.SpellcheckableMessageAreaTest)  Time elapsed: 0 s
10:46:49 [2021-02-15T15:46:49.547Z] wrapOverlengthText(org.eclipse.egit.ui.internal.dialogs.SpellcheckableMessageAreaTest)  Time elapsed: 0 s
10:46:49 [2021-02-15T15:46:49.547Z] dontWrapWordLongerThanOneLineAndKeepSpaceAtFront(org.eclipse.egit.ui.internal.dialogs.SpellcheckableMessageAreaTest)  Time elapsed: 0 s
10:46:49 [2021-02-15T15:46:49.547Z] wrapSecondLongLine(org.eclipse.egit.ui.internal.dialogs.SpellcheckableMessageAreaTest)  Time elapsed: 0 s
10:46:49 [2021-02-15T15:46:49.547Z] wrapOverlengthTextByOne(org.eclipse.egit.ui.internal.dialogs.SpellcheckableMessageAreaTest)  Time elapsed: 0 s
10:46:49 [2021-02-15T15:46:49.547Z] keepNewlineAtEnd(org.eclipse.egit.ui.internal.dialogs.SpellcheckableMessageAreaTest)  Time elapsed: 0 s
10:46:49 [2021-02-15T15:46:49.547Z] Running org.eclipse.egit.ui.internal.dialogs.CommitMessageComponentTest
10:46:49 [2021-02-15T15:46:49.547Z] Tests run: 5, Failures: 0, Errors: 0, Skipped: 0, Time elapsed: 0.001 s - in org.eclipse.egit.ui.internal.dialogs.CommitMessageComponentTest
10:46:49 [2021-02-15T15:46:49.547Z] commitFormat_MultipleLines_notOk2(org.eclipse.egit.ui.internal.dialogs.CommitMessageComponentTest)  Time elapsed: 0 s
10:46:49 [2021-02-15T15:46:49.547Z] commitFormat_simple(org.eclipse.egit.ui.internal.dialogs.CommitMessageComponentTest)  Time elapsed: 0 s
10:46:49 [2021-02-15T15:46:49.547Z] commitFormat_MultipleLines_ok(org.eclipse.egit.ui.internal.dialogs.CommitMessageComponentTest)  Time elapsed: 0 s
10:46:49 [2021-02-15T15:46:49.547Z] commitFormat_trailingWhitespace_ok(org.eclipse.egit.ui.internal.dialogs.CommitMessageComponentTest)  Time elapsed: 0 s
10:46:49 [2021-02-15T15:46:49.547Z] commitFormat_MultipleLines_notOk(org.eclipse.egit.ui.internal.dialogs.CommitMessageComponentTest)  Time elapsed: 0 s
10:46:49 [2021-02-15T15:46:49.547Z] Running org.eclipse.egit.ui.internal.actions.StashesMenuTest
10:46:52 [2021-02-15T15:46:52.830Z] 
10:46:52 [2021-02-15T15:46:52.830Z] (SWT:1786): Gtk-WARNING **: 15:46:52.088: Negative content width -6 (allocation 1, extents 4x3) while allocating gadget (node toolbar, owner GtkToolbar)
10:46:52 [2021-02-15T15:46:52.830Z] 
10:46:52 [2021-02-15T15:46:52.830Z] (SWT:1786): Gtk-WARNING **: 15:46:52.088: Negative content height -3 (allocation 1, extents 2x2) while allocating gadget (node toolbar, owner GtkToolbar)
10:46:52 [2021-02-15T15:46:52.830Z] 
10:46:52 [2021-02-15T15:46:52.830Z] (SWT:1786): Gtk-WARNING **: 15:46:52.088: Negative content width -6 (allocation 1, extents 4x3) while allocating gadget (node toolbar, owner GtkToolbar)
10:46:52 [2021-02-15T15:46:52.830Z] 
10:46:52 [2021-02-15T15:46:52.830Z] (SWT:1786): Gtk-WARNING **: 15:46:52.088: Negative content height -3 (allocation 1, extents 2x2) while allocating gadget (node toolbar, owner GtkToolbar)
10:46:52 [2021-02-15T15:46:52.830Z] 
10:46:52 [2021-02-15T15:46:52.830Z] (SWT:1786): Gtk-WARNING **: 15:46:52.159: Negative content width -6 (allocation 1, extents 4x3) while allocating gadget (node toolbar, owner GtkToolbar)
10:46:52 [2021-02-15T15:46:52.830Z] 
10:46:52 [2021-02-15T15:46:52.830Z] (SWT:1786): Gtk-WARNING **: 15:46:52.176: Negative content width -6 (allocation 1, extents 4x3) while allocating gadget (node toolbar, owner GtkToolbar)
10:46:52 [2021-02-15T15:46:52.830Z] 
10:46:52 [2021-02-15T15:46:52.830Z] (SWT:1786): Gtk-WARNING **: 15:46:52.200: Negative content width -6 (allocation 1, extents 4x3) while allocating gadget (node toolbar, owner GtkToolbar)
10:46:52 [2021-02-15T15:46:52.830Z] Tests run: 2, Failures: 0, Errors: 0, Skipped: 0, Time elapsed: 3.285 s - in org.eclipse.egit.ui.internal.actions.StashesMenuTest
10:46:52 [2021-02-15T15:46:52.830Z] menuWithoutStashes(org.eclipse.egit.ui.internal.actions.StashesMenuTest)  Time elapsed: 1.614 s
10:46:52 [2021-02-15T15:46:52.830Z] stashAndApplyChanges(org.eclipse.egit.ui.internal.actions.StashesMenuTest)  Time elapsed: 1.665 s
10:46:52 [2021-02-15T15:46:52.830Z] Running org.eclipse.egit.ui.internal.actions.LinkedResourcesTest
10:46:54 [2021-02-15T15:46:54.198Z] Tests run: 2, Failures: 0, Errors: 0, Skipped: 0, Time elapsed: 1.449 s - in org.eclipse.egit.ui.internal.actions.LinkedResourcesTest
10:46:54 [2021-02-15T15:46:54.199Z] testSomeActionsWithoutLinkedResources(org.eclipse.egit.ui.internal.actions.LinkedResourcesTest)  Time elapsed: 0.667 s
10:46:54 [2021-02-15T15:46:54.199Z] testNoActionOnLinkedResources(org.eclipse.egit.ui.internal.actions.LinkedResourcesTest)  Time elapsed: 0.776 s
10:46:54 [2021-02-15T15:46:54.199Z] Running org.eclipse.egit.ui.internal.actions.SwitchToMenuTest
10:47:04 [2021-02-15T15:47:04.171Z] 
10:47:04 [2021-02-15T15:47:04.171Z] !ENTRY org.eclipse.egit.core 4 0 2021-02-15 15:47:03.695
10:47:04 [2021-02-15T15:47:04.171Z] !MESSAGE Cannot parse the reflog for HEAD in repository /home/jenkins/agent/workspace/egit/tmp/egit.tmp/1159022693694ab992d89800a9f72d11/LocalRepositoriesTests266_selectionWithCorruptedReflog/FirstRepository/.git
10:47:04 [2021-02-15T15:47:04.171Z] !STACK 0
10:47:04 [2021-02-15T15:47:04.171Z] org.eclipse.jgit.errors.InvalidObjectIdException: Invalid id: INTENTIONALLY CORRUPTED REFLOG. Just som
10:47:04 [2021-02-15T15:47:04.171Z] 	at org.eclipse.jgit.lib.ObjectId.fromHexString(ObjectId.java:217)
10:47:04 [2021-02-15T15:47:04.171Z] 	at org.eclipse.jgit.lib.ObjectId.fromString(ObjectId.java:191)
10:47:04 [2021-02-15T15:47:04.171Z] 	at org.eclipse.jgit.internal.storage.file.ReflogEntryImpl.<init>(ReflogEntryImpl.java:39)
10:47:04 [2021-02-15T15:47:04.171Z] 	at org.eclipse.jgit.internal.storage.file.ReflogReaderImpl.getReverseEntries(ReflogReaderImpl.java:109)
10:47:04 [2021-02-15T15:47:04.171Z] 	at org.eclipse.jgit.internal.storage.file.ReflogReaderImpl.getReverseEntries(ReflogReaderImpl.java:56)
10:47:04 [2021-02-15T15:47:04.171Z] 	at org.eclipse.egit.core.RepositoryUtil.safeReadReflog(RepositoryUtil.java:193)
10:47:04 [2021-02-15T15:47:04.171Z] 	at org.eclipse.egit.ui.internal.actions.SwitchToMenu.getMostActiveBranches(SwitchToMenu.java:465)
10:47:04 [2021-02-15T15:47:04.171Z] 	at org.eclipse.egit.ui.internal.actions.SwitchToMenu.createMostActiveBranchesMenuItems(SwitchToMenu.java:306)
10:47:04 [2021-02-15T15:47:04.171Z] 	at org.eclipse.egit.ui.internal.actions.SwitchToMenu.createDynamicMenu(SwitchToMenu.java:142)
10:47:04 [2021-02-15T15:47:04.171Z] 	at org.eclipse.egit.ui.internal.actions.SwitchToMenu.fill(SwitchToMenu.java:122)
10:47:04 [2021-02-15T15:47:04.171Z] 	at org.eclipse.egit.ui.internal.actions.SwitchToMenuTest$1.run(SwitchToMenuTest.java:310)
10:47:04 [2021-02-15T15:47:04.171Z] 	at org.eclipse.swt.widgets.RunnableLock.run(RunnableLock.java:35)
10:47:04 [2021-02-15T15:47:04.171Z] 	at org.eclipse.swt.widgets.Synchronizer.runAsyncMessages(Synchronizer.java:182)
10:47:04 [2021-02-15T15:47:04.171Z] 	at org.eclipse.swt.widgets.Display.runAsyncMessages(Display.java:4536)
10:47:04 [2021-02-15T15:47:04.171Z] 	at org.eclipse.swt.widgets.Display.readAndDispatch(Display.java:4154)
10:47:04 [2021-02-15T15:47:04.171Z] 	at org.eclipse.e4.ui.internal.workbench.swt.PartRenderingEngine$4.run(PartRenderingEngine.java:1121)
10:47:04 [2021-02-15T15:47:04.171Z] 	at org.eclipse.core.databinding.observable.Realm.runWithDefault(Realm.java:336)
10:47:04 [2021-02-15T15:47:04.171Z] 	at org.eclipse.e4.ui.internal.workbench.swt.PartRenderingEngine.run(PartRenderingEngine.java:1022)
10:47:04 [2021-02-15T15:47:04.171Z] 	at org.eclipse.e4.ui.internal.workbench.E4Workbench.createAndRunUI(E4Workbench.java:150)
10:47:04 [2021-02-15T15:47:04.171Z] 	at org.eclipse.ui.internal.Workbench$5.run(Workbench.java:693)
10:47:04 [2021-02-15T15:47:04.171Z] 	at org.eclipse.core.databinding.observable.Realm.runWithDefault(Realm.java:336)
10:47:04 [2021-02-15T15:47:04.171Z] 	at org.eclipse.ui.internal.Workbench.createAndRunWorkbench(Workbench.java:610)
10:47:04 [2021-02-15T15:47:04.171Z] 	at org.eclipse.ui.PlatformUI.createAndRunWorkbench(PlatformUI.java:148)
10:47:04 [2021-02-15T15:47:04.171Z] 	at org.eclipse.ui.internal.ide.application.IDEApplication.start(IDEApplication.java:138)
10:47:04 [2021-02-15T15:47:04.171Z] 	at org.eclipse.tycho.surefire.osgibooter.UITestApplication.runApplication(UITestApplication.java:31)
10:47:04 [2021-02-15T15:47:04.171Z] 	at org.eclipse.tycho.surefire.osgibooter.AbstractUITestApplication.run(AbstractUITestApplication.java:120)
10:47:04 [2021-02-15T15:47:04.171Z] 	at org.eclipse.tycho.surefire.osgibooter.UITestApplication.start(UITestApplication.java:37)
10:47:04 [2021-02-15T15:47:04.171Z] 	at org.eclipse.equinox.internal.app.EclipseAppHandle.run(EclipseAppHandle.java:196)
10:47:04 [2021-02-15T15:47:04.171Z] 	at org.eclipse.core.runtime.internal.adaptor.EclipseAppLauncher.runApplication(EclipseAppLauncher.java:134)
10:47:04 [2021-02-15T15:47:04.171Z] 	at org.eclipse.core.runtime.internal.adaptor.EclipseAppLauncher.start(EclipseAppLauncher.java:104)
10:47:04 [2021-02-15T15:47:04.171Z] 	at org.eclipse.core.runtime.adaptor.EclipseStarter.run(EclipseStarter.java:388)
10:47:04 [2021-02-15T15:47:04.171Z] 	at org.eclipse.core.runtime.adaptor.EclipseStarter.run(EclipseStarter.java:243)
10:47:04 [2021-02-15T15:47:04.171Z] 	at sun.reflect.NativeMethodAccessorImpl.invoke0(Native Method)
10:47:04 [2021-02-15T15:47:04.171Z] 	at sun.reflect.NativeMethodAccessorImpl.invoke(NativeMethodAccessorImpl.java:62)
10:47:04 [2021-02-15T15:47:04.171Z] 	at sun.reflect.DelegatingMethodAccessorImpl.invoke(DelegatingMethodAccessorImpl.java:43)
10:47:04 [2021-02-15T15:47:04.171Z] 	at java.lang.reflect.Method.invoke(Method.java:498)
10:47:04 [2021-02-15T15:47:04.171Z] 	at org.eclipse.equinox.launcher.Main.invokeFramework(Main.java:673)
10:47:04 [2021-02-15T15:47:04.171Z] 	at org.eclipse.equinox.launcher.Main.basicRun(Main.java:610)
10:47:04 [2021-02-15T15:47:04.171Z] 	at org.eclipse.equinox.launcher.Main.run(Main.java:1519)
10:47:04 [2021-02-15T15:47:04.171Z] 	at org.eclipse.equinox.launcher.Main.main(Main.java:1492)
10:47:04 [2021-02-15T15:47:04.171Z] Caused by: java.lang.ArrayIndexOutOfBoundsException
10:47:04 [2021-02-15T15:47:04.171Z] 	at org.eclipse.jgit.util.RawParseUtils.parseHexInt32(RawParseUtils.java:336)
10:47:04 [2021-02-15T15:47:04.171Z] 	at org.eclipse.jgit.lib.ObjectId.fromHexString(ObjectId.java:210)
10:47:04 [2021-02-15T15:47:04.171Z] 	... 39 more
10:47:04 [2021-02-15T15:47:04.171Z] Tests run: 9, Failures: 0, Errors: 0, Skipped: 0, Time elapsed: 9.764 s - in org.eclipse.egit.ui.internal.actions.SwitchToMenuTest
10:47:04 [2021-02-15T15:47:04.171Z] multipleSelectionWithMultipleRepositoriesAndNoCommonBranches(org.eclipse.egit.ui.internal.actions.SwitchToMenuTest)  Time elapsed: 0.991 s
10:47:04 [2021-02-15T15:47:04.171Z] selectionWithProj1(org.eclipse.egit.ui.internal.actions.SwitchToMenuTest)  Time elapsed: 0.644 s
10:47:04 [2021-02-15T15:47:04.171Z] selectionNotAdaptableToRepository(org.eclipse.egit.ui.internal.actions.SwitchToMenuTest)  Time elapsed: 0.063 s
10:47:04 [2021-02-15T15:47:04.171Z] selectionWithProj1AndReflog(org.eclipse.egit.ui.internal.actions.SwitchToMenuTest)  Time elapsed: 0.686 s
10:47:04 [2021-02-15T15:47:04.171Z] validateMenuEntriesForMultiSelectionWithMultipleRepositories(org.eclipse.egit.ui.internal.actions.SwitchToMenuTest)  Time elapsed: 3.025 s
10:47:04 [2021-02-15T15:47:04.171Z] validateBranchSwitchingForForMultiSelectionWithMultipleRepositories(org.eclipse.egit.ui.internal.actions.SwitchToMenuTest)  Time elapsed: 1.739 s
10:47:04 [2021-02-15T15:47:04.171Z] selectionWithRepositoryHavingOver20Branches(org.eclipse.egit.ui.internal.actions.SwitchToMenuTest)  Time elapsed: 1.726 s
10:47:04 [2021-02-15T15:47:04.171Z] emptySelection(org.eclipse.egit.ui.internal.actions.SwitchToMenuTest)  Time elapsed: 0.099 s
10:47:04 [2021-02-15T15:47:04.171Z] selectionWithCorruptedReflog(org.eclipse.egit.ui.internal.actions.SwitchToMenuTest)  Time elapsed: 0.757 s
10:47:04 [2021-02-15T15:47:04.171Z] Running org.eclipse.egit.ui.internal.submodules.SubmoduleFolderTest
10:47:08 [2021-02-15T15:47:08.371Z] 
10:47:08 [2021-02-15T15:47:08.371Z] (SWT:1786): Gtk-WARNING **: 15:47:07.793: Negative content width -6 (allocation 1, extents 4x3) while allocating gadget (node toolbar, owner GtkToolbar)
10:47:08 [2021-02-15T15:47:08.371Z] 
10:47:08 [2021-02-15T15:47:08.371Z] (SWT:1786): Gtk-WARNING **: 15:47:07.793: Negative content height -3 (allocation 1, extents 2x2) while allocating gadget (node toolbar, owner GtkToolbar)
10:47:08 [2021-02-15T15:47:08.371Z] 
10:47:08 [2021-02-15T15:47:08.371Z] (SWT:1786): Gtk-WARNING **: 15:47:07.793: Negative content width -6 (allocation 1, extents 4x3) while allocating gadget (node toolbar, owner GtkToolbar)
10:47:08 [2021-02-15T15:47:08.371Z] 
10:47:08 [2021-02-15T15:47:08.371Z] (SWT:1786): Gtk-WARNING **: 15:47:07.793: Negative content height -3 (allocation 1, extents 2x2) while allocating gadget (node toolbar, owner GtkToolbar)
10:47:08 [2021-02-15T15:47:08.371Z] 
10:47:08 [2021-02-15T15:47:08.371Z] (SWT:1786): Gtk-WARNING **: 15:47:08.113: Negative content width -6 (allocation 1, extents 4x3) while allocating gadget (node toolbar, owner GtkToolbar)
10:47:08 [2021-02-15T15:47:08.371Z] 
10:47:08 [2021-02-15T15:47:08.371Z] (SWT:1786): Gtk-WARNING **: 15:47:08.118: Negative content width -6 (allocation 1, extents 4x3) while allocating gadget (node toolbar, owner GtkToolbar)
10:47:08 [2021-02-15T15:47:08.371Z] 
10:47:08 [2021-02-15T15:47:08.371Z] (SWT:1786): Gtk-WARNING **: 15:47:08.123: Negative content width -6 (allocation 1, extents 4x3) while allocating gadget (node toolbar, owner GtkToolbar)
10:47:08 [2021-02-15T15:47:08.371Z] 
10:47:08 [2021-02-15T15:47:08.371Z] (SWT:1786): Gtk-WARNING **: 15:47:08.131: Negative content width -6 (allocation 1, extents 4x3) while allocating gadget (node toolbar, owner GtkToolbar)
10:47:08 [2021-02-15T15:47:08.371Z] 
10:47:08 [2021-02-15T15:47:08.371Z] (SWT:1786): Gtk-WARNING **: 15:47:08.160: Negative content width -6 (allocation 1, extents 4x3) while allocating gadget (node toolbar, owner GtkToolbar)
10:47:08 [2021-02-15T15:47:08.371Z] 
10:47:08 [2021-02-15T15:47:08.371Z] (SWT:1786): Gtk-WARNING **: 15:47:08.161: Negative content width -6 (allocation 1, extents 4x3) while allocating gadget (node toolbar, owner GtkToolbar)
10:47:08 [2021-02-15T15:47:08.371Z] 
10:47:08 [2021-02-15T15:47:08.371Z] (SWT:1786): Gtk-WARNING **: 15:47:08.206: Negative content width -6 (allocation 1, extents 4x3) while allocating gadget (node toolbar, owner GtkToolbar)
10:47:08 [2021-02-15T15:47:08.371Z] 
10:47:08 [2021-02-15T15:47:08.371Z] (SWT:1786): Gtk-WARNING **: 15:47:08.207: Negative content width -6 (allocation 1, extents 4x3) while allocating gadget (node toolbar, owner GtkToolbar)
10:47:16 [2021-02-15T15:47:16.477Z] 
10:47:16 [2021-02-15T15:47:16.477Z] (SWT:1786): Gtk-WARNING **: 15:47:16.313: Negative content width -6 (allocation 1, extents 4x3) while allocating gadget (node toolbar, owner GtkToolbar)
10:47:16 [2021-02-15T15:47:16.477Z] 
10:47:16 [2021-02-15T15:47:16.477Z] (SWT:1786): Gtk-WARNING **: 15:47:16.331: Negative content width -6 (allocation 1, extents 4x3) while allocating gadget (node toolbar, owner GtkToolbar)
10:47:16 [2021-02-15T15:47:16.477Z] 
10:47:16 [2021-02-15T15:47:16.477Z] (SWT:1786): Gtk-WARNING **: 15:47:16.388: Negative content width -6 (allocation 1, extents 4x3) while allocating gadget (node toolbar, owner GtkToolbar)
10:47:16 [2021-02-15T15:47:16.477Z] 
10:47:16 [2021-02-15T15:47:16.477Z] (SWT:1786): Gtk-WARNING **: 15:47:16.389: Negative content width -6 (allocation 1, extents 4x3) while allocating gadget (node toolbar, owner GtkToolbar)
10:47:16 [2021-02-15T15:47:16.477Z] 
10:47:16 [2021-02-15T15:47:16.477Z] (SWT:1786): Gtk-CRITICAL **: 15:47:16.424: gtk_box_gadget_distribute: assertion 'size >= 0' failed in GtkScrollbar
10:47:16 [2021-02-15T15:47:16.477Z] 
10:47:16 [2021-02-15T15:47:16.477Z] (SWT:1786): Gtk-CRITICAL **: 15:47:16.435: gtk_box_gadget_distribute: assertion 'size >= 0' failed in GtkScrollbar
10:47:16 [2021-02-15T15:47:16.477Z] 
10:47:16 [2021-02-15T15:47:16.477Z] (SWT:1786): Gtk-CRITICAL **: 15:47:16.459: gtk_box_gadget_distribute: assertion 'size >= 0' failed in GtkScrollbar
10:47:16 [2021-02-15T15:47:16.477Z] 
10:47:16 [2021-02-15T15:47:16.477Z] (SWT:1786): Gtk-CRITICAL **: 15:47:16.465: gtk_box_gadget_distribute: assertion 'size >= 0' failed in GtkScrollbar
10:47:16 [2021-02-15T15:47:16.738Z] 
10:47:16 [2021-02-15T15:47:16.738Z] (SWT:1786): Gtk-CRITICAL **: 15:47:16.482: gtk_box_gadget_distribute: assertion 'size >= 0' failed in GtkScrollbar
10:47:16 [2021-02-15T15:47:16.738Z] 
10:47:16 [2021-02-15T15:47:16.738Z] (SWT:1786): Gtk-CRITICAL **: 15:47:16.499: gtk_box_gadget_distribute: assertion 'size >= 0' failed in GtkScrollbar
10:47:16 [2021-02-15T15:47:16.738Z] 
10:47:16 [2021-02-15T15:47:16.738Z] (SWT:1786): Gtk-CRITICAL **: 15:47:16.515: gtk_box_gadget_distribute: assertion 'size >= 0' failed in GtkScrollbar
10:47:16 [2021-02-15T15:47:16.738Z] 
10:47:16 [2021-02-15T15:47:16.738Z] (SWT:1786): Gtk-WARNING **: 15:47:16.525: Negative content width -6 (allocation 1, extents 4x3) while allocating gadget (node toolbar, owner GtkToolbar)
10:47:16 [2021-02-15T15:47:16.738Z] 
10:47:16 [2021-02-15T15:47:16.738Z] (SWT:1786): Gtk-WARNING **: 15:47:16.537: Negative content width -6 (allocation 1, extents 4x3) while allocating gadget (node toolbar, owner GtkToolbar)
10:47:16 [2021-02-15T15:47:16.738Z] 
10:47:16 [2021-02-15T15:47:16.738Z] (SWT:1786): Gtk-WARNING **: 15:47:16.569: Negative content width -6 (allocation 1, extents 4x3) while allocating gadget (node toolbar, owner GtkToolbar)
10:47:16 [2021-02-15T15:47:16.738Z] 
10:47:16 [2021-02-15T15:47:16.738Z] (SWT:1786): Gtk-CRITICAL **: 15:47:16.572: gtk_box_gadget_distribute: assertion 'size >= 0' failed in GtkScrollbar
10:47:16 [2021-02-15T15:47:16.738Z] 
10:47:16 [2021-02-15T15:47:16.738Z] (SWT:1786): Gtk-WARNING **: 15:47:16.605: Negative content width -6 (allocation 1, extents 4x3) while allocating gadget (node toolbar, owner GtkToolbar)
10:47:22 [2021-02-15T15:47:22.010Z] 
10:47:22 [2021-02-15T15:47:22.011Z] (SWT:1786): Gtk-WARNING **: 15:47:21.516: Negative content width -6 (allocation 1, extents 4x3) while allocating gadget (node toolbar, owner GtkToolbar)
10:47:22 [2021-02-15T15:47:22.011Z] 
10:47:22 [2021-02-15T15:47:22.011Z] (SWT:1786): Gtk-WARNING **: 15:47:21.648: Negative content width -6 (allocation 1, extents 4x3) while allocating gadget (node toolbar, owner GtkToolbar)
10:47:22 [2021-02-15T15:47:22.267Z] 
10:47:22 [2021-02-15T15:47:22.267Z] (SWT:1786): Gtk-WARNING **: 15:47:22.212: Negative content width -6 (allocation 1, extents 4x3) while allocating gadget (node toolbar, owner GtkToolbar)
10:47:22 [2021-02-15T15:47:22.267Z] 
10:47:22 [2021-02-15T15:47:22.267Z] (SWT:1786): Gtk-WARNING **: 15:47:22.251: Negative content width -6 (allocation 1, extents 4x3) while allocating gadget (node toolbar, owner GtkToolbar)
10:47:27 [2021-02-15T15:47:27.592Z] Tests run: 11, Failures: 0, Errors: 0, Skipped: 0, Time elapsed: 23.489 s - in org.eclipse.egit.ui.internal.submodules.SubmoduleFolderTest
10:47:27 [2021-02-15T15:47:27.592Z] testSwitchToMenu(org.eclipse.egit.ui.internal.submodules.SubmoduleFolderTest)  Time elapsed: 2.367 s
10:47:27 [2021-02-15T15:47:27.592Z] compareWithHeadInSubmoduleFolder(org.eclipse.egit.ui.internal.submodules.SubmoduleFolderTest)  Time elapsed: 2.207 s
10:47:27 [2021-02-15T15:47:27.592Z] testStageUnstageInSubRepo(org.eclipse.egit.ui.internal.submodules.SubmoduleFolderTest)  Time elapsed: 4.242 s
10:47:27 [2021-02-15T15:47:27.592Z] testDecoration(org.eclipse.egit.ui.internal.submodules.SubmoduleFolderTest)  Time elapsed: 2.259 s
10:47:27 [2021-02-15T15:47:27.592Z] testHistoryFromProjectExplorerIsFromSubRepository(org.eclipse.egit.ui.internal.submodules.SubmoduleFolderTest)  Time elapsed: 1.817 s
10:47:27 [2021-02-15T15:47:27.592Z] testParentFolderMapsToParentRepo(org.eclipse.egit.ui.internal.submodules.SubmoduleFolderTest)  Time elapsed: 1.522 s
10:47:27 [2021-02-15T15:47:27.592Z] testDisconnect(org.eclipse.egit.ui.internal.submodules.SubmoduleFolderTest)  Time elapsed: 1.993 s
10:47:27 [2021-02-15T15:47:27.592Z] testRepoViewFollowSelection(org.eclipse.egit.ui.internal.submodules.SubmoduleFolderTest)  Time elapsed: 2.227 s
10:47:27 [2021-02-15T15:47:27.592Z] testRepoRemoval(org.eclipse.egit.ui.internal.submodules.SubmoduleFolderTest)  Time elapsed: 1.609 s
10:47:27 [2021-02-15T15:47:27.592Z] testChildProjectMapsToSubRepo(org.eclipse.egit.ui.internal.submodules.SubmoduleFolderTest)  Time elapsed: 1.655 s
10:47:27 [2021-02-15T15:47:27.592Z] testChildFolderMapsToSubRepo(org.eclipse.egit.ui.internal.submodules.SubmoduleFolderTest)  Time elapsed: 1.46 s
10:47:27 [2021-02-15T15:47:27.592Z] Running org.eclipse.egit.ui.internal.synchronize.model.GitModelWorkingFileTest
10:47:30 [2021-02-15T15:47:30.882Z] Tests run: 5, Failures: 0, Errors: 0, Skipped: 0, Time elapsed: 3.237 s - in org.eclipse.egit.ui.internal.synchronize.model.GitModelWorkingFileTest
10:47:30 [2021-02-15T15:47:30.882Z] shouldReturnNotEqualForDifferentLocation(org.eclipse.egit.ui.internal.synchronize.model.GitModelWorkingFileTest)  Time elapsed: 0.623 s
10:47:30 [2021-02-15T15:47:30.882Z] shouldReturnNotEqualWhenComparingWorkingFileAndCacheFile(org.eclipse.egit.ui.internal.synchronize.model.GitModelWorkingFileTest)  Time elapsed: 0.645 s
10:47:30 [2021-02-15T15:47:30.882Z] shouldReturnEqualForSameInstance(org.eclipse.egit.ui.internal.synchronize.model.GitModelWorkingFileTest)  Time elapsed: 0.631 s
10:47:30 [2021-02-15T15:47:30.882Z] shouldReturnNotEqualWhenComparingWorkingFileAndBlob(org.eclipse.egit.ui.internal.synchronize.model.GitModelWorkingFileTest)  Time elapsed: 0.697 s
10:47:30 [2021-02-15T15:47:30.882Z] shouldReturnEqualForSameLocation(org.eclipse.egit.ui.internal.synchronize.model.GitModelWorkingFileTest)  Time elapsed: 0.628 s
10:47:30 [2021-02-15T15:47:30.882Z] Running org.eclipse.egit.ui.internal.synchronize.model.GitModelBlobTest
10:47:40 [2021-02-15T15:47:40.859Z] Tests run: 15, Failures: 0, Errors: 0, Skipped: 2, Time elapsed: 8.652 s - in org.eclipse.egit.ui.internal.synchronize.model.GitModelBlobTest
10:47:40 [2021-02-15T15:47:40.859Z] shouldReturnEqualSameData1(org.eclipse.egit.ui.internal.synchronize.model.GitModelBlobTest) skipped
10:47:40 [2021-02-15T15:47:40.859Z] shouldReturnNotEqualForDifferentLocation(org.eclipse.egit.ui.internal.synchronize.model.GitModelBlobTest)  Time elapsed: 0.614 s
10:47:40 [2021-02-15T15:47:40.859Z] shouldReturnNotEqualForBlobAndCommit(org.eclipse.egit.ui.internal.synchronize.model.GitModelBlobTest)  Time elapsed: 0.613 s
10:47:40 [2021-02-15T15:47:40.859Z] shouldReturnEqualForSameData(org.eclipse.egit.ui.internal.synchronize.model.GitModelBlobTest) skipped
10:47:40 [2021-02-15T15:47:40.859Z] shouldReturnNotEqualForDifferentFiles(org.eclipse.egit.ui.internal.synchronize.model.GitModelBlobTest)  Time elapsed: 0.657 s
10:47:40 [2021-02-15T15:47:40.859Z] shouldReturnNotEqualForBlobAndCacheFile(org.eclipse.egit.ui.internal.synchronize.model.GitModelBlobTest)  Time elapsed: 0.665 s
10:47:40 [2021-02-15T15:47:40.859Z] shouldReturnNotEqualForBlobAndTree(org.eclipse.egit.ui.internal.synchronize.model.GitModelBlobTest)  Time elapsed: 0.651 s
10:47:40 [2021-02-15T15:47:40.859Z] shouldBeSymmetric1(org.eclipse.egit.ui.internal.synchronize.model.GitModelBlobTest)  Time elapsed: 0.69 s
10:47:40 [2021-02-15T15:47:40.859Z] shouldBeSymmetric(org.eclipse.egit.ui.internal.synchronize.model.GitModelBlobTest)  Time elapsed: 0.818 s
10:47:40 [2021-02-15T15:47:40.859Z] shouldReturnEqualForSameInstance(org.eclipse.egit.ui.internal.synchronize.model.GitModelBlobTest)  Time elapsed: 0.646 s
10:47:40 [2021-02-15T15:47:40.859Z] shouldActAsResourceProvider(org.eclipse.egit.ui.internal.synchronize.model.GitModelBlobTest)  Time elapsed: 0.63 s
10:47:40 [2021-02-15T15:47:40.859Z] shouldReturnNotEqualForDifferentBaseObjectId2(org.eclipse.egit.ui.internal.synchronize.model.GitModelBlobTest)  Time elapsed: 0.639 s
10:47:40 [2021-02-15T15:47:40.859Z] shouldReturnNotEqualForDifferentBaseObjectId3(org.eclipse.egit.ui.internal.synchronize.model.GitModelBlobTest)  Time elapsed: 0.63 s
10:47:40 [2021-02-15T15:47:40.859Z] shouldReturnNotEqualForBlobAndWorkingFile(org.eclipse.egit.ui.internal.synchronize.model.GitModelBlobTest)  Time elapsed: 0.647 s
10:47:40 [2021-02-15T15:47:40.859Z] shouldReturnNotEqualForDifferentBaseObjectId(org.eclipse.egit.ui.internal.synchronize.model.GitModelBlobTest)  Time elapsed: 0.719 s
10:47:40 [2021-02-15T15:47:40.859Z] Running org.eclipse.egit.ui.internal.synchronize.model.GitModelCacheFileTest
10:47:43 [2021-02-15T15:47:43.381Z] Tests run: 7, Failures: 0, Errors: 0, Skipped: 2, Time elapsed: 4.084 s - in org.eclipse.egit.ui.internal.synchronize.model.GitModelCacheFileTest
10:47:43 [2021-02-15T15:47:43.381Z] shouldReturnEqualForSameObjectIdsAndLocation(org.eclipse.egit.ui.internal.synchronize.model.GitModelCacheFileTest)  Time elapsed: 0.588 s
10:47:43 [2021-02-15T15:47:43.381Z] shouldReturnNotEqualWhenComparingCacheFileAndBlob(org.eclipse.egit.ui.internal.synchronize.model.GitModelCacheFileTest)  Time elapsed: 0.724 s
10:47:43 [2021-02-15T15:47:43.381Z] shouldReturnNotEqualForDifferentCacheIds(org.eclipse.egit.ui.internal.synchronize.model.GitModelCacheFileTest) skipped
10:47:43 [2021-02-15T15:47:43.381Z] shouldReturnEqualForSameInstance(org.eclipse.egit.ui.internal.synchronize.model.GitModelCacheFileTest)  Time elapsed: 0.699 s
10:47:43 [2021-02-15T15:47:43.381Z] shouldReturnNotEqualWhenComparingCacheFileAndWorkingFile(org.eclipse.egit.ui.internal.synchronize.model.GitModelCacheFileTest)  Time elapsed: 0.863 s
10:47:43 [2021-02-15T15:47:43.381Z] shouldReturnNotEqualForDifferentBaseIds(org.eclipse.egit.ui.internal.synchronize.model.GitModelCacheFileTest)  Time elapsed: 1.157 s
10:47:43 [2021-02-15T15:47:43.382Z] shouldReturnNotEqualForDifferentLocations(org.eclipse.egit.ui.internal.synchronize.model.GitModelCacheFileTest) skipped
10:47:43 [2021-02-15T15:47:43.382Z] Running org.eclipse.egit.ui.internal.synchronize.model.GitModelWorkingTreeTest
10:47:44 [2021-02-15T15:47:44.757Z] Tests run: 2, Failures: 0, Errors: 0, Skipped: 0, Time elapsed: 1.291 s - in org.eclipse.egit.ui.internal.synchronize.model.GitModelWorkingTreeTest
10:47:44 [2021-02-15T15:47:44.757Z] shouldReturnNotEqualsWhenComparingWorkingTreeAndCache(org.eclipse.egit.ui.internal.synchronize.model.GitModelWorkingTreeTest)  Time elapsed: 0.657 s
10:47:44 [2021-02-15T15:47:44.757Z] shouldReturnEqualsForTheSameInstance(org.eclipse.egit.ui.internal.synchronize.model.GitModelWorkingTreeTest)  Time elapsed: 0.627 s
10:47:44 [2021-02-15T15:47:44.757Z] Running org.eclipse.egit.ui.internal.synchronize.model.GitModelCacheTreeTest
10:47:47 [2021-02-15T15:47:47.306Z] Tests run: 4, Failures: 0, Errors: 0, Skipped: 0, Time elapsed: 2.581 s - in org.eclipse.egit.ui.internal.synchronize.model.GitModelCacheTreeTest
10:47:47 [2021-02-15T15:47:47.307Z] shouldReturnEqualForSameData(org.eclipse.egit.ui.internal.synchronize.model.GitModelCacheTreeTest)  Time elapsed: 0.628 s
10:47:47 [2021-02-15T15:47:47.307Z] shouldReturnNotEqualForDifferetnLocation(org.eclipse.egit.ui.internal.synchronize.model.GitModelCacheTreeTest)  Time elapsed: 0.644 s
10:47:47 [2021-02-15T15:47:47.307Z] shouldReturnEqualForSameInstance(org.eclipse.egit.ui.internal.synchronize.model.GitModelCacheTreeTest)  Time elapsed: 0.628 s
10:47:47 [2021-02-15T15:47:47.307Z] shouldReturnNotEqualWhenComparingCacheTreeAndTree(org.eclipse.egit.ui.internal.synchronize.model.GitModelCacheTreeTest)  Time elapsed: 0.668 s
10:47:47 [2021-02-15T15:47:47.307Z] Running org.eclipse.egit.ui.internal.synchronize.model.GitModelRootTest
10:47:49 [2021-02-15T15:47:49.199Z] Tests run: 1, Failures: 0, Errors: 0, Skipped: 0, Time elapsed: 1.48 s - in org.eclipse.egit.ui.internal.synchronize.model.GitModelRootTest
10:47:49 [2021-02-15T15:47:49.199Z] shouldIgnoreEmptyRepositories(org.eclipse.egit.ui.internal.synchronize.model.GitModelRootTest)  Time elapsed: 1.475 s
10:47:49 [2021-02-15T15:47:49.199Z] Running org.eclipse.egit.ui.internal.synchronize.model.GitModelCommitTest
10:47:54 [2021-02-15T15:47:54.450Z] Tests run: 7, Failures: 0, Errors: 0, Skipped: 0, Time elapsed: 5.227 s - in org.eclipse.egit.ui.internal.synchronize.model.GitModelCommitTest
10:47:54 [2021-02-15T15:47:54.450Z] shouldReturnNotEqualForDifferentCommits(org.eclipse.egit.ui.internal.synchronize.model.GitModelCommitTest)  Time elapsed: 0.616 s
10:47:54 [2021-02-15T15:47:54.450Z] shouldReturnNotEqualWhenCommitTreeAndBlob(org.eclipse.egit.ui.internal.synchronize.model.GitModelCommitTest)  Time elapsed: 0.622 s
10:47:54 [2021-02-15T15:47:54.450Z] shouldReturnNotEqualWhenCommitTreeAndTree(org.eclipse.egit.ui.internal.synchronize.model.GitModelCommitTest)  Time elapsed: 0.657 s
10:47:54 [2021-02-15T15:47:54.450Z] shouldReturnNotEqualWhenCommitTreeAndCache(org.eclipse.egit.ui.internal.synchronize.model.GitModelCommitTest)  Time elapsed: 0.675 s
10:47:54 [2021-02-15T15:47:54.450Z] shouldReturnEqualForSameInstance(org.eclipse.egit.ui.internal.synchronize.model.GitModelCommitTest)  Time elapsed: 0.724 s
10:47:54 [2021-02-15T15:47:54.450Z] shouldReturnNotEqualForDifferentParents(org.eclipse.egit.ui.internal.synchronize.model.GitModelCommitTest)  Time elapsed: 1.305 s
10:47:54 [2021-02-15T15:47:54.450Z] shouldReturnEqualForSameCommits(org.eclipse.egit.ui.internal.synchronize.model.GitModelCommitTest)  Time elapsed: 0.61 s
10:47:54 [2021-02-15T15:47:54.450Z] Running org.eclipse.egit.ui.internal.synchronize.model.GitModelRepositoryTest
10:47:56 [2021-02-15T15:47:56.989Z] Tests run: 3, Failures: 0, Errors: 0, Skipped: 0, Time elapsed: 2.997 s - in org.eclipse.egit.ui.internal.synchronize.model.GitModelRepositoryTest
10:47:56 [2021-02-15T15:47:56.989Z] shouldReturnEqual(org.eclipse.egit.ui.internal.synchronize.model.GitModelRepositoryTest)  Time elapsed: 0.824 s
10:47:56 [2021-02-15T15:47:56.989Z] shouldReturnNotEqual(org.eclipse.egit.ui.internal.synchronize.model.GitModelRepositoryTest)  Time elapsed: 1.109 s
10:47:56 [2021-02-15T15:47:56.989Z] shouldReturnEqualForSameInstance(org.eclipse.egit.ui.internal.synchronize.model.GitModelRepositoryTest)  Time elapsed: 1.049 s
10:47:56 [2021-02-15T15:47:56.989Z] Running org.eclipse.egit.ui.internal.synchronize.model.GitModelCacheTest
10:47:58 [2021-02-15T15:47:58.883Z] 
10:47:58 [2021-02-15T15:47:58.883Z] !ENTRY org.eclipse.egit.core 4 0 2021-02-15 15:47:58.416
10:47:58 [2021-02-15T15:47:58.883Z] !MESSAGE Failed to connect project to repository
10:47:58 [2021-02-15T15:47:58.883Z] !STACK 1
10:47:58 [2021-02-15T15:47:58.883Z] org.eclipse.core.runtime.CoreException: Connecting Git team provider failed. See log for details.
10:47:58 [2021-02-15T15:47:58.883Z] 	at org.eclipse.egit.core.op.ConnectProviderOperation.execute(ConnectProviderOperation.java:114)
10:47:58 [2021-02-15T15:47:58.883Z] 	at org.eclipse.egit.ui.common.LocalRepositoryTestCase.createProjectAndCommitToRepository(LocalRepositoryTestCase.java:368)
10:47:58 [2021-02-15T15:47:58.883Z] 	at org.eclipse.egit.ui.common.LocalRepositoryTestCase.createProjectAndCommitToRepository(LocalRepositoryTestCase.java:331)
10:47:58 [2021-02-15T15:47:58.883Z] 	at org.eclipse.egit.ui.common.LocalRepositoryTestCase.createProjectAndCommitToRepository(LocalRepositoryTestCase.java:326)
10:47:58 [2021-02-15T15:47:58.883Z] 	at org.eclipse.egit.ui.internal.synchronize.model.GitModelCacheTest.setupEnvironment(GitModelCacheTest.java:133)
10:47:58 [2021-02-15T15:47:58.883Z] 	at sun.reflect.NativeMethodAccessorImpl.invoke0(Native Method)
10:47:58 [2021-02-15T15:47:58.883Z] 	at sun.reflect.NativeMethodAccessorImpl.invoke(NativeMethodAccessorImpl.java:62)
10:47:58 [2021-02-15T15:47:58.883Z] 	at sun.reflect.DelegatingMethodAccessorImpl.invoke(DelegatingMethodAccessorImpl.java:43)
10:47:58 [2021-02-15T15:47:58.883Z] 	at java.lang.reflect.Method.invoke(Method.java:498)
10:47:58 [2021-02-15T15:47:58.883Z] 	at org.junit.runners.model.FrameworkMethod$1.runReflectiveCall(FrameworkMethod.java:59)
10:47:58 [2021-02-15T15:47:58.883Z] 	at org.junit.internal.runners.model.ReflectiveCallable.run(ReflectiveCallable.java:12)
10:47:58 [2021-02-15T15:47:58.883Z] 	at org.junit.runners.model.FrameworkMethod.invokeExplosively(FrameworkMethod.java:56)
10:47:58 [2021-02-15T15:47:58.883Z] 	at org.junit.internal.runners.statements.RunBefores.invokeMethod(RunBefores.java:33)
10:47:58 [2021-02-15T15:47:58.883Z] 	at org.junit.internal.runners.statements.RunBefores.evaluate(RunBefores.java:24)
10:47:58 [2021-02-15T15:47:58.883Z] 	at org.junit.internal.runners.statements.RunAfters.evaluate(RunAfters.java:27)
10:47:58 [2021-02-15T15:47:58.883Z] 	at org.junit.rules.TestWatcher$1.evaluate(TestWatcher.java:61)
10:47:58 [2021-02-15T15:47:58.883Z] 	at org.junit.runners.ParentRunner$3.evaluate(ParentRunner.java:306)
10:47:58 [2021-02-15T15:47:58.883Z] 	at org.junit.runners.ParentRunner.runLeaf(ParentRunner.java:366)
10:47:58 [2021-02-15T15:47:58.883Z] 	at org.eclipse.swtbot.swt.finder.junit.SWTBotJunit4ClassRunner.runChild(SWTBotJunit4ClassRunner.java:77)
10:47:58 [2021-02-15T15:47:58.883Z] 	at org.junit.runners.BlockJUnit4ClassRunner.runChild(BlockJUnit4ClassRunner.java:63)
10:47:58 [2021-02-15T15:47:58.883Z] 	at org.junit.runners.ParentRunner$4.run(ParentRunner.java:331)
10:47:58 [2021-02-15T15:47:58.883Z] 	at org.junit.runners.ParentRunner$1.schedule(ParentRunner.java:79)
10:47:58 [2021-02-15T15:47:58.883Z] 	at org.junit.runners.ParentRunner.runChildren(ParentRunner.java:329)
10:47:58 [2021-02-15T15:47:58.883Z] 	at org.junit.runners.ParentRunner.access$100(ParentRunner.java:66)
10:47:58 [2021-02-15T15:47:58.883Z] 	at org.junit.runners.ParentRunner$2.evaluate(ParentRunner.java:293)
10:47:58 [2021-02-15T15:47:58.883Z] 	at org.junit.internal.runners.statements.RunBefores.evaluate(RunBefores.java:26)
10:47:58 [2021-02-15T15:47:58.883Z] 	at org.junit.internal.runners.statements.RunAfters.evaluate(RunAfters.java:27)
10:47:58 [2021-02-15T15:47:58.883Z] 	at org.junit.runners.ParentRunner$3.evaluate(ParentRunner.java:306)
10:47:58 [2021-02-15T15:47:58.883Z] 	at org.junit.runners.ParentRunner.run(ParentRunner.java:413)
10:47:58 [2021-02-15T15:47:58.883Z] 	at org.eclipse.swtbot.swt.finder.junit.SWTBotJunit4ClassRunner.run(SWTBotJunit4ClassRunner.java:62)
10:47:58 [2021-02-15T15:47:58.883Z] 	at org.apache.maven.surefire.junit4.JUnit4Provider.execute(JUnit4Provider.java:365)
10:47:58 [2021-02-15T15:47:58.883Z] 	at org.apache.maven.surefire.junit4.JUnit4Provider.executeWithRerun(JUnit4Provider.java:273)
10:47:58 [2021-02-15T15:47:58.884Z] 	at org.apache.maven.surefire.junit4.JUnit4Provider.executeTestSet(JUnit4Provider.java:238)
10:47:58 [2021-02-15T15:47:58.884Z] 	at org.apache.maven.surefire.junit4.JUnit4Provider.invoke(JUnit4Provider.java:159)
10:47:58 [2021-02-15T15:47:58.884Z] 	at sun.reflect.NativeMethodAccessorImpl.invoke0(Native Method)
10:47:58 [2021-02-15T15:47:58.884Z] 	at sun.reflect.NativeMethodAccessorImpl.invoke(NativeMethodAccessorImpl.java:62)
10:47:58 [2021-02-15T15:47:58.884Z] 	at sun.reflect.DelegatingMethodAccessorImpl.invoke(DelegatingMethodAccessorImpl.java:43)
10:47:58 [2021-02-15T15:47:58.884Z] 	at java.lang.reflect.Method.invoke(Method.java:498)
10:47:58 [2021-02-15T15:47:58.884Z] 	at org.apache.maven.surefire.util.ReflectionUtils.invokeMethodWithArray2(ReflectionUtils.java:206)
10:47:58 [2021-02-15T15:47:58.884Z] 	at org.apache.maven.surefire.booter.ProviderFactory$ProviderProxy.invoke(ProviderFactory.java:161)
10:47:58 [2021-02-15T15:47:58.884Z] 	at org.apache.maven.surefire.booter.ProviderFactory.invokeProvider(ProviderFactory.java:84)
10:47:58 [2021-02-15T15:47:58.884Z] 	at org.eclipse.tycho.surefire.osgibooter.OsgiSurefireBooter.run(OsgiSurefireBooter.java:113)
10:47:58 [2021-02-15T15:47:58.884Z] 	at org.eclipse.tycho.surefire.osgibooter.AbstractUITestApplication.runTests(AbstractUITestApplication.java:44)
10:47:58 [2021-02-15T15:47:58.884Z] 	at org.eclipse.e4.ui.internal.workbench.swt.E4Testable$1.run(E4Testable.java:73)
10:47:58 [2021-02-15T15:47:58.884Z] 	at java.lang.Thread.run(Thread.java:748)
10:47:58 [2021-02-15T15:47:58.884Z] Contains: Error connecting project ProjectWithoutDotProject, no Git repositories found
10:47:58 [2021-02-15T15:47:58.884Z] !SUBENTRY 1 org.eclipse.egit.core 4 0 2021-02-15 15:47:58.416
10:47:58 [2021-02-15T15:47:58.884Z] !MESSAGE Connecting Git team provider failed. See log for details.
10:47:58 [2021-02-15T15:47:58.884Z] !SUBENTRY 2 org.eclipse.egit.core 4 0 2021-02-15 15:47:58.416
10:47:58 [2021-02-15T15:47:58.884Z] !MESSAGE Error connecting project ProjectWithoutDotProject, no Git repositories found
10:48:06 [2021-02-15T15:48:06.990Z] Tests run: 6, Failures: 1, Errors: 0, Skipped: 0, Time elapsed: 9.658 s <<< FAILURE! - in org.eclipse.egit.ui.internal.synchronize.model.GitModelCacheTest
10:48:06 [2021-02-15T15:48:06.990Z] shouldReturnChildren(org.eclipse.egit.ui.internal.synchronize.model.GitModelCacheTest)  Time elapsed: 0.591 s
10:48:06 [2021-02-15T15:48:06.990Z] shouldReturnNotEqualWhenCacheTreeAndCommit(org.eclipse.egit.ui.internal.synchronize.model.GitModelCacheTest)  Time elapsed: 0.618 s
10:48:06 [2021-02-15T15:48:06.990Z] shouldReturnEqualForSameInstance(org.eclipse.egit.ui.internal.synchronize.model.GitModelCacheTest)  Time elapsed: 5.495 s  <<< FAILURE!
10:48:06 [2021-02-15T15:48:06.990Z] java.lang.AssertionError: Project not shared with git: P/ProjectWithoutDotProject
10:48:06 [2021-02-15T15:48:06.991Z] 	at org.junit.Assert.fail(Assert.java:89)
10:48:06 [2021-02-15T15:48:06.991Z] 	at org.junit.Assert.assertTrue(Assert.java:42)
10:48:06 [2021-02-15T15:48:06.991Z] 	at org.eclipse.egit.ui.common.LocalRepositoryTestCase.assertConnected(LocalRepositoryTestCase.java:465)
10:48:06 [2021-02-15T15:48:06.991Z] 	at org.eclipse.egit.ui.common.LocalRepositoryTestCase.createProjectAndCommitToRepository(LocalRepositoryTestCase.java:373)
10:48:06 [2021-02-15T15:48:06.991Z] 	at org.eclipse.egit.ui.common.LocalRepositoryTestCase.createProjectAndCommitToRepository(LocalRepositoryTestCase.java:331)
10:48:06 [2021-02-15T15:48:06.991Z] 	at org.eclipse.egit.ui.common.LocalRepositoryTestCase.createProjectAndCommitToRepository(LocalRepositoryTestCase.java:326)
10:48:06 [2021-02-15T15:48:06.991Z] 	at org.eclipse.egit.ui.internal.synchronize.model.GitModelCacheTest.setupEnvironment(GitModelCacheTest.java:133)
10:48:06 [2021-02-15T15:48:06.991Z] 	at sun.reflect.NativeMethodAccessorImpl.invoke0(Native Method)
10:48:06 [2021-02-15T15:48:06.991Z] 	at sun.reflect.NativeMethodAccessorImpl.invoke(NativeMethodAccessorImpl.java:62)
10:48:06 [2021-02-15T15:48:06.991Z] 	at sun.reflect.DelegatingMethodAccessorImpl.invoke(DelegatingMethodAccessorImpl.java:43)
10:48:06 [2021-02-15T15:48:06.991Z] 	at java.lang.reflect.Method.invoke(Method.java:498)
10:48:06 [2021-02-15T15:48:06.991Z] 	at org.junit.runners.model.FrameworkMethod$1.runReflectiveCall(FrameworkMethod.java:59)
10:48:06 [2021-02-15T15:48:06.991Z] 	at org.junit.internal.runners.model.ReflectiveCallable.run(ReflectiveCallable.java:12)
10:48:06 [2021-02-15T15:48:06.991Z] 	at org.junit.runners.model.FrameworkMethod.invokeExplosively(FrameworkMethod.java:56)
10:48:06 [2021-02-15T15:48:06.991Z] 	at org.junit.internal.runners.statements.RunBefores.invokeMethod(RunBefores.java:33)
10:48:06 [2021-02-15T15:48:06.991Z] 	at org.junit.internal.runners.statements.RunBefores.evaluate(RunBefores.java:24)
10:48:06 [2021-02-15T15:48:06.991Z] 	at org.junit.internal.runners.statements.RunAfters.evaluate(RunAfters.java:27)
10:48:06 [2021-02-15T15:48:06.991Z] 	at org.junit.rules.TestWatcher$1.evaluate(TestWatcher.java:61)
10:48:06 [2021-02-15T15:48:06.991Z] 	at org.junit.runners.ParentRunner$3.evaluate(ParentRunner.java:306)
10:48:06 [2021-02-15T15:48:06.991Z] 	at org.junit.runners.ParentRunner.runLeaf(ParentRunner.java:366)
10:48:06 [2021-02-15T15:48:06.991Z] 	at org.eclipse.swtbot.swt.finder.junit.SWTBotJunit4ClassRunner.runChild(SWTBotJunit4ClassRunner.java:77)
10:48:06 [2021-02-15T15:48:06.991Z] 	at org.junit.runners.BlockJUnit4ClassRunner.runChild(BlockJUnit4ClassRunner.java:63)
10:48:06 [2021-02-15T15:48:06.991Z] 	at org.junit.runners.ParentRunner$4.run(ParentRunner.java:331)
10:48:06 [2021-02-15T15:48:06.991Z] 	at org.junit.runners.ParentRunner$1.schedule(ParentRunner.java:79)
10:48:06 [2021-02-15T15:48:06.991Z] 	at org.junit.runners.ParentRunner.runChildren(ParentRunner.java:329)
10:48:06 [2021-02-15T15:48:06.991Z] 	at org.junit.runners.ParentRunner.access$100(ParentRunner.java:66)
10:48:06 [2021-02-15T15:48:06.991Z] 	at org.junit.runners.ParentRunner$2.evaluate(ParentRunner.java:293)
10:48:06 [2021-02-15T15:48:06.991Z] 	at org.junit.internal.runners.statements.RunBefores.evaluate(RunBefores.java:26)
10:48:06 [2021-02-15T15:48:06.991Z] 	at org.junit.internal.runners.statements.RunAfters.evaluate(RunAfters.java:27)
10:48:06 [2021-02-15T15:48:06.991Z] 	at org.junit.runners.ParentRunner$3.evaluate(ParentRunner.java:306)
10:48:06 [2021-02-15T15:48:06.991Z] 	at org.junit.runners.ParentRunner.run(ParentRunner.java:413)
10:48:06 [2021-02-15T15:48:06.991Z] 	at org.eclipse.swtbot.swt.finder.junit.SWTBotJunit4ClassRunner.run(SWTBotJunit4ClassRunner.java:62)
10:48:06 [2021-02-15T15:48:06.991Z] 	at org.apache.maven.surefire.junit4.JUnit4Provider.execute(JUnit4Provider.java:365)
10:48:06 [2021-02-15T15:48:06.991Z] 	at org.apache.maven.surefire.junit4.JUnit4Provider.executeWithRerun(JUnit4Provider.java:273)
10:48:06 [2021-02-15T15:48:06.991Z] 	at org.apache.maven.surefire.junit4.JUnit4Provider.executeTestSet(JUnit4Provider.java:238)
10:48:06 [2021-02-15T15:48:06.991Z] 	at org.apache.maven.surefire.junit4.JUnit4Provider.invoke(JUnit4Provider.java:159)
10:48:06 [2021-02-15T15:48:06.991Z] 	at sun.reflect.NativeMethodAccessorImpl.invoke0(Native Method)
10:48:06 [2021-02-15T15:48:06.991Z] 	at sun.reflect.NativeMethodAccessorImpl.invoke(NativeMethodAccessorImpl.java:62)
10:48:06 [2021-02-15T15:48:06.991Z] 	at sun.reflect.DelegatingMethodAccessorImpl.invoke(DelegatingMethodAccessorImpl.java:43)
10:48:06 [2021-02-15T15:48:06.991Z] 	at java.lang.reflect.Method.invoke(Method.java:498)
10:48:06 [2021-02-15T15:48:06.991Z] 	at org.apache.maven.surefire.util.ReflectionUtils.invokeMethodWithArray2(ReflectionUtils.java:206)
10:48:06 [2021-02-15T15:48:06.991Z] 	at org.apache.maven.surefire.booter.ProviderFactory$ProviderProxy.invoke(ProviderFactory.java:161)
10:48:06 [2021-02-15T15:48:06.991Z] 	at org.apache.maven.surefire.booter.ProviderFactory.invokeProvider(ProviderFactory.java:84)
10:48:06 [2021-02-15T15:48:06.991Z] 	at org.eclipse.tycho.surefire.osgibooter.OsgiSurefireBooter.run(OsgiSurefireBooter.java:113)
10:48:06 [2021-02-15T15:48:06.991Z] 	at org.eclipse.tycho.surefire.osgibooter.AbstractUITestApplication.runTests(AbstractUITestApplication.java:44)
10:48:06 [2021-02-15T15:48:06.991Z] 	at org.eclipse.e4.ui.internal.workbench.swt.E4Testable$1.run(E4Testable.java:73)
10:48:06 [2021-02-15T15:48:06.991Z] 	at java.lang.Thread.run(Thread.java:748)
10:48:06 [2021-02-15T15:48:06.991Z] 
10:48:06 [2021-02-15T15:48:06.991Z] shouldReturnEqualForSameCommits(org.eclipse.egit.ui.internal.synchronize.model.GitModelCacheTest)  Time elapsed: 0.703 s
10:48:06 [2021-02-15T15:48:06.991Z] shouldReturnNotEqualWhenComparingCacheAndWorkingTree(org.eclipse.egit.ui.internal.synchronize.model.GitModelCacheTest)  Time elapsed: 0.74 s
10:48:06 [2021-02-15T15:48:06.991Z] shouldReturnNotEqualForDifferentRepositories(org.eclipse.egit.ui.internal.synchronize.model.GitModelCacheTest)  Time elapsed: 1.488 s
10:48:06 [2021-02-15T15:48:06.991Z] Running org.eclipse.egit.ui.internal.synchronize.model.GitModelTreeTest
10:48:11 [2021-02-15T15:48:11.357Z] Tests run: 6, Failures: 0, Errors: 0, Skipped: 0, Time elapsed: 3.914 s - in org.eclipse.egit.ui.internal.synchronize.model.GitModelTreeTest
10:48:11 [2021-02-15T15:48:11.357Z] shouldReturnNotEqualForDifferentLocation(org.eclipse.egit.ui.internal.synchronize.model.GitModelTreeTest)  Time elapsed: 0.604 s
10:48:11 [2021-02-15T15:48:11.357Z] shouldReturnNotEqualForTreeAndCacheTree(org.eclipse.egit.ui.internal.synchronize.model.GitModelTreeTest)  Time elapsed: 0.622 s
10:48:11 [2021-02-15T15:48:11.357Z] shouldReturnNotEqualForTreeAndCommit(org.eclipse.egit.ui.internal.synchronize.model.GitModelTreeTest)  Time elapsed: 0.713 s
10:48:11 [2021-02-15T15:48:11.357Z] shouldReturnEqualForSameBaseCommit(org.eclipse.egit.ui.internal.synchronize.model.GitModelTreeTest)  Time elapsed: 0.747 s
10:48:11 [2021-02-15T15:48:11.357Z] shouldReturnEqualForSameInstance(org.eclipse.egit.ui.internal.synchronize.model.GitModelTreeTest)  Time elapsed: 0.617 s
10:48:11 [2021-02-15T15:48:11.357Z] shouldReturnNotEqualForTreeAndBlob(org.eclipse.egit.ui.internal.synchronize.model.GitModelTreeTest)  Time elapsed: 0.593 s
10:48:11 [2021-02-15T15:48:11.357Z] Running org.eclipse.egit.ui.internal.synchronize.mapping.GitChangeSetSorterTest
10:48:11 [2021-02-15T15:48:11.357Z] Tests run: 23, Failures: 0, Errors: 0, Skipped: 0, Time elapsed: 0.245 s - in org.eclipse.egit.ui.internal.synchronize.mapping.GitChangeSetSorterTest
10:48:11 [2021-02-15T15:48:11.357Z] commitTreeShouldBeLessThanBlob(org.eclipse.egit.ui.internal.synchronize.mapping.GitChangeSetSorterTest)  Time elapsed: 0.031 s
10:48:11 [2021-02-15T15:48:11.357Z] commitTreeShouldBeLessThanTree(org.eclipse.egit.ui.internal.synchronize.mapping.GitChangeSetSorterTest)  Time elapsed: 0 s
10:48:11 [2021-02-15T15:48:11.357Z] blobShouldBeGreaterThanTree(org.eclipse.egit.ui.internal.synchronize.mapping.GitChangeSetSorterTest)  Time elapsed: 0 s
10:48:11 [2021-02-15T15:48:11.357Z] cacheTreeShouldBeLessThanCommit(org.eclipse.egit.ui.internal.synchronize.mapping.GitChangeSetSorterTest)  Time elapsed: 0 s
10:48:11 [2021-02-15T15:48:11.357Z] shouldOrderTreesAlphabetically(org.eclipse.egit.ui.internal.synchronize.mapping.GitChangeSetSorterTest)  Time elapsed: 0.21 s
10:48:11 [2021-02-15T15:48:11.357Z] commitTreeShouldBeGreaterThanCache(org.eclipse.egit.ui.internal.synchronize.mapping.GitChangeSetSorterTest)  Time elapsed: 0 s
10:48:11 [2021-02-15T15:48:11.357Z] blobShouldBeGreaterThanWorkingTree(org.eclipse.egit.ui.internal.synchronize.mapping.GitChangeSetSorterTest)  Time elapsed: 0 s
10:48:11 [2021-02-15T15:48:11.357Z] treeShouldBeGreaterThanCache(org.eclipse.egit.ui.internal.synchronize.mapping.GitChangeSetSorterTest)  Time elapsed: 0 s
10:48:11 [2021-02-15T15:48:11.357Z] treeShouldBeGreaterThanCommit(org.eclipse.egit.ui.internal.synchronize.mapping.GitChangeSetSorterTest)  Time elapsed: 0 s
10:48:11 [2021-02-15T15:48:11.357Z] workingTreeShouldBeLessThanCacheTree(org.eclipse.egit.ui.internal.synchronize.mapping.GitChangeSetSorterTest)  Time elapsed: 0 s
10:48:11 [2021-02-15T15:48:11.357Z] treeShouldBeGreaterThanWorkingTree(org.eclipse.egit.ui.internal.synchronize.mapping.GitChangeSetSorterTest)  Time elapsed: 0 s
10:48:11 [2021-02-15T15:48:11.357Z] blobShouldBeGreaterThanCache(org.eclipse.egit.ui.internal.synchronize.mapping.GitChangeSetSorterTest)  Time elapsed: 0 s
10:48:11 [2021-02-15T15:48:11.357Z] cacheTreeShouldBeLessThanBlob(org.eclipse.egit.ui.internal.synchronize.mapping.GitChangeSetSorterTest)  Time elapsed: 0 s
10:48:11 [2021-02-15T15:48:11.357Z] cacheTreeShouldBeLessThanTree(org.eclipse.egit.ui.internal.synchronize.mapping.GitChangeSetSorterTest)  Time elapsed: 0 s
10:48:11 [2021-02-15T15:48:11.357Z] shouldOrderBlobsAlphabetically(org.eclipse.egit.ui.internal.synchronize.mapping.GitChangeSetSorterTest)  Time elapsed: 0.001 s
10:48:11 [2021-02-15T15:48:11.357Z] commitTreeShouldBeGreaterThanWorkingTree(org.eclipse.egit.ui.internal.synchronize.mapping.GitChangeSetSorterTest)  Time elapsed: 0 s
10:48:11 [2021-02-15T15:48:11.357Z] treeShouldBeLessThanBlob(org.eclipse.egit.ui.internal.synchronize.mapping.GitChangeSetSorterTest)  Time elapsed: 0 s
10:48:11 [2021-02-15T15:48:11.357Z] cacheTreeShouldBeGreaterThanWorkingTree(org.eclipse.egit.ui.internal.synchronize.mapping.GitChangeSetSorterTest)  Time elapsed: 0 s
10:48:11 [2021-02-15T15:48:11.357Z] workingTreeShouldBeLessThanBlob(org.eclipse.egit.ui.internal.synchronize.mapping.GitChangeSetSorterTest)  Time elapsed: 0 s
10:48:11 [2021-02-15T15:48:11.357Z] workingTreeShouldBeLessThanTree(org.eclipse.egit.ui.internal.synchronize.mapping.GitChangeSetSorterTest)  Time elapsed: 0 s
10:48:11 [2021-02-15T15:48:11.358Z] shouldOrderCommitsByCommitDate(org.eclipse.egit.ui.internal.synchronize.mapping.GitChangeSetSorterTest)  Time elapsed: 0.001 s
10:48:11 [2021-02-15T15:48:11.358Z] workingTreeShouldBeLessThanCommit(org.eclipse.egit.ui.internal.synchronize.mapping.GitChangeSetSorterTest)  Time elapsed: 0 s
10:48:11 [2021-02-15T15:48:11.358Z] blobShouldBeGreaterThanCommit(org.eclipse.egit.ui.internal.synchronize.mapping.GitChangeSetSorterTest)  Time elapsed: 0 s
10:48:11 [2021-02-15T15:48:11.358Z] Running org.eclipse.egit.ui.internal.CompareUtilsTest
10:48:13 [2021-02-15T15:48:13.894Z] Tests run: 3, Failures: 0, Errors: 0, Skipped: 0, Time elapsed: 2.927 s - in org.eclipse.egit.ui.internal.CompareUtilsTest
10:48:13 [2021-02-15T15:48:13.894Z] testIndexEditWithAttributes(org.eclipse.egit.ui.internal.CompareUtilsTest)  Time elapsed: 0.98 s
10:48:13 [2021-02-15T15:48:13.894Z] testIndexEdit(org.eclipse.egit.ui.internal.CompareUtilsTest)  Time elapsed: 1.153 s
10:48:13 [2021-02-15T15:48:13.894Z] testIndexEditExecutable(org.eclipse.egit.ui.internal.CompareUtilsTest)  Time elapsed: 0.785 s
10:48:13 [2021-02-15T15:48:13.894Z] Running org.eclipse.egit.ui.internal.commit.DiffEditorOutlinePageSortingTest
10:48:13 [2021-02-15T15:48:13.894Z] Tests run: 1, Failures: 0, Errors: 0, Skipped: 0, Time elapsed: 0.001 s - in org.eclipse.egit.ui.internal.commit.DiffEditorOutlinePageSortingTest
10:48:13 [2021-02-15T15:48:13.894Z] testSort1(org.eclipse.egit.ui.internal.commit.DiffEditorOutlinePageSortingTest)  Time elapsed: 0 s
10:48:13 [2021-02-15T15:48:13.894Z] Running org.eclipse.egit.ui.internal.clone.SmartImportWizardTest
10:48:14 [2021-02-15T15:48:14.669Z] 
10:48:14 [2021-02-15T15:48:14.669Z] (SWT:1786): Gtk-WARNING **: 15:48:14.626: Negative content width -1 (allocation 1, extents 1x1) while allocating gadget (node trough, owner GtkProgressBar)
10:48:14 [2021-02-15T15:48:14.669Z] 
10:48:14 [2021-02-15T15:48:14.669Z] (SWT:1786): Gtk-WARNING **: 15:48:14.628: Negative content height -1 (allocation 1, extents 1x1) while allocating gadget (node scrolledwindow, owner GtkScrolledWindow)
10:48:14 [2021-02-15T15:48:14.926Z] Tests run: 1, Failures: 0, Errors: 0, Skipped: 0, Time elapsed: 1.086 s - in org.eclipse.egit.ui.internal.clone.SmartImportWizardTest
10:48:14 [2021-02-15T15:48:14.926Z] test(org.eclipse.egit.ui.internal.clone.SmartImportWizardTest)  Time elapsed: 1.084 s
10:48:14 [2021-02-15T15:48:14.926Z] Running org.eclipse.egit.ui.internal.push.PushBranchWizardTest
10:48:16 [2021-02-15T15:48:16.309Z] 
10:48:16 [2021-02-15T15:48:16.309Z] (SWT:1786): Gtk-CRITICAL **: 15:48:16.210: gtk_box_gadget_distribute: assertion 'size >= 0' failed in GtkScrollbar
10:48:16 [2021-02-15T15:48:16.309Z] 
10:48:16 [2021-02-15T15:48:16.309Z] (SWT:1786): Gtk-CRITICAL **: 15:48:16.211: gtk_box_gadget_distribute: assertion 'size >= 0' failed in GtkScrollbar
10:48:16 [2021-02-15T15:48:16.309Z] 
10:48:16 [2021-02-15T15:48:16.309Z] (SWT:1786): Gtk-CRITICAL **: 15:48:16.215: gtk_box_gadget_distribute: assertion 'size >= 0' failed in GtkScrollbar
10:48:16 [2021-02-15T15:48:16.309Z] 
10:48:16 [2021-02-15T15:48:16.309Z] (SWT:1786): Gtk-CRITICAL **: 15:48:16.219: gtk_box_gadget_distribute: assertion 'size >= 0' failed in GtkScrollbar
10:48:28 [2021-02-15T15:48:28.499Z] Tests run: 9, Failures: 0, Errors: 0, Skipped: 0, Time elapsed: 12.735 s - in org.eclipse.egit.ui.internal.push.PushBranchWizardTest
10:48:28 [2021-02-15T15:48:28.499Z] pushHeadToExistingRemote(org.eclipse.egit.ui.internal.push.PushBranchWizardTest)  Time elapsed: 1.767 s
10:48:28 [2021-02-15T15:48:28.499Z] pushWithRemoteUpstreamConfiguration(org.eclipse.egit.ui.internal.push.PushBranchWizardTest)  Time elapsed: 1.205 s
10:48:28 [2021-02-15T15:48:28.499Z] pushWithDifferentBranchName(org.eclipse.egit.ui.internal.push.PushBranchWizardTest)  Time elapsed: 1.324 s
10:48:28 [2021-02-15T15:48:28.499Z] pushToExistingRemoteAndSetRebase(org.eclipse.egit.ui.internal.push.PushBranchWizardTest)  Time elapsed: 1.689 s
10:48:28 [2021-02-15T15:48:28.499Z] pushToNewRemote(org.eclipse.egit.ui.internal.push.PushBranchWizardTest)  Time elapsed: 1.322 s
10:48:28 [2021-02-15T15:48:28.500Z] pushToExistingRemoteWithoutConfiguringUpstream(org.eclipse.egit.ui.internal.push.PushBranchWizardTest)  Time elapsed: 1.514 s
10:48:28 [2021-02-15T15:48:28.500Z] pushToExistingRemote(org.eclipse.egit.ui.internal.push.PushBranchWizardTest)  Time elapsed: 1.135 s
10:48:28 [2021-02-15T15:48:28.500Z] pushWhenNoRemoteExistsYet(org.eclipse.egit.ui.internal.push.PushBranchWizardTest)  Time elapsed: 1.487 s
10:48:28 [2021-02-15T15:48:28.500Z] pushWithLocalUpstreamConfiguration(org.eclipse.egit.ui.internal.push.PushBranchWizardTest)  Time elapsed: 1.258 s
10:48:28 [2021-02-15T15:48:28.500Z] Running org.eclipse.egit.ui.internal.push.PushTagsWizardTest
10:48:28 [2021-02-15T15:48:28.758Z] Tests run: 1, Failures: 0, Errors: 0, Skipped: 0, Time elapsed: 1.09 s - in org.eclipse.egit.ui.internal.push.PushTagsWizardTest
10:48:28 [2021-02-15T15:48:28.758Z] pushTag(org.eclipse.egit.ui.internal.push.PushTagsWizardTest)  Time elapsed: 1.084 s
10:48:28 [2021-02-15T15:48:28.758Z] Running org.eclipse.egit.ui.internal.push.PushToUpstreamTest
10:48:32 [2021-02-15T15:48:32.140Z] Tests run: 3, Failures: 0, Errors: 0, Skipped: 0, Time elapsed: 3.17 s - in org.eclipse.egit.ui.internal.push.PushToUpstreamTest
10:48:32 [2021-02-15T15:48:32.140Z] pushWithExistingUpstreamConfiguration(org.eclipse.egit.ui.internal.push.PushToUpstreamTest)  Time elapsed: 1.043 s
10:48:32 [2021-02-15T15:48:32.140Z] pushWithoutConfig(org.eclipse.egit.ui.internal.push.PushToUpstreamTest)  Time elapsed: 1.136 s
10:48:32 [2021-02-15T15:48:32.140Z] pushWithDefaultRemoteWithPushRefSpecs(org.eclipse.egit.ui.internal.push.PushToUpstreamTest)  Time elapsed: 0.98 s
10:48:32 [2021-02-15T15:48:32.140Z] Running org.eclipse.egit.ui.internal.branch.BranchProjectTrackerTest
10:48:33 [2021-02-15T15:48:33.071Z] Tests run: 1, Failures: 0, Errors: 0, Skipped: 0, Time elapsed: 1.101 s - in org.eclipse.egit.ui.internal.branch.BranchProjectTrackerTest
10:48:33 [2021-02-15T15:48:33.071Z] twoProjectsWithOnlyOneOnBranch(org.eclipse.egit.ui.internal.branch.BranchProjectTrackerTest)  Time elapsed: 1.096 s
10:48:33 [2021-02-15T15:48:33.071Z] Running org.eclipse.egit.ui.internal.decorators.DecoratableResourceAdapterTest
10:48:48 [2021-02-15T15:48:48.042Z] Tests run: 13, Failures: 0, Errors: 0, Skipped: 0, Time elapsed: 12.992 s - in org.eclipse.egit.ui.internal.decorators.DecoratableResourceAdapterTest
10:48:48 [2021-02-15T15:48:48.042Z] testDecorationDeletedFile(org.eclipse.egit.ui.internal.decorators.DecoratableResourceAdapterTest)  Time elapsed: 1.487 s
10:48:48 [2021-02-15T15:48:48.042Z] testDecorationModifiedFile(org.eclipse.egit.ui.internal.decorators.DecoratableResourceAdapterTest)  Time elapsed: 0.827 s
10:48:48 [2021-02-15T15:48:48.042Z] testDecorationEmptyProject(org.eclipse.egit.ui.internal.decorators.DecoratableResourceAdapterTest)  Time elapsed: 0.903 s
10:48:48 [2021-02-15T15:48:48.042Z] testDecorationConflictingFile(org.eclipse.egit.ui.internal.decorators.DecoratableResourceAdapterTest)  Time elapsed: 1.015 s
10:48:48 [2021-02-15T15:48:48.042Z] testDecorationNewEmptyFolder(org.eclipse.egit.ui.internal.decorators.DecoratableResourceAdapterTest)  Time elapsed: 0.97 s
10:48:48 [2021-02-15T15:48:48.042Z] testDecorationFolderPrefixOfOtherFolder(org.eclipse.egit.ui.internal.decorators.DecoratableResourceAdapterTest)  Time elapsed: 0.819 s
10:48:48 [2021-02-15T15:48:48.042Z] testDecorationNewFileInOneSubfolder(org.eclipse.egit.ui.internal.decorators.DecoratableResourceAdapterTest)  Time elapsed: 0.991 s
10:48:48 [2021-02-15T15:48:48.042Z] testDecorationNewFile(org.eclipse.egit.ui.internal.decorators.DecoratableResourceAdapterTest)  Time elapsed: 0.913 s
10:48:48 [2021-02-15T15:48:48.043Z] testDecorationNewFileInSubfolder(org.eclipse.egit.ui.internal.decorators.DecoratableResourceAdapterTest)  Time elapsed: 0.989 s
10:48:48 [2021-02-15T15:48:48.043Z] testDecorationCommittedFile(org.eclipse.egit.ui.internal.decorators.DecoratableResourceAdapterTest)  Time elapsed: 1.016 s
10:48:48 [2021-02-15T15:48:48.043Z] testDecorationFileInIgnoredFolder(org.eclipse.egit.ui.internal.decorators.DecoratableResourceAdapterTest)  Time elapsed: 0.993 s
10:48:48 [2021-02-15T15:48:48.043Z] testDecorationIgnoredFile(org.eclipse.egit.ui.internal.decorators.DecoratableResourceAdapterTest)  Time elapsed: 1.047 s
10:48:48 [2021-02-15T15:48:48.043Z] testDecorationAddedFile(org.eclipse.egit.ui.internal.decorators.DecoratableResourceAdapterTest)  Time elapsed: 0.988 s
10:48:48 [2021-02-15T15:48:48.043Z] Running org.eclipse.egit.ui.internal.decorators.DecoratableWorkingSetTest
10:48:54 [2021-02-15T15:48:54.633Z] Tests run: 7, Failures: 0, Errors: 0, Skipped: 0, Time elapsed: 7.921 s - in org.eclipse.egit.ui.internal.decorators.DecoratableWorkingSetTest
10:48:54 [2021-02-15T15:48:54.633Z] testAnyConflictsIsConflicts(org.eclipse.egit.ui.internal.decorators.DecoratableWorkingSetTest)  Time elapsed: 1.578 s
10:48:54 [2021-02-15T15:48:54.633Z] testUntrackedContentIsUndecorated(org.eclipse.egit.ui.internal.decorators.DecoratableWorkingSetTest)  Time elapsed: 0.938 s
10:48:54 [2021-02-15T15:48:54.633Z] testAnyDirtyIsDirty(org.eclipse.egit.ui.internal.decorators.DecoratableWorkingSetTest)  Time elapsed: 1.418 s
10:48:54 [2021-02-15T15:48:54.633Z] testDecorationConflictingOverDirty(org.eclipse.egit.ui.internal.decorators.DecoratableWorkingSetTest)  Time elapsed: 1.244 s
10:48:54 [2021-02-15T15:48:54.633Z] testEmptyWorkingSetIsUndecorated(org.eclipse.egit.ui.internal.decorators.DecoratableWorkingSetTest)  Time elapsed: 0.731 s
10:48:54 [2021-02-15T15:48:54.633Z] testStagingStateHasNoInfluence_Modified(org.eclipse.egit.ui.internal.decorators.DecoratableWorkingSetTest)  Time elapsed: 0.841 s
10:48:54 [2021-02-15T15:48:54.633Z] testAnyTrackedIsTracked(org.eclipse.egit.ui.internal.decorators.DecoratableWorkingSetTest)  Time elapsed: 1.166 s
10:48:54 [2021-02-15T15:48:54.633Z] Running org.eclipse.egit.ui.internal.decorators.DecoratableResourceMappingTest
10:49:02 [2021-02-15T15:49:02.775Z] Tests run: 9, Failures: 0, Errors: 0, Skipped: 0, Time elapsed: 8.471 s - in org.eclipse.egit.ui.internal.decorators.DecoratableResourceMappingTest
10:49:02 [2021-02-15T15:49:02.775Z] testAnyConflictsIsConflicts(org.eclipse.egit.ui.internal.decorators.DecoratableResourceMappingTest)  Time elapsed: 0.999 s
10:49:02 [2021-02-15T15:49:02.775Z] testSameStagingStateIsState_Added(org.eclipse.egit.ui.internal.decorators.DecoratableResourceMappingTest)  Time elapsed: 1.016 s
10:49:02 [2021-02-15T15:49:02.775Z] testAnyDirtyIsDirty(org.eclipse.egit.ui.internal.decorators.DecoratableResourceMappingTest)  Time elapsed: 0.944 s
10:49:02 [2021-02-15T15:49:02.775Z] testMixedStagingStateIsModified_RemovedAdded(org.eclipse.egit.ui.internal.decorators.DecoratableResourceMappingTest)  Time elapsed: 0.81 s
10:49:02 [2021-02-15T15:49:02.775Z] testAllIgnoredIsUnstaged(org.eclipse.egit.ui.internal.decorators.DecoratableResourceMappingTest)  Time elapsed: 0.799 s
10:49:02 [2021-02-15T15:49:02.775Z] testDecorationConflictingOverDirty(org.eclipse.egit.ui.internal.decorators.DecoratableResourceMappingTest)  Time elapsed: 0.925 s
10:49:02 [2021-02-15T15:49:02.775Z] testMixedStagingStateIsModified_AddedNotStaged(org.eclipse.egit.ui.internal.decorators.DecoratableResourceMappingTest)  Time elapsed: 0.807 s
10:49:02 [2021-02-15T15:49:02.775Z] testNewResourceMappingIsUnstaged(org.eclipse.egit.ui.internal.decorators.DecoratableResourceMappingTest)  Time elapsed: 0.806 s
10:49:02 [2021-02-15T15:49:02.775Z] testAnyTrackedIsTracked(org.eclipse.egit.ui.internal.decorators.DecoratableResourceMappingTest)  Time elapsed: 1.318 s
10:49:02 [2021-02-15T15:49:02.775Z] Running org.eclipse.egit.ui.internal.fetch.FetchGerritChangeTest
10:49:02 [2021-02-15T15:49:02.775Z] Tests run: 15, Failures: 0, Errors: 0, Skipped: 0, Time elapsed: 0.005 s - in org.eclipse.egit.ui.internal.fetch.FetchGerritChangeTest
10:49:02 [2021-02-15T15:49:02.775Z] testChangeStringNoDigits(org.eclipse.egit.ui.internal.fetch.FetchGerritChangeTest)  Time elapsed: 0.002 s
10:49:02 [2021-02-15T15:49:02.775Z] testChangeStringOverflow(org.eclipse.egit.ui.internal.fetch.FetchGerritChangeTest)  Time elapsed: 0 s
10:49:02 [2021-02-15T15:49:02.775Z] testChangeStringTwoNumbers(org.eclipse.egit.ui.internal.fetch.FetchGerritChangeTest)  Time elapsed: 0.001 s
10:49:02 [2021-02-15T15:49:02.775Z] testFromRef(org.eclipse.egit.ui.internal.fetch.FetchGerritChangeTest)  Time elapsed: 0 s
10:49:02 [2021-02-15T15:49:02.775Z] testChangeStringNegative(org.eclipse.egit.ui.internal.fetch.FetchGerritChangeTest)  Time elapsed: 0 s
10:49:02 [2021-02-15T15:49:02.775Z] testChangeStringUri(org.eclipse.egit.ui.internal.fetch.FetchGerritChangeTest)  Time elapsed: 0 s
10:49:02 [2021-02-15T15:49:02.775Z] testRefFromChange(org.eclipse.egit.ui.internal.fetch.FetchGerritChangeTest)  Time elapsed: 0 s
10:49:02 [2021-02-15T15:49:02.775Z] testChangeStringUriNonsense(org.eclipse.egit.ui.internal.fetch.FetchGerritChangeTest)  Time elapsed: 0 s
10:49:02 [2021-02-15T15:49:02.775Z] testChangeStringThreeNumbers(org.eclipse.egit.ui.internal.fetch.FetchGerritChangeTest)  Time elapsed: 0 s
10:49:02 [2021-02-15T15:49:02.775Z] testChangeStringMultiline(org.eclipse.egit.ui.internal.fetch.FetchGerritChangeTest)  Time elapsed: 0 s
10:49:02 [2021-02-15T15:49:02.775Z] testChangeStringSingleNumber(org.eclipse.egit.ui.internal.fetch.FetchGerritChangeTest)  Time elapsed: 0 s
10:49:02 [2021-02-15T15:49:02.775Z] testChangeRefs(org.eclipse.egit.ui.internal.fetch.FetchGerritChangeTest)  Time elapsed: 0 s
10:49:02 [2021-02-15T15:49:02.775Z] testChangeStringEmpty(org.eclipse.egit.ui.internal.fetch.FetchGerritChangeTest)  Time elapsed: 0 s
10:49:02 [2021-02-15T15:49:02.775Z] testChangeStringNull(org.eclipse.egit.ui.internal.fetch.FetchGerritChangeTest)  Time elapsed: 0 s
10:49:02 [2021-02-15T15:49:02.775Z] testChangeStringZero(org.eclipse.egit.ui.internal.fetch.FetchGerritChangeTest)  Time elapsed: 0 s
10:49:02 [2021-02-15T15:49:02.775Z] Running org.eclipse.egit.ui.submodule.SubmoduleUpdateTest
10:49:03 [2021-02-15T15:49:03.357Z] 
10:49:03 [2021-02-15T15:49:03.357Z] (SWT:1786): Gtk-WARNING **: 15:49:03.142: Negative content width -6 (allocation 1, extents 4x3) while allocating gadget (node toolbar, owner GtkToolbar)
10:49:05 [2021-02-15T15:49:05.974Z] 
10:49:05 [2021-02-15T15:49:05.974Z] (SWT:1786): Gtk-WARNING **: 15:49:05.818: Negative content width -6 (allocation 1, extents 4x3) while allocating gadget (node toolbar, owner GtkToolbar)
10:49:05 [2021-02-15T15:49:05.974Z] Tests run: 1, Failures: 0, Errors: 0, Skipped: 0, Time elapsed: 3.578 s - in org.eclipse.egit.ui.submodule.SubmoduleUpdateTest
10:49:05 [2021-02-15T15:49:05.974Z] updateSubmodule(org.eclipse.egit.ui.submodule.SubmoduleUpdateTest)  Time elapsed: 3.572 s
10:49:05 [2021-02-15T15:49:05.974Z] Running org.eclipse.egit.ui.submodule.SubmoduleAddTest
10:49:06 [2021-02-15T15:49:06.930Z] 
10:49:06 [2021-02-15T15:49:06.930Z] (SWT:1786): Gtk-WARNING **: 15:49:06.744: Negative content width -6 (allocation 1, extents 4x3) while allocating gadget (node toolbar, owner GtkToolbar)
10:49:09 [2021-02-15T15:49:09.460Z] 
10:49:09 [2021-02-15T15:49:09.460Z] (SWT:1786): Gtk-WARNING **: 15:49:09.215: Negative content width -6 (allocation 1, extents 4x3) while allocating gadget (node toolbar, owner GtkToolbar)
10:49:09 [2021-02-15T15:49:09.460Z] Tests run: 1, Failures: 0, Errors: 0, Skipped: 0, Time elapsed: 3.416 s - in org.eclipse.egit.ui.submodule.SubmoduleAddTest
10:49:09 [2021-02-15T15:49:09.460Z] addAtRoot(org.eclipse.egit.ui.submodule.SubmoduleAddTest)  Time elapsed: 3.412 s
10:49:09 [2021-02-15T15:49:09.460Z] Running org.eclipse.egit.ui.submodule.SubmoduleSyncTest
10:49:10 [2021-02-15T15:49:10.393Z] 
10:49:10 [2021-02-15T15:49:10.393Z] (SWT:1786): Gtk-WARNING **: 15:49:10.173: Negative content width -6 (allocation 1, extents 4x3) while allocating gadget (node toolbar, owner GtkToolbar)
10:49:13 [2021-02-15T15:49:13.681Z] 
10:49:13 [2021-02-15T15:49:13.681Z] (SWT:1786): Gtk-WARNING **: 15:49:13.147: Negative content width -6 (allocation 1, extents 4x3) while allocating gadget (node toolbar, owner GtkToolbar)
10:49:13 [2021-02-15T15:49:13.681Z] Tests run: 1, Failures: 0, Errors: 0, Skipped: 0, Time elapsed: 3.905 s - in org.eclipse.egit.ui.submodule.SubmoduleSyncTest
10:49:13 [2021-02-15T15:49:13.681Z] syncSubmodule(org.eclipse.egit.ui.submodule.SubmoduleSyncTest)  Time elapsed: 3.9 s
10:49:13 [2021-02-15T15:49:13.681Z] Running org.eclipse.egit.ui.httpauth.PushTest
10:49:13 [2021-02-15T15:49:13.681Z] 2021-02-15 15:49:13.386:INFO:oejs.Server:WorkbenchTestable: jetty-9.4.36.v20210114; built: 2021-01-20T13:15:45.965Z; git: 238ec6997c7806b055319a6d11f8ae7564adc0de; jvm 1.8.0_252-b09
10:49:13 [2021-02-15T15:49:13.682Z] 2021-02-15 15:49:13.415:INFO:oejsh.ContextHandler:WorkbenchTestable: Started o.e.j.s.ServletContextHandler@6cdc375{/sbasic,null,AVAILABLE}
10:49:13 [2021-02-15T15:49:13.682Z] 2021-02-15 15:49:13.424:INFO:oejs.AbstractConnector:WorkbenchTestable: Started ServerConnector@1e1b1b35{HTTP/1.1, (http/1.1)}{127.0.0.1:46085}
10:49:13 [2021-02-15T15:49:13.682Z] 2021-02-15 15:49:13.424:INFO:oejs.Server:WorkbenchTestable: Started @809594ms
10:49:14 [2021-02-15T15:49:14.269Z] 
10:49:14 [2021-02-15T15:49:14.269Z] (SWT:1786): Gtk-CRITICAL **: 15:49:14.039: gtk_box_gadget_distribute: assertion 'size >= 0' failed in GtkCheckButton
10:49:15 [2021-02-15T15:49:15.207Z] 2021-02-15 15:49:14.926:INFO:oejs.AbstractConnector:WorkbenchTestable: Stopped ServerConnector@1e1b1b35{HTTP/1.1, (http/1.1)}{127.0.0.1:0}
10:49:15 [2021-02-15T15:49:15.207Z] 2021-02-15 15:49:14.926:INFO:oejsh.ContextHandler:WorkbenchTestable: Stopped o.e.j.s.ServletContextHandler@6cdc375{/sbasic,null,STOPPED}
10:49:15 [2021-02-15T15:49:15.207Z] Tests run: 1, Failures: 0, Errors: 0, Skipped: 0, Time elapsed: 1.673 s - in org.eclipse.egit.ui.httpauth.PushTest
10:49:15 [2021-02-15T15:49:15.207Z] testPush(org.eclipse.egit.ui.httpauth.PushTest)  Time elapsed: 1.673 s
10:49:15 [2021-02-15T15:49:15.207Z] Running org.eclipse.egit.ui.search.CommitSearchDialogTest
10:49:15 [2021-02-15T15:49:15.791Z] 
10:49:15 [2021-02-15T15:49:15.791Z] (SWT:1786): Gtk-WARNING **: 15:49:15.744: Negative content width -6 (allocation 1, extents 4x3) while allocating gadget (node toolbar, owner GtkToolbar)
10:49:15 [2021-02-15T15:49:15.791Z] 
10:49:15 [2021-02-15T15:49:15.791Z] (SWT:1786): Gtk-WARNING **: 15:49:15.762: Negative content width -6 (allocation 1, extents 4x3) while allocating gadget (node toolbar, owner GtkToolbar)
10:49:16 [2021-02-15T15:49:16.050Z] 
10:49:16 [2021-02-15T15:49:16.050Z] (SWT:1786): Gtk-WARNING **: 15:49:15.821: Negative content width -6 (allocation 1, extents 4x3) while allocating gadget (node toolbar, owner GtkToolbar)
10:49:16 [2021-02-15T15:49:16.050Z] 
10:49:16 [2021-02-15T15:49:16.050Z] (SWT:1786): Gtk-WARNING **: 15:49:15.904: Negative content width -6 (allocation 1, extents 4x3) while allocating gadget (node toolbar, owner GtkToolbar)
10:49:16 [2021-02-15T15:49:16.620Z] 
10:49:16 [2021-02-15T15:49:16.620Z] (SWT:1786): Gtk-WARNING **: 15:49:16.579: Negative content width -6 (allocation 1, extents 4x3) while allocating gadget (node toolbar, owner GtkToolbar)
10:49:16 [2021-02-15T15:49:16.876Z] Tests run: 1, Failures: 0, Errors: 0, Skipped: 0, Time elapsed: 1.773 s - in org.eclipse.egit.ui.search.CommitSearchDialogTest
10:49:16 [2021-02-15T15:49:16.876Z] openCommitTabOnSearchDialog(org.eclipse.egit.ui.search.CommitSearchDialogTest)  Time elapsed: 1.761 s
10:49:16 [2021-02-15T15:49:16.876Z] Running org.eclipse.egit.ui.search.CommitSearchQueryTest
10:49:22 [2021-02-15T15:49:22.141Z] Tests run: 7, Failures: 0, Errors: 0, Skipped: 0, Time elapsed: 4.755 s - in org.eclipse.egit.ui.search.CommitSearchQueryTest
10:49:22 [2021-02-15T15:49:22.141Z] testQuery(org.eclipse.egit.ui.search.CommitSearchQueryTest)  Time elapsed: 0.693 s
10:49:22 [2021-02-15T15:49:22.141Z] testMatchMessage(org.eclipse.egit.ui.search.CommitSearchQueryTest)  Time elapsed: 0.662 s
10:49:22 [2021-02-15T15:49:22.141Z] testCaseInsensitive(org.eclipse.egit.ui.search.CommitSearchQueryTest)  Time elapsed: 0.623 s
10:49:22 [2021-02-15T15:49:22.141Z] testMatchCommit(org.eclipse.egit.ui.search.CommitSearchQueryTest)  Time elapsed: 0.626 s
10:49:22 [2021-02-15T15:49:22.141Z] testMatchParent(org.eclipse.egit.ui.search.CommitSearchQueryTest)  Time elapsed: 0.641 s
10:49:22 [2021-02-15T15:49:22.141Z] testMatchTree(org.eclipse.egit.ui.search.CommitSearchQueryTest)  Time elapsed: 0.865 s
10:49:22 [2021-02-15T15:49:22.141Z] testEmptyMatches(org.eclipse.egit.ui.search.CommitSearchQueryTest)  Time elapsed: 0.624 s
10:49:22 [2021-02-15T15:49:22.141Z] Running org.eclipse.egit.ui.gitflow.CommandEnablementTest
10:49:23 [2021-02-15T15:49:23.076Z] 
10:49:23 [2021-02-15T15:49:23.076Z] (SWT:1786): Gtk-WARNING **: 15:49:22.978: Negative content width -6 (allocation 1, extents 4x3) while allocating gadget (node toolbar, owner GtkToolbar)
10:49:23 [2021-02-15T15:49:23.334Z] 
10:49:23 [2021-02-15T15:49:23.334Z] (SWT:1786): Gtk-WARNING **: 15:49:23.174: Negative content width -6 (allocation 1, extents 4x3) while allocating gadget (node toolbar, owner GtkToolbar)
10:49:23 [2021-02-15T15:49:23.604Z] Tests run: 2, Failures: 0, Errors: 0, Skipped: 0, Time elapsed: 1.89 s - in org.eclipse.egit.ui.gitflow.CommandEnablementTest
10:49:23 [2021-02-15T15:49:23.604Z] testPackageExplorerStartFinishEnablement(org.eclipse.egit.ui.gitflow.CommandEnablementTest)  Time elapsed: 0.815 s
10:49:23 [2021-02-15T15:49:23.604Z] testRepositoryViewStartFinishEnablement(org.eclipse.egit.ui.gitflow.CommandEnablementTest)  Time elapsed: 1.067 s
10:49:23 [2021-02-15T15:49:23.604Z] Running org.eclipse.egit.ui.gitflow.FeatureFinishSquashHandlerTest
10:49:24 [2021-02-15T15:49:24.539Z] 
10:49:24 [2021-02-15T15:49:24.539Z] (SWT:1786): Gtk-CRITICAL **: 15:49:24.331: gtk_box_gadget_distribute: assertion 'size >= 0' failed in GtkScrollbar
10:49:24 [2021-02-15T15:49:24.539Z] 
10:49:24 [2021-02-15T15:49:24.539Z] (SWT:1786): Gtk-CRITICAL **: 15:49:24.351: gtk_box_gadget_distribute: assertion 'size >= 0' failed in GtkScrollbar
10:49:24 [2021-02-15T15:49:24.539Z] 
10:49:24 [2021-02-15T15:49:24.539Z] (SWT:1786): Gtk-CRITICAL **: 15:49:24.368: gtk_box_gadget_distribute: assertion 'size >= 0' failed in GtkScrollbar
10:49:24 [2021-02-15T15:49:24.539Z] 
10:49:24 [2021-02-15T15:49:24.539Z] (SWT:1786): Gtk-CRITICAL **: 15:49:24.384: gtk_box_gadget_distribute: assertion 'size >= 0' failed in GtkScrollbar
10:49:24 [2021-02-15T15:49:24.539Z] 
10:49:24 [2021-02-15T15:49:24.539Z] (SWT:1786): Gtk-CRITICAL **: 15:49:24.401: gtk_box_gadget_distribute: assertion 'size >= 0' failed in GtkScrollbar
10:49:24 [2021-02-15T15:49:24.539Z] 
10:49:24 [2021-02-15T15:49:24.539Z] (SWT:1786): Gtk-CRITICAL **: 15:49:24.418: gtk_box_gadget_distribute: assertion 'size >= 0' failed in GtkScrollbar
10:49:24 [2021-02-15T15:49:24.539Z] 
10:49:24 [2021-02-15T15:49:24.539Z] (SWT:1786): Gtk-CRITICAL **: 15:49:24.434: gtk_box_gadget_distribute: assertion 'size >= 0' failed in GtkScrollbar
10:49:24 [2021-02-15T15:49:24.539Z] 
10:49:24 [2021-02-15T15:49:24.539Z] (SWT:1786): Gtk-CRITICAL **: 15:49:24.450: gtk_box_gadget_distribute: assertion 'size >= 0' failed in GtkScrollbar
10:49:24 [2021-02-15T15:49:24.539Z] 
10:49:24 [2021-02-15T15:49:24.539Z] (SWT:1786): Gtk-CRITICAL **: 15:49:24.467: gtk_box_gadget_distribute: assertion 'size >= 0' failed in GtkScrollbar
10:49:24 [2021-02-15T15:49:24.539Z] 
10:49:24 [2021-02-15T15:49:24.539Z] (SWT:1786): Gtk-CRITICAL **: 15:49:24.484: gtk_box_gadget_distribute: assertion 'size >= 0' failed in GtkScrollbar
10:49:25 [2021-02-15T15:49:25.124Z] 
10:49:25 [2021-02-15T15:49:25.124Z] (SWT:1786): Gtk-CRITICAL **: 15:49:25.104: gtk_box_gadget_distribute: assertion 'size >= 0' failed in GtkScrollbar
10:49:26 [2021-02-15T15:49:26.067Z] Tests run: 1, Failures: 0, Errors: 0, Skipped: 0, Time elapsed: 2.542 s - in org.eclipse.egit.ui.gitflow.FeatureFinishSquashHandlerTest
10:49:26 [2021-02-15T15:49:26.067Z] testFeatureFinishSquash(org.eclipse.egit.ui.gitflow.FeatureFinishSquashHandlerTest)  Time elapsed: 2.538 s
10:49:26 [2021-02-15T15:49:26.067Z] Running org.eclipse.egit.ui.gitflow.FeatureStartFinishHandlerTest
10:49:27 [2021-02-15T15:49:27.009Z] 
10:49:27 [2021-02-15T15:49:27.009Z] (SWT:1786): Gtk-CRITICAL **: 15:49:26.680: gtk_box_gadget_distribute: assertion 'size >= 0' failed in GtkScrollbar
10:49:27 [2021-02-15T15:49:27.009Z] 
10:49:27 [2021-02-15T15:49:27.009Z] (SWT:1786): Gtk-CRITICAL **: 15:49:26.698: gtk_box_gadget_distribute: assertion 'size >= 0' failed in GtkScrollbar
10:49:27 [2021-02-15T15:49:27.009Z] 
10:49:27 [2021-02-15T15:49:27.009Z] (SWT:1786): Gtk-CRITICAL **: 15:49:26.714: gtk_box_gadget_distribute: assertion 'size >= 0' failed in GtkScrollbar
10:49:27 [2021-02-15T15:49:27.009Z] 
10:49:27 [2021-02-15T15:49:27.009Z] (SWT:1786): Gtk-CRITICAL **: 15:49:26.730: gtk_box_gadget_distribute: assertion 'size >= 0' failed in GtkScrollbar
10:49:27 [2021-02-15T15:49:27.009Z] 
10:49:27 [2021-02-15T15:49:27.009Z] (SWT:1786): Gtk-CRITICAL **: 15:49:26.753: gtk_box_gadget_distribute: assertion 'size >= 0' failed in GtkScrollbar
10:49:27 [2021-02-15T15:49:27.009Z] 
10:49:27 [2021-02-15T15:49:27.009Z] (SWT:1786): Gtk-CRITICAL **: 15:49:26.763: gtk_box_gadget_distribute: assertion 'size >= 0' failed in GtkScrollbar
10:49:27 [2021-02-15T15:49:27.009Z] 
10:49:27 [2021-02-15T15:49:27.009Z] (SWT:1786): Gtk-CRITICAL **: 15:49:26.780: gtk_box_gadget_distribute: assertion 'size >= 0' failed in GtkScrollbar
10:49:27 [2021-02-15T15:49:27.009Z] 
10:49:27 [2021-02-15T15:49:27.009Z] (SWT:1786): Gtk-CRITICAL **: 15:49:26.797: gtk_box_gadget_distribute: assertion 'size >= 0' failed in GtkScrollbar
10:49:27 [2021-02-15T15:49:27.009Z] 
10:49:27 [2021-02-15T15:49:27.009Z] (SWT:1786): Gtk-CRITICAL **: 15:49:26.814: gtk_box_gadget_distribute: assertion 'size >= 0' failed in GtkScrollbar
10:49:27 [2021-02-15T15:49:27.009Z] 
10:49:27 [2021-02-15T15:49:27.009Z] (SWT:1786): Gtk-CRITICAL **: 15:49:26.830: gtk_box_gadget_distribute: assertion 'size >= 0' failed in GtkScrollbar
10:49:27 [2021-02-15T15:49:27.009Z] 
10:49:27 [2021-02-15T15:49:27.009Z] (SWT:1786): Gtk-CRITICAL **: 15:49:26.846: gtk_box_gadget_distribute: assertion 'size >= 0' failed in GtkScrollbar
10:49:27 [2021-02-15T15:49:27.009Z] 
10:49:27 [2021-02-15T15:49:27.009Z] (SWT:1786): Gtk-CRITICAL **: 15:49:26.864: gtk_box_gadget_distribute: assertion 'size >= 0' failed in GtkScrollbar
10:49:27 [2021-02-15T15:49:27.009Z] 
10:49:27 [2021-02-15T15:49:27.009Z] (SWT:1786): Gtk-CRITICAL **: 15:49:26.879: gtk_box_gadget_distribute: assertion 'size >= 0' failed in GtkScrollbar
10:49:27 [2021-02-15T15:49:27.009Z] 
10:49:27 [2021-02-15T15:49:27.009Z] (SWT:1786): Gtk-CRITICAL **: 15:49:26.896: gtk_box_gadget_distribute: assertion 'size >= 0' failed in GtkScrollbar
10:49:27 [2021-02-15T15:49:27.581Z] 
10:49:27 [2021-02-15T15:49:27.581Z] (SWT:1786): Gtk-CRITICAL **: 15:49:27.456: gtk_box_gadget_distribute: assertion 'size >= 0' failed in GtkScrollbar
10:49:28 [2021-02-15T15:49:28.157Z] Tests run: 1, Failures: 0, Errors: 0, Skipped: 0, Time elapsed: 2.234 s - in org.eclipse.egit.ui.gitflow.FeatureStartFinishHandlerTest
10:49:28 [2021-02-15T15:49:28.157Z] testFeatureStart(org.eclipse.egit.ui.gitflow.FeatureStartFinishHandlerTest)  Time elapsed: 2.229 s
10:49:28 [2021-02-15T15:49:28.157Z] Running org.eclipse.egit.ui.gitflow.FeatureFinishKeepBranchHandlerTest
10:49:29 [2021-02-15T15:49:29.124Z] 
10:49:29 [2021-02-15T15:49:29.124Z] (SWT:1786): Gtk-CRITICAL **: 15:49:28.948: gtk_box_gadget_distribute: assertion 'size >= 0' failed in GtkScrollbar
10:49:29 [2021-02-15T15:49:29.124Z] 
10:49:29 [2021-02-15T15:49:29.124Z] (SWT:1786): Gtk-CRITICAL **: 15:49:28.965: gtk_box_gadget_distribute: assertion 'size >= 0' failed in GtkScrollbar
10:49:29 [2021-02-15T15:49:29.124Z] 
10:49:29 [2021-02-15T15:49:29.124Z] (SWT:1786): Gtk-CRITICAL **: 15:49:28.982: gtk_box_gadget_distribute: assertion 'size >= 0' failed in GtkScrollbar
10:49:29 [2021-02-15T15:49:29.124Z] 
10:49:29 [2021-02-15T15:49:29.124Z] (SWT:1786): Gtk-CRITICAL **: 15:49:28.999: gtk_box_gadget_distribute: assertion 'size >= 0' failed in GtkScrollbar
10:49:29 [2021-02-15T15:49:29.124Z] 
10:49:29 [2021-02-15T15:49:29.124Z] (SWT:1786): Gtk-CRITICAL **: 15:49:29.016: gtk_box_gadget_distribute: assertion 'size >= 0' failed in GtkScrollbar
10:49:29 [2021-02-15T15:49:29.124Z] 
10:49:29 [2021-02-15T15:49:29.124Z] (SWT:1786): Gtk-CRITICAL **: 15:49:29.032: gtk_box_gadget_distribute: assertion 'size >= 0' failed in GtkScrollbar
10:49:29 [2021-02-15T15:49:29.124Z] 
10:49:29 [2021-02-15T15:49:29.124Z] (SWT:1786): Gtk-CRITICAL **: 15:49:29.049: gtk_box_gadget_distribute: assertion 'size >= 0' failed in GtkScrollbar
10:49:29 [2021-02-15T15:49:29.124Z] 
10:49:29 [2021-02-15T15:49:29.124Z] (SWT:1786): Gtk-CRITICAL **: 15:49:29.066: gtk_box_gadget_distribute: assertion 'size >= 0' failed in GtkScrollbar
10:49:29 [2021-02-15T15:49:29.124Z] 
10:49:29 [2021-02-15T15:49:29.124Z] (SWT:1786): Gtk-CRITICAL **: 15:49:29.082: gtk_box_gadget_distribute: assertion 'size >= 0' failed in GtkScrollbar
10:49:29 [2021-02-15T15:49:29.124Z] 
10:49:29 [2021-02-15T15:49:29.124Z] (SWT:1786): Gtk-CRITICAL **: 15:49:29.099: gtk_box_gadget_distribute: assertion 'size >= 0' failed in GtkScrollbar
10:49:29 [2021-02-15T15:49:29.124Z] 
10:49:29 [2021-02-15T15:49:29.124Z] (SWT:1786): Gtk-CRITICAL **: 15:49:29.116: gtk_box_gadget_distribute: assertion 'size >= 0' failed in GtkScrollbar
10:49:29 [2021-02-15T15:49:29.382Z] 
10:49:29 [2021-02-15T15:49:29.382Z] (SWT:1786): Gtk-CRITICAL **: 15:49:29.132: gtk_box_gadget_distribute: assertion 'size >= 0' failed in GtkScrollbar
10:49:29 [2021-02-15T15:49:29.382Z] 
10:49:29 [2021-02-15T15:49:29.382Z] (SWT:1786): Gtk-CRITICAL **: 15:49:29.149: gtk_box_gadget_distribute: assertion 'size >= 0' failed in GtkScrollbar
10:49:29 [2021-02-15T15:49:29.961Z] 
10:49:29 [2021-02-15T15:49:29.961Z] (SWT:1786): Gtk-CRITICAL **: 15:49:29.669: gtk_box_gadget_distribute: assertion 'size >= 0' failed in GtkScrollbar
10:49:30 [2021-02-15T15:49:30.561Z] Tests run: 1, Failures: 0, Errors: 0, Skipped: 0, Time elapsed: 2.228 s - in org.eclipse.egit.ui.gitflow.FeatureFinishKeepBranchHandlerTest
10:49:30 [2021-02-15T15:49:30.561Z] testFeatureFinishKeepBranch(org.eclipse.egit.ui.gitflow.FeatureFinishKeepBranchHandlerTest)  Time elapsed: 2.22 s
10:49:30 [2021-02-15T15:49:30.561Z] Running org.eclipse.egit.ui.gitflow.FeatureRebaseHandlerTest
10:49:31 [2021-02-15T15:49:31.521Z] 
10:49:31 [2021-02-15T15:49:31.521Z] (SWT:1786): Gtk-WARNING **: 15:49:31.393: Negative content width -6 (allocation 1, extents 4x3) while allocating gadget (node toolbar, owner GtkToolbar)
10:49:31 [2021-02-15T15:49:31.521Z] 
10:49:31 [2021-02-15T15:49:31.521Z] (SWT:1786): Gtk-WARNING **: 15:49:31.402: Negative content width -6 (allocation 1, extents 4x3) while allocating gadget (node toolbar, owner GtkToolbar)
10:49:31 [2021-02-15T15:49:31.521Z] 
10:49:31 [2021-02-15T15:49:31.522Z] (SWT:1786): Gtk-WARNING **: 15:49:31.408: Negative content width -6 (allocation 1, extents 4x3) while allocating gadget (node toolbar, owner GtkToolbar)
10:49:31 [2021-02-15T15:49:31.522Z] 
10:49:31 [2021-02-15T15:49:31.522Z] (SWT:1786): Gtk-WARNING **: 15:49:31.411: Negative content width -6 (allocation 1, extents 4x3) while allocating gadget (node toolbar, owner GtkToolbar)
10:49:31 [2021-02-15T15:49:31.522Z] 
10:49:31 [2021-02-15T15:49:31.522Z] (SWT:1786): Gtk-WARNING **: 15:49:31.411: Negative content width -6 (allocation 1, extents 4x3) while allocating gadget (node toolbar, owner GtkToolbar)
10:49:31 [2021-02-15T15:49:31.522Z] 
10:49:31 [2021-02-15T15:49:31.522Z] (SWT:1786): Gtk-WARNING **: 15:49:31.460: Negative content width -6 (allocation 1, extents 4x3) while allocating gadget (node toolbar, owner GtkToolbar)
10:49:32 [2021-02-15T15:49:32.087Z] 
10:49:32 [2021-02-15T15:49:32.087Z] (SWT:1786): Gtk-WARNING **: 15:49:31.848: Negative content height -1 (allocation 1, extents 1x1) while allocating gadget (node scrolledwindow, owner GtkScrolledWindow)
10:49:32 [2021-02-15T15:49:32.087Z] 
10:49:32 [2021-02-15T15:49:32.087Z] (SWT:1786): Gtk-CRITICAL **: 15:49:31.848: gtk_box_gadget_distribute: assertion 'size >= 0' failed in GtkScrollbar
10:49:32 [2021-02-15T15:49:32.087Z] 
10:49:32 [2021-02-15T15:49:32.087Z] (SWT:1786): Gtk-WARNING **: 15:49:31.907: Negative content width -6 (allocation 1, extents 4x3) while allocating gadget (node toolbar, owner GtkToolbar)
10:49:33 [2021-02-15T15:49:33.460Z] 
10:49:33 [2021-02-15T15:49:33.460Z] (SWT:1786): Gtk-WARNING **: 15:49:33.335: Negative content height -1 (allocation 1, extents 1x1) while allocating gadget (node scrolledwindow, owner GtkScrolledWindow)
10:49:33 [2021-02-15T15:49:33.460Z] 
10:49:33 [2021-02-15T15:49:33.460Z] (SWT:1786): Gtk-CRITICAL **: 15:49:33.336: gtk_box_gadget_distribute: assertion 'size >= 0' failed in GtkScrollbar
10:49:33 [2021-02-15T15:49:33.720Z] Tests run: 2, Failures: 0, Errors: 0, Skipped: 0, Time elapsed: 3.099 s - in org.eclipse.egit.ui.gitflow.FeatureRebaseHandlerTest
10:49:33 [2021-02-15T15:49:33.720Z] testRebaseFailOnConflict(org.eclipse.egit.ui.gitflow.FeatureRebaseHandlerTest)  Time elapsed: 1.627 s
10:49:33 [2021-02-15T15:49:33.720Z] testRebaseFailOnDirtyWorkingDirectory(org.eclipse.egit.ui.gitflow.FeatureRebaseHandlerTest)  Time elapsed: 1.464 s
10:49:33 [2021-02-15T15:49:33.720Z] Running org.eclipse.egit.ui.gitflow.InitHandlerTest
10:49:37 [2021-02-15T15:49:37.949Z] Tests run: 3, Failures: 0, Errors: 0, Skipped: 0, Time elapsed: 4.054 s - in org.eclipse.egit.ui.gitflow.InitHandlerTest
10:49:37 [2021-02-15T15:49:37.949Z] testInit(org.eclipse.egit.ui.gitflow.InitHandlerTest)  Time elapsed: 1.215 s
10:49:37 [2021-02-15T15:49:37.950Z] testInitEmptyRepoMissingMaster(org.eclipse.egit.ui.gitflow.InitHandlerTest)  Time elapsed: 1.448 s
10:49:37 [2021-02-15T15:49:37.950Z] testInitMissingMaster(org.eclipse.egit.ui.gitflow.InitHandlerTest)  Time elapsed: 1.321 s
10:49:37 [2021-02-15T15:49:37.950Z] Running org.eclipse.egit.ui.gitflow.FeatureStartCheckoutConflictTest
10:49:38 [2021-02-15T15:49:38.514Z] 
10:49:38 [2021-02-15T15:49:38.514Z] (SWT:1786): Gtk-CRITICAL **: 15:49:38.296: gtk_box_gadget_distribute: assertion 'size >= 0' failed in GtkScrollbar
10:49:38 [2021-02-15T15:49:38.514Z] 
10:49:38 [2021-02-15T15:49:38.514Z] (SWT:1786): Gtk-CRITICAL **: 15:49:38.312: gtk_box_gadget_distribute: assertion 'size >= 0' failed in GtkScrollbar
10:49:38 [2021-02-15T15:49:38.514Z] 
10:49:38 [2021-02-15T15:49:38.514Z] (SWT:1786): Gtk-CRITICAL **: 15:49:38.319: gtk_box_gadget_distribute: assertion 'size >= 0' failed in GtkScrollbar
10:49:38 [2021-02-15T15:49:38.514Z] Tests run: 1, Failures: 0, Errors: 0, Skipped: 0, Time elapsed: 0.931 s - in org.eclipse.egit.ui.gitflow.FeatureStartCheckoutConflictTest
10:49:38 [2021-02-15T15:49:38.514Z] testFeatureStart(org.eclipse.egit.ui.gitflow.FeatureStartCheckoutConflictTest)  Time elapsed: 0.927 s
10:49:38 [2021-02-15T15:49:38.514Z] Running org.eclipse.egit.ui.variables.DynamicVariablesTest
10:49:45 [2021-02-15T15:49:45.091Z] Tests run: 4, Failures: 0, Errors: 0, Skipped: 0, Time elapsed: 5.901 s - in org.eclipse.egit.ui.variables.DynamicVariablesTest
10:49:45 [2021-02-15T15:49:45.092Z] testGitBranch(org.eclipse.egit.ui.variables.DynamicVariablesTest)  Time elapsed: 1.191 s
10:49:45 [2021-02-15T15:49:45.092Z] testGitPath(org.eclipse.egit.ui.variables.DynamicVariablesTest)  Time elapsed: 1.138 s
10:49:45 [2021-02-15T15:49:45.092Z] testGitWorkTree(org.eclipse.egit.ui.variables.DynamicVariablesTest)  Time elapsed: 1.364 s
10:49:45 [2021-02-15T15:49:45.092Z] testGitDir(org.eclipse.egit.ui.variables.DynamicVariablesTest)  Time elapsed: 2.207 s
10:49:45 [2021-02-15T15:49:45.092Z] Running org.eclipse.egit.ui.prefpages.configuration.GlobalConfigurationPageTest
10:49:45 [2021-02-15T15:49:45.092Z] 
10:49:45 [2021-02-15T15:49:45.092Z] (SWT:1786): Gtk-WARNING **: 15:49:44.422: Negative content width -13 (allocation 5, extents 9x9) while allocating gadget (node entry, owner GtkEntry)
10:49:45 [2021-02-15T15:49:45.092Z] 
10:49:45 [2021-02-15T15:49:45.092Z] (SWT:1786): Gtk-WARNING **: 15:49:44.714: Negative content width -13 (allocation 5, extents 9x9) while allocating gadget (node entry, owner GtkEntry)
10:49:45 [2021-02-15T15:49:45.092Z] 
10:49:45 [2021-02-15T15:49:45.092Z] (SWT:1786): Gtk-WARNING **: 15:49:44.995: Negative content width -13 (allocation 5, extents 9x9) while allocating gadget (node entry, owner GtkEntry)
10:49:45 [2021-02-15T15:49:45.363Z] 
10:49:45 [2021-02-15T15:49:45.363Z] (SWT:1786): Gtk-WARNING **: 15:49:45.277: Negative content width -13 (allocation 5, extents 9x9) while allocating gadget (node entry, owner GtkEntry)
10:49:45 [2021-02-15T15:49:45.629Z] 
10:49:45 [2021-02-15T15:49:45.629Z] (SWT:1786): Gtk-WARNING **: 15:49:45.429: Negative content width -13 (allocation 5, extents 9x9) while allocating gadget (node entry, owner GtkEntry)
10:49:45 [2021-02-15T15:49:45.891Z] 
10:49:45 [2021-02-15T15:49:45.891Z] (SWT:1786): Gtk-WARNING **: 15:49:45.664: Negative content width -13 (allocation 5, extents 9x9) while allocating gadget (node entry, owner GtkEntry)
10:49:46 [2021-02-15T15:49:46.160Z] 
10:49:46 [2021-02-15T15:49:46.160Z] (SWT:1786): Gtk-WARNING **: 15:49:45.920: Negative content width -13 (allocation 5, extents 9x9) while allocating gadget (node entry, owner GtkEntry)
10:49:46 [2021-02-15T15:49:46.160Z] 
10:49:46 [2021-02-15T15:49:46.160Z] (SWT:1786): Gtk-WARNING **: 15:49:45.997: Negative content width -6 (allocation 1, extents 4x3) while allocating gadget (node toolbar, owner GtkToolbar)
10:49:46 [2021-02-15T15:49:46.160Z] 
10:49:46 [2021-02-15T15:49:46.160Z] (SWT:1786): Gtk-WARNING **: 15:49:45.997: Negative content height -3 (allocation 1, extents 2x2) while allocating gadget (node toolbar, owner GtkToolbar)
10:49:46 [2021-02-15T15:49:46.160Z] 
10:49:46 [2021-02-15T15:49:46.160Z] (SWT:1786): Gtk-WARNING **: 15:49:45.997: Negative content width -6 (allocation 1, extents 4x3) while allocating gadget (node toolbar, owner GtkToolbar)
10:49:46 [2021-02-15T15:49:46.160Z] 
10:49:46 [2021-02-15T15:49:46.160Z] (SWT:1786): Gtk-WARNING **: 15:49:45.997: Negative content height -3 (allocation 1, extents 2x2) while allocating gadget (node toolbar, owner GtkToolbar)
10:49:46 [2021-02-15T15:49:46.434Z] 
10:49:46 [2021-02-15T15:49:46.434Z] (SWT:1786): Gtk-WARNING **: 15:49:46.187: Negative content width -13 (allocation 5, extents 9x9) while allocating gadget (node entry, owner GtkEntry)
10:49:46 [2021-02-15T15:49:46.434Z] 
10:49:46 [2021-02-15T15:49:46.434Z] (SWT:1786): Gtk-WARNING **: 15:49:46.397: Negative content width -13 (allocation 5, extents 9x9) while allocating gadget (node entry, owner GtkEntry)
10:49:47 [2021-02-15T15:49:47.033Z] 
10:49:47 [2021-02-15T15:49:47.034Z] (SWT:1786): Gtk-WARNING **: 15:49:46.756: Negative content width -13 (allocation 5, extents 9x9) while allocating gadget (node entry, owner GtkEntry)
10:49:47 [2021-02-15T15:49:47.034Z] 
10:49:47 [2021-02-15T15:49:47.034Z] (SWT:1786): Gtk-WARNING **: 15:49:46.976: Negative content width -13 (allocation 5, extents 9x9) while allocating gadget (node entry, owner GtkEntry)
10:49:47 [2021-02-15T15:49:47.298Z] 
10:49:47 [2021-02-15T15:49:47.298Z] (SWT:1786): Gtk-WARNING **: 15:49:47.270: Negative content width -13 (allocation 5, extents 9x9) while allocating gadget (node entry, owner GtkEntry)
10:49:47 [2021-02-15T15:49:47.568Z] Tests run: 11, Failures: 0, Errors: 0, Skipped: 0, Time elapsed: 3.038 s - in org.eclipse.egit.ui.prefpages.configuration.GlobalConfigurationPageTest
10:49:47 [2021-02-15T15:49:47.568Z] testAddSubSectionEntry(org.eclipse.egit.ui.prefpages.configuration.GlobalConfigurationPageTest)  Time elapsed: 0.302 s
10:49:47 [2021-02-15T15:49:47.568Z] testAddSectionEntry(org.eclipse.egit.ui.prefpages.configuration.GlobalConfigurationPageTest)  Time elapsed: 0.289 s
10:49:47 [2021-02-15T15:49:47.568Z] testCanCreateSameEntryValue(org.eclipse.egit.ui.prefpages.configuration.GlobalConfigurationPageTest)  Time elapsed: 0.282 s
10:49:47 [2021-02-15T15:49:47.568Z] testNodes(org.eclipse.egit.ui.prefpages.configuration.GlobalConfigurationPageTest)  Time elapsed: 0.15 s
10:49:47 [2021-02-15T15:49:47.568Z] testRemoveValue(org.eclipse.egit.ui.prefpages.configuration.GlobalConfigurationPageTest)  Time elapsed: 0.214 s
10:49:47 [2021-02-15T15:49:47.568Z] testAddSubSectionEntryWithSuggestion(org.eclipse.egit.ui.prefpages.configuration.GlobalConfigurationPageTest)  Time elapsed: 0.281 s
10:49:47 [2021-02-15T15:49:47.568Z] testOpenEditor(org.eclipse.egit.ui.prefpages.configuration.GlobalConfigurationPageTest)  Time elapsed: 0.266 s
10:49:47 [2021-02-15T15:49:47.568Z] testSubsectionWithDot(org.eclipse.egit.ui.prefpages.configuration.GlobalConfigurationPageTest)  Time elapsed: 0.211 s
10:49:47 [2021-02-15T15:49:47.568Z] testChecksForKey(org.eclipse.egit.ui.prefpages.configuration.GlobalConfigurationPageTest)  Time elapsed: 0.354 s
10:49:47 [2021-02-15T15:49:47.568Z] testRemoveSubSection(org.eclipse.egit.ui.prefpages.configuration.GlobalConfigurationPageTest)  Time elapsed: 0.22 s
10:49:47 [2021-02-15T15:49:47.568Z] testRemoveSection(org.eclipse.egit.ui.prefpages.configuration.GlobalConfigurationPageTest)  Time elapsed: 0.299 s
10:49:47 [2021-02-15T15:49:47.568Z] Running org.eclipse.egit.ui.operations.GitScopeUtilTest
10:49:52 [2021-02-15T15:49:52.933Z] Tests run: 5, Failures: 0, Errors: 0, Skipped: 0, Time elapsed: 4.529 s - in org.eclipse.egit.ui.operations.GitScopeUtilTest
10:49:52 [2021-02-15T15:49:52.933Z] relatedChangesWithPrompt(org.eclipse.egit.ui.operations.GitScopeUtilTest)  Time elapsed: 1.748 s
10:49:52 [2021-02-15T15:49:52.933Z] modelProviderWithExtensionFiles(org.eclipse.egit.ui.operations.GitScopeUtilTest)  Time elapsed: 0.698 s
10:49:52 [2021-02-15T15:49:52.933Z] relatedChangesWithInvalidParams(org.eclipse.egit.ui.operations.GitScopeUtilTest)  Time elapsed: 0.663 s
10:49:52 [2021-02-15T15:49:52.933Z] relatedChangesWithNullResources(org.eclipse.egit.ui.operations.GitScopeUtilTest)  Time elapsed: 0.606 s
10:49:52 [2021-02-15T15:49:52.933Z] relatedChangesWithEmptyResources(org.eclipse.egit.ui.operations.GitScopeUtilTest)  Time elapsed: 0.812 s
10:49:52 [2021-02-15T15:49:52.933Z] 
10:49:52 [2021-02-15T15:49:52.933Z] Results:
10:49:52 [2021-02-15T15:49:52.933Z] 
10:49:52 [2021-02-15T15:49:52.933Z] Failures: 
10:49:52 [2021-02-15T15:49:52.933Z]   GitModelCacheTest.setupEnvironment:133->LocalRepositoryTestCase.createProjectAndCommitToRepository:326->LocalRepositoryTestCase.createProjectAndCommitToRepository:331->LocalRepositoryTestCase.createProjectAndCommitToRepository:373->LocalRepositoryTestCase.assertConnected:465 Project not shared with git: P/ProjectWithoutDotProject
10:49:52 [2021-02-15T15:49:52.933Z] 
10:49:52 [2021-02-15T15:49:52.933Z] Tests run: 544, Failures: 1, Errors: 0, Skipped: 12
10:49:52 [2021-02-15T15:49:52.933Z] 
10:49:53 [2021-02-15T15:49:53.517Z] 
10:49:53 [2021-02-15T15:49:53.517Z] !ENTRY org.eclipse.core.resources 2 10035 2021-02-15 15:49:53.366
10:49:53 [2021-02-15T15:49:53.517Z] !MESSAGE The workspace will exit with unsaved changes in this session.
10:49:54 [2021-02-15T15:49:54.893Z] 15:49:54 [INFO] ------------------------------------------------------------------------
10:49:54 [2021-02-15T15:49:54.893Z] 15:49:54 [INFO] Reactor Summary for EGit Parent 5.11.0-SNAPSHOT:
10:49:54 [2021-02-15T15:49:54.893Z] 15:49:54 [INFO] 
10:49:54 [2021-02-15T15:49:54.893Z] 15:49:54 [INFO] EGit Parent ........................................ SUCCESS [ 40.944 s]
10:49:54 [2021-02-15T15:49:54.893Z] 15:49:54 [INFO] EGit Target Platform Definition .................... SUCCESS [  3.584 s]
10:49:54 [2021-02-15T15:49:54.893Z] 15:49:54 [INFO] Eclipse EGit ....................................... SUCCESS [  8.912 s]
10:49:54 [2021-02-15T15:49:54.893Z] 15:49:54 [INFO] Git Team Provider (Core) ........................... SUCCESS [ 20.929 s]
10:49:54 [2021-02-15T15:49:54.893Z] 15:49:54 [INFO] Git Team Provider (UI) ............................. SUCCESS [ 57.444 s]
10:49:54 [2021-02-15T15:49:54.893Z] 15:49:54 [INFO] EGit Mylyn UI ...................................... SUCCESS [  7.916 s]
10:49:54 [2021-02-15T15:49:54.893Z] 15:49:54 [INFO] Git Team Provider (Documentation) .................. SUCCESS [  4.604 s]
10:49:54 [2021-02-15T15:49:54.893Z] 15:49:54 [INFO] Eclipse EGit Feature ............................... SUCCESS [  1.143 s]
10:49:54 [2021-02-15T15:49:54.893Z] 15:49:54 [INFO] EGit Mylyn Feature ................................. SUCCESS [  1.124 s]
10:49:54 [2021-02-15T15:49:54.893Z] 15:49:54 [INFO] Git Flow ........................................... SUCCESS [  7.999 s]
10:49:54 [2021-02-15T15:49:54.893Z] 15:49:54 [INFO] Git Flow UI ........................................ SUCCESS [  9.708 s]
10:49:54 [2021-02-15T15:49:54.893Z] 15:49:54 [INFO] Eclipse EGit Gitflow Feature ....................... SUCCESS [  1.090 s]
10:49:54 [2021-02-15T15:49:54.893Z] 15:49:54 [INFO] EGit JUnit Support ................................. SUCCESS [  7.907 s]
10:49:54 [2021-02-15T15:49:54.893Z] 15:49:54 [INFO] GitFlow Test Plug-in ............................... SUCCESS [ 29.298 s]
10:49:54 [2021-02-15T15:49:54.893Z] 15:49:54 [INFO] Eclipse EGit Source Feature ........................ SUCCESS [  1.220 s]
10:49:54 [2021-02-15T15:49:54.894Z] 15:49:54 [INFO] EGit P2 Repository ................................. SUCCESS [ 11.440 s]
10:49:54 [2021-02-15T15:49:54.894Z] 15:49:54 [INFO] EGit Core Test Plug-in ............................. SUCCESS [02:36 min]
10:49:54 [2021-02-15T15:49:54.894Z] 15:49:54 [INFO] EGit UI Test Plug-in ............................... FAILURE [14:12 min]
10:49:54 [2021-02-15T15:49:54.894Z] 15:49:54 [INFO] EGit Mylyn UI Test Plug-in ......................... SKIPPED
10:49:54 [2021-02-15T15:49:54.894Z] 15:49:54 [INFO] ------------------------------------------------------------------------
10:49:54 [2021-02-15T15:49:54.894Z] 15:49:54 [INFO] BUILD FAILURE
10:49:54 [2021-02-15T15:49:54.894Z] 15:49:54 [INFO] ------------------------------------------------------------------------
10:49:54 [2021-02-15T15:49:54.894Z] 15:49:54 [INFO] Total time:  23:32 min
10:49:54 [2021-02-15T15:49:54.894Z] 15:49:54 [INFO] Finished at: 2021-02-15T15:49:54Z
10:49:54 [2021-02-15T15:49:54.894Z] 15:49:54 [INFO] ------------------------------------------------------------------------
10:49:54 [2021-02-15T15:49:54.894Z] 15:49:54 [ERROR] Failed to execute goal org.eclipse.tycho:tycho-surefire-plugin:1.7.0:test (default-test) on project org.eclipse.egit.ui.test: There are test failures.
10:49:54 [2021-02-15T15:49:54.894Z] 15:49:54 [ERROR] 
10:49:54 [2021-02-15T15:49:54.894Z] 15:49:54 [ERROR] Please refer to /home/jenkins/agent/workspace/egit/repo/org.eclipse.egit.ui.test/target/surefire-reports for the individual test results.
10:49:54 [2021-02-15T15:49:54.894Z] 15:49:54 [ERROR] -> [Help 1]
10:49:54 [2021-02-15T15:49:54.894Z] org.apache.maven.lifecycle.LifecycleExecutionException: Failed to execute goal org.eclipse.tycho:tycho-surefire-plugin:1.7.0:test (default-test) on project org.eclipse.egit.ui.test: There are test failures.
10:49:54 [2021-02-15T15:49:54.894Z] 
10:49:54 [2021-02-15T15:49:54.894Z] Please refer to /home/jenkins/agent/workspace/egit/repo/org.eclipse.egit.ui.test/target/surefire-reports for the individual test results.
10:49:54 [2021-02-15T15:49:54.894Z]     at org.apache.maven.lifecycle.internal.MojoExecutor.execute (MojoExecutor.java:215)
10:49:54 [2021-02-15T15:49:54.894Z]     at org.apache.maven.lifecycle.internal.MojoExecutor.execute (MojoExecutor.java:156)
10:49:54 [2021-02-15T15:49:54.894Z]     at org.apache.maven.lifecycle.internal.MojoExecutor.execute (MojoExecutor.java:148)
10:49:54 [2021-02-15T15:49:54.894Z]     at org.apache.maven.lifecycle.internal.LifecycleModuleBuilder.buildProject (LifecycleModuleBuilder.java:117)
10:49:54 [2021-02-15T15:49:54.894Z]     at org.apache.maven.lifecycle.internal.LifecycleModuleBuilder.buildProject (LifecycleModuleBuilder.java:81)
10:49:54 [2021-02-15T15:49:54.894Z]     at org.apache.maven.lifecycle.internal.builder.singlethreaded.SingleThreadedBuilder.build (SingleThreadedBuilder.java:56)
10:49:54 [2021-02-15T15:49:54.894Z]     at org.apache.maven.lifecycle.internal.LifecycleStarter.execute (LifecycleStarter.java:128)
10:49:54 [2021-02-15T15:49:54.894Z]     at org.apache.maven.DefaultMaven.doExecute (DefaultMaven.java:305)
10:49:54 [2021-02-15T15:49:54.894Z]     at org.apache.maven.DefaultMaven.doExecute (DefaultMaven.java:192)
10:49:54 [2021-02-15T15:49:54.894Z]     at org.apache.maven.DefaultMaven.execute (DefaultMaven.java:105)
10:49:54 [2021-02-15T15:49:54.894Z]     at org.apache.maven.cli.MavenCli.execute (MavenCli.java:957)
10:49:54 [2021-02-15T15:49:54.894Z]     at org.apache.maven.cli.MavenCli.doMain (MavenCli.java:289)
10:49:54 [2021-02-15T15:49:54.894Z]     at org.apache.maven.cli.MavenCli.main (MavenCli.java:193)
10:49:54 [2021-02-15T15:49:54.894Z]     at sun.reflect.NativeMethodAccessorImpl.invoke0 (Native Method)
10:49:54 [2021-02-15T15:49:54.894Z]     at sun.reflect.NativeMethodAccessorImpl.invoke (NativeMethodAccessorImpl.java:62)
10:49:54 [2021-02-15T15:49:54.894Z]     at sun.reflect.DelegatingMethodAccessorImpl.invoke (DelegatingMethodAccessorImpl.java:43)
10:49:54 [2021-02-15T15:49:54.894Z]     at java.lang.reflect.Method.invoke (Method.java:498)
10:49:54 [2021-02-15T15:49:54.894Z]     at org.codehaus.plexus.classworlds.launcher.Launcher.launchEnhanced (Launcher.java:282)
10:49:54 [2021-02-15T15:49:54.894Z]     at org.codehaus.plexus.classworlds.launcher.Launcher.launch (Launcher.java:225)
10:49:54 [2021-02-15T15:49:54.894Z]     at org.codehaus.plexus.classworlds.launcher.Launcher.mainWithExitCode (Launcher.java:406)
10:49:54 [2021-02-15T15:49:54.894Z]     at org.codehaus.plexus.classworlds.launcher.Launcher.main (Launcher.java:347)
10:49:54 [2021-02-15T15:49:54.894Z] Caused by: org.apache.maven.plugin.MojoFailureException: There are test failures.
10:49:54 [2021-02-15T15:49:54.894Z] 
10:49:54 [2021-02-15T15:49:54.894Z] Please refer to /home/jenkins/agent/workspace/egit/repo/org.eclipse.egit.ui.test/target/surefire-reports for the individual test results.
10:49:54 [2021-02-15T15:49:54.894Z]     at org.eclipse.tycho.surefire.TestMojo.runTest (TestMojo.java:1063)
10:49:54 [2021-02-15T15:49:54.894Z]     at org.eclipse.tycho.surefire.TestMojo.execute (TestMojo.java:712)
10:49:54 [2021-02-15T15:49:54.894Z]     at org.apache.maven.plugin.DefaultBuildPluginManager.executeMojo (DefaultBuildPluginManager.java:137)
10:49:54 [2021-02-15T15:49:54.894Z]     at org.apache.maven.lifecycle.internal.MojoExecutor.execute (MojoExecutor.java:210)
10:49:54 [2021-02-15T15:49:54.894Z]     at org.apache.maven.lifecycle.internal.MojoExecutor.execute (MojoExecutor.java:156)
10:49:54 [2021-02-15T15:49:54.894Z]     at org.apache.maven.lifecycle.internal.MojoExecutor.execute (MojoExecutor.java:148)
10:49:54 [2021-02-15T15:49:54.894Z]     at org.apache.maven.lifecycle.internal.LifecycleModuleBuilder.buildProject (LifecycleModuleBuilder.java:117)
10:49:54 [2021-02-15T15:49:54.894Z]     at org.apache.maven.lifecycle.internal.LifecycleModuleBuilder.buildProject (LifecycleModuleBuilder.java:81)
10:49:54 [2021-02-15T15:49:54.894Z]     at org.apache.maven.lifecycle.internal.builder.singlethreaded.SingleThreadedBuilder.build (SingleThreadedBuilder.java:56)
10:49:54 [2021-02-15T15:49:54.894Z]     at org.apache.maven.lifecycle.internal.LifecycleStarter.execute (LifecycleStarter.java:128)
10:49:54 [2021-02-15T15:49:54.894Z]     at org.apache.maven.DefaultMaven.doExecute (DefaultMaven.java:305)
10:49:54 [2021-02-15T15:49:54.894Z]     at org.apache.maven.DefaultMaven.doExecute (DefaultMaven.java:192)
10:49:54 [2021-02-15T15:49:54.894Z]     at org.apache.maven.DefaultMaven.execute (DefaultMaven.java:105)
10:49:54 [2021-02-15T15:49:54.894Z]     at org.apache.maven.cli.MavenCli.execute (MavenCli.java:957)
10:49:54 [2021-02-15T15:49:54.894Z]     at org.apache.maven.cli.MavenCli.doMain (MavenCli.java:289)
10:49:54 [2021-02-15T15:49:54.894Z]     at org.apache.maven.cli.MavenCli.main (MavenCli.java:193)
10:49:54 [2021-02-15T15:49:54.894Z]     at sun.reflect.NativeMethodAccessorImpl.invoke0 (Native Method)
10:49:54 [2021-02-15T15:49:54.894Z]     at sun.reflect.NativeMethodAccessorImpl.invoke (NativeMethodAccessorImpl.java:62)
10:49:54 [2021-02-15T15:49:54.894Z]     at sun.reflect.DelegatingMethodAccessorImpl.invoke (DelegatingMethodAccessorImpl.java:43)
10:49:54 [2021-02-15T15:49:54.894Z]     at java.lang.reflect.Method.invoke (Method.java:498)
10:49:54 [2021-02-15T15:49:54.894Z]     at org.codehaus.plexus.classworlds.launcher.Launcher.launchEnhanced (Launcher.java:282)
10:49:54 [2021-02-15T15:49:54.894Z]     at org.codehaus.plexus.classworlds.launcher.Launcher.launch (Launcher.java:225)
10:49:54 [2021-02-15T15:49:54.895Z]     at org.codehaus.plexus.classworlds.launcher.Launcher.mainWithExitCode (Launcher.java:406)
10:49:54 [2021-02-15T15:49:54.895Z]     at org.codehaus.plexus.classworlds.launcher.Launcher.main (Launcher.java:347)
10:49:54 [2021-02-15T15:49:54.895Z] 15:49:54 [ERROR] 
10:49:54 [2021-02-15T15:49:54.895Z] 15:49:54 [ERROR] Re-run Maven using the -X switch to enable full debug logging.
10:49:54 [2021-02-15T15:49:54.895Z] 15:49:54 [ERROR] 
10:49:54 [2021-02-15T15:49:54.895Z] 15:49:54 [ERROR] For more information about the errors and possible solutions, please read the following articles:
10:49:54 [2021-02-15T15:49:54.895Z] 15:49:54 [ERROR] [Help 1] http://cwiki.apache.org/confluence/display/MAVEN/MojoFailureException
10:49:54 [2021-02-15T15:49:54.895Z] 15:49:54 [ERROR] 
10:49:54 [2021-02-15T15:49:54.895Z] 15:49:54 [ERROR] After correcting the problems, you can resume the build with the command
10:49:54 [2021-02-15T15:49:54.895Z] 15:49:54 [ERROR]   mvn <args> -rf :org.eclipse.egit.ui.test
[Pipeline] }
[Pipeline] // stage
[Pipeline] stage
[Pipeline] { (Results)
[Pipeline] junit
10:49:56 [2021-02-15T15:49:56.335Z] Recording test results
10:49:57 [2021-02-15T15:49:57.931Z] [Checks API] No suitable checks publisher found.
[Pipeline] archiveArtifacts
10:49:57 [2021-02-15T15:49:57.947Z] Archiving artifacts
[Pipeline] findbugs
10:50:03 [2021-02-15T15:50:03.872Z] [FINDBUGS] Collecting findbugs analysis files...
10:50:08 [2021-02-15T15:50:08.790Z] [FINDBUGS] Searching for all files in /home/jenkins/agent/workspace/egit/repo that match the pattern */target/*bugsXml.xml
10:50:08 [2021-02-15T15:50:08.790Z] [FINDBUGS] Parsing 8 files in /home/jenkins/agent/workspace/egit/repo
10:50:08 [2021-02-15T15:50:08.790Z] [FINDBUGS] Successfully parsed file /home/jenkins/agent/workspace/egit/repo/org.eclipse.egit.core.junit/target/spotbugsXml.xml with 4 unique warnings and 0 duplicates.
10:50:08 [2021-02-15T15:50:08.790Z] [FINDBUGS] Successfully parsed file /home/jenkins/agent/workspace/egit/repo/org.eclipse.egit.core.test/target/spotbugsXml.xml with 9 unique warnings and 0 duplicates.
10:50:08 [2021-02-15T15:50:08.790Z] [FINDBUGS] Successfully parsed file /home/jenkins/agent/workspace/egit/repo/org.eclipse.egit.core/target/spotbugsXml.xml with 19 unique warnings and 0 duplicates.
10:50:08 [2021-02-15T15:50:08.790Z] [FINDBUGS] Successfully parsed file /home/jenkins/agent/workspace/egit/repo/org.eclipse.egit.gitflow.test/target/spotbugsXml.xml with 19 unique warnings and 0 duplicates.
10:50:08 [2021-02-15T15:50:08.790Z] [FINDBUGS] Successfully parsed file /home/jenkins/agent/workspace/egit/repo/org.eclipse.egit.gitflow.ui/target/spotbugsXml.xml with 19 unique warnings and 0 duplicates.
10:50:08 [2021-02-15T15:50:08.790Z] [FINDBUGS] Successfully parsed file /home/jenkins/agent/workspace/egit/repo/org.eclipse.egit.gitflow/target/spotbugsXml.xml with 21 unique warnings and 0 duplicates.
10:50:08 [2021-02-15T15:50:08.790Z] [FINDBUGS] Successfully parsed file /home/jenkins/agent/workspace/egit/repo/org.eclipse.egit.mylyn.ui/target/spotbugsXml.xml with 21 unique warnings and 0 duplicates.
10:50:08 [2021-02-15T15:50:08.790Z] [FINDBUGS] Successfully parsed file /home/jenkins/agent/workspace/egit/repo/org.eclipse.egit.ui/target/spotbugsXml.xml with 64 unique warnings and 0 duplicates.
10:50:08 [2021-02-15T15:50:08.790Z] Skipping warnings blame since pipelines do not have an SCM link.%n
10:50:08 [2021-02-15T15:50:08.865Z] [FINDBUGS] Computing warning deltas based on reference build #558
[Pipeline] dry
10:50:09 [2021-02-15T15:50:09.137Z] [DRY] Collecting duplicate code analysis files...
10:50:09 [2021-02-15T15:50:09.476Z] [DRY] Searching for all files in /home/jenkins/agent/workspace/egit/repo that match the pattern **/cpd.xml
10:50:09 [2021-02-15T15:50:09.476Z] [DRY] Parsing 15 files in /home/jenkins/agent/workspace/egit/repo
10:50:09 [2021-02-15T15:50:09.476Z] [DRY] Successfully parsed file /home/jenkins/agent/workspace/egit/repo/org.eclipse.egit-feature/target/cpd.xml with 0 unique warnings and 0 duplicates.
10:50:09 [2021-02-15T15:50:09.476Z] [DRY] Successfully parsed file /home/jenkins/agent/workspace/egit/repo/org.eclipse.egit.core.junit/target/cpd.xml with 0 unique warnings and 0 duplicates.
10:50:09 [2021-02-15T15:50:09.476Z] [DRY] Successfully parsed file /home/jenkins/agent/workspace/egit/repo/org.eclipse.egit.core.test/target/cpd.xml with 0 unique warnings and 0 duplicates.
10:50:09 [2021-02-15T15:50:09.476Z] [DRY] Successfully parsed file /home/jenkins/agent/workspace/egit/repo/org.eclipse.egit.core/target/cpd.xml with 2 unique warnings and 0 duplicates.
10:50:09 [2021-02-15T15:50:09.476Z] [DRY] Successfully parsed file /home/jenkins/agent/workspace/egit/repo/org.eclipse.egit.doc/target/cpd.xml with 2 unique warnings and 0 duplicates.
10:50:09 [2021-02-15T15:50:09.476Z] [DRY] Successfully parsed file /home/jenkins/agent/workspace/egit/repo/org.eclipse.egit.gitflow-feature/target/cpd.xml with 2 unique warnings and 0 duplicates.
10:50:09 [2021-02-15T15:50:09.476Z] [DRY] Successfully parsed file /home/jenkins/agent/workspace/egit/repo/org.eclipse.egit.gitflow.test/target/cpd.xml with 2 unique warnings and 0 duplicates.
10:50:09 [2021-02-15T15:50:09.476Z] [DRY] Successfully parsed file /home/jenkins/agent/workspace/egit/repo/org.eclipse.egit.gitflow.ui/target/cpd.xml with 2 unique warnings and 0 duplicates.
10:50:09 [2021-02-15T15:50:09.476Z] [DRY] Successfully parsed file /home/jenkins/agent/workspace/egit/repo/org.eclipse.egit.gitflow/target/cpd.xml with 2 unique warnings and 0 duplicates.
10:50:09 [2021-02-15T15:50:09.476Z] [DRY] Successfully parsed file /home/jenkins/agent/workspace/egit/repo/org.eclipse.egit.mylyn-feature/target/cpd.xml with 2 unique warnings and 0 duplicates.
10:50:09 [2021-02-15T15:50:09.476Z] [DRY] Successfully parsed file /home/jenkins/agent/workspace/egit/repo/org.eclipse.egit.mylyn.ui/target/cpd.xml with 2 unique warnings and 0 duplicates.
10:50:09 [2021-02-15T15:50:09.476Z] [DRY] Successfully parsed file /home/jenkins/agent/workspace/egit/repo/org.eclipse.egit.repository/target/cpd.xml with 2 unique warnings and 0 duplicates.
10:50:09 [2021-02-15T15:50:09.476Z] [DRY] Successfully parsed file /home/jenkins/agent/workspace/egit/repo/org.eclipse.egit.source-feature/target/cpd.xml with 2 unique warnings and 0 duplicates.
10:50:09 [2021-02-15T15:50:09.476Z] [DRY] Successfully parsed file /home/jenkins/agent/workspace/egit/repo/org.eclipse.egit.ui/target/cpd.xml with 35 unique warnings and 0 duplicates.
10:50:09 [2021-02-15T15:50:09.476Z] [DRY] Successfully parsed file /home/jenkins/agent/workspace/egit/repo/org.eclipse.egit/target/cpd.xml with 35 unique warnings and 0 duplicates.
10:50:09 [2021-02-15T15:50:09.476Z] Skipping warnings blame since pipelines do not have an SCM link.%n
10:50:09 [2021-02-15T15:50:09.516Z] [DRY] Computing warning deltas based on reference build #558
[Pipeline] }
[Pipeline] // stage
[Pipeline] step
10:50:09 [2021-02-15T15:50:09.685Z] Sending e-mails to: egit-build@eclipse.org
[Pipeline] }
[Pipeline] // dir
[Pipeline] }
10:50:09 [2021-02-15T15:50:09.867Z] Terminating xvnc.
[Pipeline] // xvnc
[Pipeline] }
[Pipeline] // timeout
[Pipeline] }
[Pipeline] // node
[Pipeline] }
[Pipeline] // timestamps
[Pipeline] End of Pipeline
ERROR: script returned exit code 1
Finished: FAILURE