FailedConsole Output

Skipping 975 KB.. Full Log
03:09:55 [2021-02-12T08:09:55.433Z] 	at java.lang.reflect.Method.invoke(Method.java:498)
03:09:55 [2021-02-12T08:09:55.433Z] 	at org.junit.runners.model.FrameworkMethod$1.runReflectiveCall(FrameworkMethod.java:59)
03:09:55 [2021-02-12T08:09:55.433Z] 	at org.junit.internal.runners.model.ReflectiveCallable.run(ReflectiveCallable.java:12)
03:09:55 [2021-02-12T08:09:55.433Z] 	at org.junit.runners.model.FrameworkMethod.invokeExplosively(FrameworkMethod.java:56)
03:09:55 [2021-02-12T08:09:55.433Z] 	at org.junit.internal.runners.statements.InvokeMethod.evaluate(InvokeMethod.java:17)
03:09:55 [2021-02-12T08:09:55.433Z] 	at org.junit.internal.runners.statements.RunBefores.evaluate(RunBefores.java:26)
03:09:55 [2021-02-12T08:09:55.433Z] 	at org.junit.internal.runners.statements.RunAfters.evaluate(RunAfters.java:27)
03:09:55 [2021-02-12T08:09:55.433Z] 	at org.junit.runners.ParentRunner$3.evaluate(ParentRunner.java:306)
03:09:55 [2021-02-12T08:09:55.433Z] 	at org.junit.runners.BlockJUnit4ClassRunner$1.evaluate(BlockJUnit4ClassRunner.java:100)
03:09:55 [2021-02-12T08:09:55.433Z] 	at org.junit.runners.ParentRunner.runLeaf(ParentRunner.java:366)
03:09:55 [2021-02-12T08:09:55.433Z] 	at org.junit.runners.BlockJUnit4ClassRunner.runChild(BlockJUnit4ClassRunner.java:103)
03:09:55 [2021-02-12T08:09:55.433Z] 	at org.junit.runners.BlockJUnit4ClassRunner.runChild(BlockJUnit4ClassRunner.java:63)
03:09:55 [2021-02-12T08:09:55.433Z] 	at org.junit.runners.ParentRunner$4.run(ParentRunner.java:331)
03:09:55 [2021-02-12T08:09:55.433Z] 	at org.junit.runners.ParentRunner$1.schedule(ParentRunner.java:79)
03:09:55 [2021-02-12T08:09:55.433Z] 	at org.junit.runners.ParentRunner.runChildren(ParentRunner.java:329)
03:09:55 [2021-02-12T08:09:55.433Z] 	at org.junit.runners.ParentRunner.access$100(ParentRunner.java:66)
03:09:55 [2021-02-12T08:09:55.433Z] 	at org.junit.runners.ParentRunner$2.evaluate(ParentRunner.java:293)
03:09:55 [2021-02-12T08:09:55.433Z] 	at org.junit.internal.runners.statements.RunBefores.evaluate(RunBefores.java:26)
03:09:55 [2021-02-12T08:09:55.433Z] 	at org.junit.runners.ParentRunner$3.evaluate(ParentRunner.java:306)
03:09:55 [2021-02-12T08:09:55.434Z] 	at org.junit.runners.ParentRunner.run(ParentRunner.java:413)
03:09:55 [2021-02-12T08:09:55.434Z] 	at org.apache.maven.surefire.junit4.JUnit4Provider.execute(JUnit4Provider.java:365)
03:09:55 [2021-02-12T08:09:55.434Z] 	at org.apache.maven.surefire.junit4.JUnit4Provider.executeWithRerun(JUnit4Provider.java:273)
03:09:55 [2021-02-12T08:09:55.434Z] 	at org.apache.maven.surefire.junit4.JUnit4Provider.executeTestSet(JUnit4Provider.java:238)
03:09:55 [2021-02-12T08:09:55.434Z] 	at org.apache.maven.surefire.junit4.JUnit4Provider.invoke(JUnit4Provider.java:159)
03:09:55 [2021-02-12T08:09:55.434Z] 	at sun.reflect.NativeMethodAccessorImpl.invoke0(Native Method)
03:09:55 [2021-02-12T08:09:55.434Z] 	at sun.reflect.NativeMethodAccessorImpl.invoke(NativeMethodAccessorImpl.java:62)
03:09:55 [2021-02-12T08:09:55.434Z] 	at sun.reflect.DelegatingMethodAccessorImpl.invoke(DelegatingMethodAccessorImpl.java:43)
03:09:55 [2021-02-12T08:09:55.434Z] 	at java.lang.reflect.Method.invoke(Method.java:498)
03:09:55 [2021-02-12T08:09:55.434Z] 	at org.apache.maven.surefire.util.ReflectionUtils.invokeMethodWithArray2(ReflectionUtils.java:206)
03:09:55 [2021-02-12T08:09:55.434Z] 	at org.apache.maven.surefire.booter.ProviderFactory$ProviderProxy.invoke(ProviderFactory.java:161)
03:09:55 [2021-02-12T08:09:55.434Z] 	at org.apache.maven.surefire.booter.ProviderFactory.invokeProvider(ProviderFactory.java:84)
03:09:55 [2021-02-12T08:09:55.434Z] 	at org.eclipse.tycho.surefire.osgibooter.OsgiSurefireBooter.run(OsgiSurefireBooter.java:113)
03:09:55 [2021-02-12T08:09:55.434Z] 	at org.eclipse.tycho.surefire.osgibooter.AbstractUITestApplication.runTests(AbstractUITestApplication.java:44)
03:09:55 [2021-02-12T08:09:55.434Z] 	at org.eclipse.e4.ui.internal.workbench.swt.E4Testable$1.run(E4Testable.java:73)
03:09:55 [2021-02-12T08:09:55.434Z] 	at java.lang.Thread.run(Thread.java:748)
03:09:55 [2021-02-12T08:09:55.434Z] 
03:09:55 [2021-02-12T08:09:55.434Z] !ENTRY org.eclipse.egit.ui 4 0 2021-02-12 08:09:55.429
03:09:55 [2021-02-12T08:09:55.434Z] !MESSAGE CrashingCommitMessageProviderWithCaretPositioning fails on purpose.
03:09:55 [2021-02-12T08:09:55.434Z] !STACK 0
03:09:55 [2021-02-12T08:09:55.434Z] java.lang.IllegalStateException: CrashingCommitMessageProviderWithCaretPositioning fails on purpose.
03:09:55 [2021-02-12T08:09:55.434Z] 	at org.eclipse.egit.ui.internal.dialogs.CommitMessageBuilderTest$CrashingCommitMessageProviderWithCaretPositioning.getCommitMessageWithPosition(CommitMessageBuilderTest.java:491)
03:09:55 [2021-02-12T08:09:55.434Z] 	at org.eclipse.egit.ui.internal.dialogs.CommitMessageBuilder.build(CommitMessageBuilder.java:81)
03:09:55 [2021-02-12T08:09:55.434Z] 	at org.eclipse.egit.ui.internal.dialogs.CommitMessageBuilderTest.commitMessageProvider_oneCrashingProviderWithCaretPosition(CommitMessageBuilderTest.java:112)
03:09:55 [2021-02-12T08:09:55.434Z] 	at sun.reflect.NativeMethodAccessorImpl.invoke0(Native Method)
03:09:55 [2021-02-12T08:09:55.434Z] 	at sun.reflect.NativeMethodAccessorImpl.invoke(NativeMethodAccessorImpl.java:62)
03:09:55 [2021-02-12T08:09:55.434Z] 	at sun.reflect.DelegatingMethodAccessorImpl.invoke(DelegatingMethodAccessorImpl.java:43)
03:09:55 [2021-02-12T08:09:55.434Z] 	at java.lang.reflect.Method.invoke(Method.java:498)
03:09:55 [2021-02-12T08:09:55.434Z] 	at org.junit.runners.model.FrameworkMethod$1.runReflectiveCall(FrameworkMethod.java:59)
03:09:55 [2021-02-12T08:09:55.434Z] 	at org.junit.internal.runners.model.ReflectiveCallable.run(ReflectiveCallable.java:12)
03:09:55 [2021-02-12T08:09:55.434Z] 	at org.junit.runners.model.FrameworkMethod.invokeExplosively(FrameworkMethod.java:56)
03:09:55 [2021-02-12T08:09:55.434Z] 	at org.junit.internal.runners.statements.InvokeMethod.evaluate(InvokeMethod.java:17)
03:09:55 [2021-02-12T08:09:55.434Z] 	at org.junit.internal.runners.statements.RunBefores.evaluate(RunBefores.java:26)
03:09:55 [2021-02-12T08:09:55.434Z] 	at org.junit.internal.runners.statements.RunAfters.evaluate(RunAfters.java:27)
03:09:55 [2021-02-12T08:09:55.434Z] 	at org.junit.runners.ParentRunner$3.evaluate(ParentRunner.java:306)
03:09:55 [2021-02-12T08:09:55.434Z] 	at org.junit.runners.BlockJUnit4ClassRunner$1.evaluate(BlockJUnit4ClassRunner.java:100)
03:09:55 [2021-02-12T08:09:55.434Z] 	at org.junit.runners.ParentRunner.runLeaf(ParentRunner.java:366)
03:09:55 [2021-02-12T08:09:55.434Z] 	at org.junit.runners.BlockJUnit4ClassRunner.runChild(BlockJUnit4ClassRunner.java:103)
03:09:55 [2021-02-12T08:09:55.434Z] 	at org.junit.runners.BlockJUnit4ClassRunner.runChild(BlockJUnit4ClassRunner.java:63)
03:09:55 [2021-02-12T08:09:55.434Z] 	at org.junit.runners.ParentRunner$4.run(ParentRunner.java:331)
03:09:55 [2021-02-12T08:09:55.434Z] 	at org.junit.runners.ParentRunner$1.schedule(ParentRunner.java:79)
03:09:55 [2021-02-12T08:09:55.434Z] 	at org.junit.runners.ParentRunner.runChildren(ParentRunner.java:329)
03:09:55 [2021-02-12T08:09:55.434Z] 	at org.junit.runners.ParentRunner.access$100(ParentRunner.java:66)
03:09:55 [2021-02-12T08:09:55.434Z] 	at org.junit.runners.ParentRunner$2.evaluate(ParentRunner.java:293)
03:09:55 [2021-02-12T08:09:55.434Z] 	at org.junit.internal.runners.statements.RunBefores.evaluate(RunBefores.java:26)
03:09:55 [2021-02-12T08:09:55.434Z] 	at org.junit.runners.ParentRunner$3.evaluate(ParentRunner.java:306)
03:09:55 [2021-02-12T08:09:55.434Z] 	at org.junit.runners.ParentRunner.run(ParentRunner.java:413)
03:09:55 [2021-02-12T08:09:55.434Z] 	at org.apache.maven.surefire.junit4.JUnit4Provider.execute(JUnit4Provider.java:365)
03:09:55 [2021-02-12T08:09:55.434Z] 	at org.apache.maven.surefire.junit4.JUnit4Provider.executeWithRerun(JUnit4Provider.java:273)
03:09:55 [2021-02-12T08:09:55.434Z] 	at org.apache.maven.surefire.junit4.JUnit4Provider.executeTestSet(JUnit4Provider.java:238)
03:09:55 [2021-02-12T08:09:55.434Z] 	at org.apache.maven.surefire.junit4.JUnit4Provider.invoke(JUnit4Provider.java:159)
03:09:55 [2021-02-12T08:09:55.434Z] 	at sun.reflect.NativeMethodAccessorImpl.invoke0(Native Method)
03:09:55 [2021-02-12T08:09:55.434Z] 	at sun.reflect.NativeMethodAccessorImpl.invoke(NativeMethodAccessorImpl.java:62)
03:09:55 [2021-02-12T08:09:55.434Z] 	at sun.reflect.DelegatingMethodAccessorImpl.invoke(DelegatingMethodAccessorImpl.java:43)
03:09:55 [2021-02-12T08:09:55.434Z] 	at java.lang.reflect.Method.invoke(Method.java:498)
03:09:55 [2021-02-12T08:09:55.434Z] 	at org.apache.maven.surefire.util.ReflectionUtils.invokeMethodWithArray2(ReflectionUtils.java:206)
03:09:55 [2021-02-12T08:09:55.434Z] 	at org.apache.maven.surefire.booter.ProviderFactory$ProviderProxy.invoke(ProviderFactory.java:161)
03:09:55 [2021-02-12T08:09:55.434Z] 	at org.apache.maven.surefire.booter.ProviderFactory.invokeProvider(ProviderFactory.java:84)
03:09:55 [2021-02-12T08:09:55.434Z] 	at org.eclipse.tycho.surefire.osgibooter.OsgiSurefireBooter.run(OsgiSurefireBooter.java:113)
03:09:55 [2021-02-12T08:09:55.434Z] 	at org.eclipse.tycho.surefire.osgibooter.AbstractUITestApplication.runTests(AbstractUITestApplication.java:44)
03:09:55 [2021-02-12T08:09:55.434Z] 	at org.eclipse.e4.ui.internal.workbench.swt.E4Testable$1.run(E4Testable.java:73)
03:09:55 [2021-02-12T08:09:55.434Z] 	at java.lang.Thread.run(Thread.java:748)
03:09:56 [2021-02-12T08:09:56.805Z] 
03:09:56 [2021-02-12T08:09:56.805Z] !ENTRY org.eclipse.egit.ui 4 0 2021-02-12 08:09:56.520
03:09:56 [2021-02-12T08:09:56.805Z] !MESSAGE CrashingCommitMessageProvider fails on purpose.
03:09:56 [2021-02-12T08:09:56.805Z] !STACK 0
03:09:56 [2021-02-12T08:09:56.805Z] java.lang.IllegalStateException: CrashingCommitMessageProvider fails on purpose.
03:09:56 [2021-02-12T08:09:56.805Z] 	at org.eclipse.egit.ui.internal.dialogs.CommitMessageBuilderTest$CrashingCommitMessageProvider.getMessage(CommitMessageBuilderTest.java:474)
03:09:56 [2021-02-12T08:09:56.805Z] 	at org.eclipse.egit.ui.internal.dialogs.CommitMessageBuilder.build(CommitMessageBuilder.java:90)
03:09:56 [2021-02-12T08:09:56.805Z] 	at org.eclipse.egit.ui.internal.dialogs.CommitMessageBuilderTest.commitMessageProvider_twoProvidersFirstOneCrashing(CommitMessageBuilderTest.java:146)
03:09:56 [2021-02-12T08:09:56.805Z] 	at sun.reflect.NativeMethodAccessorImpl.invoke0(Native Method)
03:09:56 [2021-02-12T08:09:56.805Z] 	at sun.reflect.NativeMethodAccessorImpl.invoke(NativeMethodAccessorImpl.java:62)
03:09:56 [2021-02-12T08:09:56.805Z] 	at sun.reflect.DelegatingMethodAccessorImpl.invoke(DelegatingMethodAccessorImpl.java:43)
03:09:56 [2021-02-12T08:09:56.805Z] 	at java.lang.reflect.Method.invoke(Method.java:498)
03:09:56 [2021-02-12T08:09:56.805Z] 	at org.junit.runners.model.FrameworkMethod$1.runReflectiveCall(FrameworkMethod.java:59)
03:09:56 [2021-02-12T08:09:56.805Z] 	at org.junit.internal.runners.model.ReflectiveCallable.run(ReflectiveCallable.java:12)
03:09:56 [2021-02-12T08:09:56.805Z] 	at org.junit.runners.model.FrameworkMethod.invokeExplosively(FrameworkMethod.java:56)
03:09:56 [2021-02-12T08:09:56.805Z] 	at org.junit.internal.runners.statements.InvokeMethod.evaluate(InvokeMethod.java:17)
03:09:56 [2021-02-12T08:09:56.805Z] 	at org.junit.internal.runners.statements.RunBefores.evaluate(RunBefores.java:26)
03:09:56 [2021-02-12T08:09:56.805Z] 	at org.junit.internal.runners.statements.RunAfters.evaluate(RunAfters.java:27)
03:09:56 [2021-02-12T08:09:56.805Z] 	at org.junit.runners.ParentRunner$3.evaluate(ParentRunner.java:306)
03:09:56 [2021-02-12T08:09:56.805Z] 	at org.junit.runners.BlockJUnit4ClassRunner$1.evaluate(BlockJUnit4ClassRunner.java:100)
03:09:56 [2021-02-12T08:09:56.805Z] 	at org.junit.runners.ParentRunner.runLeaf(ParentRunner.java:366)
03:09:56 [2021-02-12T08:09:56.805Z] 	at org.junit.runners.BlockJUnit4ClassRunner.runChild(BlockJUnit4ClassRunner.java:103)
03:09:56 [2021-02-12T08:09:56.805Z] 	at org.junit.runners.BlockJUnit4ClassRunner.runChild(BlockJUnit4ClassRunner.java:63)
03:09:56 [2021-02-12T08:09:56.805Z] 	at org.junit.runners.ParentRunner$4.run(ParentRunner.java:331)
03:09:56 [2021-02-12T08:09:56.805Z] 	at org.junit.runners.ParentRunner$1.schedule(ParentRunner.java:79)
03:09:56 [2021-02-12T08:09:56.805Z] 	at org.junit.runners.ParentRunner.runChildren(ParentRunner.java:329)
03:09:56 [2021-02-12T08:09:56.805Z] 	at org.junit.runners.ParentRunner.access$100(ParentRunner.java:66)
03:09:56 [2021-02-12T08:09:56.805Z] 	at org.junit.runners.ParentRunner$2.evaluate(ParentRunner.java:293)
03:09:56 [2021-02-12T08:09:56.805Z] 	at org.junit.internal.runners.statements.RunBefores.evaluate(RunBefores.java:26)
03:09:56 [2021-02-12T08:09:56.805Z] 	at org.junit.runners.ParentRunner$3.evaluate(ParentRunner.java:306)
03:09:56 [2021-02-12T08:09:56.805Z] 	at org.junit.runners.ParentRunner.run(ParentRunner.java:413)
03:09:56 [2021-02-12T08:09:56.805Z] 	at org.apache.maven.surefire.junit4.JUnit4Provider.execute(JUnit4Provider.java:365)
03:09:56 [2021-02-12T08:09:56.805Z] 	at org.apache.maven.surefire.junit4.JUnit4Provider.executeWithRerun(JUnit4Provider.java:273)
03:09:56 [2021-02-12T08:09:56.805Z] 	at org.apache.maven.surefire.junit4.JUnit4Provider.executeTestSet(JUnit4Provider.java:238)
03:09:56 [2021-02-12T08:09:56.805Z] 	at org.apache.maven.surefire.junit4.JUnit4Provider.invoke(JUnit4Provider.java:159)
03:09:56 [2021-02-12T08:09:56.805Z] 	at sun.reflect.NativeMethodAccessorImpl.invoke0(Native Method)
03:09:56 [2021-02-12T08:09:56.805Z] 	at sun.reflect.NativeMethodAccessorImpl.invoke(NativeMethodAccessorImpl.java:62)
03:09:56 [2021-02-12T08:09:56.805Z] 	at sun.reflect.DelegatingMethodAccessorImpl.invoke(DelegatingMethodAccessorImpl.java:43)
03:09:56 [2021-02-12T08:09:56.805Z] 	at java.lang.reflect.Method.invoke(Method.java:498)
03:09:56 [2021-02-12T08:09:56.805Z] 	at org.apache.maven.surefire.util.ReflectionUtils.invokeMethodWithArray2(ReflectionUtils.java:206)
03:09:56 [2021-02-12T08:09:56.805Z] 	at org.apache.maven.surefire.booter.ProviderFactory$ProviderProxy.invoke(ProviderFactory.java:161)
03:09:56 [2021-02-12T08:09:56.805Z] 	at org.apache.maven.surefire.booter.ProviderFactory.invokeProvider(ProviderFactory.java:84)
03:09:56 [2021-02-12T08:09:56.805Z] 	at org.eclipse.tycho.surefire.osgibooter.OsgiSurefireBooter.run(OsgiSurefireBooter.java:113)
03:09:56 [2021-02-12T08:09:56.805Z] 	at org.eclipse.tycho.surefire.osgibooter.AbstractUITestApplication.runTests(AbstractUITestApplication.java:44)
03:09:56 [2021-02-12T08:09:56.805Z] 	at org.eclipse.e4.ui.internal.workbench.swt.E4Testable$1.run(E4Testable.java:73)
03:09:56 [2021-02-12T08:09:56.805Z] 	at java.lang.Thread.run(Thread.java:748)
03:09:56 [2021-02-12T08:09:56.805Z] 
03:09:56 [2021-02-12T08:09:56.805Z] !ENTRY org.eclipse.egit.ui 4 0 2021-02-12 08:09:56.789
03:09:56 [2021-02-12T08:09:56.805Z] !MESSAGE CrashingCommitMessageProvider fails on purpose.
03:09:56 [2021-02-12T08:09:56.805Z] !STACK 0
03:09:56 [2021-02-12T08:09:56.805Z] java.lang.IllegalStateException: CrashingCommitMessageProvider fails on purpose.
03:09:56 [2021-02-12T08:09:56.805Z] 	at org.eclipse.egit.ui.internal.dialogs.CommitMessageBuilderTest$CrashingCommitMessageProvider.getMessage(CommitMessageBuilderTest.java:474)
03:09:56 [2021-02-12T08:09:56.805Z] 	at org.eclipse.egit.ui.internal.dialogs.CommitMessageBuilder.build(CommitMessageBuilder.java:90)
03:09:56 [2021-02-12T08:09:56.805Z] 	at org.eclipse.egit.ui.internal.dialogs.CommitMessageBuilderTest.commitMessageProvider_multipleProvidersWithCrashAndNull(CommitMessageBuilderTest.java:165)
03:09:56 [2021-02-12T08:09:56.805Z] 	at sun.reflect.NativeMethodAccessorImpl.invoke0(Native Method)
03:09:56 [2021-02-12T08:09:56.805Z] 	at sun.reflect.NativeMethodAccessorImpl.invoke(NativeMethodAccessorImpl.java:62)
03:09:56 [2021-02-12T08:09:56.805Z] 	at sun.reflect.DelegatingMethodAccessorImpl.invoke(DelegatingMethodAccessorImpl.java:43)
03:09:56 [2021-02-12T08:09:56.805Z] 	at java.lang.reflect.Method.invoke(Method.java:498)
03:09:56 [2021-02-12T08:09:56.805Z] 	at org.junit.runners.model.FrameworkMethod$1.runReflectiveCall(FrameworkMethod.java:59)
03:09:56 [2021-02-12T08:09:56.805Z] 	at org.junit.internal.runners.model.ReflectiveCallable.run(ReflectiveCallable.java:12)
03:09:56 [2021-02-12T08:09:56.805Z] 	at org.junit.runners.model.FrameworkMethod.invokeExplosively(FrameworkMethod.java:56)
03:09:56 [2021-02-12T08:09:56.805Z] 	at org.junit.internal.runners.statements.InvokeMethod.evaluate(InvokeMethod.java:17)
03:09:56 [2021-02-12T08:09:56.805Z] 	at org.junit.internal.runners.statements.RunBefores.evaluate(RunBefores.java:26)
03:09:56 [2021-02-12T08:09:56.805Z] 	at org.junit.internal.runners.statements.RunAfters.evaluate(RunAfters.java:27)
03:09:56 [2021-02-12T08:09:56.805Z] 	at org.junit.runners.ParentRunner$3.evaluate(ParentRunner.java:306)
03:09:56 [2021-02-12T08:09:56.805Z] 	at org.junit.runners.BlockJUnit4ClassRunner$1.evaluate(BlockJUnit4ClassRunner.java:100)
03:09:56 [2021-02-12T08:09:56.805Z] 	at org.junit.runners.ParentRunner.runLeaf(ParentRunner.java:366)
03:09:56 [2021-02-12T08:09:56.805Z] 	at org.junit.runners.BlockJUnit4ClassRunner.runChild(BlockJUnit4ClassRunner.java:103)
03:09:56 [2021-02-12T08:09:56.805Z] 	at org.junit.runners.BlockJUnit4ClassRunner.runChild(BlockJUnit4ClassRunner.java:63)
03:09:56 [2021-02-12T08:09:56.805Z] 	at org.junit.runners.ParentRunner$4.run(ParentRunner.java:331)
03:09:56 [2021-02-12T08:09:56.805Z] 	at org.junit.runners.ParentRunner$1.schedule(ParentRunner.java:79)
03:09:56 [2021-02-12T08:09:56.805Z] 	at org.junit.runners.ParentRunner.runChildren(ParentRunner.java:329)
03:09:56 [2021-02-12T08:09:56.805Z] 	at org.junit.runners.ParentRunner.access$100(ParentRunner.java:66)
03:09:56 [2021-02-12T08:09:56.805Z] 	at org.junit.runners.ParentRunner$2.evaluate(ParentRunner.java:293)
03:09:56 [2021-02-12T08:09:56.805Z] 	at org.junit.internal.runners.statements.RunBefores.evaluate(RunBefores.java:26)
03:09:56 [2021-02-12T08:09:56.805Z] 	at org.junit.runners.ParentRunner$3.evaluate(ParentRunner.java:306)
03:09:56 [2021-02-12T08:09:56.805Z] 	at org.junit.runners.ParentRunner.run(ParentRunner.java:413)
03:09:56 [2021-02-12T08:09:56.806Z] 	at org.apache.maven.surefire.junit4.JUnit4Provider.execute(JUnit4Provider.java:365)
03:09:56 [2021-02-12T08:09:56.806Z] 	at org.apache.maven.surefire.junit4.JUnit4Provider.executeWithRerun(JUnit4Provider.java:273)
03:09:56 [2021-02-12T08:09:56.806Z] 	at org.apache.maven.surefire.junit4.JUnit4Provider.executeTestSet(JUnit4Provider.java:238)
03:09:56 [2021-02-12T08:09:56.806Z] 	at org.apache.maven.surefire.junit4.JUnit4Provider.invoke(JUnit4Provider.java:159)
03:09:56 [2021-02-12T08:09:56.806Z] 	at sun.reflect.NativeMethodAccessorImpl.invoke0(Native Method)
03:09:56 [2021-02-12T08:09:56.806Z] 	at sun.reflect.NativeMethodAccessorImpl.invoke(NativeMethodAccessorImpl.java:62)
03:09:56 [2021-02-12T08:09:56.806Z] 	at sun.reflect.DelegatingMethodAccessorImpl.invoke(DelegatingMethodAccessorImpl.java:43)
03:09:56 [2021-02-12T08:09:56.806Z] 	at java.lang.reflect.Method.invoke(Method.java:498)
03:09:56 [2021-02-12T08:09:56.806Z] 	at org.apache.maven.surefire.util.ReflectionUtils.invokeMethodWithArray2(ReflectionUtils.java:206)
03:09:56 [2021-02-12T08:09:56.806Z] 	at org.apache.maven.surefire.booter.ProviderFactory$ProviderProxy.invoke(ProviderFactory.java:161)
03:09:56 [2021-02-12T08:09:56.806Z] 	at org.apache.maven.surefire.booter.ProviderFactory.invokeProvider(ProviderFactory.java:84)
03:09:56 [2021-02-12T08:09:56.806Z] 	at org.eclipse.tycho.surefire.osgibooter.OsgiSurefireBooter.run(OsgiSurefireBooter.java:113)
03:09:56 [2021-02-12T08:09:56.806Z] 	at org.eclipse.tycho.surefire.osgibooter.AbstractUITestApplication.runTests(AbstractUITestApplication.java:44)
03:09:56 [2021-02-12T08:09:56.806Z] 	at org.eclipse.e4.ui.internal.workbench.swt.E4Testable$1.run(E4Testable.java:73)
03:09:56 [2021-02-12T08:09:56.806Z] 	at java.lang.Thread.run(Thread.java:748)
03:09:56 [2021-02-12T08:09:56.806Z] 
03:09:56 [2021-02-12T08:09:56.806Z] !ENTRY org.eclipse.egit.ui 4 0 2021-02-12 08:09:56.789
03:09:56 [2021-02-12T08:09:56.806Z] !MESSAGE CrashingCommitMessageProvider fails on purpose.
03:09:56 [2021-02-12T08:09:56.806Z] !STACK 0
03:09:56 [2021-02-12T08:09:56.806Z] java.lang.IllegalStateException: CrashingCommitMessageProvider fails on purpose.
03:09:56 [2021-02-12T08:09:56.806Z] 	at org.eclipse.egit.ui.internal.dialogs.CommitMessageBuilderTest$CrashingCommitMessageProvider.getMessage(CommitMessageBuilderTest.java:474)
03:09:56 [2021-02-12T08:09:56.806Z] 	at org.eclipse.egit.ui.internal.dialogs.CommitMessageBuilder.build(CommitMessageBuilder.java:90)
03:09:56 [2021-02-12T08:09:56.806Z] 	at org.eclipse.egit.ui.internal.dialogs.CommitMessageBuilderTest.commitMessageProvider_multipleProvidersWithCrashAndNull(CommitMessageBuilderTest.java:165)
03:09:56 [2021-02-12T08:09:56.806Z] 	at sun.reflect.NativeMethodAccessorImpl.invoke0(Native Method)
03:09:56 [2021-02-12T08:09:56.806Z] 	at sun.reflect.NativeMethodAccessorImpl.invoke(NativeMethodAccessorImpl.java:62)
03:09:56 [2021-02-12T08:09:56.806Z] 	at sun.reflect.DelegatingMethodAccessorImpl.invoke(DelegatingMethodAccessorImpl.java:43)
03:09:56 [2021-02-12T08:09:56.806Z] 	at java.lang.reflect.Method.invoke(Method.java:498)
03:09:56 [2021-02-12T08:09:56.806Z] 	at org.junit.runners.model.FrameworkMethod$1.runReflectiveCall(FrameworkMethod.java:59)
03:09:56 [2021-02-12T08:09:56.806Z] 	at org.junit.internal.runners.model.ReflectiveCallable.run(ReflectiveCallable.java:12)
03:09:56 [2021-02-12T08:09:56.806Z] 	at org.junit.runners.model.FrameworkMethod.invokeExplosively(FrameworkMethod.java:56)
03:09:56 [2021-02-12T08:09:56.806Z] 	at org.junit.internal.runners.statements.InvokeMethod.evaluate(InvokeMethod.java:17)
03:09:56 [2021-02-12T08:09:56.806Z] 	at org.junit.internal.runners.statements.RunBefores.evaluate(RunBefores.java:26)
03:09:56 [2021-02-12T08:09:56.806Z] 	at org.junit.internal.runners.statements.RunAfters.evaluate(RunAfters.java:27)
03:09:56 [2021-02-12T08:09:56.806Z] 	at org.junit.runners.ParentRunner$3.evaluate(ParentRunner.java:306)
03:09:56 [2021-02-12T08:09:56.806Z] 	at org.junit.runners.BlockJUnit4ClassRunner$1.evaluate(BlockJUnit4ClassRunner.java:100)
03:09:56 [2021-02-12T08:09:56.806Z] 	at org.junit.runners.ParentRunner.runLeaf(ParentRunner.java:366)
03:09:56 [2021-02-12T08:09:56.806Z] 	at org.junit.runners.BlockJUnit4ClassRunner.runChild(BlockJUnit4ClassRunner.java:103)
03:09:56 [2021-02-12T08:09:56.806Z] 	at org.junit.runners.BlockJUnit4ClassRunner.runChild(BlockJUnit4ClassRunner.java:63)
03:09:56 [2021-02-12T08:09:56.806Z] 	at org.junit.runners.ParentRunner$4.run(ParentRunner.java:331)
03:09:56 [2021-02-12T08:09:56.806Z] 	at org.junit.runners.ParentRunner$1.schedule(ParentRunner.java:79)
03:09:56 [2021-02-12T08:09:56.806Z] 	at org.junit.runners.ParentRunner.runChildren(ParentRunner.java:329)
03:09:56 [2021-02-12T08:09:56.806Z] 	at org.junit.runners.ParentRunner.access$100(ParentRunner.java:66)
03:09:56 [2021-02-12T08:09:56.806Z] 	at org.junit.runners.ParentRunner$2.evaluate(ParentRunner.java:293)
03:09:56 [2021-02-12T08:09:56.806Z] 	at org.junit.internal.runners.statements.RunBefores.evaluate(RunBefores.java:26)
03:09:56 [2021-02-12T08:09:56.806Z] 	at org.junit.runners.ParentRunner$3.evaluate(ParentRunner.java:306)
03:09:56 [2021-02-12T08:09:56.806Z] 	at org.junit.runners.ParentRunner.run(ParentRunner.java:413)
03:09:56 [2021-02-12T08:09:56.806Z] 	at org.apache.maven.surefire.junit4.JUnit4Provider.execute(JUnit4Provider.java:365)
03:09:56 [2021-02-12T08:09:56.806Z] 	at org.apache.maven.surefire.junit4.JUnit4Provider.executeWithRerun(JUnit4Provider.java:273)
03:09:56 [2021-02-12T08:09:56.806Z] 	at org.apache.maven.surefire.junit4.JUnit4Provider.executeTestSet(JUnit4Provider.java:238)
03:09:56 [2021-02-12T08:09:56.806Z] 	at org.apache.maven.surefire.junit4.JUnit4Provider.invoke(JUnit4Provider.java:159)
03:09:56 [2021-02-12T08:09:56.806Z] 	at sun.reflect.NativeMethodAccessorImpl.invoke0(Native Method)
03:09:56 [2021-02-12T08:09:56.806Z] 	at sun.reflect.NativeMethodAccessorImpl.invoke(NativeMethodAccessorImpl.java:62)
03:09:56 [2021-02-12T08:09:56.806Z] 	at sun.reflect.DelegatingMethodAccessorImpl.invoke(DelegatingMethodAccessorImpl.java:43)
03:09:56 [2021-02-12T08:09:56.806Z] 	at java.lang.reflect.Method.invoke(Method.java:498)
03:09:56 [2021-02-12T08:09:56.806Z] 	at org.apache.maven.surefire.util.ReflectionUtils.invokeMethodWithArray2(ReflectionUtils.java:206)
03:09:56 [2021-02-12T08:09:56.806Z] 	at org.apache.maven.surefire.booter.ProviderFactory$ProviderProxy.invoke(ProviderFactory.java:161)
03:09:56 [2021-02-12T08:09:56.806Z] 	at org.apache.maven.surefire.booter.ProviderFactory.invokeProvider(ProviderFactory.java:84)
03:09:56 [2021-02-12T08:09:56.806Z] 	at org.eclipse.tycho.surefire.osgibooter.OsgiSurefireBooter.run(OsgiSurefireBooter.java:113)
03:09:56 [2021-02-12T08:09:56.806Z] 	at org.eclipse.tycho.surefire.osgibooter.AbstractUITestApplication.runTests(AbstractUITestApplication.java:44)
03:09:56 [2021-02-12T08:09:56.806Z] 	at org.eclipse.e4.ui.internal.workbench.swt.E4Testable$1.run(E4Testable.java:73)
03:09:56 [2021-02-12T08:09:56.806Z] 	at java.lang.Thread.run(Thread.java:748)
03:09:57 [2021-02-12T08:09:57.063Z] 
03:09:57 [2021-02-12T08:09:57.064Z] !ENTRY org.eclipse.egit.ui 2 0 2021-02-12 08:09:56.874
03:09:57 [2021-02-12T08:09:57.064Z] !MESSAGE The ICommitMessageProvider2 implementation org.eclipse.egit.ui.internal.dialogs.CommitMessageBuilderTest$3 provided the caret position -42, which exceeds the length of the commit message or is negative. The caret position is ignored.
03:09:58 [2021-02-12T08:09:58.435Z] 
03:09:58 [2021-02-12T08:09:58.435Z] !ENTRY org.eclipse.egit.ui 2 0 2021-02-12 08:09:58.306
03:09:58 [2021-02-12T08:09:58.435Z] !MESSAGE Found multiple implementations of ICommitMessageProvider2. Ignoring caret positioning for org.eclipse.egit.ui.internal.dialogs.CommitMessageBuilderTest$3.
03:09:59 [2021-02-12T08:09:59.803Z] 
03:09:59 [2021-02-12T08:09:59.803Z] !ENTRY org.eclipse.egit.ui 4 0 2021-02-12 08:09:59.667
03:09:59 [2021-02-12T08:09:59.803Z] !MESSAGE CrashingCommitMessageProvider fails on purpose.
03:09:59 [2021-02-12T08:09:59.803Z] !STACK 0
03:09:59 [2021-02-12T08:09:59.803Z] java.lang.IllegalStateException: CrashingCommitMessageProvider fails on purpose.
03:09:59 [2021-02-12T08:09:59.803Z] 	at org.eclipse.egit.ui.internal.dialogs.CommitMessageBuilderTest$CrashingCommitMessageProvider.getMessage(CommitMessageBuilderTest.java:474)
03:09:59 [2021-02-12T08:09:59.803Z] 	at org.eclipse.egit.ui.internal.dialogs.CommitMessageBuilder.build(CommitMessageBuilder.java:90)
03:09:59 [2021-02-12T08:09:59.803Z] 	at org.eclipse.egit.ui.internal.dialogs.CommitMessageBuilderTest.commitMessageProvider_twoProvidersSecondOneCrashing(CommitMessageBuilderTest.java:130)
03:09:59 [2021-02-12T08:09:59.803Z] 	at sun.reflect.NativeMethodAccessorImpl.invoke0(Native Method)
03:09:59 [2021-02-12T08:09:59.803Z] 	at sun.reflect.NativeMethodAccessorImpl.invoke(NativeMethodAccessorImpl.java:62)
03:09:59 [2021-02-12T08:09:59.803Z] 	at sun.reflect.DelegatingMethodAccessorImpl.invoke(DelegatingMethodAccessorImpl.java:43)
03:09:59 [2021-02-12T08:09:59.803Z] 	at java.lang.reflect.Method.invoke(Method.java:498)
03:09:59 [2021-02-12T08:09:59.803Z] 	at org.junit.runners.model.FrameworkMethod$1.runReflectiveCall(FrameworkMethod.java:59)
03:09:59 [2021-02-12T08:09:59.803Z] 	at org.junit.internal.runners.model.ReflectiveCallable.run(ReflectiveCallable.java:12)
03:09:59 [2021-02-12T08:09:59.803Z] 	at org.junit.runners.model.FrameworkMethod.invokeExplosively(FrameworkMethod.java:56)
03:09:59 [2021-02-12T08:09:59.803Z] 	at org.junit.internal.runners.statements.InvokeMethod.evaluate(InvokeMethod.java:17)
03:09:59 [2021-02-12T08:09:59.803Z] 	at org.junit.internal.runners.statements.RunBefores.evaluate(RunBefores.java:26)
03:09:59 [2021-02-12T08:09:59.803Z] 	at org.junit.internal.runners.statements.RunAfters.evaluate(RunAfters.java:27)
03:09:59 [2021-02-12T08:09:59.803Z] 	at org.junit.runners.ParentRunner$3.evaluate(ParentRunner.java:306)
03:09:59 [2021-02-12T08:09:59.803Z] 	at org.junit.runners.BlockJUnit4ClassRunner$1.evaluate(BlockJUnit4ClassRunner.java:100)
03:09:59 [2021-02-12T08:09:59.803Z] 	at org.junit.runners.ParentRunner.runLeaf(ParentRunner.java:366)
03:09:59 [2021-02-12T08:09:59.803Z] 	at org.junit.runners.BlockJUnit4ClassRunner.runChild(BlockJUnit4ClassRunner.java:103)
03:09:59 [2021-02-12T08:09:59.804Z] 	at org.junit.runners.BlockJUnit4ClassRunner.runChild(BlockJUnit4ClassRunner.java:63)
03:09:59 [2021-02-12T08:09:59.804Z] 	at org.junit.runners.ParentRunner$4.run(ParentRunner.java:331)
03:09:59 [2021-02-12T08:09:59.804Z] 	at org.junit.runners.ParentRunner$1.schedule(ParentRunner.java:79)
03:09:59 [2021-02-12T08:09:59.804Z] 	at org.junit.runners.ParentRunner.runChildren(ParentRunner.java:329)
03:09:59 [2021-02-12T08:09:59.804Z] 	at org.junit.runners.ParentRunner.access$100(ParentRunner.java:66)
03:09:59 [2021-02-12T08:09:59.804Z] 	at org.junit.runners.ParentRunner$2.evaluate(ParentRunner.java:293)
03:09:59 [2021-02-12T08:09:59.804Z] 	at org.junit.internal.runners.statements.RunBefores.evaluate(RunBefores.java:26)
03:09:59 [2021-02-12T08:09:59.804Z] 	at org.junit.runners.ParentRunner$3.evaluate(ParentRunner.java:306)
03:09:59 [2021-02-12T08:09:59.804Z] 	at org.junit.runners.ParentRunner.run(ParentRunner.java:413)
03:09:59 [2021-02-12T08:09:59.804Z] 	at org.apache.maven.surefire.junit4.JUnit4Provider.execute(JUnit4Provider.java:365)
03:09:59 [2021-02-12T08:09:59.804Z] 	at org.apache.maven.surefire.junit4.JUnit4Provider.executeWithRerun(JUnit4Provider.java:273)
03:09:59 [2021-02-12T08:09:59.804Z] 	at org.apache.maven.surefire.junit4.JUnit4Provider.executeTestSet(JUnit4Provider.java:238)
03:09:59 [2021-02-12T08:09:59.804Z] 	at org.apache.maven.surefire.junit4.JUnit4Provider.invoke(JUnit4Provider.java:159)
03:09:59 [2021-02-12T08:09:59.804Z] 	at sun.reflect.NativeMethodAccessorImpl.invoke0(Native Method)
03:09:59 [2021-02-12T08:09:59.804Z] 	at sun.reflect.NativeMethodAccessorImpl.invoke(NativeMethodAccessorImpl.java:62)
03:09:59 [2021-02-12T08:09:59.804Z] 	at sun.reflect.DelegatingMethodAccessorImpl.invoke(DelegatingMethodAccessorImpl.java:43)
03:09:59 [2021-02-12T08:09:59.804Z] 	at java.lang.reflect.Method.invoke(Method.java:498)
03:09:59 [2021-02-12T08:09:59.804Z] 	at org.apache.maven.surefire.util.ReflectionUtils.invokeMethodWithArray2(ReflectionUtils.java:206)
03:09:59 [2021-02-12T08:09:59.804Z] 	at org.apache.maven.surefire.booter.ProviderFactory$ProviderProxy.invoke(ProviderFactory.java:161)
03:09:59 [2021-02-12T08:09:59.804Z] 	at org.apache.maven.surefire.booter.ProviderFactory.invokeProvider(ProviderFactory.java:84)
03:09:59 [2021-02-12T08:09:59.804Z] 	at org.eclipse.tycho.surefire.osgibooter.OsgiSurefireBooter.run(OsgiSurefireBooter.java:113)
03:09:59 [2021-02-12T08:09:59.804Z] 	at org.eclipse.tycho.surefire.osgibooter.AbstractUITestApplication.runTests(AbstractUITestApplication.java:44)
03:09:59 [2021-02-12T08:09:59.804Z] 	at org.eclipse.e4.ui.internal.workbench.swt.E4Testable$1.run(E4Testable.java:73)
03:09:59 [2021-02-12T08:09:59.804Z] 	at java.lang.Thread.run(Thread.java:748)
03:09:59 [2021-02-12T08:09:59.804Z] 
03:09:59 [2021-02-12T08:09:59.804Z] !ENTRY org.eclipse.egit.ui 4 0 2021-02-12 08:09:59.751
03:09:59 [2021-02-12T08:09:59.804Z] !MESSAGE CrashingCommitMessageProvider fails on purpose.
03:09:59 [2021-02-12T08:09:59.804Z] !STACK 0
03:09:59 [2021-02-12T08:09:59.804Z] java.lang.IllegalStateException: CrashingCommitMessageProvider fails on purpose.
03:09:59 [2021-02-12T08:09:59.804Z] 	at org.eclipse.egit.ui.internal.dialogs.CommitMessageBuilderTest$CrashingCommitMessageProvider.getMessage(CommitMessageBuilderTest.java:474)
03:09:59 [2021-02-12T08:09:59.804Z] 	at org.eclipse.egit.ui.internal.dialogs.CommitMessageBuilder.build(CommitMessageBuilder.java:90)
03:09:59 [2021-02-12T08:09:59.804Z] 	at org.eclipse.egit.ui.internal.dialogs.CommitMessageBuilderTest.commitMessageProvider_multipleProvidersWithCrashingAndNullAndOneCaretPositioning(CommitMessageBuilderTest.java:414)
03:09:59 [2021-02-12T08:09:59.804Z] 	at sun.reflect.NativeMethodAccessorImpl.invoke0(Native Method)
03:09:59 [2021-02-12T08:09:59.804Z] 	at sun.reflect.NativeMethodAccessorImpl.invoke(NativeMethodAccessorImpl.java:62)
03:09:59 [2021-02-12T08:09:59.804Z] 	at sun.reflect.DelegatingMethodAccessorImpl.invoke(DelegatingMethodAccessorImpl.java:43)
03:09:59 [2021-02-12T08:09:59.804Z] 	at java.lang.reflect.Method.invoke(Method.java:498)
03:09:59 [2021-02-12T08:09:59.804Z] 	at org.junit.runners.model.FrameworkMethod$1.runReflectiveCall(FrameworkMethod.java:59)
03:09:59 [2021-02-12T08:09:59.804Z] 	at org.junit.internal.runners.model.ReflectiveCallable.run(ReflectiveCallable.java:12)
03:09:59 [2021-02-12T08:09:59.804Z] 	at org.junit.runners.model.FrameworkMethod.invokeExplosively(FrameworkMethod.java:56)
03:09:59 [2021-02-12T08:09:59.804Z] 	at org.junit.internal.runners.statements.InvokeMethod.evaluate(InvokeMethod.java:17)
03:09:59 [2021-02-12T08:09:59.804Z] 	at org.junit.internal.runners.statements.RunBefores.evaluate(RunBefores.java:26)
03:09:59 [2021-02-12T08:09:59.804Z] 	at org.junit.internal.runners.statements.RunAfters.evaluate(RunAfters.java:27)
03:09:59 [2021-02-12T08:09:59.804Z] 	at org.junit.runners.ParentRunner$3.evaluate(ParentRunner.java:306)
03:09:59 [2021-02-12T08:09:59.804Z] 	at org.junit.runners.BlockJUnit4ClassRunner$1.evaluate(BlockJUnit4ClassRunner.java:100)
03:09:59 [2021-02-12T08:09:59.804Z] 	at org.junit.runners.ParentRunner.runLeaf(ParentRunner.java:366)
03:09:59 [2021-02-12T08:09:59.804Z] 	at org.junit.runners.BlockJUnit4ClassRunner.runChild(BlockJUnit4ClassRunner.java:103)
03:09:59 [2021-02-12T08:09:59.804Z] 	at org.junit.runners.BlockJUnit4ClassRunner.runChild(BlockJUnit4ClassRunner.java:63)
03:09:59 [2021-02-12T08:09:59.804Z] 	at org.junit.runners.ParentRunner$4.run(ParentRunner.java:331)
03:09:59 [2021-02-12T08:09:59.804Z] 	at org.junit.runners.ParentRunner$1.schedule(ParentRunner.java:79)
03:09:59 [2021-02-12T08:09:59.804Z] 	at org.junit.runners.ParentRunner.runChildren(ParentRunner.java:329)
03:09:59 [2021-02-12T08:09:59.804Z] 	at org.junit.runners.ParentRunner.access$100(ParentRunner.java:66)
03:09:59 [2021-02-12T08:09:59.804Z] 	at org.junit.runners.ParentRunner$2.evaluate(ParentRunner.java:293)
03:09:59 [2021-02-12T08:09:59.804Z] 	at org.junit.internal.runners.statements.RunBefores.evaluate(RunBefores.java:26)
03:09:59 [2021-02-12T08:09:59.804Z] 	at org.junit.runners.ParentRunner$3.evaluate(ParentRunner.java:306)
03:09:59 [2021-02-12T08:09:59.804Z] 	at org.junit.runners.ParentRunner.run(ParentRunner.java:413)
03:09:59 [2021-02-12T08:09:59.804Z] 	at org.apache.maven.surefire.junit4.JUnit4Provider.execute(JUnit4Provider.java:365)
03:09:59 [2021-02-12T08:09:59.804Z] 	at org.apache.maven.surefire.junit4.JUnit4Provider.executeWithRerun(JUnit4Provider.java:273)
03:09:59 [2021-02-12T08:09:59.804Z] 	at org.apache.maven.surefire.junit4.JUnit4Provider.executeTestSet(JUnit4Provider.java:238)
03:09:59 [2021-02-12T08:09:59.804Z] 	at org.apache.maven.surefire.junit4.JUnit4Provider.invoke(JUnit4Provider.java:159)
03:09:59 [2021-02-12T08:09:59.804Z] 	at sun.reflect.NativeMethodAccessorImpl.invoke0(Native Method)
03:09:59 [2021-02-12T08:09:59.804Z] 	at sun.reflect.NativeMethodAccessorImpl.invoke(NativeMethodAccessorImpl.java:62)
03:09:59 [2021-02-12T08:09:59.804Z] 	at sun.reflect.DelegatingMethodAccessorImpl.invoke(DelegatingMethodAccessorImpl.java:43)
03:09:59 [2021-02-12T08:09:59.804Z] 	at java.lang.reflect.Method.invoke(Method.java:498)
03:09:59 [2021-02-12T08:09:59.804Z] 	at org.apache.maven.surefire.util.ReflectionUtils.invokeMethodWithArray2(ReflectionUtils.java:206)
03:09:59 [2021-02-12T08:09:59.804Z] 	at org.apache.maven.surefire.booter.ProviderFactory$ProviderProxy.invoke(ProviderFactory.java:161)
03:09:59 [2021-02-12T08:09:59.804Z] 	at org.apache.maven.surefire.booter.ProviderFactory.invokeProvider(ProviderFactory.java:84)
03:09:59 [2021-02-12T08:09:59.804Z] 	at org.eclipse.tycho.surefire.osgibooter.OsgiSurefireBooter.run(OsgiSurefireBooter.java:113)
03:09:59 [2021-02-12T08:09:59.804Z] 	at org.eclipse.tycho.surefire.osgibooter.AbstractUITestApplication.runTests(AbstractUITestApplication.java:44)
03:09:59 [2021-02-12T08:09:59.804Z] 	at org.eclipse.e4.ui.internal.workbench.swt.E4Testable$1.run(E4Testable.java:73)
03:09:59 [2021-02-12T08:09:59.804Z] 	at java.lang.Thread.run(Thread.java:748)
03:09:59 [2021-02-12T08:09:59.804Z] 
03:09:59 [2021-02-12T08:09:59.804Z] !ENTRY org.eclipse.egit.ui 4 0 2021-02-12 08:09:59.752
03:09:59 [2021-02-12T08:09:59.804Z] !MESSAGE CrashingCommitMessageProvider fails on purpose.
03:09:59 [2021-02-12T08:09:59.804Z] !STACK 0
03:09:59 [2021-02-12T08:09:59.804Z] java.lang.IllegalStateException: CrashingCommitMessageProvider fails on purpose.
03:09:59 [2021-02-12T08:09:59.804Z] 	at org.eclipse.egit.ui.internal.dialogs.CommitMessageBuilderTest$CrashingCommitMessageProvider.getMessage(CommitMessageBuilderTest.java:474)
03:09:59 [2021-02-12T08:09:59.804Z] 	at org.eclipse.egit.ui.internal.dialogs.CommitMessageBuilder.build(CommitMessageBuilder.java:90)
03:09:59 [2021-02-12T08:09:59.805Z] 	at org.eclipse.egit.ui.internal.dialogs.CommitMessageBuilderTest.commitMessageProvider_multipleProvidersWithCrashingAndNullAndOneCaretPositioning(CommitMessageBuilderTest.java:414)
03:09:59 [2021-02-12T08:09:59.805Z] 	at sun.reflect.NativeMethodAccessorImpl.invoke0(Native Method)
03:09:59 [2021-02-12T08:09:59.805Z] 	at sun.reflect.NativeMethodAccessorImpl.invoke(NativeMethodAccessorImpl.java:62)
03:09:59 [2021-02-12T08:09:59.805Z] 	at sun.reflect.DelegatingMethodAccessorImpl.invoke(DelegatingMethodAccessorImpl.java:43)
03:09:59 [2021-02-12T08:09:59.805Z] 	at java.lang.reflect.Method.invoke(Method.java:498)
03:09:59 [2021-02-12T08:09:59.805Z] 	at org.junit.runners.model.FrameworkMethod$1.runReflectiveCall(FrameworkMethod.java:59)
03:09:59 [2021-02-12T08:09:59.805Z] 	at org.junit.internal.runners.model.ReflectiveCallable.run(ReflectiveCallable.java:12)
03:09:59 [2021-02-12T08:09:59.805Z] 	at org.junit.runners.model.FrameworkMethod.invokeExplosively(FrameworkMethod.java:56)
03:09:59 [2021-02-12T08:09:59.805Z] 	at org.junit.internal.runners.statements.InvokeMethod.evaluate(InvokeMethod.java:17)
03:09:59 [2021-02-12T08:09:59.805Z] 	at org.junit.internal.runners.statements.RunBefores.evaluate(RunBefores.java:26)
03:09:59 [2021-02-12T08:09:59.805Z] 	at org.junit.internal.runners.statements.RunAfters.evaluate(RunAfters.java:27)
03:09:59 [2021-02-12T08:09:59.805Z] 	at org.junit.runners.ParentRunner$3.evaluate(ParentRunner.java:306)
03:09:59 [2021-02-12T08:09:59.805Z] 	at org.junit.runners.BlockJUnit4ClassRunner$1.evaluate(BlockJUnit4ClassRunner.java:100)
03:09:59 [2021-02-12T08:09:59.805Z] 	at org.junit.runners.ParentRunner.runLeaf(ParentRunner.java:366)
03:09:59 [2021-02-12T08:09:59.805Z] 	at org.junit.runners.BlockJUnit4ClassRunner.runChild(BlockJUnit4ClassRunner.java:103)
03:09:59 [2021-02-12T08:09:59.805Z] 	at org.junit.runners.BlockJUnit4ClassRunner.runChild(BlockJUnit4ClassRunner.java:63)
03:09:59 [2021-02-12T08:09:59.805Z] 	at org.junit.runners.ParentRunner$4.run(ParentRunner.java:331)
03:09:59 [2021-02-12T08:09:59.805Z] 	at org.junit.runners.ParentRunner$1.schedule(ParentRunner.java:79)
03:09:59 [2021-02-12T08:09:59.805Z] 	at org.junit.runners.ParentRunner.runChildren(ParentRunner.java:329)
03:09:59 [2021-02-12T08:09:59.805Z] 	at org.junit.runners.ParentRunner.access$100(ParentRunner.java:66)
03:09:59 [2021-02-12T08:09:59.805Z] 	at org.junit.runners.ParentRunner$2.evaluate(ParentRunner.java:293)
03:09:59 [2021-02-12T08:09:59.805Z] 	at org.junit.internal.runners.statements.RunBefores.evaluate(RunBefores.java:26)
03:09:59 [2021-02-12T08:09:59.805Z] 	at org.junit.runners.ParentRunner$3.evaluate(ParentRunner.java:306)
03:09:59 [2021-02-12T08:09:59.805Z] 	at org.junit.runners.ParentRunner.run(ParentRunner.java:413)
03:09:59 [2021-02-12T08:09:59.805Z] 	at org.apache.maven.surefire.junit4.JUnit4Provider.execute(JUnit4Provider.java:365)
03:09:59 [2021-02-12T08:09:59.805Z] 	at org.apache.maven.surefire.junit4.JUnit4Provider.executeWithRerun(JUnit4Provider.java:273)
03:09:59 [2021-02-12T08:09:59.805Z] 	at org.apache.maven.surefire.junit4.JUnit4Provider.executeTestSet(JUnit4Provider.java:238)
03:09:59 [2021-02-12T08:09:59.805Z] 	at org.apache.maven.surefire.junit4.JUnit4Provider.invoke(JUnit4Provider.java:159)
03:09:59 [2021-02-12T08:09:59.805Z] 	at sun.reflect.NativeMethodAccessorImpl.invoke0(Native Method)
03:09:59 [2021-02-12T08:09:59.805Z] 	at sun.reflect.NativeMethodAccessorImpl.invoke(NativeMethodAccessorImpl.java:62)
03:09:59 [2021-02-12T08:09:59.805Z] 	at sun.reflect.DelegatingMethodAccessorImpl.invoke(DelegatingMethodAccessorImpl.java:43)
03:09:59 [2021-02-12T08:09:59.805Z] 	at java.lang.reflect.Method.invoke(Method.java:498)
03:09:59 [2021-02-12T08:09:59.805Z] 	at org.apache.maven.surefire.util.ReflectionUtils.invokeMethodWithArray2(ReflectionUtils.java:206)
03:09:59 [2021-02-12T08:09:59.805Z] 	at org.apache.maven.surefire.booter.ProviderFactory$ProviderProxy.invoke(ProviderFactory.java:161)
03:09:59 [2021-02-12T08:09:59.805Z] 	at org.apache.maven.surefire.booter.ProviderFactory.invokeProvider(ProviderFactory.java:84)
03:09:59 [2021-02-12T08:09:59.805Z] 	at org.eclipse.tycho.surefire.osgibooter.OsgiSurefireBooter.run(OsgiSurefireBooter.java:113)
03:09:59 [2021-02-12T08:09:59.805Z] 	at org.eclipse.tycho.surefire.osgibooter.AbstractUITestApplication.runTests(AbstractUITestApplication.java:44)
03:09:59 [2021-02-12T08:09:59.805Z] 	at org.eclipse.e4.ui.internal.workbench.swt.E4Testable$1.run(E4Testable.java:73)
03:09:59 [2021-02-12T08:09:59.805Z] 	at java.lang.Thread.run(Thread.java:748)
03:10:00 [2021-02-12T08:10:00.062Z] 
03:10:00 [2021-02-12T08:10:00.062Z] !ENTRY org.eclipse.egit.ui 2 0 2021-02-12 08:09:59.860
03:10:00 [2021-02-12T08:10:00.062Z] !MESSAGE Found multiple implementations of ICommitMessageProvider2. Ignoring caret positioning for org.eclipse.egit.ui.internal.dialogs.CommitMessageBuilderTest$3.
03:10:00 [2021-02-12T08:10:00.062Z] 
03:10:00 [2021-02-12T08:10:00.062Z] !ENTRY org.eclipse.egit.ui 2 0 2021-02-12 08:09:59.942
03:10:00 [2021-02-12T08:10:00.062Z] !MESSAGE The ICommitMessageProvider2 implementation org.eclipse.egit.ui.internal.dialogs.CommitMessageBuilderTest$3 provided the caret position 14, which exceeds the length of the commit message or is negative. The caret position is ignored.
03:10:00 [2021-02-12T08:10:00.062Z] Tests run: 20, Failures: 0, Errors: 0, Skipped: 0, Time elapsed: 4.78 s - in org.eclipse.egit.ui.internal.dialogs.CommitMessageBuilderTest
03:10:00 [2021-02-12T08:10:00.062Z] commitMessageProvider_oneCrashingProvider(org.eclipse.egit.ui.internal.dialogs.CommitMessageBuilderTest)  Time elapsed: 0.097 s
03:10:00 [2021-02-12T08:10:00.062Z] commitMessageProvider_twoProvidersSecondWithCaretPositioning(org.eclipse.egit.ui.internal.dialogs.CommitMessageBuilderTest)  Time elapsed: 0.084 s
03:10:00 [2021-02-12T08:10:00.062Z] commitMessageProvider_oneCrashingProviderWithCaretPosition(org.eclipse.egit.ui.internal.dialogs.CommitMessageBuilderTest)  Time elapsed: 0.084 s
03:10:00 [2021-02-12T08:10:00.062Z] commitMessageProvider_twoProvidersFirstOneCrashing(org.eclipse.egit.ui.internal.dialogs.CommitMessageBuilderTest)  Time elapsed: 1.106 s
03:10:00 [2021-02-12T08:10:00.062Z] commitMessageProvider_noProvider(org.eclipse.egit.ui.internal.dialogs.CommitMessageBuilderTest)  Time elapsed: 0.091 s
03:10:00 [2021-02-12T08:10:00.062Z] commitMessageProvider_oneProvider(org.eclipse.egit.ui.internal.dialogs.CommitMessageBuilderTest)  Time elapsed: 0.08 s
03:10:00 [2021-02-12T08:10:00.062Z] commitMessageProvider_multipleProvidersWithCrashAndNull(org.eclipse.egit.ui.internal.dialogs.CommitMessageBuilderTest)  Time elapsed: 0.083 s
03:10:00 [2021-02-12T08:10:00.062Z] commitMessageProvider_oneProviderWithInvalidNegativeCaretPosition(org.eclipse.egit.ui.internal.dialogs.CommitMessageBuilderTest)  Time elapsed: 0.084 s
03:10:00 [2021-02-12T08:10:00.062Z] commitMessageProvider_twoProvidersSecondWithUndefinedCaretPosition(org.eclipse.egit.ui.internal.dialogs.CommitMessageBuilderTest)  Time elapsed: 0.134 s
03:10:00 [2021-02-12T08:10:00.062Z] commitMessageProvider_twoProvidersWithCaretPositioningFirstWithUndefinedCaretPosition(org.eclipse.egit.ui.internal.dialogs.CommitMessageBuilderTest)  Time elapsed: 1.047 s
03:10:00 [2021-02-12T08:10:00.062Z] commitMessageProvider_oneProviderWithCaretPositionEqualsMessageLength(org.eclipse.egit.ui.internal.dialogs.CommitMessageBuilderTest)  Time elapsed: 0.088 s
03:10:00 [2021-02-12T08:10:00.062Z] commitMessageProvider_twoProvidersFirstWithCaretPositioning(org.eclipse.egit.ui.internal.dialogs.CommitMessageBuilderTest)  Time elapsed: 0.08 s
03:10:00 [2021-02-12T08:10:00.062Z] commitMessageProvider_twoProvidersWithCaretPositioningSecondWithUndefinedCaretPosition(org.eclipse.egit.ui.internal.dialogs.CommitMessageBuilderTest)  Time elapsed: 0.084 s
03:10:00 [2021-02-12T08:10:00.062Z] commitMessageProvider_oneProviderWithCaretPositioning(org.eclipse.egit.ui.internal.dialogs.CommitMessageBuilderTest)  Time elapsed: 0.077 s
03:10:00 [2021-02-12T08:10:00.062Z] commitMessageProvider_twoProvidersSecondWithCaretPositionZero(org.eclipse.egit.ui.internal.dialogs.CommitMessageBuilderTest)  Time elapsed: 0.137 s
03:10:00 [2021-02-12T08:10:00.062Z] commitMessageProvider_twoProviders(org.eclipse.egit.ui.internal.dialogs.CommitMessageBuilderTest)  Time elapsed: 1.052 s
03:10:00 [2021-02-12T08:10:00.062Z] commitMessageProvider_twoProvidersSecondOneCrashing(org.eclipse.egit.ui.internal.dialogs.CommitMessageBuilderTest)  Time elapsed: 0.095 s
03:10:00 [2021-02-12T08:10:00.062Z] commitMessageProvider_multipleProvidersWithCrashingAndNullAndOneCaretPositioning(org.eclipse.egit.ui.internal.dialogs.CommitMessageBuilderTest)  Time elapsed: 0.084 s
03:10:00 [2021-02-12T08:10:00.062Z] commitMessageProvider_twoProvidersWithCaretPositioning(org.eclipse.egit.ui.internal.dialogs.CommitMessageBuilderTest)  Time elapsed: 0.109 s
03:10:00 [2021-02-12T08:10:00.062Z] commitMessageProvider_oneProviderWithInvalidCaretPositionExceedingMessageLength(org.eclipse.egit.ui.internal.dialogs.CommitMessageBuilderTest)  Time elapsed: 0.082 s
03:10:00 [2021-02-12T08:10:00.062Z] Running org.eclipse.egit.ui.internal.dialogs.SpellcheckableMessageAreaTest
03:10:00 [2021-02-12T08:10:00.062Z] Tests run: 25, Failures: 0, Errors: 0, Skipped: 0, Time elapsed: 0.002 s - in org.eclipse.egit.ui.internal.dialogs.SpellcheckableMessageAreaTest
03:10:00 [2021-02-12T08:10:00.062Z] testWrappingLongWords(org.eclipse.egit.ui.internal.dialogs.SpellcheckableMessageAreaTest)  Time elapsed: 0 s
03:10:00 [2021-02-12T08:10:00.062Z] wrapOnlyCommitMessageBody(org.eclipse.egit.ui.internal.dialogs.SpellcheckableMessageAreaTest)  Time elapsed: 0 s
03:10:00 [2021-02-12T08:10:00.062Z] dontWrapMaximumLengthText(org.eclipse.egit.ui.internal.dialogs.SpellcheckableMessageAreaTest)  Time elapsed: 0 s
03:10:00 [2021-02-12T08:10:00.062Z] keepTrailingSpace(org.eclipse.egit.ui.internal.dialogs.SpellcheckableMessageAreaTest)  Time elapsed: 0 s
03:10:00 [2021-02-12T08:10:00.062Z] dontWrapShortMessage(org.eclipse.egit.ui.internal.dialogs.SpellcheckableMessageAreaTest)  Time elapsed: 0 s
03:10:00 [2021-02-12T08:10:00.062Z] lineAfterWrappedWordShouldNotBeJoined(org.eclipse.egit.ui.internal.dialogs.SpellcheckableMessageAreaTest)  Time elapsed: 0 s
03:10:00 [2021-02-12T08:10:00.062Z] lineAfterWrappedWordShouldNotBeJoined2(org.eclipse.egit.ui.internal.dialogs.SpellcheckableMessageAreaTest)  Time elapsed: 0.001 s
03:10:00 [2021-02-12T08:10:00.062Z] lineAfterWrappedWordShouldNotBeJoined3(org.eclipse.egit.ui.internal.dialogs.SpellcheckableMessageAreaTest)  Time elapsed: 0 s
03:10:00 [2021-02-12T08:10:00.062Z] dontWrapWordLongerThanOneLine(org.eclipse.egit.ui.internal.dialogs.SpellcheckableMessageAreaTest)  Time elapsed: 0 s
03:10:00 [2021-02-12T08:10:00.062Z] keepExistingNewlines(org.eclipse.egit.ui.internal.dialogs.SpellcheckableMessageAreaTest)  Time elapsed: 0 s
03:10:00 [2021-02-12T08:10:00.062Z] dontWrapShortText(org.eclipse.egit.ui.internal.dialogs.SpellcheckableMessageAreaTest)  Time elapsed: 0 s
03:10:00 [2021-02-12T08:10:00.062Z] dontWrapWordLongerThanOneLineAtStart(org.eclipse.egit.ui.internal.dialogs.SpellcheckableMessageAreaTest)  Time elapsed: 0 s
03:10:00 [2021-02-12T08:10:00.062Z] dontWrapAlreadyWrappedText(org.eclipse.egit.ui.internal.dialogs.SpellcheckableMessageAreaTest)  Time elapsed: 0 s
03:10:00 [2021-02-12T08:10:00.062Z] wrapOverlengthText2(org.eclipse.egit.ui.internal.dialogs.SpellcheckableMessageAreaTest)  Time elapsed: 0 s
03:10:00 [2021-02-12T08:10:00.062Z] lineAfterWrappedWordShouldNotBeJoinedIfItStartsWithASymbol(org.eclipse.egit.ui.internal.dialogs.SpellcheckableMessageAreaTest)  Time elapsed: 0 s
03:10:00 [2021-02-12T08:10:00.062Z] wrapAlternatingBlankNonBlank(org.eclipse.egit.ui.internal.dialogs.SpellcheckableMessageAreaTest)  Time elapsed: 0 s
03:10:00 [2021-02-12T08:10:00.062Z] keepWhitespace(org.eclipse.egit.ui.internal.dialogs.SpellcheckableMessageAreaTest)  Time elapsed: 0 s
03:10:00 [2021-02-12T08:10:00.062Z] lineAfterWrappedWordShouldNotBeJoinedIfItsEmpty(org.eclipse.egit.ui.internal.dialogs.SpellcheckableMessageAreaTest)  Time elapsed: 0 s
03:10:00 [2021-02-12T08:10:00.062Z] dontWrapLongCommitMessageFooter(org.eclipse.egit.ui.internal.dialogs.SpellcheckableMessageAreaTest)  Time elapsed: 0 s
03:10:00 [2021-02-12T08:10:00.062Z] lineAfterWrappedLineShouldBeJoinedAndFollowingLineWrappedCorrectly(org.eclipse.egit.ui.internal.dialogs.SpellcheckableMessageAreaTest)  Time elapsed: 0 s
03:10:00 [2021-02-12T08:10:00.062Z] wrapOverlengthText(org.eclipse.egit.ui.internal.dialogs.SpellcheckableMessageAreaTest)  Time elapsed: 0 s
03:10:00 [2021-02-12T08:10:00.062Z] dontWrapWordLongerThanOneLineAndKeepSpaceAtFront(org.eclipse.egit.ui.internal.dialogs.SpellcheckableMessageAreaTest)  Time elapsed: 0 s
03:10:00 [2021-02-12T08:10:00.062Z] wrapSecondLongLine(org.eclipse.egit.ui.internal.dialogs.SpellcheckableMessageAreaTest)  Time elapsed: 0 s
03:10:00 [2021-02-12T08:10:00.062Z] wrapOverlengthTextByOne(org.eclipse.egit.ui.internal.dialogs.SpellcheckableMessageAreaTest)  Time elapsed: 0 s
03:10:00 [2021-02-12T08:10:00.062Z] keepNewlineAtEnd(org.eclipse.egit.ui.internal.dialogs.SpellcheckableMessageAreaTest)  Time elapsed: 0 s
03:10:00 [2021-02-12T08:10:00.062Z] Running org.eclipse.egit.ui.internal.dialogs.CommitMessageComponentTest
03:10:00 [2021-02-12T08:10:00.062Z] Tests run: 5, Failures: 0, Errors: 0, Skipped: 0, Time elapsed: 0 s - in org.eclipse.egit.ui.internal.dialogs.CommitMessageComponentTest
03:10:00 [2021-02-12T08:10:00.062Z] commitFormat_MultipleLines_notOk2(org.eclipse.egit.ui.internal.dialogs.CommitMessageComponentTest)  Time elapsed: 0 s
03:10:00 [2021-02-12T08:10:00.062Z] commitFormat_simple(org.eclipse.egit.ui.internal.dialogs.CommitMessageComponentTest)  Time elapsed: 0 s
03:10:00 [2021-02-12T08:10:00.062Z] commitFormat_MultipleLines_ok(org.eclipse.egit.ui.internal.dialogs.CommitMessageComponentTest)  Time elapsed: 0 s
03:10:00 [2021-02-12T08:10:00.063Z] commitFormat_trailingWhitespace_ok(org.eclipse.egit.ui.internal.dialogs.CommitMessageComponentTest)  Time elapsed: 0 s
03:10:00 [2021-02-12T08:10:00.063Z] commitFormat_MultipleLines_notOk(org.eclipse.egit.ui.internal.dialogs.CommitMessageComponentTest)  Time elapsed: 0 s
03:10:00 [2021-02-12T08:10:00.063Z] Running org.eclipse.egit.ui.internal.actions.StashesMenuTest
03:10:02 [2021-02-12T08:10:02.583Z] 
03:10:02 [2021-02-12T08:10:02.583Z] (SWT:1649): Gtk-WARNING **: 08:10:02.546: Negative content width -6 (allocation 1, extents 4x3) while allocating gadget (node toolbar, owner GtkToolbar)
03:10:02 [2021-02-12T08:10:02.583Z] 
03:10:02 [2021-02-12T08:10:02.583Z] (SWT:1649): Gtk-WARNING **: 08:10:02.546: Negative content height -3 (allocation 1, extents 2x2) while allocating gadget (node toolbar, owner GtkToolbar)
03:10:02 [2021-02-12T08:10:02.583Z] 
03:10:02 [2021-02-12T08:10:02.583Z] (SWT:1649): Gtk-WARNING **: 08:10:02.546: Negative content width -6 (allocation 1, extents 4x3) while allocating gadget (node toolbar, owner GtkToolbar)
03:10:02 [2021-02-12T08:10:02.583Z] 
03:10:02 [2021-02-12T08:10:02.583Z] (SWT:1649): Gtk-WARNING **: 08:10:02.546: Negative content height -3 (allocation 1, extents 2x2) while allocating gadget (node toolbar, owner GtkToolbar)
03:10:02 [2021-02-12T08:10:02.839Z] 
03:10:02 [2021-02-12T08:10:02.839Z] (SWT:1649): Gtk-WARNING **: 08:10:02.594: Negative content width -6 (allocation 1, extents 4x3) while allocating gadget (node toolbar, owner GtkToolbar)
03:10:02 [2021-02-12T08:10:02.839Z] 
03:10:02 [2021-02-12T08:10:02.839Z] (SWT:1649): Gtk-WARNING **: 08:10:02.606: Negative content width -6 (allocation 1, extents 4x3) while allocating gadget (node toolbar, owner GtkToolbar)
03:10:02 [2021-02-12T08:10:02.839Z] 
03:10:02 [2021-02-12T08:10:02.839Z] (SWT:1649): Gtk-WARNING **: 08:10:02.617: Negative content width -6 (allocation 1, extents 4x3) while allocating gadget (node toolbar, owner GtkToolbar)
03:10:03 [2021-02-12T08:10:03.096Z] Tests run: 2, Failures: 0, Errors: 0, Skipped: 0, Time elapsed: 3.055 s - in org.eclipse.egit.ui.internal.actions.StashesMenuTest
03:10:03 [2021-02-12T08:10:03.096Z] menuWithoutStashes(org.eclipse.egit.ui.internal.actions.StashesMenuTest)  Time elapsed: 1.773 s
03:10:03 [2021-02-12T08:10:03.096Z] stashAndApplyChanges(org.eclipse.egit.ui.internal.actions.StashesMenuTest)  Time elapsed: 1.277 s
03:10:03 [2021-02-12T08:10:03.096Z] Running org.eclipse.egit.ui.internal.actions.LinkedResourcesTest
03:10:04 [2021-02-12T08:10:04.464Z] Tests run: 2, Failures: 0, Errors: 0, Skipped: 0, Time elapsed: 1.39 s - in org.eclipse.egit.ui.internal.actions.LinkedResourcesTest
03:10:04 [2021-02-12T08:10:04.464Z] testSomeActionsWithoutLinkedResources(org.eclipse.egit.ui.internal.actions.LinkedResourcesTest)  Time elapsed: 0.667 s
03:10:04 [2021-02-12T08:10:04.464Z] testNoActionOnLinkedResources(org.eclipse.egit.ui.internal.actions.LinkedResourcesTest)  Time elapsed: 0.718 s
03:10:04 [2021-02-12T08:10:04.464Z] Running org.eclipse.egit.ui.internal.actions.SwitchToMenuTest
03:10:14 [2021-02-12T08:10:14.456Z] 
03:10:14 [2021-02-12T08:10:14.456Z] !ENTRY org.eclipse.egit.core 4 0 2021-02-12 08:10:13.134
03:10:14 [2021-02-12T08:10:14.456Z] !MESSAGE Cannot parse the reflog for HEAD in repository /home/jenkins/agent/workspace/egit/tmp/egit.tmp/e70d648e173d448b90a6d86d6684108b/LocalRepositoriesTests266_selectionWithCorruptedReflog/FirstRepository/.git
03:10:14 [2021-02-12T08:10:14.456Z] !STACK 0
03:10:14 [2021-02-12T08:10:14.456Z] org.eclipse.jgit.errors.InvalidObjectIdException: Invalid id: INTENTIONALLY CORRUPTED REFLOG. Just som
03:10:14 [2021-02-12T08:10:14.456Z] 	at org.eclipse.jgit.lib.ObjectId.fromHexString(ObjectId.java:217)
03:10:14 [2021-02-12T08:10:14.456Z] 	at org.eclipse.jgit.lib.ObjectId.fromString(ObjectId.java:191)
03:10:14 [2021-02-12T08:10:14.456Z] 	at org.eclipse.jgit.internal.storage.file.ReflogEntryImpl.<init>(ReflogEntryImpl.java:39)
03:10:14 [2021-02-12T08:10:14.456Z] 	at org.eclipse.jgit.internal.storage.file.ReflogReaderImpl.getReverseEntries(ReflogReaderImpl.java:109)
03:10:14 [2021-02-12T08:10:14.456Z] 	at org.eclipse.jgit.internal.storage.file.ReflogReaderImpl.getReverseEntries(ReflogReaderImpl.java:56)
03:10:14 [2021-02-12T08:10:14.456Z] 	at org.eclipse.egit.core.RepositoryUtil.safeReadReflog(RepositoryUtil.java:193)
03:10:14 [2021-02-12T08:10:14.456Z] 	at org.eclipse.egit.ui.internal.actions.SwitchToMenu.getMostActiveBranches(SwitchToMenu.java:465)
03:10:14 [2021-02-12T08:10:14.456Z] 	at org.eclipse.egit.ui.internal.actions.SwitchToMenu.createMostActiveBranchesMenuItems(SwitchToMenu.java:306)
03:10:14 [2021-02-12T08:10:14.456Z] 	at org.eclipse.egit.ui.internal.actions.SwitchToMenu.createDynamicMenu(SwitchToMenu.java:142)
03:10:14 [2021-02-12T08:10:14.456Z] 	at org.eclipse.egit.ui.internal.actions.SwitchToMenu.fill(SwitchToMenu.java:122)
03:10:14 [2021-02-12T08:10:14.456Z] 	at org.eclipse.egit.ui.internal.actions.SwitchToMenuTest$1.run(SwitchToMenuTest.java:310)
03:10:14 [2021-02-12T08:10:14.456Z] 	at org.eclipse.swt.widgets.RunnableLock.run(RunnableLock.java:35)
03:10:14 [2021-02-12T08:10:14.456Z] 	at org.eclipse.swt.widgets.Synchronizer.runAsyncMessages(Synchronizer.java:182)
03:10:14 [2021-02-12T08:10:14.456Z] 	at org.eclipse.swt.widgets.Display.runAsyncMessages(Display.java:4536)
03:10:14 [2021-02-12T08:10:14.456Z] 	at org.eclipse.swt.widgets.Display.readAndDispatch(Display.java:4154)
03:10:14 [2021-02-12T08:10:14.456Z] 	at org.eclipse.e4.ui.internal.workbench.swt.PartRenderingEngine$4.run(PartRenderingEngine.java:1121)
03:10:14 [2021-02-12T08:10:14.456Z] 	at org.eclipse.core.databinding.observable.Realm.runWithDefault(Realm.java:336)
03:10:14 [2021-02-12T08:10:14.456Z] 	at org.eclipse.e4.ui.internal.workbench.swt.PartRenderingEngine.run(PartRenderingEngine.java:1022)
03:10:14 [2021-02-12T08:10:14.456Z] 	at org.eclipse.e4.ui.internal.workbench.E4Workbench.createAndRunUI(E4Workbench.java:150)
03:10:14 [2021-02-12T08:10:14.456Z] 	at org.eclipse.ui.internal.Workbench$5.run(Workbench.java:693)
03:10:14 [2021-02-12T08:10:14.456Z] 	at org.eclipse.core.databinding.observable.Realm.runWithDefault(Realm.java:336)
03:10:14 [2021-02-12T08:10:14.456Z] 	at org.eclipse.ui.internal.Workbench.createAndRunWorkbench(Workbench.java:610)
03:10:14 [2021-02-12T08:10:14.456Z] 	at org.eclipse.ui.PlatformUI.createAndRunWorkbench(PlatformUI.java:148)
03:10:14 [2021-02-12T08:10:14.456Z] 	at org.eclipse.ui.internal.ide.application.IDEApplication.start(IDEApplication.java:138)
03:10:14 [2021-02-12T08:10:14.456Z] 	at org.eclipse.tycho.surefire.osgibooter.UITestApplication.runApplication(UITestApplication.java:31)
03:10:14 [2021-02-12T08:10:14.456Z] 	at org.eclipse.tycho.surefire.osgibooter.AbstractUITestApplication.run(AbstractUITestApplication.java:120)
03:10:14 [2021-02-12T08:10:14.456Z] 	at org.eclipse.tycho.surefire.osgibooter.UITestApplication.start(UITestApplication.java:37)
03:10:14 [2021-02-12T08:10:14.456Z] 	at org.eclipse.equinox.internal.app.EclipseAppHandle.run(EclipseAppHandle.java:196)
03:10:14 [2021-02-12T08:10:14.456Z] 	at org.eclipse.core.runtime.internal.adaptor.EclipseAppLauncher.runApplication(EclipseAppLauncher.java:134)
03:10:14 [2021-02-12T08:10:14.456Z] 	at org.eclipse.core.runtime.internal.adaptor.EclipseAppLauncher.start(EclipseAppLauncher.java:104)
03:10:14 [2021-02-12T08:10:14.456Z] 	at org.eclipse.core.runtime.adaptor.EclipseStarter.run(EclipseStarter.java:388)
03:10:14 [2021-02-12T08:10:14.456Z] 	at org.eclipse.core.runtime.adaptor.EclipseStarter.run(EclipseStarter.java:243)
03:10:14 [2021-02-12T08:10:14.456Z] 	at sun.reflect.NativeMethodAccessorImpl.invoke0(Native Method)
03:10:14 [2021-02-12T08:10:14.456Z] 	at sun.reflect.NativeMethodAccessorImpl.invoke(NativeMethodAccessorImpl.java:62)
03:10:14 [2021-02-12T08:10:14.456Z] 	at sun.reflect.DelegatingMethodAccessorImpl.invoke(DelegatingMethodAccessorImpl.java:43)
03:10:14 [2021-02-12T08:10:14.456Z] 	at java.lang.reflect.Method.invoke(Method.java:498)
03:10:14 [2021-02-12T08:10:14.456Z] 	at org.eclipse.equinox.launcher.Main.invokeFramework(Main.java:673)
03:10:14 [2021-02-12T08:10:14.456Z] 	at org.eclipse.equinox.launcher.Main.basicRun(Main.java:610)
03:10:14 [2021-02-12T08:10:14.456Z] 	at org.eclipse.equinox.launcher.Main.run(Main.java:1519)
03:10:14 [2021-02-12T08:10:14.456Z] 	at org.eclipse.equinox.launcher.Main.main(Main.java:1492)
03:10:14 [2021-02-12T08:10:14.456Z] Caused by: java.lang.ArrayIndexOutOfBoundsException
03:10:14 [2021-02-12T08:10:14.456Z] 	at org.eclipse.jgit.util.RawParseUtils.parseHexInt32(RawParseUtils.java:336)
03:10:14 [2021-02-12T08:10:14.456Z] 	at org.eclipse.jgit.lib.ObjectId.fromHexString(ObjectId.java:210)
03:10:14 [2021-02-12T08:10:14.456Z] 	... 39 more
03:10:14 [2021-02-12T08:10:14.456Z] Tests run: 9, Failures: 0, Errors: 0, Skipped: 0, Time elapsed: 8.876 s - in org.eclipse.egit.ui.internal.actions.SwitchToMenuTest
03:10:14 [2021-02-12T08:10:14.456Z] multipleSelectionWithMultipleRepositoriesAndNoCommonBranches(org.eclipse.egit.ui.internal.actions.SwitchToMenuTest)  Time elapsed: 0.909 s
03:10:14 [2021-02-12T08:10:14.456Z] selectionWithProj1(org.eclipse.egit.ui.internal.actions.SwitchToMenuTest)  Time elapsed: 0.595 s
03:10:14 [2021-02-12T08:10:14.456Z] selectionNotAdaptableToRepository(org.eclipse.egit.ui.internal.actions.SwitchToMenuTest)  Time elapsed: 0.059 s
03:10:14 [2021-02-12T08:10:14.456Z] selectionWithProj1AndReflog(org.eclipse.egit.ui.internal.actions.SwitchToMenuTest)  Time elapsed: 0.637 s
03:10:14 [2021-02-12T08:10:14.456Z] validateMenuEntriesForMultiSelectionWithMultipleRepositories(org.eclipse.egit.ui.internal.actions.SwitchToMenuTest)  Time elapsed: 2.983 s
03:10:14 [2021-02-12T08:10:14.456Z] validateBranchSwitchingForForMultiSelectionWithMultipleRepositories(org.eclipse.egit.ui.internal.actions.SwitchToMenuTest)  Time elapsed: 1.291 s
03:10:14 [2021-02-12T08:10:14.456Z] selectionWithRepositoryHavingOver20Branches(org.eclipse.egit.ui.internal.actions.SwitchToMenuTest)  Time elapsed: 1.654 s
03:10:14 [2021-02-12T08:10:14.456Z] emptySelection(org.eclipse.egit.ui.internal.actions.SwitchToMenuTest)  Time elapsed: 0.078 s
03:10:14 [2021-02-12T08:10:14.456Z] selectionWithCorruptedReflog(org.eclipse.egit.ui.internal.actions.SwitchToMenuTest)  Time elapsed: 0.65 s
03:10:14 [2021-02-12T08:10:14.456Z] Running org.eclipse.egit.ui.internal.submodules.SubmoduleFolderTest
03:10:16 [2021-02-12T08:10:16.977Z] 
03:10:16 [2021-02-12T08:10:16.977Z] (SWT:1649): Gtk-WARNING **: 08:10:16.554: Negative content width -6 (allocation 1, extents 4x3) while allocating gadget (node toolbar, owner GtkToolbar)
03:10:16 [2021-02-12T08:10:16.977Z] 
03:10:16 [2021-02-12T08:10:16.977Z] (SWT:1649): Gtk-WARNING **: 08:10:16.554: Negative content height -3 (allocation 1, extents 2x2) while allocating gadget (node toolbar, owner GtkToolbar)
03:10:16 [2021-02-12T08:10:16.977Z] 
03:10:16 [2021-02-12T08:10:16.977Z] (SWT:1649): Gtk-WARNING **: 08:10:16.554: Negative content width -6 (allocation 1, extents 4x3) while allocating gadget (node toolbar, owner GtkToolbar)
03:10:16 [2021-02-12T08:10:16.977Z] 
03:10:16 [2021-02-12T08:10:16.977Z] (SWT:1649): Gtk-WARNING **: 08:10:16.554: Negative content height -3 (allocation 1, extents 2x2) while allocating gadget (node toolbar, owner GtkToolbar)
03:10:16 [2021-02-12T08:10:16.977Z] 
03:10:16 [2021-02-12T08:10:16.977Z] (SWT:1649): Gtk-WARNING **: 08:10:16.859: Negative content width -6 (allocation 1, extents 4x3) while allocating gadget (node toolbar, owner GtkToolbar)
03:10:16 [2021-02-12T08:10:16.977Z] 
03:10:16 [2021-02-12T08:10:16.977Z] (SWT:1649): Gtk-WARNING **: 08:10:16.861: Negative content width -6 (allocation 1, extents 4x3) while allocating gadget (node toolbar, owner GtkToolbar)
03:10:16 [2021-02-12T08:10:16.977Z] 
03:10:16 [2021-02-12T08:10:16.977Z] (SWT:1649): Gtk-WARNING **: 08:10:16.865: Negative content width -6 (allocation 1, extents 4x3) while allocating gadget (node toolbar, owner GtkToolbar)
03:10:16 [2021-02-12T08:10:16.977Z] 
03:10:16 [2021-02-12T08:10:16.977Z] (SWT:1649): Gtk-WARNING **: 08:10:16.869: Negative content width -6 (allocation 1, extents 4x3) while allocating gadget (node toolbar, owner GtkToolbar)
03:10:16 [2021-02-12T08:10:16.977Z] 
03:10:16 [2021-02-12T08:10:16.977Z] (SWT:1649): Gtk-WARNING **: 08:10:16.884: Negative content width -6 (allocation 1, extents 4x3) while allocating gadget (node toolbar, owner GtkToolbar)
03:10:16 [2021-02-12T08:10:16.977Z] 
03:10:16 [2021-02-12T08:10:16.977Z] (SWT:1649): Gtk-WARNING **: 08:10:16.885: Negative content width -6 (allocation 1, extents 4x3) while allocating gadget (node toolbar, owner GtkToolbar)
03:10:16 [2021-02-12T08:10:16.977Z] 
03:10:16 [2021-02-12T08:10:16.977Z] (SWT:1649): Gtk-WARNING **: 08:10:16.910: Negative content width -6 (allocation 1, extents 4x3) while allocating gadget (node toolbar, owner GtkToolbar)
03:10:16 [2021-02-12T08:10:16.977Z] 
03:10:16 [2021-02-12T08:10:16.977Z] (SWT:1649): Gtk-WARNING **: 08:10:16.911: Negative content width -6 (allocation 1, extents 4x3) while allocating gadget (node toolbar, owner GtkToolbar)
03:10:23 [2021-02-12T08:10:23.520Z] 
03:10:23 [2021-02-12T08:10:23.520Z] (SWT:1649): Gtk-WARNING **: 08:10:23.037: Negative content width -6 (allocation 1, extents 4x3) while allocating gadget (node toolbar, owner GtkToolbar)
03:10:23 [2021-02-12T08:10:23.520Z] 
03:10:23 [2021-02-12T08:10:23.520Z] (SWT:1649): Gtk-WARNING **: 08:10:23.052: Negative content width -6 (allocation 1, extents 4x3) while allocating gadget (node toolbar, owner GtkToolbar)
03:10:23 [2021-02-12T08:10:23.520Z] 
03:10:23 [2021-02-12T08:10:23.520Z] (SWT:1649): Gtk-WARNING **: 08:10:23.104: Negative content width -6 (allocation 1, extents 4x3) while allocating gadget (node toolbar, owner GtkToolbar)
03:10:23 [2021-02-12T08:10:23.520Z] 
03:10:23 [2021-02-12T08:10:23.520Z] (SWT:1649): Gtk-WARNING **: 08:10:23.105: Negative content width -6 (allocation 1, extents 4x3) while allocating gadget (node toolbar, owner GtkToolbar)
03:10:23 [2021-02-12T08:10:23.520Z] 
03:10:23 [2021-02-12T08:10:23.520Z] (SWT:1649): Gtk-CRITICAL **: 08:10:23.132: gtk_box_gadget_distribute: assertion 'size >= 0' failed in GtkScrollbar
03:10:23 [2021-02-12T08:10:23.520Z] 
03:10:23 [2021-02-12T08:10:23.520Z] (SWT:1649): Gtk-CRITICAL **: 08:10:23.144: gtk_box_gadget_distribute: assertion 'size >= 0' failed in GtkScrollbar
03:10:23 [2021-02-12T08:10:23.520Z] 
03:10:23 [2021-02-12T08:10:23.520Z] (SWT:1649): Gtk-CRITICAL **: 08:10:23.159: gtk_box_gadget_distribute: assertion 'size >= 0' failed in GtkScrollbar
03:10:23 [2021-02-12T08:10:23.520Z] 
03:10:23 [2021-02-12T08:10:23.520Z] (SWT:1649): Gtk-CRITICAL **: 08:10:23.175: gtk_box_gadget_distribute: assertion 'size >= 0' failed in GtkScrollbar
03:10:23 [2021-02-12T08:10:23.520Z] 
03:10:23 [2021-02-12T08:10:23.520Z] (SWT:1649): Gtk-CRITICAL **: 08:10:23.192: gtk_box_gadget_distribute: assertion 'size >= 0' failed in GtkScrollbar
03:10:23 [2021-02-12T08:10:23.520Z] 
03:10:23 [2021-02-12T08:10:23.520Z] (SWT:1649): Gtk-CRITICAL **: 08:10:23.210: gtk_box_gadget_distribute: assertion 'size >= 0' failed in GtkScrollbar
03:10:23 [2021-02-12T08:10:23.520Z] 
03:10:23 [2021-02-12T08:10:23.520Z] (SWT:1649): Gtk-CRITICAL **: 08:10:23.226: gtk_box_gadget_distribute: assertion 'size >= 0' failed in GtkScrollbar
03:10:23 [2021-02-12T08:10:23.520Z] 
03:10:23 [2021-02-12T08:10:23.520Z] (SWT:1649): Gtk-WARNING **: 08:10:23.232: Negative content width -6 (allocation 1, extents 4x3) while allocating gadget (node toolbar, owner GtkToolbar)
03:10:23 [2021-02-12T08:10:23.520Z] 
03:10:23 [2021-02-12T08:10:23.520Z] (SWT:1649): Gtk-WARNING **: 08:10:23.240: Negative content width -6 (allocation 1, extents 4x3) while allocating gadget (node toolbar, owner GtkToolbar)
03:10:23 [2021-02-12T08:10:23.520Z] 
03:10:23 [2021-02-12T08:10:23.520Z] (SWT:1649): Gtk-WARNING **: 08:10:23.275: Negative content width -6 (allocation 1, extents 4x3) while allocating gadget (node toolbar, owner GtkToolbar)
03:10:23 [2021-02-12T08:10:23.520Z] 
03:10:23 [2021-02-12T08:10:23.520Z] (SWT:1649): Gtk-CRITICAL **: 08:10:23.279: gtk_box_gadget_distribute: assertion 'size >= 0' failed in GtkScrollbar
03:10:23 [2021-02-12T08:10:23.520Z] 
03:10:23 [2021-02-12T08:10:23.520Z] (SWT:1649): Gtk-WARNING **: 08:10:23.316: Negative content width -6 (allocation 1, extents 4x3) while allocating gadget (node toolbar, owner GtkToolbar)
03:10:28 [2021-02-12T08:10:28.775Z] 
03:10:28 [2021-02-12T08:10:28.775Z] (SWT:1649): Gtk-WARNING **: 08:10:28.145: Negative content width -6 (allocation 1, extents 4x3) while allocating gadget (node toolbar, owner GtkToolbar)
03:10:28 [2021-02-12T08:10:28.775Z] 
03:10:28 [2021-02-12T08:10:28.775Z] (SWT:1649): Gtk-WARNING **: 08:10:28.444: Negative content width -6 (allocation 1, extents 4x3) while allocating gadget (node toolbar, owner GtkToolbar)
03:10:29 [2021-02-12T08:10:29.338Z] 
03:10:29 [2021-02-12T08:10:29.338Z] (SWT:1649): Gtk-WARNING **: 08:10:29.084: Negative content width -6 (allocation 1, extents 4x3) while allocating gadget (node toolbar, owner GtkToolbar)
03:10:29 [2021-02-12T08:10:29.338Z] 
03:10:29 [2021-02-12T08:10:29.338Z] (SWT:1649): Gtk-WARNING **: 08:10:29.120: Negative content width -6 (allocation 1, extents 4x3) while allocating gadget (node toolbar, owner GtkToolbar)
03:10:33 [2021-02-12T08:10:33.510Z] Tests run: 11, Failures: 0, Errors: 0, Skipped: 0, Time elapsed: 19.643 s - in org.eclipse.egit.ui.internal.submodules.SubmoduleFolderTest
03:10:33 [2021-02-12T08:10:33.510Z] testSwitchToMenu(org.eclipse.egit.ui.internal.submodules.SubmoduleFolderTest)  Time elapsed: 1.883 s
03:10:33 [2021-02-12T08:10:33.510Z] compareWithHeadInSubmoduleFolder(org.eclipse.egit.ui.internal.submodules.SubmoduleFolderTest)  Time elapsed: 1.92 s
03:10:33 [2021-02-12T08:10:33.511Z] testStageUnstageInSubRepo(org.eclipse.egit.ui.internal.submodules.SubmoduleFolderTest)  Time elapsed: 2.779 s
03:10:33 [2021-02-12T08:10:33.511Z] testDecoration(org.eclipse.egit.ui.internal.submodules.SubmoduleFolderTest)  Time elapsed: 1.914 s
03:10:33 [2021-02-12T08:10:33.511Z] testHistoryFromProjectExplorerIsFromSubRepository(org.eclipse.egit.ui.internal.submodules.SubmoduleFolderTest)  Time elapsed: 1.66 s
03:10:33 [2021-02-12T08:10:33.511Z] testParentFolderMapsToParentRepo(org.eclipse.egit.ui.internal.submodules.SubmoduleFolderTest)  Time elapsed: 1.573 s
03:10:33 [2021-02-12T08:10:33.511Z] testDisconnect(org.eclipse.egit.ui.internal.submodules.SubmoduleFolderTest)  Time elapsed: 1.952 s
03:10:33 [2021-02-12T08:10:33.511Z] testRepoViewFollowSelection(org.eclipse.egit.ui.internal.submodules.SubmoduleFolderTest)  Time elapsed: 2.268 s
03:10:33 [2021-02-12T08:10:33.511Z] testRepoRemoval(org.eclipse.egit.ui.internal.submodules.SubmoduleFolderTest)  Time elapsed: 1.26 s
03:10:33 [2021-02-12T08:10:33.511Z] testChildProjectMapsToSubRepo(org.eclipse.egit.ui.internal.submodules.SubmoduleFolderTest)  Time elapsed: 1.18 s
03:10:33 [2021-02-12T08:10:33.511Z] testChildFolderMapsToSubRepo(org.eclipse.egit.ui.internal.submodules.SubmoduleFolderTest)  Time elapsed: 1.192 s
03:10:33 [2021-02-12T08:10:33.511Z] Running org.eclipse.egit.ui.internal.synchronize.model.GitModelWorkingFileTest
03:10:36 [2021-02-12T08:10:36.032Z] Tests run: 5, Failures: 0, Errors: 0, Skipped: 0, Time elapsed: 3.078 s - in org.eclipse.egit.ui.internal.synchronize.model.GitModelWorkingFileTest
03:10:36 [2021-02-12T08:10:36.032Z] shouldReturnNotEqualForDifferentLocation(org.eclipse.egit.ui.internal.synchronize.model.GitModelWorkingFileTest)  Time elapsed: 0.6 s
03:10:36 [2021-02-12T08:10:36.032Z] shouldReturnNotEqualWhenComparingWorkingFileAndCacheFile(org.eclipse.egit.ui.internal.synchronize.model.GitModelWorkingFileTest)  Time elapsed: 0.626 s
03:10:36 [2021-02-12T08:10:36.032Z] shouldReturnEqualForSameInstance(org.eclipse.egit.ui.internal.synchronize.model.GitModelWorkingFileTest)  Time elapsed: 0.593 s
03:10:36 [2021-02-12T08:10:36.032Z] shouldReturnNotEqualWhenComparingWorkingFileAndBlob(org.eclipse.egit.ui.internal.synchronize.model.GitModelWorkingFileTest)  Time elapsed: 0.646 s
03:10:36 [2021-02-12T08:10:36.032Z] shouldReturnEqualForSameLocation(org.eclipse.egit.ui.internal.synchronize.model.GitModelWorkingFileTest)  Time elapsed: 0.604 s
03:10:36 [2021-02-12T08:10:36.032Z] Running org.eclipse.egit.ui.internal.synchronize.model.GitModelBlobTest
03:10:45 [2021-02-12T08:10:45.982Z] Tests run: 15, Failures: 0, Errors: 0, Skipped: 2, Time elapsed: 8.254 s - in org.eclipse.egit.ui.internal.synchronize.model.GitModelBlobTest
03:10:45 [2021-02-12T08:10:45.982Z] shouldReturnEqualSameData1(org.eclipse.egit.ui.internal.synchronize.model.GitModelBlobTest) skipped
03:10:45 [2021-02-12T08:10:45.982Z] shouldReturnNotEqualForDifferentLocation(org.eclipse.egit.ui.internal.synchronize.model.GitModelBlobTest)  Time elapsed: 0.616 s
03:10:45 [2021-02-12T08:10:45.982Z] shouldReturnNotEqualForBlobAndCommit(org.eclipse.egit.ui.internal.synchronize.model.GitModelBlobTest)  Time elapsed: 0.594 s
03:10:45 [2021-02-12T08:10:45.982Z] shouldReturnEqualForSameData(org.eclipse.egit.ui.internal.synchronize.model.GitModelBlobTest) skipped
03:10:45 [2021-02-12T08:10:45.982Z] shouldReturnNotEqualForDifferentFiles(org.eclipse.egit.ui.internal.synchronize.model.GitModelBlobTest)  Time elapsed: 0.592 s
03:10:45 [2021-02-12T08:10:45.982Z] shouldReturnNotEqualForBlobAndCacheFile(org.eclipse.egit.ui.internal.synchronize.model.GitModelBlobTest)  Time elapsed: 0.612 s
03:10:45 [2021-02-12T08:10:45.982Z] shouldReturnNotEqualForBlobAndTree(org.eclipse.egit.ui.internal.synchronize.model.GitModelBlobTest)  Time elapsed: 0.623 s
03:10:45 [2021-02-12T08:10:45.982Z] shouldBeSymmetric1(org.eclipse.egit.ui.internal.synchronize.model.GitModelBlobTest)  Time elapsed: 0.607 s
03:10:45 [2021-02-12T08:10:45.982Z] shouldBeSymmetric(org.eclipse.egit.ui.internal.synchronize.model.GitModelBlobTest)  Time elapsed: 0.6 s
03:10:45 [2021-02-12T08:10:45.982Z] shouldReturnEqualForSameInstance(org.eclipse.egit.ui.internal.synchronize.model.GitModelBlobTest)  Time elapsed: 0.604 s
03:10:45 [2021-02-12T08:10:45.982Z] shouldActAsResourceProvider(org.eclipse.egit.ui.internal.synchronize.model.GitModelBlobTest)  Time elapsed: 0.602 s
03:10:45 [2021-02-12T08:10:45.982Z] shouldReturnNotEqualForDifferentBaseObjectId2(org.eclipse.egit.ui.internal.synchronize.model.GitModelBlobTest)  Time elapsed: 0.601 s
03:10:45 [2021-02-12T08:10:45.982Z] shouldReturnNotEqualForDifferentBaseObjectId3(org.eclipse.egit.ui.internal.synchronize.model.GitModelBlobTest)  Time elapsed: 0.674 s
03:10:45 [2021-02-12T08:10:45.982Z] shouldReturnNotEqualForBlobAndWorkingFile(org.eclipse.egit.ui.internal.synchronize.model.GitModelBlobTest)  Time elapsed: 0.83 s
03:10:45 [2021-02-12T08:10:45.982Z] shouldReturnNotEqualForDifferentBaseObjectId(org.eclipse.egit.ui.internal.synchronize.model.GitModelBlobTest)  Time elapsed: 0.673 s
03:10:45 [2021-02-12T08:10:45.982Z] Running org.eclipse.egit.ui.internal.synchronize.model.GitModelCacheFileTest
03:10:47 [2021-02-12T08:10:47.873Z] Tests run: 7, Failures: 0, Errors: 0, Skipped: 2, Time elapsed: 3.145 s - in org.eclipse.egit.ui.internal.synchronize.model.GitModelCacheFileTest
03:10:47 [2021-02-12T08:10:47.873Z] shouldReturnEqualForSameObjectIdsAndLocation(org.eclipse.egit.ui.internal.synchronize.model.GitModelCacheFileTest)  Time elapsed: 0.594 s
03:10:47 [2021-02-12T08:10:47.873Z] shouldReturnNotEqualWhenComparingCacheFileAndBlob(org.eclipse.egit.ui.internal.synchronize.model.GitModelCacheFileTest)  Time elapsed: 0.702 s
03:10:47 [2021-02-12T08:10:47.873Z] shouldReturnNotEqualForDifferentCacheIds(org.eclipse.egit.ui.internal.synchronize.model.GitModelCacheFileTest) skipped
03:10:47 [2021-02-12T08:10:47.873Z] shouldReturnEqualForSameInstance(org.eclipse.egit.ui.internal.synchronize.model.GitModelCacheFileTest)  Time elapsed: 0.592 s
03:10:47 [2021-02-12T08:10:47.873Z] shouldReturnNotEqualWhenComparingCacheFileAndWorkingFile(org.eclipse.egit.ui.internal.synchronize.model.GitModelCacheFileTest)  Time elapsed: 0.648 s
03:10:47 [2021-02-12T08:10:47.873Z] shouldReturnNotEqualForDifferentBaseIds(org.eclipse.egit.ui.internal.synchronize.model.GitModelCacheFileTest)  Time elapsed: 0.599 s
03:10:47 [2021-02-12T08:10:47.873Z] shouldReturnNotEqualForDifferentLocations(org.eclipse.egit.ui.internal.synchronize.model.GitModelCacheFileTest) skipped
03:10:47 [2021-02-12T08:10:47.873Z] Running org.eclipse.egit.ui.internal.synchronize.model.GitModelWorkingTreeTest
03:10:48 [2021-02-12T08:10:48.802Z] Tests run: 2, Failures: 0, Errors: 0, Skipped: 0, Time elapsed: 1.205 s - in org.eclipse.egit.ui.internal.synchronize.model.GitModelWorkingTreeTest
03:10:48 [2021-02-12T08:10:48.802Z] shouldReturnNotEqualsWhenComparingWorkingTreeAndCache(org.eclipse.egit.ui.internal.synchronize.model.GitModelWorkingTreeTest)  Time elapsed: 0.608 s
03:10:48 [2021-02-12T08:10:48.802Z] shouldReturnEqualsForTheSameInstance(org.eclipse.egit.ui.internal.synchronize.model.GitModelWorkingTreeTest)  Time elapsed: 0.592 s
03:10:48 [2021-02-12T08:10:48.802Z] Running org.eclipse.egit.ui.internal.synchronize.model.GitModelCacheTreeTest
03:10:51 [2021-02-12T08:10:51.322Z] Tests run: 4, Failures: 0, Errors: 0, Skipped: 0, Time elapsed: 2.657 s - in org.eclipse.egit.ui.internal.synchronize.model.GitModelCacheTreeTest
03:10:51 [2021-02-12T08:10:51.322Z] shouldReturnEqualForSameData(org.eclipse.egit.ui.internal.synchronize.model.GitModelCacheTreeTest)  Time elapsed: 0.666 s
03:10:51 [2021-02-12T08:10:51.322Z] shouldReturnNotEqualForDifferetnLocation(org.eclipse.egit.ui.internal.synchronize.model.GitModelCacheTreeTest)  Time elapsed: 0.793 s
03:10:51 [2021-02-12T08:10:51.322Z] shouldReturnEqualForSameInstance(org.eclipse.egit.ui.internal.synchronize.model.GitModelCacheTreeTest)  Time elapsed: 0.595 s
03:10:51 [2021-02-12T08:10:51.322Z] shouldReturnNotEqualWhenComparingCacheTreeAndTree(org.eclipse.egit.ui.internal.synchronize.model.GitModelCacheTreeTest)  Time elapsed: 0.595 s
03:10:51 [2021-02-12T08:10:51.322Z] Running org.eclipse.egit.ui.internal.synchronize.model.GitModelRootTest
03:10:53 [2021-02-12T08:10:53.214Z] Tests run: 1, Failures: 0, Errors: 0, Skipped: 0, Time elapsed: 1.441 s - in org.eclipse.egit.ui.internal.synchronize.model.GitModelRootTest
03:10:53 [2021-02-12T08:10:53.214Z] shouldIgnoreEmptyRepositories(org.eclipse.egit.ui.internal.synchronize.model.GitModelRootTest)  Time elapsed: 1.436 s
03:10:53 [2021-02-12T08:10:53.214Z] Running org.eclipse.egit.ui.internal.synchronize.model.GitModelCommitTest
03:10:58 [2021-02-12T08:10:58.465Z] Tests run: 7, Failures: 0, Errors: 0, Skipped: 0, Time elapsed: 4.956 s - in org.eclipse.egit.ui.internal.synchronize.model.GitModelCommitTest
03:10:58 [2021-02-12T08:10:58.465Z] shouldReturnNotEqualForDifferentCommits(org.eclipse.egit.ui.internal.synchronize.model.GitModelCommitTest)  Time elapsed: 0.589 s
03:10:58 [2021-02-12T08:10:58.465Z] shouldReturnNotEqualWhenCommitTreeAndBlob(org.eclipse.egit.ui.internal.synchronize.model.GitModelCommitTest)  Time elapsed: 0.591 s
03:10:58 [2021-02-12T08:10:58.465Z] shouldReturnNotEqualWhenCommitTreeAndTree(org.eclipse.egit.ui.internal.synchronize.model.GitModelCommitTest)  Time elapsed: 0.59 s
03:10:58 [2021-02-12T08:10:58.465Z] shouldReturnNotEqualWhenCommitTreeAndCache(org.eclipse.egit.ui.internal.synchronize.model.GitModelCommitTest)  Time elapsed: 0.601 s
03:10:58 [2021-02-12T08:10:58.465Z] shouldReturnEqualForSameInstance(org.eclipse.egit.ui.internal.synchronize.model.GitModelCommitTest)  Time elapsed: 0.671 s
03:10:58 [2021-02-12T08:10:58.465Z] shouldReturnNotEqualForDifferentParents(org.eclipse.egit.ui.internal.synchronize.model.GitModelCommitTest)  Time elapsed: 1.294 s
03:10:58 [2021-02-12T08:10:58.465Z] shouldReturnEqualForSameCommits(org.eclipse.egit.ui.internal.synchronize.model.GitModelCommitTest)  Time elapsed: 0.603 s
03:10:58 [2021-02-12T08:10:58.465Z] Running org.eclipse.egit.ui.internal.synchronize.model.GitModelRepositoryTest
03:11:00 [2021-02-12T08:11:00.357Z] Tests run: 3, Failures: 0, Errors: 0, Skipped: 0, Time elapsed: 2.146 s - in org.eclipse.egit.ui.internal.synchronize.model.GitModelRepositoryTest
03:11:00 [2021-02-12T08:11:00.357Z] shouldReturnEqual(org.eclipse.egit.ui.internal.synchronize.model.GitModelRepositoryTest)  Time elapsed: 0.731 s
03:11:00 [2021-02-12T08:11:00.357Z] shouldReturnNotEqual(org.eclipse.egit.ui.internal.synchronize.model.GitModelRepositoryTest)  Time elapsed: 0.696 s
03:11:00 [2021-02-12T08:11:00.357Z] shouldReturnEqualForSameInstance(org.eclipse.egit.ui.internal.synchronize.model.GitModelRepositoryTest)  Time elapsed: 0.71 s
03:11:00 [2021-02-12T08:11:00.357Z] Running org.eclipse.egit.ui.internal.synchronize.model.GitModelCacheTest
03:11:04 [2021-02-12T08:11:04.636Z] Tests run: 6, Failures: 0, Errors: 0, Skipped: 0, Time elapsed: 4.415 s - in org.eclipse.egit.ui.internal.synchronize.model.GitModelCacheTest
03:11:04 [2021-02-12T08:11:04.636Z] shouldReturnChildren(org.eclipse.egit.ui.internal.synchronize.model.GitModelCacheTest)  Time elapsed: 0.587 s
03:11:04 [2021-02-12T08:11:04.637Z] shouldReturnNotEqualWhenCacheTreeAndCommit(org.eclipse.egit.ui.internal.synchronize.model.GitModelCacheTest)  Time elapsed: 0.666 s
03:11:04 [2021-02-12T08:11:04.637Z] shouldReturnEqualForSameInstance(org.eclipse.egit.ui.internal.synchronize.model.GitModelCacheTest)  Time elapsed: 0.595 s
03:11:04 [2021-02-12T08:11:04.637Z] shouldReturnEqualForSameCommits(org.eclipse.egit.ui.internal.synchronize.model.GitModelCacheTest)  Time elapsed: 0.595 s
03:11:04 [2021-02-12T08:11:04.637Z] shouldReturnNotEqualWhenComparingCacheAndWorkingTree(org.eclipse.egit.ui.internal.synchronize.model.GitModelCacheTest)  Time elapsed: 0.658 s
03:11:04 [2021-02-12T08:11:04.637Z] shouldReturnNotEqualForDifferentRepositories(org.eclipse.egit.ui.internal.synchronize.model.GitModelCacheTest)  Time elapsed: 1.3 s
03:11:04 [2021-02-12T08:11:04.637Z] Running org.eclipse.egit.ui.internal.synchronize.model.GitModelTreeTest
03:11:07 [2021-02-12T08:11:07.911Z] Tests run: 6, Failures: 0, Errors: 0, Skipped: 0, Time elapsed: 3.606 s - in org.eclipse.egit.ui.internal.synchronize.model.GitModelTreeTest
03:11:07 [2021-02-12T08:11:07.911Z] shouldReturnNotEqualForDifferentLocation(org.eclipse.egit.ui.internal.synchronize.model.GitModelTreeTest)  Time elapsed: 0.588 s
03:11:07 [2021-02-12T08:11:07.911Z] shouldReturnNotEqualForTreeAndCacheTree(org.eclipse.egit.ui.internal.synchronize.model.GitModelTreeTest)  Time elapsed: 0.594 s
03:11:07 [2021-02-12T08:11:07.911Z] shouldReturnNotEqualForTreeAndCommit(org.eclipse.egit.ui.internal.synchronize.model.GitModelTreeTest)  Time elapsed: 0.594 s
03:11:07 [2021-02-12T08:11:07.911Z] shouldReturnEqualForSameBaseCommit(org.eclipse.egit.ui.internal.synchronize.model.GitModelTreeTest)  Time elapsed: 0.617 s
03:11:07 [2021-02-12T08:11:07.911Z] shouldReturnEqualForSameInstance(org.eclipse.egit.ui.internal.synchronize.model.GitModelTreeTest)  Time elapsed: 0.603 s
03:11:07 [2021-02-12T08:11:07.911Z] shouldReturnNotEqualForTreeAndBlob(org.eclipse.egit.ui.internal.synchronize.model.GitModelTreeTest)  Time elapsed: 0.599 s
03:11:07 [2021-02-12T08:11:07.911Z] Running org.eclipse.egit.ui.internal.synchronize.mapping.GitChangeSetSorterTest
03:11:08 [2021-02-12T08:11:08.168Z] Tests run: 23, Failures: 0, Errors: 0, Skipped: 0, Time elapsed: 0.169 s - in org.eclipse.egit.ui.internal.synchronize.mapping.GitChangeSetSorterTest
03:11:08 [2021-02-12T08:11:08.168Z] commitTreeShouldBeLessThanBlob(org.eclipse.egit.ui.internal.synchronize.mapping.GitChangeSetSorterTest)  Time elapsed: 0.024 s
03:11:08 [2021-02-12T08:11:08.168Z] commitTreeShouldBeLessThanTree(org.eclipse.egit.ui.internal.synchronize.mapping.GitChangeSetSorterTest)  Time elapsed: 0 s
03:11:08 [2021-02-12T08:11:08.168Z] blobShouldBeGreaterThanTree(org.eclipse.egit.ui.internal.synchronize.mapping.GitChangeSetSorterTest)  Time elapsed: 0 s
03:11:08 [2021-02-12T08:11:08.168Z] cacheTreeShouldBeLessThanCommit(org.eclipse.egit.ui.internal.synchronize.mapping.GitChangeSetSorterTest)  Time elapsed: 0 s
03:11:08 [2021-02-12T08:11:08.168Z] shouldOrderTreesAlphabetically(org.eclipse.egit.ui.internal.synchronize.mapping.GitChangeSetSorterTest)  Time elapsed: 0.142 s
03:11:08 [2021-02-12T08:11:08.168Z] commitTreeShouldBeGreaterThanCache(org.eclipse.egit.ui.internal.synchronize.mapping.GitChangeSetSorterTest)  Time elapsed: 0 s
03:11:08 [2021-02-12T08:11:08.168Z] blobShouldBeGreaterThanWorkingTree(org.eclipse.egit.ui.internal.synchronize.mapping.GitChangeSetSorterTest)  Time elapsed: 0 s
03:11:08 [2021-02-12T08:11:08.169Z] treeShouldBeGreaterThanCache(org.eclipse.egit.ui.internal.synchronize.mapping.GitChangeSetSorterTest)  Time elapsed: 0 s
03:11:08 [2021-02-12T08:11:08.169Z] treeShouldBeGreaterThanCommit(org.eclipse.egit.ui.internal.synchronize.mapping.GitChangeSetSorterTest)  Time elapsed: 0 s
03:11:08 [2021-02-12T08:11:08.169Z] workingTreeShouldBeLessThanCacheTree(org.eclipse.egit.ui.internal.synchronize.mapping.GitChangeSetSorterTest)  Time elapsed: 0 s
03:11:08 [2021-02-12T08:11:08.169Z] treeShouldBeGreaterThanWorkingTree(org.eclipse.egit.ui.internal.synchronize.mapping.GitChangeSetSorterTest)  Time elapsed: 0 s
03:11:08 [2021-02-12T08:11:08.169Z] blobShouldBeGreaterThanCache(org.eclipse.egit.ui.internal.synchronize.mapping.GitChangeSetSorterTest)  Time elapsed: 0 s
03:11:08 [2021-02-12T08:11:08.169Z] cacheTreeShouldBeLessThanBlob(org.eclipse.egit.ui.internal.synchronize.mapping.GitChangeSetSorterTest)  Time elapsed: 0 s
03:11:08 [2021-02-12T08:11:08.169Z] cacheTreeShouldBeLessThanTree(org.eclipse.egit.ui.internal.synchronize.mapping.GitChangeSetSorterTest)  Time elapsed: 0 s
03:11:08 [2021-02-12T08:11:08.169Z] shouldOrderBlobsAlphabetically(org.eclipse.egit.ui.internal.synchronize.mapping.GitChangeSetSorterTest)  Time elapsed: 0.001 s
03:11:08 [2021-02-12T08:11:08.169Z] commitTreeShouldBeGreaterThanWorkingTree(org.eclipse.egit.ui.internal.synchronize.mapping.GitChangeSetSorterTest)  Time elapsed: 0 s
03:11:08 [2021-02-12T08:11:08.169Z] treeShouldBeLessThanBlob(org.eclipse.egit.ui.internal.synchronize.mapping.GitChangeSetSorterTest)  Time elapsed: 0 s
03:11:08 [2021-02-12T08:11:08.169Z] cacheTreeShouldBeGreaterThanWorkingTree(org.eclipse.egit.ui.internal.synchronize.mapping.GitChangeSetSorterTest)  Time elapsed: 0 s
03:11:08 [2021-02-12T08:11:08.169Z] workingTreeShouldBeLessThanBlob(org.eclipse.egit.ui.internal.synchronize.mapping.GitChangeSetSorterTest)  Time elapsed: 0 s
03:11:08 [2021-02-12T08:11:08.169Z] workingTreeShouldBeLessThanTree(org.eclipse.egit.ui.internal.synchronize.mapping.GitChangeSetSorterTest)  Time elapsed: 0 s
03:11:08 [2021-02-12T08:11:08.169Z] shouldOrderCommitsByCommitDate(org.eclipse.egit.ui.internal.synchronize.mapping.GitChangeSetSorterTest)  Time elapsed: 0.001 s
03:11:08 [2021-02-12T08:11:08.169Z] workingTreeShouldBeLessThanCommit(org.eclipse.egit.ui.internal.synchronize.mapping.GitChangeSetSorterTest)  Time elapsed: 0 s
03:11:08 [2021-02-12T08:11:08.169Z] blobShouldBeGreaterThanCommit(org.eclipse.egit.ui.internal.synchronize.mapping.GitChangeSetSorterTest)  Time elapsed: 0 s
03:11:08 [2021-02-12T08:11:08.169Z] Running org.eclipse.egit.ui.internal.CompareUtilsTest
03:11:11 [2021-02-12T08:11:11.440Z] Tests run: 3, Failures: 0, Errors: 0, Skipped: 0, Time elapsed: 2.753 s - in org.eclipse.egit.ui.internal.CompareUtilsTest
03:11:11 [2021-02-12T08:11:11.441Z] testIndexEditWithAttributes(org.eclipse.egit.ui.internal.CompareUtilsTest)  Time elapsed: 0.959 s
03:11:11 [2021-02-12T08:11:11.441Z] testIndexEdit(org.eclipse.egit.ui.internal.CompareUtilsTest)  Time elapsed: 1 s
03:11:11 [2021-02-12T08:11:11.441Z] testIndexEditExecutable(org.eclipse.egit.ui.internal.CompareUtilsTest)  Time elapsed: 0.787 s
03:11:11 [2021-02-12T08:11:11.441Z] Running org.eclipse.egit.ui.internal.commit.DiffEditorOutlinePageSortingTest
03:11:11 [2021-02-12T08:11:11.441Z] Tests run: 1, Failures: 0, Errors: 0, Skipped: 0, Time elapsed: 0 s - in org.eclipse.egit.ui.internal.commit.DiffEditorOutlinePageSortingTest
03:11:11 [2021-02-12T08:11:11.441Z] testSort1(org.eclipse.egit.ui.internal.commit.DiffEditorOutlinePageSortingTest)  Time elapsed: 0 s
03:11:11 [2021-02-12T08:11:11.441Z] Running org.eclipse.egit.ui.internal.clone.SmartImportWizardTest
03:11:12 [2021-02-12T08:11:12.005Z] Tests run: 1, Failures: 0, Errors: 0, Skipped: 0, Time elapsed: 0.968 s - in org.eclipse.egit.ui.internal.clone.SmartImportWizardTest
03:11:12 [2021-02-12T08:11:12.005Z] test(org.eclipse.egit.ui.internal.clone.SmartImportWizardTest)  Time elapsed: 0.966 s
03:11:12 [2021-02-12T08:11:12.005Z] Running org.eclipse.egit.ui.internal.push.PushBranchWizardTest
03:11:12 [2021-02-12T08:11:12.568Z] 
03:11:12 [2021-02-12T08:11:12.568Z] (SWT:1649): Gtk-CRITICAL **: 08:11:12.547: gtk_box_gadget_distribute: assertion 'size >= 0' failed in GtkScrollbar
03:11:12 [2021-02-12T08:11:12.568Z] 
03:11:12 [2021-02-12T08:11:12.568Z] (SWT:1649): Gtk-CRITICAL **: 08:11:12.547: gtk_box_gadget_distribute: assertion 'size >= 0' failed in GtkScrollbar
03:11:12 [2021-02-12T08:11:12.568Z] 
03:11:12 [2021-02-12T08:11:12.568Z] (SWT:1649): Gtk-CRITICAL **: 08:11:12.548: gtk_box_gadget_distribute: assertion 'size >= 0' failed in GtkScrollbar
03:11:22 [2021-02-12T08:11:22.535Z] Tests run: 9, Failures: 0, Errors: 0, Skipped: 0, Time elapsed: 9.366 s - in org.eclipse.egit.ui.internal.push.PushBranchWizardTest
03:11:22 [2021-02-12T08:11:22.535Z] pushHeadToExistingRemote(org.eclipse.egit.ui.internal.push.PushBranchWizardTest)  Time elapsed: 1.015 s
03:11:22 [2021-02-12T08:11:22.535Z] pushWithRemoteUpstreamConfiguration(org.eclipse.egit.ui.internal.push.PushBranchWizardTest)  Time elapsed: 1.003 s
03:11:22 [2021-02-12T08:11:22.535Z] pushWithDifferentBranchName(org.eclipse.egit.ui.internal.push.PushBranchWizardTest)  Time elapsed: 0.981 s
03:11:22 [2021-02-12T08:11:22.535Z] pushToExistingRemoteAndSetRebase(org.eclipse.egit.ui.internal.push.PushBranchWizardTest)  Time elapsed: 1.003 s
03:11:22 [2021-02-12T08:11:22.535Z] pushToNewRemote(org.eclipse.egit.ui.internal.push.PushBranchWizardTest)  Time elapsed: 1.16 s
03:11:22 [2021-02-12T08:11:22.535Z] pushToExistingRemoteWithoutConfiguringUpstream(org.eclipse.egit.ui.internal.push.PushBranchWizardTest)  Time elapsed: 1.101 s
03:11:22 [2021-02-12T08:11:22.535Z] pushToExistingRemote(org.eclipse.egit.ui.internal.push.PushBranchWizardTest)  Time elapsed: 1.002 s
03:11:22 [2021-02-12T08:11:22.535Z] pushWhenNoRemoteExistsYet(org.eclipse.egit.ui.internal.push.PushBranchWizardTest)  Time elapsed: 1.062 s
03:11:22 [2021-02-12T08:11:22.535Z] pushWithLocalUpstreamConfiguration(org.eclipse.egit.ui.internal.push.PushBranchWizardTest)  Time elapsed: 1.013 s
03:11:22 [2021-02-12T08:11:22.535Z] Running org.eclipse.egit.ui.internal.push.PushTagsWizardTest
03:11:22 [2021-02-12T08:11:22.535Z] Tests run: 1, Failures: 0, Errors: 0, Skipped: 0, Time elapsed: 1.261 s - in org.eclipse.egit.ui.internal.push.PushTagsWizardTest
03:11:22 [2021-02-12T08:11:22.535Z] pushTag(org.eclipse.egit.ui.internal.push.PushTagsWizardTest)  Time elapsed: 1.258 s
03:11:22 [2021-02-12T08:11:22.535Z] Running org.eclipse.egit.ui.internal.push.PushToUpstreamTest
03:11:23 [2021-02-12T08:11:23.903Z] 
03:11:23 [2021-02-12T08:11:23.903Z] !ENTRY org.eclipse.egit.core 4 0 2021-02-12 08:11:23.703
03:11:23 [2021-02-12T08:11:23.903Z] !MESSAGE Failed to connect project to repository
03:11:23 [2021-02-12T08:11:23.903Z] !STACK 1
03:11:23 [2021-02-12T08:11:23.903Z] org.eclipse.core.runtime.CoreException: Connecting Git team provider failed. See log for details.
03:11:23 [2021-02-12T08:11:23.903Z] 	at org.eclipse.egit.core.op.ConnectProviderOperation.execute(ConnectProviderOperation.java:114)
03:11:23 [2021-02-12T08:11:23.903Z] 	at org.eclipse.egit.ui.common.LocalRepositoryTestCase.createProjectAndCommitToRepository(LocalRepositoryTestCase.java:368)
03:11:23 [2021-02-12T08:11:23.903Z] 	at org.eclipse.egit.ui.common.LocalRepositoryTestCase.createProjectAndCommitToRepository(LocalRepositoryTestCase.java:331)
03:11:23 [2021-02-12T08:11:23.903Z] 	at org.eclipse.egit.ui.common.LocalRepositoryTestCase.createProjectAndCommitToRepository(LocalRepositoryTestCase.java:326)
03:11:23 [2021-02-12T08:11:23.903Z] 	at org.eclipse.egit.ui.internal.push.PushToUpstreamTest.createRepositories(PushToUpstreamTest.java:44)
03:11:23 [2021-02-12T08:11:23.903Z] 	at sun.reflect.NativeMethodAccessorImpl.invoke0(Native Method)
03:11:23 [2021-02-12T08:11:23.903Z] 	at sun.reflect.NativeMethodAccessorImpl.invoke(NativeMethodAccessorImpl.java:62)
03:11:23 [2021-02-12T08:11:23.903Z] 	at sun.reflect.DelegatingMethodAccessorImpl.invoke(DelegatingMethodAccessorImpl.java:43)
03:11:23 [2021-02-12T08:11:23.903Z] 	at java.lang.reflect.Method.invoke(Method.java:498)
03:11:23 [2021-02-12T08:11:23.903Z] 	at org.junit.runners.model.FrameworkMethod$1.runReflectiveCall(FrameworkMethod.java:59)
03:11:23 [2021-02-12T08:11:23.903Z] 	at org.junit.internal.runners.model.ReflectiveCallable.run(ReflectiveCallable.java:12)
03:11:23 [2021-02-12T08:11:23.903Z] 	at org.junit.runners.model.FrameworkMethod.invokeExplosively(FrameworkMethod.java:56)
03:11:23 [2021-02-12T08:11:23.903Z] 	at org.junit.internal.runners.statements.RunBefores.invokeMethod(RunBefores.java:33)
03:11:23 [2021-02-12T08:11:23.903Z] 	at org.junit.internal.runners.statements.RunBefores.evaluate(RunBefores.java:24)
03:11:23 [2021-02-12T08:11:23.904Z] 	at org.junit.internal.runners.statements.RunAfters.evaluate(RunAfters.java:27)
03:11:23 [2021-02-12T08:11:23.904Z] 	at org.junit.rules.TestWatcher$1.evaluate(TestWatcher.java:61)
03:11:23 [2021-02-12T08:11:23.904Z] 	at org.junit.runners.ParentRunner$3.evaluate(ParentRunner.java:306)
03:11:23 [2021-02-12T08:11:23.904Z] 	at org.junit.runners.ParentRunner.runLeaf(ParentRunner.java:366)
03:11:23 [2021-02-12T08:11:23.904Z] 	at org.eclipse.swtbot.swt.finder.junit.SWTBotJunit4ClassRunner.runChild(SWTBotJunit4ClassRunner.java:77)
03:11:23 [2021-02-12T08:11:23.904Z] 	at org.junit.runners.BlockJUnit4ClassRunner.runChild(BlockJUnit4ClassRunner.java:63)
03:11:23 [2021-02-12T08:11:23.904Z] 	at org.junit.runners.ParentRunner$4.run(ParentRunner.java:331)
03:11:23 [2021-02-12T08:11:23.904Z] 	at org.junit.runners.ParentRunner$1.schedule(ParentRunner.java:79)
03:11:23 [2021-02-12T08:11:23.904Z] 	at org.junit.runners.ParentRunner.runChildren(ParentRunner.java:329)
03:11:23 [2021-02-12T08:11:23.904Z] 	at org.junit.runners.ParentRunner.access$100(ParentRunner.java:66)
03:11:23 [2021-02-12T08:11:23.904Z] 	at org.junit.runners.ParentRunner$2.evaluate(ParentRunner.java:293)
03:11:23 [2021-02-12T08:11:23.904Z] 	at org.junit.internal.runners.statements.RunBefores.evaluate(RunBefores.java:26)
03:11:23 [2021-02-12T08:11:23.904Z] 	at org.junit.internal.runners.statements.RunAfters.evaluate(RunAfters.java:27)
03:11:23 [2021-02-12T08:11:23.904Z] 	at org.junit.runners.ParentRunner$3.evaluate(ParentRunner.java:306)
03:11:23 [2021-02-12T08:11:23.904Z] 	at org.junit.runners.ParentRunner.run(ParentRunner.java:413)
03:11:23 [2021-02-12T08:11:23.904Z] 	at org.eclipse.swtbot.swt.finder.junit.SWTBotJunit4ClassRunner.run(SWTBotJunit4ClassRunner.java:62)
03:11:23 [2021-02-12T08:11:23.904Z] 	at org.apache.maven.surefire.junit4.JUnit4Provider.execute(JUnit4Provider.java:365)
03:11:23 [2021-02-12T08:11:23.904Z] 	at org.apache.maven.surefire.junit4.JUnit4Provider.executeWithRerun(JUnit4Provider.java:273)
03:11:23 [2021-02-12T08:11:23.904Z] 	at org.apache.maven.surefire.junit4.JUnit4Provider.executeTestSet(JUnit4Provider.java:238)
03:11:23 [2021-02-12T08:11:23.904Z] 	at org.apache.maven.surefire.junit4.JUnit4Provider.invoke(JUnit4Provider.java:159)
03:11:23 [2021-02-12T08:11:23.904Z] 	at sun.reflect.NativeMethodAccessorImpl.invoke0(Native Method)
03:11:23 [2021-02-12T08:11:23.904Z] 	at sun.reflect.NativeMethodAccessorImpl.invoke(NativeMethodAccessorImpl.java:62)
03:11:23 [2021-02-12T08:11:23.904Z] 	at sun.reflect.DelegatingMethodAccessorImpl.invoke(DelegatingMethodAccessorImpl.java:43)
03:11:23 [2021-02-12T08:11:23.904Z] 	at java.lang.reflect.Method.invoke(Method.java:498)
03:11:23 [2021-02-12T08:11:23.904Z] 	at org.apache.maven.surefire.util.ReflectionUtils.invokeMethodWithArray2(ReflectionUtils.java:206)
03:11:23 [2021-02-12T08:11:23.904Z] 	at org.apache.maven.surefire.booter.ProviderFactory$ProviderProxy.invoke(ProviderFactory.java:161)
03:11:23 [2021-02-12T08:11:23.904Z] 	at org.apache.maven.surefire.booter.ProviderFactory.invokeProvider(ProviderFactory.java:84)
03:11:23 [2021-02-12T08:11:23.904Z] 	at org.eclipse.tycho.surefire.osgibooter.OsgiSurefireBooter.run(OsgiSurefireBooter.java:113)
03:11:23 [2021-02-12T08:11:23.904Z] 	at org.eclipse.tycho.surefire.osgibooter.AbstractUITestApplication.runTests(AbstractUITestApplication.java:44)
03:11:23 [2021-02-12T08:11:23.904Z] 	at org.eclipse.e4.ui.internal.workbench.swt.E4Testable$1.run(E4Testable.java:73)
03:11:23 [2021-02-12T08:11:23.904Z] 	at java.lang.Thread.run(Thread.java:748)
03:11:23 [2021-02-12T08:11:23.904Z] Contains: Error connecting project ProjectWithoutDotProject, no Git repositories found
03:11:23 [2021-02-12T08:11:23.904Z] !SUBENTRY 1 org.eclipse.egit.core 4 0 2021-02-12 08:11:23.703
03:11:23 [2021-02-12T08:11:23.904Z] !MESSAGE Connecting Git team provider failed. See log for details.
03:11:23 [2021-02-12T08:11:23.904Z] !SUBENTRY 2 org.eclipse.egit.core 4 0 2021-02-12 08:11:23.703
03:11:23 [2021-02-12T08:11:23.904Z] !MESSAGE Error connecting project ProjectWithoutDotProject, no Git repositories found
03:11:30 [2021-02-12T08:11:30.446Z] Tests run: 3, Failures: 1, Errors: 0, Skipped: 0, Time elapsed: 7.48 s <<< FAILURE! - in org.eclipse.egit.ui.internal.push.PushToUpstreamTest
03:11:30 [2021-02-12T08:11:30.446Z] pushWithExistingUpstreamConfiguration(org.eclipse.egit.ui.internal.push.PushToUpstreamTest)  Time elapsed: 1.084 s
03:11:30 [2021-02-12T08:11:30.446Z] pushWithoutConfig(org.eclipse.egit.ui.internal.push.PushToUpstreamTest)  Time elapsed: 5.431 s  <<< FAILURE!
03:11:30 [2021-02-12T08:11:30.446Z] java.lang.AssertionError: Project not shared with git: P/ProjectWithoutDotProject
03:11:30 [2021-02-12T08:11:30.446Z] 	at org.junit.Assert.fail(Assert.java:89)
03:11:30 [2021-02-12T08:11:30.446Z] 	at org.junit.Assert.assertTrue(Assert.java:42)
03:11:30 [2021-02-12T08:11:30.446Z] 	at org.eclipse.egit.ui.common.LocalRepositoryTestCase.assertConnected(LocalRepositoryTestCase.java:465)
03:11:30 [2021-02-12T08:11:30.446Z] 	at org.eclipse.egit.ui.common.LocalRepositoryTestCase.createProjectAndCommitToRepository(LocalRepositoryTestCase.java:373)
03:11:30 [2021-02-12T08:11:30.446Z] 	at org.eclipse.egit.ui.common.LocalRepositoryTestCase.createProjectAndCommitToRepository(LocalRepositoryTestCase.java:331)
03:11:30 [2021-02-12T08:11:30.446Z] 	at org.eclipse.egit.ui.common.LocalRepositoryTestCase.createProjectAndCommitToRepository(LocalRepositoryTestCase.java:326)
03:11:30 [2021-02-12T08:11:30.446Z] 	at org.eclipse.egit.ui.internal.push.PushToUpstreamTest.createRepositories(PushToUpstreamTest.java:44)
03:11:30 [2021-02-12T08:11:30.446Z] 	at sun.reflect.NativeMethodAccessorImpl.invoke0(Native Method)
03:11:30 [2021-02-12T08:11:30.446Z] 	at sun.reflect.NativeMethodAccessorImpl.invoke(NativeMethodAccessorImpl.java:62)
03:11:30 [2021-02-12T08:11:30.446Z] 	at sun.reflect.DelegatingMethodAccessorImpl.invoke(DelegatingMethodAccessorImpl.java:43)
03:11:30 [2021-02-12T08:11:30.446Z] 	at java.lang.reflect.Method.invoke(Method.java:498)
03:11:30 [2021-02-12T08:11:30.446Z] 	at org.junit.runners.model.FrameworkMethod$1.runReflectiveCall(FrameworkMethod.java:59)
03:11:30 [2021-02-12T08:11:30.446Z] 	at org.junit.internal.runners.model.ReflectiveCallable.run(ReflectiveCallable.java:12)
03:11:30 [2021-02-12T08:11:30.446Z] 	at org.junit.runners.model.FrameworkMethod.invokeExplosively(FrameworkMethod.java:56)
03:11:30 [2021-02-12T08:11:30.446Z] 	at org.junit.internal.runners.statements.RunBefores.invokeMethod(RunBefores.java:33)
03:11:30 [2021-02-12T08:11:30.446Z] 	at org.junit.internal.runners.statements.RunBefores.evaluate(RunBefores.java:24)
03:11:30 [2021-02-12T08:11:30.446Z] 	at org.junit.internal.runners.statements.RunAfters.evaluate(RunAfters.java:27)
03:11:30 [2021-02-12T08:11:30.446Z] 	at org.junit.rules.TestWatcher$1.evaluate(TestWatcher.java:61)
03:11:30 [2021-02-12T08:11:30.446Z] 	at org.junit.runners.ParentRunner$3.evaluate(ParentRunner.java:306)
03:11:30 [2021-02-12T08:11:30.446Z] 	at org.junit.runners.ParentRunner.runLeaf(ParentRunner.java:366)
03:11:30 [2021-02-12T08:11:30.446Z] 	at org.eclipse.swtbot.swt.finder.junit.SWTBotJunit4ClassRunner.runChild(SWTBotJunit4ClassRunner.java:77)
03:11:30 [2021-02-12T08:11:30.446Z] 	at org.junit.runners.BlockJUnit4ClassRunner.runChild(BlockJUnit4ClassRunner.java:63)
03:11:30 [2021-02-12T08:11:30.446Z] 	at org.junit.runners.ParentRunner$4.run(ParentRunner.java:331)
03:11:30 [2021-02-12T08:11:30.446Z] 	at org.junit.runners.ParentRunner$1.schedule(ParentRunner.java:79)
03:11:30 [2021-02-12T08:11:30.446Z] 	at org.junit.runners.ParentRunner.runChildren(ParentRunner.java:329)
03:11:30 [2021-02-12T08:11:30.446Z] 	at org.junit.runners.ParentRunner.access$100(ParentRunner.java:66)
03:11:30 [2021-02-12T08:11:30.446Z] 	at org.junit.runners.ParentRunner$2.evaluate(ParentRunner.java:293)
03:11:30 [2021-02-12T08:11:30.446Z] 	at org.junit.internal.runners.statements.RunBefores.evaluate(RunBefores.java:26)
03:11:30 [2021-02-12T08:11:30.446Z] 	at org.junit.internal.runners.statements.RunAfters.evaluate(RunAfters.java:27)
03:11:30 [2021-02-12T08:11:30.446Z] 	at org.junit.runners.ParentRunner$3.evaluate(ParentRunner.java:306)
03:11:30 [2021-02-12T08:11:30.446Z] 	at org.junit.runners.ParentRunner.run(ParentRunner.java:413)
03:11:30 [2021-02-12T08:11:30.446Z] 	at org.eclipse.swtbot.swt.finder.junit.SWTBotJunit4ClassRunner.run(SWTBotJunit4ClassRunner.java:62)
03:11:30 [2021-02-12T08:11:30.446Z] 	at org.apache.maven.surefire.junit4.JUnit4Provider.execute(JUnit4Provider.java:365)
03:11:30 [2021-02-12T08:11:30.446Z] 	at org.apache.maven.surefire.junit4.JUnit4Provider.executeWithRerun(JUnit4Provider.java:273)
03:11:30 [2021-02-12T08:11:30.446Z] 	at org.apache.maven.surefire.junit4.JUnit4Provider.executeTestSet(JUnit4Provider.java:238)
03:11:30 [2021-02-12T08:11:30.446Z] 	at org.apache.maven.surefire.junit4.JUnit4Provider.invoke(JUnit4Provider.java:159)
03:11:30 [2021-02-12T08:11:30.446Z] 	at sun.reflect.NativeMethodAccessorImpl.invoke0(Native Method)
03:11:30 [2021-02-12T08:11:30.446Z] 	at sun.reflect.NativeMethodAccessorImpl.invoke(NativeMethodAccessorImpl.java:62)
03:11:30 [2021-02-12T08:11:30.446Z] 	at sun.reflect.DelegatingMethodAccessorImpl.invoke(DelegatingMethodAccessorImpl.java:43)
03:11:30 [2021-02-12T08:11:30.446Z] 	at java.lang.reflect.Method.invoke(Method.java:498)
03:11:30 [2021-02-12T08:11:30.446Z] 	at org.apache.maven.surefire.util.ReflectionUtils.invokeMethodWithArray2(ReflectionUtils.java:206)
03:11:30 [2021-02-12T08:11:30.446Z] 	at org.apache.maven.surefire.booter.ProviderFactory$ProviderProxy.invoke(ProviderFactory.java:161)
03:11:30 [2021-02-12T08:11:30.446Z] 	at org.apache.maven.surefire.booter.ProviderFactory.invokeProvider(ProviderFactory.java:84)
03:11:30 [2021-02-12T08:11:30.446Z] 	at org.eclipse.tycho.surefire.osgibooter.OsgiSurefireBooter.run(OsgiSurefireBooter.java:113)
03:11:30 [2021-02-12T08:11:30.446Z] 	at org.eclipse.tycho.surefire.osgibooter.AbstractUITestApplication.runTests(AbstractUITestApplication.java:44)
03:11:30 [2021-02-12T08:11:30.446Z] 	at org.eclipse.e4.ui.internal.workbench.swt.E4Testable$1.run(E4Testable.java:73)
03:11:30 [2021-02-12T08:11:30.446Z] 	at java.lang.Thread.run(Thread.java:748)
03:11:30 [2021-02-12T08:11:30.446Z] 
03:11:30 [2021-02-12T08:11:30.446Z] pushWithDefaultRemoteWithPushRefSpecs(org.eclipse.egit.ui.internal.push.PushToUpstreamTest)  Time elapsed: 0.958 s
03:11:30 [2021-02-12T08:11:30.446Z] Running org.eclipse.egit.ui.internal.branch.BranchProjectTrackerTest
03:11:31 [2021-02-12T08:11:31.010Z] Tests run: 1, Failures: 0, Errors: 0, Skipped: 0, Time elapsed: 1.042 s - in org.eclipse.egit.ui.internal.branch.BranchProjectTrackerTest
03:11:31 [2021-02-12T08:11:31.010Z] twoProjectsWithOnlyOneOnBranch(org.eclipse.egit.ui.internal.branch.BranchProjectTrackerTest)  Time elapsed: 1.039 s
03:11:31 [2021-02-12T08:11:31.010Z] Running org.eclipse.egit.ui.internal.decorators.DecoratableResourceAdapterTest
03:11:45 [2021-02-12T08:11:45.860Z] Tests run: 13, Failures: 0, Errors: 0, Skipped: 0, Time elapsed: 12.579 s - in org.eclipse.egit.ui.internal.decorators.DecoratableResourceAdapterTest
03:11:45 [2021-02-12T08:11:45.860Z] testDecorationDeletedFile(org.eclipse.egit.ui.internal.decorators.DecoratableResourceAdapterTest)  Time elapsed: 1.087 s
03:11:45 [2021-02-12T08:11:45.860Z] testDecorationModifiedFile(org.eclipse.egit.ui.internal.decorators.DecoratableResourceAdapterTest)  Time elapsed: 0.881 s
03:11:45 [2021-02-12T08:11:45.860Z] testDecorationEmptyProject(org.eclipse.egit.ui.internal.decorators.DecoratableResourceAdapterTest)  Time elapsed: 0.894 s
03:11:45 [2021-02-12T08:11:45.860Z] testDecorationConflictingFile(org.eclipse.egit.ui.internal.decorators.DecoratableResourceAdapterTest)  Time elapsed: 1.113 s
03:11:45 [2021-02-12T08:11:45.860Z] testDecorationNewEmptyFolder(org.eclipse.egit.ui.internal.decorators.DecoratableResourceAdapterTest)  Time elapsed: 0.821 s
03:11:45 [2021-02-12T08:11:45.860Z] testDecorationFolderPrefixOfOtherFolder(org.eclipse.egit.ui.internal.decorators.DecoratableResourceAdapterTest)  Time elapsed: 1.014 s
03:11:45 [2021-02-12T08:11:45.860Z] testDecorationNewFileInOneSubfolder(org.eclipse.egit.ui.internal.decorators.DecoratableResourceAdapterTest)  Time elapsed: 0.997 s
03:11:45 [2021-02-12T08:11:45.860Z] testDecorationNewFile(org.eclipse.egit.ui.internal.decorators.DecoratableResourceAdapterTest)  Time elapsed: 0.911 s
03:11:45 [2021-02-12T08:11:45.860Z] testDecorationNewFileInSubfolder(org.eclipse.egit.ui.internal.decorators.DecoratableResourceAdapterTest)  Time elapsed: 0.818 s
03:11:45 [2021-02-12T08:11:45.860Z] testDecorationCommittedFile(org.eclipse.egit.ui.internal.decorators.DecoratableResourceAdapterTest)  Time elapsed: 0.999 s
03:11:45 [2021-02-12T08:11:45.860Z] testDecorationFileInIgnoredFolder(org.eclipse.egit.ui.internal.decorators.DecoratableResourceAdapterTest)  Time elapsed: 0.919 s
03:11:45 [2021-02-12T08:11:45.860Z] testDecorationIgnoredFile(org.eclipse.egit.ui.internal.decorators.DecoratableResourceAdapterTest)  Time elapsed: 0.813 s
03:11:45 [2021-02-12T08:11:45.860Z] testDecorationAddedFile(org.eclipse.egit.ui.internal.decorators.DecoratableResourceAdapterTest)  Time elapsed: 1.26 s
03:11:45 [2021-02-12T08:11:45.860Z] Running org.eclipse.egit.ui.internal.decorators.DecoratableWorkingSetTest
03:11:50 [2021-02-12T08:11:50.106Z] Tests run: 7, Failures: 0, Errors: 0, Skipped: 0, Time elapsed: 6.493 s - in org.eclipse.egit.ui.internal.decorators.DecoratableWorkingSetTest
03:11:50 [2021-02-12T08:11:50.106Z] testAnyConflictsIsConflicts(org.eclipse.egit.ui.internal.decorators.DecoratableWorkingSetTest)  Time elapsed: 1.006 s
03:11:50 [2021-02-12T08:11:50.106Z] testUntrackedContentIsUndecorated(org.eclipse.egit.ui.internal.decorators.DecoratableWorkingSetTest)  Time elapsed: 1.079 s
03:11:50 [2021-02-12T08:11:50.106Z] testAnyDirtyIsDirty(org.eclipse.egit.ui.internal.decorators.DecoratableWorkingSetTest)  Time elapsed: 0.786 s
03:11:50 [2021-02-12T08:11:50.106Z] testDecorationConflictingOverDirty(org.eclipse.egit.ui.internal.decorators.DecoratableWorkingSetTest)  Time elapsed: 1.024 s
03:11:50 [2021-02-12T08:11:50.106Z] testEmptyWorkingSetIsUndecorated(org.eclipse.egit.ui.internal.decorators.DecoratableWorkingSetTest)  Time elapsed: 0.717 s
03:11:50 [2021-02-12T08:11:50.106Z] testStagingStateHasNoInfluence_Modified(org.eclipse.egit.ui.internal.decorators.DecoratableWorkingSetTest)  Time elapsed: 0.985 s
03:11:50 [2021-02-12T08:11:50.106Z] testAnyTrackedIsTracked(org.eclipse.egit.ui.internal.decorators.DecoratableWorkingSetTest)  Time elapsed: 0.891 s
03:11:50 [2021-02-12T08:11:50.106Z] Running org.eclipse.egit.ui.internal.decorators.DecoratableResourceMappingTest
03:11:58 [2021-02-12T08:11:58.199Z] Tests run: 9, Failures: 0, Errors: 0, Skipped: 0, Time elapsed: 7.869 s - in org.eclipse.egit.ui.internal.decorators.DecoratableResourceMappingTest
03:11:58 [2021-02-12T08:11:58.199Z] testAnyConflictsIsConflicts(org.eclipse.egit.ui.internal.decorators.DecoratableResourceMappingTest)  Time elapsed: 0.926 s
03:11:58 [2021-02-12T08:11:58.199Z] testSameStagingStateIsState_Added(org.eclipse.egit.ui.internal.decorators.DecoratableResourceMappingTest)  Time elapsed: 0.813 s
03:11:58 [2021-02-12T08:11:58.199Z] testAnyDirtyIsDirty(org.eclipse.egit.ui.internal.decorators.DecoratableResourceMappingTest)  Time elapsed: 0.813 s
03:11:58 [2021-02-12T08:11:58.199Z] testMixedStagingStateIsModified_RemovedAdded(org.eclipse.egit.ui.internal.decorators.DecoratableResourceMappingTest)  Time elapsed: 0.815 s
03:11:58 [2021-02-12T08:11:58.199Z] testAllIgnoredIsUnstaged(org.eclipse.egit.ui.internal.decorators.DecoratableResourceMappingTest)  Time elapsed: 0.829 s
03:11:58 [2021-02-12T08:11:58.199Z] testDecorationConflictingOverDirty(org.eclipse.egit.ui.internal.decorators.DecoratableResourceMappingTest)  Time elapsed: 0.929 s
03:11:58 [2021-02-12T08:11:58.199Z] testMixedStagingStateIsModified_AddedNotStaged(org.eclipse.egit.ui.internal.decorators.DecoratableResourceMappingTest)  Time elapsed: 0.796 s
03:11:58 [2021-02-12T08:11:58.199Z] testNewResourceMappingIsUnstaged(org.eclipse.egit.ui.internal.decorators.DecoratableResourceMappingTest)  Time elapsed: 1.098 s
03:11:58 [2021-02-12T08:11:58.199Z] testAnyTrackedIsTracked(org.eclipse.egit.ui.internal.decorators.DecoratableResourceMappingTest)  Time elapsed: 0.816 s
03:11:58 [2021-02-12T08:11:58.199Z] Running org.eclipse.egit.ui.internal.fetch.FetchGerritChangeTest
03:11:58 [2021-02-12T08:11:58.199Z] Tests run: 15, Failures: 0, Errors: 0, Skipped: 0, Time elapsed: 0.004 s - in org.eclipse.egit.ui.internal.fetch.FetchGerritChangeTest
03:11:58 [2021-02-12T08:11:58.199Z] testChangeStringNoDigits(org.eclipse.egit.ui.internal.fetch.FetchGerritChangeTest)  Time elapsed: 0.001 s
03:11:58 [2021-02-12T08:11:58.199Z] testChangeStringOverflow(org.eclipse.egit.ui.internal.fetch.FetchGerritChangeTest)  Time elapsed: 0.001 s
03:11:58 [2021-02-12T08:11:58.199Z] testChangeStringTwoNumbers(org.eclipse.egit.ui.internal.fetch.FetchGerritChangeTest)  Time elapsed: 0 s
03:11:58 [2021-02-12T08:11:58.199Z] testFromRef(org.eclipse.egit.ui.internal.fetch.FetchGerritChangeTest)  Time elapsed: 0 s
03:11:58 [2021-02-12T08:11:58.199Z] testChangeStringNegative(org.eclipse.egit.ui.internal.fetch.FetchGerritChangeTest)  Time elapsed: 0 s
03:11:58 [2021-02-12T08:11:58.199Z] testChangeStringUri(org.eclipse.egit.ui.internal.fetch.FetchGerritChangeTest)  Time elapsed: 0 s
03:11:58 [2021-02-12T08:11:58.199Z] testRefFromChange(org.eclipse.egit.ui.internal.fetch.FetchGerritChangeTest)  Time elapsed: 0 s
03:11:58 [2021-02-12T08:11:58.199Z] testChangeStringUriNonsense(org.eclipse.egit.ui.internal.fetch.FetchGerritChangeTest)  Time elapsed: 0 s
03:11:58 [2021-02-12T08:11:58.199Z] testChangeStringThreeNumbers(org.eclipse.egit.ui.internal.fetch.FetchGerritChangeTest)  Time elapsed: 0 s
03:11:58 [2021-02-12T08:11:58.199Z] testChangeStringMultiline(org.eclipse.egit.ui.internal.fetch.FetchGerritChangeTest)  Time elapsed: 0 s
03:11:58 [2021-02-12T08:11:58.199Z] testChangeStringSingleNumber(org.eclipse.egit.ui.internal.fetch.FetchGerritChangeTest)  Time elapsed: 0 s
03:11:58 [2021-02-12T08:11:58.199Z] testChangeRefs(org.eclipse.egit.ui.internal.fetch.FetchGerritChangeTest)  Time elapsed: 0 s
03:11:58 [2021-02-12T08:11:58.199Z] testChangeStringEmpty(org.eclipse.egit.ui.internal.fetch.FetchGerritChangeTest)  Time elapsed: 0 s
03:11:58 [2021-02-12T08:11:58.199Z] testChangeStringNull(org.eclipse.egit.ui.internal.fetch.FetchGerritChangeTest)  Time elapsed: 0 s
03:11:58 [2021-02-12T08:11:58.199Z] testChangeStringZero(org.eclipse.egit.ui.internal.fetch.FetchGerritChangeTest)  Time elapsed: 0 s
03:11:58 [2021-02-12T08:11:58.199Z] Running org.eclipse.egit.ui.submodule.SubmoduleUpdateTest
03:11:58 [2021-02-12T08:11:58.762Z] 
03:11:58 [2021-02-12T08:11:58.763Z] (SWT:1649): Gtk-WARNING **: 08:11:58.694: Negative content width -6 (allocation 1, extents 4x3) while allocating gadget (node toolbar, owner GtkToolbar)
03:12:01 [2021-02-12T08:12:01.284Z] 
03:12:01 [2021-02-12T08:12:01.284Z] (SWT:1649): Gtk-WARNING **: 08:12:00.975: Negative content width -6 (allocation 1, extents 4x3) while allocating gadget (node toolbar, owner GtkToolbar)
03:12:01 [2021-02-12T08:12:01.284Z] Tests run: 1, Failures: 0, Errors: 0, Skipped: 0, Time elapsed: 3.214 s - in org.eclipse.egit.ui.submodule.SubmoduleUpdateTest
03:12:01 [2021-02-12T08:12:01.284Z] updateSubmodule(org.eclipse.egit.ui.submodule.SubmoduleUpdateTest)  Time elapsed: 3.21 s
03:12:01 [2021-02-12T08:12:01.284Z] Running org.eclipse.egit.ui.submodule.SubmoduleAddTest
03:12:02 [2021-02-12T08:12:02.213Z] 
03:12:02 [2021-02-12T08:12:02.214Z] (SWT:1649): Gtk-WARNING **: 08:12:01.897: Negative content width -6 (allocation 1, extents 4x3) while allocating gadget (node toolbar, owner GtkToolbar)
03:12:04 [2021-02-12T08:12:04.734Z] 
03:12:04 [2021-02-12T08:12:04.734Z] (SWT:1649): Gtk-WARNING **: 08:12:04.414: Negative content width -6 (allocation 1, extents 4x3) while allocating gadget (node toolbar, owner GtkToolbar)
03:12:04 [2021-02-12T08:12:04.734Z] Tests run: 1, Failures: 0, Errors: 0, Skipped: 0, Time elapsed: 3.437 s - in org.eclipse.egit.ui.submodule.SubmoduleAddTest
03:12:04 [2021-02-12T08:12:04.734Z] addAtRoot(org.eclipse.egit.ui.submodule.SubmoduleAddTest)  Time elapsed: 3.433 s
03:12:04 [2021-02-12T08:12:04.734Z] Running org.eclipse.egit.ui.submodule.SubmoduleSyncTest
03:12:05 [2021-02-12T08:12:05.296Z] 
03:12:05 [2021-02-12T08:12:05.297Z] (SWT:1649): Gtk-WARNING **: 08:12:05.255: Negative content width -6 (allocation 1, extents 4x3) while allocating gadget (node toolbar, owner GtkToolbar)
03:12:08 [2021-02-12T08:12:08.569Z] 
03:12:08 [2021-02-12T08:12:08.569Z] (SWT:1649): Gtk-WARNING **: 08:12:08.020: Negative content width -6 (allocation 1, extents 4x3) while allocating gadget (node toolbar, owner GtkToolbar)
03:12:08 [2021-02-12T08:12:08.569Z] Tests run: 1, Failures: 0, Errors: 0, Skipped: 0, Time elapsed: 3.605 s - in org.eclipse.egit.ui.submodule.SubmoduleSyncTest
03:12:08 [2021-02-12T08:12:08.569Z] syncSubmodule(org.eclipse.egit.ui.submodule.SubmoduleSyncTest)  Time elapsed: 3.6 s
03:12:08 [2021-02-12T08:12:08.569Z] Running org.eclipse.egit.ui.httpauth.PushTest
03:12:08 [2021-02-12T08:12:08.569Z] 2021-02-12 08:12:08.216:INFO:oejs.Server:WorkbenchTestable: jetty-9.4.35.v20201120; built: 2020-11-27T20:36:51.615Z; git: bdc54f03a5e0a7e280fab27f55c3c75ee8da89fb; jvm 1.8.0_252-b09
03:12:08 [2021-02-12T08:12:08.569Z] 2021-02-12 08:12:08.216:INFO:oejsh.ContextHandler:WorkbenchTestable: Started o.e.j.s.ServletContextHandler@56989543{/sbasic,null,AVAILABLE}
03:12:08 [2021-02-12T08:12:08.569Z] 2021-02-12 08:12:08.223:INFO:oejs.AbstractConnector:WorkbenchTestable: Started ServerConnector@3e904fe{HTTP/1.1, (http/1.1)}{127.0.0.1:40882}
03:12:08 [2021-02-12T08:12:08.569Z] 2021-02-12 08:12:08.223:INFO:oejs.Server:WorkbenchTestable: Started @742278ms
03:12:09 [2021-02-12T08:12:09.133Z] 
03:12:09 [2021-02-12T08:12:09.133Z] (SWT:1649): Gtk-CRITICAL **: 08:12:09.128: gtk_box_gadget_distribute: assertion 'size >= 0' failed in GtkCheckButton
03:12:10 [2021-02-12T08:12:10.063Z] 2021-02-12 08:12:09.995:INFO:oejs.AbstractConnector:WorkbenchTestable: Stopped ServerConnector@3e904fe{HTTP/1.1, (http/1.1)}{127.0.0.1:0}
03:12:10 [2021-02-12T08:12:10.064Z] 2021-02-12 08:12:09.996:INFO:oejsh.ContextHandler:WorkbenchTestable: Stopped o.e.j.s.ServletContextHandler@56989543{/sbasic,null,STOPPED}
03:12:10 [2021-02-12T08:12:10.064Z] Tests run: 1, Failures: 0, Errors: 0, Skipped: 0, Time elapsed: 1.873 s - in org.eclipse.egit.ui.httpauth.PushTest
03:12:10 [2021-02-12T08:12:10.064Z] testPush(org.eclipse.egit.ui.httpauth.PushTest)  Time elapsed: 1.873 s
03:12:10 [2021-02-12T08:12:10.064Z] Running org.eclipse.egit.ui.search.CommitSearchDialogTest
03:12:10 [2021-02-12T08:12:10.993Z] 
03:12:10 [2021-02-12T08:12:10.993Z] (SWT:1649): Gtk-WARNING **: 08:12:10.678: Negative content width -6 (allocation 1, extents 4x3) while allocating gadget (node toolbar, owner GtkToolbar)
03:12:10 [2021-02-12T08:12:10.993Z] 
03:12:10 [2021-02-12T08:12:10.993Z] (SWT:1649): Gtk-WARNING **: 08:12:10.691: Negative content width -6 (allocation 1, extents 4x3) while allocating gadget (node toolbar, owner GtkToolbar)
03:12:10 [2021-02-12T08:12:10.993Z] 
03:12:10 [2021-02-12T08:12:10.993Z] (SWT:1649): Gtk-WARNING **: 08:12:10.742: Negative content width -6 (allocation 1, extents 4x3) while allocating gadget (node toolbar, owner GtkToolbar)
03:12:10 [2021-02-12T08:12:10.994Z] 
03:12:10 [2021-02-12T08:12:10.994Z] (SWT:1649): Gtk-WARNING **: 08:12:10.800: Negative content width -6 (allocation 1, extents 4x3) while allocating gadget (node toolbar, owner GtkToolbar)
03:12:11 [2021-02-12T08:12:11.557Z] 
03:12:11 [2021-02-12T08:12:11.557Z] (SWT:1649): Gtk-WARNING **: 08:12:11.441: Negative content width -6 (allocation 1, extents 4x3) while allocating gadget (node toolbar, owner GtkToolbar)
03:12:11 [2021-02-12T08:12:11.813Z] Tests run: 1, Failures: 0, Errors: 0, Skipped: 0, Time elapsed: 1.551 s - in org.eclipse.egit.ui.search.CommitSearchDialogTest
03:12:11 [2021-02-12T08:12:11.813Z] openCommitTabOnSearchDialog(org.eclipse.egit.ui.search.CommitSearchDialogTest)  Time elapsed: 1.548 s
03:12:11 [2021-02-12T08:12:11.813Z] Running org.eclipse.egit.ui.search.CommitSearchQueryTest
03:12:17 [2021-02-12T08:12:17.086Z] Tests run: 7, Failures: 0, Errors: 0, Skipped: 0, Time elapsed: 4.476 s - in org.eclipse.egit.ui.search.CommitSearchQueryTest
03:12:17 [2021-02-12T08:12:17.086Z] testQuery(org.eclipse.egit.ui.search.CommitSearchQueryTest)  Time elapsed: 0.624 s
03:12:17 [2021-02-12T08:12:17.086Z] testMatchMessage(org.eclipse.egit.ui.search.CommitSearchQueryTest)  Time elapsed: 0.611 s
03:12:17 [2021-02-12T08:12:17.086Z] testCaseInsensitive(org.eclipse.egit.ui.search.CommitSearchQueryTest)  Time elapsed: 0.616 s
03:12:17 [2021-02-12T08:12:17.086Z] testMatchCommit(org.eclipse.egit.ui.search.CommitSearchQueryTest)  Time elapsed: 0.669 s
03:12:17 [2021-02-12T08:12:17.086Z] testMatchParent(org.eclipse.egit.ui.search.CommitSearchQueryTest)  Time elapsed: 0.717 s
03:12:17 [2021-02-12T08:12:17.086Z] testMatchTree(org.eclipse.egit.ui.search.CommitSearchQueryTest)  Time elapsed: 0.62 s
03:12:17 [2021-02-12T08:12:17.086Z] testEmptyMatches(org.eclipse.egit.ui.search.CommitSearchQueryTest)  Time elapsed: 0.605 s
03:12:17 [2021-02-12T08:12:17.086Z] Running org.eclipse.egit.ui.gitflow.CommandEnablementTest
03:12:17 [2021-02-12T08:12:17.649Z] 
03:12:17 [2021-02-12T08:12:17.649Z] (SWT:1649): Gtk-WARNING **: 08:12:17.366: Negative content width -6 (allocation 1, extents 4x3) while allocating gadget (node toolbar, owner GtkToolbar)
03:12:17 [2021-02-12T08:12:17.649Z] 
03:12:17 [2021-02-12T08:12:17.649Z] (SWT:1649): Gtk-WARNING **: 08:12:17.519: Negative content width -6 (allocation 1, extents 4x3) while allocating gadget (node toolbar, owner GtkToolbar)
03:12:17 [2021-02-12T08:12:17.649Z] Tests run: 2, Failures: 0, Errors: 0, Skipped: 0, Time elapsed: 1.599 s - in org.eclipse.egit.ui.gitflow.CommandEnablementTest
03:12:17 [2021-02-12T08:12:17.649Z] testPackageExplorerStartFinishEnablement(org.eclipse.egit.ui.gitflow.CommandEnablementTest)  Time elapsed: 0.808 s
03:12:17 [2021-02-12T08:12:17.649Z] testRepositoryViewStartFinishEnablement(org.eclipse.egit.ui.gitflow.CommandEnablementTest)  Time elapsed: 0.786 s
03:12:17 [2021-02-12T08:12:17.649Z] Running org.eclipse.egit.ui.gitflow.FeatureFinishSquashHandlerTest
03:12:19 [2021-02-12T08:12:19.016Z] 
03:12:19 [2021-02-12T08:12:19.016Z] (SWT:1649): Gtk-CRITICAL **: 08:12:18.723: gtk_box_gadget_distribute: assertion 'size >= 0' failed in GtkScrollbar
03:12:19 [2021-02-12T08:12:19.016Z] 
03:12:19 [2021-02-12T08:12:19.016Z] (SWT:1649): Gtk-CRITICAL **: 08:12:18.742: gtk_box_gadget_distribute: assertion 'size >= 0' failed in GtkScrollbar
03:12:19 [2021-02-12T08:12:19.016Z] 
03:12:19 [2021-02-12T08:12:19.016Z] (SWT:1649): Gtk-CRITICAL **: 08:12:18.759: gtk_box_gadget_distribute: assertion 'size >= 0' failed in GtkScrollbar
03:12:19 [2021-02-12T08:12:19.016Z] 
03:12:19 [2021-02-12T08:12:19.016Z] (SWT:1649): Gtk-CRITICAL **: 08:12:18.775: gtk_box_gadget_distribute: assertion 'size >= 0' failed in GtkScrollbar
03:12:19 [2021-02-12T08:12:19.016Z] 
03:12:19 [2021-02-12T08:12:19.016Z] (SWT:1649): Gtk-CRITICAL **: 08:12:18.791: gtk_box_gadget_distribute: assertion 'size >= 0' failed in GtkScrollbar
03:12:19 [2021-02-12T08:12:19.016Z] 
03:12:19 [2021-02-12T08:12:19.016Z] (SWT:1649): Gtk-CRITICAL **: 08:12:18.809: gtk_box_gadget_distribute: assertion 'size >= 0' failed in GtkScrollbar
03:12:19 [2021-02-12T08:12:19.016Z] 
03:12:19 [2021-02-12T08:12:19.016Z] (SWT:1649): Gtk-CRITICAL **: 08:12:18.825: gtk_box_gadget_distribute: assertion 'size >= 0' failed in GtkScrollbar
03:12:19 [2021-02-12T08:12:19.016Z] 
03:12:19 [2021-02-12T08:12:19.016Z] (SWT:1649): Gtk-CRITICAL **: 08:12:18.841: gtk_box_gadget_distribute: assertion 'size >= 0' failed in GtkScrollbar
03:12:19 [2021-02-12T08:12:19.016Z] 
03:12:19 [2021-02-12T08:12:19.016Z] (SWT:1649): Gtk-CRITICAL **: 08:12:18.859: gtk_box_gadget_distribute: assertion 'size >= 0' failed in GtkScrollbar
03:12:19 [2021-02-12T08:12:19.016Z] 
03:12:19 [2021-02-12T08:12:19.016Z] (SWT:1649): Gtk-CRITICAL **: 08:12:18.875: gtk_box_gadget_distribute: assertion 'size >= 0' failed in GtkScrollbar
03:12:19 [2021-02-12T08:12:19.016Z] 
03:12:19 [2021-02-12T08:12:19.016Z] (SWT:1649): Gtk-CRITICAL **: 08:12:18.891: gtk_box_gadget_distribute: assertion 'size >= 0' failed in GtkScrollbar
03:12:19 [2021-02-12T08:12:19.016Z] 
03:12:19 [2021-02-12T08:12:19.016Z] (SWT:1649): Gtk-CRITICAL **: 08:12:18.908: gtk_box_gadget_distribute: assertion 'size >= 0' failed in GtkScrollbar
03:12:19 [2021-02-12T08:12:19.016Z] 
03:12:19 [2021-02-12T08:12:19.016Z] (SWT:1649): Gtk-CRITICAL **: 08:12:18.925: gtk_box_gadget_distribute: assertion 'size >= 0' failed in GtkScrollbar
03:12:19 [2021-02-12T08:12:19.579Z] 
03:12:19 [2021-02-12T08:12:19.579Z] (SWT:1649): Gtk-CRITICAL **: 08:12:19.441: gtk_box_gadget_distribute: assertion 'size >= 0' failed in GtkScrollbar
03:12:20 [2021-02-12T08:12:20.143Z] Tests run: 1, Failures: 0, Errors: 0, Skipped: 0, Time elapsed: 2.498 s - in org.eclipse.egit.ui.gitflow.FeatureFinishSquashHandlerTest
03:12:20 [2021-02-12T08:12:20.143Z] testFeatureFinishSquash(org.eclipse.egit.ui.gitflow.FeatureFinishSquashHandlerTest)  Time elapsed: 2.494 s
03:12:20 [2021-02-12T08:12:20.143Z] Running org.eclipse.egit.ui.gitflow.FeatureStartFinishHandlerTest
03:12:21 [2021-02-12T08:12:21.073Z] 
03:12:21 [2021-02-12T08:12:21.073Z] (SWT:1649): Gtk-CRITICAL **: 08:12:20.834: gtk_box_gadget_distribute: assertion 'size >= 0' failed in GtkScrollbar
03:12:21 [2021-02-12T08:12:21.073Z] 
03:12:21 [2021-02-12T08:12:21.073Z] (SWT:1649): Gtk-CRITICAL **: 08:12:20.847: gtk_box_gadget_distribute: assertion 'size >= 0' failed in GtkScrollbar
03:12:21 [2021-02-12T08:12:21.073Z] 
03:12:21 [2021-02-12T08:12:21.073Z] (SWT:1649): Gtk-CRITICAL **: 08:12:20.864: gtk_box_gadget_distribute: assertion 'size >= 0' failed in GtkScrollbar
03:12:21 [2021-02-12T08:12:21.073Z] 
03:12:21 [2021-02-12T08:12:21.073Z] (SWT:1649): Gtk-CRITICAL **: 08:12:20.881: gtk_box_gadget_distribute: assertion 'size >= 0' failed in GtkScrollbar
03:12:21 [2021-02-12T08:12:21.073Z] 
03:12:21 [2021-02-12T08:12:21.073Z] (SWT:1649): Gtk-CRITICAL **: 08:12:20.897: gtk_box_gadget_distribute: assertion 'size >= 0' failed in GtkScrollbar
03:12:21 [2021-02-12T08:12:21.073Z] 
03:12:21 [2021-02-12T08:12:21.073Z] (SWT:1649): Gtk-CRITICAL **: 08:12:20.913: gtk_box_gadget_distribute: assertion 'size >= 0' failed in GtkScrollbar
03:12:21 [2021-02-12T08:12:21.073Z] 
03:12:21 [2021-02-12T08:12:21.073Z] (SWT:1649): Gtk-CRITICAL **: 08:12:20.931: gtk_box_gadget_distribute: assertion 'size >= 0' failed in GtkScrollbar
03:12:21 [2021-02-12T08:12:21.073Z] 
03:12:21 [2021-02-12T08:12:21.073Z] (SWT:1649): Gtk-CRITICAL **: 08:12:20.947: gtk_box_gadget_distribute: assertion 'size >= 0' failed in GtkScrollbar
03:12:21 [2021-02-12T08:12:21.073Z] 
03:12:21 [2021-02-12T08:12:21.073Z] (SWT:1649): Gtk-CRITICAL **: 08:12:20.963: gtk_box_gadget_distribute: assertion 'size >= 0' failed in GtkScrollbar
03:12:21 [2021-02-12T08:12:21.073Z] 
03:12:21 [2021-02-12T08:12:21.073Z] (SWT:1649): Gtk-CRITICAL **: 08:12:20.981: gtk_box_gadget_distribute: assertion 'size >= 0' failed in GtkScrollbar
03:12:21 [2021-02-12T08:12:21.073Z] 
03:12:21 [2021-02-12T08:12:21.073Z] (SWT:1649): Gtk-CRITICAL **: 08:12:20.997: gtk_box_gadget_distribute: assertion 'size >= 0' failed in GtkScrollbar
03:12:21 [2021-02-12T08:12:21.073Z] 
03:12:21 [2021-02-12T08:12:21.073Z] (SWT:1649): Gtk-CRITICAL **: 08:12:21.014: gtk_box_gadget_distribute: assertion 'size >= 0' failed in GtkScrollbar
03:12:21 [2021-02-12T08:12:21.073Z] 
03:12:21 [2021-02-12T08:12:21.073Z] (SWT:1649): Gtk-CRITICAL **: 08:12:21.031: gtk_box_gadget_distribute: assertion 'size >= 0' failed in GtkScrollbar
03:12:21 [2021-02-12T08:12:21.073Z] 
03:12:21 [2021-02-12T08:12:21.074Z] (SWT:1649): Gtk-CRITICAL **: 08:12:21.047: gtk_box_gadget_distribute: assertion 'size >= 0' failed in GtkScrollbar
03:12:21 [2021-02-12T08:12:21.074Z] 
03:12:21 [2021-02-12T08:12:21.074Z] (SWT:1649): Gtk-CRITICAL **: 08:12:21.063: gtk_box_gadget_distribute: assertion 'size >= 0' failed in GtkScrollbar
03:12:21 [2021-02-12T08:12:21.636Z] 
03:12:21 [2021-02-12T08:12:21.636Z] (SWT:1649): Gtk-CRITICAL **: 08:12:21.587: gtk_box_gadget_distribute: assertion 'size >= 0' failed in GtkScrollbar
03:12:22 [2021-02-12T08:12:22.205Z] Tests run: 1, Failures: 0, Errors: 0, Skipped: 0, Time elapsed: 2.037 s - in org.eclipse.egit.ui.gitflow.FeatureStartFinishHandlerTest
03:12:22 [2021-02-12T08:12:22.205Z] testFeatureStart(org.eclipse.egit.ui.gitflow.FeatureStartFinishHandlerTest)  Time elapsed: 2.033 s
03:12:22 [2021-02-12T08:12:22.205Z] Running org.eclipse.egit.ui.gitflow.FeatureFinishKeepBranchHandlerTest
03:12:23 [2021-02-12T08:12:23.137Z] 
03:12:23 [2021-02-12T08:12:23.137Z] (SWT:1649): Gtk-CRITICAL **: 08:12:22.857: gtk_box_gadget_distribute: assertion 'size >= 0' failed in GtkScrollbar
03:12:23 [2021-02-12T08:12:23.137Z] 
03:12:23 [2021-02-12T08:12:23.138Z] (SWT:1649): Gtk-CRITICAL **: 08:12:22.871: gtk_box_gadget_distribute: assertion 'size >= 0' failed in GtkScrollbar
03:12:23 [2021-02-12T08:12:23.138Z] 
03:12:23 [2021-02-12T08:12:23.138Z] (SWT:1649): Gtk-CRITICAL **: 08:12:22.888: gtk_box_gadget_distribute: assertion 'size >= 0' failed in GtkScrollbar
03:12:23 [2021-02-12T08:12:23.138Z] 
03:12:23 [2021-02-12T08:12:23.138Z] (SWT:1649): Gtk-CRITICAL **: 08:12:22.905: gtk_box_gadget_distribute: assertion 'size >= 0' failed in GtkScrollbar
03:12:23 [2021-02-12T08:12:23.138Z] 
03:12:23 [2021-02-12T08:12:23.138Z] (SWT:1649): Gtk-CRITICAL **: 08:12:22.921: gtk_box_gadget_distribute: assertion 'size >= 0' failed in GtkScrollbar
03:12:23 [2021-02-12T08:12:23.138Z] 
03:12:23 [2021-02-12T08:12:23.138Z] (SWT:1649): Gtk-CRITICAL **: 08:12:22.938: gtk_box_gadget_distribute: assertion 'size >= 0' failed in GtkScrollbar
03:12:23 [2021-02-12T08:12:23.138Z] 
03:12:23 [2021-02-12T08:12:23.138Z] (SWT:1649): Gtk-CRITICAL **: 08:12:22.954: gtk_box_gadget_distribute: assertion 'size >= 0' failed in GtkScrollbar
03:12:23 [2021-02-12T08:12:23.138Z] 
03:12:23 [2021-02-12T08:12:23.138Z] (SWT:1649): Gtk-CRITICAL **: 08:12:22.971: gtk_box_gadget_distribute: assertion 'size >= 0' failed in GtkScrollbar
03:12:23 [2021-02-12T08:12:23.138Z] 
03:12:23 [2021-02-12T08:12:23.138Z] (SWT:1649): Gtk-CRITICAL **: 08:12:22.988: gtk_box_gadget_distribute: assertion 'size >= 0' failed in GtkScrollbar
03:12:23 [2021-02-12T08:12:23.138Z] 
03:12:23 [2021-02-12T08:12:23.138Z] (SWT:1649): Gtk-CRITICAL **: 08:12:23.005: gtk_box_gadget_distribute: assertion 'size >= 0' failed in GtkScrollbar
03:12:23 [2021-02-12T08:12:23.138Z] 
03:12:23 [2021-02-12T08:12:23.138Z] (SWT:1649): Gtk-CRITICAL **: 08:12:23.021: gtk_box_gadget_distribute: assertion 'size >= 0' failed in GtkScrollbar
03:12:23 [2021-02-12T08:12:23.138Z] 
03:12:23 [2021-02-12T08:12:23.138Z] (SWT:1649): Gtk-CRITICAL **: 08:12:23.038: gtk_box_gadget_distribute: assertion 'size >= 0' failed in GtkScrollbar
03:12:23 [2021-02-12T08:12:23.138Z] 
03:12:23 [2021-02-12T08:12:23.138Z] (SWT:1649): Gtk-CRITICAL **: 08:12:23.055: gtk_box_gadget_distribute: assertion 'size >= 0' failed in GtkScrollbar
03:12:23 [2021-02-12T08:12:23.138Z] 
03:12:23 [2021-02-12T08:12:23.138Z] (SWT:1649): Gtk-CRITICAL **: 08:12:23.071: gtk_box_gadget_distribute: assertion 'size >= 0' failed in GtkScrollbar
03:12:23 [2021-02-12T08:12:23.138Z] 
03:12:23 [2021-02-12T08:12:23.138Z] (SWT:1649): Gtk-CRITICAL **: 08:12:23.087: gtk_box_gadget_distribute: assertion 'size >= 0' failed in GtkScrollbar
03:12:23 [2021-02-12T08:12:23.702Z] 
03:12:23 [2021-02-12T08:12:23.702Z] (SWT:1649): Gtk-CRITICAL **: 08:12:23.618: gtk_box_gadget_distribute: assertion 'size >= 0' failed in GtkScrollbar
03:12:24 [2021-02-12T08:12:24.265Z] Tests run: 1, Failures: 0, Errors: 0, Skipped: 0, Time elapsed: 2.037 s - in org.eclipse.egit.ui.gitflow.FeatureFinishKeepBranchHandlerTest
03:12:24 [2021-02-12T08:12:24.265Z] testFeatureFinishKeepBranch(org.eclipse.egit.ui.gitflow.FeatureFinishKeepBranchHandlerTest)  Time elapsed: 2.034 s
03:12:24 [2021-02-12T08:12:24.265Z] Running org.eclipse.egit.ui.gitflow.FeatureRebaseHandlerTest
03:12:25 [2021-02-12T08:12:25.194Z] 
03:12:25 [2021-02-12T08:12:25.194Z] (SWT:1649): Gtk-WARNING **: 08:12:25.019: Negative content width -6 (allocation 1, extents 4x3) while allocating gadget (node toolbar, owner GtkToolbar)
03:12:25 [2021-02-12T08:12:25.194Z] 
03:12:25 [2021-02-12T08:12:25.194Z] (SWT:1649): Gtk-WARNING **: 08:12:25.024: Negative content width -6 (allocation 1, extents 4x3) while allocating gadget (node toolbar, owner GtkToolbar)
03:12:25 [2021-02-12T08:12:25.194Z] 
03:12:25 [2021-02-12T08:12:25.194Z] (SWT:1649): Gtk-WARNING **: 08:12:25.027: Negative content width -6 (allocation 1, extents 4x3) while allocating gadget (node toolbar, owner GtkToolbar)
03:12:25 [2021-02-12T08:12:25.194Z] 
03:12:25 [2021-02-12T08:12:25.194Z] (SWT:1649): Gtk-WARNING **: 08:12:25.029: Negative content width -6 (allocation 1, extents 4x3) while allocating gadget (node toolbar, owner GtkToolbar)
03:12:25 [2021-02-12T08:12:25.194Z] 
03:12:25 [2021-02-12T08:12:25.194Z] (SWT:1649): Gtk-WARNING **: 08:12:25.029: Negative content width -6 (allocation 1, extents 4x3) while allocating gadget (node toolbar, owner GtkToolbar)
03:12:25 [2021-02-12T08:12:25.194Z] 
03:12:25 [2021-02-12T08:12:25.194Z] (SWT:1649): Gtk-WARNING **: 08:12:25.060: Negative content width -6 (allocation 1, extents 4x3) while allocating gadget (node toolbar, owner GtkToolbar)
03:12:25 [2021-02-12T08:12:25.794Z] 
03:12:25 [2021-02-12T08:12:25.794Z] (SWT:1649): Gtk-WARNING **: 08:12:25.486: Negative content height -1 (allocation 1, extents 1x1) while allocating gadget (node scrolledwindow, owner GtkScrolledWindow)
03:12:25 [2021-02-12T08:12:25.794Z] 
03:12:25 [2021-02-12T08:12:25.794Z] (SWT:1649): Gtk-CRITICAL **: 08:12:25.486: gtk_box_gadget_distribute: assertion 'size >= 0' failed in GtkScrollbar
03:12:25 [2021-02-12T08:12:25.794Z] 
03:12:25 [2021-02-12T08:12:25.794Z] (SWT:1649): Gtk-WARNING **: 08:12:25.531: Negative content width -6 (allocation 1, extents 4x3) while allocating gadget (node toolbar, owner GtkToolbar)
03:12:27 [2021-02-12T08:12:27.169Z] 
03:12:27 [2021-02-12T08:12:27.169Z] (SWT:1649): Gtk-WARNING **: 08:12:26.745: Negative content height -1 (allocation 1, extents 1x1) while allocating gadget (node scrolledwindow, owner GtkScrolledWindow)
03:12:27 [2021-02-12T08:12:27.169Z] 
03:12:27 [2021-02-12T08:12:27.169Z] (SWT:1649): Gtk-CRITICAL **: 08:12:26.745: gtk_box_gadget_distribute: assertion 'size >= 0' failed in GtkScrollbar
03:12:27 [2021-02-12T08:12:27.169Z] Tests run: 2, Failures: 0, Errors: 0, Skipped: 0, Time elapsed: 2.667 s - in org.eclipse.egit.ui.gitflow.FeatureRebaseHandlerTest
03:12:27 [2021-02-12T08:12:27.169Z] testRebaseFailOnConflict(org.eclipse.egit.ui.gitflow.FeatureRebaseHandlerTest)  Time elapsed: 1.421 s
03:12:27 [2021-02-12T08:12:27.169Z] testRebaseFailOnDirtyWorkingDirectory(org.eclipse.egit.ui.gitflow.FeatureRebaseHandlerTest)  Time elapsed: 1.239 s
03:12:27 [2021-02-12T08:12:27.169Z] Running org.eclipse.egit.ui.gitflow.InitHandlerTest
03:12:30 [2021-02-12T08:12:30.446Z] Tests run: 3, Failures: 0, Errors: 0, Skipped: 0, Time elapsed: 3.464 s - in org.eclipse.egit.ui.gitflow.InitHandlerTest
03:12:30 [2021-02-12T08:12:30.446Z] testInit(org.eclipse.egit.ui.gitflow.InitHandlerTest)  Time elapsed: 0.784 s
03:12:30 [2021-02-12T08:12:30.446Z] testInitEmptyRepoMissingMaster(org.eclipse.egit.ui.gitflow.InitHandlerTest)  Time elapsed: 1.39 s
03:12:30 [2021-02-12T08:12:30.446Z] testInitMissingMaster(org.eclipse.egit.ui.gitflow.InitHandlerTest)  Time elapsed: 1.284 s
03:12:30 [2021-02-12T08:12:30.446Z] Running org.eclipse.egit.ui.gitflow.FeatureStartCheckoutConflictTest
03:12:31 [2021-02-12T08:12:31.009Z] 
03:12:31 [2021-02-12T08:12:31.009Z] (SWT:1649): Gtk-CRITICAL **: 08:12:30.960: gtk_box_gadget_distribute: assertion 'size >= 0' failed in GtkScrollbar
03:12:31 [2021-02-12T08:12:31.009Z] 
03:12:31 [2021-02-12T08:12:31.009Z] (SWT:1649): Gtk-CRITICAL **: 08:12:30.969: gtk_box_gadget_distribute: assertion 'size >= 0' failed in GtkScrollbar
03:12:31 [2021-02-12T08:12:31.266Z] Tests run: 1, Failures: 0, Errors: 0, Skipped: 0, Time elapsed: 0.771 s - in org.eclipse.egit.ui.gitflow.FeatureStartCheckoutConflictTest
03:12:31 [2021-02-12T08:12:31.266Z] testFeatureStart(org.eclipse.egit.ui.gitflow.FeatureStartCheckoutConflictTest)  Time elapsed: 0.767 s
03:12:31 [2021-02-12T08:12:31.266Z] Running org.eclipse.egit.ui.variables.DynamicVariablesTest
03:12:36 [2021-02-12T08:12:36.521Z] Tests run: 4, Failures: 0, Errors: 0, Skipped: 0, Time elapsed: 4.32 s - in org.eclipse.egit.ui.variables.DynamicVariablesTest
03:12:36 [2021-02-12T08:12:36.521Z] testGitBranch(org.eclipse.egit.ui.variables.DynamicVariablesTest)  Time elapsed: 1.091 s
03:12:36 [2021-02-12T08:12:36.521Z] testGitPath(org.eclipse.egit.ui.variables.DynamicVariablesTest)  Time elapsed: 1.076 s
03:12:36 [2021-02-12T08:12:36.521Z] testGitWorkTree(org.eclipse.egit.ui.variables.DynamicVariablesTest)  Time elapsed: 1.08 s
03:12:36 [2021-02-12T08:12:36.521Z] testGitDir(org.eclipse.egit.ui.variables.DynamicVariablesTest)  Time elapsed: 1.073 s
03:12:36 [2021-02-12T08:12:36.521Z] Running org.eclipse.egit.ui.prefpages.configuration.GlobalConfigurationPageTest
03:12:36 [2021-02-12T08:12:36.521Z] 
03:12:36 [2021-02-12T08:12:36.521Z] (SWT:1649): Gtk-WARNING **: 08:12:35.464: Negative content width -13 (allocation 5, extents 9x9) while allocating gadget (node entry, owner GtkEntry)
03:12:36 [2021-02-12T08:12:36.521Z] 
03:12:36 [2021-02-12T08:12:36.521Z] (SWT:1649): Gtk-WARNING **: 08:12:35.612: Negative content width -13 (allocation 5, extents 9x9) while allocating gadget (node entry, owner GtkEntry)
03:12:36 [2021-02-12T08:12:36.521Z] 
03:12:36 [2021-02-12T08:12:36.521Z] (SWT:1649): Gtk-WARNING **: 08:12:35.746: Negative content width -13 (allocation 5, extents 9x9) while allocating gadget (node entry, owner GtkEntry)
03:12:36 [2021-02-12T08:12:36.521Z] 
03:12:36 [2021-02-12T08:12:36.521Z] (SWT:1649): Gtk-WARNING **: 08:12:35.861: Negative content width -13 (allocation 5, extents 9x9) while allocating gadget (node entry, owner GtkEntry)
03:12:36 [2021-02-12T08:12:36.521Z] 
03:12:36 [2021-02-12T08:12:36.521Z] (SWT:1649): Gtk-WARNING **: 08:12:35.943: Negative content width -13 (allocation 5, extents 9x9) while allocating gadget (node entry, owner GtkEntry)
03:12:36 [2021-02-12T08:12:36.521Z] 
03:12:36 [2021-02-12T08:12:36.521Z] (SWT:1649): Gtk-WARNING **: 08:12:36.048: Negative content width -13 (allocation 5, extents 9x9) while allocating gadget (node entry, owner GtkEntry)
03:12:36 [2021-02-12T08:12:36.521Z] 
03:12:36 [2021-02-12T08:12:36.521Z] (SWT:1649): Gtk-WARNING **: 08:12:36.167: Negative content width -13 (allocation 5, extents 9x9) while allocating gadget (node entry, owner GtkEntry)
03:12:36 [2021-02-12T08:12:36.521Z] 
03:12:36 [2021-02-12T08:12:36.521Z] (SWT:1649): Gtk-WARNING **: 08:12:36.216: Negative content width -6 (allocation 1, extents 4x3) while allocating gadget (node toolbar, owner GtkToolbar)
03:12:36 [2021-02-12T08:12:36.521Z] 
03:12:36 [2021-02-12T08:12:36.521Z] (SWT:1649): Gtk-WARNING **: 08:12:36.216: Negative content height -3 (allocation 1, extents 2x2) while allocating gadget (node toolbar, owner GtkToolbar)
03:12:36 [2021-02-12T08:12:36.521Z] 
03:12:36 [2021-02-12T08:12:36.521Z] (SWT:1649): Gtk-WARNING **: 08:12:36.216: Negative content width -6 (allocation 1, extents 4x3) while allocating gadget (node toolbar, owner GtkToolbar)
03:12:36 [2021-02-12T08:12:36.521Z] 
03:12:36 [2021-02-12T08:12:36.521Z] (SWT:1649): Gtk-WARNING **: 08:12:36.217: Negative content height -3 (allocation 1, extents 2x2) while allocating gadget (node toolbar, owner GtkToolbar)
03:12:36 [2021-02-12T08:12:36.521Z] 
03:12:36 [2021-02-12T08:12:36.521Z] (SWT:1649): Gtk-WARNING **: 08:12:36.311: Negative content width -13 (allocation 5, extents 9x9) while allocating gadget (node entry, owner GtkEntry)
03:12:36 [2021-02-12T08:12:36.521Z] 
03:12:36 [2021-02-12T08:12:36.521Z] (SWT:1649): Gtk-WARNING **: 08:12:36.428: Negative content width -13 (allocation 5, extents 9x9) while allocating gadget (node entry, owner GtkEntry)
03:12:36 [2021-02-12T08:12:36.777Z] 
03:12:36 [2021-02-12T08:12:36.777Z] (SWT:1649): Gtk-WARNING **: 08:12:36.581: Negative content width -13 (allocation 5, extents 9x9) while allocating gadget (node entry, owner GtkEntry)
03:12:36 [2021-02-12T08:12:36.777Z] 
03:12:36 [2021-02-12T08:12:36.777Z] (SWT:1649): Gtk-WARNING **: 08:12:36.706: Negative content width -13 (allocation 5, extents 9x9) while allocating gadget (node entry, owner GtkEntry)
03:12:37 [2021-02-12T08:12:37.034Z] 
03:12:37 [2021-02-12T08:12:37.034Z] (SWT:1649): Gtk-WARNING **: 08:12:36.809: Negative content width -13 (allocation 5, extents 9x9) while allocating gadget (node entry, owner GtkEntry)
03:12:37 [2021-02-12T08:12:37.034Z] Tests run: 11, Failures: 0, Errors: 0, Skipped: 0, Time elapsed: 1.455 s - in org.eclipse.egit.ui.prefpages.configuration.GlobalConfigurationPageTest
03:12:37 [2021-02-12T08:12:37.034Z] testAddSubSectionEntry(org.eclipse.egit.ui.prefpages.configuration.GlobalConfigurationPageTest)  Time elapsed: 0.157 s
03:12:37 [2021-02-12T08:12:37.034Z] testAddSectionEntry(org.eclipse.egit.ui.prefpages.configuration.GlobalConfigurationPageTest)  Time elapsed: 0.133 s
03:12:37 [2021-02-12T08:12:37.034Z] testCanCreateSameEntryValue(org.eclipse.egit.ui.prefpages.configuration.GlobalConfigurationPageTest)  Time elapsed: 0.11 s
03:12:37 [2021-02-12T08:12:37.034Z] testNodes(org.eclipse.egit.ui.prefpages.configuration.GlobalConfigurationPageTest)  Time elapsed: 0.085 s
03:12:37 [2021-02-12T08:12:37.034Z] testRemoveValue(org.eclipse.egit.ui.prefpages.configuration.GlobalConfigurationPageTest)  Time elapsed: 0.106 s
03:12:37 [2021-02-12T08:12:37.034Z] testAddSubSectionEntryWithSuggestion(org.eclipse.egit.ui.prefpages.configuration.GlobalConfigurationPageTest)  Time elapsed: 0.12 s
03:12:37 [2021-02-12T08:12:37.034Z] testOpenEditor(org.eclipse.egit.ui.prefpages.configuration.GlobalConfigurationPageTest)  Time elapsed: 0.145 s
03:12:37 [2021-02-12T08:12:37.034Z] testSubsectionWithDot(org.eclipse.egit.ui.prefpages.configuration.GlobalConfigurationPageTest)  Time elapsed: 0.116 s
03:12:37 [2021-02-12T08:12:37.034Z] testChecksForKey(org.eclipse.egit.ui.prefpages.configuration.GlobalConfigurationPageTest)  Time elapsed: 0.153 s
03:12:37 [2021-02-12T08:12:37.034Z] testRemoveSubSection(org.eclipse.egit.ui.prefpages.configuration.GlobalConfigurationPageTest)  Time elapsed: 0.125 s
03:12:37 [2021-02-12T08:12:37.034Z] testRemoveSection(org.eclipse.egit.ui.prefpages.configuration.GlobalConfigurationPageTest)  Time elapsed: 0.103 s
03:12:37 [2021-02-12T08:12:37.034Z] Running org.eclipse.egit.ui.operations.GitScopeUtilTest
03:12:42 [2021-02-12T08:12:42.287Z] Tests run: 5, Failures: 0, Errors: 0, Skipped: 0, Time elapsed: 4.407 s - in org.eclipse.egit.ui.operations.GitScopeUtilTest
03:12:42 [2021-02-12T08:12:42.287Z] relatedChangesWithPrompt(org.eclipse.egit.ui.operations.GitScopeUtilTest)  Time elapsed: 1.542 s
03:12:42 [2021-02-12T08:12:42.288Z] modelProviderWithExtensionFiles(org.eclipse.egit.ui.operations.GitScopeUtilTest)  Time elapsed: 0.756 s
03:12:42 [2021-02-12T08:12:42.288Z] relatedChangesWithInvalidParams(org.eclipse.egit.ui.operations.GitScopeUtilTest)  Time elapsed: 0.803 s
03:12:42 [2021-02-12T08:12:42.288Z] relatedChangesWithNullResources(org.eclipse.egit.ui.operations.GitScopeUtilTest)  Time elapsed: 0.656 s
03:12:42 [2021-02-12T08:12:42.288Z] relatedChangesWithEmptyResources(org.eclipse.egit.ui.operations.GitScopeUtilTest)  Time elapsed: 0.649 s
03:12:42 [2021-02-12T08:12:42.288Z] 
03:12:42 [2021-02-12T08:12:42.288Z] Results:
03:12:42 [2021-02-12T08:12:42.288Z] 
03:12:42 [2021-02-12T08:12:42.288Z] Failures: 
03:12:42 [2021-02-12T08:12:42.288Z]   PushToUpstreamTest.createRepositories:44->LocalRepositoryTestCase.createProjectAndCommitToRepository:326->LocalRepositoryTestCase.createProjectAndCommitToRepository:331->LocalRepositoryTestCase.createProjectAndCommitToRepository:373->LocalRepositoryTestCase.assertConnected:465 Project not shared with git: P/ProjectWithoutDotProject
03:12:42 [2021-02-12T08:12:42.288Z] 
03:12:42 [2021-02-12T08:12:42.288Z] Tests run: 544, Failures: 1, Errors: 0, Skipped: 12
03:12:42 [2021-02-12T08:12:42.288Z] 
03:12:42 [2021-02-12T08:12:42.544Z] 
03:12:42 [2021-02-12T08:12:42.544Z] !ENTRY org.eclipse.core.resources 2 10035 2021-02-12 08:12:42.309
03:12:42 [2021-02-12T08:12:42.544Z] !MESSAGE The workspace will exit with unsaved changes in this session.
03:12:43 [2021-02-12T08:12:43.474Z] 08:12:43 [INFO] ------------------------------------------------------------------------
03:12:43 [2021-02-12T08:12:43.474Z] 08:12:43 [INFO] Reactor Summary for EGit Parent 5.11.0-SNAPSHOT:
03:12:43 [2021-02-12T08:12:43.474Z] 08:12:43 [INFO] 
03:12:43 [2021-02-12T08:12:43.474Z] 08:12:43 [INFO] EGit Parent ........................................ SUCCESS [ 34.263 s]
03:12:43 [2021-02-12T08:12:43.474Z] 08:12:43 [INFO] EGit Target Platform Definition .................... SUCCESS [  2.661 s]
03:12:43 [2021-02-12T08:12:43.474Z] 08:12:43 [INFO] Eclipse EGit ....................................... SUCCESS [ 10.677 s]
03:12:43 [2021-02-12T08:12:43.474Z] 08:12:43 [INFO] Git Team Provider (Core) ........................... SUCCESS [ 17.606 s]
03:12:43 [2021-02-12T08:12:43.474Z] 08:12:43 [INFO] Git Team Provider (UI) ............................. SUCCESS [ 45.617 s]
03:12:43 [2021-02-12T08:12:43.474Z] 08:12:43 [INFO] EGit Mylyn UI ...................................... SUCCESS [  7.413 s]
03:12:43 [2021-02-12T08:12:43.474Z] 08:12:43 [INFO] Git Team Provider (Documentation) .................. SUCCESS [  6.382 s]
03:12:43 [2021-02-12T08:12:43.474Z] 08:12:43 [INFO] Eclipse EGit Feature ............................... SUCCESS [  1.710 s]
03:12:43 [2021-02-12T08:12:43.474Z] 08:12:43 [INFO] EGit Mylyn Feature ................................. SUCCESS [  1.351 s]
03:12:43 [2021-02-12T08:12:43.475Z] 08:12:43 [INFO] Git Flow ........................................... SUCCESS [  6.843 s]
03:12:43 [2021-02-12T08:12:43.475Z] 08:12:43 [INFO] Git Flow UI ........................................ SUCCESS [  9.270 s]
03:12:43 [2021-02-12T08:12:43.475Z] 08:12:43 [INFO] Eclipse EGit Gitflow Feature ....................... SUCCESS [  2.181 s]
03:12:43 [2021-02-12T08:12:43.475Z] 08:12:43 [INFO] EGit JUnit Support ................................. SUCCESS [  7.774 s]
03:12:43 [2021-02-12T08:12:43.475Z] 08:12:43 [INFO] GitFlow Test Plug-in ............................... SUCCESS [ 29.544 s]
03:12:43 [2021-02-12T08:12:43.475Z] 08:12:43 [INFO] Eclipse EGit Source Feature ........................ SUCCESS [  1.077 s]
03:12:43 [2021-02-12T08:12:43.475Z] 08:12:43 [INFO] EGit P2 Repository ................................. SUCCESS [  9.470 s]
03:12:43 [2021-02-12T08:12:43.475Z] 08:12:43 [INFO] EGit Core Test Plug-in ............................. SUCCESS [02:17 min]
03:12:43 [2021-02-12T08:12:43.475Z] 08:12:43 [INFO] EGit UI Test Plug-in ............................... FAILURE [12:58 min]
03:12:43 [2021-02-12T08:12:43.475Z] 08:12:43 [INFO] EGit Mylyn UI Test Plug-in ......................... SKIPPED
03:12:43 [2021-02-12T08:12:43.475Z] 08:12:43 [INFO] ------------------------------------------------------------------------
03:12:43 [2021-02-12T08:12:43.475Z] 08:12:43 [INFO] BUILD FAILURE
03:12:43 [2021-02-12T08:12:43.475Z] 08:12:43 [INFO] ------------------------------------------------------------------------
03:12:43 [2021-02-12T08:12:43.475Z] 08:12:43 [INFO] Total time:  21:10 min
03:12:43 [2021-02-12T08:12:43.475Z] 08:12:43 [INFO] Finished at: 2021-02-12T08:12:43Z
03:12:43 [2021-02-12T08:12:43.475Z] 08:12:43 [INFO] ------------------------------------------------------------------------
03:12:43 [2021-02-12T08:12:43.475Z] 08:12:43 [ERROR] Failed to execute goal org.eclipse.tycho:tycho-surefire-plugin:1.7.0:test (default-test) on project org.eclipse.egit.ui.test: There are test failures.
03:12:43 [2021-02-12T08:12:43.475Z] 08:12:43 [ERROR] 
03:12:43 [2021-02-12T08:12:43.475Z] 08:12:43 [ERROR] Please refer to /home/jenkins/agent/workspace/egit/repo/org.eclipse.egit.ui.test/target/surefire-reports for the individual test results.
03:12:43 [2021-02-12T08:12:43.475Z] 08:12:43 [ERROR] -> [Help 1]
03:12:43 [2021-02-12T08:12:43.475Z] org.apache.maven.lifecycle.LifecycleExecutionException: Failed to execute goal org.eclipse.tycho:tycho-surefire-plugin:1.7.0:test (default-test) on project org.eclipse.egit.ui.test: There are test failures.
03:12:43 [2021-02-12T08:12:43.475Z] 
03:12:43 [2021-02-12T08:12:43.475Z] Please refer to /home/jenkins/agent/workspace/egit/repo/org.eclipse.egit.ui.test/target/surefire-reports for the individual test results.
03:12:43 [2021-02-12T08:12:43.475Z]     at org.apache.maven.lifecycle.internal.MojoExecutor.execute (MojoExecutor.java:215)
03:12:43 [2021-02-12T08:12:43.475Z]     at org.apache.maven.lifecycle.internal.MojoExecutor.execute (MojoExecutor.java:156)
03:12:43 [2021-02-12T08:12:43.475Z]     at org.apache.maven.lifecycle.internal.MojoExecutor.execute (MojoExecutor.java:148)
03:12:43 [2021-02-12T08:12:43.475Z]     at org.apache.maven.lifecycle.internal.LifecycleModuleBuilder.buildProject (LifecycleModuleBuilder.java:117)
03:12:43 [2021-02-12T08:12:43.475Z]     at org.apache.maven.lifecycle.internal.LifecycleModuleBuilder.buildProject (LifecycleModuleBuilder.java:81)
03:12:43 [2021-02-12T08:12:43.475Z]     at org.apache.maven.lifecycle.internal.builder.singlethreaded.SingleThreadedBuilder.build (SingleThreadedBuilder.java:56)
03:12:43 [2021-02-12T08:12:43.475Z]     at org.apache.maven.lifecycle.internal.LifecycleStarter.execute (LifecycleStarter.java:128)
03:12:43 [2021-02-12T08:12:43.475Z]     at org.apache.maven.DefaultMaven.doExecute (DefaultMaven.java:305)
03:12:43 [2021-02-12T08:12:43.475Z]     at org.apache.maven.DefaultMaven.doExecute (DefaultMaven.java:192)
03:12:43 [2021-02-12T08:12:43.475Z]     at org.apache.maven.DefaultMaven.execute (DefaultMaven.java:105)
03:12:43 [2021-02-12T08:12:43.475Z]     at org.apache.maven.cli.MavenCli.execute (MavenCli.java:957)
03:12:43 [2021-02-12T08:12:43.475Z]     at org.apache.maven.cli.MavenCli.doMain (MavenCli.java:289)
03:12:43 [2021-02-12T08:12:43.475Z]     at org.apache.maven.cli.MavenCli.main (MavenCli.java:193)
03:12:43 [2021-02-12T08:12:43.475Z]     at sun.reflect.NativeMethodAccessorImpl.invoke0 (Native Method)
03:12:43 [2021-02-12T08:12:43.475Z]     at sun.reflect.NativeMethodAccessorImpl.invoke (NativeMethodAccessorImpl.java:62)
03:12:43 [2021-02-12T08:12:43.475Z]     at sun.reflect.DelegatingMethodAccessorImpl.invoke (DelegatingMethodAccessorImpl.java:43)
03:12:43 [2021-02-12T08:12:43.475Z]     at java.lang.reflect.Method.invoke (Method.java:498)
03:12:43 [2021-02-12T08:12:43.475Z]     at org.codehaus.plexus.classworlds.launcher.Launcher.launchEnhanced (Launcher.java:282)
03:12:43 [2021-02-12T08:12:43.475Z]     at org.codehaus.plexus.classworlds.launcher.Launcher.launch (Launcher.java:225)
03:12:43 [2021-02-12T08:12:43.475Z]     at org.codehaus.plexus.classworlds.launcher.Launcher.mainWithExitCode (Launcher.java:406)
03:12:43 [2021-02-12T08:12:43.475Z]     at org.codehaus.plexus.classworlds.launcher.Launcher.main (Launcher.java:347)
03:12:43 [2021-02-12T08:12:43.475Z] Caused by: org.apache.maven.plugin.MojoFailureException: There are test failures.
03:12:43 [2021-02-12T08:12:43.475Z] 
03:12:43 [2021-02-12T08:12:43.475Z] Please refer to /home/jenkins/agent/workspace/egit/repo/org.eclipse.egit.ui.test/target/surefire-reports for the individual test results.
03:12:43 [2021-02-12T08:12:43.475Z]     at org.eclipse.tycho.surefire.TestMojo.runTest (TestMojo.java:1063)
03:12:43 [2021-02-12T08:12:43.475Z]     at org.eclipse.tycho.surefire.TestMojo.execute (TestMojo.java:712)
03:12:43 [2021-02-12T08:12:43.475Z]     at org.apache.maven.plugin.DefaultBuildPluginManager.executeMojo (DefaultBuildPluginManager.java:137)
03:12:43 [2021-02-12T08:12:43.475Z]     at org.apache.maven.lifecycle.internal.MojoExecutor.execute (MojoExecutor.java:210)
03:12:43 [2021-02-12T08:12:43.475Z]     at org.apache.maven.lifecycle.internal.MojoExecutor.execute (MojoExecutor.java:156)
03:12:43 [2021-02-12T08:12:43.475Z]     at org.apache.maven.lifecycle.internal.MojoExecutor.execute (MojoExecutor.java:148)
03:12:43 [2021-02-12T08:12:43.475Z]     at org.apache.maven.lifecycle.internal.LifecycleModuleBuilder.buildProject (LifecycleModuleBuilder.java:117)
03:12:43 [2021-02-12T08:12:43.475Z]     at org.apache.maven.lifecycle.internal.LifecycleModuleBuilder.buildProject (LifecycleModuleBuilder.java:81)
03:12:43 [2021-02-12T08:12:43.475Z]     at org.apache.maven.lifecycle.internal.builder.singlethreaded.SingleThreadedBuilder.build (SingleThreadedBuilder.java:56)
03:12:43 [2021-02-12T08:12:43.475Z]     at org.apache.maven.lifecycle.internal.LifecycleStarter.execute (LifecycleStarter.java:128)
03:12:43 [2021-02-12T08:12:43.475Z]     at org.apache.maven.DefaultMaven.doExecute (DefaultMaven.java:305)
03:12:43 [2021-02-12T08:12:43.475Z]     at org.apache.maven.DefaultMaven.doExecute (DefaultMaven.java:192)
03:12:43 [2021-02-12T08:12:43.475Z]     at org.apache.maven.DefaultMaven.execute (DefaultMaven.java:105)
03:12:43 [2021-02-12T08:12:43.475Z]     at org.apache.maven.cli.MavenCli.execute (MavenCli.java:957)
03:12:43 [2021-02-12T08:12:43.475Z]     at org.apache.maven.cli.MavenCli.doMain (MavenCli.java:289)
03:12:43 [2021-02-12T08:12:43.475Z]     at org.apache.maven.cli.MavenCli.main (MavenCli.java:193)
03:12:43 [2021-02-12T08:12:43.475Z]     at sun.reflect.NativeMethodAccessorImpl.invoke0 (Native Method)
03:12:43 [2021-02-12T08:12:43.475Z]     at sun.reflect.NativeMethodAccessorImpl.invoke (NativeMethodAccessorImpl.java:62)
03:12:43 [2021-02-12T08:12:43.475Z]     at sun.reflect.DelegatingMethodAccessorImpl.invoke (DelegatingMethodAccessorImpl.java:43)
03:12:43 [2021-02-12T08:12:43.475Z]     at java.lang.reflect.Method.invoke (Method.java:498)
03:12:43 [2021-02-12T08:12:43.475Z]     at org.codehaus.plexus.classworlds.launcher.Launcher.launchEnhanced (Launcher.java:282)
03:12:43 [2021-02-12T08:12:43.475Z]     at org.codehaus.plexus.classworlds.launcher.Launcher.launch (Launcher.java:225)
03:12:43 [2021-02-12T08:12:43.475Z]     at org.codehaus.plexus.classworlds.launcher.Launcher.mainWithExitCode (Launcher.java:406)
03:12:43 [2021-02-12T08:12:43.475Z]     at org.codehaus.plexus.classworlds.launcher.Launcher.main (Launcher.java:347)
03:12:43 [2021-02-12T08:12:43.475Z] 08:12:43 [ERROR] 
03:12:43 [2021-02-12T08:12:43.475Z] 08:12:43 [ERROR] Re-run Maven using the -X switch to enable full debug logging.
03:12:43 [2021-02-12T08:12:43.475Z] 08:12:43 [ERROR] 
03:12:43 [2021-02-12T08:12:43.475Z] 08:12:43 [ERROR] For more information about the errors and possible solutions, please read the following articles:
03:12:43 [2021-02-12T08:12:43.475Z] 08:12:43 [ERROR] [Help 1] http://cwiki.apache.org/confluence/display/MAVEN/MojoFailureException
03:12:43 [2021-02-12T08:12:43.475Z] 08:12:43 [ERROR] 
03:12:43 [2021-02-12T08:12:43.475Z] 08:12:43 [ERROR] After correcting the problems, you can resume the build with the command
03:12:43 [2021-02-12T08:12:43.475Z] 08:12:43 [ERROR]   mvn <args> -rf :org.eclipse.egit.ui.test
[Pipeline] }
[Pipeline] // stage
[Pipeline] stage
[Pipeline] { (Results)
[Pipeline] junit
03:12:44 [2021-02-12T08:12:44.890Z] Recording test results
03:12:45 [2021-02-12T08:12:45.826Z] [Checks API] No suitable checks publisher found.
[Pipeline] archiveArtifacts
03:12:45 [2021-02-12T08:12:45.841Z] Archiving artifacts
[Pipeline] findbugs
03:12:51 [2021-02-12T08:12:51.965Z] [FINDBUGS] Collecting findbugs analysis files...
03:12:55 [2021-02-12T08:12:55.137Z] [FINDBUGS] Searching for all files in /home/jenkins/agent/workspace/egit/repo that match the pattern */target/*bugsXml.xml
03:12:55 [2021-02-12T08:12:55.137Z] [FINDBUGS] Parsing 8 files in /home/jenkins/agent/workspace/egit/repo
03:12:55 [2021-02-12T08:12:55.137Z] [FINDBUGS] Successfully parsed file /home/jenkins/agent/workspace/egit/repo/org.eclipse.egit.core.junit/target/spotbugsXml.xml with 4 unique warnings and 0 duplicates.
03:12:55 [2021-02-12T08:12:55.137Z] [FINDBUGS] Successfully parsed file /home/jenkins/agent/workspace/egit/repo/org.eclipse.egit.core.test/target/spotbugsXml.xml with 9 unique warnings and 0 duplicates.
03:12:55 [2021-02-12T08:12:55.137Z] [FINDBUGS] Successfully parsed file /home/jenkins/agent/workspace/egit/repo/org.eclipse.egit.core/target/spotbugsXml.xml with 19 unique warnings and 0 duplicates.
03:12:55 [2021-02-12T08:12:55.137Z] [FINDBUGS] Successfully parsed file /home/jenkins/agent/workspace/egit/repo/org.eclipse.egit.gitflow.test/target/spotbugsXml.xml with 19 unique warnings and 0 duplicates.
03:12:55 [2021-02-12T08:12:55.137Z] [FINDBUGS] Successfully parsed file /home/jenkins/agent/workspace/egit/repo/org.eclipse.egit.gitflow.ui/target/spotbugsXml.xml with 19 unique warnings and 0 duplicates.
03:12:55 [2021-02-12T08:12:55.137Z] [FINDBUGS] Successfully parsed file /home/jenkins/agent/workspace/egit/repo/org.eclipse.egit.gitflow/target/spotbugsXml.xml with 21 unique warnings and 0 duplicates.
03:12:55 [2021-02-12T08:12:55.137Z] [FINDBUGS] Successfully parsed file /home/jenkins/agent/workspace/egit/repo/org.eclipse.egit.mylyn.ui/target/spotbugsXml.xml with 21 unique warnings and 0 duplicates.
03:12:55 [2021-02-12T08:12:55.137Z] [FINDBUGS] Successfully parsed file /home/jenkins/agent/workspace/egit/repo/org.eclipse.egit.ui/target/spotbugsXml.xml with 64 unique warnings and 0 duplicates.
03:12:55 [2021-02-12T08:12:55.137Z] Skipping warnings blame since pipelines do not have an SCM link.%n
03:12:55 [2021-02-12T08:12:55.209Z] [FINDBUGS] Computing warning deltas based on reference build #550
[Pipeline] dry
03:12:55 [2021-02-12T08:12:55.404Z] [DRY] Collecting duplicate code analysis files...
03:12:55 [2021-02-12T08:12:55.663Z] [DRY] Searching for all files in /home/jenkins/agent/workspace/egit/repo that match the pattern **/cpd.xml
03:12:55 [2021-02-12T08:12:55.663Z] [DRY] Parsing 15 files in /home/jenkins/agent/workspace/egit/repo
03:12:55 [2021-02-12T08:12:55.663Z] [DRY] Successfully parsed file /home/jenkins/agent/workspace/egit/repo/org.eclipse.egit-feature/target/cpd.xml with 0 unique warnings and 0 duplicates.
03:12:55 [2021-02-12T08:12:55.663Z] [DRY] Successfully parsed file /home/jenkins/agent/workspace/egit/repo/org.eclipse.egit.core.junit/target/cpd.xml with 0 unique warnings and 0 duplicates.
03:12:55 [2021-02-12T08:12:55.663Z] [DRY] Successfully parsed file /home/jenkins/agent/workspace/egit/repo/org.eclipse.egit.core.test/target/cpd.xml with 0 unique warnings and 0 duplicates.
03:12:55 [2021-02-12T08:12:55.663Z] [DRY] Successfully parsed file /home/jenkins/agent/workspace/egit/repo/org.eclipse.egit.core/target/cpd.xml with 2 unique warnings and 0 duplicates.
03:12:55 [2021-02-12T08:12:55.663Z] [DRY] Successfully parsed file /home/jenkins/agent/workspace/egit/repo/org.eclipse.egit.doc/target/cpd.xml with 2 unique warnings and 0 duplicates.
03:12:55 [2021-02-12T08:12:55.663Z] [DRY] Successfully parsed file /home/jenkins/agent/workspace/egit/repo/org.eclipse.egit.gitflow-feature/target/cpd.xml with 2 unique warnings and 0 duplicates.
03:12:55 [2021-02-12T08:12:55.663Z] [DRY] Successfully parsed file /home/jenkins/agent/workspace/egit/repo/org.eclipse.egit.gitflow.test/target/cpd.xml with 2 unique warnings and 0 duplicates.
03:12:55 [2021-02-12T08:12:55.663Z] [DRY] Successfully parsed file /home/jenkins/agent/workspace/egit/repo/org.eclipse.egit.gitflow.ui/target/cpd.xml with 2 unique warnings and 0 duplicates.
03:12:55 [2021-02-12T08:12:55.663Z] [DRY] Successfully parsed file /home/jenkins/agent/workspace/egit/repo/org.eclipse.egit.gitflow/target/cpd.xml with 2 unique warnings and 0 duplicates.
03:12:55 [2021-02-12T08:12:55.663Z] [DRY] Successfully parsed file /home/jenkins/agent/workspace/egit/repo/org.eclipse.egit.mylyn-feature/target/cpd.xml with 2 unique warnings and 0 duplicates.
03:12:55 [2021-02-12T08:12:55.663Z] [DRY] Successfully parsed file /home/jenkins/agent/workspace/egit/repo/org.eclipse.egit.mylyn.ui/target/cpd.xml with 2 unique warnings and 0 duplicates.
03:12:55 [2021-02-12T08:12:55.663Z] [DRY] Successfully parsed file /home/jenkins/agent/workspace/egit/repo/org.eclipse.egit.repository/target/cpd.xml with 2 unique warnings and 0 duplicates.
03:12:55 [2021-02-12T08:12:55.663Z] [DRY] Successfully parsed file /home/jenkins/agent/workspace/egit/repo/org.eclipse.egit.source-feature/target/cpd.xml with 2 unique warnings and 0 duplicates.
03:12:55 [2021-02-12T08:12:55.663Z] [DRY] Successfully parsed file /home/jenkins/agent/workspace/egit/repo/org.eclipse.egit.ui/target/cpd.xml with 35 unique warnings and 0 duplicates.
03:12:55 [2021-02-12T08:12:55.663Z] [DRY] Successfully parsed file /home/jenkins/agent/workspace/egit/repo/org.eclipse.egit/target/cpd.xml with 35 unique warnings and 0 duplicates.
03:12:55 [2021-02-12T08:12:55.663Z] Skipping warnings blame since pipelines do not have an SCM link.%n
03:12:55 [2021-02-12T08:12:55.704Z] [DRY] Computing warning deltas based on reference build #550
[Pipeline] }
[Pipeline] // stage
[Pipeline] step
03:12:55 [2021-02-12T08:12:55.873Z] Sending e-mails to: egit-build@eclipse.org
[Pipeline] }
[Pipeline] // dir
[Pipeline] }
03:12:56 [2021-02-12T08:12:56.032Z] Terminating xvnc.
[Pipeline] // xvnc
[Pipeline] }
[Pipeline] // timeout
[Pipeline] }
[Pipeline] // node
[Pipeline] }
[Pipeline] // timestamps
[Pipeline] End of Pipeline
ERROR: script returned exit code 1
Finished: FAILURE