SuccessConsole Output

Skipping 897 KB.. Full Log
urefireBooter.java:113)
13:08:50 [2020-09-26T17:08:50.040Z] 	at org.eclipse.tycho.surefire.osgibooter.AbstractUITestApplication.runTests(AbstractUITestApplication.java:44)
13:08:50 [2020-09-26T17:08:50.040Z] 	at org.eclipse.e4.ui.internal.workbench.swt.E4Testable$1.run(E4Testable.java:73)
13:08:50 [2020-09-26T17:08:50.040Z] 	at java.lang.Thread.run(Thread.java:748)
13:08:51 [2020-09-26T17:08:51.410Z] 
13:08:51 [2020-09-26T17:08:51.410Z] !ENTRY org.eclipse.egit.ui 4 0 2020-09-26 17:08:50.988
13:08:51 [2020-09-26T17:08:51.410Z] !MESSAGE CrashingCommitMessageProvider fails on purpose.
13:08:51 [2020-09-26T17:08:51.410Z] !STACK 0
13:08:51 [2020-09-26T17:08:51.410Z] java.lang.IllegalStateException: CrashingCommitMessageProvider fails on purpose.
13:08:51 [2020-09-26T17:08:51.410Z] 	at org.eclipse.egit.ui.internal.dialogs.CommitMessageBuilderTest$CrashingCommitMessageProvider.getMessage(CommitMessageBuilderTest.java:474)
13:08:51 [2020-09-26T17:08:51.410Z] 	at org.eclipse.egit.ui.internal.dialogs.CommitMessageBuilder.build(CommitMessageBuilder.java:90)
13:08:51 [2020-09-26T17:08:51.410Z] 	at org.eclipse.egit.ui.internal.dialogs.CommitMessageBuilderTest.commitMessageProvider_twoProvidersFirstOneCrashing(CommitMessageBuilderTest.java:146)
13:08:51 [2020-09-26T17:08:51.410Z] 	at sun.reflect.NativeMethodAccessorImpl.invoke0(Native Method)
13:08:51 [2020-09-26T17:08:51.410Z] 	at sun.reflect.NativeMethodAccessorImpl.invoke(NativeMethodAccessorImpl.java:62)
13:08:51 [2020-09-26T17:08:51.410Z] 	at sun.reflect.DelegatingMethodAccessorImpl.invoke(DelegatingMethodAccessorImpl.java:43)
13:08:51 [2020-09-26T17:08:51.410Z] 	at java.lang.reflect.Method.invoke(Method.java:498)
13:08:51 [2020-09-26T17:08:51.410Z] 	at org.junit.runners.model.FrameworkMethod$1.runReflectiveCall(FrameworkMethod.java:59)
13:08:51 [2020-09-26T17:08:51.410Z] 	at org.junit.internal.runners.model.ReflectiveCallable.run(ReflectiveCallable.java:12)
13:08:51 [2020-09-26T17:08:51.410Z] 	at org.junit.runners.model.FrameworkMethod.invokeExplosively(FrameworkMethod.java:56)
13:08:51 [2020-09-26T17:08:51.410Z] 	at org.junit.internal.runners.statements.InvokeMethod.evaluate(InvokeMethod.java:17)
13:08:51 [2020-09-26T17:08:51.410Z] 	at org.junit.internal.runners.statements.RunBefores.evaluate(RunBefores.java:26)
13:08:51 [2020-09-26T17:08:51.410Z] 	at org.junit.internal.runners.statements.RunAfters.evaluate(RunAfters.java:27)
13:08:51 [2020-09-26T17:08:51.410Z] 	at org.junit.runners.ParentRunner$3.evaluate(ParentRunner.java:306)
13:08:51 [2020-09-26T17:08:51.410Z] 	at org.junit.runners.BlockJUnit4ClassRunner$1.evaluate(BlockJUnit4ClassRunner.java:100)
13:08:51 [2020-09-26T17:08:51.410Z] 	at org.junit.runners.ParentRunner.runLeaf(ParentRunner.java:366)
13:08:51 [2020-09-26T17:08:51.410Z] 	at org.junit.runners.BlockJUnit4ClassRunner.runChild(BlockJUnit4ClassRunner.java:103)
13:08:51 [2020-09-26T17:08:51.410Z] 	at org.junit.runners.BlockJUnit4ClassRunner.runChild(BlockJUnit4ClassRunner.java:63)
13:08:51 [2020-09-26T17:08:51.410Z] 	at org.junit.runners.ParentRunner$4.run(ParentRunner.java:331)
13:08:51 [2020-09-26T17:08:51.410Z] 	at org.junit.runners.ParentRunner$1.schedule(ParentRunner.java:79)
13:08:51 [2020-09-26T17:08:51.410Z] 	at org.junit.runners.ParentRunner.runChildren(ParentRunner.java:329)
13:08:51 [2020-09-26T17:08:51.410Z] 	at org.junit.runners.ParentRunner.access$100(ParentRunner.java:66)
13:08:51 [2020-09-26T17:08:51.410Z] 	at org.junit.runners.ParentRunner$2.evaluate(ParentRunner.java:293)
13:08:51 [2020-09-26T17:08:51.410Z] 	at org.junit.internal.runners.statements.RunBefores.evaluate(RunBefores.java:26)
13:08:51 [2020-09-26T17:08:51.410Z] 	at org.junit.runners.ParentRunner$3.evaluate(ParentRunner.java:306)
13:08:51 [2020-09-26T17:08:51.410Z] 	at org.junit.runners.ParentRunner.run(ParentRunner.java:413)
13:08:51 [2020-09-26T17:08:51.410Z] 	at org.apache.maven.surefire.junit4.JUnit4Provider.execute(JUnit4Provider.java:365)
13:08:51 [2020-09-26T17:08:51.410Z] 	at org.apache.maven.surefire.junit4.JUnit4Provider.executeWithRerun(JUnit4Provider.java:273)
13:08:51 [2020-09-26T17:08:51.410Z] 	at org.apache.maven.surefire.junit4.JUnit4Provider.executeTestSet(JUnit4Provider.java:238)
13:08:51 [2020-09-26T17:08:51.410Z] 	at org.apache.maven.surefire.junit4.JUnit4Provider.invoke(JUnit4Provider.java:159)
13:08:51 [2020-09-26T17:08:51.410Z] 	at sun.reflect.NativeMethodAccessorImpl.invoke0(Native Method)
13:08:51 [2020-09-26T17:08:51.410Z] 	at sun.reflect.NativeMethodAccessorImpl.invoke(NativeMethodAccessorImpl.java:62)
13:08:51 [2020-09-26T17:08:51.410Z] 	at sun.reflect.DelegatingMethodAccessorImpl.invoke(DelegatingMethodAccessorImpl.java:43)
13:08:51 [2020-09-26T17:08:51.410Z] 	at java.lang.reflect.Method.invoke(Method.java:498)
13:08:51 [2020-09-26T17:08:51.410Z] 	at org.apache.maven.surefire.util.ReflectionUtils.invokeMethodWithArray2(ReflectionUtils.java:206)
13:08:51 [2020-09-26T17:08:51.410Z] 	at org.apache.maven.surefire.booter.ProviderFactory$ProviderProxy.invoke(ProviderFactory.java:161)
13:08:51 [2020-09-26T17:08:51.411Z] 	at org.apache.maven.surefire.booter.ProviderFactory.invokeProvider(ProviderFactory.java:84)
13:08:51 [2020-09-26T17:08:51.411Z] 	at org.eclipse.tycho.surefire.osgibooter.OsgiSurefireBooter.run(OsgiSurefireBooter.java:113)
13:08:51 [2020-09-26T17:08:51.411Z] 	at org.eclipse.tycho.surefire.osgibooter.AbstractUITestApplication.runTests(AbstractUITestApplication.java:44)
13:08:51 [2020-09-26T17:08:51.411Z] 	at org.eclipse.e4.ui.internal.workbench.swt.E4Testable$1.run(E4Testable.java:73)
13:08:51 [2020-09-26T17:08:51.411Z] 	at java.lang.Thread.run(Thread.java:748)
13:08:52 [2020-09-26T17:08:52.782Z] 
13:08:52 [2020-09-26T17:08:52.782Z] !ENTRY org.eclipse.egit.ui 4 0 2020-09-26 17:08:52.654
13:08:52 [2020-09-26T17:08:52.782Z] !MESSAGE CrashingCommitMessageProvider fails on purpose.
13:08:52 [2020-09-26T17:08:52.782Z] !STACK 0
13:08:52 [2020-09-26T17:08:52.782Z] java.lang.IllegalStateException: CrashingCommitMessageProvider fails on purpose.
13:08:52 [2020-09-26T17:08:52.782Z] 	at org.eclipse.egit.ui.internal.dialogs.CommitMessageBuilderTest$CrashingCommitMessageProvider.getMessage(CommitMessageBuilderTest.java:474)
13:08:52 [2020-09-26T17:08:52.782Z] 	at org.eclipse.egit.ui.internal.dialogs.CommitMessageBuilder.build(CommitMessageBuilder.java:90)
13:08:52 [2020-09-26T17:08:52.782Z] 	at org.eclipse.egit.ui.internal.dialogs.CommitMessageBuilderTest.commitMessageProvider_multipleProvidersWithCrashAndNull(CommitMessageBuilderTest.java:165)
13:08:52 [2020-09-26T17:08:52.782Z] 	at sun.reflect.NativeMethodAccessorImpl.invoke0(Native Method)
13:08:52 [2020-09-26T17:08:52.782Z] 	at sun.reflect.NativeMethodAccessorImpl.invoke(NativeMethodAccessorImpl.java:62)
13:08:52 [2020-09-26T17:08:52.782Z] 	at sun.reflect.DelegatingMethodAccessorImpl.invoke(DelegatingMethodAccessorImpl.java:43)
13:08:52 [2020-09-26T17:08:52.782Z] 	at java.lang.reflect.Method.invoke(Method.java:498)
13:08:52 [2020-09-26T17:08:52.782Z] 	at org.junit.runners.model.FrameworkMethod$1.runReflectiveCall(FrameworkMethod.java:59)
13:08:52 [2020-09-26T17:08:52.782Z] 	at org.junit.internal.runners.model.ReflectiveCallable.run(ReflectiveCallable.java:12)
13:08:52 [2020-09-26T17:08:52.782Z] 	at org.junit.runners.model.FrameworkMethod.invokeExplosively(FrameworkMethod.java:56)
13:08:52 [2020-09-26T17:08:52.782Z] 	at org.junit.internal.runners.statements.InvokeMethod.evaluate(InvokeMethod.java:17)
13:08:52 [2020-09-26T17:08:52.782Z] 	at org.junit.internal.runners.statements.RunBefores.evaluate(RunBefores.java:26)
13:08:52 [2020-09-26T17:08:52.782Z] 	at org.junit.internal.runners.statements.RunAfters.evaluate(RunAfters.java:27)
13:08:52 [2020-09-26T17:08:52.783Z] 	at org.junit.runners.ParentRunner$3.evaluate(ParentRunner.java:306)
13:08:52 [2020-09-26T17:08:52.783Z] 	at org.junit.runners.BlockJUnit4ClassRunner$1.evaluate(BlockJUnit4ClassRunner.java:100)
13:08:52 [2020-09-26T17:08:52.783Z] 	at org.junit.runners.ParentRunner.runLeaf(ParentRunner.java:366)
13:08:52 [2020-09-26T17:08:52.783Z] 	at org.junit.runners.BlockJUnit4ClassRunner.runChild(BlockJUnit4ClassRunner.java:103)
13:08:52 [2020-09-26T17:08:52.783Z] 	at org.junit.runners.BlockJUnit4ClassRunner.runChild(BlockJUnit4ClassRunner.java:63)
13:08:52 [2020-09-26T17:08:52.783Z] 	at org.junit.runners.ParentRunner$4.run(ParentRunner.java:331)
13:08:52 [2020-09-26T17:08:52.783Z] 	at org.junit.runners.ParentRunner$1.schedule(ParentRunner.java:79)
13:08:52 [2020-09-26T17:08:52.783Z] 	at org.junit.runners.ParentRunner.runChildren(ParentRunner.java:329)
13:08:52 [2020-09-26T17:08:52.783Z] 	at org.junit.runners.ParentRunner.access$100(ParentRunner.java:66)
13:08:52 [2020-09-26T17:08:52.783Z] 	at org.junit.runners.ParentRunner$2.evaluate(ParentRunner.java:293)
13:08:52 [2020-09-26T17:08:52.783Z] 	at org.junit.internal.runners.statements.RunBefores.evaluate(RunBefores.java:26)
13:08:52 [2020-09-26T17:08:52.783Z] 	at org.junit.runners.ParentRunner$3.evaluate(ParentRunner.java:306)
13:08:52 [2020-09-26T17:08:52.783Z] 	at org.junit.runners.ParentRunner.run(ParentRunner.java:413)
13:08:52 [2020-09-26T17:08:52.783Z] 	at org.apache.maven.surefire.junit4.JUnit4Provider.execute(JUnit4Provider.java:365)
13:08:52 [2020-09-26T17:08:52.783Z] 	at org.apache.maven.surefire.junit4.JUnit4Provider.executeWithRerun(JUnit4Provider.java:273)
13:08:52 [2020-09-26T17:08:52.783Z] 	at org.apache.maven.surefire.junit4.JUnit4Provider.executeTestSet(JUnit4Provider.java:238)
13:08:52 [2020-09-26T17:08:52.783Z] 	at org.apache.maven.surefire.junit4.JUnit4Provider.invoke(JUnit4Provider.java:159)
13:08:52 [2020-09-26T17:08:52.783Z] 	at sun.reflect.NativeMethodAccessorImpl.invoke0(Native Method)
13:08:52 [2020-09-26T17:08:52.783Z] 	at sun.reflect.NativeMethodAccessorImpl.invoke(NativeMethodAccessorImpl.java:62)
13:08:52 [2020-09-26T17:08:52.783Z] 	at sun.reflect.DelegatingMethodAccessorImpl.invoke(DelegatingMethodAccessorImpl.java:43)
13:08:52 [2020-09-26T17:08:52.783Z] 	at java.lang.reflect.Method.invoke(Method.java:498)
13:08:52 [2020-09-26T17:08:52.783Z] 	at org.apache.maven.surefire.util.ReflectionUtils.invokeMethodWithArray2(ReflectionUtils.java:206)
13:08:52 [2020-09-26T17:08:52.783Z] 	at org.apache.maven.surefire.booter.ProviderFactory$ProviderProxy.invoke(ProviderFactory.java:161)
13:08:52 [2020-09-26T17:08:52.783Z] 	at org.apache.maven.surefire.booter.ProviderFactory.invokeProvider(ProviderFactory.java:84)
13:08:52 [2020-09-26T17:08:52.783Z] 	at org.eclipse.tycho.surefire.osgibooter.OsgiSurefireBooter.run(OsgiSurefireBooter.java:113)
13:08:52 [2020-09-26T17:08:52.783Z] 	at org.eclipse.tycho.surefire.osgibooter.AbstractUITestApplication.runTests(AbstractUITestApplication.java:44)
13:08:52 [2020-09-26T17:08:52.783Z] 	at org.eclipse.e4.ui.internal.workbench.swt.E4Testable$1.run(E4Testable.java:73)
13:08:52 [2020-09-26T17:08:52.783Z] 	at java.lang.Thread.run(Thread.java:748)
13:08:52 [2020-09-26T17:08:52.783Z] 
13:08:52 [2020-09-26T17:08:52.783Z] !ENTRY org.eclipse.egit.ui 4 0 2020-09-26 17:08:52.654
13:08:52 [2020-09-26T17:08:52.783Z] !MESSAGE CrashingCommitMessageProvider fails on purpose.
13:08:52 [2020-09-26T17:08:52.783Z] !STACK 0
13:08:52 [2020-09-26T17:08:52.783Z] java.lang.IllegalStateException: CrashingCommitMessageProvider fails on purpose.
13:08:52 [2020-09-26T17:08:52.783Z] 	at org.eclipse.egit.ui.internal.dialogs.CommitMessageBuilderTest$CrashingCommitMessageProvider.getMessage(CommitMessageBuilderTest.java:474)
13:08:52 [2020-09-26T17:08:52.783Z] 	at org.eclipse.egit.ui.internal.dialogs.CommitMessageBuilder.build(CommitMessageBuilder.java:90)
13:08:52 [2020-09-26T17:08:52.783Z] 	at org.eclipse.egit.ui.internal.dialogs.CommitMessageBuilderTest.commitMessageProvider_multipleProvidersWithCrashAndNull(CommitMessageBuilderTest.java:165)
13:08:52 [2020-09-26T17:08:52.783Z] 	at sun.reflect.NativeMethodAccessorImpl.invoke0(Native Method)
13:08:52 [2020-09-26T17:08:52.783Z] 	at sun.reflect.NativeMethodAccessorImpl.invoke(NativeMethodAccessorImpl.java:62)
13:08:52 [2020-09-26T17:08:52.783Z] 	at sun.reflect.DelegatingMethodAccessorImpl.invoke(DelegatingMethodAccessorImpl.java:43)
13:08:52 [2020-09-26T17:08:52.783Z] 	at java.lang.reflect.Method.invoke(Method.java:498)
13:08:52 [2020-09-26T17:08:52.783Z] 	at org.junit.runners.model.FrameworkMethod$1.runReflectiveCall(FrameworkMethod.java:59)
13:08:52 [2020-09-26T17:08:52.783Z] 	at org.junit.internal.runners.model.ReflectiveCallable.run(ReflectiveCallable.java:12)
13:08:52 [2020-09-26T17:08:52.783Z] 	at org.junit.runners.model.FrameworkMethod.invokeExplosively(FrameworkMethod.java:56)
13:08:52 [2020-09-26T17:08:52.783Z] 	at org.junit.internal.runners.statements.InvokeMethod.evaluate(InvokeMethod.java:17)
13:08:52 [2020-09-26T17:08:52.783Z] 	at org.junit.internal.runners.statements.RunBefores.evaluate(RunBefores.java:26)
13:08:52 [2020-09-26T17:08:52.783Z] 	at org.junit.internal.runners.statements.RunAfters.evaluate(RunAfters.java:27)
13:08:52 [2020-09-26T17:08:52.783Z] 	at org.junit.runners.ParentRunner$3.evaluate(ParentRunner.java:306)
13:08:52 [2020-09-26T17:08:52.783Z] 	at org.junit.runners.BlockJUnit4ClassRunner$1.evaluate(BlockJUnit4ClassRunner.java:100)
13:08:52 [2020-09-26T17:08:52.783Z] 	at org.junit.runners.ParentRunner.runLeaf(ParentRunner.java:366)
13:08:52 [2020-09-26T17:08:52.783Z] 	at org.junit.runners.BlockJUnit4ClassRunner.runChild(BlockJUnit4ClassRunner.java:103)
13:08:52 [2020-09-26T17:08:52.783Z] 	at org.junit.runners.BlockJUnit4ClassRunner.runChild(BlockJUnit4ClassRunner.java:63)
13:08:52 [2020-09-26T17:08:52.783Z] 	at org.junit.runners.ParentRunner$4.run(ParentRunner.java:331)
13:08:52 [2020-09-26T17:08:52.783Z] 	at org.junit.runners.ParentRunner$1.schedule(ParentRunner.java:79)
13:08:52 [2020-09-26T17:08:52.783Z] 	at org.junit.runners.ParentRunner.runChildren(ParentRunner.java:329)
13:08:52 [2020-09-26T17:08:52.783Z] 	at org.junit.runners.ParentRunner.access$100(ParentRunner.java:66)
13:08:52 [2020-09-26T17:08:52.783Z] 	at org.junit.runners.ParentRunner$2.evaluate(ParentRunner.java:293)
13:08:52 [2020-09-26T17:08:52.783Z] 	at org.junit.internal.runners.statements.RunBefores.evaluate(RunBefores.java:26)
13:08:52 [2020-09-26T17:08:52.783Z] 	at org.junit.runners.ParentRunner$3.evaluate(ParentRunner.java:306)
13:08:52 [2020-09-26T17:08:52.783Z] 	at org.junit.runners.ParentRunner.run(ParentRunner.java:413)
13:08:52 [2020-09-26T17:08:52.783Z] 	at org.apache.maven.surefire.junit4.JUnit4Provider.execute(JUnit4Provider.java:365)
13:08:52 [2020-09-26T17:08:52.783Z] 	at org.apache.maven.surefire.junit4.JUnit4Provider.executeWithRerun(JUnit4Provider.java:273)
13:08:52 [2020-09-26T17:08:52.783Z] 	at org.apache.maven.surefire.junit4.JUnit4Provider.executeTestSet(JUnit4Provider.java:238)
13:08:52 [2020-09-26T17:08:52.783Z] 	at org.apache.maven.surefire.junit4.JUnit4Provider.invoke(JUnit4Provider.java:159)
13:08:52 [2020-09-26T17:08:52.783Z] 	at sun.reflect.NativeMethodAccessorImpl.invoke0(Native Method)
13:08:52 [2020-09-26T17:08:52.783Z] 	at sun.reflect.NativeMethodAccessorImpl.invoke(NativeMethodAccessorImpl.java:62)
13:08:52 [2020-09-26T17:08:52.783Z] 	at sun.reflect.DelegatingMethodAccessorImpl.invoke(DelegatingMethodAccessorImpl.java:43)
13:08:52 [2020-09-26T17:08:52.783Z] 	at java.lang.reflect.Method.invoke(Method.java:498)
13:08:52 [2020-09-26T17:08:52.783Z] 	at org.apache.maven.surefire.util.ReflectionUtils.invokeMethodWithArray2(ReflectionUtils.java:206)
13:08:52 [2020-09-26T17:08:52.783Z] 	at org.apache.maven.surefire.booter.ProviderFactory$ProviderProxy.invoke(ProviderFactory.java:161)
13:08:52 [2020-09-26T17:08:52.783Z] 	at org.apache.maven.surefire.booter.ProviderFactory.invokeProvider(ProviderFactory.java:84)
13:08:52 [2020-09-26T17:08:52.783Z] 	at org.eclipse.tycho.surefire.osgibooter.OsgiSurefireBooter.run(OsgiSurefireBooter.java:113)
13:08:52 [2020-09-26T17:08:52.783Z] 	at org.eclipse.tycho.surefire.osgibooter.AbstractUITestApplication.runTests(AbstractUITestApplication.java:44)
13:08:52 [2020-09-26T17:08:52.783Z] 	at org.eclipse.e4.ui.internal.workbench.swt.E4Testable$1.run(E4Testable.java:73)
13:08:52 [2020-09-26T17:08:52.783Z] 	at java.lang.Thread.run(Thread.java:748)
13:08:52 [2020-09-26T17:08:52.783Z] 
13:08:52 [2020-09-26T17:08:52.783Z] !ENTRY org.eclipse.egit.ui 2 0 2020-09-26 17:08:52.743
13:08:52 [2020-09-26T17:08:52.783Z] !MESSAGE The ICommitMessageProvider2 implementation org.eclipse.egit.ui.internal.dialogs.CommitMessageBuilderTest$3 provided the caret position -42, which exceeds the length of the commit message or is negative. The caret position is ignored.
13:08:54 [2020-09-26T17:08:54.684Z] 
13:08:54 [2020-09-26T17:08:54.684Z] !ENTRY org.eclipse.egit.ui 2 0 2020-09-26 17:08:54.172
13:08:54 [2020-09-26T17:08:54.684Z] !MESSAGE Found multiple implementations of ICommitMessageProvider2. Ignoring caret positioning for org.eclipse.egit.ui.internal.dialogs.CommitMessageBuilderTest$3.
13:08:54 [2020-09-26T17:08:54.684Z] 
13:08:54 [2020-09-26T17:08:54.684Z] !ENTRY org.eclipse.egit.ui 4 0 2020-09-26 17:08:54.521
13:08:54 [2020-09-26T17:08:54.684Z] !MESSAGE CrashingCommitMessageProvider fails on purpose.
13:08:54 [2020-09-26T17:08:54.684Z] !STACK 0
13:08:54 [2020-09-26T17:08:54.684Z] java.lang.IllegalStateException: CrashingCommitMessageProvider fails on purpose.
13:08:54 [2020-09-26T17:08:54.684Z] 	at org.eclipse.egit.ui.internal.dialogs.CommitMessageBuilderTest$CrashingCommitMessageProvider.getMessage(CommitMessageBuilderTest.java:474)
13:08:54 [2020-09-26T17:08:54.684Z] 	at org.eclipse.egit.ui.internal.dialogs.CommitMessageBuilder.build(CommitMessageBuilder.java:90)
13:08:54 [2020-09-26T17:08:54.684Z] 	at org.eclipse.egit.ui.internal.dialogs.CommitMessageBuilderTest.commitMessageProvider_twoProvidersSecondOneCrashing(CommitMessageBuilderTest.java:130)
13:08:54 [2020-09-26T17:08:54.684Z] 	at sun.reflect.NativeMethodAccessorImpl.invoke0(Native Method)
13:08:54 [2020-09-26T17:08:54.684Z] 	at sun.reflect.NativeMethodAccessorImpl.invoke(NativeMethodAccessorImpl.java:62)
13:08:54 [2020-09-26T17:08:54.684Z] 	at sun.reflect.DelegatingMethodAccessorImpl.invoke(DelegatingMethodAccessorImpl.java:43)
13:08:54 [2020-09-26T17:08:54.684Z] 	at java.lang.reflect.Method.invoke(Method.java:498)
13:08:54 [2020-09-26T17:08:54.684Z] 	at org.junit.runners.model.FrameworkMethod$1.runReflectiveCall(FrameworkMethod.java:59)
13:08:54 [2020-09-26T17:08:54.684Z] 	at org.junit.internal.runners.model.ReflectiveCallable.run(ReflectiveCallable.java:12)
13:08:54 [2020-09-26T17:08:54.684Z] 	at org.junit.runners.model.FrameworkMethod.invokeExplosively(FrameworkMethod.java:56)
13:08:54 [2020-09-26T17:08:54.684Z] 	at org.junit.internal.runners.statements.InvokeMethod.evaluate(InvokeMethod.java:17)
13:08:54 [2020-09-26T17:08:54.684Z] 	at org.junit.internal.runners.statements.RunBefores.evaluate(RunBefores.java:26)
13:08:54 [2020-09-26T17:08:54.684Z] 	at org.junit.internal.runners.statements.RunAfters.evaluate(RunAfters.java:27)
13:08:54 [2020-09-26T17:08:54.684Z] 	at org.junit.runners.ParentRunner$3.evaluate(ParentRunner.java:306)
13:08:54 [2020-09-26T17:08:54.684Z] 	at org.junit.runners.BlockJUnit4ClassRunner$1.evaluate(BlockJUnit4ClassRunner.java:100)
13:08:54 [2020-09-26T17:08:54.684Z] 	at org.junit.runners.ParentRunner.runLeaf(ParentRunner.java:366)
13:08:54 [2020-09-26T17:08:54.684Z] 	at org.junit.runners.BlockJUnit4ClassRunner.runChild(BlockJUnit4ClassRunner.java:103)
13:08:54 [2020-09-26T17:08:54.684Z] 	at org.junit.runners.BlockJUnit4ClassRunner.runChild(BlockJUnit4ClassRunner.java:63)
13:08:54 [2020-09-26T17:08:54.684Z] 	at org.junit.runners.ParentRunner$4.run(ParentRunner.java:331)
13:08:54 [2020-09-26T17:08:54.684Z] 	at org.junit.runners.ParentRunner$1.schedule(ParentRunner.java:79)
13:08:54 [2020-09-26T17:08:54.684Z] 	at org.junit.runners.ParentRunner.runChildren(ParentRunner.java:329)
13:08:54 [2020-09-26T17:08:54.684Z] 	at org.junit.runners.ParentRunner.access$100(ParentRunner.java:66)
13:08:54 [2020-09-26T17:08:54.684Z] 	at org.junit.runners.ParentRunner$2.evaluate(ParentRunner.java:293)
13:08:54 [2020-09-26T17:08:54.684Z] 	at org.junit.internal.runners.statements.RunBefores.evaluate(RunBefores.java:26)
13:08:54 [2020-09-26T17:08:54.684Z] 	at org.junit.runners.ParentRunner$3.evaluate(ParentRunner.java:306)
13:08:54 [2020-09-26T17:08:54.684Z] 	at org.junit.runners.ParentRunner.run(ParentRunner.java:413)
13:08:54 [2020-09-26T17:08:54.684Z] 	at org.apache.maven.surefire.junit4.JUnit4Provider.execute(JUnit4Provider.java:365)
13:08:54 [2020-09-26T17:08:54.684Z] 	at org.apache.maven.surefire.junit4.JUnit4Provider.executeWithRerun(JUnit4Provider.java:273)
13:08:54 [2020-09-26T17:08:54.684Z] 	at org.apache.maven.surefire.junit4.JUnit4Provider.executeTestSet(JUnit4Provider.java:238)
13:08:54 [2020-09-26T17:08:54.684Z] 	at org.apache.maven.surefire.junit4.JUnit4Provider.invoke(JUnit4Provider.java:159)
13:08:54 [2020-09-26T17:08:54.684Z] 	at sun.reflect.NativeMethodAccessorImpl.invoke0(Native Method)
13:08:54 [2020-09-26T17:08:54.684Z] 	at sun.reflect.NativeMethodAccessorImpl.invoke(NativeMethodAccessorImpl.java:62)
13:08:54 [2020-09-26T17:08:54.684Z] 	at sun.reflect.DelegatingMethodAccessorImpl.invoke(DelegatingMethodAccessorImpl.java:43)
13:08:54 [2020-09-26T17:08:54.684Z] 	at java.lang.reflect.Method.invoke(Method.java:498)
13:08:54 [2020-09-26T17:08:54.684Z] 	at org.apache.maven.surefire.util.ReflectionUtils.invokeMethodWithArray2(ReflectionUtils.java:206)
13:08:54 [2020-09-26T17:08:54.684Z] 	at org.apache.maven.surefire.booter.ProviderFactory$ProviderProxy.invoke(ProviderFactory.java:161)
13:08:54 [2020-09-26T17:08:54.684Z] 	at org.apache.maven.surefire.booter.ProviderFactory.invokeProvider(ProviderFactory.java:84)
13:08:54 [2020-09-26T17:08:54.684Z] 	at org.eclipse.tycho.surefire.osgibooter.OsgiSurefireBooter.run(OsgiSurefireBooter.java:113)
13:08:54 [2020-09-26T17:08:54.685Z] 	at org.eclipse.tycho.surefire.osgibooter.AbstractUITestApplication.runTests(AbstractUITestApplication.java:44)
13:08:54 [2020-09-26T17:08:54.685Z] 	at org.eclipse.e4.ui.internal.workbench.swt.E4Testable$1.run(E4Testable.java:73)
13:08:54 [2020-09-26T17:08:54.685Z] 	at java.lang.Thread.run(Thread.java:748)
13:08:56 [2020-09-26T17:08:56.056Z] 
13:08:56 [2020-09-26T17:08:56.056Z] !ENTRY org.eclipse.egit.ui 4 0 2020-09-26 17:08:55.617
13:08:56 [2020-09-26T17:08:56.056Z] !MESSAGE CrashingCommitMessageProvider fails on purpose.
13:08:56 [2020-09-26T17:08:56.056Z] !STACK 0
13:08:56 [2020-09-26T17:08:56.057Z] java.lang.IllegalStateException: CrashingCommitMessageProvider fails on purpose.
13:08:56 [2020-09-26T17:08:56.057Z] 	at org.eclipse.egit.ui.internal.dialogs.CommitMessageBuilderTest$CrashingCommitMessageProvider.getMessage(CommitMessageBuilderTest.java:474)
13:08:56 [2020-09-26T17:08:56.057Z] 	at org.eclipse.egit.ui.internal.dialogs.CommitMessageBuilder.build(CommitMessageBuilder.java:90)
13:08:56 [2020-09-26T17:08:56.057Z] 	at org.eclipse.egit.ui.internal.dialogs.CommitMessageBuilderTest.commitMessageProvider_multipleProvidersWithCrashingAndNullAndOneCaretPositioning(CommitMessageBuilderTest.java:414)
13:08:56 [2020-09-26T17:08:56.057Z] 	at sun.reflect.NativeMethodAccessorImpl.invoke0(Native Method)
13:08:56 [2020-09-26T17:08:56.057Z] 	at sun.reflect.NativeMethodAccessorImpl.invoke(NativeMethodAccessorImpl.java:62)
13:08:56 [2020-09-26T17:08:56.057Z] 	at sun.reflect.DelegatingMethodAccessorImpl.invoke(DelegatingMethodAccessorImpl.java:43)
13:08:56 [2020-09-26T17:08:56.057Z] 	at java.lang.reflect.Method.invoke(Method.java:498)
13:08:56 [2020-09-26T17:08:56.057Z] 	at org.junit.runners.model.FrameworkMethod$1.runReflectiveCall(FrameworkMethod.java:59)
13:08:56 [2020-09-26T17:08:56.057Z] 	at org.junit.internal.runners.model.ReflectiveCallable.run(ReflectiveCallable.java:12)
13:08:56 [2020-09-26T17:08:56.057Z] 	at org.junit.runners.model.FrameworkMethod.invokeExplosively(FrameworkMethod.java:56)
13:08:56 [2020-09-26T17:08:56.057Z] 	at org.junit.internal.runners.statements.InvokeMethod.evaluate(InvokeMethod.java:17)
13:08:56 [2020-09-26T17:08:56.057Z] 	at org.junit.internal.runners.statements.RunBefores.evaluate(RunBefores.java:26)
13:08:56 [2020-09-26T17:08:56.057Z] 	at org.junit.internal.runners.statements.RunAfters.evaluate(RunAfters.java:27)
13:08:56 [2020-09-26T17:08:56.057Z] 	at org.junit.runners.ParentRunner$3.evaluate(ParentRunner.java:306)
13:08:56 [2020-09-26T17:08:56.057Z] 	at org.junit.runners.BlockJUnit4ClassRunner$1.evaluate(BlockJUnit4ClassRunner.java:100)
13:08:56 [2020-09-26T17:08:56.057Z] 	at org.junit.runners.ParentRunner.runLeaf(ParentRunner.java:366)
13:08:56 [2020-09-26T17:08:56.057Z] 	at org.junit.runners.BlockJUnit4ClassRunner.runChild(BlockJUnit4ClassRunner.java:103)
13:08:56 [2020-09-26T17:08:56.057Z] 	at org.junit.runners.BlockJUnit4ClassRunner.runChild(BlockJUnit4ClassRunner.java:63)
13:08:56 [2020-09-26T17:08:56.057Z] 	at org.junit.runners.ParentRunner$4.run(ParentRunner.java:331)
13:08:56 [2020-09-26T17:08:56.057Z] 	at org.junit.runners.ParentRunner$1.schedule(ParentRunner.java:79)
13:08:56 [2020-09-26T17:08:56.057Z] 	at org.junit.runners.ParentRunner.runChildren(ParentRunner.java:329)
13:08:56 [2020-09-26T17:08:56.057Z] 	at org.junit.runners.ParentRunner.access$100(ParentRunner.java:66)
13:08:56 [2020-09-26T17:08:56.057Z] 	at org.junit.runners.ParentRunner$2.evaluate(ParentRunner.java:293)
13:08:56 [2020-09-26T17:08:56.057Z] 	at org.junit.internal.runners.statements.RunBefores.evaluate(RunBefores.java:26)
13:08:56 [2020-09-26T17:08:56.057Z] 	at org.junit.runners.ParentRunner$3.evaluate(ParentRunner.java:306)
13:08:56 [2020-09-26T17:08:56.057Z] 	at org.junit.runners.ParentRunner.run(ParentRunner.java:413)
13:08:56 [2020-09-26T17:08:56.057Z] 	at org.apache.maven.surefire.junit4.JUnit4Provider.execute(JUnit4Provider.java:365)
13:08:56 [2020-09-26T17:08:56.057Z] 	at org.apache.maven.surefire.junit4.JUnit4Provider.executeWithRerun(JUnit4Provider.java:273)
13:08:56 [2020-09-26T17:08:56.057Z] 	at org.apache.maven.surefire.junit4.JUnit4Provider.executeTestSet(JUnit4Provider.java:238)
13:08:56 [2020-09-26T17:08:56.057Z] 	at org.apache.maven.surefire.junit4.JUnit4Provider.invoke(JUnit4Provider.java:159)
13:08:56 [2020-09-26T17:08:56.057Z] 	at sun.reflect.NativeMethodAccessorImpl.invoke0(Native Method)
13:08:56 [2020-09-26T17:08:56.057Z] 	at sun.reflect.NativeMethodAccessorImpl.invoke(NativeMethodAccessorImpl.java:62)
13:08:56 [2020-09-26T17:08:56.057Z] 	at sun.reflect.DelegatingMethodAccessorImpl.invoke(DelegatingMethodAccessorImpl.java:43)
13:08:56 [2020-09-26T17:08:56.057Z] 	at java.lang.reflect.Method.invoke(Method.java:498)
13:08:56 [2020-09-26T17:08:56.057Z] 	at org.apache.maven.surefire.util.ReflectionUtils.invokeMethodWithArray2(ReflectionUtils.java:206)
13:08:56 [2020-09-26T17:08:56.057Z] 	at org.apache.maven.surefire.booter.ProviderFactory$ProviderProxy.invoke(ProviderFactory.java:161)
13:08:56 [2020-09-26T17:08:56.057Z] 	at org.apache.maven.surefire.booter.ProviderFactory.invokeProvider(ProviderFactory.java:84)
13:08:56 [2020-09-26T17:08:56.057Z] 	at org.eclipse.tycho.surefire.osgibooter.OsgiSurefireBooter.run(OsgiSurefireBooter.java:113)
13:08:56 [2020-09-26T17:08:56.057Z] 	at org.eclipse.tycho.surefire.osgibooter.AbstractUITestApplication.runTests(AbstractUITestApplication.java:44)
13:08:56 [2020-09-26T17:08:56.057Z] 	at org.eclipse.e4.ui.internal.workbench.swt.E4Testable$1.run(E4Testable.java:73)
13:08:56 [2020-09-26T17:08:56.057Z] 	at java.lang.Thread.run(Thread.java:748)
13:08:56 [2020-09-26T17:08:56.057Z] 
13:08:56 [2020-09-26T17:08:56.057Z] !ENTRY org.eclipse.egit.ui 4 0 2020-09-26 17:08:55.617
13:08:56 [2020-09-26T17:08:56.057Z] !MESSAGE CrashingCommitMessageProvider fails on purpose.
13:08:56 [2020-09-26T17:08:56.057Z] !STACK 0
13:08:56 [2020-09-26T17:08:56.057Z] java.lang.IllegalStateException: CrashingCommitMessageProvider fails on purpose.
13:08:56 [2020-09-26T17:08:56.057Z] 	at org.eclipse.egit.ui.internal.dialogs.CommitMessageBuilderTest$CrashingCommitMessageProvider.getMessage(CommitMessageBuilderTest.java:474)
13:08:56 [2020-09-26T17:08:56.057Z] 	at org.eclipse.egit.ui.internal.dialogs.CommitMessageBuilder.build(CommitMessageBuilder.java:90)
13:08:56 [2020-09-26T17:08:56.057Z] 	at org.eclipse.egit.ui.internal.dialogs.CommitMessageBuilderTest.commitMessageProvider_multipleProvidersWithCrashingAndNullAndOneCaretPositioning(CommitMessageBuilderTest.java:414)
13:08:56 [2020-09-26T17:08:56.057Z] 	at sun.reflect.NativeMethodAccessorImpl.invoke0(Native Method)
13:08:56 [2020-09-26T17:08:56.057Z] 	at sun.reflect.NativeMethodAccessorImpl.invoke(NativeMethodAccessorImpl.java:62)
13:08:56 [2020-09-26T17:08:56.057Z] 	at sun.reflect.DelegatingMethodAccessorImpl.invoke(DelegatingMethodAccessorImpl.java:43)
13:08:56 [2020-09-26T17:08:56.057Z] 	at java.lang.reflect.Method.invoke(Method.java:498)
13:08:56 [2020-09-26T17:08:56.057Z] 	at org.junit.runners.model.FrameworkMethod$1.runReflectiveCall(FrameworkMethod.java:59)
13:08:56 [2020-09-26T17:08:56.057Z] 	at org.junit.internal.runners.model.ReflectiveCallable.run(ReflectiveCallable.java:12)
13:08:56 [2020-09-26T17:08:56.057Z] 	at org.junit.runners.model.FrameworkMethod.invokeExplosively(FrameworkMethod.java:56)
13:08:56 [2020-09-26T17:08:56.057Z] 	at org.junit.internal.runners.statements.InvokeMethod.evaluate(InvokeMethod.java:17)
13:08:56 [2020-09-26T17:08:56.057Z] 	at org.junit.internal.runners.statements.RunBefores.evaluate(RunBefores.java:26)
13:08:56 [2020-09-26T17:08:56.057Z] 	at org.junit.internal.runners.statements.RunAfters.evaluate(RunAfters.java:27)
13:08:56 [2020-09-26T17:08:56.057Z] 	at org.junit.runners.ParentRunner$3.evaluate(ParentRunner.java:306)
13:08:56 [2020-09-26T17:08:56.057Z] 	at org.junit.runners.BlockJUnit4ClassRunner$1.evaluate(BlockJUnit4ClassRunner.java:100)
13:08:56 [2020-09-26T17:08:56.057Z] 	at org.junit.runners.ParentRunner.runLeaf(ParentRunner.java:366)
13:08:56 [2020-09-26T17:08:56.057Z] 	at org.junit.runners.BlockJUnit4ClassRunner.runChild(BlockJUnit4ClassRunner.java:103)
13:08:56 [2020-09-26T17:08:56.057Z] 	at org.junit.runners.BlockJUnit4ClassRunner.runChild(BlockJUnit4ClassRunner.java:63)
13:08:56 [2020-09-26T17:08:56.057Z] 	at org.junit.runners.ParentRunner$4.run(ParentRunner.java:331)
13:08:56 [2020-09-26T17:08:56.057Z] 	at org.junit.runners.ParentRunner$1.schedule(ParentRunner.java:79)
13:08:56 [2020-09-26T17:08:56.057Z] 	at org.junit.runners.ParentRunner.runChildren(ParentRunner.java:329)
13:08:56 [2020-09-26T17:08:56.057Z] 	at org.junit.runners.ParentRunner.access$100(ParentRunner.java:66)
13:08:56 [2020-09-26T17:08:56.057Z] 	at org.junit.runners.ParentRunner$2.evaluate(ParentRunner.java:293)
13:08:56 [2020-09-26T17:08:56.057Z] 	at org.junit.internal.runners.statements.RunBefores.evaluate(RunBefores.java:26)
13:08:56 [2020-09-26T17:08:56.057Z] 	at org.junit.runners.ParentRunner$3.evaluate(ParentRunner.java:306)
13:08:56 [2020-09-26T17:08:56.057Z] 	at org.junit.runners.ParentRunner.run(ParentRunner.java:413)
13:08:56 [2020-09-26T17:08:56.057Z] 	at org.apache.maven.surefire.junit4.JUnit4Provider.execute(JUnit4Provider.java:365)
13:08:56 [2020-09-26T17:08:56.057Z] 	at org.apache.maven.surefire.junit4.JUnit4Provider.executeWithRerun(JUnit4Provider.java:273)
13:08:56 [2020-09-26T17:08:56.057Z] 	at org.apache.maven.surefire.junit4.JUnit4Provider.executeTestSet(JUnit4Provider.java:238)
13:08:56 [2020-09-26T17:08:56.057Z] 	at org.apache.maven.surefire.junit4.JUnit4Provider.invoke(JUnit4Provider.java:159)
13:08:56 [2020-09-26T17:08:56.057Z] 	at sun.reflect.NativeMethodAccessorImpl.invoke0(Native Method)
13:08:56 [2020-09-26T17:08:56.057Z] 	at sun.reflect.NativeMethodAccessorImpl.invoke(NativeMethodAccessorImpl.java:62)
13:08:56 [2020-09-26T17:08:56.057Z] 	at sun.reflect.DelegatingMethodAccessorImpl.invoke(DelegatingMethodAccessorImpl.java:43)
13:08:56 [2020-09-26T17:08:56.057Z] 	at java.lang.reflect.Method.invoke(Method.java:498)
13:08:56 [2020-09-26T17:08:56.057Z] 	at org.apache.maven.surefire.util.ReflectionUtils.invokeMethodWithArray2(ReflectionUtils.java:206)
13:08:56 [2020-09-26T17:08:56.057Z] 	at org.apache.maven.surefire.booter.ProviderFactory$ProviderProxy.invoke(ProviderFactory.java:161)
13:08:56 [2020-09-26T17:08:56.057Z] 	at org.apache.maven.surefire.booter.ProviderFactory.invokeProvider(ProviderFactory.java:84)
13:08:56 [2020-09-26T17:08:56.057Z] 	at org.eclipse.tycho.surefire.osgibooter.OsgiSurefireBooter.run(OsgiSurefireBooter.java:113)
13:08:56 [2020-09-26T17:08:56.057Z] 	at org.eclipse.tycho.surefire.osgibooter.AbstractUITestApplication.runTests(AbstractUITestApplication.java:44)
13:08:56 [2020-09-26T17:08:56.057Z] 	at org.eclipse.e4.ui.internal.workbench.swt.E4Testable$1.run(E4Testable.java:73)
13:08:56 [2020-09-26T17:08:56.057Z] 	at java.lang.Thread.run(Thread.java:748)
13:08:56 [2020-09-26T17:08:56.057Z] 
13:08:56 [2020-09-26T17:08:56.057Z] !ENTRY org.eclipse.egit.ui 2 0 2020-09-26 17:08:55.722
13:08:56 [2020-09-26T17:08:56.057Z] !MESSAGE Found multiple implementations of ICommitMessageProvider2. Ignoring caret positioning for org.eclipse.egit.ui.internal.dialogs.CommitMessageBuilderTest$3.
13:08:56 [2020-09-26T17:08:56.057Z] 
13:08:56 [2020-09-26T17:08:56.057Z] !ENTRY org.eclipse.egit.ui 2 0 2020-09-26 17:08:55.812
13:08:56 [2020-09-26T17:08:56.057Z] !MESSAGE The ICommitMessageProvider2 implementation org.eclipse.egit.ui.internal.dialogs.CommitMessageBuilderTest$3 provided the caret position 14, which exceeds the length of the commit message or is negative. The caret position is ignored.
13:08:56 [2020-09-26T17:08:56.057Z] Tests run: 20, Failures: 0, Errors: 0, Skipped: 0, Time elapsed: 6.169 s - in org.eclipse.egit.ui.internal.dialogs.CommitMessageBuilderTest
13:08:56 [2020-09-26T17:08:56.057Z] commitMessageProvider_oneCrashingProvider(org.eclipse.egit.ui.internal.dialogs.CommitMessageBuilderTest)  Time elapsed: 0.118 s
13:08:56 [2020-09-26T17:08:56.057Z] commitMessageProvider_twoProvidersSecondWithCaretPositioning(org.eclipse.egit.ui.internal.dialogs.CommitMessageBuilderTest)  Time elapsed: 0.092 s
13:08:56 [2020-09-26T17:08:56.057Z] commitMessageProvider_oneCrashingProviderWithCaretPosition(org.eclipse.egit.ui.internal.dialogs.CommitMessageBuilderTest)  Time elapsed: 0.088 s
13:08:56 [2020-09-26T17:08:56.057Z] commitMessageProvider_twoProvidersFirstOneCrashing(org.eclipse.egit.ui.internal.dialogs.CommitMessageBuilderTest)  Time elapsed: 1.066 s
13:08:56 [2020-09-26T17:08:56.057Z] commitMessageProvider_noProvider(org.eclipse.egit.ui.internal.dialogs.CommitMessageBuilderTest)  Time elapsed: 0.091 s
13:08:56 [2020-09-26T17:08:56.057Z] commitMessageProvider_oneProvider(org.eclipse.egit.ui.internal.dialogs.CommitMessageBuilderTest)  Time elapsed: 1.46 s
13:08:56 [2020-09-26T17:08:56.057Z] commitMessageProvider_multipleProvidersWithCrashAndNull(org.eclipse.egit.ui.internal.dialogs.CommitMessageBuilderTest)  Time elapsed: 0.095 s
13:08:56 [2020-09-26T17:08:56.057Z] commitMessageProvider_oneProviderWithInvalidNegativeCaretPosition(org.eclipse.egit.ui.internal.dialogs.CommitMessageBuilderTest)  Time elapsed: 0.089 s
13:08:56 [2020-09-26T17:08:56.057Z] commitMessageProvider_twoProvidersSecondWithUndefinedCaretPosition(org.eclipse.egit.ui.internal.dialogs.CommitMessageBuilderTest)  Time elapsed: 0.09 s
13:08:56 [2020-09-26T17:08:56.058Z] commitMessageProvider_twoProvidersWithCaretPositioningFirstWithUndefinedCaretPosition(org.eclipse.egit.ui.internal.dialogs.CommitMessageBuilderTest)  Time elapsed: 0.098 s
13:08:56 [2020-09-26T17:08:56.058Z] commitMessageProvider_oneProviderWithCaretPositionEqualsMessageLength(org.eclipse.egit.ui.internal.dialogs.CommitMessageBuilderTest)  Time elapsed: 0.092 s
13:08:56 [2020-09-26T17:08:56.058Z] commitMessageProvider_twoProvidersFirstWithCaretPositioning(org.eclipse.egit.ui.internal.dialogs.CommitMessageBuilderTest)  Time elapsed: 1.055 s
13:08:56 [2020-09-26T17:08:56.058Z] commitMessageProvider_twoProvidersWithCaretPositioningSecondWithUndefinedCaretPosition(org.eclipse.egit.ui.internal.dialogs.CommitMessageBuilderTest)  Time elapsed: 0.094 s
13:08:56 [2020-09-26T17:08:56.058Z] commitMessageProvider_oneProviderWithCaretPositioning(org.eclipse.egit.ui.internal.dialogs.CommitMessageBuilderTest)  Time elapsed: 0.085 s
13:08:56 [2020-09-26T17:08:56.058Z] commitMessageProvider_twoProvidersSecondWithCaretPositionZero(org.eclipse.egit.ui.internal.dialogs.CommitMessageBuilderTest)  Time elapsed: 0.082 s
13:08:56 [2020-09-26T17:08:56.058Z] commitMessageProvider_twoProviders(org.eclipse.egit.ui.internal.dialogs.CommitMessageBuilderTest)  Time elapsed: 0.09 s
13:08:56 [2020-09-26T17:08:56.058Z] commitMessageProvider_twoProvidersSecondOneCrashing(org.eclipse.egit.ui.internal.dialogs.CommitMessageBuilderTest)  Time elapsed: 0.093 s
13:08:56 [2020-09-26T17:08:56.058Z] commitMessageProvider_multipleProvidersWithCrashingAndNullAndOneCaretPositioning(org.eclipse.egit.ui.internal.dialogs.CommitMessageBuilderTest)  Time elapsed: 1.105 s
13:08:56 [2020-09-26T17:08:56.058Z] commitMessageProvider_twoProvidersWithCaretPositioning(org.eclipse.egit.ui.internal.dialogs.CommitMessageBuilderTest)  Time elapsed: 0.095 s
13:08:56 [2020-09-26T17:08:56.058Z] commitMessageProvider_oneProviderWithInvalidCaretPositionExceedingMessageLength(org.eclipse.egit.ui.internal.dialogs.CommitMessageBuilderTest)  Time elapsed: 0.089 s
13:08:56 [2020-09-26T17:08:56.058Z] Running org.eclipse.egit.ui.internal.dialogs.SpellcheckableMessageAreaTest
13:08:56 [2020-09-26T17:08:56.058Z] Tests run: 25, Failures: 0, Errors: 0, Skipped: 0, Time elapsed: 0.003 s - in org.eclipse.egit.ui.internal.dialogs.SpellcheckableMessageAreaTest
13:08:56 [2020-09-26T17:08:56.058Z] testWrappingLongWords(org.eclipse.egit.ui.internal.dialogs.SpellcheckableMessageAreaTest)  Time elapsed: 0.001 s
13:08:56 [2020-09-26T17:08:56.058Z] wrapOnlyCommitMessageBody(org.eclipse.egit.ui.internal.dialogs.SpellcheckableMessageAreaTest)  Time elapsed: 0 s
13:08:56 [2020-09-26T17:08:56.058Z] dontWrapMaximumLengthText(org.eclipse.egit.ui.internal.dialogs.SpellcheckableMessageAreaTest)  Time elapsed: 0 s
13:08:56 [2020-09-26T17:08:56.058Z] keepTrailingSpace(org.eclipse.egit.ui.internal.dialogs.SpellcheckableMessageAreaTest)  Time elapsed: 0 s
13:08:56 [2020-09-26T17:08:56.058Z] dontWrapShortMessage(org.eclipse.egit.ui.internal.dialogs.SpellcheckableMessageAreaTest)  Time elapsed: 0 s
13:08:56 [2020-09-26T17:08:56.058Z] lineAfterWrappedWordShouldNotBeJoined(org.eclipse.egit.ui.internal.dialogs.SpellcheckableMessageAreaTest)  Time elapsed: 0 s
13:08:56 [2020-09-26T17:08:56.058Z] lineAfterWrappedWordShouldNotBeJoined2(org.eclipse.egit.ui.internal.dialogs.SpellcheckableMessageAreaTest)  Time elapsed: 0 s
13:08:56 [2020-09-26T17:08:56.058Z] lineAfterWrappedWordShouldNotBeJoined3(org.eclipse.egit.ui.internal.dialogs.SpellcheckableMessageAreaTest)  Time elapsed: 0 s
13:08:56 [2020-09-26T17:08:56.058Z] dontWrapWordLongerThanOneLine(org.eclipse.egit.ui.internal.dialogs.SpellcheckableMessageAreaTest)  Time elapsed: 0 s
13:08:56 [2020-09-26T17:08:56.058Z] keepExistingNewlines(org.eclipse.egit.ui.internal.dialogs.SpellcheckableMessageAreaTest)  Time elapsed: 0 s
13:08:56 [2020-09-26T17:08:56.058Z] dontWrapShortText(org.eclipse.egit.ui.internal.dialogs.SpellcheckableMessageAreaTest)  Time elapsed: 0 s
13:08:56 [2020-09-26T17:08:56.058Z] dontWrapWordLongerThanOneLineAtStart(org.eclipse.egit.ui.internal.dialogs.SpellcheckableMessageAreaTest)  Time elapsed: 0 s
13:08:56 [2020-09-26T17:08:56.058Z] dontWrapAlreadyWrappedText(org.eclipse.egit.ui.internal.dialogs.SpellcheckableMessageAreaTest)  Time elapsed: 0.001 s
13:08:56 [2020-09-26T17:08:56.058Z] wrapOverlengthText2(org.eclipse.egit.ui.internal.dialogs.SpellcheckableMessageAreaTest)  Time elapsed: 0 s
13:08:56 [2020-09-26T17:08:56.058Z] lineAfterWrappedWordShouldNotBeJoinedIfItStartsWithASymbol(org.eclipse.egit.ui.internal.dialogs.SpellcheckableMessageAreaTest)  Time elapsed: 0 s
13:08:56 [2020-09-26T17:08:56.058Z] wrapAlternatingBlankNonBlank(org.eclipse.egit.ui.internal.dialogs.SpellcheckableMessageAreaTest)  Time elapsed: 0 s
13:08:56 [2020-09-26T17:08:56.058Z] keepWhitespace(org.eclipse.egit.ui.internal.dialogs.SpellcheckableMessageAreaTest)  Time elapsed: 0 s
13:08:56 [2020-09-26T17:08:56.058Z] lineAfterWrappedWordShouldNotBeJoinedIfItsEmpty(org.eclipse.egit.ui.internal.dialogs.SpellcheckableMessageAreaTest)  Time elapsed: 0 s
13:08:56 [2020-09-26T17:08:56.058Z] dontWrapLongCommitMessageFooter(org.eclipse.egit.ui.internal.dialogs.SpellcheckableMessageAreaTest)  Time elapsed: 0 s
13:08:56 [2020-09-26T17:08:56.058Z] lineAfterWrappedLineShouldBeJoinedAndFollowingLineWrappedCorrectly(org.eclipse.egit.ui.internal.dialogs.SpellcheckableMessageAreaTest)  Time elapsed: 0 s
13:08:56 [2020-09-26T17:08:56.058Z] wrapOverlengthText(org.eclipse.egit.ui.internal.dialogs.SpellcheckableMessageAreaTest)  Time elapsed: 0 s
13:08:56 [2020-09-26T17:08:56.058Z] dontWrapWordLongerThanOneLineAndKeepSpaceAtFront(org.eclipse.egit.ui.internal.dialogs.SpellcheckableMessageAreaTest)  Time elapsed: 0.001 s
13:08:56 [2020-09-26T17:08:56.058Z] wrapSecondLongLine(org.eclipse.egit.ui.internal.dialogs.SpellcheckableMessageAreaTest)  Time elapsed: 0 s
13:08:56 [2020-09-26T17:08:56.058Z] wrapOverlengthTextByOne(org.eclipse.egit.ui.internal.dialogs.SpellcheckableMessageAreaTest)  Time elapsed: 0 s
13:08:56 [2020-09-26T17:08:56.058Z] keepNewlineAtEnd(org.eclipse.egit.ui.internal.dialogs.SpellcheckableMessageAreaTest)  Time elapsed: 0 s
13:08:56 [2020-09-26T17:08:56.058Z] Running org.eclipse.egit.ui.internal.dialogs.CommitMessageComponentTest
13:08:56 [2020-09-26T17:08:56.058Z] Tests run: 5, Failures: 0, Errors: 0, Skipped: 0, Time elapsed: 0.001 s - in org.eclipse.egit.ui.internal.dialogs.CommitMessageComponentTest
13:08:56 [2020-09-26T17:08:56.058Z] commitFormat_MultipleLines_notOk2(org.eclipse.egit.ui.internal.dialogs.CommitMessageComponentTest)  Time elapsed: 0 s
13:08:56 [2020-09-26T17:08:56.058Z] commitFormat_simple(org.eclipse.egit.ui.internal.dialogs.CommitMessageComponentTest)  Time elapsed: 0 s
13:08:56 [2020-09-26T17:08:56.058Z] commitFormat_MultipleLines_ok(org.eclipse.egit.ui.internal.dialogs.CommitMessageComponentTest)  Time elapsed: 0 s
13:08:56 [2020-09-26T17:08:56.058Z] commitFormat_trailingWhitespace_ok(org.eclipse.egit.ui.internal.dialogs.CommitMessageComponentTest)  Time elapsed: 0 s
13:08:56 [2020-09-26T17:08:56.058Z] commitFormat_MultipleLines_notOk(org.eclipse.egit.ui.internal.dialogs.CommitMessageComponentTest)  Time elapsed: 0 s
13:08:56 [2020-09-26T17:08:56.058Z] Running org.eclipse.egit.ui.internal.actions.StashesMenuTest
13:08:58 [2020-09-26T17:08:58.585Z] 
13:08:58 [2020-09-26T17:08:58.585Z] (SWT:1587): Gtk-WARNING **: 17:08:58.348: Negative content width -6 (allocation 1, extents 4x3) while allocating gadget (node toolbar, owner GtkToolbar)
13:08:58 [2020-09-26T17:08:58.585Z] 
13:08:58 [2020-09-26T17:08:58.585Z] (SWT:1587): Gtk-WARNING **: 17:08:58.348: Negative content height -3 (allocation 1, extents 2x2) while allocating gadget (node toolbar, owner GtkToolbar)
13:08:58 [2020-09-26T17:08:58.585Z] 
13:08:58 [2020-09-26T17:08:58.585Z] (SWT:1587): Gtk-WARNING **: 17:08:58.348: Negative content width -6 (allocation 1, extents 4x3) while allocating gadget (node toolbar, owner GtkToolbar)
13:08:58 [2020-09-26T17:08:58.585Z] 
13:08:58 [2020-09-26T17:08:58.585Z] (SWT:1587): Gtk-WARNING **: 17:08:58.348: Negative content height -3 (allocation 1, extents 2x2) while allocating gadget (node toolbar, owner GtkToolbar)
13:08:58 [2020-09-26T17:08:58.585Z] 
13:08:58 [2020-09-26T17:08:58.585Z] (SWT:1587): Gtk-WARNING **: 17:08:58.395: Negative content width -6 (allocation 1, extents 4x3) while allocating gadget (node toolbar, owner GtkToolbar)
13:08:58 [2020-09-26T17:08:58.585Z] 
13:08:58 [2020-09-26T17:08:58.585Z] (SWT:1587): Gtk-WARNING **: 17:08:58.409: Negative content width -6 (allocation 1, extents 4x3) while allocating gadget (node toolbar, owner GtkToolbar)
13:08:58 [2020-09-26T17:08:58.585Z] 
13:08:58 [2020-09-26T17:08:58.585Z] (SWT:1587): Gtk-WARNING **: 17:08:58.421: Negative content width -6 (allocation 1, extents 4x3) while allocating gadget (node toolbar, owner GtkToolbar)
13:08:58 [2020-09-26T17:08:58.848Z] Tests run: 2, Failures: 0, Errors: 0, Skipped: 0, Time elapsed: 2.92 s - in org.eclipse.egit.ui.internal.actions.StashesMenuTest
13:08:58 [2020-09-26T17:08:58.848Z] menuWithoutStashes(org.eclipse.egit.ui.internal.actions.StashesMenuTest)  Time elapsed: 1.665 s
13:08:58 [2020-09-26T17:08:58.848Z] stashAndApplyChanges(org.eclipse.egit.ui.internal.actions.StashesMenuTest)  Time elapsed: 1.25 s
13:08:58 [2020-09-26T17:08:58.848Z] Running org.eclipse.egit.ui.internal.actions.LinkedResourcesTest
13:09:00 [2020-09-26T17:09:00.219Z] Tests run: 2, Failures: 0, Errors: 0, Skipped: 0, Time elapsed: 1.23 s - in org.eclipse.egit.ui.internal.actions.LinkedResourcesTest
13:09:00 [2020-09-26T17:09:00.219Z] testSomeActionsWithoutLinkedResources(org.eclipse.egit.ui.internal.actions.LinkedResourcesTest)  Time elapsed: 0.609 s
13:09:00 [2020-09-26T17:09:00.219Z] testNoActionOnLinkedResources(org.eclipse.egit.ui.internal.actions.LinkedResourcesTest)  Time elapsed: 0.617 s
13:09:00 [2020-09-26T17:09:00.219Z] Running org.eclipse.egit.ui.internal.actions.SwitchToMenuTest
13:09:10 [2020-09-26T17:09:10.238Z] 
13:09:10 [2020-09-26T17:09:10.238Z] !ENTRY org.eclipse.egit.core 4 0 2020-09-26 17:09:08.831
13:09:10 [2020-09-26T17:09:10.238Z] !MESSAGE Cannot parse the reflog for HEAD in repository /home/jenkins/agent/workspace/egit/tmp/egit.tmp/91100fa829d5468881f3243d1a944449/LocalRepositoriesTests264_selectionWithCorruptedReflog/FirstRepository/.git
13:09:10 [2020-09-26T17:09:10.238Z] !STACK 0
13:09:10 [2020-09-26T17:09:10.238Z] org.eclipse.jgit.errors.InvalidObjectIdException: Invalid id: INTENTIONALLY CORRUPTED REFLOG. Just som
13:09:10 [2020-09-26T17:09:10.238Z] 	at org.eclipse.jgit.lib.ObjectId.fromHexString(ObjectId.java:217)
13:09:10 [2020-09-26T17:09:10.238Z] 	at org.eclipse.jgit.lib.ObjectId.fromString(ObjectId.java:191)
13:09:10 [2020-09-26T17:09:10.238Z] 	at org.eclipse.jgit.internal.storage.file.ReflogEntryImpl.<init>(ReflogEntryImpl.java:39)
13:09:10 [2020-09-26T17:09:10.238Z] 	at org.eclipse.jgit.internal.storage.file.ReflogReaderImpl.getReverseEntries(ReflogReaderImpl.java:109)
13:09:10 [2020-09-26T17:09:10.238Z] 	at org.eclipse.jgit.internal.storage.file.ReflogReaderImpl.getReverseEntries(ReflogReaderImpl.java:56)
13:09:10 [2020-09-26T17:09:10.238Z] 	at org.eclipse.egit.core.RepositoryUtil.safeReadReflog(RepositoryUtil.java:193)
13:09:10 [2020-09-26T17:09:10.238Z] 	at org.eclipse.egit.ui.internal.actions.SwitchToMenu.getMostActiveBranches(SwitchToMenu.java:465)
13:09:10 [2020-09-26T17:09:10.238Z] 	at org.eclipse.egit.ui.internal.actions.SwitchToMenu.createMostActiveBranchesMenuItems(SwitchToMenu.java:306)
13:09:10 [2020-09-26T17:09:10.238Z] 	at org.eclipse.egit.ui.internal.actions.SwitchToMenu.createDynamicMenu(SwitchToMenu.java:142)
13:09:10 [2020-09-26T17:09:10.238Z] 	at org.eclipse.egit.ui.internal.actions.SwitchToMenu.fill(SwitchToMenu.java:122)
13:09:10 [2020-09-26T17:09:10.238Z] 	at org.eclipse.egit.ui.internal.actions.SwitchToMenuTest$1.run(SwitchToMenuTest.java:310)
13:09:10 [2020-09-26T17:09:10.238Z] 	at org.eclipse.swt.widgets.RunnableLock.run(RunnableLock.java:35)
13:09:10 [2020-09-26T17:09:10.238Z] 	at org.eclipse.swt.widgets.Synchronizer.runAsyncMessages(Synchronizer.java:182)
13:09:10 [2020-09-26T17:09:10.238Z] 	at org.eclipse.swt.widgets.Display.runAsyncMessages(Display.java:4536)
13:09:10 [2020-09-26T17:09:10.238Z] 	at org.eclipse.swt.widgets.Display.readAndDispatch(Display.java:4154)
13:09:10 [2020-09-26T17:09:10.238Z] 	at org.eclipse.e4.ui.internal.workbench.swt.PartRenderingEngine$4.run(PartRenderingEngine.java:1121)
13:09:10 [2020-09-26T17:09:10.238Z] 	at org.eclipse.core.databinding.observable.Realm.runWithDefault(Realm.java:336)
13:09:10 [2020-09-26T17:09:10.238Z] 	at org.eclipse.e4.ui.internal.workbench.swt.PartRenderingEngine.run(PartRenderingEngine.java:1022)
13:09:10 [2020-09-26T17:09:10.238Z] 	at org.eclipse.e4.ui.internal.workbench.E4Workbench.createAndRunUI(E4Workbench.java:150)
13:09:10 [2020-09-26T17:09:10.238Z] 	at org.eclipse.ui.internal.Workbench$5.run(Workbench.java:693)
13:09:10 [2020-09-26T17:09:10.238Z] 	at org.eclipse.core.databinding.observable.Realm.runWithDefault(Realm.java:336)
13:09:10 [2020-09-26T17:09:10.238Z] 	at org.eclipse.ui.internal.Workbench.createAndRunWorkbench(Workbench.java:610)
13:09:10 [2020-09-26T17:09:10.238Z] 	at org.eclipse.ui.PlatformUI.createAndRunWorkbench(PlatformUI.java:148)
13:09:10 [2020-09-26T17:09:10.238Z] 	at org.eclipse.ui.internal.ide.application.IDEApplication.start(IDEApplication.java:138)
13:09:10 [2020-09-26T17:09:10.238Z] 	at org.eclipse.tycho.surefire.osgibooter.UITestApplication.runApplication(UITestApplication.java:31)
13:09:10 [2020-09-26T17:09:10.238Z] 	at org.eclipse.tycho.surefire.osgibooter.AbstractUITestApplication.run(AbstractUITestApplication.java:120)
13:09:10 [2020-09-26T17:09:10.238Z] 	at org.eclipse.tycho.surefire.osgibooter.UITestApplication.start(UITestApplication.java:37)
13:09:10 [2020-09-26T17:09:10.238Z] 	at org.eclipse.equinox.internal.app.EclipseAppHandle.run(EclipseAppHandle.java:196)
13:09:10 [2020-09-26T17:09:10.238Z] 	at org.eclipse.core.runtime.internal.adaptor.EclipseAppLauncher.runApplication(EclipseAppLauncher.java:134)
13:09:10 [2020-09-26T17:09:10.238Z] 	at org.eclipse.core.runtime.internal.adaptor.EclipseAppLauncher.start(EclipseAppLauncher.java:104)
13:09:10 [2020-09-26T17:09:10.238Z] 	at org.eclipse.core.runtime.adaptor.EclipseStarter.run(EclipseStarter.java:388)
13:09:10 [2020-09-26T17:09:10.238Z] 	at org.eclipse.core.runtime.adaptor.EclipseStarter.run(EclipseStarter.java:243)
13:09:10 [2020-09-26T17:09:10.238Z] 	at sun.reflect.NativeMethodAccessorImpl.invoke0(Native Method)
13:09:10 [2020-09-26T17:09:10.238Z] 	at sun.reflect.NativeMethodAccessorImpl.invoke(NativeMethodAccessorImpl.java:62)
13:09:10 [2020-09-26T17:09:10.238Z] 	at sun.reflect.DelegatingMethodAccessorImpl.invoke(DelegatingMethodAccessorImpl.java:43)
13:09:10 [2020-09-26T17:09:10.238Z] 	at java.lang.reflect.Method.invoke(Method.java:498)
13:09:10 [2020-09-26T17:09:10.238Z] 	at org.eclipse.equinox.launcher.Main.invokeFramework(Main.java:673)
13:09:10 [2020-09-26T17:09:10.238Z] 	at org.eclipse.equinox.launcher.Main.basicRun(Main.java:610)
13:09:10 [2020-09-26T17:09:10.238Z] 	at org.eclipse.equinox.launcher.Main.run(Main.java:1519)
13:09:10 [2020-09-26T17:09:10.238Z] 	at org.eclipse.equinox.launcher.Main.main(Main.java:1492)
13:09:10 [2020-09-26T17:09:10.238Z] Caused by: java.lang.ArrayIndexOutOfBoundsException
13:09:10 [2020-09-26T17:09:10.238Z] 	at org.eclipse.jgit.util.RawParseUtils.parseHexInt32(RawParseUtils.java:336)
13:09:10 [2020-09-26T17:09:10.238Z] 	at org.eclipse.jgit.lib.ObjectId.fromHexString(ObjectId.java:210)
13:09:10 [2020-09-26T17:09:10.238Z] 	... 39 more
13:09:10 [2020-09-26T17:09:10.238Z] Tests run: 9, Failures: 0, Errors: 0, Skipped: 0, Time elapsed: 9.002 s - in org.eclipse.egit.ui.internal.actions.SwitchToMenuTest
13:09:10 [2020-09-26T17:09:10.238Z] multipleSelectionWithMultipleRepositoriesAndNoCommonBranches(org.eclipse.egit.ui.internal.actions.SwitchToMenuTest)  Time elapsed: 0.933 s
13:09:10 [2020-09-26T17:09:10.238Z] selectionWithProj1(org.eclipse.egit.ui.internal.actions.SwitchToMenuTest)  Time elapsed: 0.607 s
13:09:10 [2020-09-26T17:09:10.238Z] selectionNotAdaptableToRepository(org.eclipse.egit.ui.internal.actions.SwitchToMenuTest)  Time elapsed: 0.056 s
13:09:10 [2020-09-26T17:09:10.239Z] selectionWithProj1AndReflog(org.eclipse.egit.ui.internal.actions.SwitchToMenuTest)  Time elapsed: 0.624 s
13:09:10 [2020-09-26T17:09:10.239Z] validateMenuEntriesForMultiSelectionWithMultipleRepositories(org.eclipse.egit.ui.internal.actions.SwitchToMenuTest)  Time elapsed: 2.933 s
13:09:10 [2020-09-26T17:09:10.239Z] validateBranchSwitchingForForMultiSelectionWithMultipleRepositories(org.eclipse.egit.ui.internal.actions.SwitchToMenuTest)  Time elapsed: 1.501 s
13:09:10 [2020-09-26T17:09:10.239Z] selectionWithRepositoryHavingOver20Branches(org.eclipse.egit.ui.internal.actions.SwitchToMenuTest)  Time elapsed: 1.644 s
13:09:10 [2020-09-26T17:09:10.239Z] emptySelection(org.eclipse.egit.ui.internal.actions.SwitchToMenuTest)  Time elapsed: 0.057 s
13:09:10 [2020-09-26T17:09:10.239Z] selectionWithCorruptedReflog(org.eclipse.egit.ui.internal.actions.SwitchToMenuTest)  Time elapsed: 0.625 s
13:09:10 [2020-09-26T17:09:10.239Z] Running org.eclipse.egit.ui.internal.submodules.SubmoduleFolderTest
13:09:14 [2020-09-26T17:09:14.417Z] 
13:09:14 [2020-09-26T17:09:14.417Z] (SWT:1587): Gtk-WARNING **: 17:09:13.777: Negative content width -6 (allocation 1, extents 4x3) while allocating gadget (node toolbar, owner GtkToolbar)
13:09:14 [2020-09-26T17:09:14.417Z] 
13:09:14 [2020-09-26T17:09:14.417Z] (SWT:1587): Gtk-WARNING **: 17:09:13.777: Negative content height -3 (allocation 1, extents 2x2) while allocating gadget (node toolbar, owner GtkToolbar)
13:09:14 [2020-09-26T17:09:14.417Z] 
13:09:14 [2020-09-26T17:09:14.417Z] (SWT:1587): Gtk-WARNING **: 17:09:13.778: Negative content width -6 (allocation 1, extents 4x3) while allocating gadget (node toolbar, owner GtkToolbar)
13:09:14 [2020-09-26T17:09:14.417Z] 
13:09:14 [2020-09-26T17:09:14.417Z] (SWT:1587): Gtk-WARNING **: 17:09:13.778: Negative content height -3 (allocation 1, extents 2x2) while allocating gadget (node toolbar, owner GtkToolbar)
13:09:14 [2020-09-26T17:09:14.417Z] 
13:09:14 [2020-09-26T17:09:14.417Z] (SWT:1587): Gtk-WARNING **: 17:09:14.076: Negative content width -6 (allocation 1, extents 4x3) while allocating gadget (node toolbar, owner GtkToolbar)
13:09:14 [2020-09-26T17:09:14.417Z] 
13:09:14 [2020-09-26T17:09:14.417Z] (SWT:1587): Gtk-WARNING **: 17:09:14.079: Negative content width -6 (allocation 1, extents 4x3) while allocating gadget (node toolbar, owner GtkToolbar)
13:09:14 [2020-09-26T17:09:14.417Z] 
13:09:14 [2020-09-26T17:09:14.417Z] (SWT:1587): Gtk-WARNING **: 17:09:14.082: Negative content width -6 (allocation 1, extents 4x3) while allocating gadget (node toolbar, owner GtkToolbar)
13:09:14 [2020-09-26T17:09:14.417Z] 
13:09:14 [2020-09-26T17:09:14.417Z] (SWT:1587): Gtk-WARNING **: 17:09:14.086: Negative content width -6 (allocation 1, extents 4x3) while allocating gadget (node toolbar, owner GtkToolbar)
13:09:14 [2020-09-26T17:09:14.417Z] 
13:09:14 [2020-09-26T17:09:14.418Z] (SWT:1587): Gtk-WARNING **: 17:09:14.101: Negative content width -6 (allocation 1, extents 4x3) while allocating gadget (node toolbar, owner GtkToolbar)
13:09:14 [2020-09-26T17:09:14.418Z] 
13:09:14 [2020-09-26T17:09:14.418Z] (SWT:1587): Gtk-WARNING **: 17:09:14.102: Negative content width -6 (allocation 1, extents 4x3) while allocating gadget (node toolbar, owner GtkToolbar)
13:09:14 [2020-09-26T17:09:14.418Z] 
13:09:14 [2020-09-26T17:09:14.418Z] (SWT:1587): Gtk-WARNING **: 17:09:14.137: Negative content width -6 (allocation 1, extents 4x3) while allocating gadget (node toolbar, owner GtkToolbar)
13:09:14 [2020-09-26T17:09:14.418Z] 
13:09:14 [2020-09-26T17:09:14.418Z] (SWT:1587): Gtk-WARNING **: 17:09:14.138: Negative content width -6 (allocation 1, extents 4x3) while allocating gadget (node toolbar, owner GtkToolbar)
13:09:22 [2020-09-26T17:09:22.519Z] 
13:09:22 [2020-09-26T17:09:22.519Z] (SWT:1587): Gtk-WARNING **: 17:09:21.023: Negative content width -6 (allocation 1, extents 4x3) while allocating gadget (node toolbar, owner GtkToolbar)
13:09:22 [2020-09-26T17:09:22.519Z] 
13:09:22 [2020-09-26T17:09:22.519Z] (SWT:1587): Gtk-WARNING **: 17:09:21.038: Negative content width -6 (allocation 1, extents 4x3) while allocating gadget (node toolbar, owner GtkToolbar)
13:09:22 [2020-09-26T17:09:22.519Z] 
13:09:22 [2020-09-26T17:09:22.519Z] (SWT:1587): Gtk-WARNING **: 17:09:21.070: Negative content width -6 (allocation 1, extents 4x3) while allocating gadget (node toolbar, owner GtkToolbar)
13:09:22 [2020-09-26T17:09:22.519Z] 
13:09:22 [2020-09-26T17:09:22.519Z] (SWT:1587): Gtk-WARNING **: 17:09:21.070: Negative content width -6 (allocation 1, extents 4x3) while allocating gadget (node toolbar, owner GtkToolbar)
13:09:22 [2020-09-26T17:09:22.519Z] 
13:09:22 [2020-09-26T17:09:22.519Z] (SWT:1587): Gtk-CRITICAL **: 17:09:21.093: gtk_box_gadget_distribute: assertion 'size >= 0' failed in GtkScrollbar
13:09:22 [2020-09-26T17:09:22.519Z] 
13:09:22 [2020-09-26T17:09:22.519Z] (SWT:1587): Gtk-CRITICAL **: 17:09:21.107: gtk_box_gadget_distribute: assertion 'size >= 0' failed in GtkScrollbar
13:09:22 [2020-09-26T17:09:22.519Z] 
13:09:22 [2020-09-26T17:09:22.519Z] (SWT:1587): Gtk-CRITICAL **: 17:09:21.121: gtk_box_gadget_distribute: assertion 'size >= 0' failed in GtkScrollbar
13:09:22 [2020-09-26T17:09:22.519Z] 
13:09:22 [2020-09-26T17:09:22.519Z] (SWT:1587): Gtk-CRITICAL **: 17:09:21.138: gtk_box_gadget_distribute: assertion 'size >= 0' failed in GtkScrollbar
13:09:22 [2020-09-26T17:09:22.519Z] 
13:09:22 [2020-09-26T17:09:22.519Z] (SWT:1587): Gtk-CRITICAL **: 17:09:21.154: gtk_box_gadget_distribute: assertion 'size >= 0' failed in GtkScrollbar
13:09:22 [2020-09-26T17:09:22.519Z] 
13:09:22 [2020-09-26T17:09:22.519Z] (SWT:1587): Gtk-CRITICAL **: 17:09:21.171: gtk_box_gadget_distribute: assertion 'size >= 0' failed in GtkScrollbar
13:09:22 [2020-09-26T17:09:22.519Z] 
13:09:22 [2020-09-26T17:09:22.519Z] (SWT:1587): Gtk-CRITICAL **: 17:09:21.187: gtk_box_gadget_distribute: assertion 'size >= 0' failed in GtkScrollbar
13:09:22 [2020-09-26T17:09:22.519Z] 
13:09:22 [2020-09-26T17:09:22.519Z] (SWT:1587): Gtk-WARNING **: 17:09:21.194: Negative content width -6 (allocation 1, extents 4x3) while allocating gadget (node toolbar, owner GtkToolbar)
13:09:22 [2020-09-26T17:09:22.519Z] 
13:09:22 [2020-09-26T17:09:22.519Z] (SWT:1587): Gtk-WARNING **: 17:09:21.202: Negative content width -6 (allocation 1, extents 4x3) while allocating gadget (node toolbar, owner GtkToolbar)
13:09:22 [2020-09-26T17:09:22.519Z] 
13:09:22 [2020-09-26T17:09:22.519Z] (SWT:1587): Gtk-WARNING **: 17:09:21.239: Negative content width -6 (allocation 1, extents 4x3) while allocating gadget (node toolbar, owner GtkToolbar)
13:09:22 [2020-09-26T17:09:22.519Z] 
13:09:22 [2020-09-26T17:09:22.519Z] (SWT:1587): Gtk-CRITICAL **: 17:09:21.242: gtk_box_gadget_distribute: assertion 'size >= 0' failed in GtkScrollbar
13:09:22 [2020-09-26T17:09:22.519Z] 
13:09:22 [2020-09-26T17:09:22.519Z] (SWT:1587): Gtk-WARNING **: 17:09:21.273: Negative content width -6 (allocation 1, extents 4x3) while allocating gadget (node toolbar, owner GtkToolbar)
13:09:26 [2020-09-26T17:09:26.708Z] 
13:09:26 [2020-09-26T17:09:26.708Z] (SWT:1587): Gtk-WARNING **: 17:09:26.225: Negative content width -6 (allocation 1, extents 4x3) while allocating gadget (node toolbar, owner GtkToolbar)
13:09:26 [2020-09-26T17:09:26.708Z] 
13:09:26 [2020-09-26T17:09:26.708Z] (SWT:1587): Gtk-WARNING **: 17:09:26.342: Negative content width -6 (allocation 1, extents 4x3) while allocating gadget (node toolbar, owner GtkToolbar)
13:09:27 [2020-09-26T17:09:27.275Z] 
13:09:27 [2020-09-26T17:09:27.275Z] (SWT:1587): Gtk-WARNING **: 17:09:27.188: Negative content width -6 (allocation 1, extents 4x3) while allocating gadget (node toolbar, owner GtkToolbar)
13:09:27 [2020-09-26T17:09:27.275Z] 
13:09:27 [2020-09-26T17:09:27.275Z] (SWT:1587): Gtk-WARNING **: 17:09:27.225: Negative content width -6 (allocation 1, extents 4x3) while allocating gadget (node toolbar, owner GtkToolbar)
13:09:32 [2020-09-26T17:09:32.542Z] Tests run: 11, Failures: 0, Errors: 0, Skipped: 0, Time elapsed: 23.24 s - in org.eclipse.egit.ui.internal.submodules.SubmoduleFolderTest
13:09:32 [2020-09-26T17:09:32.542Z] testSwitchToMenu(org.eclipse.egit.ui.internal.submodules.SubmoduleFolderTest)  Time elapsed: 3.075 s
13:09:32 [2020-09-26T17:09:32.542Z] compareWithHeadInSubmoduleFolder(org.eclipse.egit.ui.internal.submodules.SubmoduleFolderTest)  Time elapsed: 2.269 s
13:09:32 [2020-09-26T17:09:32.542Z] testStageUnstageInSubRepo(org.eclipse.egit.ui.internal.submodules.SubmoduleFolderTest)  Time elapsed: 2.726 s
13:09:32 [2020-09-26T17:09:32.542Z] testDecoration(org.eclipse.egit.ui.internal.submodules.SubmoduleFolderTest)  Time elapsed: 2.277 s
13:09:32 [2020-09-26T17:09:32.542Z] testHistoryFromProjectExplorerIsFromSubRepository(org.eclipse.egit.ui.internal.submodules.SubmoduleFolderTest)  Time elapsed: 2.277 s
13:09:32 [2020-09-26T17:09:32.542Z] testParentFolderMapsToParentRepo(org.eclipse.egit.ui.internal.submodules.SubmoduleFolderTest)  Time elapsed: 1.328 s
13:09:32 [2020-09-26T17:09:32.542Z] testDisconnect(org.eclipse.egit.ui.internal.submodules.SubmoduleFolderTest)  Time elapsed: 2.004 s
13:09:32 [2020-09-26T17:09:32.542Z] testRepoViewFollowSelection(org.eclipse.egit.ui.internal.submodules.SubmoduleFolderTest)  Time elapsed: 2.393 s
13:09:32 [2020-09-26T17:09:32.542Z] testRepoRemoval(org.eclipse.egit.ui.internal.submodules.SubmoduleFolderTest)  Time elapsed: 1.844 s
13:09:32 [2020-09-26T17:09:32.542Z] testChildProjectMapsToSubRepo(org.eclipse.egit.ui.internal.submodules.SubmoduleFolderTest)  Time elapsed: 1.563 s
13:09:32 [2020-09-26T17:09:32.542Z] testChildFolderMapsToSubRepo(org.eclipse.egit.ui.internal.submodules.SubmoduleFolderTest)  Time elapsed: 1.407 s
13:09:32 [2020-09-26T17:09:32.542Z] Running org.eclipse.egit.ui.internal.synchronize.model.GitModelWorkingFileTest
13:09:35 [2020-09-26T17:09:35.828Z] Tests run: 5, Failures: 0, Errors: 0, Skipped: 0, Time elapsed: 3.405 s - in org.eclipse.egit.ui.internal.synchronize.model.GitModelWorkingFileTest
13:09:35 [2020-09-26T17:09:35.828Z] shouldReturnNotEqualForDifferentLocation(org.eclipse.egit.ui.internal.synchronize.model.GitModelWorkingFileTest)  Time elapsed: 0.627 s
13:09:35 [2020-09-26T17:09:35.828Z] shouldReturnNotEqualWhenComparingWorkingFileAndCacheFile(org.eclipse.egit.ui.internal.synchronize.model.GitModelWorkingFileTest)  Time elapsed: 0.82 s
13:09:35 [2020-09-26T17:09:35.828Z] shouldReturnEqualForSameInstance(org.eclipse.egit.ui.internal.synchronize.model.GitModelWorkingFileTest)  Time elapsed: 0.575 s
13:09:35 [2020-09-26T17:09:35.828Z] shouldReturnNotEqualWhenComparingWorkingFileAndBlob(org.eclipse.egit.ui.internal.synchronize.model.GitModelWorkingFileTest)  Time elapsed: 0.792 s
13:09:35 [2020-09-26T17:09:35.828Z] shouldReturnEqualForSameLocation(org.eclipse.egit.ui.internal.synchronize.model.GitModelWorkingFileTest)  Time elapsed: 0.58 s
13:09:35 [2020-09-26T17:09:35.828Z] Running org.eclipse.egit.ui.internal.synchronize.model.GitModelBlobTest
13:09:45 [2020-09-26T17:09:45.829Z] Tests run: 15, Failures: 0, Errors: 0, Skipped: 2, Time elapsed: 8.849 s - in org.eclipse.egit.ui.internal.synchronize.model.GitModelBlobTest
13:09:45 [2020-09-26T17:09:45.829Z] shouldReturnEqualSameData1(org.eclipse.egit.ui.internal.synchronize.model.GitModelBlobTest) skipped
13:09:45 [2020-09-26T17:09:45.829Z] shouldReturnNotEqualForDifferentLocation(org.eclipse.egit.ui.internal.synchronize.model.GitModelBlobTest)  Time elapsed: 0.602 s
13:09:45 [2020-09-26T17:09:45.829Z] shouldReturnNotEqualForBlobAndCommit(org.eclipse.egit.ui.internal.synchronize.model.GitModelBlobTest)  Time elapsed: 0.597 s
13:09:45 [2020-09-26T17:09:45.829Z] shouldReturnEqualForSameData(org.eclipse.egit.ui.internal.synchronize.model.GitModelBlobTest) skipped
13:09:45 [2020-09-26T17:09:45.829Z] shouldReturnNotEqualForDifferentFiles(org.eclipse.egit.ui.internal.synchronize.model.GitModelBlobTest)  Time elapsed: 0.6 s
13:09:45 [2020-09-26T17:09:45.829Z] shouldReturnNotEqualForBlobAndCacheFile(org.eclipse.egit.ui.internal.synchronize.model.GitModelBlobTest)  Time elapsed: 1.098 s
13:09:45 [2020-09-26T17:09:45.830Z] shouldReturnNotEqualForBlobAndTree(org.eclipse.egit.ui.internal.synchronize.model.GitModelBlobTest)  Time elapsed: 0.591 s
13:09:45 [2020-09-26T17:09:45.830Z] shouldBeSymmetric1(org.eclipse.egit.ui.internal.synchronize.model.GitModelBlobTest)  Time elapsed: 0.581 s
13:09:45 [2020-09-26T17:09:45.830Z] shouldBeSymmetric(org.eclipse.egit.ui.internal.synchronize.model.GitModelBlobTest)  Time elapsed: 0.588 s
13:09:45 [2020-09-26T17:09:45.830Z] shouldReturnEqualForSameInstance(org.eclipse.egit.ui.internal.synchronize.model.GitModelBlobTest)  Time elapsed: 0.99 s
13:09:45 [2020-09-26T17:09:45.830Z] shouldActAsResourceProvider(org.eclipse.egit.ui.internal.synchronize.model.GitModelBlobTest)  Time elapsed: 0.588 s
13:09:45 [2020-09-26T17:09:45.830Z] shouldReturnNotEqualForDifferentBaseObjectId2(org.eclipse.egit.ui.internal.synchronize.model.GitModelBlobTest)  Time elapsed: 0.568 s
13:09:45 [2020-09-26T17:09:45.830Z] shouldReturnNotEqualForDifferentBaseObjectId3(org.eclipse.egit.ui.internal.synchronize.model.GitModelBlobTest)  Time elapsed: 0.584 s
13:09:45 [2020-09-26T17:09:45.830Z] shouldReturnNotEqualForBlobAndWorkingFile(org.eclipse.egit.ui.internal.synchronize.model.GitModelBlobTest)  Time elapsed: 0.624 s
13:09:45 [2020-09-26T17:09:45.830Z] shouldReturnNotEqualForDifferentBaseObjectId(org.eclipse.egit.ui.internal.synchronize.model.GitModelBlobTest)  Time elapsed: 0.814 s
13:09:45 [2020-09-26T17:09:45.830Z] Running org.eclipse.egit.ui.internal.synchronize.model.GitModelCacheFileTest
13:09:47 [2020-09-26T17:09:47.728Z] Tests run: 7, Failures: 0, Errors: 0, Skipped: 2, Time elapsed: 3.195 s - in org.eclipse.egit.ui.internal.synchronize.model.GitModelCacheFileTest
13:09:47 [2020-09-26T17:09:47.729Z] shouldReturnEqualForSameObjectIdsAndLocation(org.eclipse.egit.ui.internal.synchronize.model.GitModelCacheFileTest)  Time elapsed: 0.579 s
13:09:47 [2020-09-26T17:09:47.729Z] shouldReturnNotEqualWhenComparingCacheFileAndBlob(org.eclipse.egit.ui.internal.synchronize.model.GitModelCacheFileTest)  Time elapsed: 0.603 s
13:09:47 [2020-09-26T17:09:47.729Z] shouldReturnNotEqualForDifferentCacheIds(org.eclipse.egit.ui.internal.synchronize.model.GitModelCacheFileTest) skipped
13:09:47 [2020-09-26T17:09:47.729Z] shouldReturnEqualForSameInstance(org.eclipse.egit.ui.internal.synchronize.model.GitModelCacheFileTest)  Time elapsed: 0.583 s
13:09:47 [2020-09-26T17:09:47.729Z] shouldReturnNotEqualWhenComparingCacheFileAndWorkingFile(org.eclipse.egit.ui.internal.synchronize.model.GitModelCacheFileTest)  Time elapsed: 0.76 s
13:09:47 [2020-09-26T17:09:47.729Z] shouldReturnNotEqualForDifferentBaseIds(org.eclipse.egit.ui.internal.synchronize.model.GitModelCacheFileTest)  Time elapsed: 0.659 s
13:09:47 [2020-09-26T17:09:47.729Z] shouldReturnNotEqualForDifferentLocations(org.eclipse.egit.ui.internal.synchronize.model.GitModelCacheFileTest) skipped
13:09:47 [2020-09-26T17:09:47.729Z] Running org.eclipse.egit.ui.internal.synchronize.model.GitModelWorkingTreeTest
13:09:49 [2020-09-26T17:09:49.115Z] Tests run: 2, Failures: 0, Errors: 0, Skipped: 0, Time elapsed: 1.287 s - in org.eclipse.egit.ui.internal.synchronize.model.GitModelWorkingTreeTest
13:09:49 [2020-09-26T17:09:49.115Z] shouldReturnNotEqualsWhenComparingWorkingTreeAndCache(org.eclipse.egit.ui.internal.synchronize.model.GitModelWorkingTreeTest)  Time elapsed: 0.609 s
13:09:49 [2020-09-26T17:09:49.115Z] shouldReturnEqualsForTheSameInstance(org.eclipse.egit.ui.internal.synchronize.model.GitModelWorkingTreeTest)  Time elapsed: 0.673 s
13:09:49 [2020-09-26T17:09:49.115Z] Running org.eclipse.egit.ui.internal.synchronize.model.GitModelCacheTreeTest
13:09:51 [2020-09-26T17:09:51.643Z] Tests run: 4, Failures: 0, Errors: 0, Skipped: 0, Time elapsed: 2.649 s - in org.eclipse.egit.ui.internal.synchronize.model.GitModelCacheTreeTest
13:09:51 [2020-09-26T17:09:51.643Z] shouldReturnEqualForSameData(org.eclipse.egit.ui.internal.synchronize.model.GitModelCacheTreeTest)  Time elapsed: 0.595 s
13:09:51 [2020-09-26T17:09:51.643Z] shouldReturnNotEqualForDifferetnLocation(org.eclipse.egit.ui.internal.synchronize.model.GitModelCacheTreeTest)  Time elapsed: 0.78 s
13:09:51 [2020-09-26T17:09:51.643Z] shouldReturnEqualForSameInstance(org.eclipse.egit.ui.internal.synchronize.model.GitModelCacheTreeTest)  Time elapsed: 0.66 s
13:09:51 [2020-09-26T17:09:51.643Z] shouldReturnNotEqualWhenComparingCacheTreeAndTree(org.eclipse.egit.ui.internal.synchronize.model.GitModelCacheTreeTest)  Time elapsed: 0.606 s
13:09:51 [2020-09-26T17:09:51.643Z] Running org.eclipse.egit.ui.internal.synchronize.model.GitModelRootTest
13:09:53 [2020-09-26T17:09:53.540Z] Tests run: 1, Failures: 0, Errors: 0, Skipped: 0, Time elapsed: 1.42 s - in org.eclipse.egit.ui.internal.synchronize.model.GitModelRootTest
13:09:53 [2020-09-26T17:09:53.540Z] shouldIgnoreEmptyRepositories(org.eclipse.egit.ui.internal.synchronize.model.GitModelRootTest)  Time elapsed: 1.415 s
13:09:53 [2020-09-26T17:09:53.540Z] Running org.eclipse.egit.ui.internal.synchronize.model.GitModelCommitTest
13:09:58 [2020-09-26T17:09:58.801Z] Tests run: 7, Failures: 0, Errors: 0, Skipped: 0, Time elapsed: 4.939 s - in org.eclipse.egit.ui.internal.synchronize.model.GitModelCommitTest
13:09:58 [2020-09-26T17:09:58.801Z] shouldReturnNotEqualForDifferentCommits(org.eclipse.egit.ui.internal.synchronize.model.GitModelCommitTest)  Time elapsed: 0.573 s
13:09:58 [2020-09-26T17:09:58.801Z] shouldReturnNotEqualWhenCommitTreeAndBlob(org.eclipse.egit.ui.internal.synchronize.model.GitModelCommitTest)  Time elapsed: 0.592 s
13:09:58 [2020-09-26T17:09:58.801Z] shouldReturnNotEqualWhenCommitTreeAndTree(org.eclipse.egit.ui.internal.synchronize.model.GitModelCommitTest)  Time elapsed: 0.58 s
13:09:58 [2020-09-26T17:09:58.801Z] shouldReturnNotEqualWhenCommitTreeAndCache(org.eclipse.egit.ui.internal.synchronize.model.GitModelCommitTest)  Time elapsed: 0.612 s
13:09:58 [2020-09-26T17:09:58.801Z] shouldReturnEqualForSameInstance(org.eclipse.egit.ui.internal.synchronize.model.GitModelCommitTest)  Time elapsed: 0.614 s
13:09:58 [2020-09-26T17:09:58.801Z] shouldReturnNotEqualForDifferentParents(org.eclipse.egit.ui.internal.synchronize.model.GitModelCommitTest)  Time elapsed: 1.287 s
13:09:58 [2020-09-26T17:09:58.801Z] shouldReturnEqualForSameCommits(org.eclipse.egit.ui.internal.synchronize.model.GitModelCommitTest)  Time elapsed: 0.666 s
13:09:58 [2020-09-26T17:09:58.801Z] Running org.eclipse.egit.ui.internal.synchronize.model.GitModelRepositoryTest
13:10:00 [2020-09-26T17:10:00.703Z] Tests run: 3, Failures: 0, Errors: 0, Skipped: 0, Time elapsed: 2.228 s - in org.eclipse.egit.ui.internal.synchronize.model.GitModelRepositoryTest
13:10:00 [2020-09-26T17:10:00.703Z] shouldReturnEqual(org.eclipse.egit.ui.internal.synchronize.model.GitModelRepositoryTest)  Time elapsed: 0.771 s
13:10:00 [2020-09-26T17:10:00.703Z] shouldReturnNotEqual(org.eclipse.egit.ui.internal.synchronize.model.GitModelRepositoryTest)  Time elapsed: 0.704 s
13:10:00 [2020-09-26T17:10:00.703Z] shouldReturnEqualForSameInstance(org.eclipse.egit.ui.internal.synchronize.model.GitModelRepositoryTest)  Time elapsed: 0.743 s
13:10:00 [2020-09-26T17:10:00.703Z] Running org.eclipse.egit.ui.internal.synchronize.model.GitModelCacheTest
13:10:08 [2020-09-26T17:10:08.810Z] Tests run: 6, Failures: 0, Errors: 0, Skipped: 0, Time elapsed: 7.896 s - in org.eclipse.egit.ui.internal.synchronize.model.GitModelCacheTest
13:10:08 [2020-09-26T17:10:08.810Z] shouldReturnChildren(org.eclipse.egit.ui.internal.synchronize.model.GitModelCacheTest)  Time elapsed: 0.635 s
13:10:08 [2020-09-26T17:10:08.810Z] shouldReturnNotEqualWhenCacheTreeAndCommit(org.eclipse.egit.ui.internal.synchronize.model.GitModelCacheTest)  Time elapsed: 1.333 s
13:10:08 [2020-09-26T17:10:08.810Z] shouldReturnEqualForSameInstance(org.eclipse.egit.ui.internal.synchronize.model.GitModelCacheTest)  Time elapsed: 2.044 s
13:10:08 [2020-09-26T17:10:08.810Z] shouldReturnEqualForSameCommits(org.eclipse.egit.ui.internal.synchronize.model.GitModelCacheTest)  Time elapsed: 1.1 s
13:10:08 [2020-09-26T17:10:08.810Z] shouldReturnNotEqualWhenComparingCacheAndWorkingTree(org.eclipse.egit.ui.internal.synchronize.model.GitModelCacheTest)  Time elapsed: 1.494 s
13:10:08 [2020-09-26T17:10:08.810Z] shouldReturnNotEqualForDifferentRepositories(org.eclipse.egit.ui.internal.synchronize.model.GitModelCacheTest)  Time elapsed: 1.276 s
13:10:08 [2020-09-26T17:10:08.810Z] Running org.eclipse.egit.ui.internal.synchronize.model.GitModelTreeTest
13:10:15 [2020-09-26T17:10:15.361Z] Tests run: 6, Failures: 0, Errors: 0, Skipped: 0, Time elapsed: 6.773 s - in org.eclipse.egit.ui.internal.synchronize.model.GitModelTreeTest
13:10:15 [2020-09-26T17:10:15.361Z] shouldReturnNotEqualForDifferentLocation(org.eclipse.egit.ui.internal.synchronize.model.GitModelTreeTest)  Time elapsed: 0.691 s
13:10:15 [2020-09-26T17:10:15.361Z] shouldReturnNotEqualForTreeAndCacheTree(org.eclipse.egit.ui.internal.synchronize.model.GitModelTreeTest)  Time elapsed: 0.691 s
13:10:15 [2020-09-26T17:10:15.361Z] shouldReturnNotEqualForTreeAndCommit(org.eclipse.egit.ui.internal.synchronize.model.GitModelTreeTest)  Time elapsed: 2.057 s
13:10:15 [2020-09-26T17:10:15.361Z] shouldReturnEqualForSameBaseCommit(org.eclipse.egit.ui.internal.synchronize.model.GitModelTreeTest)  Time elapsed: 2.134 s
13:10:15 [2020-09-26T17:10:15.361Z] shouldReturnEqualForSameInstance(org.eclipse.egit.ui.internal.synchronize.model.GitModelTreeTest)  Time elapsed: 0.585 s
13:10:15 [2020-09-26T17:10:15.361Z] shouldReturnNotEqualForTreeAndBlob(org.eclipse.egit.ui.internal.synchronize.model.GitModelTreeTest)  Time elapsed: 0.602 s
13:10:15 [2020-09-26T17:10:15.361Z] Running org.eclipse.egit.ui.internal.synchronize.mapping.GitChangeSetSorterTest
13:10:15 [2020-09-26T17:10:15.361Z] Tests run: 23, Failures: 0, Errors: 0, Skipped: 0, Time elapsed: 0.218 s - in org.eclipse.egit.ui.internal.synchronize.mapping.GitChangeSetSorterTest
13:10:15 [2020-09-26T17:10:15.361Z] commitTreeShouldBeLessThanBlob(org.eclipse.egit.ui.internal.synchronize.mapping.GitChangeSetSorterTest)  Time elapsed: 0.028 s
13:10:15 [2020-09-26T17:10:15.361Z] commitTreeShouldBeLessThanTree(org.eclipse.egit.ui.internal.synchronize.mapping.GitChangeSetSorterTest)  Time elapsed: 0 s
13:10:15 [2020-09-26T17:10:15.361Z] blobShouldBeGreaterThanTree(org.eclipse.egit.ui.internal.synchronize.mapping.GitChangeSetSorterTest)  Time elapsed: 0 s
13:10:15 [2020-09-26T17:10:15.361Z] cacheTreeShouldBeLessThanCommit(org.eclipse.egit.ui.internal.synchronize.mapping.GitChangeSetSorterTest)  Time elapsed: 0 s
13:10:15 [2020-09-26T17:10:15.361Z] shouldOrderTreesAlphabetically(org.eclipse.egit.ui.internal.synchronize.mapping.GitChangeSetSorterTest)  Time elapsed: 0.187 s
13:10:15 [2020-09-26T17:10:15.361Z] commitTreeShouldBeGreaterThanCache(org.eclipse.egit.ui.internal.synchronize.mapping.GitChangeSetSorterTest)  Time elapsed: 0 s
13:10:15 [2020-09-26T17:10:15.361Z] blobShouldBeGreaterThanWorkingTree(org.eclipse.egit.ui.internal.synchronize.mapping.GitChangeSetSorterTest)  Time elapsed: 0 s
13:10:15 [2020-09-26T17:10:15.361Z] treeShouldBeGreaterThanCache(org.eclipse.egit.ui.internal.synchronize.mapping.GitChangeSetSorterTest)  Time elapsed: 0 s
13:10:15 [2020-09-26T17:10:15.361Z] treeShouldBeGreaterThanCommit(org.eclipse.egit.ui.internal.synchronize.mapping.GitChangeSetSorterTest)  Time elapsed: 0 s
13:10:15 [2020-09-26T17:10:15.361Z] workingTreeShouldBeLessThanCacheTree(org.eclipse.egit.ui.internal.synchronize.mapping.GitChangeSetSorterTest)  Time elapsed: 0 s
13:10:15 [2020-09-26T17:10:15.361Z] treeShouldBeGreaterThanWorkingTree(org.eclipse.egit.ui.internal.synchronize.mapping.GitChangeSetSorterTest)  Time elapsed: 0 s
13:10:15 [2020-09-26T17:10:15.361Z] blobShouldBeGreaterThanCache(org.eclipse.egit.ui.internal.synchronize.mapping.GitChangeSetSorterTest)  Time elapsed: 0 s
13:10:15 [2020-09-26T17:10:15.361Z] cacheTreeShouldBeLessThanBlob(org.eclipse.egit.ui.internal.synchronize.mapping.GitChangeSetSorterTest)  Time elapsed: 0 s
13:10:15 [2020-09-26T17:10:15.361Z] cacheTreeShouldBeLessThanTree(org.eclipse.egit.ui.internal.synchronize.mapping.GitChangeSetSorterTest)  Time elapsed: 0 s
13:10:15 [2020-09-26T17:10:15.361Z] shouldOrderBlobsAlphabetically(org.eclipse.egit.ui.internal.synchronize.mapping.GitChangeSetSorterTest)  Time elapsed: 0 s
13:10:15 [2020-09-26T17:10:15.361Z] commitTreeShouldBeGreaterThanWorkingTree(org.eclipse.egit.ui.internal.synchronize.mapping.GitChangeSetSorterTest)  Time elapsed: 0 s
13:10:15 [2020-09-26T17:10:15.361Z] treeShouldBeLessThanBlob(org.eclipse.egit.ui.internal.synchronize.mapping.GitChangeSetSorterTest)  Time elapsed: 0 s
13:10:15 [2020-09-26T17:10:15.361Z] cacheTreeShouldBeGreaterThanWorkingTree(org.eclipse.egit.ui.internal.synchronize.mapping.GitChangeSetSorterTest)  Time elapsed: 0 s
13:10:15 [2020-09-26T17:10:15.361Z] workingTreeShouldBeLessThanBlob(org.eclipse.egit.ui.internal.synchronize.mapping.GitChangeSetSorterTest)  Time elapsed: 0 s
13:10:15 [2020-09-26T17:10:15.361Z] workingTreeShouldBeLessThanTree(org.eclipse.egit.ui.internal.synchronize.mapping.GitChangeSetSorterTest)  Time elapsed: 0 s
13:10:15 [2020-09-26T17:10:15.361Z] shouldOrderCommitsByCommitDate(org.eclipse.egit.ui.internal.synchronize.mapping.GitChangeSetSorterTest)  Time elapsed: 0.001 s
13:10:15 [2020-09-26T17:10:15.361Z] workingTreeShouldBeLessThanCommit(org.eclipse.egit.ui.internal.synchronize.mapping.GitChangeSetSorterTest)  Time elapsed: 0 s
13:10:15 [2020-09-26T17:10:15.361Z] blobShouldBeGreaterThanCommit(org.eclipse.egit.ui.internal.synchronize.mapping.GitChangeSetSorterTest)  Time elapsed: 0 s
13:10:15 [2020-09-26T17:10:15.361Z] Running org.eclipse.egit.ui.internal.CompareUtilsTest
13:10:18 [2020-09-26T17:10:18.639Z] Tests run: 3, Failures: 0, Errors: 0, Skipped: 0, Time elapsed: 3.184 s - in org.eclipse.egit.ui.internal.CompareUtilsTest
13:10:18 [2020-09-26T17:10:18.639Z] testIndexEditWithAttributes(org.eclipse.egit.ui.internal.CompareUtilsTest)  Time elapsed: 1.056 s
13:10:18 [2020-09-26T17:10:18.639Z] testIndexEdit(org.eclipse.egit.ui.internal.CompareUtilsTest)  Time elapsed: 1.423 s
13:10:18 [2020-09-26T17:10:18.639Z] testIndexEditExecutable(org.eclipse.egit.ui.internal.CompareUtilsTest)  Time elapsed: 0.698 s
13:10:18 [2020-09-26T17:10:18.639Z] Running org.eclipse.egit.ui.internal.clone.SmartImportWizardTest
13:10:19 [2020-09-26T17:10:19.576Z] Tests run: 1, Failures: 0, Errors: 0, Skipped: 0, Time elapsed: 0.953 s - in org.eclipse.egit.ui.internal.clone.SmartImportWizardTest
13:10:19 [2020-09-26T17:10:19.576Z] test(org.eclipse.egit.ui.internal.clone.SmartImportWizardTest)  Time elapsed: 0.95 s
13:10:19 [2020-09-26T17:10:19.576Z] Running org.eclipse.egit.ui.internal.push.PushBranchWizardTest
13:10:20 [2020-09-26T17:10:20.140Z] 
13:10:20 [2020-09-26T17:10:20.140Z] (SWT:1587): Gtk-CRITICAL **: 17:10:20.068: gtk_box_gadget_distribute: assertion 'size >= 0' failed in GtkScrollbar
13:10:20 [2020-09-26T17:10:20.140Z] 
13:10:20 [2020-09-26T17:10:20.140Z] (SWT:1587): Gtk-CRITICAL **: 17:10:20.069: gtk_box_gadget_distribute: assertion 'size >= 0' failed in GtkScrollbar
13:10:20 [2020-09-26T17:10:20.140Z] 
13:10:20 [2020-09-26T17:10:20.140Z] (SWT:1587): Gtk-CRITICAL **: 17:10:20.070: gtk_box_gadget_distribute: assertion 'size >= 0' failed in GtkScrollbar
13:10:30 [2020-09-26T17:10:30.159Z] Tests run: 9, Failures: 0, Errors: 0, Skipped: 0, Time elapsed: 9.528 s - in org.eclipse.egit.ui.internal.push.PushBranchWizardTest
13:10:30 [2020-09-26T17:10:30.159Z] pushHeadToExistingRemote(org.eclipse.egit.ui.internal.push.PushBranchWizardTest)  Time elapsed: 1.038 s
13:10:30 [2020-09-26T17:10:30.159Z] pushWithRemoteUpstreamConfiguration(org.eclipse.egit.ui.internal.push.PushBranchWizardTest)  Time elapsed: 0.977 s
13:10:30 [2020-09-26T17:10:30.159Z] pushWithDifferentBranchName(org.eclipse.egit.ui.internal.push.PushBranchWizardTest)  Time elapsed: 0.995 s
13:10:30 [2020-09-26T17:10:30.159Z] pushToExistingRemoteAndSetRebase(org.eclipse.egit.ui.internal.push.PushBranchWizardTest)  Time elapsed: 0.962 s
13:10:30 [2020-09-26T17:10:30.159Z] pushToNewRemote(org.eclipse.egit.ui.internal.push.PushBranchWizardTest)  Time elapsed: 1.121 s
13:10:30 [2020-09-26T17:10:30.159Z] pushToExistingRemoteWithoutConfiguringUpstream(org.eclipse.egit.ui.internal.push.PushBranchWizardTest)  Time elapsed: 1.202 s
13:10:30 [2020-09-26T17:10:30.159Z] pushToExistingRemote(org.eclipse.egit.ui.internal.push.PushBranchWizardTest)  Time elapsed: 1.03 s
13:10:30 [2020-09-26T17:10:30.159Z] pushWhenNoRemoteExistsYet(org.eclipse.egit.ui.internal.push.PushBranchWizardTest)  Time elapsed: 1.078 s
13:10:30 [2020-09-26T17:10:30.159Z] pushWithLocalUpstreamConfiguration(org.eclipse.egit.ui.internal.push.PushBranchWizardTest)  Time elapsed: 1.102 s
13:10:30 [2020-09-26T17:10:30.159Z] Running org.eclipse.egit.ui.internal.push.PushTagsWizardTest
13:10:30 [2020-09-26T17:10:30.159Z] Tests run: 1, Failures: 0, Errors: 0, Skipped: 0, Time elapsed: 0.935 s - in org.eclipse.egit.ui.internal.push.PushTagsWizardTest
13:10:30 [2020-09-26T17:10:30.159Z] pushTag(org.eclipse.egit.ui.internal.push.PushTagsWizardTest)  Time elapsed: 0.931 s
13:10:30 [2020-09-26T17:10:30.159Z] Running org.eclipse.egit.ui.internal.push.PushToUpstreamTest
13:10:32 [2020-09-26T17:10:32.687Z] Tests run: 3, Failures: 0, Errors: 0, Skipped: 0, Time elapsed: 2.779 s - in org.eclipse.egit.ui.internal.push.PushToUpstreamTest
13:10:32 [2020-09-26T17:10:32.687Z] pushWithExistingUpstreamConfiguration(org.eclipse.egit.ui.internal.push.PushToUpstreamTest)  Time elapsed: 0.872 s
13:10:32 [2020-09-26T17:10:32.687Z] pushWithoutConfig(org.eclipse.egit.ui.internal.push.PushToUpstreamTest)  Time elapsed: 0.972 s
13:10:32 [2020-09-26T17:10:32.687Z] pushWithDefaultRemoteWithPushRefSpecs(org.eclipse.egit.ui.internal.push.PushToUpstreamTest)  Time elapsed: 0.928 s
13:10:32 [2020-09-26T17:10:32.687Z] Running org.eclipse.egit.ui.internal.branch.BranchProjectTrackerTest
13:10:34 [2020-09-26T17:10:34.057Z] Tests run: 1, Failures: 0, Errors: 0, Skipped: 0, Time elapsed: 1.131 s - in org.eclipse.egit.ui.internal.branch.BranchProjectTrackerTest
13:10:34 [2020-09-26T17:10:34.057Z] twoProjectsWithOnlyOneOnBranch(org.eclipse.egit.ui.internal.branch.BranchProjectTrackerTest)  Time elapsed: 1.127 s
13:10:34 [2020-09-26T17:10:34.057Z] Running org.eclipse.egit.ui.internal.decorators.DecoratableResourceAdapterTest
13:10:46 [2020-09-26T17:10:46.244Z] Tests run: 13, Failures: 0, Errors: 0, Skipped: 0, Time elapsed: 12.582 s - in org.eclipse.egit.ui.internal.decorators.DecoratableResourceAdapterTest
13:10:46 [2020-09-26T17:10:46.244Z] testDecorationDeletedFile(org.eclipse.egit.ui.internal.decorators.DecoratableResourceAdapterTest)  Time elapsed: 0.779 s
13:10:46 [2020-09-26T17:10:46.244Z] testDecorationModifiedFile(org.eclipse.egit.ui.internal.decorators.DecoratableResourceAdapterTest)  Time elapsed: 0.976 s
13:10:46 [2020-09-26T17:10:46.244Z] testDecorationEmptyProject(org.eclipse.egit.ui.internal.decorators.DecoratableResourceAdapterTest)  Time elapsed: 0.693 s
13:10:46 [2020-09-26T17:10:46.244Z] testDecorationConflictingFile(org.eclipse.egit.ui.internal.decorators.DecoratableResourceAdapterTest)  Time elapsed: 1.146 s
13:10:46 [2020-09-26T17:10:46.244Z] testDecorationNewEmptyFolder(org.eclipse.egit.ui.internal.decorators.DecoratableResourceAdapterTest)  Time elapsed: 1.018 s
13:10:46 [2020-09-26T17:10:46.244Z] testDecorationFolderPrefixOfOtherFolder(org.eclipse.egit.ui.internal.decorators.DecoratableResourceAdapterTest)  Time elapsed: 0.885 s
13:10:46 [2020-09-26T17:10:46.244Z] testDecorationNewFileInOneSubfolder(org.eclipse.egit.ui.internal.decorators.DecoratableResourceAdapterTest)  Time elapsed: 1.001 s
13:10:46 [2020-09-26T17:10:46.244Z] testDecorationNewFile(org.eclipse.egit.ui.internal.decorators.DecoratableResourceAdapterTest)  Time elapsed: 0.799 s
13:10:46 [2020-09-26T17:10:46.244Z] testDecorationNewFileInSubfolder(org.eclipse.egit.ui.internal.decorators.DecoratableResourceAdapterTest)  Time elapsed: 0.982 s
13:10:46 [2020-09-26T17:10:46.244Z] testDecorationCommittedFile(org.eclipse.egit.ui.internal.decorators.DecoratableResourceAdapterTest)  Time elapsed: 1.289 s
13:10:46 [2020-09-26T17:10:46.244Z] testDecorationFileInIgnoredFolder(org.eclipse.egit.ui.internal.decorators.DecoratableResourceAdapterTest)  Time elapsed: 0.794 s
13:10:46 [2020-09-26T17:10:46.244Z] testDecorationIgnoredFile(org.eclipse.egit.ui.internal.decorators.DecoratableResourceAdapterTest)  Time elapsed: 1.385 s
13:10:46 [2020-09-26T17:10:46.244Z] testDecorationAddedFile(org.eclipse.egit.ui.internal.decorators.DecoratableResourceAdapterTest)  Time elapsed: 0.797 s
13:10:46 [2020-09-26T17:10:46.244Z] Running org.eclipse.egit.ui.internal.decorators.DecoratableWorkingSetTest
13:10:54 [2020-09-26T17:10:54.346Z] Tests run: 7, Failures: 0, Errors: 0, Skipped: 0, Time elapsed: 7.426 s - in org.eclipse.egit.ui.internal.decorators.DecoratableWorkingSetTest
13:10:54 [2020-09-26T17:10:54.346Z] testAnyConflictsIsConflicts(org.eclipse.egit.ui.internal.decorators.DecoratableWorkingSetTest)  Time elapsed: 1.625 s
13:10:54 [2020-09-26T17:10:54.346Z] testUntrackedContentIsUndecorated(org.eclipse.egit.ui.internal.decorators.DecoratableWorkingSetTest)  Time elapsed: 0.791 s
13:10:54 [2020-09-26T17:10:54.346Z] testAnyDirtyIsDirty(org.eclipse.egit.ui.internal.decorators.DecoratableWorkingSetTest)  Time elapsed: 1.154 s
13:10:54 [2020-09-26T17:10:54.346Z] testDecorationConflictingOverDirty(org.eclipse.egit.ui.internal.decorators.DecoratableWorkingSetTest)  Time elapsed: 0.959 s
13:10:54 [2020-09-26T17:10:54.346Z] testEmptyWorkingSetIsUndecorated(org.eclipse.egit.ui.internal.decorators.DecoratableWorkingSetTest)  Time elapsed: 1.004 s
13:10:54 [2020-09-26T17:10:54.346Z] testStagingStateHasNoInfluence_Modified(org.eclipse.egit.ui.internal.decorators.DecoratableWorkingSetTest)  Time elapsed: 0.995 s
13:10:54 [2020-09-26T17:10:54.346Z] testAnyTrackedIsTracked(org.eclipse.egit.ui.internal.decorators.DecoratableWorkingSetTest)  Time elapsed: 0.894 s
13:10:54 [2020-09-26T17:10:54.346Z] Running org.eclipse.egit.ui.internal.decorators.DecoratableResourceMappingTest
13:11:02 [2020-09-26T17:11:02.448Z] Tests run: 9, Failures: 0, Errors: 0, Skipped: 0, Time elapsed: 8.056 s - in org.eclipse.egit.ui.internal.decorators.DecoratableResourceMappingTest
13:11:02 [2020-09-26T17:11:02.448Z] testAnyConflictsIsConflicts(org.eclipse.egit.ui.internal.decorators.DecoratableResourceMappingTest)  Time elapsed: 1.173 s
13:11:02 [2020-09-26T17:11:02.448Z] testSameStagingStateIsState_Added(org.eclipse.egit.ui.internal.decorators.DecoratableResourceMappingTest)  Time elapsed: 0.802 s
13:11:02 [2020-09-26T17:11:02.448Z] testAnyDirtyIsDirty(org.eclipse.egit.ui.internal.decorators.DecoratableResourceMappingTest)  Time elapsed: 0.896 s
13:11:02 [2020-09-26T17:11:02.448Z] testMixedStagingStateIsModified_RemovedAdded(org.eclipse.egit.ui.internal.decorators.DecoratableResourceMappingTest)  Time elapsed: 0.806 s
13:11:02 [2020-09-26T17:11:02.448Z] testAllIgnoredIsUnstaged(org.eclipse.egit.ui.internal.decorators.DecoratableResourceMappingTest)  Time elapsed: 0.993 s
13:11:02 [2020-09-26T17:11:02.448Z] testDecorationConflictingOverDirty(org.eclipse.egit.ui.internal.decorators.DecoratableResourceMappingTest)  Time elapsed: 0.862 s
13:11:02 [2020-09-26T17:11:02.448Z] testMixedStagingStateIsModified_AddedNotStaged(org.eclipse.egit.ui.internal.decorators.DecoratableResourceMappingTest)  Time elapsed: 0.894 s
13:11:02 [2020-09-26T17:11:02.448Z] testNewResourceMappingIsUnstaged(org.eclipse.egit.ui.internal.decorators.DecoratableResourceMappingTest)  Time elapsed: 0.789 s
13:11:02 [2020-09-26T17:11:02.448Z] testAnyTrackedIsTracked(org.eclipse.egit.ui.internal.decorators.DecoratableResourceMappingTest)  Time elapsed: 0.801 s
13:11:02 [2020-09-26T17:11:02.448Z] Running org.eclipse.egit.ui.internal.fetch.FetchGerritChangeTest
13:11:02 [2020-09-26T17:11:02.448Z] Tests run: 15, Failures: 0, Errors: 0, Skipped: 0, Time elapsed: 0.004 s - in org.eclipse.egit.ui.internal.fetch.FetchGerritChangeTest
13:11:02 [2020-09-26T17:11:02.448Z] testChangeStringNoDigits(org.eclipse.egit.ui.internal.fetch.FetchGerritChangeTest)  Time elapsed: 0.002 s
13:11:02 [2020-09-26T17:11:02.448Z] testChangeStringOverflow(org.eclipse.egit.ui.internal.fetch.FetchGerritChangeTest)  Time elapsed: 0 s
13:11:02 [2020-09-26T17:11:02.448Z] testChangeStringTwoNumbers(org.eclipse.egit.ui.internal.fetch.FetchGerritChangeTest)  Time elapsed: 0.001 s
13:11:02 [2020-09-26T17:11:02.448Z] testFromRef(org.eclipse.egit.ui.internal.fetch.FetchGerritChangeTest)  Time elapsed: 0 s
13:11:02 [2020-09-26T17:11:02.448Z] testChangeStringNegative(org.eclipse.egit.ui.internal.fetch.FetchGerritChangeTest)  Time elapsed: 0 s
13:11:02 [2020-09-26T17:11:02.448Z] testChangeStringUri(org.eclipse.egit.ui.internal.fetch.FetchGerritChangeTest)  Time elapsed: 0 s
13:11:02 [2020-09-26T17:11:02.448Z] testRefFromChange(org.eclipse.egit.ui.internal.fetch.FetchGerritChangeTest)  Time elapsed: 0.001 s
13:11:02 [2020-09-26T17:11:02.448Z] testChangeStringUriNonsense(org.eclipse.egit.ui.internal.fetch.FetchGerritChangeTest)  Time elapsed: 0 s
13:11:02 [2020-09-26T17:11:02.448Z] testChangeStringThreeNumbers(org.eclipse.egit.ui.internal.fetch.FetchGerritChangeTest)  Time elapsed: 0 s
13:11:02 [2020-09-26T17:11:02.448Z] testChangeStringMultiline(org.eclipse.egit.ui.internal.fetch.FetchGerritChangeTest)  Time elapsed: 0 s
13:11:02 [2020-09-26T17:11:02.448Z] testChangeStringSingleNumber(org.eclipse.egit.ui.internal.fetch.FetchGerritChangeTest)  Time elapsed: 0 s
13:11:02 [2020-09-26T17:11:02.448Z] testChangeRefs(org.eclipse.egit.ui.internal.fetch.FetchGerritChangeTest)  Time elapsed: 0 s
13:11:02 [2020-09-26T17:11:02.448Z] testChangeStringEmpty(org.eclipse.egit.ui.internal.fetch.FetchGerritChangeTest)  Time elapsed: 0 s
13:11:02 [2020-09-26T17:11:02.448Z] testChangeStringNull(org.eclipse.egit.ui.internal.fetch.FetchGerritChangeTest)  Time elapsed: 0 s
13:11:02 [2020-09-26T17:11:02.448Z] testChangeStringZero(org.eclipse.egit.ui.internal.fetch.FetchGerritChangeTest)  Time elapsed: 0 s
13:11:02 [2020-09-26T17:11:02.448Z] Running org.eclipse.egit.ui.submodule.SubmoduleUpdateTest
13:11:02 [2020-09-26T17:11:02.705Z] 
13:11:02 [2020-09-26T17:11:02.705Z] (SWT:1587): Gtk-WARNING **: 17:11:02.445: Negative content width -6 (allocation 1, extents 4x3) while allocating gadget (node toolbar, owner GtkToolbar)
13:11:05 [2020-09-26T17:11:05.231Z] 
13:11:05 [2020-09-26T17:11:05.231Z] (SWT:1587): Gtk-WARNING **: 17:11:04.628: Negative content width -6 (allocation 1, extents 4x3) while allocating gadget (node toolbar, owner GtkToolbar)
13:11:05 [2020-09-26T17:11:05.231Z] Tests run: 1, Failures: 0, Errors: 0, Skipped: 0, Time elapsed: 3.015 s - in org.eclipse.egit.ui.submodule.SubmoduleUpdateTest
13:11:05 [2020-09-26T17:11:05.231Z] updateSubmodule(org.eclipse.egit.ui.submodule.SubmoduleUpdateTest)  Time elapsed: 3.011 s
13:11:05 [2020-09-26T17:11:05.231Z] Running org.eclipse.egit.ui.submodule.SubmoduleAddTest
13:11:05 [2020-09-26T17:11:05.488Z] 
13:11:05 [2020-09-26T17:11:05.488Z] (SWT:1587): Gtk-WARNING **: 17:11:05.479: Negative content width -6 (allocation 1, extents 4x3) while allocating gadget (node toolbar, owner GtkToolbar)
13:11:08 [2020-09-26T17:11:08.014Z] 
13:11:08 [2020-09-26T17:11:08.014Z] (SWT:1587): Gtk-WARNING **: 17:11:07.865: Negative content width -6 (allocation 1, extents 4x3) while allocating gadget (node toolbar, owner GtkToolbar)
13:11:08 [2020-09-26T17:11:08.014Z] Tests run: 1, Failures: 0, Errors: 0, Skipped: 0, Time elapsed: 3.234 s - in org.eclipse.egit.ui.submodule.SubmoduleAddTest
13:11:08 [2020-09-26T17:11:08.014Z] addAtRoot(org.eclipse.egit.ui.submodule.SubmoduleAddTest)  Time elapsed: 3.23 s
13:11:08 [2020-09-26T17:11:08.014Z] Running org.eclipse.egit.ui.submodule.SubmoduleSyncTest
13:11:08 [2020-09-26T17:11:08.947Z] 
13:11:08 [2020-09-26T17:11:08.947Z] (SWT:1587): Gtk-WARNING **: 17:11:08.717: Negative content width -6 (allocation 1, extents 4x3) while allocating gadget (node toolbar, owner GtkToolbar)
13:11:11 [2020-09-26T17:11:11.483Z] 
13:11:11 [2020-09-26T17:11:11.483Z] (SWT:1587): Gtk-WARNING **: 17:11:11.395: Negative content width -6 (allocation 1, extents 4x3) while allocating gadget (node toolbar, owner GtkToolbar)
13:11:11 [2020-09-26T17:11:11.741Z] Tests run: 1, Failures: 0, Errors: 0, Skipped: 0, Time elapsed: 3.529 s - in org.eclipse.egit.ui.submodule.SubmoduleSyncTest
13:11:11 [2020-09-26T17:11:11.741Z] syncSubmodule(org.eclipse.egit.ui.submodule.SubmoduleSyncTest)  Time elapsed: 3.525 s
13:11:11 [2020-09-26T17:11:11.741Z] Running org.eclipse.egit.ui.httpauth.PushTest
13:11:11 [2020-09-26T17:11:11.741Z] 2020-09-26 17:11:11.571:INFO:oejs.Server:WorkbenchTestable: jetty-9.4.30.v20200611; built: 2020-06-16T05:54:33.713Z; git: 271836e4c1f4612f12b7bb13ef5a92a927634b0d; jvm 1.8.0_262-b10
13:11:11 [2020-09-26T17:11:11.741Z] 2020-09-26 17:11:11.572:INFO:oejsh.ContextHandler:WorkbenchTestable: Started o.e.j.s.ServletContextHandler@d47c433{/sbasic,null,AVAILABLE}
13:11:11 [2020-09-26T17:11:11.741Z] 2020-09-26 17:11:11.577:INFO:oejs.AbstractConnector:WorkbenchTestable: Started ServerConnector@2d7163a0{HTTP/1.1, (http/1.1)}{127.0.0.1:40750}
13:11:11 [2020-09-26T17:11:11.741Z] 2020-09-26 17:11:11.578:INFO:oejs.Server:WorkbenchTestable: Started @739074ms
13:11:12 [2020-09-26T17:11:12.674Z] 
13:11:12 [2020-09-26T17:11:12.674Z] (SWT:1587): Gtk-CRITICAL **: 17:11:12.344: gtk_box_gadget_distribute: assertion 'size >= 0' failed in GtkCheckButton
13:11:13 [2020-09-26T17:11:13.242Z] 2020-09-26 17:11:13.199:INFO:oejs.AbstractConnector:WorkbenchTestable: Stopped ServerConnector@2d7163a0{HTTP/1.1, (http/1.1)}{127.0.0.1:0}
13:11:13 [2020-09-26T17:11:13.242Z] 2020-09-26 17:11:13.200:INFO:oejsh.ContextHandler:WorkbenchTestable: Stopped o.e.j.s.ServletContextHandler@d47c433{/sbasic,null,UNAVAILABLE}
13:11:13 [2020-09-26T17:11:13.242Z] Tests run: 1, Failures: 0, Errors: 0, Skipped: 0, Time elapsed: 1.706 s - in org.eclipse.egit.ui.httpauth.PushTest
13:11:13 [2020-09-26T17:11:13.242Z] testPush(org.eclipse.egit.ui.httpauth.PushTest)  Time elapsed: 1.706 s
13:11:13 [2020-09-26T17:11:13.242Z] Running org.eclipse.egit.ui.search.CommitSearchDialogTest
13:11:14 [2020-09-26T17:11:14.174Z] 
13:11:14 [2020-09-26T17:11:14.174Z] (SWT:1587): Gtk-WARNING **: 17:11:13.888: Negative content width -6 (allocation 1, extents 4x3) while allocating gadget (node toolbar, owner GtkToolbar)
13:11:14 [2020-09-26T17:11:14.174Z] 
13:11:14 [2020-09-26T17:11:14.174Z] (SWT:1587): Gtk-WARNING **: 17:11:13.900: Negative content width -6 (allocation 1, extents 4x3) while allocating gadget (node toolbar, owner GtkToolbar)
13:11:14 [2020-09-26T17:11:14.174Z] 
13:11:14 [2020-09-26T17:11:14.174Z] (SWT:1587): Gtk-WARNING **: 17:11:13.963: Negative content width -6 (allocation 1, extents 4x3) while allocating gadget (node toolbar, owner GtkToolbar)
13:11:14 [2020-09-26T17:11:14.174Z] 
13:11:14 [2020-09-26T17:11:14.174Z] (SWT:1587): Gtk-WARNING **: 17:11:14.014: Negative content width -6 (allocation 1, extents 4x3) while allocating gadget (node toolbar, owner GtkToolbar)
13:11:14 [2020-09-26T17:11:14.738Z] 
13:11:14 [2020-09-26T17:11:14.738Z] (SWT:1587): Gtk-WARNING **: 17:11:14.655: Negative content width -6 (allocation 1, extents 4x3) while allocating gadget (node toolbar, owner GtkToolbar)
13:11:14 [2020-09-26T17:11:14.994Z] Tests run: 1, Failures: 0, Errors: 0, Skipped: 0, Time elapsed: 1.557 s - in org.eclipse.egit.ui.search.CommitSearchDialogTest
13:11:14 [2020-09-26T17:11:14.994Z] openCommitTabOnSearchDialog(org.eclipse.egit.ui.search.CommitSearchDialogTest)  Time elapsed: 1.554 s
13:11:14 [2020-09-26T17:11:14.994Z] Running org.eclipse.egit.ui.search.CommitSearchQueryTest
13:11:20 [2020-09-26T17:11:20.249Z] Tests run: 7, Failures: 0, Errors: 0, Skipped: 0, Time elapsed: 4.9 s - in org.eclipse.egit.ui.search.CommitSearchQueryTest
13:11:20 [2020-09-26T17:11:20.249Z] testQuery(org.eclipse.egit.ui.search.CommitSearchQueryTest)  Time elapsed: 0.658 s
13:11:20 [2020-09-26T17:11:20.249Z] testMatchMessage(org.eclipse.egit.ui.search.CommitSearchQueryTest)  Time elapsed: 0.79 s
13:11:20 [2020-09-26T17:11:20.249Z] testCaseInsensitive(org.eclipse.egit.ui.search.CommitSearchQueryTest)  Time elapsed: 0.756 s
13:11:20 [2020-09-26T17:11:20.249Z] testMatchCommit(org.eclipse.egit.ui.search.CommitSearchQueryTest)  Time elapsed: 0.796 s
13:11:20 [2020-09-26T17:11:20.249Z] testMatchParent(org.eclipse.egit.ui.search.CommitSearchQueryTest)  Time elapsed: 0.599 s
13:11:20 [2020-09-26T17:11:20.249Z] testMatchTree(org.eclipse.egit.ui.search.CommitSearchQueryTest)  Time elapsed: 0.684 s
13:11:20 [2020-09-26T17:11:20.249Z] testEmptyMatches(org.eclipse.egit.ui.search.CommitSearchQueryTest)  Time elapsed: 0.603 s
13:11:20 [2020-09-26T17:11:20.249Z] Running org.eclipse.egit.ui.gitflow.CommandEnablementTest
13:11:21 [2020-09-26T17:11:21.623Z] 
13:11:21 [2020-09-26T17:11:21.623Z] (SWT:1587): Gtk-WARNING **: 17:11:21.191: Negative content width -6 (allocation 1, extents 4x3) while allocating gadget (node toolbar, owner GtkToolbar)
13:11:21 [2020-09-26T17:11:21.623Z] 
13:11:21 [2020-09-26T17:11:21.623Z] (SWT:1587): Gtk-WARNING **: 17:11:21.343: Negative content width -6 (allocation 1, extents 4x3) while allocating gadget (node toolbar, owner GtkToolbar)
13:11:21 [2020-09-26T17:11:21.623Z] Tests run: 2, Failures: 0, Errors: 0, Skipped: 0, Time elapsed: 1.848 s - in org.eclipse.egit.ui.gitflow.CommandEnablementTest
13:11:21 [2020-09-26T17:11:21.623Z] testPackageExplorerStartFinishEnablement(org.eclipse.egit.ui.gitflow.CommandEnablementTest)  Time elapsed: 0.696 s
13:11:21 [2020-09-26T17:11:21.624Z] testRepositoryViewStartFinishEnablement(org.eclipse.egit.ui.gitflow.CommandEnablementTest)  Time elapsed: 1.146 s
13:11:21 [2020-09-26T17:11:21.624Z] Running org.eclipse.egit.ui.gitflow.FeatureFinishSquashHandlerTest
13:11:22 [2020-09-26T17:11:22.554Z] 
13:11:22 [2020-09-26T17:11:22.555Z] (SWT:1587): Gtk-CRITICAL **: 17:11:22.239: gtk_box_gadget_distribute: assertion 'size >= 0' failed in GtkScrollbar
13:11:22 [2020-09-26T17:11:22.555Z] 
13:11:22 [2020-09-26T17:11:22.555Z] (SWT:1587): Gtk-CRITICAL **: 17:11:22.259: gtk_box_gadget_distribute: assertion 'size >= 0' failed in GtkScrollbar
13:11:22 [2020-09-26T17:11:22.555Z] 
13:11:22 [2020-09-26T17:11:22.555Z] (SWT:1587): Gtk-CRITICAL **: 17:11:22.275: gtk_box_gadget_distribute: assertion 'size >= 0' failed in GtkScrollbar
13:11:22 [2020-09-26T17:11:22.555Z] 
13:11:22 [2020-09-26T17:11:22.555Z] (SWT:1587): Gtk-CRITICAL **: 17:11:22.291: gtk_box_gadget_distribute: assertion 'size >= 0' failed in GtkScrollbar
13:11:22 [2020-09-26T17:11:22.555Z] 
13:11:22 [2020-09-26T17:11:22.555Z] (SWT:1587): Gtk-CRITICAL **: 17:11:22.308: gtk_box_gadget_distribute: assertion 'size >= 0' failed in GtkScrollbar
13:11:22 [2020-09-26T17:11:22.555Z] 
13:11:22 [2020-09-26T17:11:22.555Z] (SWT:1587): Gtk-CRITICAL **: 17:11:22.327: gtk_box_gadget_distribute: assertion 'size >= 0' failed in GtkScrollbar
13:11:22 [2020-09-26T17:11:22.555Z] 
13:11:22 [2020-09-26T17:11:22.555Z] (SWT:1587): Gtk-CRITICAL **: 17:11:22.341: gtk_box_gadget_distribute: assertion 'size >= 0' failed in GtkScrollbar
13:11:22 [2020-09-26T17:11:22.555Z] 
13:11:22 [2020-09-26T17:11:22.555Z] (SWT:1587): Gtk-CRITICAL **: 17:11:22.358: gtk_box_gadget_distribute: assertion 'size >= 0' failed in GtkScrollbar
13:11:22 [2020-09-26T17:11:22.555Z] 
13:11:22 [2020-09-26T17:11:22.555Z] (SWT:1587): Gtk-CRITICAL **: 17:11:22.375: gtk_box_gadget_distribute: assertion 'size >= 0' failed in GtkScrollbar
13:11:22 [2020-09-26T17:11:22.555Z] 
13:11:22 [2020-09-26T17:11:22.555Z] (SWT:1587): Gtk-CRITICAL **: 17:11:22.392: gtk_box_gadget_distribute: assertion 'size >= 0' failed in GtkScrollbar
13:11:22 [2020-09-26T17:11:22.555Z] 
13:11:22 [2020-09-26T17:11:22.555Z] (SWT:1587): Gtk-CRITICAL **: 17:11:22.408: gtk_box_gadget_distribute: assertion 'size >= 0' failed in GtkScrollbar
13:11:22 [2020-09-26T17:11:22.555Z] 
13:11:22 [2020-09-26T17:11:22.555Z] (SWT:1587): Gtk-CRITICAL **: 17:11:22.424: gtk_box_gadget_distribute: assertion 'size >= 0' failed in GtkScrollbar
13:11:22 [2020-09-26T17:11:22.555Z] 
13:11:22 [2020-09-26T17:11:22.555Z] (SWT:1587): Gtk-CRITICAL **: 17:11:22.441: gtk_box_gadget_distribute: assertion 'size >= 0' failed in GtkScrollbar
13:11:23 [2020-09-26T17:11:23.120Z] 
13:11:23 [2020-09-26T17:11:23.120Z] (SWT:1587): Gtk-CRITICAL **: 17:11:22.954: gtk_box_gadget_distribute: assertion 'size >= 0' failed in GtkScrollbar
13:11:23 [2020-09-26T17:11:23.707Z] Tests run: 1, Failures: 0, Errors: 0, Skipped: 0, Time elapsed: 2.149 s - in org.eclipse.egit.ui.gitflow.FeatureFinishSquashHandlerTest
13:11:23 [2020-09-26T17:11:23.707Z] testFeatureFinishSquash(org.eclipse.egit.ui.gitflow.FeatureFinishSquashHandlerTest)  Time elapsed: 2.145 s
13:11:23 [2020-09-26T17:11:23.707Z] Running org.eclipse.egit.ui.gitflow.FeatureStartFinishHandlerTest
13:11:24 [2020-09-26T17:11:24.638Z] 
13:11:24 [2020-09-26T17:11:24.638Z] (SWT:1587): Gtk-CRITICAL **: 17:11:24.356: gtk_box_gadget_distribute: assertion 'size >= 0' failed in GtkScrollbar
13:11:24 [2020-09-26T17:11:24.638Z] 
13:11:24 [2020-09-26T17:11:24.638Z] (SWT:1587): Gtk-CRITICAL **: 17:11:24.368: gtk_box_gadget_distribute: assertion 'size >= 0' failed in GtkScrollbar
13:11:24 [2020-09-26T17:11:24.638Z] 
13:11:24 [2020-09-26T17:11:24.638Z] (SWT:1587): Gtk-CRITICAL **: 17:11:24.385: gtk_box_gadget_distribute: assertion 'size >= 0' failed in GtkScrollbar
13:11:24 [2020-09-26T17:11:24.638Z] 
13:11:24 [2020-09-26T17:11:24.638Z] (SWT:1587): Gtk-CRITICAL **: 17:11:24.401: gtk_box_gadget_distribute: assertion 'size >= 0' failed in GtkScrollbar
13:11:24 [2020-09-26T17:11:24.638Z] 
13:11:24 [2020-09-26T17:11:24.638Z] (SWT:1587): Gtk-CRITICAL **: 17:11:24.418: gtk_box_gadget_distribute: assertion 'size >= 0' failed in GtkScrollbar
13:11:24 [2020-09-26T17:11:24.638Z] 
13:11:24 [2020-09-26T17:11:24.638Z] (SWT:1587): Gtk-CRITICAL **: 17:11:24.435: gtk_box_gadget_distribute: assertion 'size >= 0' failed in GtkScrollbar
13:11:24 [2020-09-26T17:11:24.638Z] 
13:11:24 [2020-09-26T17:11:24.638Z] (SWT:1587): Gtk-CRITICAL **: 17:11:24.451: gtk_box_gadget_distribute: assertion 'size >= 0' failed in GtkScrollbar
13:11:24 [2020-09-26T17:11:24.638Z] 
13:11:24 [2020-09-26T17:11:24.638Z] (SWT:1587): Gtk-CRITICAL **: 17:11:24.467: gtk_box_gadget_distribute: assertion 'size >= 0' failed in GtkScrollbar
13:11:24 [2020-09-26T17:11:24.638Z] 
13:11:24 [2020-09-26T17:11:24.638Z] (SWT:1587): Gtk-CRITICAL **: 17:11:24.485: gtk_box_gadget_distribute: assertion 'size >= 0' failed in GtkScrollbar
13:11:24 [2020-09-26T17:11:24.638Z] 
13:11:24 [2020-09-26T17:11:24.638Z] (SWT:1587): Gtk-CRITICAL **: 17:11:24.501: gtk_box_gadget_distribute: assertion 'size >= 0' failed in GtkScrollbar
13:11:24 [2020-09-26T17:11:24.638Z] 
13:11:24 [2020-09-26T17:11:24.638Z] (SWT:1587): Gtk-CRITICAL **: 17:11:24.518: gtk_box_gadget_distribute: assertion 'size >= 0' failed in GtkScrollbar
13:11:24 [2020-09-26T17:11:24.638Z] 
13:11:24 [2020-09-26T17:11:24.638Z] (SWT:1587): Gtk-CRITICAL **: 17:11:24.535: gtk_box_gadget_distribute: assertion 'size >= 0' failed in GtkScrollbar
13:11:24 [2020-09-26T17:11:24.638Z] 
13:11:24 [2020-09-26T17:11:24.638Z] (SWT:1587): Gtk-CRITICAL **: 17:11:24.551: gtk_box_gadget_distribute: assertion 'size >= 0' failed in GtkScrollbar
13:11:24 [2020-09-26T17:11:24.638Z] 
13:11:24 [2020-09-26T17:11:24.638Z] (SWT:1587): Gtk-CRITICAL **: 17:11:24.568: gtk_box_gadget_distribute: assertion 'size >= 0' failed in GtkScrollbar
13:11:24 [2020-09-26T17:11:24.638Z] 
13:11:24 [2020-09-26T17:11:24.638Z] (SWT:1587): Gtk-CRITICAL **: 17:11:24.584: gtk_box_gadget_distribute: assertion 'size >= 0' failed in GtkScrollbar
13:11:25 [2020-09-26T17:11:25.202Z] 
13:11:25 [2020-09-26T17:11:25.202Z] (SWT:1587): Gtk-CRITICAL **: 17:11:25.115: gtk_box_gadget_distribute: assertion 'size >= 0' failed in GtkScrollbar
13:11:25 [2020-09-26T17:11:25.765Z] Tests run: 1, Failures: 0, Errors: 0, Skipped: 0, Time elapsed: 2.065 s - in org.eclipse.egit.ui.gitflow.FeatureStartFinishHandlerTest
13:11:25 [2020-09-26T17:11:25.765Z] testFeatureStart(org.eclipse.egit.ui.gitflow.FeatureStartFinishHandlerTest)  Time elapsed: 2.061 s
13:11:25 [2020-09-26T17:11:25.765Z] Running org.eclipse.egit.ui.gitflow.FeatureFinishKeepBranchHandlerTest
13:11:26 [2020-09-26T17:11:26.696Z] 
13:11:26 [2020-09-26T17:11:26.696Z] (SWT:1587): Gtk-CRITICAL **: 17:11:26.391: gtk_box_gadget_distribute: assertion 'size >= 0' failed in GtkScrollbar
13:11:26 [2020-09-26T17:11:26.696Z] 
13:11:26 [2020-09-26T17:11:26.696Z] (SWT:1587): Gtk-CRITICAL **: 17:11:26.403: gtk_box_gadget_distribute: assertion 'size >= 0' failed in GtkScrollbar
13:11:26 [2020-09-26T17:11:26.696Z] 
13:11:26 [2020-09-26T17:11:26.696Z] (SWT:1587): Gtk-CRITICAL **: 17:11:26.420: gtk_box_gadget_distribute: assertion 'size >= 0' failed in GtkScrollbar
13:11:26 [2020-09-26T17:11:26.696Z] 
13:11:26 [2020-09-26T17:11:26.696Z] (SWT:1587): Gtk-CRITICAL **: 17:11:26.437: gtk_box_gadget_distribute: assertion 'size >= 0' failed in GtkScrollbar
13:11:26 [2020-09-26T17:11:26.696Z] 
13:11:26 [2020-09-26T17:11:26.696Z] (SWT:1587): Gtk-CRITICAL **: 17:11:26.453: gtk_box_gadget_distribute: assertion 'size >= 0' failed in GtkScrollbar
13:11:26 [2020-09-26T17:11:26.696Z] 
13:11:26 [2020-09-26T17:11:26.696Z] (SWT:1587): Gtk-CRITICAL **: 17:11:26.470: gtk_box_gadget_distribute: assertion 'size >= 0' failed in GtkScrollbar
13:11:26 [2020-09-26T17:11:26.696Z] 
13:11:26 [2020-09-26T17:11:26.696Z] (SWT:1587): Gtk-CRITICAL **: 17:11:26.486: gtk_box_gadget_distribute: assertion 'size >= 0' failed in GtkScrollbar
13:11:26 [2020-09-26T17:11:26.696Z] 
13:11:26 [2020-09-26T17:11:26.696Z] (SWT:1587): Gtk-CRITICAL **: 17:11:26.504: gtk_box_gadget_distribute: assertion 'size >= 0' failed in GtkScrollbar
13:11:26 [2020-09-26T17:11:26.696Z] 
13:11:26 [2020-09-26T17:11:26.696Z] (SWT:1587): Gtk-CRITICAL **: 17:11:26.520: gtk_box_gadget_distribute: assertion 'size >= 0' failed in GtkScrollbar
13:11:26 [2020-09-26T17:11:26.696Z] 
13:11:26 [2020-09-26T17:11:26.696Z] (SWT:1587): Gtk-CRITICAL **: 17:11:26.536: gtk_box_gadget_distribute: assertion 'size >= 0' failed in GtkScrollbar
13:11:26 [2020-09-26T17:11:26.696Z] 
13:11:26 [2020-09-26T17:11:26.696Z] (SWT:1587): Gtk-CRITICAL **: 17:11:26.554: gtk_box_gadget_distribute: assertion 'size >= 0' failed in GtkScrollbar
13:11:26 [2020-09-26T17:11:26.696Z] 
13:11:26 [2020-09-26T17:11:26.696Z] (SWT:1587): Gtk-CRITICAL **: 17:11:26.570: gtk_box_gadget_distribute: assertion 'size >= 0' failed in GtkScrollbar
13:11:26 [2020-09-26T17:11:26.696Z] 
13:11:26 [2020-09-26T17:11:26.696Z] (SWT:1587): Gtk-CRITICAL **: 17:11:26.586: gtk_box_gadget_distribute: assertion 'size >= 0' failed in GtkScrollbar
13:11:26 [2020-09-26T17:11:26.696Z] 
13:11:26 [2020-09-26T17:11:26.696Z] (SWT:1587): Gtk-CRITICAL **: 17:11:26.604: gtk_box_gadget_distribute: assertion 'size >= 0' failed in GtkScrollbar
13:11:27 [2020-09-26T17:11:27.260Z] 
13:11:27 [2020-09-26T17:11:27.260Z] (SWT:1587): Gtk-CRITICAL **: 17:11:27.151: gtk_box_gadget_distribute: assertion 'size >= 0' failed in GtkScrollbar
13:11:27 [2020-09-26T17:11:27.824Z] Tests run: 1, Failures: 0, Errors: 0, Skipped: 0, Time elapsed: 2.002 s - in org.eclipse.egit.ui.gitflow.FeatureFinishKeepBranchHandlerTest
13:11:27 [2020-09-26T17:11:27.824Z] testFeatureFinishKeepBranch(org.eclipse.egit.ui.gitflow.FeatureFinishKeepBranchHandlerTest)  Time elapsed: 1.998 s
13:11:27 [2020-09-26T17:11:27.824Z] Running org.eclipse.egit.ui.gitflow.FeatureRebaseHandlerTest
13:11:28 [2020-09-26T17:11:28.778Z] 
13:11:28 [2020-09-26T17:11:28.778Z] (SWT:1587): Gtk-WARNING **: 17:11:28.531: Negative content width -6 (allocation 1, extents 4x3) while allocating gadget (node toolbar, owner GtkToolbar)
13:11:28 [2020-09-26T17:11:28.778Z] 
13:11:28 [2020-09-26T17:11:28.778Z] (SWT:1587): Gtk-WARNING **: 17:11:28.536: Negative content width -6 (allocation 1, extents 4x3) while allocating gadget (node toolbar, owner GtkToolbar)
13:11:28 [2020-09-26T17:11:28.778Z] 
13:11:28 [2020-09-26T17:11:28.778Z] (SWT:1587): Gtk-WARNING **: 17:11:28.540: Negative content width -6 (allocation 1, extents 4x3) while allocating gadget (node toolbar, owner GtkToolbar)
13:11:28 [2020-09-26T17:11:28.778Z] 
13:11:28 [2020-09-26T17:11:28.778Z] (SWT:1587): Gtk-WARNING **: 17:11:28.541: Negative content width -6 (allocation 1, extents 4x3) while allocating gadget (node toolbar, owner GtkToolbar)
13:11:28 [2020-09-26T17:11:28.778Z] 
13:11:28 [2020-09-26T17:11:28.778Z] (SWT:1587): Gtk-WARNING **: 17:11:28.541: Negative content width -6 (allocation 1, extents 4x3) while allocating gadget (node toolbar, owner GtkToolbar)
13:11:28 [2020-09-26T17:11:28.778Z] 
13:11:28 [2020-09-26T17:11:28.778Z] (SWT:1587): Gtk-WARNING **: 17:11:28.571: Negative content width -6 (allocation 1, extents 4x3) while allocating gadget (node toolbar, owner GtkToolbar)
13:11:29 [2020-09-26T17:11:29.035Z] 
13:11:29 [2020-09-26T17:11:29.035Z] (SWT:1587): Gtk-WARNING **: 17:11:29.009: Negative content height -1 (allocation 1, extents 1x1) while allocating gadget (node scrolledwindow, owner GtkScrolledWindow)
13:11:29 [2020-09-26T17:11:29.035Z] 
13:11:29 [2020-09-26T17:11:29.035Z] (SWT:1587): Gtk-CRITICAL **: 17:11:29.009: gtk_box_gadget_distribute: assertion 'size >= 0' failed in GtkScrollbar
13:11:29 [2020-09-26T17:11:29.292Z] 
13:11:29 [2020-09-26T17:11:29.292Z] (SWT:1587): Gtk-WARNING **: 17:11:29.058: Negative content width -6 (allocation 1, extents 4x3) while allocating gadget (node toolbar, owner GtkToolbar)
13:11:30 [2020-09-26T17:11:30.664Z] 
13:11:30 [2020-09-26T17:11:30.664Z] (SWT:1587): Gtk-WARNING **: 17:11:30.386: Negative content height -1 (allocation 1, extents 1x1) while allocating gadget (node scrolledwindow, owner GtkScrolledWindow)
13:11:30 [2020-09-26T17:11:30.664Z] 
13:11:30 [2020-09-26T17:11:30.664Z] (SWT:1587): Gtk-CRITICAL **: 17:11:30.386: gtk_box_gadget_distribute: assertion 'size >= 0' failed in GtkScrollbar
13:11:30 [2020-09-26T17:11:30.664Z] Tests run: 2, Failures: 0, Errors: 0, Skipped: 0, Time elapsed: 2.77 s - in org.eclipse.egit.ui.gitflow.FeatureRebaseHandlerTest
13:11:30 [2020-09-26T17:11:30.664Z] testRebaseFailOnConflict(org.eclipse.egit.ui.gitflow.FeatureRebaseHandlerTest)  Time elapsed: 1.414 s
13:11:30 [2020-09-26T17:11:30.664Z] testRebaseFailOnDirtyWorkingDirectory(org.eclipse.egit.ui.gitflow.FeatureRebaseHandlerTest)  Time elapsed: 1.349 s
13:11:30 [2020-09-26T17:11:30.664Z] Running org.eclipse.egit.ui.gitflow.InitHandlerTest
13:11:33 [2020-09-26T17:11:33.939Z] Tests run: 3, Failures: 0, Errors: 0, Skipped: 0, Time elapsed: 3.409 s - in org.eclipse.egit.ui.gitflow.InitHandlerTest
13:11:33 [2020-09-26T17:11:33.939Z] testInit(org.eclipse.egit.ui.gitflow.InitHandlerTest)  Time elapsed: 0.767 s
13:11:33 [2020-09-26T17:11:33.939Z] testInitEmptyRepoMissingMaster(org.eclipse.egit.ui.gitflow.InitHandlerTest)  Time elapsed: 1.437 s
13:11:33 [2020-09-26T17:11:33.939Z] testInitMissingMaster(org.eclipse.egit.ui.gitflow.InitHandlerTest)  Time elapsed: 1.198 s
13:11:33 [2020-09-26T17:11:33.939Z] Running org.eclipse.egit.ui.gitflow.FeatureStartCheckoutConflictTest
13:11:34 [2020-09-26T17:11:34.871Z] 
13:11:34 [2020-09-26T17:11:34.871Z] (SWT:1587): Gtk-CRITICAL **: 17:11:34.550: gtk_box_gadget_distribute: assertion 'size >= 0' failed in GtkScrollbar
13:11:34 [2020-09-26T17:11:34.871Z] 
13:11:34 [2020-09-26T17:11:34.871Z] (SWT:1587): Gtk-CRITICAL **: 17:11:34.560: gtk_box_gadget_distribute: assertion 'size >= 0' failed in GtkScrollbar
13:11:34 [2020-09-26T17:11:34.871Z] Tests run: 1, Failures: 0, Errors: 0, Skipped: 0, Time elapsed: 0.798 s - in org.eclipse.egit.ui.gitflow.FeatureStartCheckoutConflictTest
13:11:34 [2020-09-26T17:11:34.871Z] testFeatureStart(org.eclipse.egit.ui.gitflow.FeatureStartCheckoutConflictTest)  Time elapsed: 0.795 s
13:11:34 [2020-09-26T17:11:34.871Z] Running org.eclipse.egit.ui.variables.DynamicVariablesTest
13:11:39 [2020-09-26T17:11:39.103Z] Tests run: 4, Failures: 0, Errors: 0, Skipped: 0, Time elapsed: 4.25 s - in org.eclipse.egit.ui.variables.DynamicVariablesTest
13:11:39 [2020-09-26T17:11:39.103Z] testGitBranch(org.eclipse.egit.ui.variables.DynamicVariablesTest)  Time elapsed: 1.074 s
13:11:39 [2020-09-26T17:11:39.103Z] testGitPath(org.eclipse.egit.ui.variables.DynamicVariablesTest)  Time elapsed: 1.054 s
13:11:39 [2020-09-26T17:11:39.103Z] testGitWorkTree(org.eclipse.egit.ui.variables.DynamicVariablesTest)  Time elapsed: 1.065 s
13:11:39 [2020-09-26T17:11:39.103Z] testGitDir(org.eclipse.egit.ui.variables.DynamicVariablesTest)  Time elapsed: 1.057 s
13:11:39 [2020-09-26T17:11:39.103Z] Running org.eclipse.egit.ui.prefpages.configuration.GlobalConfigurationPageTest
13:11:39 [2020-09-26T17:11:39.103Z] 
13:11:39 [2020-09-26T17:11:39.103Z] !ENTRY org.eclipse.ui 2 2 2020-09-26 17:11:38.998
13:11:39 [2020-09-26T17:11:39.103Z] !MESSAGE Invalid preference category path: org.eclipse.ui.net.NetPreferences (bundle: org.eclipse.jsch.ui, page: org.eclipse.jsch.ui.SSHPreferences)
13:11:39 [2020-09-26T17:11:39.103Z] 
13:11:39 [2020-09-26T17:11:39.103Z] (SWT:1587): Gtk-WARNING **: 17:11:39.016: Negative content width -13 (allocation 5, extents 9x9) while allocating gadget (node entry, owner GtkEntry)
13:11:39 [2020-09-26T17:11:39.361Z] 
13:11:39 [2020-09-26T17:11:39.361Z] (SWT:1587): Gtk-WARNING **: 17:11:39.163: Negative content width -13 (allocation 5, extents 9x9) while allocating gadget (node entry, owner GtkEntry)
13:11:39 [2020-09-26T17:11:39.361Z] 
13:11:39 [2020-09-26T17:11:39.361Z] (SWT:1587): Gtk-WARNING **: 17:11:39.288: Negative content width -13 (allocation 5, extents 9x9) while allocating gadget (node entry, owner GtkEntry)
13:11:39 [2020-09-26T17:11:39.619Z] 
13:11:39 [2020-09-26T17:11:39.619Z] (SWT:1587): Gtk-WARNING **: 17:11:39.408: Negative content width -13 (allocation 5, extents 9x9) while allocating gadget (node entry, owner GtkEntry)
13:11:39 [2020-09-26T17:11:39.619Z] 
13:11:39 [2020-09-26T17:11:39.619Z] (SWT:1587): Gtk-WARNING **: 17:11:39.484: Negative content width -13 (allocation 5, extents 9x9) while allocating gadget (node entry, owner GtkEntry)
13:11:39 [2020-09-26T17:11:39.619Z] 
13:11:39 [2020-09-26T17:11:39.619Z] (SWT:1587): Gtk-WARNING **: 17:11:39.569: Negative content width -13 (allocation 5, extents 9x9) while allocating gadget (node entry, owner GtkEntry)
13:11:39 [2020-09-26T17:11:39.877Z] 
13:11:39 [2020-09-26T17:11:39.877Z] (SWT:1587): Gtk-WARNING **: 17:11:39.685: Negative content width -13 (allocation 5, extents 9x9) while allocating gadget (node entry, owner GtkEntry)
13:11:39 [2020-09-26T17:11:39.877Z] 
13:11:39 [2020-09-26T17:11:39.877Z] (SWT:1587): Gtk-WARNING **: 17:11:39.735: Negative content width -6 (allocation 1, extents 4x3) while allocating gadget (node toolbar, owner GtkToolbar)
13:11:39 [2020-09-26T17:11:39.877Z] 
13:11:39 [2020-09-26T17:11:39.877Z] (SWT:1587): Gtk-WARNING **: 17:11:39.735: Negative content height -3 (allocation 1, extents 2x2) while allocating gadget (node toolbar, owner GtkToolbar)
13:11:39 [2020-09-26T17:11:39.877Z] 
13:11:39 [2020-09-26T17:11:39.877Z] (SWT:1587): Gtk-WARNING **: 17:11:39.735: Negative content width -6 (allocation 1, extents 4x3) while allocating gadget (node toolbar, owner GtkToolbar)
13:11:39 [2020-09-26T17:11:39.877Z] 
13:11:39 [2020-09-26T17:11:39.877Z] (SWT:1587): Gtk-WARNING **: 17:11:39.735: Negative content height -3 (allocation 1, extents 2x2) while allocating gadget (node toolbar, owner GtkToolbar)
13:11:39 [2020-09-26T17:11:39.877Z] 
13:11:39 [2020-09-26T17:11:39.877Z] (SWT:1587): Gtk-WARNING **: 17:11:39.833: Negative content width -13 (allocation 5, extents 9x9) while allocating gadget (node entry, owner GtkEntry)
13:11:40 [2020-09-26T17:11:40.134Z] 
13:11:40 [2020-09-26T17:11:40.134Z] (SWT:1587): Gtk-WARNING **: 17:11:39.956: Negative content width -13 (allocation 5, extents 9x9) while allocating gadget (node entry, owner GtkEntry)
13:11:40 [2020-09-26T17:11:40.134Z] 
13:11:40 [2020-09-26T17:11:40.134Z] (SWT:1587): Gtk-WARNING **: 17:11:40.093: Negative content width -13 (allocation 5, extents 9x9) while allocating gadget (node entry, owner GtkEntry)
13:11:40 [2020-09-26T17:11:40.391Z] 
13:11:40 [2020-09-26T17:11:40.391Z] (SWT:1587): Gtk-WARNING **: 17:11:40.204: Negative content width -13 (allocation 5, extents 9x9) while allocating gadget (node entry, owner GtkEntry)
13:11:40 [2020-09-26T17:11:40.391Z] 
13:11:40 [2020-09-26T17:11:40.391Z] (SWT:1587): Gtk-WARNING **: 17:11:40.315: Negative content width -13 (allocation 5, extents 9x9) while allocating gadget (node entry, owner GtkEntry)
13:11:40 [2020-09-26T17:11:40.649Z] Tests run: 11, Failures: 0, Errors: 0, Skipped: 0, Time elapsed: 1.428 s - in org.eclipse.egit.ui.prefpages.configuration.GlobalConfigurationPageTest
13:11:40 [2020-09-26T17:11:40.649Z] testAddSubSectionEntry(org.eclipse.egit.ui.prefpages.configuration.GlobalConfigurationPageTest)  Time elapsed: 0.173 s
13:11:40 [2020-09-26T17:11:40.649Z] testAddSectionEntry(org.eclipse.egit.ui.prefpages.configuration.GlobalConfigurationPageTest)  Time elapsed: 0.125 s
13:11:40 [2020-09-26T17:11:40.649Z] testCanCreateSameEntryValue(org.eclipse.egit.ui.prefpages.configuration.GlobalConfigurationPageTest)  Time elapsed: 0.113 s
13:11:40 [2020-09-26T17:11:40.649Z] testNodes(org.eclipse.egit.ui.prefpages.configuration.GlobalConfigurationPageTest)  Time elapsed: 0.083 s
13:11:40 [2020-09-26T17:11:40.649Z] testRemoveValue(org.eclipse.egit.ui.prefpages.configuration.GlobalConfigurationPageTest)  Time elapsed: 0.085 s
13:11:40 [2020-09-26T17:11:40.649Z] testAddSubSectionEntryWithSuggestion(org.eclipse.egit.ui.prefpages.configuration.GlobalConfigurationPageTest)  Time elapsed: 0.116 s
13:11:40 [2020-09-26T17:11:40.649Z] testOpenEditor(org.eclipse.egit.ui.prefpages.configuration.GlobalConfigurationPageTest)  Time elapsed: 0.147 s
13:11:40 [2020-09-26T17:11:40.649Z] testSubsectionWithDot(org.eclipse.egit.ui.prefpages.configuration.GlobalConfigurationPageTest)  Time elapsed: 0.124 s
13:11:40 [2020-09-26T17:11:40.649Z] testChecksForKey(org.eclipse.egit.ui.prefpages.configuration.GlobalConfigurationPageTest)  Time elapsed: 0.137 s
13:11:40 [2020-09-26T17:11:40.649Z] testRemoveSubSection(org.eclipse.egit.ui.prefpages.configuration.GlobalConfigurationPageTest)  Time elapsed: 0.111 s
13:11:40 [2020-09-26T17:11:40.649Z] testRemoveSection(org.eclipse.egit.ui.prefpages.configuration.GlobalConfigurationPageTest)  Time elapsed: 0.111 s
13:11:40 [2020-09-26T17:11:40.649Z] Running org.eclipse.egit.ui.operations.GitScopeUtilTest
13:11:44 [2020-09-26T17:11:44.829Z] Tests run: 5, Failures: 0, Errors: 0, Skipped: 0, Time elapsed: 4.048 s - in org.eclipse.egit.ui.operations.GitScopeUtilTest
13:11:44 [2020-09-26T17:11:44.829Z] relatedChangesWithPrompt(org.eclipse.egit.ui.operations.GitScopeUtilTest)  Time elapsed: 1.537 s
13:11:44 [2020-09-26T17:11:44.829Z] modelProviderWithExtensionFiles(org.eclipse.egit.ui.operations.GitScopeUtilTest)  Time elapsed: 0.628 s
13:11:44 [2020-09-26T17:11:44.829Z] relatedChangesWithInvalidParams(org.eclipse.egit.ui.operations.GitScopeUtilTest)  Time elapsed: 0.626 s
13:11:44 [2020-09-26T17:11:44.829Z] relatedChangesWithNullResources(org.eclipse.egit.ui.operations.GitScopeUtilTest)  Time elapsed: 0.614 s
13:11:44 [2020-09-26T17:11:44.829Z] relatedChangesWithEmptyResources(org.eclipse.egit.ui.operations.GitScopeUtilTest)  Time elapsed: 0.641 s
13:11:44 [2020-09-26T17:11:44.829Z] 
13:11:44 [2020-09-26T17:11:44.829Z] Results:
13:11:44 [2020-09-26T17:11:44.829Z] 
13:11:44 [2020-09-26T17:11:44.829Z] Tests run: 541, Failures: 0, Errors: 0, Skipped: 12
13:11:44 [2020-09-26T17:11:44.829Z] 
13:11:45 [2020-09-26T17:11:45.394Z] 
13:11:45 [2020-09-26T17:11:45.394Z] !ENTRY org.eclipse.core.resources 2 10035 2020-09-26 17:11:45.377
13:11:45 [2020-09-26T17:11:45.394Z] !MESSAGE The workspace will exit with unsaved changes in this session.
13:11:46 [2020-09-26T17:11:46.765Z] [INFO] All tests passed!
13:11:46 [2020-09-26T17:11:46.765Z] [INFO] 
13:11:46 [2020-09-26T17:11:46.765Z] [INFO] >>> spotbugs-maven-plugin:3.1.12:check (default) > :spotbugs @ org.eclipse.egit.ui.test >>>
13:11:46 [2020-09-26T17:11:46.765Z] [INFO] 
13:11:46 [2020-09-26T17:11:46.765Z] [INFO] --- spotbugs-maven-plugin:3.1.12:spotbugs (spotbugs) @ org.eclipse.egit.ui.test ---
13:11:46 [2020-09-26T17:11:46.765Z] [INFO] Fork Value is true
13:12:01 [2020-09-26T17:12:01.681Z]      [java] Warnings generated: 21
13:12:01 [2020-09-26T17:12:01.681Z] [INFO] Done SpotBugs Analysis....
13:12:01 [2020-09-26T17:12:01.681Z] [INFO] 
13:12:01 [2020-09-26T17:12:01.681Z] [INFO] <<< spotbugs-maven-plugin:3.1.12:check (default) < :spotbugs @ org.eclipse.egit.ui.test <<<
13:12:01 [2020-09-26T17:12:01.681Z] [INFO] 
13:12:01 [2020-09-26T17:12:01.681Z] [INFO] 
13:12:01 [2020-09-26T17:12:01.681Z] [INFO] --- spotbugs-maven-plugin:3.1.12:check (default) @ org.eclipse.egit.ui.test ---
13:12:01 [2020-09-26T17:12:01.681Z] [INFO] BugInstance size is 21
13:12:01 [2020-09-26T17:12:01.681Z] [INFO] Error size is 0
13:12:01 [2020-09-26T17:12:01.681Z] [INFO] Total bugs: 21
13:12:01 [2020-09-26T17:12:01.681Z] [ERROR] Possible null pointer dereference in org.eclipse.egit.ui.common.LocalRepositoryTestCase.shareProjects(File) due to return value of called method [org.eclipse.egit.ui.common.LocalRepositoryTestCase, org.eclipse.egit.ui.common.LocalRepositoryTestCase] Dereferenced at LocalRepositoryTestCase.java:[line 628]Known null at LocalRepositoryTestCase.java:[line 628] NP_NULL_ON_SOME_PATH_FROM_RETURN_VALUE
13:12:01 [2020-09-26T17:12:01.681Z] [ERROR] Possible null pointer dereference in org.eclipse.egit.ui.common.LocalRepositoryTestCase.shareProjects(File) due to return value of called method [org.eclipse.egit.ui.common.LocalRepositoryTestCase, org.eclipse.egit.ui.common.LocalRepositoryTestCase] Dereferenced at LocalRepositoryTestCase.java:[line 630]Known null at LocalRepositoryTestCase.java:[line 630] NP_NULL_ON_SOME_PATH_FROM_RETURN_VALUE
13:12:01 [2020-09-26T17:12:01.682Z] [ERROR] Write to static field org.eclipse.egit.ui.common.LocalRepositoryTestCase.testMethodNumber from instance method org.eclipse.egit.ui.common.LocalRepositoryTestCase.initNewTestDirectory() [org.eclipse.egit.ui.common.LocalRepositoryTestCase] At LocalRepositoryTestCase.java:[line 193] ST_WRITE_TO_STATIC_FROM_INSTANCE_METHOD
13:12:01 [2020-09-26T17:12:01.682Z] [ERROR] Exceptional return value of java.io.File.delete() ignored in org.eclipse.egit.ui.internal.actions.SwitchToMenuTest.multipleSelectionWithMultipleRepositoriesAndNoCommonBranches() [org.eclipse.egit.ui.internal.actions.SwitchToMenuTest, org.eclipse.egit.ui.internal.actions.SwitchToMenuTest] At SwitchToMenuTest.java:[line 283]Another occurrence at SwitchToMenuTest.java:[line 284] RV_RETURN_VALUE_IGNORED_BAD_PRACTICE
13:12:01 [2020-09-26T17:12:01.682Z] [ERROR] Call to org.eclipse.egit.ui.internal.decorators.TestDecoratableResource.equals(org.eclipse.egit.ui.internal.decorators.DecoratableResourceAdapter) in org.eclipse.egit.ui.internal.decorators.DecoratableResourceAdapterTest.testDecorationDeletedFile() [org.eclipse.egit.ui.internal.decorators.DecoratableResourceAdapterTest] At DecoratableResourceAdapterTest.java:[line 384] EC_UNRELATED_TYPES
13:12:01 [2020-09-26T17:12:01.682Z] [ERROR] Call to org.eclipse.egit.ui.internal.synchronize.model.GitModelCommit.equals(org.eclipse.egit.ui.internal.synchronize.model.GitModelBlob) in org.eclipse.egit.ui.internal.synchronize.model.GitModelBlobTest.shouldBeSymmetric1() [org.eclipse.egit.ui.internal.synchronize.model.GitModelBlobTest] At GitModelBlobTest.java:[line 123] EC_UNRELATED_TYPES
13:12:01 [2020-09-26T17:12:01.682Z] [ERROR] Call to org.eclipse.egit.ui.internal.synchronize.model.GitModelBlob.equals(org.eclipse.egit.ui.internal.synchronize.model.GitModelCommit) in org.eclipse.egit.ui.internal.synchronize.model.GitModelBlobTest.shouldBeSymmetric1() [org.eclipse.egit.ui.internal.synchronize.model.GitModelBlobTest] At GitModelBlobTest.java:[line 122] EC_UNRELATED_TYPES
13:12:01 [2020-09-26T17:12:01.682Z] [ERROR] Call to org.eclipse.egit.ui.internal.synchronize.model.GitModelBlob.equals(org.eclipse.egit.ui.internal.synchronize.model.GitModelCommit) in org.eclipse.egit.ui.internal.synchronize.model.GitModelBlobTest.shouldReturnNotEqualForBlobAndCommit() [org.eclipse.egit.ui.internal.synchronize.model.GitModelBlobTest] At GitModelBlobTest.java:[line 199] EC_UNRELATED_TYPES
13:12:01 [2020-09-26T17:12:01.682Z] [ERROR] Write to static field org.eclipse.egit.ui.internal.synchronize.model.GitModelRootTest.repo1 from instance method org.eclipse.egit.ui.internal.synchronize.model.GitModelRootTest.setupEnvironment() [org.eclipse.egit.ui.internal.synchronize.model.GitModelRootTest] At GitModelRootTest.java:[line 32] ST_WRITE_TO_STATIC_FROM_INSTANCE_METHOD
13:12:01 [2020-09-26T17:12:01.682Z] [ERROR] Write to static field org.eclipse.egit.ui.internal.synchronize.model.GitModelRootTest.repo2 from instance method org.eclipse.egit.ui.internal.synchronize.model.GitModelRootTest.setupEnvironment() [org.eclipse.egit.ui.internal.synchronize.model.GitModelRootTest] At GitModelRootTest.java:[line 35] ST_WRITE_TO_STATIC_FROM_INSTANCE_METHOD
13:12:01 [2020-09-26T17:12:01.682Z] [ERROR] Exceptional return value of java.io.File.delete() ignored in org.eclipse.egit.ui.prefpages.configuration.GlobalConfigurationPageTest.afterTest() [org.eclipse.egit.ui.prefpages.configuration.GlobalConfigurationPageTest] At GlobalConfigurationPageTest.java:[line 124] RV_RETURN_VALUE_IGNORED_BAD_PRACTICE
13:12:01 [2020-09-26T17:12:01.682Z] [ERROR] Return value of org.eclipse.swtbot.eclipse.finder.waits.Conditions.waitForView(Matcher) ignored, but method has no side effect [org.eclipse.egit.ui.test.TestUtil] At TestUtil.java:[line 746] RV_RETURN_VALUE_IGNORED_NO_SIDE_EFFECT
13:12:01 [2020-09-26T17:12:01.682Z] [ERROR] Return value of org.eclipse.swtbot.eclipse.finder.waits.Conditions.waitForView(Matcher) ignored, but method has no side effect [org.eclipse.egit.ui.test.TestUtil] At TestUtil.java:[line 762] RV_RETURN_VALUE_IGNORED_NO_SIDE_EFFECT
13:12:01 [2020-09-26T17:12:01.682Z] [ERROR] Write to static field org.eclipse.egit.ui.test.team.actions.BranchAndResetActionTest.LOCAL_BRANCHES from instance method org.eclipse.egit.ui.test.team.actions.BranchAndResetActionTest.setup() [org.eclipse.egit.ui.test.team.actions.BranchAndResetActionTest] At BranchAndResetActionTest.java:[line 99] ST_WRITE_TO_STATIC_FROM_INSTANCE_METHOD
13:12:01 [2020-09-26T17:12:01.682Z] [ERROR] Write to static field org.eclipse.egit.ui.test.team.actions.BranchAndResetActionTest.TAGS from instance method org.eclipse.egit.ui.test.team.actions.BranchAndResetActionTest.setup() [org.eclipse.egit.ui.test.team.actions.BranchAndResetActionTest] At BranchAndResetActionTest.java:[line 100] ST_WRITE_TO_STATIC_FROM_INSTANCE_METHOD
13:12:01 [2020-09-26T17:12:01.682Z] [ERROR] Write to static field org.eclipse.egit.ui.test.team.actions.CompareActionsTest.TAGS from instance method org.eclipse.egit.ui.test.team.actions.CompareActionsTest.setup() [org.eclipse.egit.ui.test.team.actions.CompareActionsTest] At CompareActionsTest.java:[line 94] ST_WRITE_TO_STATIC_FROM_INSTANCE_METHOD
13:12:01 [2020-09-26T17:12:01.682Z] [ERROR] Write to static field org.eclipse.egit.ui.test.team.actions.CompareActionsTest.commitOfTag from instance method org.eclipse.egit.ui.test.team.actions.CompareActionsTest.setup() [org.eclipse.egit.ui.test.team.actions.CompareActionsTest] At CompareActionsTest.java:[line 89] ST_WRITE_TO_STATIC_FROM_INSTANCE_METHOD
13:12:01 [2020-09-26T17:12:01.682Z] [ERROR] VERY confusing to have methods org.eclipse.egit.ui.view.repositories.GitRepositoriesViewBranchHandlingTest.setUp() and org.eclipse.egit.ui.view.repositories.GitRepositoriesViewTestBase.setup() [org.eclipse.egit.ui.view.repositories.GitRepositoriesViewBranchHandlingTest] At GitRepositoriesViewBranchHandlingTest.java:[lines 84-108] NM_VERY_CONFUSING
13:12:01 [2020-09-26T17:12:01.682Z] [ERROR] Possible null pointer dereference in org.eclipse.egit.ui.view.repositories.GitRepositoriesViewTest.testExpandWorkDir() due to return value of called method [org.eclipse.egit.ui.view.repositories.GitRepositoriesViewTest, org.eclipse.egit.ui.view.repositories.GitRepositoriesViewTest] Method invoked at GitRepositoriesViewTest.java:[line 247]Known null at GitRepositoriesViewTest.java:[line 247] NP_NULL_ON_SOME_PATH_FROM_RETURN_VALUE
13:12:01 [2020-09-26T17:12:01.682Z] [ERROR] org.eclipse.egit.ui.view.repositories.GitRepositoriesViewTestBase.myRepoViewUtil isn't final and can't be protected from malicious code  [org.eclipse.egit.ui.view.repositories.GitRepositoriesViewTestBase] In GitRepositoriesViewTestBase.java MS_CANNOT_BE_FINAL
13:12:01 [2020-09-26T17:12:01.682Z] [ERROR] VERY confusing to have methods org.eclipse.egit.ui.wizards.pull.PullWizardTest.setUp() and org.eclipse.egit.ui.view.repositories.GitRepositoriesViewTestBase.setup() [org.eclipse.egit.ui.wizards.pull.PullWizardTest] At PullWizardTest.java:[lines 80-88] NM_VERY_CONFUSING
13:12:01 [2020-09-26T17:12:01.682Z] [INFO] 
13:12:01 [2020-09-26T17:12:01.682Z] 
13:12:01 [2020-09-26T17:12:01.682Z] 
13:12:01 [2020-09-26T17:12:01.682Z] To see bug detail using the Spotbugs GUI, use the following command "mvn spotbugs:gui"
13:12:01 [2020-09-26T17:12:01.682Z] 
13:12:01 [2020-09-26T17:12:01.682Z] 
13:12:01 [2020-09-26T17:12:01.682Z] 
13:12:01 [2020-09-26T17:12:01.682Z] [INFO] 
13:12:01 [2020-09-26T17:12:01.682Z] [INFO] >>> maven-pmd-plugin:3.12.0:cpd-check (default) > :cpd @ org.eclipse.egit.ui.test >>>
13:12:01 [2020-09-26T17:12:01.682Z] [INFO] 
13:12:01 [2020-09-26T17:12:01.682Z] [INFO] --- maven-pmd-plugin:3.12.0:cpd (cpd) @ org.eclipse.egit.ui.test ---
13:12:01 [2020-09-26T17:12:01.682Z] [INFO] 
13:12:01 [2020-09-26T17:12:01.682Z] [INFO] <<< maven-pmd-plugin:3.12.0:cpd-check (default) < :cpd @ org.eclipse.egit.ui.test <<<
13:12:01 [2020-09-26T17:12:01.682Z] [INFO] 
13:12:01 [2020-09-26T17:12:01.682Z] [INFO] 
13:12:01 [2020-09-26T17:12:01.682Z] [INFO] --- maven-pmd-plugin:3.12.0:cpd-check (default) @ org.eclipse.egit.ui.test ---
13:12:01 [2020-09-26T17:12:01.682Z] [INFO] 
13:12:01 [2020-09-26T17:12:01.682Z] [INFO] 
13:12:01 [2020-09-26T17:12:01.682Z] [INFO] --- tycho-pack200a-plugin:1.7.0:normalize (pack200-normalize) @ org.eclipse.egit.ui.test ---
13:12:01 [2020-09-26T17:12:01.682Z] [INFO] Pack200 normalizing jar /home/jenkins/agent/workspace/egit/repo/org.eclipse.egit.ui.test/target/org.eclipse.egit.ui.test-5.10.0-SNAPSHOT.jar
13:12:01 [2020-09-26T17:12:01.682Z] [INFO] 
13:12:01 [2020-09-26T17:12:01.682Z] [INFO] --- eclipse-jarsigner-plugin:1.1.5:sign (sign) @ org.eclipse.egit.ui.test ---
13:12:01 [2020-09-26T17:12:01.682Z] [INFO] Signing jar: /home/jenkins/agent/workspace/egit/repo/org.eclipse.egit.ui.test/target/org.eclipse.egit.ui.test-5.10.0-SNAPSHOT.jar
13:12:03 [2020-09-26T17:12:03.582Z] [INFO] 
13:12:03 [2020-09-26T17:12:03.582Z] [INFO] --- tycho-pack200b-plugin:1.7.0:pack (pack200-pack) @ org.eclipse.egit.ui.test ---
13:12:03 [2020-09-26T17:12:03.582Z] [INFO] Pack200 packing jar /home/jenkins/agent/workspace/egit/repo/org.eclipse.egit.ui.test/target/org.eclipse.egit.ui.test-5.10.0-SNAPSHOT.jar
13:12:03 [2020-09-26T17:12:03.839Z] [INFO] 
13:12:03 [2020-09-26T17:12:03.839Z] [INFO] --- tycho-p2-plugin:1.7.0:p2-metadata (p2-metadata) @ org.eclipse.egit.ui.test ---
13:12:03 [2020-09-26T17:12:03.839Z] [INFO] 
13:12:03 [2020-09-26T17:12:03.839Z] [INFO] --- maven-install-plugin:2.3.1:install (default-install) @ org.eclipse.egit.ui.test ---
13:12:03 [2020-09-26T17:12:03.839Z] [INFO] Installing /home/jenkins/agent/workspace/egit/repo/org.eclipse.egit.ui.test/target/org.eclipse.egit.ui.test-5.10.0-SNAPSHOT.jar to /home/jenkins/agent/workspace/egit/.repository/org/eclipse/egit/org.eclipse.egit.ui.test/5.10.0-SNAPSHOT/org.eclipse.egit.ui.test-5.10.0-SNAPSHOT.jar
13:12:03 [2020-09-26T17:12:03.839Z] [INFO] Installing /home/jenkins/agent/workspace/egit/repo/org.eclipse.egit.ui.test/pom.xml to /home/jenkins/agent/workspace/egit/.repository/org/eclipse/egit/org.eclipse.egit.ui.test/5.10.0-SNAPSHOT/org.eclipse.egit.ui.test-5.10.0-SNAPSHOT.pom
13:12:03 [2020-09-26T17:12:03.839Z] [INFO] Installing /home/jenkins/agent/workspace/egit/repo/org.eclipse.egit.ui.test/target/org.eclipse.egit.ui.test-5.10.0-SNAPSHOT.jar.pack.gz to /home/jenkins/agent/workspace/egit/.repository/org/eclipse/egit/org.eclipse.egit.ui.test/5.10.0-SNAPSHOT/org.eclipse.egit.ui.test-5.10.0-SNAPSHOT-pack200.jar.pack.gz
13:12:03 [2020-09-26T17:12:03.839Z] [INFO] Installing /home/jenkins/agent/workspace/egit/repo/org.eclipse.egit.ui.test/target/p2content.xml to /home/jenkins/agent/workspace/egit/.repository/org/eclipse/egit/org.eclipse.egit.ui.test/5.10.0-SNAPSHOT/org.eclipse.egit.ui.test-5.10.0-SNAPSHOT-p2metadata.xml
13:12:03 [2020-09-26T17:12:03.840Z] [INFO] Installing /home/jenkins/agent/workspace/egit/repo/org.eclipse.egit.ui.test/target/p2artifacts.xml to /home/jenkins/agent/workspace/egit/.repository/org/eclipse/egit/org.eclipse.egit.ui.test/5.10.0-SNAPSHOT/org.eclipse.egit.ui.test-5.10.0-SNAPSHOT-p2artifacts.xml
13:12:03 [2020-09-26T17:12:03.840Z] [INFO] 
13:12:03 [2020-09-26T17:12:03.840Z] [INFO] --- tycho-p2-plugin:1.7.0:update-local-index (default-update-local-index) @ org.eclipse.egit.ui.test ---
13:12:03 [2020-09-26T17:12:03.840Z] [INFO] 
13:12:03 [2020-09-26T17:12:03.840Z] [INFO] ----------< org.eclipse.egit:org.eclipse.egit.mylyn.ui.test >-----------
13:12:03 [2020-09-26T17:12:03.840Z] [INFO] Building EGit Mylyn UI Test Plug-in 5.10.0-SNAPSHOT              [19/19]
13:12:03 [2020-09-26T17:12:03.840Z] [INFO] ------------------------[ eclipse-test-plugin ]-------------------------
13:12:04 [2020-09-26T17:12:04.105Z] [INFO] 
13:12:04 [2020-09-26T17:12:04.105Z] [INFO] --- maven-clean-plugin:2.5:clean (default-clean) @ org.eclipse.egit.mylyn.ui.test ---
13:12:04 [2020-09-26T17:12:04.105Z] [INFO] 
13:12:04 [2020-09-26T17:12:04.105Z] [INFO] --- tycho-packaging-plugin:1.7.0:build-qualifier (default-build-qualifier) @ org.eclipse.egit.mylyn.ui.test ---
13:12:04 [2020-09-26T17:12:04.105Z] [INFO] The project's OSGi version is 5.10.0.202009261650
13:12:04 [2020-09-26T17:12:04.105Z] [INFO] 
13:12:04 [2020-09-26T17:12:04.105Z] [INFO] --- tycho-packaging-plugin:1.7.0:validate-id (default-validate-id) @ org.eclipse.egit.mylyn.ui.test ---
13:12:04 [2020-09-26T17:12:04.105Z] [INFO] 
13:12:04 [2020-09-26T17:12:04.105Z] [INFO] --- tycho-packaging-plugin:1.7.0:validate-version (default-validate-version) @ org.eclipse.egit.mylyn.ui.test ---
13:12:04 [2020-09-26T17:12:04.105Z] [INFO] 
13:12:04 [2020-09-26T17:12:04.105Z] [INFO] --- maven-enforcer-plugin:3.0.0-M3:enforce (enforce-maven) @ org.eclipse.egit.mylyn.ui.test ---
13:12:04 [2020-09-26T17:12:04.105Z] [INFO] 
13:12:04 [2020-09-26T17:12:04.105Z] [INFO] --- maven-resources-plugin:2.4.3:resources (default-resources) @ org.eclipse.egit.mylyn.ui.test ---
13:12:04 [2020-09-26T17:12:04.105Z] [INFO] Using 'UTF-8' encoding to copy filtered resources.
13:12:04 [2020-09-26T17:12:04.105Z] [INFO] skip non existing resourceDirectory /home/jenkins/agent/workspace/egit/repo/org.eclipse.egit.mylyn.ui.test/src/main/resources
13:12:04 [2020-09-26T17:12:04.105Z] [INFO] 
13:12:04 [2020-09-26T17:12:04.105Z] [INFO] --- tycho-compiler-plugin:1.7.0:compile (default-compile) @ org.eclipse.egit.mylyn.ui.test ---
13:12:04 [2020-09-26T17:12:04.105Z] [INFO] Compiling 1 source file to /home/jenkins/agent/workspace/egit/repo/org.eclipse.egit.mylyn.ui.test/target/classes
13:12:04 [2020-09-26T17:12:04.105Z] [INFO] 
13:12:04 [2020-09-26T17:12:04.105Z] [INFO] --- maven-resources-plugin:2.4.3:testResources (default-testResources) @ org.eclipse.egit.mylyn.ui.test ---
13:12:04 [2020-09-26T17:12:04.105Z] [INFO] Using 'UTF-8' encoding to copy filtered resources.
13:12:04 [2020-09-26T17:12:04.105Z] [INFO] skip non existing resourceDirectory /home/jenkins/agent/workspace/egit/repo/org.eclipse.egit.mylyn.ui.test/src/test/resources
13:12:04 [2020-09-26T17:12:04.105Z] [INFO] 
13:12:04 [2020-09-26T17:12:04.105Z] [INFO] --- target-platform-configuration:1.7.0:target-platform (default-target-platform) @ org.eclipse.egit.mylyn.ui.test ---
13:12:04 [2020-09-26T17:12:04.105Z] [INFO] 
13:12:04 [2020-09-26T17:12:04.105Z] [INFO] --- tycho-packaging-plugin:1.7.0:package-plugin (default-package-plugin) @ org.eclipse.egit.mylyn.ui.test ---
13:12:04 [2020-09-26T17:12:04.105Z] [INFO] Building jar: /home/jenkins/agent/workspace/egit/repo/org.eclipse.egit.mylyn.ui.test/target/org.eclipse.egit.mylyn.ui.test-5.10.0-SNAPSHOT.jar
13:12:04 [2020-09-26T17:12:04.105Z] [INFO] 
13:12:04 [2020-09-26T17:12:04.105Z] [INFO] --- tycho-p2-plugin:1.7.0:p2-metadata-default (default-p2-metadata-default) @ org.eclipse.egit.mylyn.ui.test ---
13:12:04 [2020-09-26T17:12:04.105Z] [INFO] 
13:12:04 [2020-09-26T17:12:04.105Z] [INFO] --- tycho-surefire-plugin:1.7.0:test (default-test) @ org.eclipse.egit.mylyn.ui.test ---
13:12:04 [2020-09-26T17:12:04.363Z] [INFO] Executing Test Runtime with timeout 0, logs (if any) will be placed at: /home/jenkins/agent/workspace/egit/repo/org.eclipse.egit.mylyn.ui.test/target/work/data/.metadata/.log
13:12:04 [2020-09-26T17:12:04.363Z] [INFO] Command line:
13:12:04 [2020-09-26T17:12:04.363Z] 	[/usr/lib/jvm/java-1.8.0-openjdk-1.8.0.262.b10-0.el7_8.x86_64/jre/bin/java, -Dosgi.noShutdown=false, -Dosgi.os=linux, -Dosgi.ws=gtk, -Dosgi.arch=x86_64, -Declipse.consoleLog=true, -Xmx512m, -Dosgi.clean=true, -jar, /home/jenkins/agent/workspace/egit/.repository/p2/osgi/bundle/org.eclipse.equinox.launcher/1.3.201.v20161025-1711/org.eclipse.equinox.launcher-1.3.201.v20161025-1711.jar, -data, /home/jenkins/agent/workspace/egit/repo/org.eclipse.egit.mylyn.ui.test/target/work/data, -install, /home/jenkins/agent/workspace/egit/repo/org.eclipse.egit.mylyn.ui.test/target/work, -configuration, /home/jenkins/agent/workspace/egit/repo/org.eclipse.egit.mylyn.ui.test/target/work/configuration, -application, org.eclipse.tycho.surefire.osgibooter.uitest, -testproperties, /home/jenkins/agent/workspace/egit/repo/org.eclipse.egit.mylyn.ui.test/target/surefire.properties, -testApplication, org.eclipse.ui.ide.workbench]
13:12:06 [2020-09-26T17:12:06.273Z] !SESSION 2020-09-26 17:12:04.376 -----------------------------------------------
13:12:06 [2020-09-26T17:12:06.273Z] eclipse.buildId=unknown
13:12:06 [2020-09-26T17:12:06.273Z] java.version=1.8.0_262
13:12:06 [2020-09-26T17:12:06.273Z] java.vendor=Oracle Corporation
13:12:06 [2020-09-26T17:12:06.273Z] BootLoader constants: OS=linux, ARCH=x86_64, WS=gtk, NL=en_US
13:12:06 [2020-09-26T17:12:06.273Z] Framework arguments:  -application org.eclipse.tycho.surefire.osgibooter.uitest -testproperties /home/jenkins/agent/workspace/egit/repo/org.eclipse.egit.mylyn.ui.test/target/surefire.properties -testApplication org.eclipse.ui.ide.workbench
13:12:06 [2020-09-26T17:12:06.273Z] Command-line arguments:  -data /home/jenkins/agent/workspace/egit/repo/org.eclipse.egit.mylyn.ui.test/target/work/data -application org.eclipse.tycho.surefire.osgibooter.uitest -testproperties /home/jenkins/agent/workspace/egit/repo/org.eclipse.egit.mylyn.ui.test/target/surefire.properties -testApplication org.eclipse.ui.ide.workbench
13:12:06 [2020-09-26T17:12:06.273Z] 
13:12:06 [2020-09-26T17:12:06.273Z] !ENTRY org.eclipse.jdt.launching.macosx 4 0 2020-09-26 17:12:05.835
13:12:06 [2020-09-26T17:12:06.273Z] !MESSAGE FrameworkEvent ERROR
13:12:06 [2020-09-26T17:12:06.273Z] !STACK 0
13:12:06 [2020-09-26T17:12:06.273Z] org.osgi.framework.BundleException: Could not resolve module: org.eclipse.jdt.launching.macosx [250]
13:12:06 [2020-09-26T17:12:06.273Z]   Unresolved requirement: Require-Capability: eclipse.platform; filter:="(osgi.os=macosx)"
13:12:06 [2020-09-26T17:12:06.273Z] 
13:12:06 [2020-09-26T17:12:06.273Z] 	at org.eclipse.osgi.container.Module.start(Module.java:444)
13:12:06 [2020-09-26T17:12:06.273Z] 	at org.eclipse.osgi.container.ModuleContainer$ContainerStartLevel.incStartLevel(ModuleContainer.java:1620)
13:12:06 [2020-09-26T17:12:06.273Z] 	at org.eclipse.osgi.container.ModuleContainer$ContainerStartLevel.incStartLevel(ModuleContainer.java:1599)
13:12:06 [2020-09-26T17:12:06.273Z] 	at org.eclipse.osgi.container.ModuleContainer$ContainerStartLevel.doContainerStartLevel(ModuleContainer.java:1571)
13:12:06 [2020-09-26T17:12:06.273Z] 	at org.eclipse.osgi.container.ModuleContainer$ContainerStartLevel.dispatchEvent(ModuleContainer.java:1514)
13:12:06 [2020-09-26T17:12:06.273Z] 	at org.eclipse.osgi.container.ModuleContainer$ContainerStartLevel.dispatchEvent(ModuleContainer.java:1)
13:12:06 [2020-09-26T17:12:06.273Z] 	at org.eclipse.osgi.framework.eventmgr.EventManager.dispatchEvent(EventManager.java:230)
13:12:06 [2020-09-26T17:12:06.273Z] 	at org.eclipse.osgi.framework.eventmgr.EventManager$EventThread.run(EventManager.java:340)
13:12:06 [2020-09-26T17:12:06.273Z] 
13:12:06 [2020-09-26T17:12:06.273Z] !ENTRY org.eclipse.jdt.launching.ui.macosx 4 0 2020-09-26 17:12:05.836
13:12:06 [2020-09-26T17:12:06.273Z] !MESSAGE FrameworkEvent ERROR
13:12:06 [2020-09-26T17:12:06.273Z] !STACK 0
13:12:06 [2020-09-26T17:12:06.273Z] org.osgi.framework.BundleException: Could not resolve module: org.eclipse.jdt.launching.ui.macosx [251]
13:12:06 [2020-09-26T17:12:06.273Z]   Unresolved requirement: Require-Capability: eclipse.platform; filter:="(osgi.os=macosx)"
13:12:06 [2020-09-26T17:12:06.273Z] 
13:12:06 [2020-09-26T17:12:06.273Z] 	at org.eclipse.osgi.container.Module.start(Module.java:444)
13:12:06 [2020-09-26T17:12:06.273Z] 	at org.eclipse.osgi.container.ModuleContainer$ContainerStartLevel.incStartLevel(ModuleContainer.java:1620)
13:12:06 [2020-09-26T17:12:06.273Z] 	at org.eclipse.osgi.container.ModuleContainer$ContainerStartLevel.incStartLevel(ModuleContainer.java:1599)
13:12:06 [2020-09-26T17:12:06.273Z] 	at org.eclipse.osgi.container.ModuleContainer$ContainerStartLevel.doContainerStartLevel(ModuleContainer.java:1571)
13:12:06 [2020-09-26T17:12:06.273Z] 	at org.eclipse.osgi.container.ModuleContainer$ContainerStartLevel.dispatchEvent(ModuleContainer.java:1514)
13:12:06 [2020-09-26T17:12:06.273Z] 	at org.eclipse.osgi.container.ModuleContainer$ContainerStartLevel.dispatchEvent(ModuleContainer.java:1)
13:12:06 [2020-09-26T17:12:06.273Z] 	at org.eclipse.osgi.framework.eventmgr.EventManager.dispatchEvent(EventManager.java:230)
13:12:06 [2020-09-26T17:12:06.273Z] 	at org.eclipse.osgi.framework.eventmgr.EventManager$EventThread.run(EventManager.java:340)
13:12:06 [2020-09-26T17:12:06.273Z] Launching application org.eclipse.ui.ide.workbench...
13:12:07 [2020-09-26T17:12:07.649Z] SLF4J: Failed to load class "org.slf4j.impl.StaticLoggerBinder".
13:12:07 [2020-09-26T17:12:07.649Z] SLF4J: Defaulting to no-operation (NOP) logger implementation
13:12:07 [2020-09-26T17:12:07.649Z] SLF4J: See http://www.slf4j.org/codes.html#StaticLoggerBinder for further details.
13:12:08 [2020-09-26T17:12:08.214Z] 
13:12:08 [2020-09-26T17:12:08.214Z] (SWT:3352): Gtk-WARNING **: 17:12:08.108: Negative content width -6 (allocation 1, extents 4x3) while allocating gadget (node toolbar, owner GtkToolbar)
13:12:08 [2020-09-26T17:12:08.214Z] 
13:12:08 [2020-09-26T17:12:08.214Z] (SWT:3352): Gtk-WARNING **: 17:12:08.108: Negative content height -3 (allocation 1, extents 2x2) while allocating gadget (node toolbar, owner GtkToolbar)
13:12:08 [2020-09-26T17:12:08.214Z] 
13:12:08 [2020-09-26T17:12:08.214Z] (SWT:3352): Gtk-WARNING **: 17:12:08.108: Negative content width -6 (allocation 1, extents 4x3) while allocating gadget (node toolbar, owner GtkToolbar)
13:12:08 [2020-09-26T17:12:08.214Z] 
13:12:08 [2020-09-26T17:12:08.214Z] (SWT:3352): Gtk-WARNING **: 17:12:08.108: Negative content height -3 (allocation 1, extents 2x2) while allocating gadget (node toolbar, owner GtkToolbar)
13:12:08 [2020-09-26T17:12:08.214Z] 
13:12:08 [2020-09-26T17:12:08.214Z] (SWT:3352): Gtk-WARNING **: 17:12:08.113: Negative content width -6 (allocation 1, extents 4x3) while allocating gadget (node toolbar, owner GtkToolbar)
13:12:08 [2020-09-26T17:12:08.214Z] 
13:12:08 [2020-09-26T17:12:08.214Z] (SWT:3352): Gtk-WARNING **: 17:12:08.113: Negative content height -3 (allocation 1, extents 2x2) while allocating gadget (node toolbar, owner GtkToolbar)
13:12:08 [2020-09-26T17:12:08.214Z] 
13:12:08 [2020-09-26T17:12:08.214Z] (SWT:3352): Gtk-WARNING **: 17:12:08.113: Negative content width -6 (allocation 1, extents 4x3) while allocating gadget (node toolbar, owner GtkToolbar)
13:12:08 [2020-09-26T17:12:08.214Z] 
13:12:08 [2020-09-26T17:12:08.214Z] (SWT:3352): Gtk-WARNING **: 17:12:08.113: Negative content height -3 (allocation 1, extents 2x2) while allocating gadget (node toolbar, owner GtkToolbar)
13:12:08 [2020-09-26T17:12:08.472Z] 
13:12:08 [2020-09-26T17:12:08.472Z] (SWT:3352): Gtk-WARNING **: 17:12:08.231: Negative content width -6 (allocation 1, extents 4x3) while allocating gadget (node toolbar, owner GtkToolbar)
13:12:08 [2020-09-26T17:12:08.472Z] 
13:12:08 [2020-09-26T17:12:08.472Z] (SWT:3352): Gtk-WARNING **: 17:12:08.231: Negative content height -3 (allocation 1, extents 2x2) while allocating gadget (node toolbar, owner GtkToolbar)
13:12:08 [2020-09-26T17:12:08.472Z] 
13:12:08 [2020-09-26T17:12:08.472Z] (SWT:3352): Gtk-WARNING **: 17:12:08.231: Negative content width -6 (allocation 1, extents 4x3) while allocating gadget (node toolbar, owner GtkToolbar)
13:12:08 [2020-09-26T17:12:08.472Z] 
13:12:08 [2020-09-26T17:12:08.472Z] (SWT:3352): Gtk-WARNING **: 17:12:08.231: Negative content height -3 (allocation 1, extents 2x2) while allocating gadget (node toolbar, owner GtkToolbar)
13:12:08 [2020-09-26T17:12:08.472Z] 
13:12:08 [2020-09-26T17:12:08.472Z] (SWT:3352): Gtk-WARNING **: 17:12:08.237: gtk_widget_size_allocate(): attempt to allocate widget with width -3 and height -3
13:12:08 [2020-09-26T17:12:08.729Z] 
13:12:08 [2020-09-26T17:12:08.729Z] (SWT:3352): Gtk-WARNING **: 17:12:08.505: Negative content width -6 (allocation 1, extents 4x3) while allocating gadget (node toolbar, owner GtkToolbar)
13:12:08 [2020-09-26T17:12:08.729Z] 
13:12:08 [2020-09-26T17:12:08.729Z] (SWT:3352): Gtk-WARNING **: 17:12:08.505: Negative content height -3 (allocation 1, extents 2x2) while allocating gadget (node toolbar, owner GtkToolbar)
13:12:08 [2020-09-26T17:12:08.729Z] 
13:12:08 [2020-09-26T17:12:08.729Z] (SWT:3352): Gtk-WARNING **: 17:12:08.505: Negative content width -6 (allocation 1, extents 4x3) while allocating gadget (node toolbar, owner GtkToolbar)
13:12:08 [2020-09-26T17:12:08.729Z] 
13:12:08 [2020-09-26T17:12:08.729Z] (SWT:3352): Gtk-WARNING **: 17:12:08.505: Negative content height -3 (allocation 1, extents 2x2) while allocating gadget (node toolbar, owner GtkToolbar)
13:12:08 [2020-09-26T17:12:08.729Z] 
13:12:08 [2020-09-26T17:12:08.729Z] (SWT:3352): Gtk-WARNING **: 17:12:08.517: Negative content width -6 (allocation 1, extents 4x3) while allocating gadget (node toolbar, owner GtkToolbar)
13:12:08 [2020-09-26T17:12:08.729Z] 
13:12:08 [2020-09-26T17:12:08.729Z] (SWT:3352): Gtk-WARNING **: 17:12:08.517: Negative content height -3 (allocation 1, extents 2x2) while allocating gadget (node toolbar, owner GtkToolbar)
13:12:08 [2020-09-26T17:12:08.729Z] 
13:12:08 [2020-09-26T17:12:08.729Z] (SWT:3352): Gtk-WARNING **: 17:12:08.517: Negative content width -6 (allocation 1, extents 4x3) while allocating gadget (node toolbar, owner GtkToolbar)
13:12:08 [2020-09-26T17:12:08.729Z] 
13:12:08 [2020-09-26T17:12:08.729Z] (SWT:3352): Gtk-WARNING **: 17:12:08.517: Negative content height -3 (allocation 1, extents 2x2) while allocating gadget (node toolbar, owner GtkToolbar)
13:12:08 [2020-09-26T17:12:08.729Z] 
13:12:08 [2020-09-26T17:12:08.729Z] (SWT:3352): Gtk-WARNING **: 17:12:08.519: Negative content width -6 (allocation 1, extents 4x3) while allocating gadget (node toolbar, owner GtkToolbar)
13:12:08 [2020-09-26T17:12:08.729Z] 
13:12:08 [2020-09-26T17:12:08.729Z] (SWT:3352): Gtk-WARNING **: 17:12:08.519: Negative content height -3 (allocation 1, extents 2x2) while allocating gadget (node toolbar, owner GtkToolbar)
13:12:08 [2020-09-26T17:12:08.729Z] 
13:12:08 [2020-09-26T17:12:08.729Z] (SWT:3352): Gtk-WARNING **: 17:12:08.519: Negative content width -6 (allocation 1, extents 4x3) while allocating gadget (node toolbar, owner GtkToolbar)
13:12:08 [2020-09-26T17:12:08.729Z] 
13:12:08 [2020-09-26T17:12:08.729Z] (SWT:3352): Gtk-WARNING **: 17:12:08.519: Negative content height -3 (allocation 1, extents 2x2) while allocating gadget (node toolbar, owner GtkToolbar)
13:12:08 [2020-09-26T17:12:08.729Z] 
13:12:08 [2020-09-26T17:12:08.729Z] (SWT:3352): Gtk-WARNING **: 17:12:08.523: Negative content width -6 (allocation 1, extents 4x3) while allocating gadget (node toolbar, owner GtkToolbar)
13:12:08 [2020-09-26T17:12:08.729Z] 
13:12:08 [2020-09-26T17:12:08.729Z] (SWT:3352): Gtk-WARNING **: 17:12:08.523: Negative content height -3 (allocation 1, extents 2x2) while allocating gadget (node toolbar, owner GtkToolbar)
13:12:08 [2020-09-26T17:12:08.729Z] 
13:12:08 [2020-09-26T17:12:08.729Z] (SWT:3352): Gtk-WARNING **: 17:12:08.523: Negative content width -6 (allocation 1, extents 4x3) while allocating gadget (node toolbar, owner GtkToolbar)
13:12:08 [2020-09-26T17:12:08.729Z] 
13:12:08 [2020-09-26T17:12:08.729Z] (SWT:3352): Gtk-WARNING **: 17:12:08.523: Negative content height -3 (allocation 1, extents 2x2) while allocating gadget (node toolbar, owner GtkToolbar)
13:12:09 [2020-09-26T17:12:09.294Z] 
13:12:09 [2020-09-26T17:12:09.294Z] (SWT:3352): Gtk-WARNING **: 17:12:09.014: Negative content height -9 (allocation 1, extents 5x5) while allocating gadget (node button, owner GtkButton)
13:12:09 [2020-09-26T17:12:09.294Z] 
13:12:09 [2020-09-26T17:12:09.294Z] (SWT:3352): Gtk-WARNING **: 17:12:09.068: Negative content width -6 (allocation 1, extents 4x3) while allocating gadget (node toolbar, owner GtkToolbar)
13:12:09 [2020-09-26T17:12:09.294Z] 
13:12:09 [2020-09-26T17:12:09.294Z] (SWT:3352): Gtk-WARNING **: 17:12:09.068: Negative content height -3 (allocation 1, extents 2x2) while allocating gadget (node toolbar, owner GtkToolbar)
13:12:09 [2020-09-26T17:12:09.294Z] 
13:12:09 [2020-09-26T17:12:09.294Z] (SWT:3352): Gtk-WARNING **: 17:12:09.068: Negative content width -6 (allocation 1, extents 4x3) while allocating gadget (node toolbar, owner GtkToolbar)
13:12:09 [2020-09-26T17:12:09.294Z] 
13:12:09 [2020-09-26T17:12:09.294Z] (SWT:3352): Gtk-WARNING **: 17:12:09.068: Negative content height -3 (allocation 1, extents 2x2) while allocating gadget (node toolbar, owner GtkToolbar)
13:12:09 [2020-09-26T17:12:09.294Z] 
13:12:09 [2020-09-26T17:12:09.294Z] (SWT:3352): Gtk-WARNING **: 17:12:09.079: Negative content width -6 (allocation 1, extents 4x3) while allocating gadget (node toolbar, owner GtkToolbar)
13:12:09 [2020-09-26T17:12:09.294Z] 
13:12:09 [2020-09-26T17:12:09.294Z] (SWT:3352): Gtk-WARNING **: 17:12:09.079: Negative content height -3 (allocation 1, extents 2x2) while allocating gadget (node toolbar, owner GtkToolbar)
13:12:09 [2020-09-26T17:12:09.294Z] 
13:12:09 [2020-09-26T17:12:09.294Z] (SWT:3352): Gtk-WARNING **: 17:12:09.079: Negative content width -6 (allocation 1, extents 4x3) while allocating gadget (node toolbar, owner GtkToolbar)
13:12:09 [2020-09-26T17:12:09.294Z] 
13:12:09 [2020-09-26T17:12:09.294Z] (SWT:3352): Gtk-WARNING **: 17:12:09.079: Negative content height -3 (allocation 1, extents 2x2) while allocating gadget (node toolbar, owner GtkToolbar)
13:12:09 [2020-09-26T17:12:09.294Z] 
13:12:09 [2020-09-26T17:12:09.294Z] (SWT:3352): Gtk-WARNING **: 17:12:09.120: Negative content width -6 (allocation 1, extents 4x3) while allocating gadget (node toolbar, owner GtkToolbar)
13:12:09 [2020-09-26T17:12:09.294Z] 
13:12:09 [2020-09-26T17:12:09.294Z] (SWT:3352): Gtk-WARNING **: 17:12:09.123: Negative content width -6 (allocation 1, extents 4x3) while allocating gadget (node toolbar, owner GtkToolbar)
13:12:09 [2020-09-26T17:12:09.294Z] 
13:12:09 [2020-09-26T17:12:09.294Z] (SWT:3352): Gtk-WARNING **: 17:12:09.127: Negative content width -6 (allocation 1, extents 4x3) while allocating gadget (node toolbar, owner GtkToolbar)
13:12:09 [2020-09-26T17:12:09.294Z] 
13:12:09 [2020-09-26T17:12:09.294Z] (SWT:3352): Gtk-WARNING **: 17:12:09.129: Negative content width -6 (allocation 1, extents 4x3) while allocating gadget (node toolbar, owner GtkToolbar)
13:12:09 [2020-09-26T17:12:09.294Z] 
13:12:09 [2020-09-26T17:12:09.294Z] (SWT:3352): Gtk-WARNING **: 17:12:09.131: Negative content width -6 (allocation 1, extents 4x3) while allocating gadget (node toolbar, owner GtkToolbar)
13:12:09 [2020-09-26T17:12:09.294Z] 
13:12:09 [2020-09-26T17:12:09.294Z] (SWT:3352): Gtk-WARNING **: 17:12:09.131: Negative content width -1 (allocation 1, extents 1x1) while allocating gadget (node trough, owner GtkProgressBar)
13:12:09 [2020-09-26T17:12:09.294Z] 
13:12:09 [2020-09-26T17:12:09.294Z] (SWT:3352): Gtk-WARNING **: 17:12:09.131: Negative content width -1 (allocation 1, extents 1x1) while allocating gadget (node trough, owner GtkProgressBar)
13:12:09 [2020-09-26T17:12:09.551Z] 
13:12:09 [2020-09-26T17:12:09.551Z] (SWT:3352): Gtk-WARNING **: 17:12:09.343: Negative content width -6 (allocation 1, extents 4x3) while allocating gadget (node toolbar, owner GtkToolbar)
13:12:09 [2020-09-26T17:12:09.551Z] 
13:12:09 [2020-09-26T17:12:09.551Z] (SWT:3352): Gtk-WARNING **: 17:12:09.344: Negative content width -6 (allocation 1, extents 4x3) while allocating gadget (node toolbar, owner GtkToolbar)
13:12:09 [2020-09-26T17:12:09.551Z] 
13:12:09 [2020-09-26T17:12:09.551Z] (SWT:3352): Gtk-WARNING **: 17:12:09.348: Negative content width -6 (allocation 1, extents 4x3) while allocating gadget (node toolbar, owner GtkToolbar)
13:12:09 [2020-09-26T17:12:09.551Z] 
13:12:09 [2020-09-26T17:12:09.551Z] (SWT:3352): Gtk-WARNING **: 17:12:09.349: Negative content width -6 (allocation 1, extents 4x3) while allocating gadget (node toolbar, owner GtkToolbar)
13:12:09 [2020-09-26T17:12:09.551Z] 
13:12:09 [2020-09-26T17:12:09.551Z] (SWT:3352): Gtk-WARNING **: 17:12:09.353: Negative content width -6 (allocation 1, extents 4x3) while allocating gadget (node toolbar, owner GtkToolbar)
13:12:09 [2020-09-26T17:12:09.551Z] 
13:12:09 [2020-09-26T17:12:09.551Z] (SWT:3352): Gtk-WARNING **: 17:12:09.354: Negative content width -6 (allocation 1, extents 4x3) while allocating gadget (node toolbar, owner GtkToolbar)
13:12:09 [2020-09-26T17:12:09.551Z] Running org.eclipse.egit.internal.mylyn.CommitHyperlinkDetectorTest
13:12:09 [2020-09-26T17:12:09.809Z] Tests run: 14, Failures: 0, Errors: 0, Skipped: 0, Time elapsed: 0.095 s - in org.eclipse.egit.internal.mylyn.CommitHyperlinkDetectorTest
13:12:09 [2020-09-26T17:12:09.809Z] testEndLine(org.eclipse.egit.internal.mylyn.CommitHyperlinkDetectorTest)  Time elapsed: 0.03 s
13:12:09 [2020-09-26T17:12:09.809Z] testGerritId(org.eclipse.egit.internal.mylyn.CommitHyperlinkDetectorTest)  Time elapsed: 0.003 s
13:12:09 [2020-09-26T17:12:09.809Z] testMiddleLine(org.eclipse.egit.internal.mylyn.CommitHyperlinkDetectorTest)  Time elapsed: 0.002 s
13:12:09 [2020-09-26T17:12:09.809Z] testOffsetOff(org.eclipse.egit.internal.mylyn.CommitHyperlinkDetectorTest)  Time elapsed: 0.013 s
13:12:09 [2020-09-26T17:12:09.809Z] testEmpty(org.eclipse.egit.internal.mylyn.CommitHyperlinkDetectorTest)  Time elapsed: 0.002 s
13:12:09 [2020-09-26T17:12:09.809Z] testBadLocation(org.eclipse.egit.internal.mylyn.CommitHyperlinkDetectorTest)  Time elapsed: 0.002 s
13:12:09 [2020-09-26T17:12:09.809Z] testEndSentence(org.eclipse.egit.internal.mylyn.CommitHyperlinkDetectorTest)  Time elapsed: 0.003 s
13:12:09 [2020-09-26T17:12:09.809Z] testMultiLine(org.eclipse.egit.internal.mylyn.CommitHyperlinkDetectorTest)  Time elapsed: 0.003 s
13:12:09 [2020-09-26T17:12:09.809Z] testBeginSentence(org.eclipse.egit.internal.mylyn.CommitHyperlinkDetectorTest)  Time elapsed: 0.002 s
13:12:09 [2020-09-26T17:12:09.809Z] testGerritIdWithinText(org.eclipse.egit.internal.mylyn.CommitHyperlinkDetectorTest)  Time elapsed: 0.003 s
13:12:09 [2020-09-26T17:12:09.809Z] testMultiId(org.eclipse.egit.internal.mylyn.CommitHyperlinkDetectorTest)  Time elapsed: 0.004 s
13:12:09 [2020-09-26T17:12:09.809Z] testSimpleId(org.eclipse.egit.internal.mylyn.CommitHyperlinkDetectorTest)  Time elapsed: 0.003 s
13:12:09 [2020-09-26T17:12:09.809Z] testNoDocument(org.eclipse.egit.internal.mylyn.CommitHyperlinkDetectorTest)  Time elapsed: 0.003 s
13:12:09 [2020-09-26T17:12:09.810Z] testOffsetMiddle(org.eclipse.egit.internal.mylyn.CommitHyperlinkDetectorTest)  Time elapsed: 0.003 s
13:12:09 [2020-09-26T17:12:09.810Z] 
13:12:09 [2020-09-26T17:12:09.810Z] Results:
13:12:09 [2020-09-26T17:12:09.810Z] 
13:12:09 [2020-09-26T17:12:09.810Z] Tests run: 14, Failures: 0, Errors: 0, Skipped: 0
13:12:09 [2020-09-26T17:12:09.810Z] 
13:12:09 [2020-09-26T17:12:09.810Z] 
13:12:09 [2020-09-26T17:12:09.810Z] (SWT:3352): Gtk-WARNING **: 17:12:09.572: Negative content width -6 (allocation 1, extents 4x3) while allocating gadget (node toolbar, owner GtkToolbar)
13:12:09 [2020-09-26T17:12:09.810Z] 
13:12:09 [2020-09-26T17:12:09.810Z] (SWT:3352): Gtk-WARNING **: 17:12:09.573: Negative content width -6 (allocation 1, extents 4x3) while allocating gadget (node toolbar, owner GtkToolbar)
13:12:12 [2020-09-26T17:12:12.345Z] [INFO] All tests passed!
13:12:12 [2020-09-26T17:12:12.345Z] [INFO] 
13:12:12 [2020-09-26T17:12:12.345Z] [INFO] >>> spotbugs-maven-plugin:3.1.12:check (default) > :spotbugs @ org.eclipse.egit.mylyn.ui.test >>>
13:12:12 [2020-09-26T17:12:12.345Z] [INFO] 
13:12:12 [2020-09-26T17:12:12.345Z] [INFO] --- spotbugs-maven-plugin:3.1.12:spotbugs (spotbugs) @ org.eclipse.egit.mylyn.ui.test ---
13:12:12 [2020-09-26T17:12:12.345Z] [INFO] Fork Value is true
13:12:14 [2020-09-26T17:12:14.241Z] [INFO] Done SpotBugs Analysis....
13:12:14 [2020-09-26T17:12:14.241Z] [INFO] 
13:12:14 [2020-09-26T17:12:14.241Z] [INFO] <<< spotbugs-maven-plugin:3.1.12:check (default) < :spotbugs @ org.eclipse.egit.mylyn.ui.test <<<
13:12:14 [2020-09-26T17:12:14.242Z] [INFO] 
13:12:14 [2020-09-26T17:12:14.242Z] [INFO] 
13:12:14 [2020-09-26T17:12:14.242Z] [INFO] --- spotbugs-maven-plugin:3.1.12:check (default) @ org.eclipse.egit.mylyn.ui.test ---
13:12:14 [2020-09-26T17:12:14.242Z] [INFO] BugInstance size is 0
13:12:14 [2020-09-26T17:12:14.242Z] [INFO] Error size is 0
13:12:14 [2020-09-26T17:12:14.242Z] [INFO] No errors/warnings found
13:12:14 [2020-09-26T17:12:14.242Z] [INFO] 
13:12:14 [2020-09-26T17:12:14.242Z] [INFO] >>> maven-pmd-plugin:3.12.0:cpd-check (default) > :cpd @ org.eclipse.egit.mylyn.ui.test >>>
13:12:14 [2020-09-26T17:12:14.242Z] [INFO] 
13:12:14 [2020-09-26T17:12:14.242Z] [INFO] --- maven-pmd-plugin:3.12.0:cpd (cpd) @ org.eclipse.egit.mylyn.ui.test ---
13:12:14 [2020-09-26T17:12:14.242Z] [INFO] 
13:12:14 [2020-09-26T17:12:14.242Z] [INFO] <<< maven-pmd-plugin:3.12.0:cpd-check (default) < :cpd @ org.eclipse.egit.mylyn.ui.test <<<
13:12:14 [2020-09-26T17:12:14.242Z] [INFO] 
13:12:14 [2020-09-26T17:12:14.242Z] [INFO] 
13:12:14 [2020-09-26T17:12:14.242Z] [INFO] --- maven-pmd-plugin:3.12.0:cpd-check (default) @ org.eclipse.egit.mylyn.ui.test ---
13:12:14 [2020-09-26T17:12:14.242Z] [INFO] 
13:12:14 [2020-09-26T17:12:14.242Z] [INFO] 
13:12:14 [2020-09-26T17:12:14.242Z] [INFO] --- tycho-pack200a-plugin:1.7.0:normalize (pack200-normalize) @ org.eclipse.egit.mylyn.ui.test ---
13:12:14 [2020-09-26T17:12:14.242Z] [INFO] Pack200 normalizing jar /home/jenkins/agent/workspace/egit/repo/org.eclipse.egit.mylyn.ui.test/target/org.eclipse.egit.mylyn.ui.test-5.10.0-SNAPSHOT.jar
13:12:14 [2020-09-26T17:12:14.242Z] [INFO] 
13:12:14 [2020-09-26T17:12:14.242Z] [INFO] --- eclipse-jarsigner-plugin:1.1.5:sign (sign) @ org.eclipse.egit.mylyn.ui.test ---
13:12:14 [2020-09-26T17:12:14.242Z] [INFO] Signing jar: /home/jenkins/agent/workspace/egit/repo/org.eclipse.egit.mylyn.ui.test/target/org.eclipse.egit.mylyn.ui.test-5.10.0-SNAPSHOT.jar
13:12:15 [2020-09-26T17:12:15.615Z] [INFO] 
13:12:15 [2020-09-26T17:12:15.615Z] [INFO] --- tycho-pack200b-plugin:1.7.0:pack (pack200-pack) @ org.eclipse.egit.mylyn.ui.test ---
13:12:15 [2020-09-26T17:12:15.615Z] [INFO] Pack200 packing jar /home/jenkins/agent/workspace/egit/repo/org.eclipse.egit.mylyn.ui.test/target/org.eclipse.egit.mylyn.ui.test-5.10.0-SNAPSHOT.jar
13:12:15 [2020-09-26T17:12:15.615Z] [INFO] 
13:12:15 [2020-09-26T17:12:15.615Z] [INFO] --- tycho-p2-plugin:1.7.0:p2-metadata (p2-metadata) @ org.eclipse.egit.mylyn.ui.test ---
13:12:15 [2020-09-26T17:12:15.615Z] [INFO] 
13:12:15 [2020-09-26T17:12:15.615Z] [INFO] --- maven-install-plugin:2.3.1:install (default-install) @ org.eclipse.egit.mylyn.ui.test ---
13:12:15 [2020-09-26T17:12:15.615Z] [INFO] Installing /home/jenkins/agent/workspace/egit/repo/org.eclipse.egit.mylyn.ui.test/target/org.eclipse.egit.mylyn.ui.test-5.10.0-SNAPSHOT.jar to /home/jenkins/agent/workspace/egit/.repository/org/eclipse/egit/org.eclipse.egit.mylyn.ui.test/5.10.0-SNAPSHOT/org.eclipse.egit.mylyn.ui.test-5.10.0-SNAPSHOT.jar
13:12:15 [2020-09-26T17:12:15.615Z] [INFO] Installing /home/jenkins/agent/workspace/egit/repo/org.eclipse.egit.mylyn.ui.test/pom.xml to /home/jenkins/agent/workspace/egit/.repository/org/eclipse/egit/org.eclipse.egit.mylyn.ui.test/5.10.0-SNAPSHOT/org.eclipse.egit.mylyn.ui.test-5.10.0-SNAPSHOT.pom
13:12:15 [2020-09-26T17:12:15.615Z] [INFO] Installing /home/jenkins/agent/workspace/egit/repo/org.eclipse.egit.mylyn.ui.test/target/org.eclipse.egit.mylyn.ui.test-5.10.0-SNAPSHOT.jar.pack.gz to /home/jenkins/agent/workspace/egit/.repository/org/eclipse/egit/org.eclipse.egit.mylyn.ui.test/5.10.0-SNAPSHOT/org.eclipse.egit.mylyn.ui.test-5.10.0-SNAPSHOT-pack200.jar.pack.gz
13:12:15 [2020-09-26T17:12:15.615Z] [INFO] Installing /home/jenkins/agent/workspace/egit/repo/org.eclipse.egit.mylyn.ui.test/target/p2content.xml to /home/jenkins/agent/workspace/egit/.repository/org/eclipse/egit/org.eclipse.egit.mylyn.ui.test/5.10.0-SNAPSHOT/org.eclipse.egit.mylyn.ui.test-5.10.0-SNAPSHOT-p2metadata.xml
13:12:15 [2020-09-26T17:12:15.615Z] [INFO] Installing /home/jenkins/agent/workspace/egit/repo/org.eclipse.egit.mylyn.ui.test/target/p2artifacts.xml to /home/jenkins/agent/workspace/egit/.repository/org/eclipse/egit/org.eclipse.egit.mylyn.ui.test/5.10.0-SNAPSHOT/org.eclipse.egit.mylyn.ui.test-5.10.0-SNAPSHOT-p2artifacts.xml
13:12:15 [2020-09-26T17:12:15.615Z] [INFO] 
13:12:15 [2020-09-26T17:12:15.615Z] [INFO] --- tycho-p2-plugin:1.7.0:update-local-index (default-update-local-index) @ org.eclipse.egit.mylyn.ui.test ---
13:12:15 [2020-09-26T17:12:15.615Z] [INFO] ------------------------------------------------------------------------
13:12:15 [2020-09-26T17:12:15.615Z] [INFO] Reactor Summary for EGit Parent 5.10.0-SNAPSHOT:
13:12:15 [2020-09-26T17:12:15.615Z] [INFO] 
13:12:15 [2020-09-26T17:12:15.615Z] [INFO] EGit Parent ........................................ SUCCESS [ 34.238 s]
13:12:15 [2020-09-26T17:12:15.615Z] [INFO] EGit Target Platform Definition .................... SUCCESS [  1.444 s]
13:12:15 [2020-09-26T17:12:15.615Z] [INFO] Eclipse EGit ....................................... SUCCESS [  7.143 s]
13:12:15 [2020-09-26T17:12:15.615Z] [INFO] Git Team Provider (Core) ........................... SUCCESS [ 16.254 s]
13:12:15 [2020-09-26T17:12:15.615Z] [INFO] Git Team Provider (UI) ............................. SUCCESS [ 44.533 s]
13:12:15 [2020-09-26T17:12:15.615Z] [INFO] EGit Mylyn UI ...................................... SUCCESS [  6.696 s]
13:12:15 [2020-09-26T17:12:15.616Z] [INFO] Git Team Provider (Documentation) .................. SUCCESS [  4.432 s]
13:12:15 [2020-09-26T17:12:15.616Z] [INFO] Eclipse EGit Feature ............................... SUCCESS [  1.139 s]
13:12:15 [2020-09-26T17:12:15.616Z] [INFO] EGit Mylyn Feature ................................. SUCCESS [  1.075 s]
13:12:15 [2020-09-26T17:12:15.616Z] [INFO] Git Flow ........................................... SUCCESS [  5.878 s]
13:12:15 [2020-09-26T17:12:15.616Z] [INFO] Git Flow UI ........................................ SUCCESS [  8.394 s]
13:12:15 [2020-09-26T17:12:15.616Z] [INFO] Eclipse EGit Gitflow Feature ....................... SUCCESS [  1.080 s]
13:12:15 [2020-09-26T17:12:15.616Z] [INFO] EGit JUnit Support ................................. SUCCESS [  6.187 s]
13:12:15 [2020-09-26T17:12:15.616Z] [INFO] GitFlow Test Plug-in ............................... SUCCESS [ 24.961 s]
13:12:15 [2020-09-26T17:12:15.616Z] [INFO] Eclipse EGit Source Feature ........................ SUCCESS [  1.071 s]
13:12:15 [2020-09-26T17:12:15.616Z] [INFO] EGit P2 Repository ................................. SUCCESS [  9.634 s]
13:12:15 [2020-09-26T17:12:15.616Z] [INFO] EGit Core Test Plug-in ............................. SUCCESS [02:11 min]
13:12:15 [2020-09-26T17:12:15.616Z] [INFO] EGit UI Test Plug-in ............................... SUCCESS [13:12 min]
13:12:15 [2020-09-26T17:12:15.616Z] [INFO] EGit Mylyn UI Test Plug-in ......................... SUCCESS [ 11.535 s]
13:12:15 [2020-09-26T17:12:15.616Z] [INFO] ------------------------------------------------------------------------
13:12:15 [2020-09-26T17:12:15.616Z] [INFO] BUILD SUCCESS
13:12:15 [2020-09-26T17:12:15.616Z] [INFO] ------------------------------------------------------------------------
13:12:15 [2020-09-26T17:12:15.616Z] [INFO] Total time:  21:20 min
13:12:15 [2020-09-26T17:12:15.616Z] [INFO] Finished at: 2020-09-26T17:12:15Z
13:12:15 [2020-09-26T17:12:15.616Z] [INFO] ------------------------------------------------------------------------