FailedConsole Output

Skipping 900 KB.. Full Log
kToolbar)
20:58:34 [2020-08-28T00:58:34.866Z] 
20:58:34 [2020-08-28T00:58:34.866Z] (SWT:1591): Gtk-WARNING **: 00:58:34.664: Negative content width -6 (allocation 1, extents 4x3) while allocating gadget (node toolbar, owner GtkToolbar)
20:58:34 [2020-08-28T00:58:34.866Z] 
20:58:34 [2020-08-28T00:58:34.866Z] (SWT:1591): Gtk-WARNING **: 00:58:34.673: Negative content width -6 (allocation 1, extents 4x3) while allocating gadget (node toolbar, owner GtkToolbar)
20:58:34 [2020-08-28T00:58:34.866Z] 
20:58:34 [2020-08-28T00:58:34.866Z] (SWT:1591): Gtk-WARNING **: 00:58:34.674: Negative content width -6 (allocation 1, extents 4x3) while allocating gadget (node toolbar, owner GtkToolbar)
20:58:34 [2020-08-28T00:58:34.866Z] 
20:58:34 [2020-08-28T00:58:34.866Z] (SWT:1591): Gtk-WARNING **: 00:58:34.674: Negative content width -6 (allocation 1, extents 4x3) while allocating gadget (node toolbar, owner GtkToolbar)
20:58:34 [2020-08-28T00:58:34.866Z] 
20:58:34 [2020-08-28T00:58:34.866Z] (SWT:1591): Gtk-WARNING **: 00:58:34.689: Negative content width -6 (allocation 1, extents 4x3) while allocating gadget (node toolbar, owner GtkToolbar)
20:58:34 [2020-08-28T00:58:34.866Z] 
20:58:34 [2020-08-28T00:58:34.866Z] (SWT:1591): Gtk-WARNING **: 00:58:34.738: Negative content width -6 (allocation 1, extents 4x3) while allocating gadget (node toolbar, owner GtkToolbar)
20:58:34 [2020-08-28T00:58:34.866Z] 
20:58:34 [2020-08-28T00:58:34.866Z] (SWT:1591): Gtk-WARNING **: 00:58:34.798: Negative content width -6 (allocation 1, extents 4x3) while allocating gadget (node toolbar, owner GtkToolbar)
20:58:34 [2020-08-28T00:58:34.866Z] 
20:58:34 [2020-08-28T00:58:34.866Z] (SWT:1591): Gtk-WARNING **: 00:58:34.835: Negative content width -6 (allocation 1, extents 4x3) while allocating gadget (node toolbar, owner GtkToolbar)
20:58:34 [2020-08-28T00:58:34.866Z] 
20:58:34 [2020-08-28T00:58:34.866Z] (SWT:1591): Gtk-CRITICAL **: 00:58:34.862: gtk_box_gadget_distribute: assertion 'size >= 0' failed in GtkScrollbar
20:58:35 [2020-08-28T00:58:35.123Z] 
20:58:35 [2020-08-28T00:58:35.123Z] (SWT:1591): Gtk-CRITICAL **: 00:58:34.864: gtk_box_gadget_distribute: assertion 'size >= 0' failed in GtkScrollbar
20:58:35 [2020-08-28T00:58:35.123Z] 
20:58:35 [2020-08-28T00:58:35.123Z] (SWT:1591): Gtk-CRITICAL **: 00:58:34.879: gtk_box_gadget_distribute: assertion 'size >= 0' failed in GtkScrollbar
20:58:35 [2020-08-28T00:58:35.123Z] 
20:58:35 [2020-08-28T00:58:35.123Z] (SWT:1591): Gtk-CRITICAL **: 00:58:34.900: gtk_box_gadget_distribute: assertion 'size >= 0' failed in GtkScrollbar
20:58:35 [2020-08-28T00:58:35.123Z] 
20:58:35 [2020-08-28T00:58:35.123Z] (SWT:1591): Gtk-CRITICAL **: 00:58:34.912: gtk_box_gadget_distribute: assertion 'size >= 0' failed in GtkScrollbar
20:58:35 [2020-08-28T00:58:35.123Z] 
20:58:35 [2020-08-28T00:58:35.123Z] (SWT:1591): Gtk-CRITICAL **: 00:58:34.929: gtk_box_gadget_distribute: assertion 'size >= 0' failed in GtkScrollbar
20:58:35 [2020-08-28T00:58:35.123Z] 
20:58:35 [2020-08-28T00:58:35.123Z] (SWT:1591): Gtk-CRITICAL **: 00:58:34.945: gtk_box_gadget_distribute: assertion 'size >= 0' failed in GtkScrollbar
20:58:35 [2020-08-28T00:58:35.123Z] 
20:58:35 [2020-08-28T00:58:35.123Z] (SWT:1591): Gtk-CRITICAL **: 00:58:34.963: gtk_box_gadget_distribute: assertion 'size >= 0' failed in GtkScrollbar
20:58:35 [2020-08-28T00:58:35.123Z] 
20:58:35 [2020-08-28T00:58:35.123Z] (SWT:1591): Gtk-CRITICAL **: 00:58:34.979: gtk_box_gadget_distribute: assertion 'size >= 0' failed in GtkScrollbar
20:58:35 [2020-08-28T00:58:35.123Z] 
20:58:35 [2020-08-28T00:58:35.123Z] (SWT:1591): Gtk-CRITICAL **: 00:58:34.995: gtk_box_gadget_distribute: assertion 'size >= 0' failed in GtkScrollbar
20:58:35 [2020-08-28T00:58:35.123Z] 
20:58:35 [2020-08-28T00:58:35.123Z] (SWT:1591): Gtk-CRITICAL **: 00:58:35.012: gtk_box_gadget_distribute: assertion 'size >= 0' failed in GtkScrollbar
20:58:35 [2020-08-28T00:58:35.123Z] 
20:58:35 [2020-08-28T00:58:35.123Z] (SWT:1591): Gtk-CRITICAL **: 00:58:35.029: gtk_box_gadget_distribute: assertion 'size >= 0' failed in GtkScrollbar
20:58:35 [2020-08-28T00:58:35.123Z] 
20:58:35 [2020-08-28T00:58:35.123Z] (SWT:1591): Gtk-WARNING **: 00:58:35.039: Negative content width -6 (allocation 1, extents 4x3) while allocating gadget (node toolbar, owner GtkToolbar)
20:58:35 [2020-08-28T00:58:35.124Z] 
20:58:35 [2020-08-28T00:58:35.124Z] (SWT:1591): Gtk-WARNING **: 00:58:35.048: Negative content width -6 (allocation 1, extents 4x3) while allocating gadget (node toolbar, owner GtkToolbar)
20:58:36 [2020-08-28T00:58:36.494Z] 
20:58:36 [2020-08-28T00:58:36.494Z] (SWT:1591): Gtk-WARNING **: 00:58:36.387: Negative content width -6 (allocation 1, extents 4x3) while allocating gadget (node toolbar, owner GtkToolbar)
20:58:36 [2020-08-28T00:58:36.752Z] 
20:58:36 [2020-08-28T00:58:36.752Z] (SWT:1591): Gtk-WARNING **: 00:58:36.595: Negative content width -6 (allocation 1, extents 4x3) while allocating gadget (node toolbar, owner GtkToolbar)
20:58:37 [2020-08-28T00:58:37.334Z] 
20:58:37 [2020-08-28T00:58:37.334Z] (SWT:1591): Gtk-WARNING **: 00:58:37.112: Negative content width -6 (allocation 1, extents 4x3) while allocating gadget (node toolbar, owner GtkToolbar)
20:58:37 [2020-08-28T00:58:37.627Z] 
20:58:37 [2020-08-28T00:58:37.627Z] (SWT:1591): Gtk-WARNING **: 00:58:37.326: Negative content width -6 (allocation 1, extents 4x3) while allocating gadget (node toolbar, owner GtkToolbar)
20:58:37 [2020-08-28T00:58:37.884Z] 
20:58:37 [2020-08-28T00:58:37.885Z] (SWT:1591): Gtk-CRITICAL **: 00:58:37.855: gtk_box_gadget_distribute: assertion 'size >= 0' failed in GtkScrollbar
20:58:37 [2020-08-28T00:58:37.885Z] 
20:58:37 [2020-08-28T00:58:37.885Z] (SWT:1591): Gtk-WARNING **: 00:58:37.857: Negative content width -6 (allocation 1, extents 4x3) while allocating gadget (node toolbar, owner GtkToolbar)
20:58:37 [2020-08-28T00:58:37.885Z] 
20:58:37 [2020-08-28T00:58:37.885Z] (SWT:1591): Gtk-CRITICAL **: 00:58:37.868: gtk_box_gadget_distribute: assertion 'size >= 0' failed in GtkScrollbar
20:58:37 [2020-08-28T00:58:37.885Z] 
20:58:37 [2020-08-28T00:58:37.885Z] (SWT:1591): Gtk-CRITICAL **: 00:58:37.868: gtk_box_gadget_distribute: assertion 'size >= 0' failed in GtkScrollbar
20:58:38 [2020-08-28T00:58:38.141Z] 
20:58:38 [2020-08-28T00:58:38.141Z] (SWT:1591): Gtk-CRITICAL **: 00:58:37.885: gtk_box_gadget_distribute: assertion 'size >= 0' failed in GtkScrollbar
20:58:38 [2020-08-28T00:58:38.141Z] 
20:58:38 [2020-08-28T00:58:38.141Z] (SWT:1591): Gtk-WARNING **: 00:58:38.062: Negative content width -6 (allocation 1, extents 4x3) while allocating gadget (node toolbar, owner GtkToolbar)
20:58:38 [2020-08-28T00:58:38.704Z] 
20:58:38 [2020-08-28T00:58:38.704Z] (SWT:1591): Gtk-WARNING **: 00:58:38.587: Negative content width -6 (allocation 1, extents 4x3) while allocating gadget (node toolbar, owner GtkToolbar)
20:58:38 [2020-08-28T00:58:38.704Z] 
20:58:38 [2020-08-28T00:58:38.704Z] (SWT:1591): Gtk-CRITICAL **: 00:58:38.592: gtk_box_gadget_distribute: assertion 'size >= 0' failed in GtkScrollbar
20:58:38 [2020-08-28T00:58:38.704Z] 
20:58:38 [2020-08-28T00:58:38.704Z] (SWT:1591): Gtk-CRITICAL **: 00:58:38.602: gtk_box_gadget_distribute: assertion 'size >= 0' failed in GtkScrollbar
20:58:38 [2020-08-28T00:58:38.962Z] 
20:58:38 [2020-08-28T00:58:38.962Z] (SWT:1591): Gtk-WARNING **: 00:58:38.793: Negative content width -6 (allocation 1, extents 4x3) while allocating gadget (node toolbar, owner GtkToolbar)
20:58:39 [2020-08-28T00:58:39.894Z] 
20:58:39 [2020-08-28T00:58:39.894Z] (SWT:1591): Gtk-WARNING **: 00:58:39.686: Negative content width -6 (allocation 1, extents 4x3) while allocating gadget (node toolbar, owner GtkToolbar)
20:58:39 [2020-08-28T00:58:39.894Z] 
20:58:39 [2020-08-28T00:58:39.894Z] (SWT:1591): Gtk-WARNING **: 00:58:39.696: Negative content width -6 (allocation 1, extents 4x3) while allocating gadget (node toolbar, owner GtkToolbar)
20:58:39 [2020-08-28T00:58:39.894Z] Tests run: 3, Failures: 0, Errors: 0, Skipped: 1, Time elapsed: 12.352 s - in org.eclipse.egit.ui.internal.selection.SelectionForViewsTest
20:58:39 [2020-08-28T00:58:39.894Z] testViewsReactOnRepoSwitchInStaging(org.eclipse.egit.ui.internal.selection.SelectionForViewsTest) skipped
20:58:39 [2020-08-28T00:58:39.894Z] testViewsReactOnBareRepoViewSelection(org.eclipse.egit.ui.internal.selection.SelectionForViewsTest)  Time elapsed: 6.323 s
20:58:39 [2020-08-28T00:58:39.894Z] testViewsReactOnRepoViewSelection(org.eclipse.egit.ui.internal.selection.SelectionForViewsTest)  Time elapsed: 6.022 s
20:58:39 [2020-08-28T00:58:39.894Z] Running org.eclipse.egit.ui.internal.selection.SelectionUtilsTest
20:58:39 [2020-08-28T00:58:39.894Z] Tests run: 1, Failures: 0, Errors: 0, Skipped: 0, Time elapsed: 0.058 s - in org.eclipse.egit.ui.internal.selection.SelectionUtilsTest
20:58:39 [2020-08-28T00:58:39.894Z] getSelectedResourcesShouldUseAllTraversals(org.eclipse.egit.ui.internal.selection.SelectionUtilsTest)  Time elapsed: 0.058 s
20:58:39 [2020-08-28T00:58:39.894Z] Running org.eclipse.egit.ui.internal.CommonUtilsTest
20:58:40 [2020-08-28T00:58:40.152Z] Tests run: 10, Failures: 0, Errors: 0, Skipped: 0, Time elapsed: 0.047 s - in org.eclipse.egit.ui.internal.CommonUtilsTest
20:58:40 [2020-08-28T00:58:40.152Z] sortingShouldWorkForBigNumbers(org.eclipse.egit.ui.internal.CommonUtilsTest)  Time elapsed: 0.001 s
20:58:40 [2020-08-28T00:58:40.152Z] sortingShouldWorkForMixedParts(org.eclipse.egit.ui.internal.CommonUtilsTest)  Time elapsed: 0 s
20:58:40 [2020-08-28T00:58:40.152Z] sortingShouldWorkForNumbers(org.eclipse.egit.ui.internal.CommonUtilsTest)  Time elapsed: 0 s
20:58:40 [2020-08-28T00:58:40.152Z] testFooterOffset(org.eclipse.egit.ui.internal.CommonUtilsTest)  Time elapsed: 0 s
20:58:40 [2020-08-28T00:58:40.152Z] sortingShouldWorkForEqualAndEmptyStrings(org.eclipse.egit.ui.internal.CommonUtilsTest)  Time elapsed: 0 s
20:58:40 [2020-08-28T00:58:40.152Z] sortingShouldIgnoreCase(org.eclipse.egit.ui.internal.CommonUtilsTest)  Time elapsed: 0 s
20:58:40 [2020-08-28T00:58:40.152Z] testFooterOffsetNoFooter(org.eclipse.egit.ui.internal.CommonUtilsTest)  Time elapsed: 0 s
20:58:40 [2020-08-28T00:58:40.152Z] sortingShouldIgnoreLeadingZeros(org.eclipse.egit.ui.internal.CommonUtilsTest)  Time elapsed: 0 s
20:58:40 [2020-08-28T00:58:40.152Z] testResourceCompare(org.eclipse.egit.ui.internal.CommonUtilsTest)  Time elapsed: 0.046 s
20:58:40 [2020-08-28T00:58:40.152Z] sortingShouldWorkForEasyStrings(org.eclipse.egit.ui.internal.CommonUtilsTest)  Time elapsed: 0 s
20:58:40 [2020-08-28T00:58:40.152Z] Running org.eclipse.egit.ui.internal.dialogs.HyperlinkTokenScannerTest
20:58:40 [2020-08-28T00:58:40.152Z] Tests run: 10, Failures: 0, Errors: 0, Skipped: 0, Time elapsed: 0.113 s - in org.eclipse.egit.ui.internal.dialogs.HyperlinkTokenScannerTest
20:58:40 [2020-08-28T00:58:40.152Z] tokenizeEmbeddedHyperlink(org.eclipse.egit.ui.internal.dialogs.HyperlinkTokenScannerTest)  Time elapsed: 0.105 s
20:58:40 [2020-08-28T00:58:40.152Z] tokenizeWithFailingDetector(org.eclipse.egit.ui.internal.dialogs.HyperlinkTokenScannerTest)  Time elapsed: 0.001 s
20:58:40 [2020-08-28T00:58:40.152Z] tokenizeWithoutDetectors(org.eclipse.egit.ui.internal.dialogs.HyperlinkTokenScannerTest)  Time elapsed: 0 s
20:58:40 [2020-08-28T00:58:40.152Z] tokenizeHyperlinksOutsideRegion(org.eclipse.egit.ui.internal.dialogs.HyperlinkTokenScannerTest)  Time elapsed: 0 s
20:58:40 [2020-08-28T00:58:40.152Z] tokenizeMultipleHyperlinksSimple(org.eclipse.egit.ui.internal.dialogs.HyperlinkTokenScannerTest)  Time elapsed: 0.001 s
20:58:40 [2020-08-28T00:58:40.152Z] tokenizeMultipleHyperlinksMultiline(org.eclipse.egit.ui.internal.dialogs.HyperlinkTokenScannerTest)  Time elapsed: 0 s
20:58:40 [2020-08-28T00:58:40.152Z] tokenizeLeadingHyperlink(org.eclipse.egit.ui.internal.dialogs.HyperlinkTokenScannerTest)  Time elapsed: 0.001 s
20:58:40 [2020-08-28T00:58:40.152Z] tokenizeEmpty(org.eclipse.egit.ui.internal.dialogs.HyperlinkTokenScannerTest)  Time elapsed: 0 s
20:58:40 [2020-08-28T00:58:40.152Z] tokenizeHyperlinksCutByRegion(org.eclipse.egit.ui.internal.dialogs.HyperlinkTokenScannerTest)  Time elapsed: 0.001 s
20:58:40 [2020-08-28T00:58:40.152Z] tokenizeNoHyperlinks(org.eclipse.egit.ui.internal.dialogs.HyperlinkTokenScannerTest)  Time elapsed: 0 s
20:58:40 [2020-08-28T00:58:40.152Z] Running org.eclipse.egit.ui.internal.dialogs.CommitMessageBuilderTest
20:58:41 [2020-08-28T00:58:41.524Z] 
20:58:41 [2020-08-28T00:58:41.524Z] !ENTRY org.eclipse.egit.ui 4 0 2020-08-28 00:58:41.427
20:58:41 [2020-08-28T00:58:41.524Z] !MESSAGE CrashingCommitMessageProvider fails on purpose.
20:58:41 [2020-08-28T00:58:41.524Z] !STACK 0
20:58:41 [2020-08-28T00:58:41.524Z] java.lang.IllegalStateException: CrashingCommitMessageProvider fails on purpose.
20:58:41 [2020-08-28T00:58:41.524Z] 	at org.eclipse.egit.ui.internal.dialogs.CommitMessageBuilderTest$CrashingCommitMessageProvider.getMessage(CommitMessageBuilderTest.java:474)
20:58:41 [2020-08-28T00:58:41.524Z] 	at org.eclipse.egit.ui.internal.dialogs.CommitMessageBuilder.build(CommitMessageBuilder.java:90)
20:58:41 [2020-08-28T00:58:41.524Z] 	at org.eclipse.egit.ui.internal.dialogs.CommitMessageBuilderTest.commitMessageProvider_oneCrashingProvider(CommitMessageBuilderTest.java:99)
20:58:41 [2020-08-28T00:58:41.524Z] 	at sun.reflect.NativeMethodAccessorImpl.invoke0(Native Method)
20:58:41 [2020-08-28T00:58:41.524Z] 	at sun.reflect.NativeMethodAccessorImpl.invoke(NativeMethodAccessorImpl.java:62)
20:58:41 [2020-08-28T00:58:41.524Z] 	at sun.reflect.DelegatingMethodAccessorImpl.invoke(DelegatingMethodAccessorImpl.java:43)
20:58:41 [2020-08-28T00:58:41.524Z] 	at java.lang.reflect.Method.invoke(Method.java:498)
20:58:41 [2020-08-28T00:58:41.524Z] 	at org.junit.runners.model.FrameworkMethod$1.runReflectiveCall(FrameworkMethod.java:59)
20:58:41 [2020-08-28T00:58:41.524Z] 	at org.junit.internal.runners.model.ReflectiveCallable.run(ReflectiveCallable.java:12)
20:58:41 [2020-08-28T00:58:41.524Z] 	at org.junit.runners.model.FrameworkMethod.invokeExplosively(FrameworkMethod.java:56)
20:58:41 [2020-08-28T00:58:41.524Z] 	at org.junit.internal.runners.statements.InvokeMethod.evaluate(InvokeMethod.java:17)
20:58:41 [2020-08-28T00:58:41.524Z] 	at org.junit.internal.runners.statements.RunBefores.evaluate(RunBefores.java:26)
20:58:41 [2020-08-28T00:58:41.524Z] 	at org.junit.internal.runners.statements.RunAfters.evaluate(RunAfters.java:27)
20:58:41 [2020-08-28T00:58:41.524Z] 	at org.junit.runners.ParentRunner$3.evaluate(ParentRunner.java:306)
20:58:41 [2020-08-28T00:58:41.525Z] 	at org.junit.runners.BlockJUnit4ClassRunner$1.evaluate(BlockJUnit4ClassRunner.java:100)
20:58:41 [2020-08-28T00:58:41.525Z] 	at org.junit.runners.ParentRunner.runLeaf(ParentRunner.java:366)
20:58:41 [2020-08-28T00:58:41.525Z] 	at org.junit.runners.BlockJUnit4ClassRunner.runChild(BlockJUnit4ClassRunner.java:103)
20:58:41 [2020-08-28T00:58:41.525Z] 	at org.junit.runners.BlockJUnit4ClassRunner.runChild(BlockJUnit4ClassRunner.java:63)
20:58:41 [2020-08-28T00:58:41.525Z] 	at org.junit.runners.ParentRunner$4.run(ParentRunner.java:331)
20:58:41 [2020-08-28T00:58:41.525Z] 	at org.junit.runners.ParentRunner$1.schedule(ParentRunner.java:79)
20:58:41 [2020-08-28T00:58:41.525Z] 	at org.junit.runners.ParentRunner.runChildren(ParentRunner.java:329)
20:58:41 [2020-08-28T00:58:41.525Z] 	at org.junit.runners.ParentRunner.access$100(ParentRunner.java:66)
20:58:41 [2020-08-28T00:58:41.525Z] 	at org.junit.runners.ParentRunner$2.evaluate(ParentRunner.java:293)
20:58:41 [2020-08-28T00:58:41.525Z] 	at org.junit.internal.runners.statements.RunBefores.evaluate(RunBefores.java:26)
20:58:41 [2020-08-28T00:58:41.525Z] 	at org.junit.runners.ParentRunner$3.evaluate(ParentRunner.java:306)
20:58:41 [2020-08-28T00:58:41.525Z] 	at org.junit.runners.ParentRunner.run(ParentRunner.java:413)
20:58:41 [2020-08-28T00:58:41.525Z] 	at org.apache.maven.surefire.junit4.JUnit4Provider.execute(JUnit4Provider.java:365)
20:58:41 [2020-08-28T00:58:41.525Z] 	at org.apache.maven.surefire.junit4.JUnit4Provider.executeWithRerun(JUnit4Provider.java:273)
20:58:41 [2020-08-28T00:58:41.525Z] 	at org.apache.maven.surefire.junit4.JUnit4Provider.executeTestSet(JUnit4Provider.java:238)
20:58:41 [2020-08-28T00:58:41.525Z] 	at org.apache.maven.surefire.junit4.JUnit4Provider.invoke(JUnit4Provider.java:159)
20:58:41 [2020-08-28T00:58:41.525Z] 	at sun.reflect.NativeMethodAccessorImpl.invoke0(Native Method)
20:58:41 [2020-08-28T00:58:41.525Z] 	at sun.reflect.NativeMethodAccessorImpl.invoke(NativeMethodAccessorImpl.java:62)
20:58:41 [2020-08-28T00:58:41.525Z] 	at sun.reflect.DelegatingMethodAccessorImpl.invoke(DelegatingMethodAccessorImpl.java:43)
20:58:41 [2020-08-28T00:58:41.525Z] 	at java.lang.reflect.Method.invoke(Method.java:498)
20:58:41 [2020-08-28T00:58:41.525Z] 	at org.apache.maven.surefire.util.ReflectionUtils.invokeMethodWithArray2(ReflectionUtils.java:206)
20:58:41 [2020-08-28T00:58:41.525Z] 	at org.apache.maven.surefire.booter.ProviderFactory$ProviderProxy.invoke(ProviderFactory.java:161)
20:58:41 [2020-08-28T00:58:41.525Z] 	at org.apache.maven.surefire.booter.ProviderFactory.invokeProvider(ProviderFactory.java:84)
20:58:41 [2020-08-28T00:58:41.525Z] 	at org.eclipse.tycho.surefire.osgibooter.OsgiSurefireBooter.run(OsgiSurefireBooter.java:113)
20:58:41 [2020-08-28T00:58:41.525Z] 	at org.eclipse.tycho.surefire.osgibooter.AbstractUITestApplication.runTests(AbstractUITestApplication.java:44)
20:58:41 [2020-08-28T00:58:41.525Z] 	at org.eclipse.e4.ui.internal.workbench.swt.E4Testable$1.run(E4Testable.java:73)
20:58:41 [2020-08-28T00:58:41.525Z] 	at java.lang.Thread.run(Thread.java:748)
20:58:41 [2020-08-28T00:58:41.783Z] 
20:58:41 [2020-08-28T00:58:41.783Z] !ENTRY org.eclipse.egit.ui 4 0 2020-08-28 00:58:41.641
20:58:41 [2020-08-28T00:58:41.783Z] !MESSAGE CrashingCommitMessageProviderWithCaretPositioning fails on purpose.
20:58:41 [2020-08-28T00:58:41.783Z] !STACK 0
20:58:41 [2020-08-28T00:58:41.783Z] java.lang.IllegalStateException: CrashingCommitMessageProviderWithCaretPositioning fails on purpose.
20:58:41 [2020-08-28T00:58:41.783Z] 	at org.eclipse.egit.ui.internal.dialogs.CommitMessageBuilderTest$CrashingCommitMessageProviderWithCaretPositioning.getCommitMessageWithPosition(CommitMessageBuilderTest.java:491)
20:58:41 [2020-08-28T00:58:41.783Z] 	at org.eclipse.egit.ui.internal.dialogs.CommitMessageBuilder.build(CommitMessageBuilder.java:81)
20:58:41 [2020-08-28T00:58:41.783Z] 	at org.eclipse.egit.ui.internal.dialogs.CommitMessageBuilderTest.commitMessageProvider_oneCrashingProviderWithCaretPosition(CommitMessageBuilderTest.java:112)
20:58:41 [2020-08-28T00:58:41.783Z] 	at sun.reflect.NativeMethodAccessorImpl.invoke0(Native Method)
20:58:41 [2020-08-28T00:58:41.783Z] 	at sun.reflect.NativeMethodAccessorImpl.invoke(NativeMethodAccessorImpl.java:62)
20:58:41 [2020-08-28T00:58:41.783Z] 	at sun.reflect.DelegatingMethodAccessorImpl.invoke(DelegatingMethodAccessorImpl.java:43)
20:58:41 [2020-08-28T00:58:41.783Z] 	at java.lang.reflect.Method.invoke(Method.java:498)
20:58:41 [2020-08-28T00:58:41.783Z] 	at org.junit.runners.model.FrameworkMethod$1.runReflectiveCall(FrameworkMethod.java:59)
20:58:41 [2020-08-28T00:58:41.783Z] 	at org.junit.internal.runners.model.ReflectiveCallable.run(ReflectiveCallable.java:12)
20:58:41 [2020-08-28T00:58:41.783Z] 	at org.junit.runners.model.FrameworkMethod.invokeExplosively(FrameworkMethod.java:56)
20:58:41 [2020-08-28T00:58:41.783Z] 	at org.junit.internal.runners.statements.InvokeMethod.evaluate(InvokeMethod.java:17)
20:58:41 [2020-08-28T00:58:41.783Z] 	at org.junit.internal.runners.statements.RunBefores.evaluate(RunBefores.java:26)
20:58:41 [2020-08-28T00:58:41.783Z] 	at org.junit.internal.runners.statements.RunAfters.evaluate(RunAfters.java:27)
20:58:41 [2020-08-28T00:58:41.783Z] 	at org.junit.runners.ParentRunner$3.evaluate(ParentRunner.java:306)
20:58:41 [2020-08-28T00:58:41.783Z] 	at org.junit.runners.BlockJUnit4ClassRunner$1.evaluate(BlockJUnit4ClassRunner.java:100)
20:58:41 [2020-08-28T00:58:41.783Z] 	at org.junit.runners.ParentRunner.runLeaf(ParentRunner.java:366)
20:58:41 [2020-08-28T00:58:41.783Z] 	at org.junit.runners.BlockJUnit4ClassRunner.runChild(BlockJUnit4ClassRunner.java:103)
20:58:41 [2020-08-28T00:58:41.783Z] 	at org.junit.runners.BlockJUnit4ClassRunner.runChild(BlockJUnit4ClassRunner.java:63)
20:58:41 [2020-08-28T00:58:41.783Z] 	at org.junit.runners.ParentRunner$4.run(ParentRunner.java:331)
20:58:41 [2020-08-28T00:58:41.783Z] 	at org.junit.runners.ParentRunner$1.schedule(ParentRunner.java:79)
20:58:41 [2020-08-28T00:58:41.783Z] 	at org.junit.runners.ParentRunner.runChildren(ParentRunner.java:329)
20:58:41 [2020-08-28T00:58:41.783Z] 	at org.junit.runners.ParentRunner.access$100(ParentRunner.java:66)
20:58:41 [2020-08-28T00:58:41.783Z] 	at org.junit.runners.ParentRunner$2.evaluate(ParentRunner.java:293)
20:58:41 [2020-08-28T00:58:41.783Z] 	at org.junit.internal.runners.statements.RunBefores.evaluate(RunBefores.java:26)
20:58:41 [2020-08-28T00:58:41.783Z] 	at org.junit.runners.ParentRunner$3.evaluate(ParentRunner.java:306)
20:58:41 [2020-08-28T00:58:41.783Z] 	at org.junit.runners.ParentRunner.run(ParentRunner.java:413)
20:58:41 [2020-08-28T00:58:41.783Z] 	at org.apache.maven.surefire.junit4.JUnit4Provider.execute(JUnit4Provider.java:365)
20:58:41 [2020-08-28T00:58:41.783Z] 	at org.apache.maven.surefire.junit4.JUnit4Provider.executeWithRerun(JUnit4Provider.java:273)
20:58:41 [2020-08-28T00:58:41.783Z] 	at org.apache.maven.surefire.junit4.JUnit4Provider.executeTestSet(JUnit4Provider.java:238)
20:58:41 [2020-08-28T00:58:41.783Z] 	at org.apache.maven.surefire.junit4.JUnit4Provider.invoke(JUnit4Provider.java:159)
20:58:41 [2020-08-28T00:58:41.783Z] 	at sun.reflect.NativeMethodAccessorImpl.invoke0(Native Method)
20:58:41 [2020-08-28T00:58:41.783Z] 	at sun.reflect.NativeMethodAccessorImpl.invoke(NativeMethodAccessorImpl.java:62)
20:58:41 [2020-08-28T00:58:41.783Z] 	at sun.reflect.DelegatingMethodAccessorImpl.invoke(DelegatingMethodAccessorImpl.java:43)
20:58:41 [2020-08-28T00:58:41.783Z] 	at java.lang.reflect.Method.invoke(Method.java:498)
20:58:41 [2020-08-28T00:58:41.783Z] 	at org.apache.maven.surefire.util.ReflectionUtils.invokeMethodWithArray2(ReflectionUtils.java:206)
20:58:41 [2020-08-28T00:58:41.783Z] 	at org.apache.maven.surefire.booter.ProviderFactory$ProviderProxy.invoke(ProviderFactory.java:161)
20:58:41 [2020-08-28T00:58:41.783Z] 	at org.apache.maven.surefire.booter.ProviderFactory.invokeProvider(ProviderFactory.java:84)
20:58:41 [2020-08-28T00:58:41.783Z] 	at org.eclipse.tycho.surefire.osgibooter.OsgiSurefireBooter.run(OsgiSurefireBooter.java:113)
20:58:41 [2020-08-28T00:58:41.783Z] 	at org.eclipse.tycho.surefire.osgibooter.AbstractUITestApplication.runTests(AbstractUITestApplication.java:44)
20:58:41 [2020-08-28T00:58:41.783Z] 	at org.eclipse.e4.ui.internal.workbench.swt.E4Testable$1.run(E4Testable.java:73)
20:58:41 [2020-08-28T00:58:41.783Z] 	at java.lang.Thread.run(Thread.java:748)
20:58:41 [2020-08-28T00:58:41.783Z] 
20:58:41 [2020-08-28T00:58:41.783Z] !ENTRY org.eclipse.egit.ui 4 0 2020-08-28 00:58:41.736
20:58:41 [2020-08-28T00:58:41.784Z] !MESSAGE CrashingCommitMessageProvider fails on purpose.
20:58:41 [2020-08-28T00:58:41.784Z] !STACK 0
20:58:41 [2020-08-28T00:58:41.784Z] java.lang.IllegalStateException: CrashingCommitMessageProvider fails on purpose.
20:58:41 [2020-08-28T00:58:41.784Z] 	at org.eclipse.egit.ui.internal.dialogs.CommitMessageBuilderTest$CrashingCommitMessageProvider.getMessage(CommitMessageBuilderTest.java:474)
20:58:41 [2020-08-28T00:58:41.784Z] 	at org.eclipse.egit.ui.internal.dialogs.CommitMessageBuilder.build(CommitMessageBuilder.java:90)
20:58:41 [2020-08-28T00:58:41.784Z] 	at org.eclipse.egit.ui.internal.dialogs.CommitMessageBuilderTest.commitMessageProvider_twoProvidersFirstOneCrashing(CommitMessageBuilderTest.java:146)
20:58:41 [2020-08-28T00:58:41.784Z] 	at sun.reflect.NativeMethodAccessorImpl.invoke0(Native Method)
20:58:41 [2020-08-28T00:58:41.784Z] 	at sun.reflect.NativeMethodAccessorImpl.invoke(NativeMethodAccessorImpl.java:62)
20:58:41 [2020-08-28T00:58:41.784Z] 	at sun.reflect.DelegatingMethodAccessorImpl.invoke(DelegatingMethodAccessorImpl.java:43)
20:58:41 [2020-08-28T00:58:41.784Z] 	at java.lang.reflect.Method.invoke(Method.java:498)
20:58:41 [2020-08-28T00:58:41.784Z] 	at org.junit.runners.model.FrameworkMethod$1.runReflectiveCall(FrameworkMethod.java:59)
20:58:41 [2020-08-28T00:58:41.784Z] 	at org.junit.internal.runners.model.ReflectiveCallable.run(ReflectiveCallable.java:12)
20:58:41 [2020-08-28T00:58:41.784Z] 	at org.junit.runners.model.FrameworkMethod.invokeExplosively(FrameworkMethod.java:56)
20:58:41 [2020-08-28T00:58:41.784Z] 	at org.junit.internal.runners.statements.InvokeMethod.evaluate(InvokeMethod.java:17)
20:58:41 [2020-08-28T00:58:41.784Z] 	at org.junit.internal.runners.statements.RunBefores.evaluate(RunBefores.java:26)
20:58:41 [2020-08-28T00:58:41.784Z] 	at org.junit.internal.runners.statements.RunAfters.evaluate(RunAfters.java:27)
20:58:41 [2020-08-28T00:58:41.784Z] 	at org.junit.runners.ParentRunner$3.evaluate(ParentRunner.java:306)
20:58:41 [2020-08-28T00:58:41.784Z] 	at org.junit.runners.BlockJUnit4ClassRunner$1.evaluate(BlockJUnit4ClassRunner.java:100)
20:58:41 [2020-08-28T00:58:41.784Z] 	at org.junit.runners.ParentRunner.runLeaf(ParentRunner.java:366)
20:58:41 [2020-08-28T00:58:41.784Z] 	at org.junit.runners.BlockJUnit4ClassRunner.runChild(BlockJUnit4ClassRunner.java:103)
20:58:41 [2020-08-28T00:58:41.784Z] 	at org.junit.runners.BlockJUnit4ClassRunner.runChild(BlockJUnit4ClassRunner.java:63)
20:58:41 [2020-08-28T00:58:41.784Z] 	at org.junit.runners.ParentRunner$4.run(ParentRunner.java:331)
20:58:41 [2020-08-28T00:58:41.784Z] 	at org.junit.runners.ParentRunner$1.schedule(ParentRunner.java:79)
20:58:41 [2020-08-28T00:58:41.784Z] 	at org.junit.runners.ParentRunner.runChildren(ParentRunner.java:329)
20:58:41 [2020-08-28T00:58:41.784Z] 	at org.junit.runners.ParentRunner.access$100(ParentRunner.java:66)
20:58:41 [2020-08-28T00:58:41.784Z] 	at org.junit.runners.ParentRunner$2.evaluate(ParentRunner.java:293)
20:58:41 [2020-08-28T00:58:41.784Z] 	at org.junit.internal.runners.statements.RunBefores.evaluate(RunBefores.java:26)
20:58:41 [2020-08-28T00:58:41.784Z] 	at org.junit.runners.ParentRunner$3.evaluate(ParentRunner.java:306)
20:58:41 [2020-08-28T00:58:41.784Z] 	at org.junit.runners.ParentRunner.run(ParentRunner.java:413)
20:58:41 [2020-08-28T00:58:41.784Z] 	at org.apache.maven.surefire.junit4.JUnit4Provider.execute(JUnit4Provider.java:365)
20:58:41 [2020-08-28T00:58:41.784Z] 	at org.apache.maven.surefire.junit4.JUnit4Provider.executeWithRerun(JUnit4Provider.java:273)
20:58:41 [2020-08-28T00:58:41.784Z] 	at org.apache.maven.surefire.junit4.JUnit4Provider.executeTestSet(JUnit4Provider.java:238)
20:58:41 [2020-08-28T00:58:41.784Z] 	at org.apache.maven.surefire.junit4.JUnit4Provider.invoke(JUnit4Provider.java:159)
20:58:41 [2020-08-28T00:58:41.784Z] 	at sun.reflect.NativeMethodAccessorImpl.invoke0(Native Method)
20:58:41 [2020-08-28T00:58:41.784Z] 	at sun.reflect.NativeMethodAccessorImpl.invoke(NativeMethodAccessorImpl.java:62)
20:58:41 [2020-08-28T00:58:41.784Z] 	at sun.reflect.DelegatingMethodAccessorImpl.invoke(DelegatingMethodAccessorImpl.java:43)
20:58:41 [2020-08-28T00:58:41.784Z] 	at java.lang.reflect.Method.invoke(Method.java:498)
20:58:41 [2020-08-28T00:58:41.784Z] 	at org.apache.maven.surefire.util.ReflectionUtils.invokeMethodWithArray2(ReflectionUtils.java:206)
20:58:41 [2020-08-28T00:58:41.784Z] 	at org.apache.maven.surefire.booter.ProviderFactory$ProviderProxy.invoke(ProviderFactory.java:161)
20:58:41 [2020-08-28T00:58:41.784Z] 	at org.apache.maven.surefire.booter.ProviderFactory.invokeProvider(ProviderFactory.java:84)
20:58:41 [2020-08-28T00:58:41.784Z] 	at org.eclipse.tycho.surefire.osgibooter.OsgiSurefireBooter.run(OsgiSurefireBooter.java:113)
20:58:41 [2020-08-28T00:58:41.784Z] 	at org.eclipse.tycho.surefire.osgibooter.AbstractUITestApplication.runTests(AbstractUITestApplication.java:44)
20:58:41 [2020-08-28T00:58:41.784Z] 	at org.eclipse.e4.ui.internal.workbench.swt.E4Testable$1.run(E4Testable.java:73)
20:58:41 [2020-08-28T00:58:41.784Z] 	at java.lang.Thread.run(Thread.java:748)
20:58:43 [2020-08-28T00:58:43.157Z] 
20:58:43 [2020-08-28T00:58:43.157Z] !ENTRY org.eclipse.egit.ui 4 0 2020-08-28 00:58:42.966
20:58:43 [2020-08-28T00:58:43.157Z] !MESSAGE CrashingCommitMessageProvider fails on purpose.
20:58:43 [2020-08-28T00:58:43.157Z] !STACK 0
20:58:43 [2020-08-28T00:58:43.157Z] java.lang.IllegalStateException: CrashingCommitMessageProvider fails on purpose.
20:58:43 [2020-08-28T00:58:43.157Z] 	at org.eclipse.egit.ui.internal.dialogs.CommitMessageBuilderTest$CrashingCommitMessageProvider.getMessage(CommitMessageBuilderTest.java:474)
20:58:43 [2020-08-28T00:58:43.157Z] 	at org.eclipse.egit.ui.internal.dialogs.CommitMessageBuilder.build(CommitMessageBuilder.java:90)
20:58:43 [2020-08-28T00:58:43.157Z] 	at org.eclipse.egit.ui.internal.dialogs.CommitMessageBuilderTest.commitMessageProvider_multipleProvidersWithCrashAndNull(CommitMessageBuilderTest.java:165)
20:58:43 [2020-08-28T00:58:43.157Z] 	at sun.reflect.NativeMethodAccessorImpl.invoke0(Native Method)
20:58:43 [2020-08-28T00:58:43.157Z] 	at sun.reflect.NativeMethodAccessorImpl.invoke(NativeMethodAccessorImpl.java:62)
20:58:43 [2020-08-28T00:58:43.157Z] 	at sun.reflect.DelegatingMethodAccessorImpl.invoke(DelegatingMethodAccessorImpl.java:43)
20:58:43 [2020-08-28T00:58:43.157Z] 	at java.lang.reflect.Method.invoke(Method.java:498)
20:58:43 [2020-08-28T00:58:43.157Z] 	at org.junit.runners.model.FrameworkMethod$1.runReflectiveCall(FrameworkMethod.java:59)
20:58:43 [2020-08-28T00:58:43.157Z] 	at org.junit.internal.runners.model.ReflectiveCallable.run(ReflectiveCallable.java:12)
20:58:43 [2020-08-28T00:58:43.157Z] 	at org.junit.runners.model.FrameworkMethod.invokeExplosively(FrameworkMethod.java:56)
20:58:43 [2020-08-28T00:58:43.157Z] 	at org.junit.internal.runners.statements.InvokeMethod.evaluate(InvokeMethod.java:17)
20:58:43 [2020-08-28T00:58:43.157Z] 	at org.junit.internal.runners.statements.RunBefores.evaluate(RunBefores.java:26)
20:58:43 [2020-08-28T00:58:43.157Z] 	at org.junit.internal.runners.statements.RunAfters.evaluate(RunAfters.java:27)
20:58:43 [2020-08-28T00:58:43.157Z] 	at org.junit.runners.ParentRunner$3.evaluate(ParentRunner.java:306)
20:58:43 [2020-08-28T00:58:43.157Z] 	at org.junit.runners.BlockJUnit4ClassRunner$1.evaluate(BlockJUnit4ClassRunner.java:100)
20:58:43 [2020-08-28T00:58:43.157Z] 	at org.junit.runners.ParentRunner.runLeaf(ParentRunner.java:366)
20:58:43 [2020-08-28T00:58:43.157Z] 	at org.junit.runners.BlockJUnit4ClassRunner.runChild(BlockJUnit4ClassRunner.java:103)
20:58:43 [2020-08-28T00:58:43.157Z] 	at org.junit.runners.BlockJUnit4ClassRunner.runChild(BlockJUnit4ClassRunner.java:63)
20:58:43 [2020-08-28T00:58:43.157Z] 	at org.junit.runners.ParentRunner$4.run(ParentRunner.java:331)
20:58:43 [2020-08-28T00:58:43.157Z] 	at org.junit.runners.ParentRunner$1.schedule(ParentRunner.java:79)
20:58:43 [2020-08-28T00:58:43.157Z] 	at org.junit.runners.ParentRunner.runChildren(ParentRunner.java:329)
20:58:43 [2020-08-28T00:58:43.157Z] 	at org.junit.runners.ParentRunner.access$100(ParentRunner.java:66)
20:58:43 [2020-08-28T00:58:43.157Z] 	at org.junit.runners.ParentRunner$2.evaluate(ParentRunner.java:293)
20:58:43 [2020-08-28T00:58:43.157Z] 	at org.junit.internal.runners.statements.RunBefores.evaluate(RunBefores.java:26)
20:58:43 [2020-08-28T00:58:43.157Z] 	at org.junit.runners.ParentRunner$3.evaluate(ParentRunner.java:306)
20:58:43 [2020-08-28T00:58:43.157Z] 	at org.junit.runners.ParentRunner.run(ParentRunner.java:413)
20:58:43 [2020-08-28T00:58:43.157Z] 	at org.apache.maven.surefire.junit4.JUnit4Provider.execute(JUnit4Provider.java:365)
20:58:43 [2020-08-28T00:58:43.157Z] 	at org.apache.maven.surefire.junit4.JUnit4Provider.executeWithRerun(JUnit4Provider.java:273)
20:58:43 [2020-08-28T00:58:43.157Z] 	at org.apache.maven.surefire.junit4.JUnit4Provider.executeTestSet(JUnit4Provider.java:238)
20:58:43 [2020-08-28T00:58:43.157Z] 	at org.apache.maven.surefire.junit4.JUnit4Provider.invoke(JUnit4Provider.java:159)
20:58:43 [2020-08-28T00:58:43.157Z] 	at sun.reflect.NativeMethodAccessorImpl.invoke0(Native Method)
20:58:43 [2020-08-28T00:58:43.157Z] 	at sun.reflect.NativeMethodAccessorImpl.invoke(NativeMethodAccessorImpl.java:62)
20:58:43 [2020-08-28T00:58:43.157Z] 	at sun.reflect.DelegatingMethodAccessorImpl.invoke(DelegatingMethodAccessorImpl.java:43)
20:58:43 [2020-08-28T00:58:43.157Z] 	at java.lang.reflect.Method.invoke(Method.java:498)
20:58:43 [2020-08-28T00:58:43.157Z] 	at org.apache.maven.surefire.util.ReflectionUtils.invokeMethodWithArray2(ReflectionUtils.java:206)
20:58:43 [2020-08-28T00:58:43.157Z] 	at org.apache.maven.surefire.booter.ProviderFactory$ProviderProxy.invoke(ProviderFactory.java:161)
20:58:43 [2020-08-28T00:58:43.157Z] 	at org.apache.maven.surefire.booter.ProviderFactory.invokeProvider(ProviderFactory.java:84)
20:58:43 [2020-08-28T00:58:43.157Z] 	at org.eclipse.tycho.surefire.osgibooter.OsgiSurefireBooter.run(OsgiSurefireBooter.java:113)
20:58:43 [2020-08-28T00:58:43.157Z] 	at org.eclipse.tycho.surefire.osgibooter.AbstractUITestApplication.runTests(AbstractUITestApplication.java:44)
20:58:43 [2020-08-28T00:58:43.157Z] 	at org.eclipse.e4.ui.internal.workbench.swt.E4Testable$1.run(E4Testable.java:73)
20:58:43 [2020-08-28T00:58:43.157Z] 	at java.lang.Thread.run(Thread.java:748)
20:58:43 [2020-08-28T00:58:43.157Z] 
20:58:43 [2020-08-28T00:58:43.157Z] !ENTRY org.eclipse.egit.ui 4 0 2020-08-28 00:58:42.967
20:58:43 [2020-08-28T00:58:43.157Z] !MESSAGE CrashingCommitMessageProvider fails on purpose.
20:58:43 [2020-08-28T00:58:43.157Z] !STACK 0
20:58:43 [2020-08-28T00:58:43.157Z] java.lang.IllegalStateException: CrashingCommitMessageProvider fails on purpose.
20:58:43 [2020-08-28T00:58:43.157Z] 	at org.eclipse.egit.ui.internal.dialogs.CommitMessageBuilderTest$CrashingCommitMessageProvider.getMessage(CommitMessageBuilderTest.java:474)
20:58:43 [2020-08-28T00:58:43.157Z] 	at org.eclipse.egit.ui.internal.dialogs.CommitMessageBuilder.build(CommitMessageBuilder.java:90)
20:58:43 [2020-08-28T00:58:43.157Z] 	at org.eclipse.egit.ui.internal.dialogs.CommitMessageBuilderTest.commitMessageProvider_multipleProvidersWithCrashAndNull(CommitMessageBuilderTest.java:165)
20:58:43 [2020-08-28T00:58:43.157Z] 	at sun.reflect.NativeMethodAccessorImpl.invoke0(Native Method)
20:58:43 [2020-08-28T00:58:43.157Z] 	at sun.reflect.NativeMethodAccessorImpl.invoke(NativeMethodAccessorImpl.java:62)
20:58:43 [2020-08-28T00:58:43.157Z] 	at sun.reflect.DelegatingMethodAccessorImpl.invoke(DelegatingMethodAccessorImpl.java:43)
20:58:43 [2020-08-28T00:58:43.157Z] 	at java.lang.reflect.Method.invoke(Method.java:498)
20:58:43 [2020-08-28T00:58:43.157Z] 	at org.junit.runners.model.FrameworkMethod$1.runReflectiveCall(FrameworkMethod.java:59)
20:58:43 [2020-08-28T00:58:43.158Z] 	at org.junit.internal.runners.model.ReflectiveCallable.run(ReflectiveCallable.java:12)
20:58:43 [2020-08-28T00:58:43.158Z] 	at org.junit.runners.model.FrameworkMethod.invokeExplosively(FrameworkMethod.java:56)
20:58:43 [2020-08-28T00:58:43.158Z] 	at org.junit.internal.runners.statements.InvokeMethod.evaluate(InvokeMethod.java:17)
20:58:43 [2020-08-28T00:58:43.158Z] 	at org.junit.internal.runners.statements.RunBefores.evaluate(RunBefores.java:26)
20:58:43 [2020-08-28T00:58:43.158Z] 	at org.junit.internal.runners.statements.RunAfters.evaluate(RunAfters.java:27)
20:58:43 [2020-08-28T00:58:43.158Z] 	at org.junit.runners.ParentRunner$3.evaluate(ParentRunner.java:306)
20:58:43 [2020-08-28T00:58:43.158Z] 	at org.junit.runners.BlockJUnit4ClassRunner$1.evaluate(BlockJUnit4ClassRunner.java:100)
20:58:43 [2020-08-28T00:58:43.158Z] 	at org.junit.runners.ParentRunner.runLeaf(ParentRunner.java:366)
20:58:43 [2020-08-28T00:58:43.158Z] 	at org.junit.runners.BlockJUnit4ClassRunner.runChild(BlockJUnit4ClassRunner.java:103)
20:58:43 [2020-08-28T00:58:43.158Z] 	at org.junit.runners.BlockJUnit4ClassRunner.runChild(BlockJUnit4ClassRunner.java:63)
20:58:43 [2020-08-28T00:58:43.158Z] 	at org.junit.runners.ParentRunner$4.run(ParentRunner.java:331)
20:58:43 [2020-08-28T00:58:43.158Z] 	at org.junit.runners.ParentRunner$1.schedule(ParentRunner.java:79)
20:58:43 [2020-08-28T00:58:43.158Z] 	at org.junit.runners.ParentRunner.runChildren(ParentRunner.java:329)
20:58:43 [2020-08-28T00:58:43.158Z] 	at org.junit.runners.ParentRunner.access$100(ParentRunner.java:66)
20:58:43 [2020-08-28T00:58:43.158Z] 	at org.junit.runners.ParentRunner$2.evaluate(ParentRunner.java:293)
20:58:43 [2020-08-28T00:58:43.158Z] 	at org.junit.internal.runners.statements.RunBefores.evaluate(RunBefores.java:26)
20:58:43 [2020-08-28T00:58:43.158Z] 	at org.junit.runners.ParentRunner$3.evaluate(ParentRunner.java:306)
20:58:43 [2020-08-28T00:58:43.158Z] 	at org.junit.runners.ParentRunner.run(ParentRunner.java:413)
20:58:43 [2020-08-28T00:58:43.158Z] 	at org.apache.maven.surefire.junit4.JUnit4Provider.execute(JUnit4Provider.java:365)
20:58:43 [2020-08-28T00:58:43.158Z] 	at org.apache.maven.surefire.junit4.JUnit4Provider.executeWithRerun(JUnit4Provider.java:273)
20:58:43 [2020-08-28T00:58:43.158Z] 	at org.apache.maven.surefire.junit4.JUnit4Provider.executeTestSet(JUnit4Provider.java:238)
20:58:43 [2020-08-28T00:58:43.158Z] 	at org.apache.maven.surefire.junit4.JUnit4Provider.invoke(JUnit4Provider.java:159)
20:58:43 [2020-08-28T00:58:43.158Z] 	at sun.reflect.NativeMethodAccessorImpl.invoke0(Native Method)
20:58:43 [2020-08-28T00:58:43.158Z] 	at sun.reflect.NativeMethodAccessorImpl.invoke(NativeMethodAccessorImpl.java:62)
20:58:43 [2020-08-28T00:58:43.158Z] 	at sun.reflect.DelegatingMethodAccessorImpl.invoke(DelegatingMethodAccessorImpl.java:43)
20:58:43 [2020-08-28T00:58:43.158Z] 	at java.lang.reflect.Method.invoke(Method.java:498)
20:58:43 [2020-08-28T00:58:43.158Z] 	at org.apache.maven.surefire.util.ReflectionUtils.invokeMethodWithArray2(ReflectionUtils.java:206)
20:58:43 [2020-08-28T00:58:43.158Z] 	at org.apache.maven.surefire.booter.ProviderFactory$ProviderProxy.invoke(ProviderFactory.java:161)
20:58:43 [2020-08-28T00:58:43.158Z] 	at org.apache.maven.surefire.booter.ProviderFactory.invokeProvider(ProviderFactory.java:84)
20:58:43 [2020-08-28T00:58:43.158Z] 	at org.eclipse.tycho.surefire.osgibooter.OsgiSurefireBooter.run(OsgiSurefireBooter.java:113)
20:58:43 [2020-08-28T00:58:43.158Z] 	at org.eclipse.tycho.surefire.osgibooter.AbstractUITestApplication.runTests(AbstractUITestApplication.java:44)
20:58:43 [2020-08-28T00:58:43.158Z] 	at org.eclipse.e4.ui.internal.workbench.swt.E4Testable$1.run(E4Testable.java:73)
20:58:43 [2020-08-28T00:58:43.158Z] 	at java.lang.Thread.run(Thread.java:748)
20:58:43 [2020-08-28T00:58:43.158Z] 
20:58:43 [2020-08-28T00:58:43.158Z] !ENTRY org.eclipse.egit.ui 2 0 2020-08-28 00:58:43.076
20:58:43 [2020-08-28T00:58:43.158Z] !MESSAGE The ICommitMessageProvider2 implementation org.eclipse.egit.ui.internal.dialogs.CommitMessageBuilderTest$3 provided the caret position -42, which exceeds the length of the commit message or is negative. The caret position is ignored.
20:58:44 [2020-08-28T00:58:44.530Z] 
20:58:44 [2020-08-28T00:58:44.530Z] !ENTRY org.eclipse.egit.ui 2 0 2020-08-28 00:58:44.497
20:58:44 [2020-08-28T00:58:44.530Z] !MESSAGE Found multiple implementations of ICommitMessageProvider2. Ignoring caret positioning for org.eclipse.egit.ui.internal.dialogs.CommitMessageBuilderTest$3.
20:58:45 [2020-08-28T00:58:45.096Z] 
20:58:45 [2020-08-28T00:58:45.096Z] !ENTRY org.eclipse.egit.ui 4 0 2020-08-28 00:58:44.875
20:58:45 [2020-08-28T00:58:45.096Z] !MESSAGE CrashingCommitMessageProvider fails on purpose.
20:58:45 [2020-08-28T00:58:45.096Z] !STACK 0
20:58:45 [2020-08-28T00:58:45.096Z] java.lang.IllegalStateException: CrashingCommitMessageProvider fails on purpose.
20:58:45 [2020-08-28T00:58:45.096Z] 	at org.eclipse.egit.ui.internal.dialogs.CommitMessageBuilderTest$CrashingCommitMessageProvider.getMessage(CommitMessageBuilderTest.java:474)
20:58:45 [2020-08-28T00:58:45.096Z] 	at org.eclipse.egit.ui.internal.dialogs.CommitMessageBuilder.build(CommitMessageBuilder.java:90)
20:58:45 [2020-08-28T00:58:45.096Z] 	at org.eclipse.egit.ui.internal.dialogs.CommitMessageBuilderTest.commitMessageProvider_twoProvidersSecondOneCrashing(CommitMessageBuilderTest.java:130)
20:58:45 [2020-08-28T00:58:45.096Z] 	at sun.reflect.NativeMethodAccessorImpl.invoke0(Native Method)
20:58:45 [2020-08-28T00:58:45.096Z] 	at sun.reflect.NativeMethodAccessorImpl.invoke(NativeMethodAccessorImpl.java:62)
20:58:45 [2020-08-28T00:58:45.096Z] 	at sun.reflect.DelegatingMethodAccessorImpl.invoke(DelegatingMethodAccessorImpl.java:43)
20:58:45 [2020-08-28T00:58:45.096Z] 	at java.lang.reflect.Method.invoke(Method.java:498)
20:58:45 [2020-08-28T00:58:45.096Z] 	at org.junit.runners.model.FrameworkMethod$1.runReflectiveCall(FrameworkMethod.java:59)
20:58:45 [2020-08-28T00:58:45.096Z] 	at org.junit.internal.runners.model.ReflectiveCallable.run(ReflectiveCallable.java:12)
20:58:45 [2020-08-28T00:58:45.096Z] 	at org.junit.runners.model.FrameworkMethod.invokeExplosively(FrameworkMethod.java:56)
20:58:45 [2020-08-28T00:58:45.096Z] 	at org.junit.internal.runners.statements.InvokeMethod.evaluate(InvokeMethod.java:17)
20:58:45 [2020-08-28T00:58:45.096Z] 	at org.junit.internal.runners.statements.RunBefores.evaluate(RunBefores.java:26)
20:58:45 [2020-08-28T00:58:45.096Z] 	at org.junit.internal.runners.statements.RunAfters.evaluate(RunAfters.java:27)
20:58:45 [2020-08-28T00:58:45.096Z] 	at org.junit.runners.ParentRunner$3.evaluate(ParentRunner.java:306)
20:58:45 [2020-08-28T00:58:45.096Z] 	at org.junit.runners.BlockJUnit4ClassRunner$1.evaluate(BlockJUnit4ClassRunner.java:100)
20:58:45 [2020-08-28T00:58:45.096Z] 	at org.junit.runners.ParentRunner.runLeaf(ParentRunner.java:366)
20:58:45 [2020-08-28T00:58:45.096Z] 	at org.junit.runners.BlockJUnit4ClassRunner.runChild(BlockJUnit4ClassRunner.java:103)
20:58:45 [2020-08-28T00:58:45.096Z] 	at org.junit.runners.BlockJUnit4ClassRunner.runChild(BlockJUnit4ClassRunner.java:63)
20:58:45 [2020-08-28T00:58:45.096Z] 	at org.junit.runners.ParentRunner$4.run(ParentRunner.java:331)
20:58:45 [2020-08-28T00:58:45.096Z] 	at org.junit.runners.ParentRunner$1.schedule(ParentRunner.java:79)
20:58:45 [2020-08-28T00:58:45.096Z] 	at org.junit.runners.ParentRunner.runChildren(ParentRunner.java:329)
20:58:45 [2020-08-28T00:58:45.096Z] 	at org.junit.runners.ParentRunner.access$100(ParentRunner.java:66)
20:58:45 [2020-08-28T00:58:45.096Z] 	at org.junit.runners.ParentRunner$2.evaluate(ParentRunner.java:293)
20:58:45 [2020-08-28T00:58:45.096Z] 	at org.junit.internal.runners.statements.RunBefores.evaluate(RunBefores.java:26)
20:58:45 [2020-08-28T00:58:45.096Z] 	at org.junit.runners.ParentRunner$3.evaluate(ParentRunner.java:306)
20:58:45 [2020-08-28T00:58:45.096Z] 	at org.junit.runners.ParentRunner.run(ParentRunner.java:413)
20:58:45 [2020-08-28T00:58:45.096Z] 	at org.apache.maven.surefire.junit4.JUnit4Provider.execute(JUnit4Provider.java:365)
20:58:45 [2020-08-28T00:58:45.096Z] 	at org.apache.maven.surefire.junit4.JUnit4Provider.executeWithRerun(JUnit4Provider.java:273)
20:58:45 [2020-08-28T00:58:45.096Z] 	at org.apache.maven.surefire.junit4.JUnit4Provider.executeTestSet(JUnit4Provider.java:238)
20:58:45 [2020-08-28T00:58:45.096Z] 	at org.apache.maven.surefire.junit4.JUnit4Provider.invoke(JUnit4Provider.java:159)
20:58:45 [2020-08-28T00:58:45.096Z] 	at sun.reflect.NativeMethodAccessorImpl.invoke0(Native Method)
20:58:45 [2020-08-28T00:58:45.096Z] 	at sun.reflect.NativeMethodAccessorImpl.invoke(NativeMethodAccessorImpl.java:62)
20:58:45 [2020-08-28T00:58:45.096Z] 	at sun.reflect.DelegatingMethodAccessorImpl.invoke(DelegatingMethodAccessorImpl.java:43)
20:58:45 [2020-08-28T00:58:45.096Z] 	at java.lang.reflect.Method.invoke(Method.java:498)
20:58:45 [2020-08-28T00:58:45.096Z] 	at org.apache.maven.surefire.util.ReflectionUtils.invokeMethodWithArray2(ReflectionUtils.java:206)
20:58:45 [2020-08-28T00:58:45.096Z] 	at org.apache.maven.surefire.booter.ProviderFactory$ProviderProxy.invoke(ProviderFactory.java:161)
20:58:45 [2020-08-28T00:58:45.096Z] 	at org.apache.maven.surefire.booter.ProviderFactory.invokeProvider(ProviderFactory.java:84)
20:58:45 [2020-08-28T00:58:45.096Z] 	at org.eclipse.tycho.surefire.osgibooter.OsgiSurefireBooter.run(OsgiSurefireBooter.java:113)
20:58:45 [2020-08-28T00:58:45.096Z] 	at org.eclipse.tycho.surefire.osgibooter.AbstractUITestApplication.runTests(AbstractUITestApplication.java:44)
20:58:45 [2020-08-28T00:58:45.096Z] 	at org.eclipse.e4.ui.internal.workbench.swt.E4Testable$1.run(E4Testable.java:73)
20:58:45 [2020-08-28T00:58:45.096Z] 	at java.lang.Thread.run(Thread.java:748)
20:58:45 [2020-08-28T00:58:45.096Z] 
20:58:45 [2020-08-28T00:58:45.096Z] !ENTRY org.eclipse.egit.ui 4 0 2020-08-28 00:58:44.966
20:58:45 [2020-08-28T00:58:45.096Z] !MESSAGE CrashingCommitMessageProvider fails on purpose.
20:58:45 [2020-08-28T00:58:45.096Z] !STACK 0
20:58:45 [2020-08-28T00:58:45.096Z] java.lang.IllegalStateException: CrashingCommitMessageProvider fails on purpose.
20:58:45 [2020-08-28T00:58:45.096Z] 	at org.eclipse.egit.ui.internal.dialogs.CommitMessageBuilderTest$CrashingCommitMessageProvider.getMessage(CommitMessageBuilderTest.java:474)
20:58:45 [2020-08-28T00:58:45.096Z] 	at org.eclipse.egit.ui.internal.dialogs.CommitMessageBuilder.build(CommitMessageBuilder.java:90)
20:58:45 [2020-08-28T00:58:45.096Z] 	at org.eclipse.egit.ui.internal.dialogs.CommitMessageBuilderTest.commitMessageProvider_multipleProvidersWithCrashingAndNullAndOneCaretPositioning(CommitMessageBuilderTest.java:414)
20:58:45 [2020-08-28T00:58:45.096Z] 	at sun.reflect.NativeMethodAccessorImpl.invoke0(Native Method)
20:58:45 [2020-08-28T00:58:45.096Z] 	at sun.reflect.NativeMethodAccessorImpl.invoke(NativeMethodAccessorImpl.java:62)
20:58:45 [2020-08-28T00:58:45.096Z] 	at sun.reflect.DelegatingMethodAccessorImpl.invoke(DelegatingMethodAccessorImpl.java:43)
20:58:45 [2020-08-28T00:58:45.096Z] 	at java.lang.reflect.Method.invoke(Method.java:498)
20:58:45 [2020-08-28T00:58:45.096Z] 	at org.junit.runners.model.FrameworkMethod$1.runReflectiveCall(FrameworkMethod.java:59)
20:58:45 [2020-08-28T00:58:45.097Z] 	at org.junit.internal.runners.model.ReflectiveCallable.run(ReflectiveCallable.java:12)
20:58:45 [2020-08-28T00:58:45.097Z] 	at org.junit.runners.model.FrameworkMethod.invokeExplosively(FrameworkMethod.java:56)
20:58:45 [2020-08-28T00:58:45.097Z] 	at org.junit.internal.runners.statements.InvokeMethod.evaluate(InvokeMethod.java:17)
20:58:45 [2020-08-28T00:58:45.097Z] 	at org.junit.internal.runners.statements.RunBefores.evaluate(RunBefores.java:26)
20:58:45 [2020-08-28T00:58:45.097Z] 	at org.junit.internal.runners.statements.RunAfters.evaluate(RunAfters.java:27)
20:58:45 [2020-08-28T00:58:45.097Z] 	at org.junit.runners.ParentRunner$3.evaluate(ParentRunner.java:306)
20:58:45 [2020-08-28T00:58:45.097Z] 	at org.junit.runners.BlockJUnit4ClassRunner$1.evaluate(BlockJUnit4ClassRunner.java:100)
20:58:45 [2020-08-28T00:58:45.097Z] 	at org.junit.runners.ParentRunner.runLeaf(ParentRunner.java:366)
20:58:45 [2020-08-28T00:58:45.097Z] 	at org.junit.runners.BlockJUnit4ClassRunner.runChild(BlockJUnit4ClassRunner.java:103)
20:58:45 [2020-08-28T00:58:45.097Z] 	at org.junit.runners.BlockJUnit4ClassRunner.runChild(BlockJUnit4ClassRunner.java:63)
20:58:45 [2020-08-28T00:58:45.097Z] 	at org.junit.runners.ParentRunner$4.run(ParentRunner.java:331)
20:58:45 [2020-08-28T00:58:45.097Z] 	at org.junit.runners.ParentRunner$1.schedule(ParentRunner.java:79)
20:58:45 [2020-08-28T00:58:45.097Z] 	at org.junit.runners.ParentRunner.runChildren(ParentRunner.java:329)
20:58:45 [2020-08-28T00:58:45.097Z] 	at org.junit.runners.ParentRunner.access$100(ParentRunner.java:66)
20:58:45 [2020-08-28T00:58:45.097Z] 	at org.junit.runners.ParentRunner$2.evaluate(ParentRunner.java:293)
20:58:45 [2020-08-28T00:58:45.097Z] 	at org.junit.internal.runners.statements.RunBefores.evaluate(RunBefores.java:26)
20:58:45 [2020-08-28T00:58:45.097Z] 	at org.junit.runners.ParentRunner$3.evaluate(ParentRunner.java:306)
20:58:45 [2020-08-28T00:58:45.097Z] 	at org.junit.runners.ParentRunner.run(ParentRunner.java:413)
20:58:45 [2020-08-28T00:58:45.097Z] 	at org.apache.maven.surefire.junit4.JUnit4Provider.execute(JUnit4Provider.java:365)
20:58:45 [2020-08-28T00:58:45.097Z] 	at org.apache.maven.surefire.junit4.JUnit4Provider.executeWithRerun(JUnit4Provider.java:273)
20:58:45 [2020-08-28T00:58:45.097Z] 	at org.apache.maven.surefire.junit4.JUnit4Provider.executeTestSet(JUnit4Provider.java:238)
20:58:45 [2020-08-28T00:58:45.097Z] 	at org.apache.maven.surefire.junit4.JUnit4Provider.invoke(JUnit4Provider.java:159)
20:58:45 [2020-08-28T00:58:45.097Z] 	at sun.reflect.NativeMethodAccessorImpl.invoke0(Native Method)
20:58:45 [2020-08-28T00:58:45.097Z] 	at sun.reflect.NativeMethodAccessorImpl.invoke(NativeMethodAccessorImpl.java:62)
20:58:45 [2020-08-28T00:58:45.097Z] 	at sun.reflect.DelegatingMethodAccessorImpl.invoke(DelegatingMethodAccessorImpl.java:43)
20:58:45 [2020-08-28T00:58:45.097Z] 	at java.lang.reflect.Method.invoke(Method.java:498)
20:58:45 [2020-08-28T00:58:45.097Z] 	at org.apache.maven.surefire.util.ReflectionUtils.invokeMethodWithArray2(ReflectionUtils.java:206)
20:58:45 [2020-08-28T00:58:45.097Z] 	at org.apache.maven.surefire.booter.ProviderFactory$ProviderProxy.invoke(ProviderFactory.java:161)
20:58:45 [2020-08-28T00:58:45.097Z] 	at org.apache.maven.surefire.booter.ProviderFactory.invokeProvider(ProviderFactory.java:84)
20:58:45 [2020-08-28T00:58:45.097Z] 	at org.eclipse.tycho.surefire.osgibooter.OsgiSurefireBooter.run(OsgiSurefireBooter.java:113)
20:58:45 [2020-08-28T00:58:45.097Z] 	at org.eclipse.tycho.surefire.osgibooter.AbstractUITestApplication.runTests(AbstractUITestApplication.java:44)
20:58:45 [2020-08-28T00:58:45.097Z] 	at org.eclipse.e4.ui.internal.workbench.swt.E4Testable$1.run(E4Testable.java:73)
20:58:45 [2020-08-28T00:58:45.097Z] 	at java.lang.Thread.run(Thread.java:748)
20:58:45 [2020-08-28T00:58:45.097Z] 
20:58:45 [2020-08-28T00:58:45.097Z] !ENTRY org.eclipse.egit.ui 4 0 2020-08-28 00:58:44.966
20:58:45 [2020-08-28T00:58:45.097Z] !MESSAGE CrashingCommitMessageProvider fails on purpose.
20:58:45 [2020-08-28T00:58:45.097Z] !STACK 0
20:58:45 [2020-08-28T00:58:45.097Z] java.lang.IllegalStateException: CrashingCommitMessageProvider fails on purpose.
20:58:45 [2020-08-28T00:58:45.097Z] 	at org.eclipse.egit.ui.internal.dialogs.CommitMessageBuilderTest$CrashingCommitMessageProvider.getMessage(CommitMessageBuilderTest.java:474)
20:58:45 [2020-08-28T00:58:45.097Z] 	at org.eclipse.egit.ui.internal.dialogs.CommitMessageBuilder.build(CommitMessageBuilder.java:90)
20:58:45 [2020-08-28T00:58:45.097Z] 	at org.eclipse.egit.ui.internal.dialogs.CommitMessageBuilderTest.commitMessageProvider_multipleProvidersWithCrashingAndNullAndOneCaretPositioning(CommitMessageBuilderTest.java:414)
20:58:45 [2020-08-28T00:58:45.097Z] 	at sun.reflect.NativeMethodAccessorImpl.invoke0(Native Method)
20:58:45 [2020-08-28T00:58:45.097Z] 	at sun.reflect.NativeMethodAccessorImpl.invoke(NativeMethodAccessorImpl.java:62)
20:58:45 [2020-08-28T00:58:45.097Z] 	at sun.reflect.DelegatingMethodAccessorImpl.invoke(DelegatingMethodAccessorImpl.java:43)
20:58:45 [2020-08-28T00:58:45.097Z] 	at java.lang.reflect.Method.invoke(Method.java:498)
20:58:45 [2020-08-28T00:58:45.097Z] 	at org.junit.runners.model.FrameworkMethod$1.runReflectiveCall(FrameworkMethod.java:59)
20:58:45 [2020-08-28T00:58:45.097Z] 	at org.junit.internal.runners.model.ReflectiveCallable.run(ReflectiveCallable.java:12)
20:58:45 [2020-08-28T00:58:45.097Z] 	at org.junit.runners.model.FrameworkMethod.invokeExplosively(FrameworkMethod.java:56)
20:58:45 [2020-08-28T00:58:45.097Z] 	at org.junit.internal.runners.statements.InvokeMethod.evaluate(InvokeMethod.java:17)
20:58:45 [2020-08-28T00:58:45.097Z] 	at org.junit.internal.runners.statements.RunBefores.evaluate(RunBefores.java:26)
20:58:45 [2020-08-28T00:58:45.097Z] 	at org.junit.internal.runners.statements.RunAfters.evaluate(RunAfters.java:27)
20:58:45 [2020-08-28T00:58:45.097Z] 	at org.junit.runners.ParentRunner$3.evaluate(ParentRunner.java:306)
20:58:45 [2020-08-28T00:58:45.097Z] 	at org.junit.runners.BlockJUnit4ClassRunner$1.evaluate(BlockJUnit4ClassRunner.java:100)
20:58:45 [2020-08-28T00:58:45.097Z] 	at org.junit.runners.ParentRunner.runLeaf(ParentRunner.java:366)
20:58:45 [2020-08-28T00:58:45.097Z] 	at org.junit.runners.BlockJUnit4ClassRunner.runChild(BlockJUnit4ClassRunner.java:103)
20:58:45 [2020-08-28T00:58:45.097Z] 	at org.junit.runners.BlockJUnit4ClassRunner.runChild(BlockJUnit4ClassRunner.java:63)
20:58:45 [2020-08-28T00:58:45.097Z] 	at org.junit.runners.ParentRunner$4.run(ParentRunner.java:331)
20:58:45 [2020-08-28T00:58:45.097Z] 	at org.junit.runners.ParentRunner$1.schedule(ParentRunner.java:79)
20:58:45 [2020-08-28T00:58:45.097Z] 	at org.junit.runners.ParentRunner.runChildren(ParentRunner.java:329)
20:58:45 [2020-08-28T00:58:45.097Z] 	at org.junit.runners.ParentRunner.access$100(ParentRunner.java:66)
20:58:45 [2020-08-28T00:58:45.097Z] 	at org.junit.runners.ParentRunner$2.evaluate(ParentRunner.java:293)
20:58:45 [2020-08-28T00:58:45.097Z] 	at org.junit.internal.runners.statements.RunBefores.evaluate(RunBefores.java:26)
20:58:45 [2020-08-28T00:58:45.097Z] 	at org.junit.runners.ParentRunner$3.evaluate(ParentRunner.java:306)
20:58:45 [2020-08-28T00:58:45.097Z] 	at org.junit.runners.ParentRunner.run(ParentRunner.java:413)
20:58:45 [2020-08-28T00:58:45.097Z] 	at org.apache.maven.surefire.junit4.JUnit4Provider.execute(JUnit4Provider.java:365)
20:58:45 [2020-08-28T00:58:45.097Z] 	at org.apache.maven.surefire.junit4.JUnit4Provider.executeWithRerun(JUnit4Provider.java:273)
20:58:45 [2020-08-28T00:58:45.097Z] 	at org.apache.maven.surefire.junit4.JUnit4Provider.executeTestSet(JUnit4Provider.java:238)
20:58:45 [2020-08-28T00:58:45.097Z] 	at org.apache.maven.surefire.junit4.JUnit4Provider.invoke(JUnit4Provider.java:159)
20:58:45 [2020-08-28T00:58:45.097Z] 	at sun.reflect.NativeMethodAccessorImpl.invoke0(Native Method)
20:58:45 [2020-08-28T00:58:45.097Z] 	at sun.reflect.NativeMethodAccessorImpl.invoke(NativeMethodAccessorImpl.java:62)
20:58:45 [2020-08-28T00:58:45.097Z] 	at sun.reflect.DelegatingMethodAccessorImpl.invoke(DelegatingMethodAccessorImpl.java:43)
20:58:45 [2020-08-28T00:58:45.097Z] 	at java.lang.reflect.Method.invoke(Method.java:498)
20:58:45 [2020-08-28T00:58:45.097Z] 	at org.apache.maven.surefire.util.ReflectionUtils.invokeMethodWithArray2(ReflectionUtils.java:206)
20:58:45 [2020-08-28T00:58:45.097Z] 	at org.apache.maven.surefire.booter.ProviderFactory$ProviderProxy.invoke(ProviderFactory.java:161)
20:58:45 [2020-08-28T00:58:45.097Z] 	at org.apache.maven.surefire.booter.ProviderFactory.invokeProvider(ProviderFactory.java:84)
20:58:45 [2020-08-28T00:58:45.097Z] 	at org.eclipse.tycho.surefire.osgibooter.OsgiSurefireBooter.run(OsgiSurefireBooter.java:113)
20:58:45 [2020-08-28T00:58:45.097Z] 	at org.eclipse.tycho.surefire.osgibooter.AbstractUITestApplication.runTests(AbstractUITestApplication.java:44)
20:58:45 [2020-08-28T00:58:45.097Z] 	at org.eclipse.e4.ui.internal.workbench.swt.E4Testable$1.run(E4Testable.java:73)
20:58:45 [2020-08-28T00:58:45.097Z] 	at java.lang.Thread.run(Thread.java:748)
20:58:46 [2020-08-28T00:58:46.470Z] 
20:58:46 [2020-08-28T00:58:46.470Z] !ENTRY org.eclipse.egit.ui 2 0 2020-08-28 00:58:46.055
20:58:46 [2020-08-28T00:58:46.470Z] !MESSAGE Found multiple implementations of ICommitMessageProvider2. Ignoring caret positioning for org.eclipse.egit.ui.internal.dialogs.CommitMessageBuilderTest$3.
20:58:46 [2020-08-28T00:58:46.470Z] 
20:58:46 [2020-08-28T00:58:46.470Z] !ENTRY org.eclipse.egit.ui 2 0 2020-08-28 00:58:46.180
20:58:46 [2020-08-28T00:58:46.470Z] !MESSAGE The ICommitMessageProvider2 implementation org.eclipse.egit.ui.internal.dialogs.CommitMessageBuilderTest$3 provided the caret position 14, which exceeds the length of the commit message or is negative. The caret position is ignored.
20:58:46 [2020-08-28T00:58:46.470Z] Tests run: 20, Failures: 0, Errors: 0, Skipped: 0, Time elapsed: 6.142 s - in org.eclipse.egit.ui.internal.dialogs.CommitMessageBuilderTest
20:58:46 [2020-08-28T00:58:46.470Z] commitMessageProvider_oneCrashingProvider(org.eclipse.egit.ui.internal.dialogs.CommitMessageBuilderTest)  Time elapsed: 1.408 s
20:58:46 [2020-08-28T00:58:46.470Z] commitMessageProvider_twoProvidersSecondWithCaretPositioning(org.eclipse.egit.ui.internal.dialogs.CommitMessageBuilderTest)  Time elapsed: 0.098 s
20:58:46 [2020-08-28T00:58:46.470Z] commitMessageProvider_oneCrashingProviderWithCaretPosition(org.eclipse.egit.ui.internal.dialogs.CommitMessageBuilderTest)  Time elapsed: 0.096 s
20:58:46 [2020-08-28T00:58:46.470Z] commitMessageProvider_twoProvidersFirstOneCrashing(org.eclipse.egit.ui.internal.dialogs.CommitMessageBuilderTest)  Time elapsed: 0.094 s
20:58:46 [2020-08-28T00:58:46.470Z] commitMessageProvider_noProvider(org.eclipse.egit.ui.internal.dialogs.CommitMessageBuilderTest)  Time elapsed: 0.092 s
20:58:46 [2020-08-28T00:58:46.470Z] commitMessageProvider_oneProvider(org.eclipse.egit.ui.internal.dialogs.CommitMessageBuilderTest)  Time elapsed: 0.086 s
20:58:46 [2020-08-28T00:58:46.470Z] commitMessageProvider_multipleProvidersWithCrashAndNull(org.eclipse.egit.ui.internal.dialogs.CommitMessageBuilderTest)  Time elapsed: 1.064 s
20:58:46 [2020-08-28T00:58:46.470Z] commitMessageProvider_oneProviderWithInvalidNegativeCaretPosition(org.eclipse.egit.ui.internal.dialogs.CommitMessageBuilderTest)  Time elapsed: 0.098 s
20:58:46 [2020-08-28T00:58:46.470Z] commitMessageProvider_twoProvidersSecondWithUndefinedCaretPosition(org.eclipse.egit.ui.internal.dialogs.CommitMessageBuilderTest)  Time elapsed: 0.086 s
20:58:46 [2020-08-28T00:58:46.470Z] commitMessageProvider_twoProvidersWithCaretPositioningFirstWithUndefinedCaretPosition(org.eclipse.egit.ui.internal.dialogs.CommitMessageBuilderTest)  Time elapsed: 0.083 s
20:58:46 [2020-08-28T00:58:46.470Z] commitMessageProvider_oneProviderWithCaretPositionEqualsMessageLength(org.eclipse.egit.ui.internal.dialogs.CommitMessageBuilderTest)  Time elapsed: 0.092 s
20:58:46 [2020-08-28T00:58:46.470Z] commitMessageProvider_twoProvidersFirstWithCaretPositioning(org.eclipse.egit.ui.internal.dialogs.CommitMessageBuilderTest)  Time elapsed: 0.11 s
20:58:46 [2020-08-28T00:58:46.470Z] commitMessageProvider_twoProvidersWithCaretPositioningSecondWithUndefinedCaretPosition(org.eclipse.egit.ui.internal.dialogs.CommitMessageBuilderTest)  Time elapsed: 1.059 s
20:58:46 [2020-08-28T00:58:46.470Z] commitMessageProvider_oneProviderWithCaretPositioning(org.eclipse.egit.ui.internal.dialogs.CommitMessageBuilderTest)  Time elapsed: 0.096 s
20:58:46 [2020-08-28T00:58:46.471Z] commitMessageProvider_twoProvidersSecondWithCaretPositionZero(org.eclipse.egit.ui.internal.dialogs.CommitMessageBuilderTest)  Time elapsed: 0.091 s
20:58:46 [2020-08-28T00:58:46.471Z] commitMessageProvider_twoProviders(org.eclipse.egit.ui.internal.dialogs.CommitMessageBuilderTest)  Time elapsed: 0.087 s
20:58:46 [2020-08-28T00:58:46.471Z] commitMessageProvider_twoProvidersSecondOneCrashing(org.eclipse.egit.ui.internal.dialogs.CommitMessageBuilderTest)  Time elapsed: 0.093 s
20:58:46 [2020-08-28T00:58:46.471Z] commitMessageProvider_multipleProvidersWithCrashingAndNullAndOneCaretPositioning(org.eclipse.egit.ui.internal.dialogs.CommitMessageBuilderTest)  Time elapsed: 0.091 s
20:58:46 [2020-08-28T00:58:46.471Z] commitMessageProvider_twoProvidersWithCaretPositioning(org.eclipse.egit.ui.internal.dialogs.CommitMessageBuilderTest)  Time elapsed: 1.099 s
20:58:46 [2020-08-28T00:58:46.471Z] commitMessageProvider_oneProviderWithInvalidCaretPositionExceedingMessageLength(org.eclipse.egit.ui.internal.dialogs.CommitMessageBuilderTest)  Time elapsed: 0.115 s
20:58:46 [2020-08-28T00:58:46.471Z] Running org.eclipse.egit.ui.internal.dialogs.SpellcheckableMessageAreaTest
20:58:46 [2020-08-28T00:58:46.471Z] Tests run: 25, Failures: 0, Errors: 0, Skipped: 0, Time elapsed: 0.003 s - in org.eclipse.egit.ui.internal.dialogs.SpellcheckableMessageAreaTest
20:58:46 [2020-08-28T00:58:46.471Z] testWrappingLongWords(org.eclipse.egit.ui.internal.dialogs.SpellcheckableMessageAreaTest)  Time elapsed: 0 s
20:58:46 [2020-08-28T00:58:46.471Z] wrapOnlyCommitMessageBody(org.eclipse.egit.ui.internal.dialogs.SpellcheckableMessageAreaTest)  Time elapsed: 0 s
20:58:46 [2020-08-28T00:58:46.471Z] dontWrapMaximumLengthText(org.eclipse.egit.ui.internal.dialogs.SpellcheckableMessageAreaTest)  Time elapsed: 0 s
20:58:46 [2020-08-28T00:58:46.471Z] keepTrailingSpace(org.eclipse.egit.ui.internal.dialogs.SpellcheckableMessageAreaTest)  Time elapsed: 0 s
20:58:46 [2020-08-28T00:58:46.471Z] dontWrapShortMessage(org.eclipse.egit.ui.internal.dialogs.SpellcheckableMessageAreaTest)  Time elapsed: 0 s
20:58:46 [2020-08-28T00:58:46.471Z] lineAfterWrappedWordShouldNotBeJoined(org.eclipse.egit.ui.internal.dialogs.SpellcheckableMessageAreaTest)  Time elapsed: 0 s
20:58:46 [2020-08-28T00:58:46.471Z] lineAfterWrappedWordShouldNotBeJoined2(org.eclipse.egit.ui.internal.dialogs.SpellcheckableMessageAreaTest)  Time elapsed: 0.001 s
20:58:46 [2020-08-28T00:58:46.471Z] lineAfterWrappedWordShouldNotBeJoined3(org.eclipse.egit.ui.internal.dialogs.SpellcheckableMessageAreaTest)  Time elapsed: 0 s
20:58:46 [2020-08-28T00:58:46.471Z] dontWrapWordLongerThanOneLine(org.eclipse.egit.ui.internal.dialogs.SpellcheckableMessageAreaTest)  Time elapsed: 0 s
20:58:46 [2020-08-28T00:58:46.471Z] keepExistingNewlines(org.eclipse.egit.ui.internal.dialogs.SpellcheckableMessageAreaTest)  Time elapsed: 0 s
20:58:46 [2020-08-28T00:58:46.471Z] dontWrapShortText(org.eclipse.egit.ui.internal.dialogs.SpellcheckableMessageAreaTest)  Time elapsed: 0 s
20:58:46 [2020-08-28T00:58:46.471Z] dontWrapWordLongerThanOneLineAtStart(org.eclipse.egit.ui.internal.dialogs.SpellcheckableMessageAreaTest)  Time elapsed: 0 s
20:58:46 [2020-08-28T00:58:46.471Z] dontWrapAlreadyWrappedText(org.eclipse.egit.ui.internal.dialogs.SpellcheckableMessageAreaTest)  Time elapsed: 0 s
20:58:46 [2020-08-28T00:58:46.471Z] wrapOverlengthText2(org.eclipse.egit.ui.internal.dialogs.SpellcheckableMessageAreaTest)  Time elapsed: 0 s
20:58:46 [2020-08-28T00:58:46.471Z] lineAfterWrappedWordShouldNotBeJoinedIfItStartsWithASymbol(org.eclipse.egit.ui.internal.dialogs.SpellcheckableMessageAreaTest)  Time elapsed: 0 s
20:58:46 [2020-08-28T00:58:46.471Z] wrapAlternatingBlankNonBlank(org.eclipse.egit.ui.internal.dialogs.SpellcheckableMessageAreaTest)  Time elapsed: 0.001 s
20:58:46 [2020-08-28T00:58:46.471Z] keepWhitespace(org.eclipse.egit.ui.internal.dialogs.SpellcheckableMessageAreaTest)  Time elapsed: 0 s
20:58:46 [2020-08-28T00:58:46.471Z] lineAfterWrappedWordShouldNotBeJoinedIfItsEmpty(org.eclipse.egit.ui.internal.dialogs.SpellcheckableMessageAreaTest)  Time elapsed: 0 s
20:58:46 [2020-08-28T00:58:46.471Z] dontWrapLongCommitMessageFooter(org.eclipse.egit.ui.internal.dialogs.SpellcheckableMessageAreaTest)  Time elapsed: 0 s
20:58:46 [2020-08-28T00:58:46.471Z] lineAfterWrappedLineShouldBeJoinedAndFollowingLineWrappedCorrectly(org.eclipse.egit.ui.internal.dialogs.SpellcheckableMessageAreaTest)  Time elapsed: 0 s
20:58:46 [2020-08-28T00:58:46.471Z] wrapOverlengthText(org.eclipse.egit.ui.internal.dialogs.SpellcheckableMessageAreaTest)  Time elapsed: 0 s
20:58:46 [2020-08-28T00:58:46.471Z] dontWrapWordLongerThanOneLineAndKeepSpaceAtFront(org.eclipse.egit.ui.internal.dialogs.SpellcheckableMessageAreaTest)  Time elapsed: 0 s
20:58:46 [2020-08-28T00:58:46.471Z] wrapSecondLongLine(org.eclipse.egit.ui.internal.dialogs.SpellcheckableMessageAreaTest)  Time elapsed: 0 s
20:58:46 [2020-08-28T00:58:46.471Z] wrapOverlengthTextByOne(org.eclipse.egit.ui.internal.dialogs.SpellcheckableMessageAreaTest)  Time elapsed: 0 s
20:58:46 [2020-08-28T00:58:46.471Z] keepNewlineAtEnd(org.eclipse.egit.ui.internal.dialogs.SpellcheckableMessageAreaTest)  Time elapsed: 0 s
20:58:46 [2020-08-28T00:58:46.471Z] Running org.eclipse.egit.ui.internal.dialogs.CommitMessageComponentTest
20:58:46 [2020-08-28T00:58:46.471Z] Tests run: 5, Failures: 0, Errors: 0, Skipped: 0, Time elapsed: 0 s - in org.eclipse.egit.ui.internal.dialogs.CommitMessageComponentTest
20:58:46 [2020-08-28T00:58:46.471Z] commitFormat_MultipleLines_notOk2(org.eclipse.egit.ui.internal.dialogs.CommitMessageComponentTest)  Time elapsed: 0 s
20:58:46 [2020-08-28T00:58:46.471Z] commitFormat_simple(org.eclipse.egit.ui.internal.dialogs.CommitMessageComponentTest)  Time elapsed: 0 s
20:58:46 [2020-08-28T00:58:46.471Z] commitFormat_MultipleLines_ok(org.eclipse.egit.ui.internal.dialogs.CommitMessageComponentTest)  Time elapsed: 0 s
20:58:46 [2020-08-28T00:58:46.471Z] commitFormat_trailingWhitespace_ok(org.eclipse.egit.ui.internal.dialogs.CommitMessageComponentTest)  Time elapsed: 0 s
20:58:46 [2020-08-28T00:58:46.471Z] commitFormat_MultipleLines_notOk(org.eclipse.egit.ui.internal.dialogs.CommitMessageComponentTest)  Time elapsed: 0 s
20:58:46 [2020-08-28T00:58:46.471Z] Running org.eclipse.egit.ui.internal.actions.StashesMenuTest
20:58:49 [2020-08-28T00:58:49.016Z] 
20:58:49 [2020-08-28T00:58:49.016Z] (SWT:1591): Gtk-WARNING **: 00:58:48.616: Negative content width -6 (allocation 1, extents 4x3) while allocating gadget (node toolbar, owner GtkToolbar)
20:58:49 [2020-08-28T00:58:49.016Z] 
20:58:49 [2020-08-28T00:58:49.016Z] (SWT:1591): Gtk-WARNING **: 00:58:48.616: Negative content height -3 (allocation 1, extents 2x2) while allocating gadget (node toolbar, owner GtkToolbar)
20:58:49 [2020-08-28T00:58:49.016Z] 
20:58:49 [2020-08-28T00:58:49.016Z] (SWT:1591): Gtk-WARNING **: 00:58:48.616: Negative content width -6 (allocation 1, extents 4x3) while allocating gadget (node toolbar, owner GtkToolbar)
20:58:49 [2020-08-28T00:58:49.016Z] 
20:58:49 [2020-08-28T00:58:49.016Z] (SWT:1591): Gtk-WARNING **: 00:58:48.616: Negative content height -3 (allocation 1, extents 2x2) while allocating gadget (node toolbar, owner GtkToolbar)
20:58:49 [2020-08-28T00:58:49.016Z] 
20:58:49 [2020-08-28T00:58:49.016Z] (SWT:1591): Gtk-WARNING **: 00:58:48.663: Negative content width -6 (allocation 1, extents 4x3) while allocating gadget (node toolbar, owner GtkToolbar)
20:58:49 [2020-08-28T00:58:49.016Z] 
20:58:49 [2020-08-28T00:58:49.016Z] (SWT:1591): Gtk-WARNING **: 00:58:48.673: Negative content width -6 (allocation 1, extents 4x3) while allocating gadget (node toolbar, owner GtkToolbar)
20:58:49 [2020-08-28T00:58:49.016Z] 
20:58:49 [2020-08-28T00:58:49.016Z] (SWT:1591): Gtk-WARNING **: 00:58:48.685: Negative content width -6 (allocation 1, extents 4x3) while allocating gadget (node toolbar, owner GtkToolbar)
20:58:49 [2020-08-28T00:58:49.305Z] Tests run: 2, Failures: 0, Errors: 0, Skipped: 0, Time elapsed: 2.871 s - in org.eclipse.egit.ui.internal.actions.StashesMenuTest
20:58:49 [2020-08-28T00:58:49.305Z] menuWithoutStashes(org.eclipse.egit.ui.internal.actions.StashesMenuTest)  Time elapsed: 1.592 s
20:58:49 [2020-08-28T00:58:49.305Z] stashAndApplyChanges(org.eclipse.egit.ui.internal.actions.StashesMenuTest)  Time elapsed: 1.274 s
20:58:49 [2020-08-28T00:58:49.305Z] Running org.eclipse.egit.ui.internal.actions.LinkedResourcesTest
20:58:50 [2020-08-28T00:58:50.691Z] Tests run: 2, Failures: 0, Errors: 0, Skipped: 0, Time elapsed: 1.207 s - in org.eclipse.egit.ui.internal.actions.LinkedResourcesTest
20:58:50 [2020-08-28T00:58:50.691Z] testSomeActionsWithoutLinkedResources(org.eclipse.egit.ui.internal.actions.LinkedResourcesTest)  Time elapsed: 0.58 s
20:58:50 [2020-08-28T00:58:50.691Z] testNoActionOnLinkedResources(org.eclipse.egit.ui.internal.actions.LinkedResourcesTest)  Time elapsed: 0.622 s
20:58:50 [2020-08-28T00:58:50.691Z] Running org.eclipse.egit.ui.internal.actions.SwitchToMenuTest
20:59:00 [2020-08-28T00:59:00.653Z] 
20:59:00 [2020-08-28T00:59:00.653Z] !ENTRY org.eclipse.egit.core 4 0 2020-08-28 00:58:58.926
20:59:00 [2020-08-28T00:59:00.653Z] !MESSAGE Cannot parse the reflog for HEAD in repository /home/jenkins/agent/workspace/egit/tmp/egit.tmp/2a9a8cc55d054a31a3ba17dfd8c97f20/LocalRepositoriesTests264_selectionWithCorruptedReflog/FirstRepository/.git
20:59:00 [2020-08-28T00:59:00.653Z] !STACK 0
20:59:00 [2020-08-28T00:59:00.653Z] org.eclipse.jgit.errors.InvalidObjectIdException: Invalid id: INTENTIONALLY CORRUPTED REFLOG. Just som
20:59:00 [2020-08-28T00:59:00.653Z] 	at org.eclipse.jgit.lib.ObjectId.fromHexString(ObjectId.java:217)
20:59:00 [2020-08-28T00:59:00.653Z] 	at org.eclipse.jgit.lib.ObjectId.fromString(ObjectId.java:191)
20:59:00 [2020-08-28T00:59:00.653Z] 	at org.eclipse.jgit.internal.storage.file.ReflogEntryImpl.<init>(ReflogEntryImpl.java:39)
20:59:00 [2020-08-28T00:59:00.653Z] 	at org.eclipse.jgit.internal.storage.file.ReflogReaderImpl.getReverseEntries(ReflogReaderImpl.java:109)
20:59:00 [2020-08-28T00:59:00.653Z] 	at org.eclipse.jgit.internal.storage.file.ReflogReaderImpl.getReverseEntries(ReflogReaderImpl.java:56)
20:59:00 [2020-08-28T00:59:00.653Z] 	at org.eclipse.egit.core.RepositoryUtil.safeReadReflog(RepositoryUtil.java:193)
20:59:00 [2020-08-28T00:59:00.653Z] 	at org.eclipse.egit.ui.internal.actions.SwitchToMenu.getMostActiveBranches(SwitchToMenu.java:465)
20:59:00 [2020-08-28T00:59:00.653Z] 	at org.eclipse.egit.ui.internal.actions.SwitchToMenu.createMostActiveBranchesMenuItems(SwitchToMenu.java:306)
20:59:00 [2020-08-28T00:59:00.653Z] 	at org.eclipse.egit.ui.internal.actions.SwitchToMenu.createDynamicMenu(SwitchToMenu.java:142)
20:59:00 [2020-08-28T00:59:00.653Z] 	at org.eclipse.egit.ui.internal.actions.SwitchToMenu.fill(SwitchToMenu.java:122)
20:59:00 [2020-08-28T00:59:00.653Z] 	at org.eclipse.egit.ui.internal.actions.SwitchToMenuTest$1.run(SwitchToMenuTest.java:310)
20:59:00 [2020-08-28T00:59:00.653Z] 	at org.eclipse.swt.widgets.RunnableLock.run(RunnableLock.java:35)
20:59:00 [2020-08-28T00:59:00.653Z] 	at org.eclipse.swt.widgets.Synchronizer.runAsyncMessages(Synchronizer.java:182)
20:59:00 [2020-08-28T00:59:00.653Z] 	at org.eclipse.swt.widgets.Display.runAsyncMessages(Display.java:4536)
20:59:00 [2020-08-28T00:59:00.653Z] 	at org.eclipse.swt.widgets.Display.readAndDispatch(Display.java:4154)
20:59:00 [2020-08-28T00:59:00.653Z] 	at org.eclipse.e4.ui.internal.workbench.swt.PartRenderingEngine$4.run(PartRenderingEngine.java:1121)
20:59:00 [2020-08-28T00:59:00.653Z] 	at org.eclipse.core.databinding.observable.Realm.runWithDefault(Realm.java:336)
20:59:00 [2020-08-28T00:59:00.653Z] 	at org.eclipse.e4.ui.internal.workbench.swt.PartRenderingEngine.run(PartRenderingEngine.java:1022)
20:59:00 [2020-08-28T00:59:00.653Z] 	at org.eclipse.e4.ui.internal.workbench.E4Workbench.createAndRunUI(E4Workbench.java:150)
20:59:00 [2020-08-28T00:59:00.653Z] 	at org.eclipse.ui.internal.Workbench$5.run(Workbench.java:693)
20:59:00 [2020-08-28T00:59:00.653Z] 	at org.eclipse.core.databinding.observable.Realm.runWithDefault(Realm.java:336)
20:59:00 [2020-08-28T00:59:00.653Z] 	at org.eclipse.ui.internal.Workbench.createAndRunWorkbench(Workbench.java:610)
20:59:00 [2020-08-28T00:59:00.653Z] 	at org.eclipse.ui.PlatformUI.createAndRunWorkbench(PlatformUI.java:148)
20:59:00 [2020-08-28T00:59:00.653Z] 	at org.eclipse.ui.internal.ide.application.IDEApplication.start(IDEApplication.java:138)
20:59:00 [2020-08-28T00:59:00.653Z] 	at org.eclipse.tycho.surefire.osgibooter.UITestApplication.runApplication(UITestApplication.java:31)
20:59:00 [2020-08-28T00:59:00.653Z] 	at org.eclipse.tycho.surefire.osgibooter.AbstractUITestApplication.run(AbstractUITestApplication.java:120)
20:59:00 [2020-08-28T00:59:00.653Z] 	at org.eclipse.tycho.surefire.osgibooter.UITestApplication.start(UITestApplication.java:37)
20:59:00 [2020-08-28T00:59:00.653Z] 	at org.eclipse.equinox.internal.app.EclipseAppHandle.run(EclipseAppHandle.java:196)
20:59:00 [2020-08-28T00:59:00.653Z] 	at org.eclipse.core.runtime.internal.adaptor.EclipseAppLauncher.runApplication(EclipseAppLauncher.java:134)
20:59:00 [2020-08-28T00:59:00.653Z] 	at org.eclipse.core.runtime.internal.adaptor.EclipseAppLauncher.start(EclipseAppLauncher.java:104)
20:59:00 [2020-08-28T00:59:00.653Z] 	at org.eclipse.core.runtime.adaptor.EclipseStarter.run(EclipseStarter.java:388)
20:59:00 [2020-08-28T00:59:00.653Z] 	at org.eclipse.core.runtime.adaptor.EclipseStarter.run(EclipseStarter.java:243)
20:59:00 [2020-08-28T00:59:00.653Z] 	at sun.reflect.NativeMethodAccessorImpl.invoke0(Native Method)
20:59:00 [2020-08-28T00:59:00.653Z] 	at sun.reflect.NativeMethodAccessorImpl.invoke(NativeMethodAccessorImpl.java:62)
20:59:00 [2020-08-28T00:59:00.653Z] 	at sun.reflect.DelegatingMethodAccessorImpl.invoke(DelegatingMethodAccessorImpl.java:43)
20:59:00 [2020-08-28T00:59:00.653Z] 	at java.lang.reflect.Method.invoke(Method.java:498)
20:59:00 [2020-08-28T00:59:00.653Z] 	at org.eclipse.equinox.launcher.Main.invokeFramework(Main.java:673)
20:59:00 [2020-08-28T00:59:00.653Z] 	at org.eclipse.equinox.launcher.Main.basicRun(Main.java:610)
20:59:00 [2020-08-28T00:59:00.653Z] 	at org.eclipse.equinox.launcher.Main.run(Main.java:1519)
20:59:00 [2020-08-28T00:59:00.653Z] 	at org.eclipse.equinox.launcher.Main.main(Main.java:1492)
20:59:00 [2020-08-28T00:59:00.653Z] Caused by: java.lang.ArrayIndexOutOfBoundsException
20:59:00 [2020-08-28T00:59:00.653Z] 	at org.eclipse.jgit.util.RawParseUtils.parseHexInt32(RawParseUtils.java:336)
20:59:00 [2020-08-28T00:59:00.653Z] 	at org.eclipse.jgit.lib.ObjectId.fromHexString(ObjectId.java:210)
20:59:00 [2020-08-28T00:59:00.653Z] 	... 39 more
20:59:00 [2020-08-28T00:59:00.653Z] Tests run: 9, Failures: 0, Errors: 0, Skipped: 0, Time elapsed: 8.792 s - in org.eclipse.egit.ui.internal.actions.SwitchToMenuTest
20:59:00 [2020-08-28T00:59:00.653Z] multipleSelectionWithMultipleRepositoriesAndNoCommonBranches(org.eclipse.egit.ui.internal.actions.SwitchToMenuTest)  Time elapsed: 0.942 s
20:59:00 [2020-08-28T00:59:00.653Z] selectionWithProj1(org.eclipse.egit.ui.internal.actions.SwitchToMenuTest)  Time elapsed: 0.683 s
20:59:00 [2020-08-28T00:59:00.653Z] selectionNotAdaptableToRepository(org.eclipse.egit.ui.internal.actions.SwitchToMenuTest)  Time elapsed: 0.055 s
20:59:00 [2020-08-28T00:59:00.653Z] selectionWithProj1AndReflog(org.eclipse.egit.ui.internal.actions.SwitchToMenuTest)  Time elapsed: 0.626 s
20:59:00 [2020-08-28T00:59:00.653Z] validateMenuEntriesForMultiSelectionWithMultipleRepositories(org.eclipse.egit.ui.internal.actions.SwitchToMenuTest)  Time elapsed: 2.918 s
20:59:00 [2020-08-28T00:59:00.653Z] validateBranchSwitchingForForMultiSelectionWithMultipleRepositories(org.eclipse.egit.ui.internal.actions.SwitchToMenuTest)  Time elapsed: 1.203 s
20:59:00 [2020-08-28T00:59:00.653Z] selectionWithRepositoryHavingOver20Branches(org.eclipse.egit.ui.internal.actions.SwitchToMenuTest)  Time elapsed: 1.641 s
20:59:00 [2020-08-28T00:59:00.653Z] emptySelection(org.eclipse.egit.ui.internal.actions.SwitchToMenuTest)  Time elapsed: 0.057 s
20:59:00 [2020-08-28T00:59:00.653Z] selectionWithCorruptedReflog(org.eclipse.egit.ui.internal.actions.SwitchToMenuTest)  Time elapsed: 0.646 s
20:59:00 [2020-08-28T00:59:00.653Z] Running org.eclipse.egit.ui.internal.submodules.SubmoduleFolderTest
20:59:02 [2020-08-28T00:59:02.550Z] 
20:59:02 [2020-08-28T00:59:02.550Z] (SWT:1591): Gtk-WARNING **: 00:59:02.301: Negative content width -6 (allocation 1, extents 4x3) while allocating gadget (node toolbar, owner GtkToolbar)
20:59:02 [2020-08-28T00:59:02.550Z] 
20:59:02 [2020-08-28T00:59:02.550Z] (SWT:1591): Gtk-WARNING **: 00:59:02.301: Negative content height -3 (allocation 1, extents 2x2) while allocating gadget (node toolbar, owner GtkToolbar)
20:59:02 [2020-08-28T00:59:02.550Z] 
20:59:02 [2020-08-28T00:59:02.550Z] (SWT:1591): Gtk-WARNING **: 00:59:02.301: Negative content width -6 (allocation 1, extents 4x3) while allocating gadget (node toolbar, owner GtkToolbar)
20:59:02 [2020-08-28T00:59:02.550Z] 
20:59:02 [2020-08-28T00:59:02.550Z] (SWT:1591): Gtk-WARNING **: 00:59:02.301: Negative content height -3 (allocation 1, extents 2x2) while allocating gadget (node toolbar, owner GtkToolbar)
20:59:02 [2020-08-28T00:59:02.807Z] 
20:59:02 [2020-08-28T00:59:02.807Z] (SWT:1591): Gtk-WARNING **: 00:59:02.603: Negative content width -6 (allocation 1, extents 4x3) while allocating gadget (node toolbar, owner GtkToolbar)
20:59:02 [2020-08-28T00:59:02.807Z] 
20:59:02 [2020-08-28T00:59:02.807Z] (SWT:1591): Gtk-WARNING **: 00:59:02.606: Negative content width -6 (allocation 1, extents 4x3) while allocating gadget (node toolbar, owner GtkToolbar)
20:59:02 [2020-08-28T00:59:02.807Z] 
20:59:02 [2020-08-28T00:59:02.807Z] (SWT:1591): Gtk-WARNING **: 00:59:02.609: Negative content width -6 (allocation 1, extents 4x3) while allocating gadget (node toolbar, owner GtkToolbar)
20:59:02 [2020-08-28T00:59:02.807Z] 
20:59:02 [2020-08-28T00:59:02.807Z] (SWT:1591): Gtk-WARNING **: 00:59:02.613: Negative content width -6 (allocation 1, extents 4x3) while allocating gadget (node toolbar, owner GtkToolbar)
20:59:02 [2020-08-28T00:59:02.807Z] 
20:59:02 [2020-08-28T00:59:02.807Z] (SWT:1591): Gtk-WARNING **: 00:59:02.628: Negative content width -6 (allocation 1, extents 4x3) while allocating gadget (node toolbar, owner GtkToolbar)
20:59:02 [2020-08-28T00:59:02.807Z] 
20:59:02 [2020-08-28T00:59:02.807Z] (SWT:1591): Gtk-WARNING **: 00:59:02.629: Negative content width -6 (allocation 1, extents 4x3) while allocating gadget (node toolbar, owner GtkToolbar)
20:59:02 [2020-08-28T00:59:02.807Z] 
20:59:02 [2020-08-28T00:59:02.807Z] (SWT:1591): Gtk-WARNING **: 00:59:02.662: Negative content width -6 (allocation 1, extents 4x3) while allocating gadget (node toolbar, owner GtkToolbar)
20:59:02 [2020-08-28T00:59:02.807Z] 
20:59:02 [2020-08-28T00:59:02.807Z] (SWT:1591): Gtk-WARNING **: 00:59:02.663: Negative content width -6 (allocation 1, extents 4x3) while allocating gadget (node toolbar, owner GtkToolbar)
20:59:10 [2020-08-28T00:59:10.925Z] 
20:59:10 [2020-08-28T00:59:10.925Z] (SWT:1591): Gtk-WARNING **: 00:59:09.846: Negative content width -6 (allocation 1, extents 4x3) while allocating gadget (node toolbar, owner GtkToolbar)
20:59:10 [2020-08-28T00:59:10.925Z] 
20:59:10 [2020-08-28T00:59:10.925Z] (SWT:1591): Gtk-WARNING **: 00:59:09.860: Negative content width -6 (allocation 1, extents 4x3) while allocating gadget (node toolbar, owner GtkToolbar)
20:59:10 [2020-08-28T00:59:10.925Z] 
20:59:10 [2020-08-28T00:59:10.925Z] (SWT:1591): Gtk-WARNING **: 00:59:09.893: Negative content width -6 (allocation 1, extents 4x3) while allocating gadget (node toolbar, owner GtkToolbar)
20:59:10 [2020-08-28T00:59:10.926Z] 
20:59:10 [2020-08-28T00:59:10.926Z] (SWT:1591): Gtk-WARNING **: 00:59:09.894: Negative content width -6 (allocation 1, extents 4x3) while allocating gadget (node toolbar, owner GtkToolbar)
20:59:10 [2020-08-28T00:59:10.926Z] 
20:59:10 [2020-08-28T00:59:10.926Z] (SWT:1591): Gtk-CRITICAL **: 00:59:09.916: gtk_box_gadget_distribute: assertion 'size >= 0' failed in GtkScrollbar
20:59:10 [2020-08-28T00:59:10.926Z] 
20:59:10 [2020-08-28T00:59:10.926Z] (SWT:1591): Gtk-WARNING **: 00:59:09.919: Negative content width -6 (allocation 1, extents 4x3) while allocating gadget (node toolbar, owner GtkToolbar)
20:59:10 [2020-08-28T00:59:10.926Z] 
20:59:10 [2020-08-28T00:59:10.926Z] (SWT:1591): Gtk-WARNING **: 00:59:09.929: Negative content width -6 (allocation 1, extents 4x3) while allocating gadget (node toolbar, owner GtkToolbar)
20:59:10 [2020-08-28T00:59:10.926Z] 
20:59:10 [2020-08-28T00:59:10.926Z] (SWT:1591): Gtk-WARNING **: 00:59:09.957: Negative content width -6 (allocation 1, extents 4x3) while allocating gadget (node toolbar, owner GtkToolbar)
20:59:10 [2020-08-28T00:59:10.926Z] 
20:59:10 [2020-08-28T00:59:10.926Z] (SWT:1591): Gtk-CRITICAL **: 00:59:09.960: gtk_box_gadget_distribute: assertion 'size >= 0' failed in GtkScrollbar
20:59:10 [2020-08-28T00:59:10.926Z] 
20:59:10 [2020-08-28T00:59:10.926Z] (SWT:1591): Gtk-WARNING **: 00:59:09.986: Negative content width -6 (allocation 1, extents 4x3) while allocating gadget (node toolbar, owner GtkToolbar)
20:59:16 [2020-08-28T00:59:16.220Z] 
20:59:16 [2020-08-28T00:59:16.220Z] (SWT:1591): Gtk-WARNING **: 00:59:15.159: Negative content width -6 (allocation 1, extents 4x3) while allocating gadget (node toolbar, owner GtkToolbar)
20:59:16 [2020-08-28T00:59:16.220Z] 
20:59:16 [2020-08-28T00:59:16.220Z] (SWT:1591): Gtk-WARNING **: 00:59:15.278: Negative content width -6 (allocation 1, extents 4x3) while allocating gadget (node toolbar, owner GtkToolbar)
20:59:16 [2020-08-28T00:59:16.220Z] 
20:59:16 [2020-08-28T00:59:16.220Z] (SWT:1591): Gtk-WARNING **: 00:59:15.923: Negative content width -6 (allocation 1, extents 4x3) while allocating gadget (node toolbar, owner GtkToolbar)
20:59:16 [2020-08-28T00:59:16.220Z] 
20:59:16 [2020-08-28T00:59:16.220Z] (SWT:1591): Gtk-WARNING **: 00:59:15.961: Negative content width -6 (allocation 1, extents 4x3) while allocating gadget (node toolbar, owner GtkToolbar)
20:59:21 [2020-08-28T00:59:21.477Z] Tests run: 11, Failures: 0, Errors: 0, Skipped: 0, Time elapsed: 22.164 s - in org.eclipse.egit.ui.internal.submodules.SubmoduleFolderTest
20:59:21 [2020-08-28T00:59:21.478Z] testSwitchToMenu(org.eclipse.egit.ui.internal.submodules.SubmoduleFolderTest)  Time elapsed: 1.88 s
20:59:21 [2020-08-28T00:59:21.478Z] compareWithHeadInSubmoduleFolder(org.eclipse.egit.ui.internal.submodules.SubmoduleFolderTest)  Time elapsed: 1.883 s
20:59:21 [2020-08-28T00:59:21.478Z] testStageUnstageInSubRepo(org.eclipse.egit.ui.internal.submodules.SubmoduleFolderTest)  Time elapsed: 2.745 s
20:59:21 [2020-08-28T00:59:21.478Z] testDecoration(org.eclipse.egit.ui.internal.submodules.SubmoduleFolderTest)  Time elapsed: 2.637 s
20:59:21 [2020-08-28T00:59:21.478Z] testHistoryFromProjectExplorerIsFromSubRepository(org.eclipse.egit.ui.internal.submodules.SubmoduleFolderTest)  Time elapsed: 2.002 s
20:59:21 [2020-08-28T00:59:21.478Z] testParentFolderMapsToParentRepo(org.eclipse.egit.ui.internal.submodules.SubmoduleFolderTest)  Time elapsed: 1.856 s
20:59:21 [2020-08-28T00:59:21.478Z] testDisconnect(org.eclipse.egit.ui.internal.submodules.SubmoduleFolderTest)  Time elapsed: 1.927 s
20:59:21 [2020-08-28T00:59:21.478Z] testRepoViewFollowSelection(org.eclipse.egit.ui.internal.submodules.SubmoduleFolderTest)  Time elapsed: 2.06 s
20:59:21 [2020-08-28T00:59:21.478Z] testRepoRemoval(org.eclipse.egit.ui.internal.submodules.SubmoduleFolderTest)  Time elapsed: 2.102 s
20:59:21 [2020-08-28T00:59:21.478Z] testChildProjectMapsToSubRepo(org.eclipse.egit.ui.internal.submodules.SubmoduleFolderTest)  Time elapsed: 1.405 s
20:59:21 [2020-08-28T00:59:21.478Z] testChildFolderMapsToSubRepo(org.eclipse.egit.ui.internal.submodules.SubmoduleFolderTest)  Time elapsed: 1.607 s
20:59:21 [2020-08-28T00:59:21.478Z] Running org.eclipse.egit.ui.internal.synchronize.model.GitModelWorkingFileTest
20:59:24 [2020-08-28T00:59:24.759Z] Tests run: 5, Failures: 0, Errors: 0, Skipped: 0, Time elapsed: 3.076 s - in org.eclipse.egit.ui.internal.synchronize.model.GitModelWorkingFileTest
20:59:24 [2020-08-28T00:59:24.759Z] shouldReturnNotEqualForDifferentLocation(org.eclipse.egit.ui.internal.synchronize.model.GitModelWorkingFileTest)  Time elapsed: 0.599 s
20:59:24 [2020-08-28T00:59:24.759Z] shouldReturnNotEqualWhenComparingWorkingFileAndCacheFile(org.eclipse.egit.ui.internal.synchronize.model.GitModelWorkingFileTest)  Time elapsed: 0.615 s
20:59:24 [2020-08-28T00:59:24.759Z] shouldReturnEqualForSameInstance(org.eclipse.egit.ui.internal.synchronize.model.GitModelWorkingFileTest)  Time elapsed: 0.581 s
20:59:24 [2020-08-28T00:59:24.759Z] shouldReturnNotEqualWhenComparingWorkingFileAndBlob(org.eclipse.egit.ui.internal.synchronize.model.GitModelWorkingFileTest)  Time elapsed: 0.676 s
20:59:24 [2020-08-28T00:59:24.759Z] shouldReturnEqualForSameLocation(org.eclipse.egit.ui.internal.synchronize.model.GitModelWorkingFileTest)  Time elapsed: 0.595 s
20:59:24 [2020-08-28T00:59:24.759Z] Running org.eclipse.egit.ui.internal.synchronize.model.GitModelBlobTest
20:59:32 [2020-08-28T00:59:32.866Z] Tests run: 15, Failures: 0, Errors: 0, Skipped: 2, Time elapsed: 7.928 s - in org.eclipse.egit.ui.internal.synchronize.model.GitModelBlobTest
20:59:32 [2020-08-28T00:59:32.866Z] shouldReturnEqualSameData1(org.eclipse.egit.ui.internal.synchronize.model.GitModelBlobTest) skipped
20:59:32 [2020-08-28T00:59:32.867Z] shouldReturnNotEqualForDifferentLocation(org.eclipse.egit.ui.internal.synchronize.model.GitModelBlobTest)  Time elapsed: 0.603 s
20:59:32 [2020-08-28T00:59:32.867Z] shouldReturnNotEqualForBlobAndCommit(org.eclipse.egit.ui.internal.synchronize.model.GitModelBlobTest)  Time elapsed: 0.587 s
20:59:32 [2020-08-28T00:59:32.867Z] shouldReturnEqualForSameData(org.eclipse.egit.ui.internal.synchronize.model.GitModelBlobTest) skipped
20:59:32 [2020-08-28T00:59:32.867Z] shouldReturnNotEqualForDifferentFiles(org.eclipse.egit.ui.internal.synchronize.model.GitModelBlobTest)  Time elapsed: 0.586 s
20:59:32 [2020-08-28T00:59:32.867Z] shouldReturnNotEqualForBlobAndCacheFile(org.eclipse.egit.ui.internal.synchronize.model.GitModelBlobTest)  Time elapsed: 0.611 s
20:59:32 [2020-08-28T00:59:32.867Z] shouldReturnNotEqualForBlobAndTree(org.eclipse.egit.ui.internal.synchronize.model.GitModelBlobTest)  Time elapsed: 0.611 s
20:59:32 [2020-08-28T00:59:32.867Z] shouldBeSymmetric1(org.eclipse.egit.ui.internal.synchronize.model.GitModelBlobTest)  Time elapsed: 0.619 s
20:59:32 [2020-08-28T00:59:32.867Z] shouldBeSymmetric(org.eclipse.egit.ui.internal.synchronize.model.GitModelBlobTest)  Time elapsed: 0.664 s
20:59:32 [2020-08-28T00:59:32.867Z] shouldReturnEqualForSameInstance(org.eclipse.egit.ui.internal.synchronize.model.GitModelBlobTest)  Time elapsed: 0.602 s
20:59:32 [2020-08-28T00:59:32.867Z] shouldActAsResourceProvider(org.eclipse.egit.ui.internal.synchronize.model.GitModelBlobTest)  Time elapsed: 0.604 s
20:59:32 [2020-08-28T00:59:32.867Z] shouldReturnNotEqualForDifferentBaseObjectId2(org.eclipse.egit.ui.internal.synchronize.model.GitModelBlobTest)  Time elapsed: 0.596 s
20:59:32 [2020-08-28T00:59:32.867Z] shouldReturnNotEqualForDifferentBaseObjectId3(org.eclipse.egit.ui.internal.synchronize.model.GitModelBlobTest)  Time elapsed: 0.604 s
20:59:32 [2020-08-28T00:59:32.867Z] shouldReturnNotEqualForBlobAndWorkingFile(org.eclipse.egit.ui.internal.synchronize.model.GitModelBlobTest)  Time elapsed: 0.627 s
20:59:32 [2020-08-28T00:59:32.867Z] shouldReturnNotEqualForDifferentBaseObjectId(org.eclipse.egit.ui.internal.synchronize.model.GitModelBlobTest)  Time elapsed: 0.59 s
20:59:32 [2020-08-28T00:59:32.867Z] Running org.eclipse.egit.ui.internal.synchronize.model.GitModelCacheFileTest
20:59:35 [2020-08-28T00:59:35.390Z] Tests run: 7, Failures: 0, Errors: 0, Skipped: 2, Time elapsed: 3.011 s - in org.eclipse.egit.ui.internal.synchronize.model.GitModelCacheFileTest
20:59:35 [2020-08-28T00:59:35.390Z] shouldReturnEqualForSameObjectIdsAndLocation(org.eclipse.egit.ui.internal.synchronize.model.GitModelCacheFileTest)  Time elapsed: 0.587 s
20:59:35 [2020-08-28T00:59:35.390Z] shouldReturnNotEqualWhenComparingCacheFileAndBlob(org.eclipse.egit.ui.internal.synchronize.model.GitModelCacheFileTest)  Time elapsed: 0.601 s
20:59:35 [2020-08-28T00:59:35.390Z] shouldReturnNotEqualForDifferentCacheIds(org.eclipse.egit.ui.internal.synchronize.model.GitModelCacheFileTest) skipped
20:59:35 [2020-08-28T00:59:35.390Z] shouldReturnEqualForSameInstance(org.eclipse.egit.ui.internal.synchronize.model.GitModelCacheFileTest)  Time elapsed: 0.6 s
20:59:35 [2020-08-28T00:59:35.390Z] shouldReturnNotEqualWhenComparingCacheFileAndWorkingFile(org.eclipse.egit.ui.internal.synchronize.model.GitModelCacheFileTest)  Time elapsed: 0.612 s
20:59:35 [2020-08-28T00:59:35.390Z] shouldReturnNotEqualForDifferentBaseIds(org.eclipse.egit.ui.internal.synchronize.model.GitModelCacheFileTest)  Time elapsed: 0.6 s
20:59:35 [2020-08-28T00:59:35.390Z] shouldReturnNotEqualForDifferentLocations(org.eclipse.egit.ui.internal.synchronize.model.GitModelCacheFileTest) skipped
20:59:35 [2020-08-28T00:59:35.390Z] Running org.eclipse.egit.ui.internal.synchronize.model.GitModelWorkingTreeTest
20:59:36 [2020-08-28T00:59:36.762Z] Tests run: 2, Failures: 0, Errors: 0, Skipped: 0, Time elapsed: 1.199 s - in org.eclipse.egit.ui.internal.synchronize.model.GitModelWorkingTreeTest
20:59:36 [2020-08-28T00:59:36.762Z] shouldReturnNotEqualsWhenComparingWorkingTreeAndCache(org.eclipse.egit.ui.internal.synchronize.model.GitModelWorkingTreeTest)  Time elapsed: 0.61 s
20:59:36 [2020-08-28T00:59:36.762Z] shouldReturnEqualsForTheSameInstance(org.eclipse.egit.ui.internal.synchronize.model.GitModelWorkingTreeTest)  Time elapsed: 0.585 s
20:59:36 [2020-08-28T00:59:36.762Z] Running org.eclipse.egit.ui.internal.synchronize.model.GitModelCacheTreeTest
20:59:39 [2020-08-28T00:59:39.285Z] Tests run: 4, Failures: 0, Errors: 0, Skipped: 0, Time elapsed: 2.384 s - in org.eclipse.egit.ui.internal.synchronize.model.GitModelCacheTreeTest
20:59:39 [2020-08-28T00:59:39.285Z] shouldReturnEqualForSameData(org.eclipse.egit.ui.internal.synchronize.model.GitModelCacheTreeTest)  Time elapsed: 0.587 s
20:59:39 [2020-08-28T00:59:39.285Z] shouldReturnNotEqualForDifferetnLocation(org.eclipse.egit.ui.internal.synchronize.model.GitModelCacheTreeTest)  Time elapsed: 0.587 s
20:59:39 [2020-08-28T00:59:39.285Z] shouldReturnEqualForSameInstance(org.eclipse.egit.ui.internal.synchronize.model.GitModelCacheTreeTest)  Time elapsed: 0.586 s
20:59:39 [2020-08-28T00:59:39.285Z] shouldReturnNotEqualWhenComparingCacheTreeAndTree(org.eclipse.egit.ui.internal.synchronize.model.GitModelCacheTreeTest)  Time elapsed: 0.616 s
20:59:39 [2020-08-28T00:59:39.285Z] Running org.eclipse.egit.ui.internal.synchronize.model.GitModelRootTest
20:59:40 [2020-08-28T00:59:40.656Z] Tests run: 1, Failures: 0, Errors: 0, Skipped: 0, Time elapsed: 1.422 s - in org.eclipse.egit.ui.internal.synchronize.model.GitModelRootTest
20:59:40 [2020-08-28T00:59:40.656Z] shouldIgnoreEmptyRepositories(org.eclipse.egit.ui.internal.synchronize.model.GitModelRootTest)  Time elapsed: 1.418 s
20:59:40 [2020-08-28T00:59:40.656Z] Running org.eclipse.egit.ui.internal.synchronize.model.GitModelCommitTest
20:59:45 [2020-08-28T00:59:45.915Z] Tests run: 7, Failures: 0, Errors: 0, Skipped: 0, Time elapsed: 4.876 s - in org.eclipse.egit.ui.internal.synchronize.model.GitModelCommitTest
20:59:45 [2020-08-28T00:59:45.915Z] shouldReturnNotEqualForDifferentCommits(org.eclipse.egit.ui.internal.synchronize.model.GitModelCommitTest)  Time elapsed: 0.58 s
20:59:45 [2020-08-28T00:59:45.915Z] shouldReturnNotEqualWhenCommitTreeAndBlob(org.eclipse.egit.ui.internal.synchronize.model.GitModelCommitTest)  Time elapsed: 0.586 s
20:59:45 [2020-08-28T00:59:45.915Z] shouldReturnNotEqualWhenCommitTreeAndTree(org.eclipse.egit.ui.internal.synchronize.model.GitModelCommitTest)  Time elapsed: 0.593 s
20:59:45 [2020-08-28T00:59:45.915Z] shouldReturnNotEqualWhenCommitTreeAndCache(org.eclipse.egit.ui.internal.synchronize.model.GitModelCommitTest)  Time elapsed: 0.613 s
20:59:45 [2020-08-28T00:59:45.915Z] shouldReturnEqualForSameInstance(org.eclipse.egit.ui.internal.synchronize.model.GitModelCommitTest)  Time elapsed: 0.602 s
20:59:45 [2020-08-28T00:59:45.915Z] shouldReturnNotEqualForDifferentParents(org.eclipse.egit.ui.internal.synchronize.model.GitModelCommitTest)  Time elapsed: 1.29 s
20:59:45 [2020-08-28T00:59:45.915Z] shouldReturnEqualForSameCommits(org.eclipse.egit.ui.internal.synchronize.model.GitModelCommitTest)  Time elapsed: 0.598 s
20:59:45 [2020-08-28T00:59:45.915Z] Running org.eclipse.egit.ui.internal.synchronize.model.GitModelRepositoryTest
20:59:47 [2020-08-28T00:59:47.289Z] Tests run: 3, Failures: 0, Errors: 0, Skipped: 0, Time elapsed: 2.104 s - in org.eclipse.egit.ui.internal.synchronize.model.GitModelRepositoryTest
20:59:47 [2020-08-28T00:59:47.290Z] shouldReturnEqual(org.eclipse.egit.ui.internal.synchronize.model.GitModelRepositoryTest)  Time elapsed: 0.698 s
20:59:47 [2020-08-28T00:59:47.290Z] shouldReturnNotEqual(org.eclipse.egit.ui.internal.synchronize.model.GitModelRepositoryTest)  Time elapsed: 0.701 s
20:59:47 [2020-08-28T00:59:47.290Z] shouldReturnEqualForSameInstance(org.eclipse.egit.ui.internal.synchronize.model.GitModelRepositoryTest)  Time elapsed: 0.696 s
20:59:47 [2020-08-28T00:59:47.290Z] Running org.eclipse.egit.ui.internal.synchronize.model.GitModelCacheTest
20:59:52 [2020-08-28T00:59:52.576Z] Tests run: 6, Failures: 0, Errors: 0, Skipped: 0, Time elapsed: 4.311 s - in org.eclipse.egit.ui.internal.synchronize.model.GitModelCacheTest
20:59:52 [2020-08-28T00:59:52.576Z] shouldReturnChildren(org.eclipse.egit.ui.internal.synchronize.model.GitModelCacheTest)  Time elapsed: 0.594 s
20:59:52 [2020-08-28T00:59:52.576Z] shouldReturnNotEqualWhenCacheTreeAndCommit(org.eclipse.egit.ui.internal.synchronize.model.GitModelCacheTest)  Time elapsed: 0.597 s
20:59:52 [2020-08-28T00:59:52.576Z] shouldReturnEqualForSameInstance(org.eclipse.egit.ui.internal.synchronize.model.GitModelCacheTest)  Time elapsed: 0.572 s
20:59:52 [2020-08-28T00:59:52.576Z] shouldReturnEqualForSameCommits(org.eclipse.egit.ui.internal.synchronize.model.GitModelCacheTest)  Time elapsed: 0.601 s
20:59:52 [2020-08-28T00:59:52.576Z] shouldReturnNotEqualWhenComparingCacheAndWorkingTree(org.eclipse.egit.ui.internal.synchronize.model.GitModelCacheTest)  Time elapsed: 0.644 s
20:59:52 [2020-08-28T00:59:52.576Z] shouldReturnNotEqualForDifferentRepositories(org.eclipse.egit.ui.internal.synchronize.model.GitModelCacheTest)  Time elapsed: 1.29 s
20:59:52 [2020-08-28T00:59:52.576Z] Running org.eclipse.egit.ui.internal.synchronize.model.GitModelTreeTest
20:59:55 [2020-08-28T00:59:55.861Z] Tests run: 6, Failures: 0, Errors: 0, Skipped: 0, Time elapsed: 3.59 s - in org.eclipse.egit.ui.internal.synchronize.model.GitModelTreeTest
20:59:55 [2020-08-28T00:59:55.861Z] shouldReturnNotEqualForDifferentLocation(org.eclipse.egit.ui.internal.synchronize.model.GitModelTreeTest)  Time elapsed: 0.596 s
20:59:55 [2020-08-28T00:59:55.861Z] shouldReturnNotEqualForTreeAndCacheTree(org.eclipse.egit.ui.internal.synchronize.model.GitModelTreeTest)  Time elapsed: 0.604 s
20:59:55 [2020-08-28T00:59:55.861Z] shouldReturnNotEqualForTreeAndCommit(org.eclipse.egit.ui.internal.synchronize.model.GitModelTreeTest)  Time elapsed: 0.587 s
20:59:55 [2020-08-28T00:59:55.861Z] shouldReturnEqualForSameBaseCommit(org.eclipse.egit.ui.internal.synchronize.model.GitModelTreeTest)  Time elapsed: 0.604 s
20:59:55 [2020-08-28T00:59:55.861Z] shouldReturnEqualForSameInstance(org.eclipse.egit.ui.internal.synchronize.model.GitModelTreeTest)  Time elapsed: 0.592 s
20:59:55 [2020-08-28T00:59:55.861Z] shouldReturnNotEqualForTreeAndBlob(org.eclipse.egit.ui.internal.synchronize.model.GitModelTreeTest)  Time elapsed: 0.596 s
20:59:55 [2020-08-28T00:59:55.861Z] Running org.eclipse.egit.ui.internal.synchronize.mapping.GitChangeSetSorterTest
20:59:55 [2020-08-28T00:59:55.861Z] Tests run: 23, Failures: 0, Errors: 0, Skipped: 0, Time elapsed: 0.167 s - in org.eclipse.egit.ui.internal.synchronize.mapping.GitChangeSetSorterTest
20:59:55 [2020-08-28T00:59:55.861Z] commitTreeShouldBeLessThanBlob(org.eclipse.egit.ui.internal.synchronize.mapping.GitChangeSetSorterTest)  Time elapsed: 0.031 s
20:59:55 [2020-08-28T00:59:55.861Z] commitTreeShouldBeLessThanTree(org.eclipse.egit.ui.internal.synchronize.mapping.GitChangeSetSorterTest)  Time elapsed: 0 s
20:59:55 [2020-08-28T00:59:55.861Z] blobShouldBeGreaterThanTree(org.eclipse.egit.ui.internal.synchronize.mapping.GitChangeSetSorterTest)  Time elapsed: 0 s
20:59:55 [2020-08-28T00:59:55.861Z] cacheTreeShouldBeLessThanCommit(org.eclipse.egit.ui.internal.synchronize.mapping.GitChangeSetSorterTest)  Time elapsed: 0 s
20:59:55 [2020-08-28T00:59:55.861Z] shouldOrderTreesAlphabetically(org.eclipse.egit.ui.internal.synchronize.mapping.GitChangeSetSorterTest)  Time elapsed: 0.134 s
20:59:55 [2020-08-28T00:59:55.861Z] commitTreeShouldBeGreaterThanCache(org.eclipse.egit.ui.internal.synchronize.mapping.GitChangeSetSorterTest)  Time elapsed: 0 s
20:59:55 [2020-08-28T00:59:55.861Z] blobShouldBeGreaterThanWorkingTree(org.eclipse.egit.ui.internal.synchronize.mapping.GitChangeSetSorterTest)  Time elapsed: 0 s
20:59:55 [2020-08-28T00:59:55.861Z] treeShouldBeGreaterThanCache(org.eclipse.egit.ui.internal.synchronize.mapping.GitChangeSetSorterTest)  Time elapsed: 0 s
20:59:55 [2020-08-28T00:59:55.861Z] treeShouldBeGreaterThanCommit(org.eclipse.egit.ui.internal.synchronize.mapping.GitChangeSetSorterTest)  Time elapsed: 0 s
20:59:55 [2020-08-28T00:59:55.861Z] workingTreeShouldBeLessThanCacheTree(org.eclipse.egit.ui.internal.synchronize.mapping.GitChangeSetSorterTest)  Time elapsed: 0 s
20:59:55 [2020-08-28T00:59:55.861Z] treeShouldBeGreaterThanWorkingTree(org.eclipse.egit.ui.internal.synchronize.mapping.GitChangeSetSorterTest)  Time elapsed: 0 s
20:59:55 [2020-08-28T00:59:55.861Z] blobShouldBeGreaterThanCache(org.eclipse.egit.ui.internal.synchronize.mapping.GitChangeSetSorterTest)  Time elapsed: 0 s
20:59:55 [2020-08-28T00:59:55.861Z] cacheTreeShouldBeLessThanBlob(org.eclipse.egit.ui.internal.synchronize.mapping.GitChangeSetSorterTest)  Time elapsed: 0 s
20:59:55 [2020-08-28T00:59:55.861Z] cacheTreeShouldBeLessThanTree(org.eclipse.egit.ui.internal.synchronize.mapping.GitChangeSetSorterTest)  Time elapsed: 0 s
20:59:55 [2020-08-28T00:59:55.861Z] shouldOrderBlobsAlphabetically(org.eclipse.egit.ui.internal.synchronize.mapping.GitChangeSetSorterTest)  Time elapsed: 0.001 s
20:59:55 [2020-08-28T00:59:55.861Z] commitTreeShouldBeGreaterThanWorkingTree(org.eclipse.egit.ui.internal.synchronize.mapping.GitChangeSetSorterTest)  Time elapsed: 0 s
20:59:55 [2020-08-28T00:59:55.861Z] treeShouldBeLessThanBlob(org.eclipse.egit.ui.internal.synchronize.mapping.GitChangeSetSorterTest)  Time elapsed: 0 s
20:59:55 [2020-08-28T00:59:55.861Z] cacheTreeShouldBeGreaterThanWorkingTree(org.eclipse.egit.ui.internal.synchronize.mapping.GitChangeSetSorterTest)  Time elapsed: 0 s
20:59:55 [2020-08-28T00:59:55.861Z] workingTreeShouldBeLessThanBlob(org.eclipse.egit.ui.internal.synchronize.mapping.GitChangeSetSorterTest)  Time elapsed: 0 s
20:59:55 [2020-08-28T00:59:55.861Z] workingTreeShouldBeLessThanTree(org.eclipse.egit.ui.internal.synchronize.mapping.GitChangeSetSorterTest)  Time elapsed: 0 s
20:59:55 [2020-08-28T00:59:55.861Z] shouldOrderCommitsByCommitDate(org.eclipse.egit.ui.internal.synchronize.mapping.GitChangeSetSorterTest)  Time elapsed: 0.001 s
20:59:55 [2020-08-28T00:59:55.861Z] workingTreeShouldBeLessThanCommit(org.eclipse.egit.ui.internal.synchronize.mapping.GitChangeSetSorterTest)  Time elapsed: 0 s
20:59:55 [2020-08-28T00:59:55.861Z] blobShouldBeGreaterThanCommit(org.eclipse.egit.ui.internal.synchronize.mapping.GitChangeSetSorterTest)  Time elapsed: 0 s
20:59:55 [2020-08-28T00:59:55.861Z] Running org.eclipse.egit.ui.internal.CompareUtilsTest
20:59:58 [2020-08-28T00:59:58.389Z] Tests run: 3, Failures: 0, Errors: 0, Skipped: 0, Time elapsed: 2.505 s - in org.eclipse.egit.ui.internal.CompareUtilsTest
20:59:58 [2020-08-28T00:59:58.389Z] testIndexEditWithAttributes(org.eclipse.egit.ui.internal.CompareUtilsTest)  Time elapsed: 0.965 s
20:59:58 [2020-08-28T00:59:58.389Z] testIndexEdit(org.eclipse.egit.ui.internal.CompareUtilsTest)  Time elapsed: 0.83 s
20:59:58 [2020-08-28T00:59:58.389Z] testIndexEditExecutable(org.eclipse.egit.ui.internal.CompareUtilsTest)  Time elapsed: 0.703 s
20:59:58 [2020-08-28T00:59:58.389Z] Running org.eclipse.egit.ui.internal.clone.SmartImportWizardTest
20:59:58 [2020-08-28T00:59:58.955Z] Tests run: 1, Failures: 0, Errors: 0, Skipped: 0, Time elapsed: 0.969 s - in org.eclipse.egit.ui.internal.clone.SmartImportWizardTest
20:59:58 [2020-08-28T00:59:58.955Z] test(org.eclipse.egit.ui.internal.clone.SmartImportWizardTest)  Time elapsed: 0.966 s
20:59:58 [2020-08-28T00:59:58.955Z] Running org.eclipse.egit.ui.internal.push.PushBranchWizardTest
20:59:59 [2020-08-28T00:59:59.888Z] 
20:59:59 [2020-08-28T00:59:59.888Z] (SWT:1591): Gtk-CRITICAL **: 00:59:59.621: gtk_box_gadget_distribute: assertion 'size >= 0' failed in GtkScrollbar
20:59:59 [2020-08-28T00:59:59.888Z] 
20:59:59 [2020-08-28T00:59:59.888Z] (SWT:1591): Gtk-CRITICAL **: 00:59:59.622: gtk_box_gadget_distribute: assertion 'size >= 0' failed in GtkScrollbar
20:59:59 [2020-08-28T00:59:59.888Z] 
20:59:59 [2020-08-28T00:59:59.888Z] (SWT:1591): Gtk-CRITICAL **: 00:59:59.625: gtk_box_gadget_distribute: assertion 'size >= 0' failed in GtkScrollbar
20:59:59 [2020-08-28T00:59:59.888Z] 
20:59:59 [2020-08-28T00:59:59.888Z] (SWT:1591): Gtk-CRITICAL **: 00:59:59.629: gtk_box_gadget_distribute: assertion 'size >= 0' failed in GtkScrollbar
21:00:09 [2020-08-28T01:00:09.853Z] Tests run: 9, Failures: 0, Errors: 0, Skipped: 0, Time elapsed: 9.477 s - in org.eclipse.egit.ui.internal.push.PushBranchWizardTest
21:00:09 [2020-08-28T01:00:09.853Z] pushHeadToExistingRemote(org.eclipse.egit.ui.internal.push.PushBranchWizardTest)  Time elapsed: 1.019 s
21:00:09 [2020-08-28T01:00:09.853Z] pushWithRemoteUpstreamConfiguration(org.eclipse.egit.ui.internal.push.PushBranchWizardTest)  Time elapsed: 0.975 s
21:00:09 [2020-08-28T01:00:09.854Z] pushWithDifferentBranchName(org.eclipse.egit.ui.internal.push.PushBranchWizardTest)  Time elapsed: 0.945 s
21:00:09 [2020-08-28T01:00:09.854Z] pushToExistingRemoteAndSetRebase(org.eclipse.egit.ui.internal.push.PushBranchWizardTest)  Time elapsed: 1.257 s
21:00:09 [2020-08-28T01:00:09.854Z] pushToNewRemote(org.eclipse.egit.ui.internal.push.PushBranchWizardTest)  Time elapsed: 1.052 s
21:00:09 [2020-08-28T01:00:09.854Z] pushToExistingRemoteWithoutConfiguringUpstream(org.eclipse.egit.ui.internal.push.PushBranchWizardTest)  Time elapsed: 1.004 s
21:00:09 [2020-08-28T01:00:09.854Z] pushToExistingRemote(org.eclipse.egit.ui.internal.push.PushBranchWizardTest)  Time elapsed: 1.02 s
21:00:09 [2020-08-28T01:00:09.854Z] pushWhenNoRemoteExistsYet(org.eclipse.egit.ui.internal.push.PushBranchWizardTest)  Time elapsed: 1.108 s
21:00:09 [2020-08-28T01:00:09.854Z] pushWithLocalUpstreamConfiguration(org.eclipse.egit.ui.internal.push.PushBranchWizardTest)  Time elapsed: 1.075 s
21:00:09 [2020-08-28T01:00:09.854Z] Running org.eclipse.egit.ui.internal.push.PushTagsWizardTest
21:00:09 [2020-08-28T01:00:09.854Z] Tests run: 1, Failures: 0, Errors: 0, Skipped: 0, Time elapsed: 0.978 s - in org.eclipse.egit.ui.internal.push.PushTagsWizardTest
21:00:09 [2020-08-28T01:00:09.854Z] pushTag(org.eclipse.egit.ui.internal.push.PushTagsWizardTest)  Time elapsed: 0.975 s
21:00:09 [2020-08-28T01:00:09.854Z] Running org.eclipse.egit.ui.internal.push.PushToUpstreamTest
21:00:12 [2020-08-28T01:00:12.380Z] Tests run: 3, Failures: 0, Errors: 0, Skipped: 0, Time elapsed: 2.702 s - in org.eclipse.egit.ui.internal.push.PushToUpstreamTest
21:00:12 [2020-08-28T01:00:12.380Z] pushWithExistingUpstreamConfiguration(org.eclipse.egit.ui.internal.push.PushToUpstreamTest)  Time elapsed: 0.861 s
21:00:12 [2020-08-28T01:00:12.380Z] pushWithoutConfig(org.eclipse.egit.ui.internal.push.PushToUpstreamTest)  Time elapsed: 0.872 s
21:00:12 [2020-08-28T01:00:12.380Z] pushWithDefaultRemoteWithPushRefSpecs(org.eclipse.egit.ui.internal.push.PushToUpstreamTest)  Time elapsed: 0.961 s
21:00:12 [2020-08-28T01:00:12.380Z] Running org.eclipse.egit.ui.internal.branch.BranchProjectTrackerTest
21:00:13 [2020-08-28T01:00:13.312Z] Tests run: 1, Failures: 0, Errors: 0, Skipped: 0, Time elapsed: 1.238 s - in org.eclipse.egit.ui.internal.branch.BranchProjectTrackerTest
21:00:13 [2020-08-28T01:00:13.312Z] twoProjectsWithOnlyOneOnBranch(org.eclipse.egit.ui.internal.branch.BranchProjectTrackerTest)  Time elapsed: 1.235 s
21:00:13 [2020-08-28T01:00:13.312Z] Running org.eclipse.egit.ui.internal.decorators.DecoratableResourceAdapterTest
21:00:28 [2020-08-28T01:00:28.175Z] Tests run: 13, Failures: 0, Errors: 0, Skipped: 0, Time elapsed: 12.391 s - in org.eclipse.egit.ui.internal.decorators.DecoratableResourceAdapterTest
21:00:28 [2020-08-28T01:00:28.175Z] testDecorationDeletedFile(org.eclipse.egit.ui.internal.decorators.DecoratableResourceAdapterTest)  Time elapsed: 0.798 s
21:00:28 [2020-08-28T01:00:28.175Z] testDecorationModifiedFile(org.eclipse.egit.ui.internal.decorators.DecoratableResourceAdapterTest)  Time elapsed: 1.061 s
21:00:28 [2020-08-28T01:00:28.175Z] testDecorationEmptyProject(org.eclipse.egit.ui.internal.decorators.DecoratableResourceAdapterTest)  Time elapsed: 0.871 s
21:00:28 [2020-08-28T01:00:28.175Z] testDecorationConflictingFile(org.eclipse.egit.ui.internal.decorators.DecoratableResourceAdapterTest)  Time elapsed: 0.915 s
21:00:28 [2020-08-28T01:00:28.175Z] testDecorationNewEmptyFolder(org.eclipse.egit.ui.internal.decorators.DecoratableResourceAdapterTest)  Time elapsed: 0.916 s
21:00:28 [2020-08-28T01:00:28.175Z] testDecorationFolderPrefixOfOtherFolder(org.eclipse.egit.ui.internal.decorators.DecoratableResourceAdapterTest)  Time elapsed: 1.006 s
21:00:28 [2020-08-28T01:00:28.175Z] testDecorationNewFileInOneSubfolder(org.eclipse.egit.ui.internal.decorators.DecoratableResourceAdapterTest)  Time elapsed: 1.192 s
21:00:28 [2020-08-28T01:00:28.175Z] testDecorationNewFile(org.eclipse.egit.ui.internal.decorators.DecoratableResourceAdapterTest)  Time elapsed: 0.896 s
21:00:28 [2020-08-28T01:00:28.175Z] testDecorationNewFileInSubfolder(org.eclipse.egit.ui.internal.decorators.DecoratableResourceAdapterTest)  Time elapsed: 0.996 s
21:00:28 [2020-08-28T01:00:28.175Z] testDecorationCommittedFile(org.eclipse.egit.ui.internal.decorators.DecoratableResourceAdapterTest)  Time elapsed: 0.901 s
21:00:28 [2020-08-28T01:00:28.175Z] testDecorationFileInIgnoredFolder(org.eclipse.egit.ui.internal.decorators.DecoratableResourceAdapterTest)  Time elapsed: 1.195 s
21:00:28 [2020-08-28T01:00:28.175Z] testDecorationIgnoredFile(org.eclipse.egit.ui.internal.decorators.DecoratableResourceAdapterTest)  Time elapsed: 0.806 s
21:00:28 [2020-08-28T01:00:28.175Z] testDecorationAddedFile(org.eclipse.egit.ui.internal.decorators.DecoratableResourceAdapterTest)  Time elapsed: 0.811 s
21:00:28 [2020-08-28T01:00:28.175Z] Running org.eclipse.egit.ui.internal.decorators.DecoratableWorkingSetTest
21:00:33 [2020-08-28T01:00:33.436Z] Tests run: 7, Failures: 0, Errors: 0, Skipped: 0, Time elapsed: 7.107 s - in org.eclipse.egit.ui.internal.decorators.DecoratableWorkingSetTest
21:00:33 [2020-08-28T01:00:33.436Z] testAnyConflictsIsConflicts(org.eclipse.egit.ui.internal.decorators.DecoratableWorkingSetTest)  Time elapsed: 1.183 s
21:00:33 [2020-08-28T01:00:33.436Z] testUntrackedContentIsUndecorated(org.eclipse.egit.ui.internal.decorators.DecoratableWorkingSetTest)  Time elapsed: 0.988 s
21:00:33 [2020-08-28T01:00:33.436Z] testAnyDirtyIsDirty(org.eclipse.egit.ui.internal.decorators.DecoratableWorkingSetTest)  Time elapsed: 0.894 s
21:00:33 [2020-08-28T01:00:33.436Z] testDecorationConflictingOverDirty(org.eclipse.egit.ui.internal.decorators.DecoratableWorkingSetTest)  Time elapsed: 1.05 s
21:00:33 [2020-08-28T01:00:33.436Z] testEmptyWorkingSetIsUndecorated(org.eclipse.egit.ui.internal.decorators.DecoratableWorkingSetTest)  Time elapsed: 0.9 s
21:00:33 [2020-08-28T01:00:33.436Z] testStagingStateHasNoInfluence_Modified(org.eclipse.egit.ui.internal.decorators.DecoratableWorkingSetTest)  Time elapsed: 1.29 s
21:00:33 [2020-08-28T01:00:33.436Z] testAnyTrackedIsTracked(org.eclipse.egit.ui.internal.decorators.DecoratableWorkingSetTest)  Time elapsed: 0.793 s
21:00:33 [2020-08-28T01:00:33.436Z] Running org.eclipse.egit.ui.internal.decorators.DecoratableResourceMappingTest
21:00:41 [2020-08-28T01:00:41.535Z] Tests run: 9, Failures: 0, Errors: 0, Skipped: 0, Time elapsed: 7.971 s - in org.eclipse.egit.ui.internal.decorators.DecoratableResourceMappingTest
21:00:41 [2020-08-28T01:00:41.536Z] testAnyConflictsIsConflicts(org.eclipse.egit.ui.internal.decorators.DecoratableResourceMappingTest)  Time elapsed: 1.012 s
21:00:41 [2020-08-28T01:00:41.536Z] testSameStagingStateIsState_Added(org.eclipse.egit.ui.internal.decorators.DecoratableResourceMappingTest)  Time elapsed: 0.89 s
21:00:41 [2020-08-28T01:00:41.536Z] testAnyDirtyIsDirty(org.eclipse.egit.ui.internal.decorators.DecoratableResourceMappingTest)  Time elapsed: 0.801 s
21:00:41 [2020-08-28T01:00:41.536Z] testMixedStagingStateIsModified_RemovedAdded(org.eclipse.egit.ui.internal.decorators.DecoratableResourceMappingTest)  Time elapsed: 0.84 s
21:00:41 [2020-08-28T01:00:41.536Z] testAllIgnoredIsUnstaged(org.eclipse.egit.ui.internal.decorators.DecoratableResourceMappingTest)  Time elapsed: 0.788 s
21:00:41 [2020-08-28T01:00:41.536Z] testDecorationConflictingOverDirty(org.eclipse.egit.ui.internal.decorators.DecoratableResourceMappingTest)  Time elapsed: 1.214 s
21:00:41 [2020-08-28T01:00:41.536Z] testMixedStagingStateIsModified_AddedNotStaged(org.eclipse.egit.ui.internal.decorators.DecoratableResourceMappingTest)  Time elapsed: 0.793 s
21:00:41 [2020-08-28T01:00:41.536Z] testNewResourceMappingIsUnstaged(org.eclipse.egit.ui.internal.decorators.DecoratableResourceMappingTest)  Time elapsed: 0.795 s
21:00:41 [2020-08-28T01:00:41.536Z] testAnyTrackedIsTracked(org.eclipse.egit.ui.internal.decorators.DecoratableResourceMappingTest)  Time elapsed: 0.803 s
21:00:41 [2020-08-28T01:00:41.536Z] Running org.eclipse.egit.ui.internal.fetch.FetchGerritChangeTest
21:00:41 [2020-08-28T01:00:41.536Z] Tests run: 15, Failures: 0, Errors: 0, Skipped: 0, Time elapsed: 0.004 s - in org.eclipse.egit.ui.internal.fetch.FetchGerritChangeTest
21:00:41 [2020-08-28T01:00:41.536Z] testChangeStringNoDigits(org.eclipse.egit.ui.internal.fetch.FetchGerritChangeTest)  Time elapsed: 0.002 s
21:00:41 [2020-08-28T01:00:41.536Z] testChangeStringOverflow(org.eclipse.egit.ui.internal.fetch.FetchGerritChangeTest)  Time elapsed: 0 s
21:00:41 [2020-08-28T01:00:41.536Z] testChangeStringTwoNumbers(org.eclipse.egit.ui.internal.fetch.FetchGerritChangeTest)  Time elapsed: 0.001 s
21:00:41 [2020-08-28T01:00:41.536Z] testFromRef(org.eclipse.egit.ui.internal.fetch.FetchGerritChangeTest)  Time elapsed: 0 s
21:00:41 [2020-08-28T01:00:41.536Z] testChangeStringNegative(org.eclipse.egit.ui.internal.fetch.FetchGerritChangeTest)  Time elapsed: 0 s
21:00:41 [2020-08-28T01:00:41.536Z] testChangeStringUri(org.eclipse.egit.ui.internal.fetch.FetchGerritChangeTest)  Time elapsed: 0 s
21:00:41 [2020-08-28T01:00:41.536Z] testRefFromChange(org.eclipse.egit.ui.internal.fetch.FetchGerritChangeTest)  Time elapsed: 0 s
21:00:41 [2020-08-28T01:00:41.536Z] testChangeStringUriNonsense(org.eclipse.egit.ui.internal.fetch.FetchGerritChangeTest)  Time elapsed: 0 s
21:00:41 [2020-08-28T01:00:41.536Z] testChangeStringThreeNumbers(org.eclipse.egit.ui.internal.fetch.FetchGerritChangeTest)  Time elapsed: 0 s
21:00:41 [2020-08-28T01:00:41.536Z] testChangeStringMultiline(org.eclipse.egit.ui.internal.fetch.FetchGerritChangeTest)  Time elapsed: 0 s
21:00:41 [2020-08-28T01:00:41.536Z] testChangeStringSingleNumber(org.eclipse.egit.ui.internal.fetch.FetchGerritChangeTest)  Time elapsed: 0 s
21:00:41 [2020-08-28T01:00:41.536Z] testChangeRefs(org.eclipse.egit.ui.internal.fetch.FetchGerritChangeTest)  Time elapsed: 0 s
21:00:41 [2020-08-28T01:00:41.536Z] testChangeStringEmpty(org.eclipse.egit.ui.internal.fetch.FetchGerritChangeTest)  Time elapsed: 0.001 s
21:00:41 [2020-08-28T01:00:41.536Z] testChangeStringNull(org.eclipse.egit.ui.internal.fetch.FetchGerritChangeTest)  Time elapsed: 0 s
21:00:41 [2020-08-28T01:00:41.536Z] testChangeStringZero(org.eclipse.egit.ui.internal.fetch.FetchGerritChangeTest)  Time elapsed: 0 s
21:00:41 [2020-08-28T01:00:41.536Z] Running org.eclipse.egit.ui.submodule.SubmoduleUpdateTest
21:00:41 [2020-08-28T01:00:41.536Z] 
21:00:41 [2020-08-28T01:00:41.536Z] (SWT:1591): Gtk-WARNING **: 01:00:41.465: Negative content width -6 (allocation 1, extents 4x3) while allocating gadget (node toolbar, owner GtkToolbar)
21:00:44 [2020-08-28T01:00:44.095Z] 
21:00:44 [2020-08-28T01:00:44.095Z] (SWT:1591): Gtk-WARNING **: 01:00:43.968: Negative content width -6 (allocation 1, extents 4x3) while allocating gadget (node toolbar, owner GtkToolbar)
21:00:44 [2020-08-28T01:00:44.095Z] Tests run: 1, Failures: 0, Errors: 0, Skipped: 0, Time elapsed: 3.339 s - in org.eclipse.egit.ui.submodule.SubmoduleUpdateTest
21:00:44 [2020-08-28T01:00:44.095Z] updateSubmodule(org.eclipse.egit.ui.submodule.SubmoduleUpdateTest)  Time elapsed: 3.335 s
21:00:44 [2020-08-28T01:00:44.095Z] Running org.eclipse.egit.ui.submodule.SubmoduleAddTest
21:00:45 [2020-08-28T01:00:45.026Z] 
21:00:45 [2020-08-28T01:00:45.026Z] (SWT:1591): Gtk-WARNING **: 01:00:44.822: Negative content width -6 (allocation 1, extents 4x3) while allocating gadget (node toolbar, owner GtkToolbar)
21:00:47 [2020-08-28T01:00:47.553Z] 
21:00:47 [2020-08-28T01:00:47.553Z] (SWT:1591): Gtk-WARNING **: 01:00:47.101: Negative content width -6 (allocation 1, extents 4x3) while allocating gadget (node toolbar, owner GtkToolbar)
21:00:47 [2020-08-28T01:00:47.553Z] Tests run: 1, Failures: 0, Errors: 0, Skipped: 0, Time elapsed: 3.129 s - in org.eclipse.egit.ui.submodule.SubmoduleAddTest
21:00:47 [2020-08-28T01:00:47.553Z] addAtRoot(org.eclipse.egit.ui.submodule.SubmoduleAddTest)  Time elapsed: 3.125 s
21:00:47 [2020-08-28T01:00:47.553Z] Running org.eclipse.egit.ui.submodule.SubmoduleSyncTest
21:00:48 [2020-08-28T01:00:48.118Z] 
21:00:48 [2020-08-28T01:00:48.118Z] (SWT:1591): Gtk-WARNING **: 01:00:48.057: Negative content width -6 (allocation 1, extents 4x3) while allocating gadget (node toolbar, owner GtkToolbar)
21:00:50 [2020-08-28T01:00:50.646Z] 
21:00:50 [2020-08-28T01:00:50.646Z] (SWT:1591): Gtk-WARNING **: 01:00:50.630: Negative content width -6 (allocation 1, extents 4x3) while allocating gadget (node toolbar, owner GtkToolbar)
21:00:50 [2020-08-28T01:00:50.903Z] Tests run: 1, Failures: 0, Errors: 0, Skipped: 0, Time elapsed: 3.527 s - in org.eclipse.egit.ui.submodule.SubmoduleSyncTest
21:00:50 [2020-08-28T01:00:50.903Z] syncSubmodule(org.eclipse.egit.ui.submodule.SubmoduleSyncTest)  Time elapsed: 3.523 s
21:00:50 [2020-08-28T01:00:50.903Z] Running org.eclipse.egit.ui.httpauth.PushTest
21:00:50 [2020-08-28T01:00:50.903Z] 2020-08-28 01:00:50.805:INFO:oejs.Server:WorkbenchTestable: jetty-9.4.30.v20200611; built: 2020-06-16T05:54:33.713Z; git: 271836e4c1f4612f12b7bb13ef5a92a927634b0d; jvm 1.8.0_262-b10
21:00:50 [2020-08-28T01:00:50.903Z] 2020-08-28 01:00:50.806:INFO:oejsh.ContextHandler:WorkbenchTestable: Started o.e.j.s.ServletContextHandler@778e5a36{/sbasic,null,AVAILABLE}
21:00:50 [2020-08-28T01:00:50.903Z] 2020-08-28 01:00:50.812:INFO:oejs.AbstractConnector:WorkbenchTestable: Started ServerConnector@5e29253{HTTP/1.1, (http/1.1)}{127.0.0.1:34250}
21:00:50 [2020-08-28T01:00:50.903Z] 2020-08-28 01:00:50.812:INFO:oejs.Server:WorkbenchTestable: Started @728053ms
21:00:51 [2020-08-28T01:00:51.836Z] 
21:00:51 [2020-08-28T01:00:51.836Z] (SWT:1591): Gtk-CRITICAL **: 01:00:51.585: gtk_box_gadget_distribute: assertion 'size >= 0' failed in GtkCheckButton
21:00:52 [2020-08-28T01:00:52.770Z] 2020-08-28 01:00:52.448:INFO:oejs.AbstractConnector:WorkbenchTestable: Stopped ServerConnector@5e29253{HTTP/1.1, (http/1.1)}{127.0.0.1:0}
21:00:52 [2020-08-28T01:00:52.770Z] 2020-08-28 01:00:52.448:INFO:oejsh.ContextHandler:WorkbenchTestable: Stopped o.e.j.s.ServletContextHandler@778e5a36{/sbasic,null,UNAVAILABLE}
21:00:52 [2020-08-28T01:00:52.770Z] Tests run: 1, Failures: 0, Errors: 0, Skipped: 0, Time elapsed: 1.718 s - in org.eclipse.egit.ui.httpauth.PushTest
21:00:52 [2020-08-28T01:00:52.770Z] testPush(org.eclipse.egit.ui.httpauth.PushTest)  Time elapsed: 1.718 s
21:00:52 [2020-08-28T01:00:52.770Z] Running org.eclipse.egit.ui.search.CommitSearchDialogTest
21:00:53 [2020-08-28T01:00:53.336Z] 
21:00:53 [2020-08-28T01:00:53.336Z] (SWT:1591): Gtk-WARNING **: 01:00:53.137: Negative content width -6 (allocation 1, extents 4x3) while allocating gadget (node toolbar, owner GtkToolbar)
21:00:53 [2020-08-28T01:00:53.336Z] 
21:00:53 [2020-08-28T01:00:53.336Z] (SWT:1591): Gtk-WARNING **: 01:00:53.149: Negative content width -6 (allocation 1, extents 4x3) while allocating gadget (node toolbar, owner GtkToolbar)
21:00:53 [2020-08-28T01:00:53.336Z] 
21:00:53 [2020-08-28T01:00:53.336Z] (SWT:1591): Gtk-WARNING **: 01:00:53.205: Negative content width -6 (allocation 1, extents 4x3) while allocating gadget (node toolbar, owner GtkToolbar)
21:00:53 [2020-08-28T01:00:53.336Z] 
21:00:53 [2020-08-28T01:00:53.336Z] (SWT:1591): Gtk-WARNING **: 01:00:53.265: Negative content width -6 (allocation 1, extents 4x3) while allocating gadget (node toolbar, owner GtkToolbar)
21:00:54 [2020-08-28T01:00:54.267Z] 
21:00:54 [2020-08-28T01:00:54.267Z] (SWT:1591): Gtk-WARNING **: 01:00:53.907: Negative content width -6 (allocation 1, extents 4x3) while allocating gadget (node toolbar, owner GtkToolbar)
21:00:54 [2020-08-28T01:00:54.267Z] Tests run: 1, Failures: 0, Errors: 0, Skipped: 0, Time elapsed: 1.561 s - in org.eclipse.egit.ui.search.CommitSearchDialogTest
21:00:54 [2020-08-28T01:00:54.267Z] openCommitTabOnSearchDialog(org.eclipse.egit.ui.search.CommitSearchDialogTest)  Time elapsed: 1.558 s
21:00:54 [2020-08-28T01:00:54.267Z] Running org.eclipse.egit.ui.search.CommitSearchQueryTest
21:00:58 [2020-08-28T01:00:58.446Z] Tests run: 7, Failures: 0, Errors: 0, Skipped: 0, Time elapsed: 4.243 s - in org.eclipse.egit.ui.search.CommitSearchQueryTest
21:00:58 [2020-08-28T01:00:58.446Z] testQuery(org.eclipse.egit.ui.search.CommitSearchQueryTest)  Time elapsed: 0.643 s
21:00:58 [2020-08-28T01:00:58.446Z] testMatchMessage(org.eclipse.egit.ui.search.CommitSearchQueryTest)  Time elapsed: 0.59 s
21:00:58 [2020-08-28T01:00:58.446Z] testCaseInsensitive(org.eclipse.egit.ui.search.CommitSearchQueryTest)  Time elapsed: 0.601 s
21:00:58 [2020-08-28T01:00:58.446Z] testMatchCommit(org.eclipse.egit.ui.search.CommitSearchQueryTest)  Time elapsed: 0.597 s
21:00:58 [2020-08-28T01:00:58.446Z] testMatchParent(org.eclipse.egit.ui.search.CommitSearchQueryTest)  Time elapsed: 0.589 s
21:00:58 [2020-08-28T01:00:58.446Z] testMatchTree(org.eclipse.egit.ui.search.CommitSearchQueryTest)  Time elapsed: 0.619 s
21:00:58 [2020-08-28T01:00:58.446Z] testEmptyMatches(org.eclipse.egit.ui.search.CommitSearchQueryTest)  Time elapsed: 0.589 s
21:00:58 [2020-08-28T01:00:58.446Z] Running org.eclipse.egit.ui.gitflow.CommandEnablementTest
21:00:59 [2020-08-28T01:00:59.816Z] 
21:00:59 [2020-08-28T01:00:59.816Z] (SWT:1591): Gtk-WARNING **: 01:00:59.596: Negative content width -6 (allocation 1, extents 4x3) while allocating gadget (node toolbar, owner GtkToolbar)
21:00:59 [2020-08-28T01:00:59.816Z] 
21:00:59 [2020-08-28T01:00:59.816Z] (SWT:1591): Gtk-WARNING **: 01:00:59.753: Negative content width -6 (allocation 1, extents 4x3) while allocating gadget (node toolbar, owner GtkToolbar)
21:01:00 [2020-08-28T01:01:00.391Z] Tests run: 2, Failures: 0, Errors: 0, Skipped: 0, Time elapsed: 1.849 s - in org.eclipse.egit.ui.gitflow.CommandEnablementTest
21:01:00 [2020-08-28T01:01:00.391Z] testPackageExplorerStartFinishEnablement(org.eclipse.egit.ui.gitflow.CommandEnablementTest)  Time elapsed: 0.734 s
21:01:00 [2020-08-28T01:01:00.391Z] testRepositoryViewStartFinishEnablement(org.eclipse.egit.ui.gitflow.CommandEnablementTest)  Time elapsed: 1.111 s
21:01:00 [2020-08-28T01:01:00.391Z] Running org.eclipse.egit.ui.gitflow.FeatureFinishSquashHandlerTest
21:01:00 [2020-08-28T01:01:00.955Z] 
21:01:00 [2020-08-28T01:01:00.955Z] (SWT:1591): Gtk-CRITICAL **: 01:01:00.819: gtk_box_gadget_distribute: assertion 'size >= 0' failed in GtkScrollbar
21:01:00 [2020-08-28T01:01:00.955Z] 
21:01:00 [2020-08-28T01:01:00.955Z] (SWT:1591): Gtk-CRITICAL **: 01:01:00.839: gtk_box_gadget_distribute: assertion 'size >= 0' failed in GtkScrollbar
21:01:00 [2020-08-28T01:01:00.955Z] 
21:01:00 [2020-08-28T01:01:00.955Z] (SWT:1591): Gtk-CRITICAL **: 01:01:00.854: gtk_box_gadget_distribute: assertion 'size >= 0' failed in GtkScrollbar
21:01:00 [2020-08-28T01:01:00.955Z] 
21:01:00 [2020-08-28T01:01:00.955Z] (SWT:1591): Gtk-CRITICAL **: 01:01:00.872: gtk_box_gadget_distribute: assertion 'size >= 0' failed in GtkScrollbar
21:01:00 [2020-08-28T01:01:00.955Z] 
21:01:00 [2020-08-28T01:01:00.955Z] (SWT:1591): Gtk-CRITICAL **: 01:01:00.888: gtk_box_gadget_distribute: assertion 'size >= 0' failed in GtkScrollbar
21:01:00 [2020-08-28T01:01:00.955Z] 
21:01:00 [2020-08-28T01:01:00.955Z] (SWT:1591): Gtk-CRITICAL **: 01:01:00.905: gtk_box_gadget_distribute: assertion 'size >= 0' failed in GtkScrollbar
21:01:00 [2020-08-28T01:01:00.955Z] 
21:01:00 [2020-08-28T01:01:00.955Z] (SWT:1591): Gtk-CRITICAL **: 01:01:00.922: gtk_box_gadget_distribute: assertion 'size >= 0' failed in GtkScrollbar
21:01:00 [2020-08-28T01:01:00.955Z] 
21:01:00 [2020-08-28T01:01:00.955Z] (SWT:1591): Gtk-CRITICAL **: 01:01:00.938: gtk_box_gadget_distribute: assertion 'size >= 0' failed in GtkScrollbar
21:01:01 [2020-08-28T01:01:01.212Z] 
21:01:01 [2020-08-28T01:01:01.212Z] (SWT:1591): Gtk-CRITICAL **: 01:01:00.955: gtk_box_gadget_distribute: assertion 'size >= 0' failed in GtkScrollbar
21:01:01 [2020-08-28T01:01:01.212Z] 
21:01:01 [2020-08-28T01:01:01.212Z] (SWT:1591): Gtk-CRITICAL **: 01:01:00.972: gtk_box_gadget_distribute: assertion 'size >= 0' failed in GtkScrollbar
21:01:01 [2020-08-28T01:01:01.212Z] 
21:01:01 [2020-08-28T01:01:01.212Z] (SWT:1591): Gtk-CRITICAL **: 01:01:00.988: gtk_box_gadget_distribute: assertion 'size >= 0' failed in GtkScrollbar
21:01:01 [2020-08-28T01:01:01.212Z] 
21:01:01 [2020-08-28T01:01:01.212Z] (SWT:1591): Gtk-CRITICAL **: 01:01:01.005: gtk_box_gadget_distribute: assertion 'size >= 0' failed in GtkScrollbar
21:01:01 [2020-08-28T01:01:01.212Z] 
21:01:01 [2020-08-28T01:01:01.212Z] (SWT:1591): Gtk-CRITICAL **: 01:01:01.022: gtk_box_gadget_distribute: assertion 'size >= 0' failed in GtkScrollbar
21:01:01 [2020-08-28T01:01:01.212Z] 
21:01:01 [2020-08-28T01:01:01.212Z] (SWT:1591): Gtk-CRITICAL **: 01:01:01.038: gtk_box_gadget_distribute: assertion 'size >= 0' failed in GtkScrollbar
21:01:01 [2020-08-28T01:01:01.212Z] 
21:01:01 [2020-08-28T01:01:01.212Z] (SWT:1591): Gtk-CRITICAL **: 01:01:01.054: gtk_box_gadget_distribute: assertion 'size >= 0' failed in GtkScrollbar
21:01:01 [2020-08-28T01:01:01.212Z] 
21:01:01 [2020-08-28T01:01:01.212Z] (SWT:1591): Gtk-CRITICAL **: 01:01:01.071: gtk_box_gadget_distribute: assertion 'size >= 0' failed in GtkScrollbar
21:01:01 [2020-08-28T01:01:01.776Z] 
21:01:01 [2020-08-28T01:01:01.776Z] (SWT:1591): Gtk-CRITICAL **: 01:01:01.582: gtk_box_gadget_distribute: assertion 'size >= 0' failed in GtkScrollbar
21:01:02 [2020-08-28T01:01:02.342Z] Tests run: 1, Failures: 0, Errors: 0, Skipped: 0, Time elapsed: 2.099 s - in org.eclipse.egit.ui.gitflow.FeatureFinishSquashHandlerTest
21:01:02 [2020-08-28T01:01:02.342Z] testFeatureFinishSquash(org.eclipse.egit.ui.gitflow.FeatureFinishSquashHandlerTest)  Time elapsed: 2.096 s
21:01:02 [2020-08-28T01:01:02.342Z] Running org.eclipse.egit.ui.gitflow.FeatureStartFinishHandlerTest
21:01:03 [2020-08-28T01:01:03.274Z] 
21:01:03 [2020-08-28T01:01:03.274Z] (SWT:1591): Gtk-CRITICAL **: 01:01:03.036: gtk_box_gadget_distribute: assertion 'size >= 0' failed in GtkScrollbar
21:01:03 [2020-08-28T01:01:03.274Z] 
21:01:03 [2020-08-28T01:01:03.274Z] (SWT:1591): Gtk-CRITICAL **: 01:01:03.056: gtk_box_gadget_distribute: assertion 'size >= 0' failed in GtkScrollbar
21:01:03 [2020-08-28T01:01:03.274Z] 
21:01:03 [2020-08-28T01:01:03.274Z] (SWT:1591): Gtk-CRITICAL **: 01:01:03.073: gtk_box_gadget_distribute: assertion 'size >= 0' failed in GtkScrollbar
21:01:03 [2020-08-28T01:01:03.274Z] 
21:01:03 [2020-08-28T01:01:03.274Z] (SWT:1591): Gtk-CRITICAL **: 01:01:03.088: gtk_box_gadget_distribute: assertion 'size >= 0' failed in GtkScrollbar
21:01:03 [2020-08-28T01:01:03.274Z] 
21:01:03 [2020-08-28T01:01:03.274Z] (SWT:1591): Gtk-CRITICAL **: 01:01:03.105: gtk_box_gadget_distribute: assertion 'size >= 0' failed in GtkScrollbar
21:01:03 [2020-08-28T01:01:03.274Z] 
21:01:03 [2020-08-28T01:01:03.274Z] (SWT:1591): Gtk-CRITICAL **: 01:01:03.122: gtk_box_gadget_distribute: assertion 'size >= 0' failed in GtkScrollbar
21:01:03 [2020-08-28T01:01:03.274Z] 
21:01:03 [2020-08-28T01:01:03.274Z] (SWT:1591): Gtk-CRITICAL **: 01:01:03.138: gtk_box_gadget_distribute: assertion 'size >= 0' failed in GtkScrollbar
21:01:03 [2020-08-28T01:01:03.274Z] 
21:01:03 [2020-08-28T01:01:03.274Z] (SWT:1591): Gtk-CRITICAL **: 01:01:03.155: gtk_box_gadget_distribute: assertion 'size >= 0' failed in GtkScrollbar
21:01:03 [2020-08-28T01:01:03.274Z] 
21:01:03 [2020-08-28T01:01:03.274Z] (SWT:1591): Gtk-CRITICAL **: 01:01:03.171: gtk_box_gadget_distribute: assertion 'size >= 0' failed in GtkScrollbar
21:01:03 [2020-08-28T01:01:03.274Z] 
21:01:03 [2020-08-28T01:01:03.274Z] (SWT:1591): Gtk-CRITICAL **: 01:01:03.189: gtk_box_gadget_distribute: assertion 'size >= 0' failed in GtkScrollbar
21:01:03 [2020-08-28T01:01:03.274Z] 
21:01:03 [2020-08-28T01:01:03.274Z] (SWT:1591): Gtk-CRITICAL **: 01:01:03.205: gtk_box_gadget_distribute: assertion 'size >= 0' failed in GtkScrollbar
21:01:03 [2020-08-28T01:01:03.274Z] 
21:01:03 [2020-08-28T01:01:03.274Z] (SWT:1591): Gtk-CRITICAL **: 01:01:03.222: gtk_box_gadget_distribute: assertion 'size >= 0' failed in GtkScrollbar
21:01:03 [2020-08-28T01:01:03.274Z] 
21:01:03 [2020-08-28T01:01:03.274Z] (SWT:1591): Gtk-CRITICAL **: 01:01:03.238: gtk_box_gadget_distribute: assertion 'size >= 0' failed in GtkScrollbar
21:01:03 [2020-08-28T01:01:03.274Z] 
21:01:03 [2020-08-28T01:01:03.274Z] (SWT:1591): Gtk-CRITICAL **: 01:01:03.255: gtk_box_gadget_distribute: assertion 'size >= 0' failed in GtkScrollbar
21:01:03 [2020-08-28T01:01:03.274Z] 
21:01:03 [2020-08-28T01:01:03.274Z] (SWT:1591): Gtk-CRITICAL **: 01:01:03.271: gtk_box_gadget_distribute: assertion 'size >= 0' failed in GtkScrollbar
21:01:03 [2020-08-28T01:01:03.839Z] 
21:01:03 [2020-08-28T01:01:03.839Z] (SWT:1591): Gtk-CRITICAL **: 01:01:03.796: gtk_box_gadget_distribute: assertion 'size >= 0' failed in GtkScrollbar
21:01:04 [2020-08-28T01:01:04.409Z] Tests run: 1, Failures: 0, Errors: 0, Skipped: 0, Time elapsed: 2.141 s - in org.eclipse.egit.ui.gitflow.FeatureStartFinishHandlerTest
21:01:04 [2020-08-28T01:01:04.409Z] testFeatureStart(org.eclipse.egit.ui.gitflow.FeatureStartFinishHandlerTest)  Time elapsed: 2.138 s
21:01:04 [2020-08-28T01:01:04.409Z] Running org.eclipse.egit.ui.gitflow.FeatureFinishKeepBranchHandlerTest
21:01:05 [2020-08-28T01:01:05.342Z] 
21:01:05 [2020-08-28T01:01:05.342Z] (SWT:1591): Gtk-CRITICAL **: 01:01:05.020: gtk_box_gadget_distribute: assertion 'size >= 0' failed in GtkScrollbar
21:01:05 [2020-08-28T01:01:05.342Z] 
21:01:05 [2020-08-28T01:01:05.342Z] (SWT:1591): Gtk-CRITICAL **: 01:01:05.041: gtk_box_gadget_distribute: assertion 'size >= 0' failed in GtkScrollbar
21:01:05 [2020-08-28T01:01:05.342Z] 
21:01:05 [2020-08-28T01:01:05.342Z] (SWT:1591): Gtk-CRITICAL **: 01:01:05.055: gtk_box_gadget_distribute: assertion 'size >= 0' failed in GtkScrollbar
21:01:05 [2020-08-28T01:01:05.342Z] 
21:01:05 [2020-08-28T01:01:05.342Z] (SWT:1591): Gtk-CRITICAL **: 01:01:05.071: gtk_box_gadget_distribute: assertion 'size >= 0' failed in GtkScrollbar
21:01:05 [2020-08-28T01:01:05.342Z] 
21:01:05 [2020-08-28T01:01:05.342Z] (SWT:1591): Gtk-CRITICAL **: 01:01:05.089: gtk_box_gadget_distribute: assertion 'size >= 0' failed in GtkScrollbar
21:01:05 [2020-08-28T01:01:05.342Z] 
21:01:05 [2020-08-28T01:01:05.342Z] (SWT:1591): Gtk-CRITICAL **: 01:01:05.105: gtk_box_gadget_distribute: assertion 'size >= 0' failed in GtkScrollbar
21:01:05 [2020-08-28T01:01:05.342Z] 
21:01:05 [2020-08-28T01:01:05.342Z] (SWT:1591): Gtk-CRITICAL **: 01:01:05.121: gtk_box_gadget_distribute: assertion 'size >= 0' failed in GtkScrollbar
21:01:05 [2020-08-28T01:01:05.342Z] 
21:01:05 [2020-08-28T01:01:05.342Z] (SWT:1591): Gtk-CRITICAL **: 01:01:05.139: gtk_box_gadget_distribute: assertion 'size >= 0' failed in GtkScrollbar
21:01:05 [2020-08-28T01:01:05.342Z] 
21:01:05 [2020-08-28T01:01:05.342Z] (SWT:1591): Gtk-CRITICAL **: 01:01:05.155: gtk_box_gadget_distribute: assertion 'size >= 0' failed in GtkScrollbar
21:01:05 [2020-08-28T01:01:05.342Z] 
21:01:05 [2020-08-28T01:01:05.342Z] (SWT:1591): Gtk-CRITICAL **: 01:01:05.172: gtk_box_gadget_distribute: assertion 'size >= 0' failed in GtkScrollbar
21:01:05 [2020-08-28T01:01:05.342Z] 
21:01:05 [2020-08-28T01:01:05.342Z] (SWT:1591): Gtk-CRITICAL **: 01:01:05.189: gtk_box_gadget_distribute: assertion 'size >= 0' failed in GtkScrollbar
21:01:05 [2020-08-28T01:01:05.342Z] 
21:01:05 [2020-08-28T01:01:05.342Z] (SWT:1591): Gtk-CRITICAL **: 01:01:05.205: gtk_box_gadget_distribute: assertion 'size >= 0' failed in GtkScrollbar
21:01:05 [2020-08-28T01:01:05.342Z] 
21:01:05 [2020-08-28T01:01:05.342Z] (SWT:1591): Gtk-CRITICAL **: 01:01:05.221: gtk_box_gadget_distribute: assertion 'size >= 0' failed in GtkScrollbar
21:01:05 [2020-08-28T01:01:05.342Z] 
21:01:05 [2020-08-28T01:01:05.342Z] (SWT:1591): Gtk-CRITICAL **: 01:01:05.238: gtk_box_gadget_distribute: assertion 'size >= 0' failed in GtkScrollbar
21:01:05 [2020-08-28T01:01:05.907Z] 
21:01:05 [2020-08-28T01:01:05.907Z] (SWT:1591): Gtk-CRITICAL **: 01:01:05.781: gtk_box_gadget_distribute: assertion 'size >= 0' failed in GtkScrollbar
21:01:06 [2020-08-28T01:01:06.491Z] Tests run: 1, Failures: 0, Errors: 0, Skipped: 0, Time elapsed: 2.011 s - in org.eclipse.egit.ui.gitflow.FeatureFinishKeepBranchHandlerTest
21:01:06 [2020-08-28T01:01:06.491Z] testFeatureFinishKeepBranch(org.eclipse.egit.ui.gitflow.FeatureFinishKeepBranchHandlerTest)  Time elapsed: 1.985 s
21:01:06 [2020-08-28T01:01:06.491Z] Running org.eclipse.egit.ui.gitflow.FeatureRebaseHandlerTest
21:01:07 [2020-08-28T01:01:07.425Z] 
21:01:07 [2020-08-28T01:01:07.425Z] (SWT:1591): Gtk-WARNING **: 01:01:07.187: Negative content width -6 (allocation 1, extents 4x3) while allocating gadget (node toolbar, owner GtkToolbar)
21:01:07 [2020-08-28T01:01:07.425Z] 
21:01:07 [2020-08-28T01:01:07.425Z] (SWT:1591): Gtk-WARNING **: 01:01:07.192: Negative content width -6 (allocation 1, extents 4x3) while allocating gadget (node toolbar, owner GtkToolbar)
21:01:07 [2020-08-28T01:01:07.425Z] 
21:01:07 [2020-08-28T01:01:07.425Z] (SWT:1591): Gtk-WARNING **: 01:01:07.196: Negative content width -6 (allocation 1, extents 4x3) while allocating gadget (node toolbar, owner GtkToolbar)
21:01:07 [2020-08-28T01:01:07.425Z] 
21:01:07 [2020-08-28T01:01:07.425Z] (SWT:1591): Gtk-WARNING **: 01:01:07.197: Negative content width -6 (allocation 1, extents 4x3) while allocating gadget (node toolbar, owner GtkToolbar)
21:01:07 [2020-08-28T01:01:07.425Z] 
21:01:07 [2020-08-28T01:01:07.425Z] (SWT:1591): Gtk-WARNING **: 01:01:07.197: Negative content width -6 (allocation 1, extents 4x3) while allocating gadget (node toolbar, owner GtkToolbar)
21:01:07 [2020-08-28T01:01:07.425Z] 
21:01:07 [2020-08-28T01:01:07.425Z] (SWT:1591): Gtk-WARNING **: 01:01:07.227: Negative content width -6 (allocation 1, extents 4x3) while allocating gadget (node toolbar, owner GtkToolbar)
21:01:07 [2020-08-28T01:01:07.682Z] 
21:01:07 [2020-08-28T01:01:07.682Z] (SWT:1591): Gtk-WARNING **: 01:01:07.663: Negative content height -1 (allocation 1, extents 1x1) while allocating gadget (node scrolledwindow, owner GtkScrolledWindow)
21:01:07 [2020-08-28T01:01:07.682Z] 
21:01:07 [2020-08-28T01:01:07.682Z] (SWT:1591): Gtk-CRITICAL **: 01:01:07.663: gtk_box_gadget_distribute: assertion 'size >= 0' failed in GtkScrollbar
21:01:07 [2020-08-28T01:01:07.939Z] 
21:01:07 [2020-08-28T01:01:07.939Z] (SWT:1591): Gtk-WARNING **: 01:01:07.728: Negative content width -6 (allocation 1, extents 4x3) while allocating gadget (node toolbar, owner GtkToolbar)
21:01:09 [2020-08-28T01:01:09.311Z] 
21:01:09 [2020-08-28T01:01:09.311Z] (SWT:1591): Gtk-WARNING **: 01:01:09.080: Negative content height -1 (allocation 1, extents 1x1) while allocating gadget (node scrolledwindow, owner GtkScrolledWindow)
21:01:09 [2020-08-28T01:01:09.311Z] 
21:01:09 [2020-08-28T01:01:09.311Z] (SWT:1591): Gtk-CRITICAL **: 01:01:09.080: gtk_box_gadget_distribute: assertion 'size >= 0' failed in GtkScrollbar
21:01:09 [2020-08-28T01:01:09.311Z] Tests run: 2, Failures: 0, Errors: 0, Skipped: 0, Time elapsed: 2.838 s - in org.eclipse.egit.ui.gitflow.FeatureRebaseHandlerTest
21:01:09 [2020-08-28T01:01:09.311Z] testRebaseFailOnConflict(org.eclipse.egit.ui.gitflow.FeatureRebaseHandlerTest)  Time elapsed: 1.44 s
21:01:09 [2020-08-28T01:01:09.311Z] testRebaseFailOnDirtyWorkingDirectory(org.eclipse.egit.ui.gitflow.FeatureRebaseHandlerTest)  Time elapsed: 1.389 s
21:01:09 [2020-08-28T01:01:09.311Z] Running org.eclipse.egit.ui.gitflow.InitHandlerTest
21:01:14 [2020-08-28T01:01:14.574Z] Tests run: 3, Failures: 0, Errors: 0, Skipped: 0, Time elapsed: 4.313 s - in org.eclipse.egit.ui.gitflow.InitHandlerTest
21:01:14 [2020-08-28T01:01:14.574Z] testInit(org.eclipse.egit.ui.gitflow.InitHandlerTest)  Time elapsed: 1.267 s
21:01:14 [2020-08-28T01:01:14.574Z] testInitEmptyRepoMissingMaster(org.eclipse.egit.ui.gitflow.InitHandlerTest)  Time elapsed: 1.793 s
21:01:14 [2020-08-28T01:01:14.574Z] testInitMissingMaster(org.eclipse.egit.ui.gitflow.InitHandlerTest)  Time elapsed: 1.246 s
21:01:14 [2020-08-28T01:01:14.574Z] Running org.eclipse.egit.ui.gitflow.FeatureStartCheckoutConflictTest
21:01:14 [2020-08-28T01:01:14.574Z] 
21:01:14 [2020-08-28T01:01:14.574Z] (SWT:1591): Gtk-CRITICAL **: 01:01:14.194: gtk_box_gadget_distribute: assertion 'size >= 0' failed in GtkScrollbar
21:01:14 [2020-08-28T01:01:14.574Z] 
21:01:14 [2020-08-28T01:01:14.574Z] (SWT:1591): Gtk-CRITICAL **: 01:01:14.205: gtk_box_gadget_distribute: assertion 'size >= 0' failed in GtkScrollbar
21:01:14 [2020-08-28T01:01:14.574Z] Tests run: 1, Failures: 0, Errors: 0, Skipped: 0, Time elapsed: 0.811 s - in org.eclipse.egit.ui.gitflow.FeatureStartCheckoutConflictTest
21:01:14 [2020-08-28T01:01:14.574Z] testFeatureStart(org.eclipse.egit.ui.gitflow.FeatureStartCheckoutConflictTest)  Time elapsed: 0.807 s
21:01:14 [2020-08-28T01:01:14.574Z] Running org.eclipse.egit.ui.variables.DynamicVariablesTest
21:01:18 [2020-08-28T01:01:18.758Z] Tests run: 4, Failures: 0, Errors: 0, Skipped: 0, Time elapsed: 4.246 s - in org.eclipse.egit.ui.variables.DynamicVariablesTest
21:01:18 [2020-08-28T01:01:18.758Z] testGitBranch(org.eclipse.egit.ui.variables.DynamicVariablesTest)  Time elapsed: 1.074 s
21:01:18 [2020-08-28T01:01:18.758Z] testGitPath(org.eclipse.egit.ui.variables.DynamicVariablesTest)  Time elapsed: 1.062 s
21:01:18 [2020-08-28T01:01:18.758Z] testGitWorkTree(org.eclipse.egit.ui.variables.DynamicVariablesTest)  Time elapsed: 1.058 s
21:01:18 [2020-08-28T01:01:18.758Z] testGitDir(org.eclipse.egit.ui.variables.DynamicVariablesTest)  Time elapsed: 1.052 s
21:01:18 [2020-08-28T01:01:18.758Z] Running org.eclipse.egit.ui.prefpages.configuration.GlobalConfigurationPageTest
21:01:18 [2020-08-28T01:01:18.758Z] 
21:01:18 [2020-08-28T01:01:18.758Z] !ENTRY org.eclipse.ui 2 2 2020-08-28 01:01:18.629
21:01:18 [2020-08-28T01:01:18.758Z] !MESSAGE Invalid preference category path: org.eclipse.ui.net.NetPreferences (bundle: org.eclipse.jsch.ui, page: org.eclipse.jsch.ui.SSHPreferences)
21:01:18 [2020-08-28T01:01:18.758Z] 
21:01:18 [2020-08-28T01:01:18.758Z] (SWT:1591): Gtk-WARNING **: 01:01:18.644: Negative content width -13 (allocation 5, extents 9x9) while allocating gadget (node entry, owner GtkEntry)
21:01:19 [2020-08-28T01:01:19.016Z] 
21:01:19 [2020-08-28T01:01:19.016Z] (SWT:1591): Gtk-WARNING **: 01:01:18.786: Negative content width -13 (allocation 5, extents 9x9) while allocating gadget (node entry, owner GtkEntry)
21:01:19 [2020-08-28T01:01:19.016Z] 
21:01:19 [2020-08-28T01:01:19.016Z] (SWT:1591): Gtk-WARNING **: 01:01:18.948: Negative content width -13 (allocation 5, extents 9x9) while allocating gadget (node entry, owner GtkEntry)
21:01:19 [2020-08-28T01:01:19.274Z] 
21:01:19 [2020-08-28T01:01:19.274Z] (SWT:1591): Gtk-WARNING **: 01:01:19.070: Negative content width -13 (allocation 5, extents 9x9) while allocating gadget (node entry, owner GtkEntry)
21:01:19 [2020-08-28T01:01:19.274Z] 
21:01:19 [2020-08-28T01:01:19.274Z] (SWT:1591): Gtk-WARNING **: 01:01:19.147: Negative content width -13 (allocation 5, extents 9x9) while allocating gadget (node entry, owner GtkEntry)
21:01:19 [2020-08-28T01:01:19.274Z] 
21:01:19 [2020-08-28T01:01:19.274Z] (SWT:1591): Gtk-WARNING **: 01:01:19.234: Negative content width -13 (allocation 5, extents 9x9) while allocating gadget (node entry, owner GtkEntry)
21:01:19 [2020-08-28T01:01:19.532Z] 
21:01:19 [2020-08-28T01:01:19.532Z] (SWT:1591): Gtk-WARNING **: 01:01:19.356: Negative content width -13 (allocation 5, extents 9x9) while allocating gadget (node entry, owner GtkEntry)
21:01:19 [2020-08-28T01:01:19.532Z] 
21:01:19 [2020-08-28T01:01:19.532Z] (SWT:1591): Gtk-WARNING **: 01:01:19.407: Negative content width -6 (allocation 1, extents 4x3) while allocating gadget (node toolbar, owner GtkToolbar)
21:01:19 [2020-08-28T01:01:19.532Z] 
21:01:19 [2020-08-28T01:01:19.532Z] (SWT:1591): Gtk-WARNING **: 01:01:19.407: Negative content height -3 (allocation 1, extents 2x2) while allocating gadget (node toolbar, owner GtkToolbar)
21:01:19 [2020-08-28T01:01:19.532Z] 
21:01:19 [2020-08-28T01:01:19.532Z] (SWT:1591): Gtk-WARNING **: 01:01:19.407: Negative content width -6 (allocation 1, extents 4x3) while allocating gadget (node toolbar, owner GtkToolbar)
21:01:19 [2020-08-28T01:01:19.532Z] 
21:01:19 [2020-08-28T01:01:19.532Z] (SWT:1591): Gtk-WARNING **: 01:01:19.407: Negative content height -3 (allocation 1, extents 2x2) while allocating gadget (node toolbar, owner GtkToolbar)
21:01:19 [2020-08-28T01:01:19.532Z] 
21:01:19 [2020-08-28T01:01:19.532Z] (SWT:1591): Gtk-WARNING **: 01:01:19.504: Negative content width -13 (allocation 5, extents 9x9) while allocating gadget (node entry, owner GtkEntry)
21:01:19 [2020-08-28T01:01:19.789Z] 
21:01:19 [2020-08-28T01:01:19.789Z] (SWT:1591): Gtk-WARNING **: 01:01:19.618: Negative content width -13 (allocation 5, extents 9x9) while allocating gadget (node entry, owner GtkEntry)
21:01:19 [2020-08-28T01:01:19.789Z] 
21:01:19 [2020-08-28T01:01:19.789Z] (SWT:1591): Gtk-WARNING **: 01:01:19.754: Negative content width -13 (allocation 5, extents 9x9) while allocating gadget (node entry, owner GtkEntry)
21:01:20 [2020-08-28T01:01:20.047Z] 
21:01:20 [2020-08-28T01:01:20.047Z] (SWT:1591): Gtk-WARNING **: 01:01:19.858: Negative content width -13 (allocation 5, extents 9x9) while allocating gadget (node entry, owner GtkEntry)
21:01:20 [2020-08-28T01:01:20.047Z] 
21:01:20 [2020-08-28T01:01:20.047Z] (SWT:1591): Gtk-WARNING **: 01:01:19.967: Negative content width -13 (allocation 5, extents 9x9) while allocating gadget (node entry, owner GtkEntry)
21:01:20 [2020-08-28T01:01:20.305Z] Tests run: 11, Failures: 0, Errors: 0, Skipped: 0, Time elapsed: 1.448 s - in org.eclipse.egit.ui.prefpages.configuration.GlobalConfigurationPageTest
21:01:20 [2020-08-28T01:01:20.305Z] testAddSubSectionEntry(org.eclipse.egit.ui.prefpages.configuration.GlobalConfigurationPageTest)  Time elapsed: 0.163 s
21:01:20 [2020-08-28T01:01:20.305Z] testAddSectionEntry(org.eclipse.egit.ui.prefpages.configuration.GlobalConfigurationPageTest)  Time elapsed: 0.158 s
21:01:20 [2020-08-28T01:01:20.305Z] testCanCreateSameEntryValue(org.eclipse.egit.ui.prefpages.configuration.GlobalConfigurationPageTest)  Time elapsed: 0.125 s
21:01:20 [2020-08-28T01:01:20.305Z] testNodes(org.eclipse.egit.ui.prefpages.configuration.GlobalConfigurationPageTest)  Time elapsed: 0.076 s
21:01:20 [2020-08-28T01:01:20.305Z] testRemoveValue(org.eclipse.egit.ui.prefpages.configuration.GlobalConfigurationPageTest)  Time elapsed: 0.088 s
21:01:20 [2020-08-28T01:01:20.305Z] testAddSubSectionEntryWithSuggestion(org.eclipse.egit.ui.prefpages.configuration.GlobalConfigurationPageTest)  Time elapsed: 0.122 s
21:01:20 [2020-08-28T01:01:20.305Z] testOpenEditor(org.eclipse.egit.ui.prefpages.configuration.GlobalConfigurationPageTest)  Time elapsed: 0.148 s
21:01:20 [2020-08-28T01:01:20.305Z] testSubsectionWithDot(org.eclipse.egit.ui.prefpages.configuration.GlobalConfigurationPageTest)  Time elapsed: 0.114 s
21:01:20 [2020-08-28T01:01:20.305Z] testChecksForKey(org.eclipse.egit.ui.prefpages.configuration.GlobalConfigurationPageTest)  Time elapsed: 0.135 s
21:01:20 [2020-08-28T01:01:20.305Z] testRemoveSubSection(org.eclipse.egit.ui.prefpages.configuration.GlobalConfigurationPageTest)  Time elapsed: 0.104 s
21:01:20 [2020-08-28T01:01:20.305Z] testRemoveSection(org.eclipse.egit.ui.prefpages.configuration.GlobalConfigurationPageTest)  Time elapsed: 0.11 s
21:01:20 [2020-08-28T01:01:20.305Z] Running org.eclipse.egit.ui.operations.GitScopeUtilTest
21:01:24 [2020-08-28T01:01:24.487Z] Tests run: 5, Failures: 0, Errors: 0, Skipped: 0, Time elapsed: 4.241 s - in org.eclipse.egit.ui.operations.GitScopeUtilTest
21:01:24 [2020-08-28T01:01:24.487Z] relatedChangesWithPrompt(org.eclipse.egit.ui.operations.GitScopeUtilTest)  Time elapsed: 1.594 s
21:01:24 [2020-08-28T01:01:24.487Z] modelProviderWithExtensionFiles(org.eclipse.egit.ui.operations.GitScopeUtilTest)  Time elapsed: 0.826 s
21:01:24 [2020-08-28T01:01:24.487Z] relatedChangesWithInvalidParams(org.eclipse.egit.ui.operations.GitScopeUtilTest)  Time elapsed: 0.591 s
21:01:24 [2020-08-28T01:01:24.487Z] relatedChangesWithNullResources(org.eclipse.egit.ui.operations.GitScopeUtilTest)  Time elapsed: 0.591 s
21:01:24 [2020-08-28T01:01:24.487Z] relatedChangesWithEmptyResources(org.eclipse.egit.ui.operations.GitScopeUtilTest)  Time elapsed: 0.638 s
21:01:24 [2020-08-28T01:01:24.487Z] 
21:01:24 [2020-08-28T01:01:24.487Z] Results:
21:01:24 [2020-08-28T01:01:24.487Z] 
21:01:24 [2020-08-28T01:01:24.487Z] Errors: 
21:01:24 [2020-08-28T01:01:24.487Z]   CommitNonWSChangesTest>LocalRepositoryTestCase.afterClassBase:288 » IO Could n...
21:01:24 [2020-08-28T01:01:24.487Z] 
21:01:24 [2020-08-28T01:01:24.487Z] Tests run: 542, Failures: 0, Errors: 1, Skipped: 12
21:01:24 [2020-08-28T01:01:24.487Z] 
21:01:25 [2020-08-28T01:01:25.420Z] 
21:01:25 [2020-08-28T01:01:25.420Z] !ENTRY org.eclipse.core.resources 2 10035 2020-08-28 01:01:25.291
21:01:25 [2020-08-28T01:01:25.420Z] !MESSAGE The workspace will exit with unsaved changes in this session.
21:01:26 [2020-08-28T01:01:26.354Z] [INFO] ------------------------------------------------------------------------
21:01:26 [2020-08-28T01:01:26.354Z] [INFO] Reactor Summary for EGit Parent 5.9.0-SNAPSHOT:
21:01:26 [2020-08-28T01:01:26.354Z] [INFO] 
21:01:26 [2020-08-28T01:01:26.354Z] [INFO] EGit Parent ........................................ SUCCESS [ 31.580 s]
21:01:26 [2020-08-28T01:01:26.354Z] [INFO] EGit Target Platform Definition .................... SUCCESS [  1.282 s]
21:01:26 [2020-08-28T01:01:26.354Z] [INFO] Eclipse EGit ....................................... SUCCESS [  5.932 s]
21:01:26 [2020-08-28T01:01:26.354Z] [INFO] Git Team Provider (Core) ........................... SUCCESS [ 17.469 s]
21:01:26 [2020-08-28T01:01:26.354Z] [INFO] Git Team Provider (UI) ............................. SUCCESS [ 43.972 s]
21:01:26 [2020-08-28T01:01:26.354Z] [INFO] EGit Mylyn UI ...................................... SUCCESS [  6.748 s]
21:01:26 [2020-08-28T01:01:26.354Z] [INFO] Git Team Provider (Documentation) .................. SUCCESS [  5.208 s]
21:01:26 [2020-08-28T01:01:26.354Z] [INFO] Eclipse EGit Feature ............................... SUCCESS [  1.116 s]
21:01:26 [2020-08-28T01:01:26.354Z] [INFO] EGit Mylyn Feature ................................. SUCCESS [  1.179 s]
21:01:26 [2020-08-28T01:01:26.354Z] [INFO] Git Flow ........................................... SUCCESS [  6.022 s]
21:01:26 [2020-08-28T01:01:26.354Z] [INFO] Git Flow UI ........................................ SUCCESS [  9.146 s]
21:01:26 [2020-08-28T01:01:26.354Z] [INFO] Eclipse EGit Gitflow Feature ....................... SUCCESS [  1.421 s]
21:01:26 [2020-08-28T01:01:26.354Z] [INFO] EGit JUnit Support ................................. SUCCESS [  6.897 s]
21:01:26 [2020-08-28T01:01:26.354Z] [INFO] GitFlow Test Plug-in ............................... SUCCESS [ 24.090 s]
21:01:26 [2020-08-28T01:01:26.354Z] [INFO] Eclipse EGit Source Feature ........................ SUCCESS [  0.974 s]
21:01:26 [2020-08-28T01:01:26.354Z] [INFO] EGit P2 Repository ................................. SUCCESS [ 14.484 s]
21:01:26 [2020-08-28T01:01:26.354Z] [INFO] EGit Core Test Plug-in ............................. SUCCESS [02:09 min]
21:01:26 [2020-08-28T01:01:26.354Z] [INFO] EGit UI Test Plug-in ............................... FAILURE [12:44 min]
21:01:26 [2020-08-28T01:01:26.354Z] [INFO] EGit Mylyn UI Test Plug-in ......................... SKIPPED
21:01:26 [2020-08-28T01:01:26.354Z] [INFO] ------------------------------------------------------------------------
21:01:26 [2020-08-28T01:01:26.354Z] [INFO] BUILD FAILURE
21:01:26 [2020-08-28T01:01:26.354Z] [INFO] ------------------------------------------------------------------------
21:01:26 [2020-08-28T01:01:26.354Z] [INFO] Total time:  20:17 min
21:01:26 [2020-08-28T01:01:26.354Z] [INFO] Finished at: 2020-08-28T01:01:26Z
21:01:26 [2020-08-28T01:01:26.354Z] [INFO] ------------------------------------------------------------------------
21:01:26 [2020-08-28T01:01:26.354Z] [ERROR] Failed to execute goal org.eclipse.tycho:tycho-surefire-plugin:1.7.0:test (default-test) on project org.eclipse.egit.ui.test: There are test failures.
21:01:26 [2020-08-28T01:01:26.354Z] [ERROR] 
21:01:26 [2020-08-28T01:01:26.354Z] [ERROR] Please refer to /home/jenkins/agent/workspace/egit/repo/org.eclipse.egit.ui.test/target/surefire-reports for the individual test results.
21:01:26 [2020-08-28T01:01:26.354Z] [ERROR] -> [Help 1]
21:01:26 [2020-08-28T01:01:26.354Z] org.apache.maven.lifecycle.LifecycleExecutionException: Failed to execute goal org.eclipse.tycho:tycho-surefire-plugin:1.7.0:test (default-test) on project org.eclipse.egit.ui.test: There are test failures.
21:01:26 [2020-08-28T01:01:26.355Z] 
21:01:26 [2020-08-28T01:01:26.355Z] Please refer to /home/jenkins/agent/workspace/egit/repo/org.eclipse.egit.ui.test/target/surefire-reports for the individual test results.
21:01:26 [2020-08-28T01:01:26.355Z]     at org.apache.maven.lifecycle.internal.MojoExecutor.execute (MojoExecutor.java:215)
21:01:26 [2020-08-28T01:01:26.355Z]     at org.apache.maven.lifecycle.internal.MojoExecutor.execute (MojoExecutor.java:156)
21:01:26 [2020-08-28T01:01:26.355Z]     at org.apache.maven.lifecycle.internal.MojoExecutor.execute (MojoExecutor.java:148)
21:01:26 [2020-08-28T01:01:26.355Z]     at org.apache.maven.lifecycle.internal.LifecycleModuleBuilder.buildProject (LifecycleModuleBuilder.java:117)
21:01:26 [2020-08-28T01:01:26.355Z]     at org.apache.maven.lifecycle.internal.LifecycleModuleBuilder.buildProject (LifecycleModuleBuilder.java:81)
21:01:26 [2020-08-28T01:01:26.355Z]     at org.apache.maven.lifecycle.internal.builder.singlethreaded.SingleThreadedBuilder.build (SingleThreadedBuilder.java:56)
21:01:26 [2020-08-28T01:01:26.355Z]     at org.apache.maven.lifecycle.internal.LifecycleStarter.execute (LifecycleStarter.java:128)
21:01:26 [2020-08-28T01:01:26.355Z]     at org.apache.maven.DefaultMaven.doExecute (DefaultMaven.java:305)
21:01:26 [2020-08-28T01:01:26.355Z]     at org.apache.maven.DefaultMaven.doExecute (DefaultMaven.java:192)
21:01:26 [2020-08-28T01:01:26.355Z]     at org.apache.maven.DefaultMaven.execute (DefaultMaven.java:105)
21:01:26 [2020-08-28T01:01:26.355Z]     at org.apache.maven.cli.MavenCli.execute (MavenCli.java:957)
21:01:26 [2020-08-28T01:01:26.355Z]     at org.apache.maven.cli.MavenCli.doMain (MavenCli.java:289)
21:01:26 [2020-08-28T01:01:26.355Z]     at org.apache.maven.cli.MavenCli.main (MavenCli.java:193)
21:01:26 [2020-08-28T01:01:26.355Z]     at sun.reflect.NativeMethodAccessorImpl.invoke0 (Native Method)
21:01:26 [2020-08-28T01:01:26.355Z]     at sun.reflect.NativeMethodAccessorImpl.invoke (NativeMethodAccessorImpl.java:62)
21:01:26 [2020-08-28T01:01:26.355Z]     at sun.reflect.DelegatingMethodAccessorImpl.invoke (DelegatingMethodAccessorImpl.java:43)
21:01:26 [2020-08-28T01:01:26.355Z]     at java.lang.reflect.Method.invoke (Method.java:498)
21:01:26 [2020-08-28T01:01:26.355Z]     at org.codehaus.plexus.classworlds.launcher.Launcher.launchEnhanced (Launcher.java:282)
21:01:26 [2020-08-28T01:01:26.355Z]     at org.codehaus.plexus.classworlds.launcher.Launcher.launch (Launcher.java:225)
21:01:26 [2020-08-28T01:01:26.355Z]     at org.codehaus.plexus.classworlds.launcher.Launcher.mainWithExitCode (Launcher.java:406)
21:01:26 [2020-08-28T01:01:26.355Z]     at org.codehaus.plexus.classworlds.launcher.Launcher.main (Launcher.java:347)
21:01:26 [2020-08-28T01:01:26.355Z] Caused by: org.apache.maven.plugin.MojoFailureException: There are test failures.
21:01:26 [2020-08-28T01:01:26.355Z] 
21:01:26 [2020-08-28T01:01:26.355Z] Please refer to /home/jenkins/agent/workspace/egit/repo/org.eclipse.egit.ui.test/target/surefire-reports for the individual test results.
21:01:26 [2020-08-28T01:01:26.355Z]     at org.eclipse.tycho.surefire.TestMojo.runTest (TestMojo.java:1063)
21:01:26 [2020-08-28T01:01:26.355Z]     at org.eclipse.tycho.surefire.TestMojo.execute (TestMojo.java:712)
21:01:26 [2020-08-28T01:01:26.355Z]     at org.apache.maven.plugin.DefaultBuildPluginManager.executeMojo (DefaultBuildPluginManager.java:137)
21:01:26 [2020-08-28T01:01:26.355Z]     at org.apache.maven.lifecycle.internal.MojoExecutor.execute (MojoExecutor.java:210)
21:01:26 [2020-08-28T01:01:26.355Z]     at org.apache.maven.lifecycle.internal.MojoExecutor.execute (MojoExecutor.java:156)
21:01:26 [2020-08-28T01:01:26.355Z]     at org.apache.maven.lifecycle.internal.MojoExecutor.execute (MojoExecutor.java:148)
21:01:26 [2020-08-28T01:01:26.355Z]     at org.apache.maven.lifecycle.internal.LifecycleModuleBuilder.buildProject (LifecycleModuleBuilder.java:117)
21:01:26 [2020-08-28T01:01:26.355Z]     at org.apache.maven.lifecycle.internal.LifecycleModuleBuilder.buildProject (LifecycleModuleBuilder.java:81)
21:01:26 [2020-08-28T01:01:26.355Z]     at org.apache.maven.lifecycle.internal.builder.singlethreaded.SingleThreadedBuilder.build (SingleThreadedBuilder.java:56)
21:01:26 [2020-08-28T01:01:26.355Z]     at org.apache.maven.lifecycle.internal.LifecycleStarter.execute (LifecycleStarter.java:128)
21:01:26 [2020-08-28T01:01:26.355Z]     at org.apache.maven.DefaultMaven.doExecute (DefaultMaven.java:305)
21:01:26 [2020-08-28T01:01:26.355Z]     at org.apache.maven.DefaultMaven.doExecute (DefaultMaven.java:192)
21:01:26 [2020-08-28T01:01:26.355Z]     at org.apache.maven.DefaultMaven.execute (DefaultMaven.java:105)
21:01:26 [2020-08-28T01:01:26.355Z]     at org.apache.maven.cli.MavenCli.execute (MavenCli.java:957)
21:01:26 [2020-08-28T01:01:26.355Z]     at org.apache.maven.cli.MavenCli.doMain (MavenCli.java:289)
21:01:26 [2020-08-28T01:01:26.355Z]     at org.apache.maven.cli.MavenCli.main (MavenCli.java:193)
21:01:26 [2020-08-28T01:01:26.355Z]     at sun.reflect.NativeMethodAccessorImpl.invoke0 (Native Method)
21:01:26 [2020-08-28T01:01:26.355Z]     at sun.reflect.NativeMethodAccessorImpl.invoke (NativeMethodAccessorImpl.java:62)
21:01:26 [2020-08-28T01:01:26.355Z]     at sun.reflect.DelegatingMethodAccessorImpl.invoke (DelegatingMethodAccessorImpl.java:43)
21:01:26 [2020-08-28T01:01:26.355Z]     at java.lang.reflect.Method.invoke (Method.java:498)
21:01:26 [2020-08-28T01:01:26.355Z]     at org.codehaus.plexus.classworlds.launcher.Launcher.launchEnhanced (Launcher.java:282)
21:01:26 [2020-08-28T01:01:26.355Z]     at org.codehaus.plexus.classworlds.launcher.Launcher.launch (Launcher.java:225)
21:01:26 [2020-08-28T01:01:26.355Z]     at org.codehaus.plexus.classworlds.launcher.Launcher.mainWithExitCode (Launcher.java:406)
21:01:26 [2020-08-28T01:01:26.355Z]     at org.codehaus.plexus.classworlds.launcher.Launcher.main (Launcher.java:347)
21:01:26 [2020-08-28T01:01:26.355Z] [ERROR] 
21:01:26 [2020-08-28T01:01:26.355Z] [ERROR] Re-run Maven using the -X switch to enable full debug logging.
21:01:26 [2020-08-28T01:01:26.355Z] [ERROR] 
21:01:26 [2020-08-28T01:01:26.355Z] [ERROR] For more information about the errors and possible solutions, please read the following articles:
21:01:26 [2020-08-28T01:01:26.355Z] [ERROR] [Help 1] http://cwiki.apache.org/confluence/display/MAVEN/MojoFailureException
21:01:26 [2020-08-28T01:01:26.355Z] [ERROR] 
21:01:26 [2020-08-28T01:01:26.355Z] [ERROR] After correcting the problems, you can resume the build with the command
21:01:26 [2020-08-28T01:01:26.355Z] [ERROR]   mvn <args> -rf :org.eclipse.egit.ui.test
[Pipeline] }
[Pipeline] // stage
[Pipeline] stage
[Pipeline] { (Results)
[Pipeline] junit
21:01:27 [2020-08-28T01:01:27.766Z] Recording test results
[Pipeline] archiveArtifacts
21:01:28 [2020-08-28T01:01:28.664Z] Archiving artifacts
[Pipeline] findbugs
21:01:31 [2020-08-28T01:01:31.355Z] [FINDBUGS] Collecting findbugs analysis files...
21:01:34 [2020-08-28T01:01:34.760Z] [FINDBUGS] Searching for all files in /home/jenkins/agent/workspace/egit/repo that match the pattern */target/*bugsXml.xml
21:01:34 [2020-08-28T01:01:34.760Z] [FINDBUGS] Parsing 8 files in /home/jenkins/agent/workspace/egit/repo
21:01:34 [2020-08-28T01:01:34.760Z] [FINDBUGS] Successfully parsed file /home/jenkins/agent/workspace/egit/repo/org.eclipse.egit.core.junit/target/spotbugsXml.xml with 4 unique warnings and 0 duplicates.
21:01:34 [2020-08-28T01:01:34.760Z] [FINDBUGS] Successfully parsed file /home/jenkins/agent/workspace/egit/repo/org.eclipse.egit.core.test/target/spotbugsXml.xml with 9 unique warnings and 0 duplicates.
21:01:34 [2020-08-28T01:01:34.760Z] [FINDBUGS] Successfully parsed file /home/jenkins/agent/workspace/egit/repo/org.eclipse.egit.core/target/spotbugsXml.xml with 20 unique warnings and 0 duplicates.
21:01:34 [2020-08-28T01:01:34.760Z] [FINDBUGS] Successfully parsed file /home/jenkins/agent/workspace/egit/repo/org.eclipse.egit.gitflow.test/target/spotbugsXml.xml with 20 unique warnings and 0 duplicates.
21:01:34 [2020-08-28T01:01:34.760Z] [FINDBUGS] Successfully parsed file /home/jenkins/agent/workspace/egit/repo/org.eclipse.egit.gitflow.ui/target/spotbugsXml.xml with 20 unique warnings and 0 duplicates.
21:01:34 [2020-08-28T01:01:34.760Z] [FINDBUGS] Successfully parsed file /home/jenkins/agent/workspace/egit/repo/org.eclipse.egit.gitflow/target/spotbugsXml.xml with 22 unique warnings and 0 duplicates.
21:01:34 [2020-08-28T01:01:34.760Z] [FINDBUGS] Successfully parsed file /home/jenkins/agent/workspace/egit/repo/org.eclipse.egit.mylyn.ui/target/spotbugsXml.xml with 22 unique warnings and 0 duplicates.
21:01:34 [2020-08-28T01:01:34.760Z] [FINDBUGS] Successfully parsed file /home/jenkins/agent/workspace/egit/repo/org.eclipse.egit.ui/target/spotbugsXml.xml with 59 unique warnings and 0 duplicates.
21:01:34 [2020-08-28T01:01:34.760Z] Skipping warnings blame since pipelines do not have an SCM link.%n
21:01:34 [2020-08-28T01:01:34.819Z] [FINDBUGS] Computing warning deltas based on reference build #468
[Pipeline] dry
21:01:35 [2020-08-28T01:01:35.050Z] [DRY] Collecting duplicate code analysis files...
21:01:35 [2020-08-28T01:01:35.281Z] [DRY] Searching for all files in /home/jenkins/agent/workspace/egit/repo that match the pattern **/cpd.xml
21:01:35 [2020-08-28T01:01:35.281Z] [DRY] Parsing 15 files in /home/jenkins/agent/workspace/egit/repo
21:01:35 [2020-08-28T01:01:35.281Z] [DRY] Successfully parsed file /home/jenkins/agent/workspace/egit/repo/org.eclipse.egit-feature/target/cpd.xml with 0 unique warnings and 0 duplicates.
21:01:35 [2020-08-28T01:01:35.281Z] [DRY] Successfully parsed file /home/jenkins/agent/workspace/egit/repo/org.eclipse.egit.core.junit/target/cpd.xml with 0 unique warnings and 0 duplicates.
21:01:35 [2020-08-28T01:01:35.281Z] [DRY] Successfully parsed file /home/jenkins/agent/workspace/egit/repo/org.eclipse.egit.core.test/target/cpd.xml with 0 unique warnings and 0 duplicates.
21:01:35 [2020-08-28T01:01:35.281Z] [DRY] Successfully parsed file /home/jenkins/agent/workspace/egit/repo/org.eclipse.egit.core/target/cpd.xml with 4 unique warnings and 0 duplicates.
21:01:35 [2020-08-28T01:01:35.281Z] [DRY] Successfully parsed file /home/jenkins/agent/workspace/egit/repo/org.eclipse.egit.doc/target/cpd.xml with 4 unique warnings and 0 duplicates.
21:01:35 [2020-08-28T01:01:35.281Z] [DRY] Successfully parsed file /home/jenkins/agent/workspace/egit/repo/org.eclipse.egit.gitflow-feature/target/cpd.xml with 4 unique warnings and 0 duplicates.
21:01:35 [2020-08-28T01:01:35.281Z] [DRY] Successfully parsed file /home/jenkins/agent/workspace/egit/repo/org.eclipse.egit.gitflow.test/target/cpd.xml with 4 unique warnings and 0 duplicates.
21:01:35 [2020-08-28T01:01:35.281Z] [DRY] Successfully parsed file /home/jenkins/agent/workspace/egit/repo/org.eclipse.egit.gitflow.ui/target/cpd.xml with 4 unique warnings and 0 duplicates.
21:01:35 [2020-08-28T01:01:35.281Z] [DRY] Successfully parsed file /home/jenkins/agent/workspace/egit/repo/org.eclipse.egit.gitflow/target/cpd.xml with 4 unique warnings and 0 duplicates.
21:01:35 [2020-08-28T01:01:35.281Z] [DRY] Successfully parsed file /home/jenkins/agent/workspace/egit/repo/org.eclipse.egit.mylyn-feature/target/cpd.xml with 4 unique warnings and 0 duplicates.
21:01:35 [2020-08-28T01:01:35.281Z] [DRY] Successfully parsed file /home/jenkins/agent/workspace/egit/repo/org.eclipse.egit.mylyn.ui/target/cpd.xml with 4 unique warnings and 0 duplicates.
21:01:35 [2020-08-28T01:01:35.281Z] [DRY] Successfully parsed file /home/jenkins/agent/workspace/egit/repo/org.eclipse.egit.repository/target/cpd.xml with 4 unique warnings and 0 duplicates.
21:01:35 [2020-08-28T01:01:35.281Z] [DRY] Successfully parsed file /home/jenkins/agent/workspace/egit/repo/org.eclipse.egit.source-feature/target/cpd.xml with 4 unique warnings and 0 duplicates.
21:01:35 [2020-08-28T01:01:35.281Z] [DRY] Successfully parsed file /home/jenkins/agent/workspace/egit/repo/org.eclipse.egit.ui/target/cpd.xml with 37 unique warnings and 0 duplicates.
21:01:35 [2020-08-28T01:01:35.281Z] [DRY] Successfully parsed file /home/jenkins/agent/workspace/egit/repo/org.eclipse.egit/target/cpd.xml with 37 unique warnings and 0 duplicates.
21:01:35 [2020-08-28T01:01:35.281Z] Skipping warnings blame since pipelines do not have an SCM link.%n
21:01:35 [2020-08-28T01:01:35.321Z] [DRY] Computing warning deltas based on reference build #468
[Pipeline] }
[Pipeline] // stage
[Pipeline] step
21:01:35 [2020-08-28T01:01:35.481Z] Sending e-mails to: egit-build@eclipse.org
[Pipeline] }
[Pipeline] // dir
[Pipeline] }
21:01:35 [2020-08-28T01:01:35.592Z] Terminating xvnc.
[Pipeline] // wrap
[Pipeline] }
[Pipeline] // timeout
[Pipeline] }
[Pipeline] // node
[Pipeline] }
[Pipeline] // timestamps
[Pipeline] End of Pipeline
ERROR: script returned exit code 1
Finished: FAILURE