FailedConsole Output

Skipping 903 KB.. Full Log
: Gtk-WARNING **: 21:43:08.745: Negative content width -6 (allocation 1, extents 4x3) while allocating gadget (node toolbar, owner GtkToolbar)
17:43:08 [2020-08-23T21:43:08.781Z] 
17:43:08 [2020-08-23T21:43:08.781Z] (SWT:1602): Gtk-CRITICAL **: 21:43:08.751: gtk_box_gadget_distribute: assertion 'size >= 0' failed in GtkScrollbar
17:43:09 [2020-08-23T21:43:09.038Z] 
17:43:09 [2020-08-23T21:43:09.038Z] (SWT:1602): Gtk-WARNING **: 21:43:08.795: Negative content width -6 (allocation 1, extents 4x3) while allocating gadget (node toolbar, owner GtkToolbar)
17:43:09 [2020-08-23T21:43:09.038Z] 
17:43:09 [2020-08-23T21:43:09.038Z] (SWT:1602): Gtk-WARNING **: 21:43:08.821: Negative content width -6 (allocation 1, extents 4x3) while allocating gadget (node toolbar, owner GtkToolbar)
17:43:09 [2020-08-23T21:43:09.038Z] 
17:43:09 [2020-08-23T21:43:09.038Z] (SWT:1602): Gtk-WARNING **: 21:43:08.830: Negative content width -6 (allocation 1, extents 4x3) while allocating gadget (node toolbar, owner GtkToolbar)
17:43:09 [2020-08-23T21:43:09.038Z] 
17:43:09 [2020-08-23T21:43:09.038Z] (SWT:1602): Gtk-WARNING **: 21:43:08.832: Negative content width -6 (allocation 1, extents 4x3) while allocating gadget (node toolbar, owner GtkToolbar)
17:43:09 [2020-08-23T21:43:09.038Z] 
17:43:09 [2020-08-23T21:43:09.038Z] (SWT:1602): Gtk-WARNING **: 21:43:08.832: Negative content width -6 (allocation 1, extents 4x3) while allocating gadget (node toolbar, owner GtkToolbar)
17:43:09 [2020-08-23T21:43:09.038Z] 
17:43:09 [2020-08-23T21:43:09.038Z] (SWT:1602): Gtk-WARNING **: 21:43:08.847: Negative content width -6 (allocation 1, extents 4x3) while allocating gadget (node toolbar, owner GtkToolbar)
17:43:09 [2020-08-23T21:43:09.038Z] 
17:43:09 [2020-08-23T21:43:09.038Z] (SWT:1602): Gtk-WARNING **: 21:43:08.894: Negative content width -6 (allocation 1, extents 4x3) while allocating gadget (node toolbar, owner GtkToolbar)
17:43:09 [2020-08-23T21:43:09.038Z] 
17:43:09 [2020-08-23T21:43:09.038Z] (SWT:1602): Gtk-WARNING **: 21:43:08.949: Negative content width -6 (allocation 1, extents 4x3) while allocating gadget (node toolbar, owner GtkToolbar)
17:43:09 [2020-08-23T21:43:09.038Z] 
17:43:09 [2020-08-23T21:43:09.038Z] (SWT:1602): Gtk-WARNING **: 21:43:08.987: Negative content width -6 (allocation 1, extents 4x3) while allocating gadget (node toolbar, owner GtkToolbar)
17:43:09 [2020-08-23T21:43:09.038Z] 
17:43:09 [2020-08-23T21:43:09.038Z] (SWT:1602): Gtk-CRITICAL **: 21:43:09.019: gtk_box_gadget_distribute: assertion 'size >= 0' failed in GtkScrollbar
17:43:09 [2020-08-23T21:43:09.302Z] 
17:43:09 [2020-08-23T21:43:09.302Z] (SWT:1602): Gtk-CRITICAL **: 21:43:09.042: gtk_box_gadget_distribute: assertion 'size >= 0' failed in GtkScrollbar
17:43:09 [2020-08-23T21:43:09.302Z] 
17:43:09 [2020-08-23T21:43:09.302Z] (SWT:1602): Gtk-CRITICAL **: 21:43:09.059: gtk_box_gadget_distribute: assertion 'size >= 0' failed in GtkScrollbar
17:43:09 [2020-08-23T21:43:09.302Z] 
17:43:09 [2020-08-23T21:43:09.302Z] (SWT:1602): Gtk-CRITICAL **: 21:43:09.075: gtk_box_gadget_distribute: assertion 'size >= 0' failed in GtkScrollbar
17:43:09 [2020-08-23T21:43:09.302Z] 
17:43:09 [2020-08-23T21:43:09.302Z] (SWT:1602): Gtk-CRITICAL **: 21:43:09.092: gtk_box_gadget_distribute: assertion 'size >= 0' failed in GtkScrollbar
17:43:09 [2020-08-23T21:43:09.302Z] 
17:43:09 [2020-08-23T21:43:09.302Z] (SWT:1602): Gtk-CRITICAL **: 21:43:09.109: gtk_box_gadget_distribute: assertion 'size >= 0' failed in GtkScrollbar
17:43:09 [2020-08-23T21:43:09.302Z] 
17:43:09 [2020-08-23T21:43:09.302Z] (SWT:1602): Gtk-CRITICAL **: 21:43:09.125: gtk_box_gadget_distribute: assertion 'size >= 0' failed in GtkScrollbar
17:43:09 [2020-08-23T21:43:09.302Z] 
17:43:09 [2020-08-23T21:43:09.302Z] (SWT:1602): Gtk-CRITICAL **: 21:43:09.142: gtk_box_gadget_distribute: assertion 'size >= 0' failed in GtkScrollbar
17:43:09 [2020-08-23T21:43:09.302Z] 
17:43:09 [2020-08-23T21:43:09.302Z] (SWT:1602): Gtk-CRITICAL **: 21:43:09.158: gtk_box_gadget_distribute: assertion 'size >= 0' failed in GtkScrollbar
17:43:09 [2020-08-23T21:43:09.302Z] 
17:43:09 [2020-08-23T21:43:09.302Z] (SWT:1602): Gtk-CRITICAL **: 21:43:09.175: gtk_box_gadget_distribute: assertion 'size >= 0' failed in GtkScrollbar
17:43:09 [2020-08-23T21:43:09.302Z] 
17:43:09 [2020-08-23T21:43:09.302Z] (SWT:1602): Gtk-WARNING **: 21:43:09.197: Negative content width -6 (allocation 1, extents 4x3) while allocating gadget (node toolbar, owner GtkToolbar)
17:43:09 [2020-08-23T21:43:09.302Z] 
17:43:09 [2020-08-23T21:43:09.302Z] (SWT:1602): Gtk-WARNING **: 21:43:09.206: Negative content width -6 (allocation 1, extents 4x3) while allocating gadget (node toolbar, owner GtkToolbar)
17:43:10 [2020-08-23T21:43:10.673Z] 
17:43:10 [2020-08-23T21:43:10.673Z] (SWT:1602): Gtk-WARNING **: 21:43:10.252: Negative content width -6 (allocation 1, extents 4x3) while allocating gadget (node toolbar, owner GtkToolbar)
17:43:10 [2020-08-23T21:43:10.673Z] 
17:43:10 [2020-08-23T21:43:10.673Z] (SWT:1602): Gtk-WARNING **: 21:43:10.457: Negative content width -6 (allocation 1, extents 4x3) while allocating gadget (node toolbar, owner GtkToolbar)
17:43:11 [2020-08-23T21:43:11.237Z] 
17:43:11 [2020-08-23T21:43:11.237Z] (SWT:1602): Gtk-WARNING **: 21:43:10.974: Negative content width -6 (allocation 1, extents 4x3) while allocating gadget (node toolbar, owner GtkToolbar)
17:43:11 [2020-08-23T21:43:11.237Z] 
17:43:11 [2020-08-23T21:43:11.237Z] (SWT:1602): Gtk-WARNING **: 21:43:11.184: Negative content width -6 (allocation 1, extents 4x3) while allocating gadget (node toolbar, owner GtkToolbar)
17:43:11 [2020-08-23T21:43:11.800Z] 
17:43:11 [2020-08-23T21:43:11.800Z] (SWT:1602): Gtk-CRITICAL **: 21:43:11.708: gtk_box_gadget_distribute: assertion 'size >= 0' failed in GtkScrollbar
17:43:11 [2020-08-23T21:43:11.800Z] 
17:43:11 [2020-08-23T21:43:11.800Z] (SWT:1602): Gtk-WARNING **: 21:43:11.710: Negative content width -6 (allocation 1, extents 4x3) while allocating gadget (node toolbar, owner GtkToolbar)
17:43:11 [2020-08-23T21:43:11.800Z] 
17:43:11 [2020-08-23T21:43:11.800Z] (SWT:1602): Gtk-CRITICAL **: 21:43:11.721: gtk_box_gadget_distribute: assertion 'size >= 0' failed in GtkScrollbar
17:43:11 [2020-08-23T21:43:11.800Z] 
17:43:11 [2020-08-23T21:43:11.800Z] (SWT:1602): Gtk-CRITICAL **: 21:43:11.722: gtk_box_gadget_distribute: assertion 'size >= 0' failed in GtkScrollbar
17:43:11 [2020-08-23T21:43:11.800Z] 
17:43:11 [2020-08-23T21:43:11.800Z] (SWT:1602): Gtk-CRITICAL **: 21:43:11.731: gtk_box_gadget_distribute: assertion 'size >= 0' failed in GtkScrollbar
17:43:12 [2020-08-23T21:43:12.057Z] 
17:43:12 [2020-08-23T21:43:12.057Z] (SWT:1602): Gtk-WARNING **: 21:43:11.913: Negative content width -6 (allocation 1, extents 4x3) while allocating gadget (node toolbar, owner GtkToolbar)
17:43:12 [2020-08-23T21:43:12.622Z] 
17:43:12 [2020-08-23T21:43:12.622Z] (SWT:1602): Gtk-WARNING **: 21:43:12.442: Negative content width -6 (allocation 1, extents 4x3) while allocating gadget (node toolbar, owner GtkToolbar)
17:43:12 [2020-08-23T21:43:12.622Z] 
17:43:12 [2020-08-23T21:43:12.622Z] (SWT:1602): Gtk-CRITICAL **: 21:43:12.447: gtk_box_gadget_distribute: assertion 'size >= 0' failed in GtkScrollbar
17:43:12 [2020-08-23T21:43:12.622Z] 
17:43:12 [2020-08-23T21:43:12.622Z] (SWT:1602): Gtk-CRITICAL **: 21:43:12.456: gtk_box_gadget_distribute: assertion 'size >= 0' failed in GtkScrollbar
17:43:12 [2020-08-23T21:43:12.880Z] 
17:43:12 [2020-08-23T21:43:12.880Z] (SWT:1602): Gtk-WARNING **: 21:43:12.647: Negative content width -6 (allocation 1, extents 4x3) while allocating gadget (node toolbar, owner GtkToolbar)
17:43:13 [2020-08-23T21:43:13.812Z] 
17:43:13 [2020-08-23T21:43:13.812Z] (SWT:1602): Gtk-WARNING **: 21:43:13.536: Negative content width -6 (allocation 1, extents 4x3) while allocating gadget (node toolbar, owner GtkToolbar)
17:43:13 [2020-08-23T21:43:13.812Z] 
17:43:13 [2020-08-23T21:43:13.812Z] (SWT:1602): Gtk-WARNING **: 21:43:13.545: Negative content width -6 (allocation 1, extents 4x3) while allocating gadget (node toolbar, owner GtkToolbar)
17:43:13 [2020-08-23T21:43:13.812Z] Tests run: 3, Failures: 0, Errors: 0, Skipped: 1, Time elapsed: 11.283 s - in org.eclipse.egit.ui.internal.selection.SelectionForViewsTest
17:43:13 [2020-08-23T21:43:13.812Z] testViewsReactOnRepoSwitchInStaging(org.eclipse.egit.ui.internal.selection.SelectionForViewsTest) skipped
17:43:13 [2020-08-23T21:43:13.812Z] testViewsReactOnBareRepoViewSelection(org.eclipse.egit.ui.internal.selection.SelectionForViewsTest)  Time elapsed: 5.569 s
17:43:13 [2020-08-23T21:43:13.812Z] testViewsReactOnRepoViewSelection(org.eclipse.egit.ui.internal.selection.SelectionForViewsTest)  Time elapsed: 5.706 s
17:43:13 [2020-08-23T21:43:13.812Z] Running org.eclipse.egit.ui.internal.selection.SelectionUtilsTest
17:43:13 [2020-08-23T21:43:13.812Z] Tests run: 1, Failures: 0, Errors: 0, Skipped: 0, Time elapsed: 0.058 s - in org.eclipse.egit.ui.internal.selection.SelectionUtilsTest
17:43:13 [2020-08-23T21:43:13.812Z] getSelectedResourcesShouldUseAllTraversals(org.eclipse.egit.ui.internal.selection.SelectionUtilsTest)  Time elapsed: 0.058 s
17:43:13 [2020-08-23T21:43:13.812Z] Running org.eclipse.egit.ui.internal.CommonUtilsTest
17:43:13 [2020-08-23T21:43:13.812Z] Tests run: 10, Failures: 0, Errors: 0, Skipped: 0, Time elapsed: 0.037 s - in org.eclipse.egit.ui.internal.CommonUtilsTest
17:43:13 [2020-08-23T21:43:13.812Z] sortingShouldWorkForBigNumbers(org.eclipse.egit.ui.internal.CommonUtilsTest)  Time elapsed: 0.001 s
17:43:13 [2020-08-23T21:43:13.812Z] sortingShouldWorkForMixedParts(org.eclipse.egit.ui.internal.CommonUtilsTest)  Time elapsed: 0 s
17:43:13 [2020-08-23T21:43:13.812Z] sortingShouldWorkForNumbers(org.eclipse.egit.ui.internal.CommonUtilsTest)  Time elapsed: 0 s
17:43:13 [2020-08-23T21:43:13.812Z] testFooterOffset(org.eclipse.egit.ui.internal.CommonUtilsTest)  Time elapsed: 0 s
17:43:13 [2020-08-23T21:43:13.812Z] sortingShouldWorkForEqualAndEmptyStrings(org.eclipse.egit.ui.internal.CommonUtilsTest)  Time elapsed: 0 s
17:43:13 [2020-08-23T21:43:13.812Z] sortingShouldIgnoreCase(org.eclipse.egit.ui.internal.CommonUtilsTest)  Time elapsed: 0 s
17:43:13 [2020-08-23T21:43:13.812Z] testFooterOffsetNoFooter(org.eclipse.egit.ui.internal.CommonUtilsTest)  Time elapsed: 0 s
17:43:13 [2020-08-23T21:43:13.812Z] sortingShouldIgnoreLeadingZeros(org.eclipse.egit.ui.internal.CommonUtilsTest)  Time elapsed: 0 s
17:43:13 [2020-08-23T21:43:13.812Z] testResourceCompare(org.eclipse.egit.ui.internal.CommonUtilsTest)  Time elapsed: 0.036 s
17:43:13 [2020-08-23T21:43:13.812Z] sortingShouldWorkForEasyStrings(org.eclipse.egit.ui.internal.CommonUtilsTest)  Time elapsed: 0 s
17:43:13 [2020-08-23T21:43:13.812Z] Running org.eclipse.egit.ui.internal.dialogs.HyperlinkTokenScannerTest
17:43:14 [2020-08-23T21:43:14.070Z] Tests run: 10, Failures: 0, Errors: 0, Skipped: 0, Time elapsed: 0.143 s - in org.eclipse.egit.ui.internal.dialogs.HyperlinkTokenScannerTest
17:43:14 [2020-08-23T21:43:14.070Z] tokenizeEmbeddedHyperlink(org.eclipse.egit.ui.internal.dialogs.HyperlinkTokenScannerTest)  Time elapsed: 0.136 s
17:43:14 [2020-08-23T21:43:14.070Z] tokenizeWithFailingDetector(org.eclipse.egit.ui.internal.dialogs.HyperlinkTokenScannerTest)  Time elapsed: 0.001 s
17:43:14 [2020-08-23T21:43:14.070Z] tokenizeWithoutDetectors(org.eclipse.egit.ui.internal.dialogs.HyperlinkTokenScannerTest)  Time elapsed: 0 s
17:43:14 [2020-08-23T21:43:14.070Z] tokenizeHyperlinksOutsideRegion(org.eclipse.egit.ui.internal.dialogs.HyperlinkTokenScannerTest)  Time elapsed: 0 s
17:43:14 [2020-08-23T21:43:14.070Z] tokenizeMultipleHyperlinksSimple(org.eclipse.egit.ui.internal.dialogs.HyperlinkTokenScannerTest)  Time elapsed: 0 s
17:43:14 [2020-08-23T21:43:14.070Z] tokenizeMultipleHyperlinksMultiline(org.eclipse.egit.ui.internal.dialogs.HyperlinkTokenScannerTest)  Time elapsed: 0 s
17:43:14 [2020-08-23T21:43:14.070Z] tokenizeLeadingHyperlink(org.eclipse.egit.ui.internal.dialogs.HyperlinkTokenScannerTest)  Time elapsed: 0.001 s
17:43:14 [2020-08-23T21:43:14.070Z] tokenizeEmpty(org.eclipse.egit.ui.internal.dialogs.HyperlinkTokenScannerTest)  Time elapsed: 0 s
17:43:14 [2020-08-23T21:43:14.070Z] tokenizeHyperlinksCutByRegion(org.eclipse.egit.ui.internal.dialogs.HyperlinkTokenScannerTest)  Time elapsed: 0.001 s
17:43:14 [2020-08-23T21:43:14.070Z] tokenizeNoHyperlinks(org.eclipse.egit.ui.internal.dialogs.HyperlinkTokenScannerTest)  Time elapsed: 0 s
17:43:14 [2020-08-23T21:43:14.070Z] Running org.eclipse.egit.ui.internal.dialogs.CommitMessageBuilderTest
17:43:14 [2020-08-23T21:43:14.070Z] 
17:43:14 [2020-08-23T21:43:14.070Z] !ENTRY org.eclipse.egit.ui 4 0 2020-08-23 21:43:14.007
17:43:14 [2020-08-23T21:43:14.070Z] !MESSAGE CrashingCommitMessageProvider fails on purpose.
17:43:14 [2020-08-23T21:43:14.070Z] !STACK 0
17:43:14 [2020-08-23T21:43:14.070Z] java.lang.IllegalStateException: CrashingCommitMessageProvider fails on purpose.
17:43:14 [2020-08-23T21:43:14.070Z] 	at org.eclipse.egit.ui.internal.dialogs.CommitMessageBuilderTest$CrashingCommitMessageProvider.getMessage(CommitMessageBuilderTest.java:474)
17:43:14 [2020-08-23T21:43:14.070Z] 	at org.eclipse.egit.ui.internal.dialogs.CommitMessageBuilder.build(CommitMessageBuilder.java:90)
17:43:14 [2020-08-23T21:43:14.070Z] 	at org.eclipse.egit.ui.internal.dialogs.CommitMessageBuilderTest.commitMessageProvider_oneCrashingProvider(CommitMessageBuilderTest.java:99)
17:43:14 [2020-08-23T21:43:14.070Z] 	at sun.reflect.NativeMethodAccessorImpl.invoke0(Native Method)
17:43:14 [2020-08-23T21:43:14.070Z] 	at sun.reflect.NativeMethodAccessorImpl.invoke(NativeMethodAccessorImpl.java:62)
17:43:14 [2020-08-23T21:43:14.070Z] 	at sun.reflect.DelegatingMethodAccessorImpl.invoke(DelegatingMethodAccessorImpl.java:43)
17:43:14 [2020-08-23T21:43:14.070Z] 	at java.lang.reflect.Method.invoke(Method.java:498)
17:43:14 [2020-08-23T21:43:14.070Z] 	at org.junit.runners.model.FrameworkMethod$1.runReflectiveCall(FrameworkMethod.java:59)
17:43:14 [2020-08-23T21:43:14.070Z] 	at org.junit.internal.runners.model.ReflectiveCallable.run(ReflectiveCallable.java:12)
17:43:14 [2020-08-23T21:43:14.070Z] 	at org.junit.runners.model.FrameworkMethod.invokeExplosively(FrameworkMethod.java:56)
17:43:14 [2020-08-23T21:43:14.070Z] 	at org.junit.internal.runners.statements.InvokeMethod.evaluate(InvokeMethod.java:17)
17:43:14 [2020-08-23T21:43:14.070Z] 	at org.junit.internal.runners.statements.RunBefores.evaluate(RunBefores.java:26)
17:43:14 [2020-08-23T21:43:14.070Z] 	at org.junit.internal.runners.statements.RunAfters.evaluate(RunAfters.java:27)
17:43:14 [2020-08-23T21:43:14.070Z] 	at org.junit.runners.ParentRunner$3.evaluate(ParentRunner.java:306)
17:43:14 [2020-08-23T21:43:14.070Z] 	at org.junit.runners.BlockJUnit4ClassRunner$1.evaluate(BlockJUnit4ClassRunner.java:100)
17:43:14 [2020-08-23T21:43:14.070Z] 	at org.junit.runners.ParentRunner.runLeaf(ParentRunner.java:366)
17:43:14 [2020-08-23T21:43:14.070Z] 	at org.junit.runners.BlockJUnit4ClassRunner.runChild(BlockJUnit4ClassRunner.java:103)
17:43:14 [2020-08-23T21:43:14.070Z] 	at org.junit.runners.BlockJUnit4ClassRunner.runChild(BlockJUnit4ClassRunner.java:63)
17:43:14 [2020-08-23T21:43:14.070Z] 	at org.junit.runners.ParentRunner$4.run(ParentRunner.java:331)
17:43:14 [2020-08-23T21:43:14.070Z] 	at org.junit.runners.ParentRunner$1.schedule(ParentRunner.java:79)
17:43:14 [2020-08-23T21:43:14.070Z] 	at org.junit.runners.ParentRunner.runChildren(ParentRunner.java:329)
17:43:14 [2020-08-23T21:43:14.070Z] 	at org.junit.runners.ParentRunner.access$100(ParentRunner.java:66)
17:43:14 [2020-08-23T21:43:14.070Z] 	at org.junit.runners.ParentRunner$2.evaluate(ParentRunner.java:293)
17:43:14 [2020-08-23T21:43:14.070Z] 	at org.junit.internal.runners.statements.RunBefores.evaluate(RunBefores.java:26)
17:43:14 [2020-08-23T21:43:14.070Z] 	at org.junit.runners.ParentRunner$3.evaluate(ParentRunner.java:306)
17:43:14 [2020-08-23T21:43:14.070Z] 	at org.junit.runners.ParentRunner.run(ParentRunner.java:413)
17:43:14 [2020-08-23T21:43:14.070Z] 	at org.apache.maven.surefire.junit4.JUnit4Provider.execute(JUnit4Provider.java:365)
17:43:14 [2020-08-23T21:43:14.070Z] 	at org.apache.maven.surefire.junit4.JUnit4Provider.executeWithRerun(JUnit4Provider.java:273)
17:43:14 [2020-08-23T21:43:14.070Z] 	at org.apache.maven.surefire.junit4.JUnit4Provider.executeTestSet(JUnit4Provider.java:238)
17:43:14 [2020-08-23T21:43:14.070Z] 	at org.apache.maven.surefire.junit4.JUnit4Provider.invoke(JUnit4Provider.java:159)
17:43:14 [2020-08-23T21:43:14.070Z] 	at sun.reflect.NativeMethodAccessorImpl.invoke0(Native Method)
17:43:14 [2020-08-23T21:43:14.070Z] 	at sun.reflect.NativeMethodAccessorImpl.invoke(NativeMethodAccessorImpl.java:62)
17:43:14 [2020-08-23T21:43:14.070Z] 	at sun.reflect.DelegatingMethodAccessorImpl.invoke(DelegatingMethodAccessorImpl.java:43)
17:43:14 [2020-08-23T21:43:14.070Z] 	at java.lang.reflect.Method.invoke(Method.java:498)
17:43:14 [2020-08-23T21:43:14.070Z] 	at org.apache.maven.surefire.util.ReflectionUtils.invokeMethodWithArray2(ReflectionUtils.java:206)
17:43:14 [2020-08-23T21:43:14.070Z] 	at org.apache.maven.surefire.booter.ProviderFactory$ProviderProxy.invoke(ProviderFactory.java:161)
17:43:14 [2020-08-23T21:43:14.070Z] 	at org.apache.maven.surefire.booter.ProviderFactory.invokeProvider(ProviderFactory.java:84)
17:43:14 [2020-08-23T21:43:14.070Z] 	at org.eclipse.tycho.surefire.osgibooter.OsgiSurefireBooter.run(OsgiSurefireBooter.java:113)
17:43:14 [2020-08-23T21:43:14.070Z] 	at org.eclipse.tycho.surefire.osgibooter.AbstractUITestApplication.runTests(AbstractUITestApplication.java:44)
17:43:14 [2020-08-23T21:43:14.070Z] 	at org.eclipse.e4.ui.internal.workbench.swt.E4Testable$1.run(E4Testable.java:73)
17:43:14 [2020-08-23T21:43:14.071Z] 	at java.lang.Thread.run(Thread.java:748)
17:43:15 [2020-08-23T21:43:15.442Z] 
17:43:15 [2020-08-23T21:43:15.442Z] !ENTRY org.eclipse.egit.ui 4 0 2020-08-23 21:43:15.260
17:43:15 [2020-08-23T21:43:15.442Z] !MESSAGE CrashingCommitMessageProviderWithCaretPositioning fails on purpose.
17:43:15 [2020-08-23T21:43:15.442Z] !STACK 0
17:43:15 [2020-08-23T21:43:15.442Z] java.lang.IllegalStateException: CrashingCommitMessageProviderWithCaretPositioning fails on purpose.
17:43:15 [2020-08-23T21:43:15.442Z] 	at org.eclipse.egit.ui.internal.dialogs.CommitMessageBuilderTest$CrashingCommitMessageProviderWithCaretPositioning.getCommitMessageWithPosition(CommitMessageBuilderTest.java:491)
17:43:15 [2020-08-23T21:43:15.442Z] 	at org.eclipse.egit.ui.internal.dialogs.CommitMessageBuilder.build(CommitMessageBuilder.java:81)
17:43:15 [2020-08-23T21:43:15.442Z] 	at org.eclipse.egit.ui.internal.dialogs.CommitMessageBuilderTest.commitMessageProvider_oneCrashingProviderWithCaretPosition(CommitMessageBuilderTest.java:112)
17:43:15 [2020-08-23T21:43:15.442Z] 	at sun.reflect.NativeMethodAccessorImpl.invoke0(Native Method)
17:43:15 [2020-08-23T21:43:15.442Z] 	at sun.reflect.NativeMethodAccessorImpl.invoke(NativeMethodAccessorImpl.java:62)
17:43:15 [2020-08-23T21:43:15.442Z] 	at sun.reflect.DelegatingMethodAccessorImpl.invoke(DelegatingMethodAccessorImpl.java:43)
17:43:15 [2020-08-23T21:43:15.442Z] 	at java.lang.reflect.Method.invoke(Method.java:498)
17:43:15 [2020-08-23T21:43:15.442Z] 	at org.junit.runners.model.FrameworkMethod$1.runReflectiveCall(FrameworkMethod.java:59)
17:43:15 [2020-08-23T21:43:15.442Z] 	at org.junit.internal.runners.model.ReflectiveCallable.run(ReflectiveCallable.java:12)
17:43:15 [2020-08-23T21:43:15.442Z] 	at org.junit.runners.model.FrameworkMethod.invokeExplosively(FrameworkMethod.java:56)
17:43:15 [2020-08-23T21:43:15.442Z] 	at org.junit.internal.runners.statements.InvokeMethod.evaluate(InvokeMethod.java:17)
17:43:15 [2020-08-23T21:43:15.442Z] 	at org.junit.internal.runners.statements.RunBefores.evaluate(RunBefores.java:26)
17:43:15 [2020-08-23T21:43:15.442Z] 	at org.junit.internal.runners.statements.RunAfters.evaluate(RunAfters.java:27)
17:43:15 [2020-08-23T21:43:15.442Z] 	at org.junit.runners.ParentRunner$3.evaluate(ParentRunner.java:306)
17:43:15 [2020-08-23T21:43:15.442Z] 	at org.junit.runners.BlockJUnit4ClassRunner$1.evaluate(BlockJUnit4ClassRunner.java:100)
17:43:15 [2020-08-23T21:43:15.442Z] 	at org.junit.runners.ParentRunner.runLeaf(ParentRunner.java:366)
17:43:15 [2020-08-23T21:43:15.442Z] 	at org.junit.runners.BlockJUnit4ClassRunner.runChild(BlockJUnit4ClassRunner.java:103)
17:43:15 [2020-08-23T21:43:15.442Z] 	at org.junit.runners.BlockJUnit4ClassRunner.runChild(BlockJUnit4ClassRunner.java:63)
17:43:15 [2020-08-23T21:43:15.442Z] 	at org.junit.runners.ParentRunner$4.run(ParentRunner.java:331)
17:43:15 [2020-08-23T21:43:15.442Z] 	at org.junit.runners.ParentRunner$1.schedule(ParentRunner.java:79)
17:43:15 [2020-08-23T21:43:15.442Z] 	at org.junit.runners.ParentRunner.runChildren(ParentRunner.java:329)
17:43:15 [2020-08-23T21:43:15.442Z] 	at org.junit.runners.ParentRunner.access$100(ParentRunner.java:66)
17:43:15 [2020-08-23T21:43:15.442Z] 	at org.junit.runners.ParentRunner$2.evaluate(ParentRunner.java:293)
17:43:15 [2020-08-23T21:43:15.442Z] 	at org.junit.internal.runners.statements.RunBefores.evaluate(RunBefores.java:26)
17:43:15 [2020-08-23T21:43:15.442Z] 	at org.junit.runners.ParentRunner$3.evaluate(ParentRunner.java:306)
17:43:15 [2020-08-23T21:43:15.442Z] 	at org.junit.runners.ParentRunner.run(ParentRunner.java:413)
17:43:15 [2020-08-23T21:43:15.443Z] 	at org.apache.maven.surefire.junit4.JUnit4Provider.execute(JUnit4Provider.java:365)
17:43:15 [2020-08-23T21:43:15.443Z] 	at org.apache.maven.surefire.junit4.JUnit4Provider.executeWithRerun(JUnit4Provider.java:273)
17:43:15 [2020-08-23T21:43:15.443Z] 	at org.apache.maven.surefire.junit4.JUnit4Provider.executeTestSet(JUnit4Provider.java:238)
17:43:15 [2020-08-23T21:43:15.443Z] 	at org.apache.maven.surefire.junit4.JUnit4Provider.invoke(JUnit4Provider.java:159)
17:43:15 [2020-08-23T21:43:15.443Z] 	at sun.reflect.NativeMethodAccessorImpl.invoke0(Native Method)
17:43:15 [2020-08-23T21:43:15.443Z] 	at sun.reflect.NativeMethodAccessorImpl.invoke(NativeMethodAccessorImpl.java:62)
17:43:15 [2020-08-23T21:43:15.443Z] 	at sun.reflect.DelegatingMethodAccessorImpl.invoke(DelegatingMethodAccessorImpl.java:43)
17:43:15 [2020-08-23T21:43:15.443Z] 	at java.lang.reflect.Method.invoke(Method.java:498)
17:43:15 [2020-08-23T21:43:15.443Z] 	at org.apache.maven.surefire.util.ReflectionUtils.invokeMethodWithArray2(ReflectionUtils.java:206)
17:43:15 [2020-08-23T21:43:15.443Z] 	at org.apache.maven.surefire.booter.ProviderFactory$ProviderProxy.invoke(ProviderFactory.java:161)
17:43:15 [2020-08-23T21:43:15.443Z] 	at org.apache.maven.surefire.booter.ProviderFactory.invokeProvider(ProviderFactory.java:84)
17:43:15 [2020-08-23T21:43:15.443Z] 	at org.eclipse.tycho.surefire.osgibooter.OsgiSurefireBooter.run(OsgiSurefireBooter.java:113)
17:43:15 [2020-08-23T21:43:15.443Z] 	at org.eclipse.tycho.surefire.osgibooter.AbstractUITestApplication.runTests(AbstractUITestApplication.java:44)
17:43:15 [2020-08-23T21:43:15.443Z] 	at org.eclipse.e4.ui.internal.workbench.swt.E4Testable$1.run(E4Testable.java:73)
17:43:15 [2020-08-23T21:43:15.443Z] 	at java.lang.Thread.run(Thread.java:748)
17:43:15 [2020-08-23T21:43:15.443Z] 
17:43:15 [2020-08-23T21:43:15.443Z] !ENTRY org.eclipse.egit.ui 4 0 2020-08-23 21:43:15.381
17:43:15 [2020-08-23T21:43:15.443Z] !MESSAGE CrashingCommitMessageProvider fails on purpose.
17:43:15 [2020-08-23T21:43:15.443Z] !STACK 0
17:43:15 [2020-08-23T21:43:15.443Z] java.lang.IllegalStateException: CrashingCommitMessageProvider fails on purpose.
17:43:15 [2020-08-23T21:43:15.443Z] 	at org.eclipse.egit.ui.internal.dialogs.CommitMessageBuilderTest$CrashingCommitMessageProvider.getMessage(CommitMessageBuilderTest.java:474)
17:43:15 [2020-08-23T21:43:15.443Z] 	at org.eclipse.egit.ui.internal.dialogs.CommitMessageBuilder.build(CommitMessageBuilder.java:90)
17:43:15 [2020-08-23T21:43:15.443Z] 	at org.eclipse.egit.ui.internal.dialogs.CommitMessageBuilderTest.commitMessageProvider_twoProvidersFirstOneCrashing(CommitMessageBuilderTest.java:146)
17:43:15 [2020-08-23T21:43:15.443Z] 	at sun.reflect.NativeMethodAccessorImpl.invoke0(Native Method)
17:43:15 [2020-08-23T21:43:15.443Z] 	at sun.reflect.NativeMethodAccessorImpl.invoke(NativeMethodAccessorImpl.java:62)
17:43:15 [2020-08-23T21:43:15.443Z] 	at sun.reflect.DelegatingMethodAccessorImpl.invoke(DelegatingMethodAccessorImpl.java:43)
17:43:15 [2020-08-23T21:43:15.443Z] 	at java.lang.reflect.Method.invoke(Method.java:498)
17:43:15 [2020-08-23T21:43:15.443Z] 	at org.junit.runners.model.FrameworkMethod$1.runReflectiveCall(FrameworkMethod.java:59)
17:43:15 [2020-08-23T21:43:15.443Z] 	at org.junit.internal.runners.model.ReflectiveCallable.run(ReflectiveCallable.java:12)
17:43:15 [2020-08-23T21:43:15.443Z] 	at org.junit.runners.model.FrameworkMethod.invokeExplosively(FrameworkMethod.java:56)
17:43:15 [2020-08-23T21:43:15.443Z] 	at org.junit.internal.runners.statements.InvokeMethod.evaluate(InvokeMethod.java:17)
17:43:15 [2020-08-23T21:43:15.443Z] 	at org.junit.internal.runners.statements.RunBefores.evaluate(RunBefores.java:26)
17:43:15 [2020-08-23T21:43:15.443Z] 	at org.junit.internal.runners.statements.RunAfters.evaluate(RunAfters.java:27)
17:43:15 [2020-08-23T21:43:15.443Z] 	at org.junit.runners.ParentRunner$3.evaluate(ParentRunner.java:306)
17:43:15 [2020-08-23T21:43:15.443Z] 	at org.junit.runners.BlockJUnit4ClassRunner$1.evaluate(BlockJUnit4ClassRunner.java:100)
17:43:15 [2020-08-23T21:43:15.443Z] 	at org.junit.runners.ParentRunner.runLeaf(ParentRunner.java:366)
17:43:15 [2020-08-23T21:43:15.443Z] 	at org.junit.runners.BlockJUnit4ClassRunner.runChild(BlockJUnit4ClassRunner.java:103)
17:43:15 [2020-08-23T21:43:15.443Z] 	at org.junit.runners.BlockJUnit4ClassRunner.runChild(BlockJUnit4ClassRunner.java:63)
17:43:15 [2020-08-23T21:43:15.443Z] 	at org.junit.runners.ParentRunner$4.run(ParentRunner.java:331)
17:43:15 [2020-08-23T21:43:15.443Z] 	at org.junit.runners.ParentRunner$1.schedule(ParentRunner.java:79)
17:43:15 [2020-08-23T21:43:15.443Z] 	at org.junit.runners.ParentRunner.runChildren(ParentRunner.java:329)
17:43:15 [2020-08-23T21:43:15.443Z] 	at org.junit.runners.ParentRunner.access$100(ParentRunner.java:66)
17:43:15 [2020-08-23T21:43:15.443Z] 	at org.junit.runners.ParentRunner$2.evaluate(ParentRunner.java:293)
17:43:15 [2020-08-23T21:43:15.443Z] 	at org.junit.internal.runners.statements.RunBefores.evaluate(RunBefores.java:26)
17:43:15 [2020-08-23T21:43:15.443Z] 	at org.junit.runners.ParentRunner$3.evaluate(ParentRunner.java:306)
17:43:15 [2020-08-23T21:43:15.443Z] 	at org.junit.runners.ParentRunner.run(ParentRunner.java:413)
17:43:15 [2020-08-23T21:43:15.443Z] 	at org.apache.maven.surefire.junit4.JUnit4Provider.execute(JUnit4Provider.java:365)
17:43:15 [2020-08-23T21:43:15.443Z] 	at org.apache.maven.surefire.junit4.JUnit4Provider.executeWithRerun(JUnit4Provider.java:273)
17:43:15 [2020-08-23T21:43:15.443Z] 	at org.apache.maven.surefire.junit4.JUnit4Provider.executeTestSet(JUnit4Provider.java:238)
17:43:15 [2020-08-23T21:43:15.443Z] 	at org.apache.maven.surefire.junit4.JUnit4Provider.invoke(JUnit4Provider.java:159)
17:43:15 [2020-08-23T21:43:15.443Z] 	at sun.reflect.NativeMethodAccessorImpl.invoke0(Native Method)
17:43:15 [2020-08-23T21:43:15.443Z] 	at sun.reflect.NativeMethodAccessorImpl.invoke(NativeMethodAccessorImpl.java:62)
17:43:15 [2020-08-23T21:43:15.443Z] 	at sun.reflect.DelegatingMethodAccessorImpl.invoke(DelegatingMethodAccessorImpl.java:43)
17:43:15 [2020-08-23T21:43:15.443Z] 	at java.lang.reflect.Method.invoke(Method.java:498)
17:43:15 [2020-08-23T21:43:15.443Z] 	at org.apache.maven.surefire.util.ReflectionUtils.invokeMethodWithArray2(ReflectionUtils.java:206)
17:43:15 [2020-08-23T21:43:15.443Z] 	at org.apache.maven.surefire.booter.ProviderFactory$ProviderProxy.invoke(ProviderFactory.java:161)
17:43:15 [2020-08-23T21:43:15.443Z] 	at org.apache.maven.surefire.booter.ProviderFactory.invokeProvider(ProviderFactory.java:84)
17:43:15 [2020-08-23T21:43:15.443Z] 	at org.eclipse.tycho.surefire.osgibooter.OsgiSurefireBooter.run(OsgiSurefireBooter.java:113)
17:43:15 [2020-08-23T21:43:15.443Z] 	at org.eclipse.tycho.surefire.osgibooter.AbstractUITestApplication.runTests(AbstractUITestApplication.java:44)
17:43:15 [2020-08-23T21:43:15.443Z] 	at org.eclipse.e4.ui.internal.workbench.swt.E4Testable$1.run(E4Testable.java:73)
17:43:15 [2020-08-23T21:43:15.443Z] 	at java.lang.Thread.run(Thread.java:748)
17:43:15 [2020-08-23T21:43:15.700Z] 
17:43:15 [2020-08-23T21:43:15.700Z] !ENTRY org.eclipse.egit.ui 4 0 2020-08-23 21:43:15.637
17:43:15 [2020-08-23T21:43:15.701Z] !MESSAGE CrashingCommitMessageProvider fails on purpose.
17:43:15 [2020-08-23T21:43:15.701Z] !STACK 0
17:43:15 [2020-08-23T21:43:15.701Z] java.lang.IllegalStateException: CrashingCommitMessageProvider fails on purpose.
17:43:15 [2020-08-23T21:43:15.701Z] 	at org.eclipse.egit.ui.internal.dialogs.CommitMessageBuilderTest$CrashingCommitMessageProvider.getMessage(CommitMessageBuilderTest.java:474)
17:43:15 [2020-08-23T21:43:15.701Z] 	at org.eclipse.egit.ui.internal.dialogs.CommitMessageBuilder.build(CommitMessageBuilder.java:90)
17:43:15 [2020-08-23T21:43:15.701Z] 	at org.eclipse.egit.ui.internal.dialogs.CommitMessageBuilderTest.commitMessageProvider_multipleProvidersWithCrashAndNull(CommitMessageBuilderTest.java:165)
17:43:15 [2020-08-23T21:43:15.701Z] 	at sun.reflect.NativeMethodAccessorImpl.invoke0(Native Method)
17:43:15 [2020-08-23T21:43:15.701Z] 	at sun.reflect.NativeMethodAccessorImpl.invoke(NativeMethodAccessorImpl.java:62)
17:43:15 [2020-08-23T21:43:15.701Z] 	at sun.reflect.DelegatingMethodAccessorImpl.invoke(DelegatingMethodAccessorImpl.java:43)
17:43:15 [2020-08-23T21:43:15.701Z] 	at java.lang.reflect.Method.invoke(Method.java:498)
17:43:15 [2020-08-23T21:43:15.701Z] 	at org.junit.runners.model.FrameworkMethod$1.runReflectiveCall(FrameworkMethod.java:59)
17:43:15 [2020-08-23T21:43:15.701Z] 	at org.junit.internal.runners.model.ReflectiveCallable.run(ReflectiveCallable.java:12)
17:43:15 [2020-08-23T21:43:15.701Z] 	at org.junit.runners.model.FrameworkMethod.invokeExplosively(FrameworkMethod.java:56)
17:43:15 [2020-08-23T21:43:15.701Z] 	at org.junit.internal.runners.statements.InvokeMethod.evaluate(InvokeMethod.java:17)
17:43:15 [2020-08-23T21:43:15.701Z] 	at org.junit.internal.runners.statements.RunBefores.evaluate(RunBefores.java:26)
17:43:15 [2020-08-23T21:43:15.701Z] 	at org.junit.internal.runners.statements.RunAfters.evaluate(RunAfters.java:27)
17:43:15 [2020-08-23T21:43:15.701Z] 	at org.junit.runners.ParentRunner$3.evaluate(ParentRunner.java:306)
17:43:15 [2020-08-23T21:43:15.701Z] 	at org.junit.runners.BlockJUnit4ClassRunner$1.evaluate(BlockJUnit4ClassRunner.java:100)
17:43:15 [2020-08-23T21:43:15.701Z] 	at org.junit.runners.ParentRunner.runLeaf(ParentRunner.java:366)
17:43:15 [2020-08-23T21:43:15.701Z] 	at org.junit.runners.BlockJUnit4ClassRunner.runChild(BlockJUnit4ClassRunner.java:103)
17:43:15 [2020-08-23T21:43:15.701Z] 	at org.junit.runners.BlockJUnit4ClassRunner.runChild(BlockJUnit4ClassRunner.java:63)
17:43:15 [2020-08-23T21:43:15.701Z] 	at org.junit.runners.ParentRunner$4.run(ParentRunner.java:331)
17:43:15 [2020-08-23T21:43:15.701Z] 	at org.junit.runners.ParentRunner$1.schedule(ParentRunner.java:79)
17:43:15 [2020-08-23T21:43:15.701Z] 	at org.junit.runners.ParentRunner.runChildren(ParentRunner.java:329)
17:43:15 [2020-08-23T21:43:15.701Z] 	at org.junit.runners.ParentRunner.access$100(ParentRunner.java:66)
17:43:15 [2020-08-23T21:43:15.701Z] 	at org.junit.runners.ParentRunner$2.evaluate(ParentRunner.java:293)
17:43:15 [2020-08-23T21:43:15.701Z] 	at org.junit.internal.runners.statements.RunBefores.evaluate(RunBefores.java:26)
17:43:15 [2020-08-23T21:43:15.701Z] 	at org.junit.runners.ParentRunner$3.evaluate(ParentRunner.java:306)
17:43:15 [2020-08-23T21:43:15.701Z] 	at org.junit.runners.ParentRunner.run(ParentRunner.java:413)
17:43:15 [2020-08-23T21:43:15.701Z] 	at org.apache.maven.surefire.junit4.JUnit4Provider.execute(JUnit4Provider.java:365)
17:43:15 [2020-08-23T21:43:15.701Z] 	at org.apache.maven.surefire.junit4.JUnit4Provider.executeWithRerun(JUnit4Provider.java:273)
17:43:15 [2020-08-23T21:43:15.701Z] 	at org.apache.maven.surefire.junit4.JUnit4Provider.executeTestSet(JUnit4Provider.java:238)
17:43:15 [2020-08-23T21:43:15.701Z] 	at org.apache.maven.surefire.junit4.JUnit4Provider.invoke(JUnit4Provider.java:159)
17:43:15 [2020-08-23T21:43:15.701Z] 	at sun.reflect.NativeMethodAccessorImpl.invoke0(Native Method)
17:43:15 [2020-08-23T21:43:15.701Z] 	at sun.reflect.NativeMethodAccessorImpl.invoke(NativeMethodAccessorImpl.java:62)
17:43:15 [2020-08-23T21:43:15.701Z] 	at sun.reflect.DelegatingMethodAccessorImpl.invoke(DelegatingMethodAccessorImpl.java:43)
17:43:15 [2020-08-23T21:43:15.701Z] 	at java.lang.reflect.Method.invoke(Method.java:498)
17:43:15 [2020-08-23T21:43:15.701Z] 	at org.apache.maven.surefire.util.ReflectionUtils.invokeMethodWithArray2(ReflectionUtils.java:206)
17:43:15 [2020-08-23T21:43:15.701Z] 	at org.apache.maven.surefire.booter.ProviderFactory$ProviderProxy.invoke(ProviderFactory.java:161)
17:43:15 [2020-08-23T21:43:15.701Z] 	at org.apache.maven.surefire.booter.ProviderFactory.invokeProvider(ProviderFactory.java:84)
17:43:15 [2020-08-23T21:43:15.701Z] 	at org.eclipse.tycho.surefire.osgibooter.OsgiSurefireBooter.run(OsgiSurefireBooter.java:113)
17:43:15 [2020-08-23T21:43:15.701Z] 	at org.eclipse.tycho.surefire.osgibooter.AbstractUITestApplication.runTests(AbstractUITestApplication.java:44)
17:43:15 [2020-08-23T21:43:15.701Z] 	at org.eclipse.e4.ui.internal.workbench.swt.E4Testable$1.run(E4Testable.java:73)
17:43:15 [2020-08-23T21:43:15.701Z] 	at java.lang.Thread.run(Thread.java:748)
17:43:15 [2020-08-23T21:43:15.701Z] 
17:43:15 [2020-08-23T21:43:15.701Z] !ENTRY org.eclipse.egit.ui 4 0 2020-08-23 21:43:15.638
17:43:15 [2020-08-23T21:43:15.701Z] !MESSAGE CrashingCommitMessageProvider fails on purpose.
17:43:15 [2020-08-23T21:43:15.701Z] !STACK 0
17:43:15 [2020-08-23T21:43:15.701Z] java.lang.IllegalStateException: CrashingCommitMessageProvider fails on purpose.
17:43:15 [2020-08-23T21:43:15.701Z] 	at org.eclipse.egit.ui.internal.dialogs.CommitMessageBuilderTest$CrashingCommitMessageProvider.getMessage(CommitMessageBuilderTest.java:474)
17:43:15 [2020-08-23T21:43:15.701Z] 	at org.eclipse.egit.ui.internal.dialogs.CommitMessageBuilder.build(CommitMessageBuilder.java:90)
17:43:15 [2020-08-23T21:43:15.701Z] 	at org.eclipse.egit.ui.internal.dialogs.CommitMessageBuilderTest.commitMessageProvider_multipleProvidersWithCrashAndNull(CommitMessageBuilderTest.java:165)
17:43:15 [2020-08-23T21:43:15.701Z] 	at sun.reflect.NativeMethodAccessorImpl.invoke0(Native Method)
17:43:15 [2020-08-23T21:43:15.701Z] 	at sun.reflect.NativeMethodAccessorImpl.invoke(NativeMethodAccessorImpl.java:62)
17:43:15 [2020-08-23T21:43:15.701Z] 	at sun.reflect.DelegatingMethodAccessorImpl.invoke(DelegatingMethodAccessorImpl.java:43)
17:43:15 [2020-08-23T21:43:15.701Z] 	at java.lang.reflect.Method.invoke(Method.java:498)
17:43:15 [2020-08-23T21:43:15.701Z] 	at org.junit.runners.model.FrameworkMethod$1.runReflectiveCall(FrameworkMethod.java:59)
17:43:15 [2020-08-23T21:43:15.701Z] 	at org.junit.internal.runners.model.ReflectiveCallable.run(ReflectiveCallable.java:12)
17:43:15 [2020-08-23T21:43:15.701Z] 	at org.junit.runners.model.FrameworkMethod.invokeExplosively(FrameworkMethod.java:56)
17:43:15 [2020-08-23T21:43:15.701Z] 	at org.junit.internal.runners.statements.InvokeMethod.evaluate(InvokeMethod.java:17)
17:43:15 [2020-08-23T21:43:15.701Z] 	at org.junit.internal.runners.statements.RunBefores.evaluate(RunBefores.java:26)
17:43:15 [2020-08-23T21:43:15.701Z] 	at org.junit.internal.runners.statements.RunAfters.evaluate(RunAfters.java:27)
17:43:15 [2020-08-23T21:43:15.701Z] 	at org.junit.runners.ParentRunner$3.evaluate(ParentRunner.java:306)
17:43:15 [2020-08-23T21:43:15.701Z] 	at org.junit.runners.BlockJUnit4ClassRunner$1.evaluate(BlockJUnit4ClassRunner.java:100)
17:43:15 [2020-08-23T21:43:15.701Z] 	at org.junit.runners.ParentRunner.runLeaf(ParentRunner.java:366)
17:43:15 [2020-08-23T21:43:15.701Z] 	at org.junit.runners.BlockJUnit4ClassRunner.runChild(BlockJUnit4ClassRunner.java:103)
17:43:15 [2020-08-23T21:43:15.701Z] 	at org.junit.runners.BlockJUnit4ClassRunner.runChild(BlockJUnit4ClassRunner.java:63)
17:43:15 [2020-08-23T21:43:15.701Z] 	at org.junit.runners.ParentRunner$4.run(ParentRunner.java:331)
17:43:15 [2020-08-23T21:43:15.701Z] 	at org.junit.runners.ParentRunner$1.schedule(ParentRunner.java:79)
17:43:15 [2020-08-23T21:43:15.701Z] 	at org.junit.runners.ParentRunner.runChildren(ParentRunner.java:329)
17:43:15 [2020-08-23T21:43:15.701Z] 	at org.junit.runners.ParentRunner.access$100(ParentRunner.java:66)
17:43:15 [2020-08-23T21:43:15.701Z] 	at org.junit.runners.ParentRunner$2.evaluate(ParentRunner.java:293)
17:43:15 [2020-08-23T21:43:15.701Z] 	at org.junit.internal.runners.statements.RunBefores.evaluate(RunBefores.java:26)
17:43:15 [2020-08-23T21:43:15.701Z] 	at org.junit.runners.ParentRunner$3.evaluate(ParentRunner.java:306)
17:43:15 [2020-08-23T21:43:15.701Z] 	at org.junit.runners.ParentRunner.run(ParentRunner.java:413)
17:43:15 [2020-08-23T21:43:15.701Z] 	at org.apache.maven.surefire.junit4.JUnit4Provider.execute(JUnit4Provider.java:365)
17:43:15 [2020-08-23T21:43:15.701Z] 	at org.apache.maven.surefire.junit4.JUnit4Provider.executeWithRerun(JUnit4Provider.java:273)
17:43:15 [2020-08-23T21:43:15.701Z] 	at org.apache.maven.surefire.junit4.JUnit4Provider.executeTestSet(JUnit4Provider.java:238)
17:43:15 [2020-08-23T21:43:15.701Z] 	at org.apache.maven.surefire.junit4.JUnit4Provider.invoke(JUnit4Provider.java:159)
17:43:15 [2020-08-23T21:43:15.701Z] 	at sun.reflect.NativeMethodAccessorImpl.invoke0(Native Method)
17:43:15 [2020-08-23T21:43:15.701Z] 	at sun.reflect.NativeMethodAccessorImpl.invoke(NativeMethodAccessorImpl.java:62)
17:43:15 [2020-08-23T21:43:15.701Z] 	at sun.reflect.DelegatingMethodAccessorImpl.invoke(DelegatingMethodAccessorImpl.java:43)
17:43:15 [2020-08-23T21:43:15.701Z] 	at java.lang.reflect.Method.invoke(Method.java:498)
17:43:15 [2020-08-23T21:43:15.701Z] 	at org.apache.maven.surefire.util.ReflectionUtils.invokeMethodWithArray2(ReflectionUtils.java:206)
17:43:15 [2020-08-23T21:43:15.701Z] 	at org.apache.maven.surefire.booter.ProviderFactory$ProviderProxy.invoke(ProviderFactory.java:161)
17:43:15 [2020-08-23T21:43:15.701Z] 	at org.apache.maven.surefire.booter.ProviderFactory.invokeProvider(ProviderFactory.java:84)
17:43:15 [2020-08-23T21:43:15.701Z] 	at org.eclipse.tycho.surefire.osgibooter.OsgiSurefireBooter.run(OsgiSurefireBooter.java:113)
17:43:15 [2020-08-23T21:43:15.701Z] 	at org.eclipse.tycho.surefire.osgibooter.AbstractUITestApplication.runTests(AbstractUITestApplication.java:44)
17:43:15 [2020-08-23T21:43:15.701Z] 	at org.eclipse.e4.ui.internal.workbench.swt.E4Testable$1.run(E4Testable.java:73)
17:43:15 [2020-08-23T21:43:15.701Z] 	at java.lang.Thread.run(Thread.java:748)
17:43:15 [2020-08-23T21:43:15.958Z] 
17:43:15 [2020-08-23T21:43:15.958Z] !ENTRY org.eclipse.egit.ui 2 0 2020-08-23 21:43:15.728
17:43:15 [2020-08-23T21:43:15.958Z] !MESSAGE The ICommitMessageProvider2 implementation org.eclipse.egit.ui.internal.dialogs.CommitMessageBuilderTest$3 provided the caret position -42, which exceeds the length of the commit message or is negative. The caret position is ignored.
17:43:17 [2020-08-23T21:43:17.333Z] 
17:43:17 [2020-08-23T21:43:17.333Z] !ENTRY org.eclipse.egit.ui 2 0 2020-08-23 21:43:17.189
17:43:17 [2020-08-23T21:43:17.333Z] !MESSAGE Found multiple implementations of ICommitMessageProvider2. Ignoring caret positioning for org.eclipse.egit.ui.internal.dialogs.CommitMessageBuilderTest$3.
17:43:18 [2020-08-23T21:43:18.706Z] 
17:43:18 [2020-08-23T21:43:18.706Z] !ENTRY org.eclipse.egit.ui 4 0 2020-08-23 21:43:18.564
17:43:18 [2020-08-23T21:43:18.706Z] !MESSAGE CrashingCommitMessageProvider fails on purpose.
17:43:18 [2020-08-23T21:43:18.706Z] !STACK 0
17:43:18 [2020-08-23T21:43:18.706Z] java.lang.IllegalStateException: CrashingCommitMessageProvider fails on purpose.
17:43:18 [2020-08-23T21:43:18.706Z] 	at org.eclipse.egit.ui.internal.dialogs.CommitMessageBuilderTest$CrashingCommitMessageProvider.getMessage(CommitMessageBuilderTest.java:474)
17:43:18 [2020-08-23T21:43:18.706Z] 	at org.eclipse.egit.ui.internal.dialogs.CommitMessageBuilder.build(CommitMessageBuilder.java:90)
17:43:18 [2020-08-23T21:43:18.706Z] 	at org.eclipse.egit.ui.internal.dialogs.CommitMessageBuilderTest.commitMessageProvider_twoProvidersSecondOneCrashing(CommitMessageBuilderTest.java:130)
17:43:18 [2020-08-23T21:43:18.706Z] 	at sun.reflect.NativeMethodAccessorImpl.invoke0(Native Method)
17:43:18 [2020-08-23T21:43:18.706Z] 	at sun.reflect.NativeMethodAccessorImpl.invoke(NativeMethodAccessorImpl.java:62)
17:43:18 [2020-08-23T21:43:18.706Z] 	at sun.reflect.DelegatingMethodAccessorImpl.invoke(DelegatingMethodAccessorImpl.java:43)
17:43:18 [2020-08-23T21:43:18.706Z] 	at java.lang.reflect.Method.invoke(Method.java:498)
17:43:18 [2020-08-23T21:43:18.706Z] 	at org.junit.runners.model.FrameworkMethod$1.runReflectiveCall(FrameworkMethod.java:59)
17:43:18 [2020-08-23T21:43:18.706Z] 	at org.junit.internal.runners.model.ReflectiveCallable.run(ReflectiveCallable.java:12)
17:43:18 [2020-08-23T21:43:18.706Z] 	at org.junit.runners.model.FrameworkMethod.invokeExplosively(FrameworkMethod.java:56)
17:43:18 [2020-08-23T21:43:18.706Z] 	at org.junit.internal.runners.statements.InvokeMethod.evaluate(InvokeMethod.java:17)
17:43:18 [2020-08-23T21:43:18.706Z] 	at org.junit.internal.runners.statements.RunBefores.evaluate(RunBefores.java:26)
17:43:18 [2020-08-23T21:43:18.706Z] 	at org.junit.internal.runners.statements.RunAfters.evaluate(RunAfters.java:27)
17:43:18 [2020-08-23T21:43:18.706Z] 	at org.junit.runners.ParentRunner$3.evaluate(ParentRunner.java:306)
17:43:18 [2020-08-23T21:43:18.706Z] 	at org.junit.runners.BlockJUnit4ClassRunner$1.evaluate(BlockJUnit4ClassRunner.java:100)
17:43:18 [2020-08-23T21:43:18.706Z] 	at org.junit.runners.ParentRunner.runLeaf(ParentRunner.java:366)
17:43:18 [2020-08-23T21:43:18.706Z] 	at org.junit.runners.BlockJUnit4ClassRunner.runChild(BlockJUnit4ClassRunner.java:103)
17:43:18 [2020-08-23T21:43:18.706Z] 	at org.junit.runners.BlockJUnit4ClassRunner.runChild(BlockJUnit4ClassRunner.java:63)
17:43:18 [2020-08-23T21:43:18.706Z] 	at org.junit.runners.ParentRunner$4.run(ParentRunner.java:331)
17:43:18 [2020-08-23T21:43:18.706Z] 	at org.junit.runners.ParentRunner$1.schedule(ParentRunner.java:79)
17:43:18 [2020-08-23T21:43:18.706Z] 	at org.junit.runners.ParentRunner.runChildren(ParentRunner.java:329)
17:43:18 [2020-08-23T21:43:18.706Z] 	at org.junit.runners.ParentRunner.access$100(ParentRunner.java:66)
17:43:18 [2020-08-23T21:43:18.706Z] 	at org.junit.runners.ParentRunner$2.evaluate(ParentRunner.java:293)
17:43:18 [2020-08-23T21:43:18.706Z] 	at org.junit.internal.runners.statements.RunBefores.evaluate(RunBefores.java:26)
17:43:18 [2020-08-23T21:43:18.706Z] 	at org.junit.runners.ParentRunner$3.evaluate(ParentRunner.java:306)
17:43:18 [2020-08-23T21:43:18.706Z] 	at org.junit.runners.ParentRunner.run(ParentRunner.java:413)
17:43:18 [2020-08-23T21:43:18.706Z] 	at org.apache.maven.surefire.junit4.JUnit4Provider.execute(JUnit4Provider.java:365)
17:43:18 [2020-08-23T21:43:18.706Z] 	at org.apache.maven.surefire.junit4.JUnit4Provider.executeWithRerun(JUnit4Provider.java:273)
17:43:18 [2020-08-23T21:43:18.706Z] 	at org.apache.maven.surefire.junit4.JUnit4Provider.executeTestSet(JUnit4Provider.java:238)
17:43:18 [2020-08-23T21:43:18.706Z] 	at org.apache.maven.surefire.junit4.JUnit4Provider.invoke(JUnit4Provider.java:159)
17:43:18 [2020-08-23T21:43:18.706Z] 	at sun.reflect.NativeMethodAccessorImpl.invoke0(Native Method)
17:43:18 [2020-08-23T21:43:18.706Z] 	at sun.reflect.NativeMethodAccessorImpl.invoke(NativeMethodAccessorImpl.java:62)
17:43:18 [2020-08-23T21:43:18.706Z] 	at sun.reflect.DelegatingMethodAccessorImpl.invoke(DelegatingMethodAccessorImpl.java:43)
17:43:18 [2020-08-23T21:43:18.706Z] 	at java.lang.reflect.Method.invoke(Method.java:498)
17:43:18 [2020-08-23T21:43:18.706Z] 	at org.apache.maven.surefire.util.ReflectionUtils.invokeMethodWithArray2(ReflectionUtils.java:206)
17:43:18 [2020-08-23T21:43:18.706Z] 	at org.apache.maven.surefire.booter.ProviderFactory$ProviderProxy.invoke(ProviderFactory.java:161)
17:43:18 [2020-08-23T21:43:18.706Z] 	at org.apache.maven.surefire.booter.ProviderFactory.invokeProvider(ProviderFactory.java:84)
17:43:18 [2020-08-23T21:43:18.706Z] 	at org.eclipse.tycho.surefire.osgibooter.OsgiSurefireBooter.run(OsgiSurefireBooter.java:113)
17:43:18 [2020-08-23T21:43:18.706Z] 	at org.eclipse.tycho.surefire.osgibooter.AbstractUITestApplication.runTests(AbstractUITestApplication.java:44)
17:43:18 [2020-08-23T21:43:18.706Z] 	at org.eclipse.e4.ui.internal.workbench.swt.E4Testable$1.run(E4Testable.java:73)
17:43:18 [2020-08-23T21:43:18.706Z] 	at java.lang.Thread.run(Thread.java:748)
17:43:18 [2020-08-23T21:43:18.706Z] 
17:43:18 [2020-08-23T21:43:18.706Z] !ENTRY org.eclipse.egit.ui 4 0 2020-08-23 21:43:18.648
17:43:18 [2020-08-23T21:43:18.706Z] !MESSAGE CrashingCommitMessageProvider fails on purpose.
17:43:18 [2020-08-23T21:43:18.706Z] !STACK 0
17:43:18 [2020-08-23T21:43:18.706Z] java.lang.IllegalStateException: CrashingCommitMessageProvider fails on purpose.
17:43:18 [2020-08-23T21:43:18.706Z] 	at org.eclipse.egit.ui.internal.dialogs.CommitMessageBuilderTest$CrashingCommitMessageProvider.getMessage(CommitMessageBuilderTest.java:474)
17:43:18 [2020-08-23T21:43:18.706Z] 	at org.eclipse.egit.ui.internal.dialogs.CommitMessageBuilder.build(CommitMessageBuilder.java:90)
17:43:18 [2020-08-23T21:43:18.706Z] 	at org.eclipse.egit.ui.internal.dialogs.CommitMessageBuilderTest.commitMessageProvider_multipleProvidersWithCrashingAndNullAndOneCaretPositioning(CommitMessageBuilderTest.java:414)
17:43:18 [2020-08-23T21:43:18.706Z] 	at sun.reflect.NativeMethodAccessorImpl.invoke0(Native Method)
17:43:18 [2020-08-23T21:43:18.706Z] 	at sun.reflect.NativeMethodAccessorImpl.invoke(NativeMethodAccessorImpl.java:62)
17:43:18 [2020-08-23T21:43:18.706Z] 	at sun.reflect.DelegatingMethodAccessorImpl.invoke(DelegatingMethodAccessorImpl.java:43)
17:43:18 [2020-08-23T21:43:18.706Z] 	at java.lang.reflect.Method.invoke(Method.java:498)
17:43:18 [2020-08-23T21:43:18.706Z] 	at org.junit.runners.model.FrameworkMethod$1.runReflectiveCall(FrameworkMethod.java:59)
17:43:18 [2020-08-23T21:43:18.706Z] 	at org.junit.internal.runners.model.ReflectiveCallable.run(ReflectiveCallable.java:12)
17:43:18 [2020-08-23T21:43:18.706Z] 	at org.junit.runners.model.FrameworkMethod.invokeExplosively(FrameworkMethod.java:56)
17:43:18 [2020-08-23T21:43:18.706Z] 	at org.junit.internal.runners.statements.InvokeMethod.evaluate(InvokeMethod.java:17)
17:43:18 [2020-08-23T21:43:18.706Z] 	at org.junit.internal.runners.statements.RunBefores.evaluate(RunBefores.java:26)
17:43:18 [2020-08-23T21:43:18.706Z] 	at org.junit.internal.runners.statements.RunAfters.evaluate(RunAfters.java:27)
17:43:18 [2020-08-23T21:43:18.706Z] 	at org.junit.runners.ParentRunner$3.evaluate(ParentRunner.java:306)
17:43:18 [2020-08-23T21:43:18.706Z] 	at org.junit.runners.BlockJUnit4ClassRunner$1.evaluate(BlockJUnit4ClassRunner.java:100)
17:43:18 [2020-08-23T21:43:18.706Z] 	at org.junit.runners.ParentRunner.runLeaf(ParentRunner.java:366)
17:43:18 [2020-08-23T21:43:18.706Z] 	at org.junit.runners.BlockJUnit4ClassRunner.runChild(BlockJUnit4ClassRunner.java:103)
17:43:18 [2020-08-23T21:43:18.706Z] 	at org.junit.runners.BlockJUnit4ClassRunner.runChild(BlockJUnit4ClassRunner.java:63)
17:43:18 [2020-08-23T21:43:18.706Z] 	at org.junit.runners.ParentRunner$4.run(ParentRunner.java:331)
17:43:18 [2020-08-23T21:43:18.706Z] 	at org.junit.runners.ParentRunner$1.schedule(ParentRunner.java:79)
17:43:18 [2020-08-23T21:43:18.706Z] 	at org.junit.runners.ParentRunner.runChildren(ParentRunner.java:329)
17:43:18 [2020-08-23T21:43:18.706Z] 	at org.junit.runners.ParentRunner.access$100(ParentRunner.java:66)
17:43:18 [2020-08-23T21:43:18.706Z] 	at org.junit.runners.ParentRunner$2.evaluate(ParentRunner.java:293)
17:43:18 [2020-08-23T21:43:18.706Z] 	at org.junit.internal.runners.statements.RunBefores.evaluate(RunBefores.java:26)
17:43:18 [2020-08-23T21:43:18.706Z] 	at org.junit.runners.ParentRunner$3.evaluate(ParentRunner.java:306)
17:43:18 [2020-08-23T21:43:18.706Z] 	at org.junit.runners.ParentRunner.run(ParentRunner.java:413)
17:43:18 [2020-08-23T21:43:18.706Z] 	at org.apache.maven.surefire.junit4.JUnit4Provider.execute(JUnit4Provider.java:365)
17:43:18 [2020-08-23T21:43:18.706Z] 	at org.apache.maven.surefire.junit4.JUnit4Provider.executeWithRerun(JUnit4Provider.java:273)
17:43:18 [2020-08-23T21:43:18.706Z] 	at org.apache.maven.surefire.junit4.JUnit4Provider.executeTestSet(JUnit4Provider.java:238)
17:43:18 [2020-08-23T21:43:18.706Z] 	at org.apache.maven.surefire.junit4.JUnit4Provider.invoke(JUnit4Provider.java:159)
17:43:18 [2020-08-23T21:43:18.706Z] 	at sun.reflect.NativeMethodAccessorImpl.invoke0(Native Method)
17:43:18 [2020-08-23T21:43:18.706Z] 	at sun.reflect.NativeMethodAccessorImpl.invoke(NativeMethodAccessorImpl.java:62)
17:43:18 [2020-08-23T21:43:18.706Z] 	at sun.reflect.DelegatingMethodAccessorImpl.invoke(DelegatingMethodAccessorImpl.java:43)
17:43:18 [2020-08-23T21:43:18.706Z] 	at java.lang.reflect.Method.invoke(Method.java:498)
17:43:18 [2020-08-23T21:43:18.706Z] 	at org.apache.maven.surefire.util.ReflectionUtils.invokeMethodWithArray2(ReflectionUtils.java:206)
17:43:18 [2020-08-23T21:43:18.706Z] 	at org.apache.maven.surefire.booter.ProviderFactory$ProviderProxy.invoke(ProviderFactory.java:161)
17:43:18 [2020-08-23T21:43:18.706Z] 	at org.apache.maven.surefire.booter.ProviderFactory.invokeProvider(ProviderFactory.java:84)
17:43:18 [2020-08-23T21:43:18.706Z] 	at org.eclipse.tycho.surefire.osgibooter.OsgiSurefireBooter.run(OsgiSurefireBooter.java:113)
17:43:18 [2020-08-23T21:43:18.706Z] 	at org.eclipse.tycho.surefire.osgibooter.AbstractUITestApplication.runTests(AbstractUITestApplication.java:44)
17:43:18 [2020-08-23T21:43:18.706Z] 	at org.eclipse.e4.ui.internal.workbench.swt.E4Testable$1.run(E4Testable.java:73)
17:43:18 [2020-08-23T21:43:18.706Z] 	at java.lang.Thread.run(Thread.java:748)
17:43:18 [2020-08-23T21:43:18.706Z] 
17:43:18 [2020-08-23T21:43:18.706Z] !ENTRY org.eclipse.egit.ui 4 0 2020-08-23 21:43:18.648
17:43:18 [2020-08-23T21:43:18.706Z] !MESSAGE CrashingCommitMessageProvider fails on purpose.
17:43:18 [2020-08-23T21:43:18.706Z] !STACK 0
17:43:18 [2020-08-23T21:43:18.706Z] java.lang.IllegalStateException: CrashingCommitMessageProvider fails on purpose.
17:43:18 [2020-08-23T21:43:18.707Z] 	at org.eclipse.egit.ui.internal.dialogs.CommitMessageBuilderTest$CrashingCommitMessageProvider.getMessage(CommitMessageBuilderTest.java:474)
17:43:18 [2020-08-23T21:43:18.707Z] 	at org.eclipse.egit.ui.internal.dialogs.CommitMessageBuilder.build(CommitMessageBuilder.java:90)
17:43:18 [2020-08-23T21:43:18.707Z] 	at org.eclipse.egit.ui.internal.dialogs.CommitMessageBuilderTest.commitMessageProvider_multipleProvidersWithCrashingAndNullAndOneCaretPositioning(CommitMessageBuilderTest.java:414)
17:43:18 [2020-08-23T21:43:18.707Z] 	at sun.reflect.NativeMethodAccessorImpl.invoke0(Native Method)
17:43:18 [2020-08-23T21:43:18.707Z] 	at sun.reflect.NativeMethodAccessorImpl.invoke(NativeMethodAccessorImpl.java:62)
17:43:18 [2020-08-23T21:43:18.707Z] 	at sun.reflect.DelegatingMethodAccessorImpl.invoke(DelegatingMethodAccessorImpl.java:43)
17:43:18 [2020-08-23T21:43:18.707Z] 	at java.lang.reflect.Method.invoke(Method.java:498)
17:43:18 [2020-08-23T21:43:18.707Z] 	at org.junit.runners.model.FrameworkMethod$1.runReflectiveCall(FrameworkMethod.java:59)
17:43:18 [2020-08-23T21:43:18.707Z] 	at org.junit.internal.runners.model.ReflectiveCallable.run(ReflectiveCallable.java:12)
17:43:18 [2020-08-23T21:43:18.707Z] 	at org.junit.runners.model.FrameworkMethod.invokeExplosively(FrameworkMethod.java:56)
17:43:18 [2020-08-23T21:43:18.707Z] 	at org.junit.internal.runners.statements.InvokeMethod.evaluate(InvokeMethod.java:17)
17:43:18 [2020-08-23T21:43:18.707Z] 	at org.junit.internal.runners.statements.RunBefores.evaluate(RunBefores.java:26)
17:43:18 [2020-08-23T21:43:18.707Z] 	at org.junit.internal.runners.statements.RunAfters.evaluate(RunAfters.java:27)
17:43:18 [2020-08-23T21:43:18.707Z] 	at org.junit.runners.ParentRunner$3.evaluate(ParentRunner.java:306)
17:43:18 [2020-08-23T21:43:18.707Z] 	at org.junit.runners.BlockJUnit4ClassRunner$1.evaluate(BlockJUnit4ClassRunner.java:100)
17:43:18 [2020-08-23T21:43:18.707Z] 	at org.junit.runners.ParentRunner.runLeaf(ParentRunner.java:366)
17:43:18 [2020-08-23T21:43:18.707Z] 	at org.junit.runners.BlockJUnit4ClassRunner.runChild(BlockJUnit4ClassRunner.java:103)
17:43:18 [2020-08-23T21:43:18.707Z] 	at org.junit.runners.BlockJUnit4ClassRunner.runChild(BlockJUnit4ClassRunner.java:63)
17:43:18 [2020-08-23T21:43:18.707Z] 	at org.junit.runners.ParentRunner$4.run(ParentRunner.java:331)
17:43:18 [2020-08-23T21:43:18.707Z] 	at org.junit.runners.ParentRunner$1.schedule(ParentRunner.java:79)
17:43:18 [2020-08-23T21:43:18.707Z] 	at org.junit.runners.ParentRunner.runChildren(ParentRunner.java:329)
17:43:18 [2020-08-23T21:43:18.707Z] 	at org.junit.runners.ParentRunner.access$100(ParentRunner.java:66)
17:43:18 [2020-08-23T21:43:18.707Z] 	at org.junit.runners.ParentRunner$2.evaluate(ParentRunner.java:293)
17:43:18 [2020-08-23T21:43:18.707Z] 	at org.junit.internal.runners.statements.RunBefores.evaluate(RunBefores.java:26)
17:43:18 [2020-08-23T21:43:18.707Z] 	at org.junit.runners.ParentRunner$3.evaluate(ParentRunner.java:306)
17:43:18 [2020-08-23T21:43:18.707Z] 	at org.junit.runners.ParentRunner.run(ParentRunner.java:413)
17:43:18 [2020-08-23T21:43:18.707Z] 	at org.apache.maven.surefire.junit4.JUnit4Provider.execute(JUnit4Provider.java:365)
17:43:18 [2020-08-23T21:43:18.707Z] 	at org.apache.maven.surefire.junit4.JUnit4Provider.executeWithRerun(JUnit4Provider.java:273)
17:43:18 [2020-08-23T21:43:18.707Z] 	at org.apache.maven.surefire.junit4.JUnit4Provider.executeTestSet(JUnit4Provider.java:238)
17:43:18 [2020-08-23T21:43:18.707Z] 	at org.apache.maven.surefire.junit4.JUnit4Provider.invoke(JUnit4Provider.java:159)
17:43:18 [2020-08-23T21:43:18.707Z] 	at sun.reflect.NativeMethodAccessorImpl.invoke0(Native Method)
17:43:18 [2020-08-23T21:43:18.707Z] 	at sun.reflect.NativeMethodAccessorImpl.invoke(NativeMethodAccessorImpl.java:62)
17:43:18 [2020-08-23T21:43:18.707Z] 	at sun.reflect.DelegatingMethodAccessorImpl.invoke(DelegatingMethodAccessorImpl.java:43)
17:43:18 [2020-08-23T21:43:18.707Z] 	at java.lang.reflect.Method.invoke(Method.java:498)
17:43:18 [2020-08-23T21:43:18.707Z] 	at org.apache.maven.surefire.util.ReflectionUtils.invokeMethodWithArray2(ReflectionUtils.java:206)
17:43:18 [2020-08-23T21:43:18.707Z] 	at org.apache.maven.surefire.booter.ProviderFactory$ProviderProxy.invoke(ProviderFactory.java:161)
17:43:18 [2020-08-23T21:43:18.707Z] 	at org.apache.maven.surefire.booter.ProviderFactory.invokeProvider(ProviderFactory.java:84)
17:43:18 [2020-08-23T21:43:18.707Z] 	at org.eclipse.tycho.surefire.osgibooter.OsgiSurefireBooter.run(OsgiSurefireBooter.java:113)
17:43:18 [2020-08-23T21:43:18.707Z] 	at org.eclipse.tycho.surefire.osgibooter.AbstractUITestApplication.runTests(AbstractUITestApplication.java:44)
17:43:18 [2020-08-23T21:43:18.707Z] 	at org.eclipse.e4.ui.internal.workbench.swt.E4Testable$1.run(E4Testable.java:73)
17:43:18 [2020-08-23T21:43:18.707Z] 	at java.lang.Thread.run(Thread.java:748)
17:43:18 [2020-08-23T21:43:18.964Z] 
17:43:18 [2020-08-23T21:43:18.964Z] !ENTRY org.eclipse.egit.ui 2 0 2020-08-23 21:43:18.730
17:43:18 [2020-08-23T21:43:18.964Z] !MESSAGE Found multiple implementations of ICommitMessageProvider2. Ignoring caret positioning for org.eclipse.egit.ui.internal.dialogs.CommitMessageBuilderTest$3.
17:43:18 [2020-08-23T21:43:18.964Z] 
17:43:18 [2020-08-23T21:43:18.964Z] !ENTRY org.eclipse.egit.ui 2 0 2020-08-23 21:43:18.822
17:43:18 [2020-08-23T21:43:18.964Z] !MESSAGE The ICommitMessageProvider2 implementation org.eclipse.egit.ui.internal.dialogs.CommitMessageBuilderTest$3 provided the caret position 14, which exceeds the length of the commit message or is negative. The caret position is ignored.
17:43:18 [2020-08-23T21:43:18.964Z] Tests run: 20, Failures: 0, Errors: 0, Skipped: 0, Time elapsed: 4.915 s - in org.eclipse.egit.ui.internal.dialogs.CommitMessageBuilderTest
17:43:18 [2020-08-23T21:43:18.964Z] commitMessageProvider_oneCrashingProvider(org.eclipse.egit.ui.internal.dialogs.CommitMessageBuilderTest)  Time elapsed: 0.098 s
17:43:18 [2020-08-23T21:43:18.964Z] commitMessageProvider_twoProvidersSecondWithCaretPositioning(org.eclipse.egit.ui.internal.dialogs.CommitMessageBuilderTest)  Time elapsed: 0.09 s
17:43:18 [2020-08-23T21:43:18.964Z] commitMessageProvider_oneCrashingProviderWithCaretPosition(org.eclipse.egit.ui.internal.dialogs.CommitMessageBuilderTest)  Time elapsed: 1.185 s
17:43:18 [2020-08-23T21:43:18.964Z] commitMessageProvider_twoProvidersFirstOneCrashing(org.eclipse.egit.ui.internal.dialogs.CommitMessageBuilderTest)  Time elapsed: 0.099 s
17:43:18 [2020-08-23T21:43:18.964Z] commitMessageProvider_noProvider(org.eclipse.egit.ui.internal.dialogs.CommitMessageBuilderTest)  Time elapsed: 0.085 s
17:43:18 [2020-08-23T21:43:18.964Z] commitMessageProvider_oneProvider(org.eclipse.egit.ui.internal.dialogs.CommitMessageBuilderTest)  Time elapsed: 0.084 s
17:43:18 [2020-08-23T21:43:18.964Z] commitMessageProvider_multipleProvidersWithCrashAndNull(org.eclipse.egit.ui.internal.dialogs.CommitMessageBuilderTest)  Time elapsed: 0.089 s
17:43:18 [2020-08-23T21:43:18.964Z] commitMessageProvider_oneProviderWithInvalidNegativeCaretPosition(org.eclipse.egit.ui.internal.dialogs.CommitMessageBuilderTest)  Time elapsed: 0.089 s
17:43:18 [2020-08-23T21:43:18.965Z] commitMessageProvider_twoProvidersSecondWithUndefinedCaretPosition(org.eclipse.egit.ui.internal.dialogs.CommitMessageBuilderTest)  Time elapsed: 1.105 s
17:43:18 [2020-08-23T21:43:18.965Z] commitMessageProvider_twoProvidersWithCaretPositioningFirstWithUndefinedCaretPosition(org.eclipse.egit.ui.internal.dialogs.CommitMessageBuilderTest)  Time elapsed: 0.097 s
17:43:18 [2020-08-23T21:43:18.965Z] commitMessageProvider_oneProviderWithCaretPositionEqualsMessageLength(org.eclipse.egit.ui.internal.dialogs.CommitMessageBuilderTest)  Time elapsed: 0.094 s
17:43:18 [2020-08-23T21:43:18.965Z] commitMessageProvider_twoProvidersFirstWithCaretPositioning(org.eclipse.egit.ui.internal.dialogs.CommitMessageBuilderTest)  Time elapsed: 0.083 s
17:43:18 [2020-08-23T21:43:18.965Z] commitMessageProvider_twoProvidersWithCaretPositioningSecondWithUndefinedCaretPosition(org.eclipse.egit.ui.internal.dialogs.CommitMessageBuilderTest)  Time elapsed: 0.083 s
17:43:18 [2020-08-23T21:43:18.965Z] commitMessageProvider_oneProviderWithCaretPositioning(org.eclipse.egit.ui.internal.dialogs.CommitMessageBuilderTest)  Time elapsed: 0.083 s
17:43:18 [2020-08-23T21:43:18.965Z] commitMessageProvider_twoProvidersSecondWithCaretPositionZero(org.eclipse.egit.ui.internal.dialogs.CommitMessageBuilderTest)  Time elapsed: 1.102 s
17:43:18 [2020-08-23T21:43:18.965Z] commitMessageProvider_twoProviders(org.eclipse.egit.ui.internal.dialogs.CommitMessageBuilderTest)  Time elapsed: 0.095 s
17:43:18 [2020-08-23T21:43:18.965Z] commitMessageProvider_twoProvidersSecondOneCrashing(org.eclipse.egit.ui.internal.dialogs.CommitMessageBuilderTest)  Time elapsed: 0.096 s
17:43:18 [2020-08-23T21:43:18.965Z] commitMessageProvider_multipleProvidersWithCrashingAndNullAndOneCaretPositioning(org.eclipse.egit.ui.internal.dialogs.CommitMessageBuilderTest)  Time elapsed: 0.083 s
17:43:18 [2020-08-23T21:43:18.965Z] commitMessageProvider_twoProvidersWithCaretPositioning(org.eclipse.egit.ui.internal.dialogs.CommitMessageBuilderTest)  Time elapsed: 0.082 s
17:43:18 [2020-08-23T21:43:18.965Z] commitMessageProvider_oneProviderWithInvalidCaretPositionExceedingMessageLength(org.eclipse.egit.ui.internal.dialogs.CommitMessageBuilderTest)  Time elapsed: 0.092 s
17:43:18 [2020-08-23T21:43:18.965Z] Running org.eclipse.egit.ui.internal.dialogs.SpellcheckableMessageAreaTest
17:43:18 [2020-08-23T21:43:18.965Z] Tests run: 25, Failures: 0, Errors: 0, Skipped: 0, Time elapsed: 0.022 s - in org.eclipse.egit.ui.internal.dialogs.SpellcheckableMessageAreaTest
17:43:18 [2020-08-23T21:43:18.965Z] testWrappingLongWords(org.eclipse.egit.ui.internal.dialogs.SpellcheckableMessageAreaTest)  Time elapsed: 0.001 s
17:43:18 [2020-08-23T21:43:18.965Z] wrapOnlyCommitMessageBody(org.eclipse.egit.ui.internal.dialogs.SpellcheckableMessageAreaTest)  Time elapsed: 0 s
17:43:18 [2020-08-23T21:43:18.965Z] dontWrapMaximumLengthText(org.eclipse.egit.ui.internal.dialogs.SpellcheckableMessageAreaTest)  Time elapsed: 0 s
17:43:18 [2020-08-23T21:43:18.965Z] keepTrailingSpace(org.eclipse.egit.ui.internal.dialogs.SpellcheckableMessageAreaTest)  Time elapsed: 0 s
17:43:18 [2020-08-23T21:43:18.965Z] dontWrapShortMessage(org.eclipse.egit.ui.internal.dialogs.SpellcheckableMessageAreaTest)  Time elapsed: 0 s
17:43:18 [2020-08-23T21:43:18.965Z] lineAfterWrappedWordShouldNotBeJoined(org.eclipse.egit.ui.internal.dialogs.SpellcheckableMessageAreaTest)  Time elapsed: 0 s
17:43:18 [2020-08-23T21:43:18.965Z] lineAfterWrappedWordShouldNotBeJoined2(org.eclipse.egit.ui.internal.dialogs.SpellcheckableMessageAreaTest)  Time elapsed: 0 s
17:43:18 [2020-08-23T21:43:18.965Z] lineAfterWrappedWordShouldNotBeJoined3(org.eclipse.egit.ui.internal.dialogs.SpellcheckableMessageAreaTest)  Time elapsed: 0 s
17:43:18 [2020-08-23T21:43:18.965Z] dontWrapWordLongerThanOneLine(org.eclipse.egit.ui.internal.dialogs.SpellcheckableMessageAreaTest)  Time elapsed: 0 s
17:43:18 [2020-08-23T21:43:18.965Z] keepExistingNewlines(org.eclipse.egit.ui.internal.dialogs.SpellcheckableMessageAreaTest)  Time elapsed: 0 s
17:43:18 [2020-08-23T21:43:18.965Z] dontWrapShortText(org.eclipse.egit.ui.internal.dialogs.SpellcheckableMessageAreaTest)  Time elapsed: 0.02 s
17:43:18 [2020-08-23T21:43:18.965Z] dontWrapWordLongerThanOneLineAtStart(org.eclipse.egit.ui.internal.dialogs.SpellcheckableMessageAreaTest)  Time elapsed: 0 s
17:43:18 [2020-08-23T21:43:18.965Z] dontWrapAlreadyWrappedText(org.eclipse.egit.ui.internal.dialogs.SpellcheckableMessageAreaTest)  Time elapsed: 0 s
17:43:18 [2020-08-23T21:43:18.965Z] wrapOverlengthText2(org.eclipse.egit.ui.internal.dialogs.SpellcheckableMessageAreaTest)  Time elapsed: 0 s
17:43:18 [2020-08-23T21:43:18.965Z] lineAfterWrappedWordShouldNotBeJoinedIfItStartsWithASymbol(org.eclipse.egit.ui.internal.dialogs.SpellcheckableMessageAreaTest)  Time elapsed: 0 s
17:43:18 [2020-08-23T21:43:18.965Z] wrapAlternatingBlankNonBlank(org.eclipse.egit.ui.internal.dialogs.SpellcheckableMessageAreaTest)  Time elapsed: 0 s
17:43:18 [2020-08-23T21:43:18.965Z] keepWhitespace(org.eclipse.egit.ui.internal.dialogs.SpellcheckableMessageAreaTest)  Time elapsed: 0 s
17:43:18 [2020-08-23T21:43:18.965Z] lineAfterWrappedWordShouldNotBeJoinedIfItsEmpty(org.eclipse.egit.ui.internal.dialogs.SpellcheckableMessageAreaTest)  Time elapsed: 0 s
17:43:18 [2020-08-23T21:43:18.965Z] dontWrapLongCommitMessageFooter(org.eclipse.egit.ui.internal.dialogs.SpellcheckableMessageAreaTest)  Time elapsed: 0 s
17:43:18 [2020-08-23T21:43:18.965Z] lineAfterWrappedLineShouldBeJoinedAndFollowingLineWrappedCorrectly(org.eclipse.egit.ui.internal.dialogs.SpellcheckableMessageAreaTest)  Time elapsed: 0 s
17:43:18 [2020-08-23T21:43:18.965Z] wrapOverlengthText(org.eclipse.egit.ui.internal.dialogs.SpellcheckableMessageAreaTest)  Time elapsed: 0 s
17:43:18 [2020-08-23T21:43:18.965Z] dontWrapWordLongerThanOneLineAndKeepSpaceAtFront(org.eclipse.egit.ui.internal.dialogs.SpellcheckableMessageAreaTest)  Time elapsed: 0 s
17:43:18 [2020-08-23T21:43:18.965Z] wrapSecondLongLine(org.eclipse.egit.ui.internal.dialogs.SpellcheckableMessageAreaTest)  Time elapsed: 0 s
17:43:18 [2020-08-23T21:43:18.965Z] wrapOverlengthTextByOne(org.eclipse.egit.ui.internal.dialogs.SpellcheckableMessageAreaTest)  Time elapsed: 0 s
17:43:18 [2020-08-23T21:43:18.965Z] keepNewlineAtEnd(org.eclipse.egit.ui.internal.dialogs.SpellcheckableMessageAreaTest)  Time elapsed: 0 s
17:43:18 [2020-08-23T21:43:18.965Z] Running org.eclipse.egit.ui.internal.dialogs.CommitMessageComponentTest
17:43:18 [2020-08-23T21:43:18.965Z] Tests run: 5, Failures: 0, Errors: 0, Skipped: 0, Time elapsed: 0.001 s - in org.eclipse.egit.ui.internal.dialogs.CommitMessageComponentTest
17:43:18 [2020-08-23T21:43:18.965Z] commitFormat_MultipleLines_notOk2(org.eclipse.egit.ui.internal.dialogs.CommitMessageComponentTest)  Time elapsed: 0 s
17:43:18 [2020-08-23T21:43:18.965Z] commitFormat_simple(org.eclipse.egit.ui.internal.dialogs.CommitMessageComponentTest)  Time elapsed: 0 s
17:43:18 [2020-08-23T21:43:18.965Z] commitFormat_MultipleLines_ok(org.eclipse.egit.ui.internal.dialogs.CommitMessageComponentTest)  Time elapsed: 0 s
17:43:18 [2020-08-23T21:43:18.965Z] commitFormat_trailingWhitespace_ok(org.eclipse.egit.ui.internal.dialogs.CommitMessageComponentTest)  Time elapsed: 0 s
17:43:18 [2020-08-23T21:43:18.965Z] commitFormat_MultipleLines_notOk(org.eclipse.egit.ui.internal.dialogs.CommitMessageComponentTest)  Time elapsed: 0 s
17:43:18 [2020-08-23T21:43:18.965Z] Running org.eclipse.egit.ui.internal.actions.StashesMenuTest
17:43:21 [2020-08-23T21:43:21.495Z] 
17:43:21 [2020-08-23T21:43:21.495Z] (SWT:1602): Gtk-WARNING **: 21:43:21.267: Negative content width -6 (allocation 1, extents 4x3) while allocating gadget (node toolbar, owner GtkToolbar)
17:43:21 [2020-08-23T21:43:21.495Z] 
17:43:21 [2020-08-23T21:43:21.495Z] (SWT:1602): Gtk-WARNING **: 21:43:21.267: Negative content height -3 (allocation 1, extents 2x2) while allocating gadget (node toolbar, owner GtkToolbar)
17:43:21 [2020-08-23T21:43:21.495Z] 
17:43:21 [2020-08-23T21:43:21.495Z] (SWT:1602): Gtk-WARNING **: 21:43:21.267: Negative content width -6 (allocation 1, extents 4x3) while allocating gadget (node toolbar, owner GtkToolbar)
17:43:21 [2020-08-23T21:43:21.495Z] 
17:43:21 [2020-08-23T21:43:21.495Z] (SWT:1602): Gtk-WARNING **: 21:43:21.267: Negative content height -3 (allocation 1, extents 2x2) while allocating gadget (node toolbar, owner GtkToolbar)
17:43:21 [2020-08-23T21:43:21.495Z] 
17:43:21 [2020-08-23T21:43:21.495Z] (SWT:1602): Gtk-WARNING **: 21:43:21.314: Negative content width -6 (allocation 1, extents 4x3) while allocating gadget (node toolbar, owner GtkToolbar)
17:43:21 [2020-08-23T21:43:21.495Z] 
17:43:21 [2020-08-23T21:43:21.495Z] (SWT:1602): Gtk-WARNING **: 21:43:21.326: Negative content width -6 (allocation 1, extents 4x3) while allocating gadget (node toolbar, owner GtkToolbar)
17:43:21 [2020-08-23T21:43:21.495Z] 
17:43:21 [2020-08-23T21:43:21.495Z] (SWT:1602): Gtk-WARNING **: 21:43:21.338: Negative content width -6 (allocation 1, extents 4x3) while allocating gadget (node toolbar, owner GtkToolbar)
17:43:21 [2020-08-23T21:43:21.752Z] Tests run: 2, Failures: 0, Errors: 0, Skipped: 0, Time elapsed: 2.799 s - in org.eclipse.egit.ui.internal.actions.StashesMenuTest
17:43:21 [2020-08-23T21:43:21.752Z] menuWithoutStashes(org.eclipse.egit.ui.internal.actions.StashesMenuTest)  Time elapsed: 1.589 s
17:43:21 [2020-08-23T21:43:21.752Z] stashAndApplyChanges(org.eclipse.egit.ui.internal.actions.StashesMenuTest)  Time elapsed: 1.205 s
17:43:21 [2020-08-23T21:43:21.752Z] Running org.eclipse.egit.ui.internal.actions.LinkedResourcesTest
17:43:23 [2020-08-23T21:43:23.122Z] Tests run: 2, Failures: 0, Errors: 0, Skipped: 0, Time elapsed: 1.243 s - in org.eclipse.egit.ui.internal.actions.LinkedResourcesTest
17:43:23 [2020-08-23T21:43:23.122Z] testSomeActionsWithoutLinkedResources(org.eclipse.egit.ui.internal.actions.LinkedResourcesTest)  Time elapsed: 0.59 s
17:43:23 [2020-08-23T21:43:23.122Z] testNoActionOnLinkedResources(org.eclipse.egit.ui.internal.actions.LinkedResourcesTest)  Time elapsed: 0.649 s
17:43:23 [2020-08-23T21:43:23.122Z] Running org.eclipse.egit.ui.internal.actions.SwitchToMenuTest
17:43:33 [2020-08-23T21:43:33.077Z] 
17:43:33 [2020-08-23T21:43:33.077Z] !ENTRY org.eclipse.egit.core 4 0 2020-08-23 21:43:31.771
17:43:33 [2020-08-23T21:43:33.077Z] !MESSAGE Cannot parse the reflog for HEAD in repository /home/jenkins/agent/workspace/egit/tmp/egit.tmp/a74c2993b36744199819da8027f10c4a/LocalRepositoriesTests264_selectionWithCorruptedReflog/FirstRepository/.git
17:43:33 [2020-08-23T21:43:33.077Z] !STACK 0
17:43:33 [2020-08-23T21:43:33.077Z] org.eclipse.jgit.errors.InvalidObjectIdException: Invalid id: INTENTIONALLY CORRUPTED REFLOG. Just som
17:43:33 [2020-08-23T21:43:33.077Z] 	at org.eclipse.jgit.lib.ObjectId.fromHexString(ObjectId.java:217)
17:43:33 [2020-08-23T21:43:33.077Z] 	at org.eclipse.jgit.lib.ObjectId.fromString(ObjectId.java:191)
17:43:33 [2020-08-23T21:43:33.077Z] 	at org.eclipse.jgit.internal.storage.file.ReflogEntryImpl.<init>(ReflogEntryImpl.java:39)
17:43:33 [2020-08-23T21:43:33.077Z] 	at org.eclipse.jgit.internal.storage.file.ReflogReaderImpl.getReverseEntries(ReflogReaderImpl.java:109)
17:43:33 [2020-08-23T21:43:33.077Z] 	at org.eclipse.jgit.internal.storage.file.ReflogReaderImpl.getReverseEntries(ReflogReaderImpl.java:56)
17:43:33 [2020-08-23T21:43:33.078Z] 	at org.eclipse.egit.core.RepositoryUtil.safeReadReflog(RepositoryUtil.java:193)
17:43:33 [2020-08-23T21:43:33.078Z] 	at org.eclipse.egit.ui.internal.actions.SwitchToMenu.getMostActiveBranches(SwitchToMenu.java:465)
17:43:33 [2020-08-23T21:43:33.078Z] 	at org.eclipse.egit.ui.internal.actions.SwitchToMenu.createMostActiveBranchesMenuItems(SwitchToMenu.java:306)
17:43:33 [2020-08-23T21:43:33.078Z] 	at org.eclipse.egit.ui.internal.actions.SwitchToMenu.createDynamicMenu(SwitchToMenu.java:142)
17:43:33 [2020-08-23T21:43:33.078Z] 	at org.eclipse.egit.ui.internal.actions.SwitchToMenu.fill(SwitchToMenu.java:122)
17:43:33 [2020-08-23T21:43:33.078Z] 	at org.eclipse.egit.ui.internal.actions.SwitchToMenuTest$1.run(SwitchToMenuTest.java:310)
17:43:33 [2020-08-23T21:43:33.078Z] 	at org.eclipse.swt.widgets.RunnableLock.run(RunnableLock.java:35)
17:43:33 [2020-08-23T21:43:33.078Z] 	at org.eclipse.swt.widgets.Synchronizer.runAsyncMessages(Synchronizer.java:182)
17:43:33 [2020-08-23T21:43:33.078Z] 	at org.eclipse.swt.widgets.Display.runAsyncMessages(Display.java:4536)
17:43:33 [2020-08-23T21:43:33.078Z] 	at org.eclipse.swt.widgets.Display.readAndDispatch(Display.java:4154)
17:43:33 [2020-08-23T21:43:33.078Z] 	at org.eclipse.e4.ui.internal.workbench.swt.PartRenderingEngine$4.run(PartRenderingEngine.java:1121)
17:43:33 [2020-08-23T21:43:33.078Z] 	at org.eclipse.core.databinding.observable.Realm.runWithDefault(Realm.java:336)
17:43:33 [2020-08-23T21:43:33.078Z] 	at org.eclipse.e4.ui.internal.workbench.swt.PartRenderingEngine.run(PartRenderingEngine.java:1022)
17:43:33 [2020-08-23T21:43:33.078Z] 	at org.eclipse.e4.ui.internal.workbench.E4Workbench.createAndRunUI(E4Workbench.java:150)
17:43:33 [2020-08-23T21:43:33.078Z] 	at org.eclipse.ui.internal.Workbench$5.run(Workbench.java:693)
17:43:33 [2020-08-23T21:43:33.078Z] 	at org.eclipse.core.databinding.observable.Realm.runWithDefault(Realm.java:336)
17:43:33 [2020-08-23T21:43:33.078Z] 	at org.eclipse.ui.internal.Workbench.createAndRunWorkbench(Workbench.java:610)
17:43:33 [2020-08-23T21:43:33.078Z] 	at org.eclipse.ui.PlatformUI.createAndRunWorkbench(PlatformUI.java:148)
17:43:33 [2020-08-23T21:43:33.078Z] 	at org.eclipse.ui.internal.ide.application.IDEApplication.start(IDEApplication.java:138)
17:43:33 [2020-08-23T21:43:33.078Z] 	at org.eclipse.tycho.surefire.osgibooter.UITestApplication.runApplication(UITestApplication.java:31)
17:43:33 [2020-08-23T21:43:33.078Z] 	at org.eclipse.tycho.surefire.osgibooter.AbstractUITestApplication.run(AbstractUITestApplication.java:120)
17:43:33 [2020-08-23T21:43:33.078Z] 	at org.eclipse.tycho.surefire.osgibooter.UITestApplication.start(UITestApplication.java:37)
17:43:33 [2020-08-23T21:43:33.078Z] 	at org.eclipse.equinox.internal.app.EclipseAppHandle.run(EclipseAppHandle.java:196)
17:43:33 [2020-08-23T21:43:33.078Z] 	at org.eclipse.core.runtime.internal.adaptor.EclipseAppLauncher.runApplication(EclipseAppLauncher.java:134)
17:43:33 [2020-08-23T21:43:33.078Z] 	at org.eclipse.core.runtime.internal.adaptor.EclipseAppLauncher.start(EclipseAppLauncher.java:104)
17:43:33 [2020-08-23T21:43:33.078Z] 	at org.eclipse.core.runtime.adaptor.EclipseStarter.run(EclipseStarter.java:388)
17:43:33 [2020-08-23T21:43:33.078Z] 	at org.eclipse.core.runtime.adaptor.EclipseStarter.run(EclipseStarter.java:243)
17:43:33 [2020-08-23T21:43:33.078Z] 	at sun.reflect.NativeMethodAccessorImpl.invoke0(Native Method)
17:43:33 [2020-08-23T21:43:33.078Z] 	at sun.reflect.NativeMethodAccessorImpl.invoke(NativeMethodAccessorImpl.java:62)
17:43:33 [2020-08-23T21:43:33.078Z] 	at sun.reflect.DelegatingMethodAccessorImpl.invoke(DelegatingMethodAccessorImpl.java:43)
17:43:33 [2020-08-23T21:43:33.078Z] 	at java.lang.reflect.Method.invoke(Method.java:498)
17:43:33 [2020-08-23T21:43:33.078Z] 	at org.eclipse.equinox.launcher.Main.invokeFramework(Main.java:673)
17:43:33 [2020-08-23T21:43:33.078Z] 	at org.eclipse.equinox.launcher.Main.basicRun(Main.java:610)
17:43:33 [2020-08-23T21:43:33.078Z] 	at org.eclipse.equinox.launcher.Main.run(Main.java:1519)
17:43:33 [2020-08-23T21:43:33.078Z] 	at org.eclipse.equinox.launcher.Main.main(Main.java:1492)
17:43:33 [2020-08-23T21:43:33.078Z] Caused by: java.lang.ArrayIndexOutOfBoundsException
17:43:33 [2020-08-23T21:43:33.078Z] 	at org.eclipse.jgit.util.RawParseUtils.parseHexInt32(RawParseUtils.java:336)
17:43:33 [2020-08-23T21:43:33.078Z] 	at org.eclipse.jgit.lib.ObjectId.fromHexString(ObjectId.java:210)
17:43:33 [2020-08-23T21:43:33.078Z] 	... 39 more
17:43:33 [2020-08-23T21:43:33.078Z] Tests run: 9, Failures: 0, Errors: 0, Skipped: 0, Time elapsed: 9.017 s - in org.eclipse.egit.ui.internal.actions.SwitchToMenuTest
17:43:33 [2020-08-23T21:43:33.078Z] multipleSelectionWithMultipleRepositoriesAndNoCommonBranches(org.eclipse.egit.ui.internal.actions.SwitchToMenuTest)  Time elapsed: 1.021 s
17:43:33 [2020-08-23T21:43:33.078Z] selectionWithProj1(org.eclipse.egit.ui.internal.actions.SwitchToMenuTest)  Time elapsed: 0.584 s
17:43:33 [2020-08-23T21:43:33.078Z] selectionNotAdaptableToRepository(org.eclipse.egit.ui.internal.actions.SwitchToMenuTest)  Time elapsed: 0.055 s
17:43:33 [2020-08-23T21:43:33.078Z] selectionWithProj1AndReflog(org.eclipse.egit.ui.internal.actions.SwitchToMenuTest)  Time elapsed: 0.634 s
17:43:33 [2020-08-23T21:43:33.078Z] validateMenuEntriesForMultiSelectionWithMultipleRepositories(org.eclipse.egit.ui.internal.actions.SwitchToMenuTest)  Time elapsed: 2.923 s
17:43:33 [2020-08-23T21:43:33.078Z] validateBranchSwitchingForForMultiSelectionWithMultipleRepositories(org.eclipse.egit.ui.internal.actions.SwitchToMenuTest)  Time elapsed: 1.227 s
17:43:33 [2020-08-23T21:43:33.078Z] selectionWithRepositoryHavingOver20Branches(org.eclipse.egit.ui.internal.actions.SwitchToMenuTest)  Time elapsed: 1.862 s
17:43:33 [2020-08-23T21:43:33.078Z] emptySelection(org.eclipse.egit.ui.internal.actions.SwitchToMenuTest)  Time elapsed: 0.056 s
17:43:33 [2020-08-23T21:43:33.078Z] selectionWithCorruptedReflog(org.eclipse.egit.ui.internal.actions.SwitchToMenuTest)  Time elapsed: 0.634 s
17:43:33 [2020-08-23T21:43:33.078Z] Running org.eclipse.egit.ui.internal.submodules.SubmoduleFolderTest
17:43:36 [2020-08-23T21:43:36.358Z] 
17:43:36 [2020-08-23T21:43:36.359Z] (SWT:1602): Gtk-WARNING **: 21:43:35.672: Negative content width -6 (allocation 1, extents 4x3) while allocating gadget (node toolbar, owner GtkToolbar)
17:43:36 [2020-08-23T21:43:36.359Z] 
17:43:36 [2020-08-23T21:43:36.359Z] (SWT:1602): Gtk-WARNING **: 21:43:35.672: Negative content height -3 (allocation 1, extents 2x2) while allocating gadget (node toolbar, owner GtkToolbar)
17:43:36 [2020-08-23T21:43:36.359Z] 
17:43:36 [2020-08-23T21:43:36.359Z] (SWT:1602): Gtk-WARNING **: 21:43:35.672: Negative content width -6 (allocation 1, extents 4x3) while allocating gadget (node toolbar, owner GtkToolbar)
17:43:36 [2020-08-23T21:43:36.359Z] 
17:43:36 [2020-08-23T21:43:36.359Z] (SWT:1602): Gtk-WARNING **: 21:43:35.672: Negative content height -3 (allocation 1, extents 2x2) while allocating gadget (node toolbar, owner GtkToolbar)
17:43:36 [2020-08-23T21:43:36.359Z] 
17:43:36 [2020-08-23T21:43:36.359Z] (SWT:1602): Gtk-WARNING **: 21:43:36.000: Negative content width -6 (allocation 1, extents 4x3) while allocating gadget (node toolbar, owner GtkToolbar)
17:43:36 [2020-08-23T21:43:36.359Z] 
17:43:36 [2020-08-23T21:43:36.359Z] (SWT:1602): Gtk-WARNING **: 21:43:36.003: Negative content width -6 (allocation 1, extents 4x3) while allocating gadget (node toolbar, owner GtkToolbar)
17:43:36 [2020-08-23T21:43:36.359Z] 
17:43:36 [2020-08-23T21:43:36.359Z] (SWT:1602): Gtk-WARNING **: 21:43:36.006: Negative content width -6 (allocation 1, extents 4x3) while allocating gadget (node toolbar, owner GtkToolbar)
17:43:36 [2020-08-23T21:43:36.359Z] 
17:43:36 [2020-08-23T21:43:36.359Z] (SWT:1602): Gtk-WARNING **: 21:43:36.010: Negative content width -6 (allocation 1, extents 4x3) while allocating gadget (node toolbar, owner GtkToolbar)
17:43:36 [2020-08-23T21:43:36.359Z] 
17:43:36 [2020-08-23T21:43:36.359Z] (SWT:1602): Gtk-WARNING **: 21:43:36.026: Negative content width -6 (allocation 1, extents 4x3) while allocating gadget (node toolbar, owner GtkToolbar)
17:43:36 [2020-08-23T21:43:36.359Z] 
17:43:36 [2020-08-23T21:43:36.359Z] (SWT:1602): Gtk-WARNING **: 21:43:36.026: Negative content width -6 (allocation 1, extents 4x3) while allocating gadget (node toolbar, owner GtkToolbar)
17:43:36 [2020-08-23T21:43:36.359Z] 
17:43:36 [2020-08-23T21:43:36.359Z] (SWT:1602): Gtk-WARNING **: 21:43:36.056: Negative content width -6 (allocation 1, extents 4x3) while allocating gadget (node toolbar, owner GtkToolbar)
17:43:36 [2020-08-23T21:43:36.359Z] 
17:43:36 [2020-08-23T21:43:36.359Z] (SWT:1602): Gtk-WARNING **: 21:43:36.057: Negative content width -6 (allocation 1, extents 4x3) while allocating gadget (node toolbar, owner GtkToolbar)
17:43:42 [2020-08-23T21:43:42.959Z] 
17:43:42 [2020-08-23T21:43:42.960Z] (SWT:1602): Gtk-WARNING **: 21:43:42.654: Negative content width -6 (allocation 1, extents 4x3) while allocating gadget (node toolbar, owner GtkToolbar)
17:43:42 [2020-08-23T21:43:42.960Z] 
17:43:42 [2020-08-23T21:43:42.960Z] (SWT:1602): Gtk-WARNING **: 21:43:42.667: Negative content width -6 (allocation 1, extents 4x3) while allocating gadget (node toolbar, owner GtkToolbar)
17:43:42 [2020-08-23T21:43:42.960Z] 
17:43:42 [2020-08-23T21:43:42.960Z] (SWT:1602): Gtk-WARNING **: 21:43:42.700: Negative content width -6 (allocation 1, extents 4x3) while allocating gadget (node toolbar, owner GtkToolbar)
17:43:42 [2020-08-23T21:43:42.960Z] 
17:43:42 [2020-08-23T21:43:42.960Z] (SWT:1602): Gtk-WARNING **: 21:43:42.700: Negative content width -6 (allocation 1, extents 4x3) while allocating gadget (node toolbar, owner GtkToolbar)
17:43:42 [2020-08-23T21:43:42.960Z] 
17:43:42 [2020-08-23T21:43:42.960Z] (SWT:1602): Gtk-CRITICAL **: 21:43:42.723: gtk_box_gadget_distribute: assertion 'size >= 0' failed in GtkScrollbar
17:43:42 [2020-08-23T21:43:42.960Z] 
17:43:42 [2020-08-23T21:43:42.960Z] (SWT:1602): Gtk-WARNING **: 21:43:42.726: Negative content width -6 (allocation 1, extents 4x3) while allocating gadget (node toolbar, owner GtkToolbar)
17:43:42 [2020-08-23T21:43:42.960Z] 
17:43:42 [2020-08-23T21:43:42.960Z] (SWT:1602): Gtk-WARNING **: 21:43:42.736: Negative content width -6 (allocation 1, extents 4x3) while allocating gadget (node toolbar, owner GtkToolbar)
17:43:42 [2020-08-23T21:43:42.960Z] 
17:43:42 [2020-08-23T21:43:42.960Z] (SWT:1602): Gtk-WARNING **: 21:43:42.763: Negative content width -6 (allocation 1, extents 4x3) while allocating gadget (node toolbar, owner GtkToolbar)
17:43:42 [2020-08-23T21:43:42.960Z] 
17:43:42 [2020-08-23T21:43:42.960Z] (SWT:1602): Gtk-CRITICAL **: 21:43:42.766: gtk_box_gadget_distribute: assertion 'size >= 0' failed in GtkScrollbar
17:43:42 [2020-08-23T21:43:42.960Z] 
17:43:42 [2020-08-23T21:43:42.960Z] (SWT:1602): Gtk-WARNING **: 21:43:42.796: Negative content width -6 (allocation 1, extents 4x3) while allocating gadget (node toolbar, owner GtkToolbar)
17:43:48 [2020-08-23T21:43:48.229Z] 
17:43:48 [2020-08-23T21:43:48.229Z] (SWT:1602): Gtk-WARNING **: 21:43:47.826: Negative content width -6 (allocation 1, extents 4x3) while allocating gadget (node toolbar, owner GtkToolbar)
17:43:48 [2020-08-23T21:43:48.229Z] 
17:43:48 [2020-08-23T21:43:48.229Z] (SWT:1602): Gtk-WARNING **: 21:43:47.942: Negative content width -6 (allocation 1, extents 4x3) while allocating gadget (node toolbar, owner GtkToolbar)
17:43:48 [2020-08-23T21:43:48.793Z] 
17:43:48 [2020-08-23T21:43:48.793Z] (SWT:1602): Gtk-WARNING **: 21:43:48.786: Negative content width -6 (allocation 1, extents 4x3) while allocating gadget (node toolbar, owner GtkToolbar)
17:43:49 [2020-08-23T21:43:49.051Z] 
17:43:49 [2020-08-23T21:43:49.051Z] (SWT:1602): Gtk-WARNING **: 21:43:48.824: Negative content width -6 (allocation 1, extents 4x3) while allocating gadget (node toolbar, owner GtkToolbar)
17:43:53 [2020-08-23T21:43:53.227Z] Tests run: 11, Failures: 0, Errors: 0, Skipped: 0, Time elapsed: 20.828 s - in org.eclipse.egit.ui.internal.submodules.SubmoduleFolderTest
17:43:53 [2020-08-23T21:43:53.227Z] testSwitchToMenu(org.eclipse.egit.ui.internal.submodules.SubmoduleFolderTest)  Time elapsed: 2.091 s
17:43:53 [2020-08-23T21:43:53.227Z] compareWithHeadInSubmoduleFolder(org.eclipse.egit.ui.internal.submodules.SubmoduleFolderTest)  Time elapsed: 2.242 s
17:43:53 [2020-08-23T21:43:53.227Z] testStageUnstageInSubRepo(org.eclipse.egit.ui.internal.submodules.SubmoduleFolderTest)  Time elapsed: 2.88 s
17:43:53 [2020-08-23T21:43:53.227Z] testDecoration(org.eclipse.egit.ui.internal.submodules.SubmoduleFolderTest)  Time elapsed: 1.972 s
17:43:53 [2020-08-23T21:43:53.227Z] testHistoryFromProjectExplorerIsFromSubRepository(org.eclipse.egit.ui.internal.submodules.SubmoduleFolderTest)  Time elapsed: 1.824 s
17:43:53 [2020-08-23T21:43:53.227Z] testParentFolderMapsToParentRepo(org.eclipse.egit.ui.internal.submodules.SubmoduleFolderTest)  Time elapsed: 1.286 s
17:43:53 [2020-08-23T21:43:53.227Z] testDisconnect(org.eclipse.egit.ui.internal.submodules.SubmoduleFolderTest)  Time elapsed: 1.935 s
17:43:53 [2020-08-23T21:43:53.227Z] testRepoViewFollowSelection(org.eclipse.egit.ui.internal.submodules.SubmoduleFolderTest)  Time elapsed: 2.782 s
17:43:53 [2020-08-23T21:43:53.227Z] testRepoRemoval(org.eclipse.egit.ui.internal.submodules.SubmoduleFolderTest)  Time elapsed: 1.217 s
17:43:53 [2020-08-23T21:43:53.227Z] testChildProjectMapsToSubRepo(org.eclipse.egit.ui.internal.submodules.SubmoduleFolderTest)  Time elapsed: 1.214 s
17:43:53 [2020-08-23T21:43:53.227Z] testChildFolderMapsToSubRepo(org.eclipse.egit.ui.internal.submodules.SubmoduleFolderTest)  Time elapsed: 1.321 s
17:43:53 [2020-08-23T21:43:53.227Z] Running org.eclipse.egit.ui.internal.synchronize.model.GitModelWorkingFileTest
17:43:56 [2020-08-23T21:43:56.502Z] Tests run: 5, Failures: 0, Errors: 0, Skipped: 0, Time elapsed: 3.084 s - in org.eclipse.egit.ui.internal.synchronize.model.GitModelWorkingFileTest
17:43:56 [2020-08-23T21:43:56.502Z] shouldReturnNotEqualForDifferentLocation(org.eclipse.egit.ui.internal.synchronize.model.GitModelWorkingFileTest)  Time elapsed: 0.598 s
17:43:56 [2020-08-23T21:43:56.502Z] shouldReturnNotEqualWhenComparingWorkingFileAndCacheFile(org.eclipse.egit.ui.internal.synchronize.model.GitModelWorkingFileTest)  Time elapsed: 0.619 s
17:43:56 [2020-08-23T21:43:56.502Z] shouldReturnEqualForSameInstance(org.eclipse.egit.ui.internal.synchronize.model.GitModelWorkingFileTest)  Time elapsed: 0.585 s
17:43:56 [2020-08-23T21:43:56.502Z] shouldReturnNotEqualWhenComparingWorkingFileAndBlob(org.eclipse.egit.ui.internal.synchronize.model.GitModelWorkingFileTest)  Time elapsed: 0.672 s
17:43:56 [2020-08-23T21:43:56.502Z] shouldReturnEqualForSameLocation(org.eclipse.egit.ui.internal.synchronize.model.GitModelWorkingFileTest)  Time elapsed: 0.599 s
17:43:56 [2020-08-23T21:43:56.502Z] Running org.eclipse.egit.ui.internal.synchronize.model.GitModelBlobTest
17:44:04 [2020-08-23T21:44:04.615Z] Tests run: 15, Failures: 0, Errors: 0, Skipped: 2, Time elapsed: 8.074 s - in org.eclipse.egit.ui.internal.synchronize.model.GitModelBlobTest
17:44:04 [2020-08-23T21:44:04.616Z] shouldReturnEqualSameData1(org.eclipse.egit.ui.internal.synchronize.model.GitModelBlobTest) skipped
17:44:04 [2020-08-23T21:44:04.616Z] shouldReturnNotEqualForDifferentLocation(org.eclipse.egit.ui.internal.synchronize.model.GitModelBlobTest)  Time elapsed: 0.613 s
17:44:04 [2020-08-23T21:44:04.616Z] shouldReturnNotEqualForBlobAndCommit(org.eclipse.egit.ui.internal.synchronize.model.GitModelBlobTest)  Time elapsed: 0.588 s
17:44:04 [2020-08-23T21:44:04.616Z] shouldReturnEqualForSameData(org.eclipse.egit.ui.internal.synchronize.model.GitModelBlobTest) skipped
17:44:04 [2020-08-23T21:44:04.616Z] shouldReturnNotEqualForDifferentFiles(org.eclipse.egit.ui.internal.synchronize.model.GitModelBlobTest)  Time elapsed: 0.66 s
17:44:04 [2020-08-23T21:44:04.616Z] shouldReturnNotEqualForBlobAndCacheFile(org.eclipse.egit.ui.internal.synchronize.model.GitModelBlobTest)  Time elapsed: 0.621 s
17:44:04 [2020-08-23T21:44:04.616Z] shouldReturnNotEqualForBlobAndTree(org.eclipse.egit.ui.internal.synchronize.model.GitModelBlobTest)  Time elapsed: 0.605 s
17:44:04 [2020-08-23T21:44:04.616Z] shouldBeSymmetric1(org.eclipse.egit.ui.internal.synchronize.model.GitModelBlobTest)  Time elapsed: 0.589 s
17:44:04 [2020-08-23T21:44:04.616Z] shouldBeSymmetric(org.eclipse.egit.ui.internal.synchronize.model.GitModelBlobTest)  Time elapsed: 0.664 s
17:44:04 [2020-08-23T21:44:04.616Z] shouldReturnEqualForSameInstance(org.eclipse.egit.ui.internal.synchronize.model.GitModelBlobTest)  Time elapsed: 0.582 s
17:44:04 [2020-08-23T21:44:04.616Z] shouldActAsResourceProvider(org.eclipse.egit.ui.internal.synchronize.model.GitModelBlobTest)  Time elapsed: 0.627 s
17:44:04 [2020-08-23T21:44:04.616Z] shouldReturnNotEqualForDifferentBaseObjectId2(org.eclipse.egit.ui.internal.synchronize.model.GitModelBlobTest)  Time elapsed: 0.598 s
17:44:04 [2020-08-23T21:44:04.616Z] shouldReturnNotEqualForDifferentBaseObjectId3(org.eclipse.egit.ui.internal.synchronize.model.GitModelBlobTest)  Time elapsed: 0.6 s
17:44:04 [2020-08-23T21:44:04.616Z] shouldReturnNotEqualForBlobAndWorkingFile(org.eclipse.egit.ui.internal.synchronize.model.GitModelBlobTest)  Time elapsed: 0.633 s
17:44:04 [2020-08-23T21:44:04.616Z] shouldReturnNotEqualForDifferentBaseObjectId(org.eclipse.egit.ui.internal.synchronize.model.GitModelBlobTest)  Time elapsed: 0.665 s
17:44:04 [2020-08-23T21:44:04.616Z] Running org.eclipse.egit.ui.internal.synchronize.model.GitModelCacheFileTest
17:44:07 [2020-08-23T21:44:07.906Z] Tests run: 7, Failures: 0, Errors: 0, Skipped: 2, Time elapsed: 3.232 s - in org.eclipse.egit.ui.internal.synchronize.model.GitModelCacheFileTest
17:44:07 [2020-08-23T21:44:07.906Z] shouldReturnEqualForSameObjectIdsAndLocation(org.eclipse.egit.ui.internal.synchronize.model.GitModelCacheFileTest)  Time elapsed: 0.591 s
17:44:07 [2020-08-23T21:44:07.906Z] shouldReturnNotEqualWhenComparingCacheFileAndBlob(org.eclipse.egit.ui.internal.synchronize.model.GitModelCacheFileTest)  Time elapsed: 0.597 s
17:44:07 [2020-08-23T21:44:07.906Z] shouldReturnNotEqualForDifferentCacheIds(org.eclipse.egit.ui.internal.synchronize.model.GitModelCacheFileTest) skipped
17:44:07 [2020-08-23T21:44:07.906Z] shouldReturnEqualForSameInstance(org.eclipse.egit.ui.internal.synchronize.model.GitModelCacheFileTest)  Time elapsed: 0.804 s
17:44:07 [2020-08-23T21:44:07.906Z] shouldReturnNotEqualWhenComparingCacheFileAndWorkingFile(org.eclipse.egit.ui.internal.synchronize.model.GitModelCacheFileTest)  Time elapsed: 0.625 s
17:44:07 [2020-08-23T21:44:07.906Z] shouldReturnNotEqualForDifferentBaseIds(org.eclipse.egit.ui.internal.synchronize.model.GitModelCacheFileTest)  Time elapsed: 0.604 s
17:44:07 [2020-08-23T21:44:07.906Z] shouldReturnNotEqualForDifferentLocations(org.eclipse.egit.ui.internal.synchronize.model.GitModelCacheFileTest) skipped
17:44:07 [2020-08-23T21:44:07.906Z] Running org.eclipse.egit.ui.internal.synchronize.model.GitModelWorkingTreeTest
17:44:08 [2020-08-23T21:44:08.470Z] Tests run: 2, Failures: 0, Errors: 0, Skipped: 0, Time elapsed: 1.282 s - in org.eclipse.egit.ui.internal.synchronize.model.GitModelWorkingTreeTest
17:44:08 [2020-08-23T21:44:08.470Z] shouldReturnNotEqualsWhenComparingWorkingTreeAndCache(org.eclipse.egit.ui.internal.synchronize.model.GitModelWorkingTreeTest)  Time elapsed: 0.616 s
17:44:08 [2020-08-23T21:44:08.470Z] shouldReturnEqualsForTheSameInstance(org.eclipse.egit.ui.internal.synchronize.model.GitModelWorkingTreeTest)  Time elapsed: 0.661 s
17:44:08 [2020-08-23T21:44:08.470Z] Running org.eclipse.egit.ui.internal.synchronize.model.GitModelCacheTreeTest
17:44:11 [2020-08-23T21:44:11.746Z] Tests run: 4, Failures: 0, Errors: 0, Skipped: 0, Time elapsed: 2.571 s - in org.eclipse.egit.ui.internal.synchronize.model.GitModelCacheTreeTest
17:44:11 [2020-08-23T21:44:11.746Z] shouldReturnEqualForSameData(org.eclipse.egit.ui.internal.synchronize.model.GitModelCacheTreeTest)  Time elapsed: 0.782 s
17:44:11 [2020-08-23T21:44:11.746Z] shouldReturnNotEqualForDifferetnLocation(org.eclipse.egit.ui.internal.synchronize.model.GitModelCacheTreeTest)  Time elapsed: 0.591 s
17:44:11 [2020-08-23T21:44:11.746Z] shouldReturnEqualForSameInstance(org.eclipse.egit.ui.internal.synchronize.model.GitModelCacheTreeTest)  Time elapsed: 0.583 s
17:44:11 [2020-08-23T21:44:11.746Z] shouldReturnNotEqualWhenComparingCacheTreeAndTree(org.eclipse.egit.ui.internal.synchronize.model.GitModelCacheTreeTest)  Time elapsed: 0.606 s
17:44:11 [2020-08-23T21:44:11.746Z] Running org.eclipse.egit.ui.internal.synchronize.model.GitModelRootTest
17:44:12 [2020-08-23T21:44:12.678Z] Tests run: 1, Failures: 0, Errors: 0, Skipped: 0, Time elapsed: 1.424 s - in org.eclipse.egit.ui.internal.synchronize.model.GitModelRootTest
17:44:12 [2020-08-23T21:44:12.678Z] shouldIgnoreEmptyRepositories(org.eclipse.egit.ui.internal.synchronize.model.GitModelRootTest)  Time elapsed: 1.419 s
17:44:12 [2020-08-23T21:44:12.678Z] Running org.eclipse.egit.ui.internal.synchronize.model.GitModelCommitTest
17:44:17 [2020-08-23T21:44:17.932Z] Tests run: 7, Failures: 0, Errors: 0, Skipped: 0, Time elapsed: 4.877 s - in org.eclipse.egit.ui.internal.synchronize.model.GitModelCommitTest
17:44:17 [2020-08-23T21:44:17.932Z] shouldReturnNotEqualForDifferentCommits(org.eclipse.egit.ui.internal.synchronize.model.GitModelCommitTest)  Time elapsed: 0.592 s
17:44:17 [2020-08-23T21:44:17.932Z] shouldReturnNotEqualWhenCommitTreeAndBlob(org.eclipse.egit.ui.internal.synchronize.model.GitModelCommitTest)  Time elapsed: 0.597 s
17:44:17 [2020-08-23T21:44:17.932Z] shouldReturnNotEqualWhenCommitTreeAndTree(org.eclipse.egit.ui.internal.synchronize.model.GitModelCommitTest)  Time elapsed: 0.588 s
17:44:17 [2020-08-23T21:44:17.932Z] shouldReturnNotEqualWhenCommitTreeAndCache(org.eclipse.egit.ui.internal.synchronize.model.GitModelCommitTest)  Time elapsed: 0.619 s
17:44:17 [2020-08-23T21:44:17.932Z] shouldReturnEqualForSameInstance(org.eclipse.egit.ui.internal.synchronize.model.GitModelCommitTest)  Time elapsed: 0.583 s
17:44:17 [2020-08-23T21:44:17.932Z] shouldReturnNotEqualForDifferentParents(org.eclipse.egit.ui.internal.synchronize.model.GitModelCommitTest)  Time elapsed: 1.292 s
17:44:17 [2020-08-23T21:44:17.932Z] shouldReturnEqualForSameCommits(org.eclipse.egit.ui.internal.synchronize.model.GitModelCommitTest)  Time elapsed: 0.59 s
17:44:17 [2020-08-23T21:44:17.932Z] Running org.eclipse.egit.ui.internal.synchronize.model.GitModelRepositoryTest
17:44:19 [2020-08-23T21:44:19.836Z] Tests run: 3, Failures: 0, Errors: 0, Skipped: 0, Time elapsed: 2.241 s - in org.eclipse.egit.ui.internal.synchronize.model.GitModelRepositoryTest
17:44:19 [2020-08-23T21:44:19.836Z] shouldReturnEqual(org.eclipse.egit.ui.internal.synchronize.model.GitModelRepositoryTest)  Time elapsed: 0.705 s
17:44:19 [2020-08-23T21:44:19.836Z] shouldReturnNotEqual(org.eclipse.egit.ui.internal.synchronize.model.GitModelRepositoryTest)  Time elapsed: 0.722 s
17:44:19 [2020-08-23T21:44:19.836Z] shouldReturnEqualForSameInstance(org.eclipse.egit.ui.internal.synchronize.model.GitModelRepositoryTest)  Time elapsed: 0.804 s
17:44:19 [2020-08-23T21:44:19.836Z] Running org.eclipse.egit.ui.internal.synchronize.model.GitModelCacheTest
17:44:25 [2020-08-23T21:44:25.098Z] Tests run: 6, Failures: 0, Errors: 0, Skipped: 0, Time elapsed: 4.462 s - in org.eclipse.egit.ui.internal.synchronize.model.GitModelCacheTest
17:44:25 [2020-08-23T21:44:25.098Z] shouldReturnChildren(org.eclipse.egit.ui.internal.synchronize.model.GitModelCacheTest)  Time elapsed: 0.593 s
17:44:25 [2020-08-23T21:44:25.098Z] shouldReturnNotEqualWhenCacheTreeAndCommit(org.eclipse.egit.ui.internal.synchronize.model.GitModelCacheTest)  Time elapsed: 0.659 s
17:44:25 [2020-08-23T21:44:25.098Z] shouldReturnEqualForSameInstance(org.eclipse.egit.ui.internal.synchronize.model.GitModelCacheTest)  Time elapsed: 0.59 s
17:44:25 [2020-08-23T21:44:25.098Z] shouldReturnEqualForSameCommits(org.eclipse.egit.ui.internal.synchronize.model.GitModelCacheTest)  Time elapsed: 0.594 s
17:44:25 [2020-08-23T21:44:25.098Z] shouldReturnNotEqualWhenComparingCacheAndWorkingTree(org.eclipse.egit.ui.internal.synchronize.model.GitModelCacheTest)  Time elapsed: 0.643 s
17:44:25 [2020-08-23T21:44:25.098Z] shouldReturnNotEqualForDifferentRepositories(org.eclipse.egit.ui.internal.synchronize.model.GitModelCacheTest)  Time elapsed: 1.368 s
17:44:25 [2020-08-23T21:44:25.098Z] Running org.eclipse.egit.ui.internal.synchronize.model.GitModelTreeTest
17:44:27 [2020-08-23T21:44:27.623Z] Tests run: 6, Failures: 0, Errors: 0, Skipped: 0, Time elapsed: 3.595 s - in org.eclipse.egit.ui.internal.synchronize.model.GitModelTreeTest
17:44:27 [2020-08-23T21:44:27.623Z] shouldReturnNotEqualForDifferentLocation(org.eclipse.egit.ui.internal.synchronize.model.GitModelTreeTest)  Time elapsed: 0.586 s
17:44:27 [2020-08-23T21:44:27.623Z] shouldReturnNotEqualForTreeAndCacheTree(org.eclipse.egit.ui.internal.synchronize.model.GitModelTreeTest)  Time elapsed: 0.608 s
17:44:27 [2020-08-23T21:44:27.623Z] shouldReturnNotEqualForTreeAndCommit(org.eclipse.egit.ui.internal.synchronize.model.GitModelTreeTest)  Time elapsed: 0.588 s
17:44:27 [2020-08-23T21:44:27.623Z] shouldReturnEqualForSameBaseCommit(org.eclipse.egit.ui.internal.synchronize.model.GitModelTreeTest)  Time elapsed: 0.614 s
17:44:27 [2020-08-23T21:44:27.623Z] shouldReturnEqualForSameInstance(org.eclipse.egit.ui.internal.synchronize.model.GitModelTreeTest)  Time elapsed: 0.594 s
17:44:27 [2020-08-23T21:44:27.623Z] shouldReturnNotEqualForTreeAndBlob(org.eclipse.egit.ui.internal.synchronize.model.GitModelTreeTest)  Time elapsed: 0.592 s
17:44:27 [2020-08-23T21:44:27.623Z] Running org.eclipse.egit.ui.internal.synchronize.mapping.GitChangeSetSorterTest
17:44:27 [2020-08-23T21:44:27.881Z] Tests run: 23, Failures: 0, Errors: 0, Skipped: 0, Time elapsed: 0.186 s - in org.eclipse.egit.ui.internal.synchronize.mapping.GitChangeSetSorterTest
17:44:27 [2020-08-23T21:44:27.881Z] commitTreeShouldBeLessThanBlob(org.eclipse.egit.ui.internal.synchronize.mapping.GitChangeSetSorterTest)  Time elapsed: 0.023 s
17:44:27 [2020-08-23T21:44:27.881Z] commitTreeShouldBeLessThanTree(org.eclipse.egit.ui.internal.synchronize.mapping.GitChangeSetSorterTest)  Time elapsed: 0 s
17:44:27 [2020-08-23T21:44:27.881Z] blobShouldBeGreaterThanTree(org.eclipse.egit.ui.internal.synchronize.mapping.GitChangeSetSorterTest)  Time elapsed: 0 s
17:44:27 [2020-08-23T21:44:27.881Z] cacheTreeShouldBeLessThanCommit(org.eclipse.egit.ui.internal.synchronize.mapping.GitChangeSetSorterTest)  Time elapsed: 0 s
17:44:27 [2020-08-23T21:44:27.881Z] shouldOrderTreesAlphabetically(org.eclipse.egit.ui.internal.synchronize.mapping.GitChangeSetSorterTest)  Time elapsed: 0.158 s
17:44:27 [2020-08-23T21:44:27.881Z] commitTreeShouldBeGreaterThanCache(org.eclipse.egit.ui.internal.synchronize.mapping.GitChangeSetSorterTest)  Time elapsed: 0 s
17:44:27 [2020-08-23T21:44:27.881Z] blobShouldBeGreaterThanWorkingTree(org.eclipse.egit.ui.internal.synchronize.mapping.GitChangeSetSorterTest)  Time elapsed: 0 s
17:44:27 [2020-08-23T21:44:27.881Z] treeShouldBeGreaterThanCache(org.eclipse.egit.ui.internal.synchronize.mapping.GitChangeSetSorterTest)  Time elapsed: 0 s
17:44:27 [2020-08-23T21:44:27.881Z] treeShouldBeGreaterThanCommit(org.eclipse.egit.ui.internal.synchronize.mapping.GitChangeSetSorterTest)  Time elapsed: 0 s
17:44:27 [2020-08-23T21:44:27.881Z] workingTreeShouldBeLessThanCacheTree(org.eclipse.egit.ui.internal.synchronize.mapping.GitChangeSetSorterTest)  Time elapsed: 0.001 s
17:44:27 [2020-08-23T21:44:27.881Z] treeShouldBeGreaterThanWorkingTree(org.eclipse.egit.ui.internal.synchronize.mapping.GitChangeSetSorterTest)  Time elapsed: 0 s
17:44:27 [2020-08-23T21:44:27.881Z] blobShouldBeGreaterThanCache(org.eclipse.egit.ui.internal.synchronize.mapping.GitChangeSetSorterTest)  Time elapsed: 0 s
17:44:27 [2020-08-23T21:44:27.881Z] cacheTreeShouldBeLessThanBlob(org.eclipse.egit.ui.internal.synchronize.mapping.GitChangeSetSorterTest)  Time elapsed: 0 s
17:44:27 [2020-08-23T21:44:27.881Z] cacheTreeShouldBeLessThanTree(org.eclipse.egit.ui.internal.synchronize.mapping.GitChangeSetSorterTest)  Time elapsed: 0 s
17:44:27 [2020-08-23T21:44:27.881Z] shouldOrderBlobsAlphabetically(org.eclipse.egit.ui.internal.synchronize.mapping.GitChangeSetSorterTest)  Time elapsed: 0 s
17:44:27 [2020-08-23T21:44:27.881Z] commitTreeShouldBeGreaterThanWorkingTree(org.eclipse.egit.ui.internal.synchronize.mapping.GitChangeSetSorterTest)  Time elapsed: 0.001 s
17:44:27 [2020-08-23T21:44:27.881Z] treeShouldBeLessThanBlob(org.eclipse.egit.ui.internal.synchronize.mapping.GitChangeSetSorterTest)  Time elapsed: 0 s
17:44:27 [2020-08-23T21:44:27.881Z] cacheTreeShouldBeGreaterThanWorkingTree(org.eclipse.egit.ui.internal.synchronize.mapping.GitChangeSetSorterTest)  Time elapsed: 0 s
17:44:27 [2020-08-23T21:44:27.881Z] workingTreeShouldBeLessThanBlob(org.eclipse.egit.ui.internal.synchronize.mapping.GitChangeSetSorterTest)  Time elapsed: 0 s
17:44:27 [2020-08-23T21:44:27.881Z] workingTreeShouldBeLessThanTree(org.eclipse.egit.ui.internal.synchronize.mapping.GitChangeSetSorterTest)  Time elapsed: 0 s
17:44:27 [2020-08-23T21:44:27.881Z] shouldOrderCommitsByCommitDate(org.eclipse.egit.ui.internal.synchronize.mapping.GitChangeSetSorterTest)  Time elapsed: 0 s
17:44:27 [2020-08-23T21:44:27.881Z] workingTreeShouldBeLessThanCommit(org.eclipse.egit.ui.internal.synchronize.mapping.GitChangeSetSorterTest)  Time elapsed: 0 s
17:44:27 [2020-08-23T21:44:27.881Z] blobShouldBeGreaterThanCommit(org.eclipse.egit.ui.internal.synchronize.mapping.GitChangeSetSorterTest)  Time elapsed: 0 s
17:44:27 [2020-08-23T21:44:27.881Z] Running org.eclipse.egit.ui.internal.CompareUtilsTest
17:44:30 [2020-08-23T21:44:30.426Z] Tests run: 3, Failures: 0, Errors: 0, Skipped: 0, Time elapsed: 2.603 s - in org.eclipse.egit.ui.internal.CompareUtilsTest
17:44:30 [2020-08-23T21:44:30.426Z] testIndexEditWithAttributes(org.eclipse.egit.ui.internal.CompareUtilsTest)  Time elapsed: 0.954 s
17:44:30 [2020-08-23T21:44:30.426Z] testIndexEdit(org.eclipse.egit.ui.internal.CompareUtilsTest)  Time elapsed: 0.902 s
17:44:30 [2020-08-23T21:44:30.426Z] testIndexEditExecutable(org.eclipse.egit.ui.internal.CompareUtilsTest)  Time elapsed: 0.739 s
17:44:30 [2020-08-23T21:44:30.426Z] Running org.eclipse.egit.ui.internal.clone.SmartImportWizardTest
17:44:31 [2020-08-23T21:44:31.795Z] Tests run: 1, Failures: 0, Errors: 0, Skipped: 0, Time elapsed: 0.997 s - in org.eclipse.egit.ui.internal.clone.SmartImportWizardTest
17:44:31 [2020-08-23T21:44:31.796Z] test(org.eclipse.egit.ui.internal.clone.SmartImportWizardTest)  Time elapsed: 0.994 s
17:44:31 [2020-08-23T21:44:31.796Z] Running org.eclipse.egit.ui.internal.push.PushBranchWizardTest
17:44:32 [2020-08-23T21:44:32.360Z] 
17:44:32 [2020-08-23T21:44:32.360Z] (SWT:1602): Gtk-CRITICAL **: 21:44:32.163: gtk_box_gadget_distribute: assertion 'size >= 0' failed in GtkScrollbar
17:44:32 [2020-08-23T21:44:32.360Z] 
17:44:32 [2020-08-23T21:44:32.360Z] (SWT:1602): Gtk-CRITICAL **: 21:44:32.164: gtk_box_gadget_distribute: assertion 'size >= 0' failed in GtkScrollbar
17:44:32 [2020-08-23T21:44:32.360Z] 
17:44:32 [2020-08-23T21:44:32.360Z] (SWT:1602): Gtk-CRITICAL **: 21:44:32.165: gtk_box_gadget_distribute: assertion 'size >= 0' failed in GtkScrollbar
17:44:42 [2020-08-23T21:44:42.335Z] Tests run: 9, Failures: 0, Errors: 0, Skipped: 0, Time elapsed: 9.344 s - in org.eclipse.egit.ui.internal.push.PushBranchWizardTest
17:44:42 [2020-08-23T21:44:42.335Z] pushHeadToExistingRemote(org.eclipse.egit.ui.internal.push.PushBranchWizardTest)  Time elapsed: 0.961 s
17:44:42 [2020-08-23T21:44:42.335Z] pushWithRemoteUpstreamConfiguration(org.eclipse.egit.ui.internal.push.PushBranchWizardTest)  Time elapsed: 1.175 s
17:44:42 [2020-08-23T21:44:42.335Z] pushWithDifferentBranchName(org.eclipse.egit.ui.internal.push.PushBranchWizardTest)  Time elapsed: 1.021 s
17:44:42 [2020-08-23T21:44:42.335Z] pushToExistingRemoteAndSetRebase(org.eclipse.egit.ui.internal.push.PushBranchWizardTest)  Time elapsed: 0.979 s
17:44:42 [2020-08-23T21:44:42.335Z] pushToNewRemote(org.eclipse.egit.ui.internal.push.PushBranchWizardTest)  Time elapsed: 1.097 s
17:44:42 [2020-08-23T21:44:42.335Z] pushToExistingRemoteWithoutConfiguringUpstream(org.eclipse.egit.ui.internal.push.PushBranchWizardTest)  Time elapsed: 0.978 s
17:44:42 [2020-08-23T21:44:42.335Z] pushToExistingRemote(org.eclipse.egit.ui.internal.push.PushBranchWizardTest)  Time elapsed: 1 s
17:44:42 [2020-08-23T21:44:42.335Z] pushWhenNoRemoteExistsYet(org.eclipse.egit.ui.internal.push.PushBranchWizardTest)  Time elapsed: 1.108 s
17:44:42 [2020-08-23T21:44:42.335Z] pushWithLocalUpstreamConfiguration(org.eclipse.egit.ui.internal.push.PushBranchWizardTest)  Time elapsed: 0.998 s
17:44:42 [2020-08-23T21:44:42.335Z] Running org.eclipse.egit.ui.internal.push.PushTagsWizardTest
17:44:42 [2020-08-23T21:44:42.335Z] Tests run: 1, Failures: 0, Errors: 0, Skipped: 0, Time elapsed: 0.972 s - in org.eclipse.egit.ui.internal.push.PushTagsWizardTest
17:44:42 [2020-08-23T21:44:42.335Z] pushTag(org.eclipse.egit.ui.internal.push.PushTagsWizardTest)  Time elapsed: 0.968 s
17:44:42 [2020-08-23T21:44:42.335Z] Running org.eclipse.egit.ui.internal.push.PushToUpstreamTest
17:44:44 [2020-08-23T21:44:44.857Z] Tests run: 3, Failures: 0, Errors: 0, Skipped: 0, Time elapsed: 2.87 s - in org.eclipse.egit.ui.internal.push.PushToUpstreamTest
17:44:44 [2020-08-23T21:44:44.857Z] pushWithExistingUpstreamConfiguration(org.eclipse.egit.ui.internal.push.PushToUpstreamTest)  Time elapsed: 0.906 s
17:44:44 [2020-08-23T21:44:44.857Z] pushWithoutConfig(org.eclipse.egit.ui.internal.push.PushToUpstreamTest)  Time elapsed: 0.991 s
17:44:44 [2020-08-23T21:44:44.857Z] pushWithDefaultRemoteWithPushRefSpecs(org.eclipse.egit.ui.internal.push.PushToUpstreamTest)  Time elapsed: 0.964 s
17:44:44 [2020-08-23T21:44:44.857Z] Running org.eclipse.egit.ui.internal.branch.BranchProjectTrackerTest
17:44:45 [2020-08-23T21:44:45.792Z] Tests run: 1, Failures: 0, Errors: 0, Skipped: 0, Time elapsed: 1.067 s - in org.eclipse.egit.ui.internal.branch.BranchProjectTrackerTest
17:44:45 [2020-08-23T21:44:45.792Z] twoProjectsWithOnlyOneOnBranch(org.eclipse.egit.ui.internal.branch.BranchProjectTrackerTest)  Time elapsed: 1.063 s
17:44:45 [2020-08-23T21:44:45.792Z] Running org.eclipse.egit.ui.internal.decorators.DecoratableResourceAdapterTest
17:44:57 [2020-08-23T21:44:57.991Z] Tests run: 13, Failures: 0, Errors: 0, Skipped: 0, Time elapsed: 11.32 s - in org.eclipse.egit.ui.internal.decorators.DecoratableResourceAdapterTest
17:44:57 [2020-08-23T21:44:57.991Z] testDecorationDeletedFile(org.eclipse.egit.ui.internal.decorators.DecoratableResourceAdapterTest)  Time elapsed: 0.797 s
17:44:57 [2020-08-23T21:44:57.991Z] testDecorationModifiedFile(org.eclipse.egit.ui.internal.decorators.DecoratableResourceAdapterTest)  Time elapsed: 0.985 s
17:44:57 [2020-08-23T21:44:57.991Z] testDecorationEmptyProject(org.eclipse.egit.ui.internal.decorators.DecoratableResourceAdapterTest)  Time elapsed: 0.706 s
17:44:57 [2020-08-23T21:44:57.991Z] testDecorationConflictingFile(org.eclipse.egit.ui.internal.decorators.DecoratableResourceAdapterTest)  Time elapsed: 0.913 s
17:44:57 [2020-08-23T21:44:57.991Z] testDecorationNewEmptyFolder(org.eclipse.egit.ui.internal.decorators.DecoratableResourceAdapterTest)  Time elapsed: 0.831 s
17:44:57 [2020-08-23T21:44:57.991Z] testDecorationFolderPrefixOfOtherFolder(org.eclipse.egit.ui.internal.decorators.DecoratableResourceAdapterTest)  Time elapsed: 0.995 s
17:44:57 [2020-08-23T21:44:57.991Z] testDecorationNewFileInOneSubfolder(org.eclipse.egit.ui.internal.decorators.DecoratableResourceAdapterTest)  Time elapsed: 0.818 s
17:44:57 [2020-08-23T21:44:57.991Z] testDecorationNewFile(org.eclipse.egit.ui.internal.decorators.DecoratableResourceAdapterTest)  Time elapsed: 0.988 s
17:44:57 [2020-08-23T21:44:57.991Z] testDecorationNewFileInSubfolder(org.eclipse.egit.ui.internal.decorators.DecoratableResourceAdapterTest)  Time elapsed: 0.802 s
17:44:57 [2020-08-23T21:44:57.991Z] testDecorationCommittedFile(org.eclipse.egit.ui.internal.decorators.DecoratableResourceAdapterTest)  Time elapsed: 0.983 s
17:44:57 [2020-08-23T21:44:57.991Z] testDecorationFileInIgnoredFolder(org.eclipse.egit.ui.internal.decorators.DecoratableResourceAdapterTest)  Time elapsed: 0.798 s
17:44:57 [2020-08-23T21:44:57.991Z] testDecorationIgnoredFile(org.eclipse.egit.ui.internal.decorators.DecoratableResourceAdapterTest)  Time elapsed: 0.883 s
17:44:57 [2020-08-23T21:44:57.991Z] testDecorationAddedFile(org.eclipse.egit.ui.internal.decorators.DecoratableResourceAdapterTest)  Time elapsed: 0.793 s
17:44:57 [2020-08-23T21:44:57.991Z] Running org.eclipse.egit.ui.internal.decorators.DecoratableWorkingSetTest
17:45:04 [2020-08-23T21:45:04.539Z] Tests run: 7, Failures: 0, Errors: 0, Skipped: 0, Time elapsed: 7.052 s - in org.eclipse.egit.ui.internal.decorators.DecoratableWorkingSetTest
17:45:04 [2020-08-23T21:45:04.539Z] testAnyConflictsIsConflicts(org.eclipse.egit.ui.internal.decorators.DecoratableWorkingSetTest)  Time elapsed: 1.07 s
17:45:04 [2020-08-23T21:45:04.539Z] testUntrackedContentIsUndecorated(org.eclipse.egit.ui.internal.decorators.DecoratableWorkingSetTest)  Time elapsed: 0.789 s
17:45:04 [2020-08-23T21:45:04.539Z] testAnyDirtyIsDirty(org.eclipse.egit.ui.internal.decorators.DecoratableWorkingSetTest)  Time elapsed: 1.283 s
17:45:04 [2020-08-23T21:45:04.539Z] testDecorationConflictingOverDirty(org.eclipse.egit.ui.internal.decorators.DecoratableWorkingSetTest)  Time elapsed: 1.002 s
17:45:04 [2020-08-23T21:45:04.539Z] testEmptyWorkingSetIsUndecorated(org.eclipse.egit.ui.internal.decorators.DecoratableWorkingSetTest)  Time elapsed: 1.122 s
17:45:04 [2020-08-23T21:45:04.539Z] testStagingStateHasNoInfluence_Modified(org.eclipse.egit.ui.internal.decorators.DecoratableWorkingSetTest)  Time elapsed: 0.796 s
17:45:04 [2020-08-23T21:45:04.539Z] testAnyTrackedIsTracked(org.eclipse.egit.ui.internal.decorators.DecoratableWorkingSetTest)  Time elapsed: 0.987 s
17:45:04 [2020-08-23T21:45:04.539Z] Running org.eclipse.egit.ui.internal.decorators.DecoratableResourceMappingTest
17:45:12 [2020-08-23T21:45:12.634Z] Tests run: 9, Failures: 0, Errors: 0, Skipped: 0, Time elapsed: 8.322 s - in org.eclipse.egit.ui.internal.decorators.DecoratableResourceMappingTest
17:45:12 [2020-08-23T21:45:12.634Z] testAnyConflictsIsConflicts(org.eclipse.egit.ui.internal.decorators.DecoratableResourceMappingTest)  Time elapsed: 1.018 s
17:45:12 [2020-08-23T21:45:12.634Z] testSameStagingStateIsState_Added(org.eclipse.egit.ui.internal.decorators.DecoratableResourceMappingTest)  Time elapsed: 1 s
17:45:12 [2020-08-23T21:45:12.634Z] testAnyDirtyIsDirty(org.eclipse.egit.ui.internal.decorators.DecoratableResourceMappingTest)  Time elapsed: 0.803 s
17:45:12 [2020-08-23T21:45:12.634Z] testMixedStagingStateIsModified_RemovedAdded(org.eclipse.egit.ui.internal.decorators.DecoratableResourceMappingTest)  Time elapsed: 1.008 s
17:45:12 [2020-08-23T21:45:12.634Z] testAllIgnoredIsUnstaged(org.eclipse.egit.ui.internal.decorators.DecoratableResourceMappingTest)  Time elapsed: 0.798 s
17:45:12 [2020-08-23T21:45:12.634Z] testDecorationConflictingOverDirty(org.eclipse.egit.ui.internal.decorators.DecoratableResourceMappingTest)  Time elapsed: 0.988 s
17:45:12 [2020-08-23T21:45:12.634Z] testMixedStagingStateIsModified_AddedNotStaged(org.eclipse.egit.ui.internal.decorators.DecoratableResourceMappingTest)  Time elapsed: 0.869 s
17:45:12 [2020-08-23T21:45:12.634Z] testNewResourceMappingIsUnstaged(org.eclipse.egit.ui.internal.decorators.DecoratableResourceMappingTest)  Time elapsed: 0.9 s
17:45:12 [2020-08-23T21:45:12.634Z] testAnyTrackedIsTracked(org.eclipse.egit.ui.internal.decorators.DecoratableResourceMappingTest)  Time elapsed: 0.903 s
17:45:12 [2020-08-23T21:45:12.634Z] Running org.eclipse.egit.ui.internal.fetch.FetchGerritChangeTest
17:45:12 [2020-08-23T21:45:12.634Z] Tests run: 15, Failures: 0, Errors: 0, Skipped: 0, Time elapsed: 0.004 s - in org.eclipse.egit.ui.internal.fetch.FetchGerritChangeTest
17:45:12 [2020-08-23T21:45:12.634Z] testChangeStringNoDigits(org.eclipse.egit.ui.internal.fetch.FetchGerritChangeTest)  Time elapsed: 0.002 s
17:45:12 [2020-08-23T21:45:12.634Z] testChangeStringOverflow(org.eclipse.egit.ui.internal.fetch.FetchGerritChangeTest)  Time elapsed: 0 s
17:45:12 [2020-08-23T21:45:12.634Z] testChangeStringTwoNumbers(org.eclipse.egit.ui.internal.fetch.FetchGerritChangeTest)  Time elapsed: 0 s
17:45:12 [2020-08-23T21:45:12.634Z] testFromRef(org.eclipse.egit.ui.internal.fetch.FetchGerritChangeTest)  Time elapsed: 0.001 s
17:45:12 [2020-08-23T21:45:12.634Z] testChangeStringNegative(org.eclipse.egit.ui.internal.fetch.FetchGerritChangeTest)  Time elapsed: 0 s
17:45:12 [2020-08-23T21:45:12.634Z] testChangeStringUri(org.eclipse.egit.ui.internal.fetch.FetchGerritChangeTest)  Time elapsed: 0 s
17:45:12 [2020-08-23T21:45:12.634Z] testRefFromChange(org.eclipse.egit.ui.internal.fetch.FetchGerritChangeTest)  Time elapsed: 0 s
17:45:12 [2020-08-23T21:45:12.634Z] testChangeStringUriNonsense(org.eclipse.egit.ui.internal.fetch.FetchGerritChangeTest)  Time elapsed: 0 s
17:45:12 [2020-08-23T21:45:12.634Z] testChangeStringThreeNumbers(org.eclipse.egit.ui.internal.fetch.FetchGerritChangeTest)  Time elapsed: 0 s
17:45:12 [2020-08-23T21:45:12.634Z] testChangeStringMultiline(org.eclipse.egit.ui.internal.fetch.FetchGerritChangeTest)  Time elapsed: 0 s
17:45:12 [2020-08-23T21:45:12.634Z] testChangeStringSingleNumber(org.eclipse.egit.ui.internal.fetch.FetchGerritChangeTest)  Time elapsed: 0 s
17:45:12 [2020-08-23T21:45:12.634Z] testChangeRefs(org.eclipse.egit.ui.internal.fetch.FetchGerritChangeTest)  Time elapsed: 0.001 s
17:45:12 [2020-08-23T21:45:12.634Z] testChangeStringEmpty(org.eclipse.egit.ui.internal.fetch.FetchGerritChangeTest)  Time elapsed: 0 s
17:45:12 [2020-08-23T21:45:12.634Z] testChangeStringNull(org.eclipse.egit.ui.internal.fetch.FetchGerritChangeTest)  Time elapsed: 0 s
17:45:12 [2020-08-23T21:45:12.634Z] testChangeStringZero(org.eclipse.egit.ui.internal.fetch.FetchGerritChangeTest)  Time elapsed: 0 s
17:45:12 [2020-08-23T21:45:12.634Z] Running org.eclipse.egit.ui.submodule.SubmoduleUpdateTest
17:45:13 [2020-08-23T21:45:13.565Z] 
17:45:13 [2020-08-23T21:45:13.565Z] (SWT:1602): Gtk-WARNING **: 21:45:13.311: Negative content width -6 (allocation 1, extents 4x3) while allocating gadget (node toolbar, owner GtkToolbar)
17:45:16 [2020-08-23T21:45:16.090Z] 
17:45:16 [2020-08-23T21:45:16.090Z] (SWT:1602): Gtk-WARNING **: 21:45:15.671: Negative content width -6 (allocation 1, extents 4x3) while allocating gadget (node toolbar, owner GtkToolbar)
17:45:16 [2020-08-23T21:45:16.090Z] Tests run: 1, Failures: 0, Errors: 0, Skipped: 0, Time elapsed: 3.397 s - in org.eclipse.egit.ui.submodule.SubmoduleUpdateTest
17:45:16 [2020-08-23T21:45:16.090Z] updateSubmodule(org.eclipse.egit.ui.submodule.SubmoduleUpdateTest)  Time elapsed: 3.393 s
17:45:16 [2020-08-23T21:45:16.090Z] Running org.eclipse.egit.ui.submodule.SubmoduleAddTest
17:45:16 [2020-08-23T21:45:16.653Z] 
17:45:16 [2020-08-23T21:45:16.653Z] (SWT:1602): Gtk-WARNING **: 21:45:16.519: Negative content width -6 (allocation 1, extents 4x3) while allocating gadget (node toolbar, owner GtkToolbar)
17:45:19 [2020-08-23T21:45:19.183Z] 
17:45:19 [2020-08-23T21:45:19.183Z] (SWT:1602): Gtk-WARNING **: 21:45:18.855: Negative content width -6 (allocation 1, extents 4x3) while allocating gadget (node toolbar, owner GtkToolbar)
17:45:19 [2020-08-23T21:45:19.183Z] Tests run: 1, Failures: 0, Errors: 0, Skipped: 0, Time elapsed: 3.183 s - in org.eclipse.egit.ui.submodule.SubmoduleAddTest
17:45:19 [2020-08-23T21:45:19.183Z] addAtRoot(org.eclipse.egit.ui.submodule.SubmoduleAddTest)  Time elapsed: 3.178 s
17:45:19 [2020-08-23T21:45:19.183Z] Running org.eclipse.egit.ui.submodule.SubmoduleSyncTest
17:45:19 [2020-08-23T21:45:19.747Z] 
17:45:19 [2020-08-23T21:45:19.747Z] (SWT:1602): Gtk-WARNING **: 21:45:19.737: Negative content width -6 (allocation 1, extents 4x3) while allocating gadget (node toolbar, owner GtkToolbar)
17:45:22 [2020-08-23T21:45:22.269Z] 
17:45:22 [2020-08-23T21:45:22.269Z] (SWT:1602): Gtk-WARNING **: 21:45:22.218: Negative content width -6 (allocation 1, extents 4x3) while allocating gadget (node toolbar, owner GtkToolbar)
17:45:22 [2020-08-23T21:45:22.527Z] Tests run: 1, Failures: 0, Errors: 0, Skipped: 0, Time elapsed: 3.34 s - in org.eclipse.egit.ui.submodule.SubmoduleSyncTest
17:45:22 [2020-08-23T21:45:22.527Z] syncSubmodule(org.eclipse.egit.ui.submodule.SubmoduleSyncTest)  Time elapsed: 3.336 s
17:45:22 [2020-08-23T21:45:22.527Z] Running org.eclipse.egit.ui.httpauth.PushTest
17:45:22 [2020-08-23T21:45:22.527Z] 2020-08-23 21:45:22.404:INFO:oejs.Server:WorkbenchTestable: jetty-9.4.30.v20200611; built: 2020-06-16T05:54:33.713Z; git: 271836e4c1f4612f12b7bb13ef5a92a927634b0d; jvm 1.8.0_262-b10
17:45:22 [2020-08-23T21:45:22.527Z] 2020-08-23 21:45:22.405:INFO:oejsh.ContextHandler:WorkbenchTestable: Started o.e.j.s.ServletContextHandler@65a44b1{/sbasic,null,AVAILABLE}
17:45:22 [2020-08-23T21:45:22.527Z] 2020-08-23 21:45:22.411:INFO:oejs.AbstractConnector:WorkbenchTestable: Started ServerConnector@452d2a4b{HTTP/1.1, (http/1.1)}{127.0.0.1:41369}
17:45:22 [2020-08-23T21:45:22.527Z] 2020-08-23 21:45:22.411:INFO:oejs.Server:WorkbenchTestable: Started @724514ms
17:45:23 [2020-08-23T21:45:23.459Z] 
17:45:23 [2020-08-23T21:45:23.459Z] (SWT:1602): Gtk-CRITICAL **: 21:45:23.220: gtk_box_gadget_distribute: assertion 'size >= 0' failed in GtkCheckButton
17:45:24 [2020-08-23T21:45:24.389Z] 2020-08-23 21:45:24.073:INFO:oejs.AbstractConnector:WorkbenchTestable: Stopped ServerConnector@452d2a4b{HTTP/1.1, (http/1.1)}{127.0.0.1:0}
17:45:24 [2020-08-23T21:45:24.389Z] 2020-08-23 21:45:24.073:INFO:oejsh.ContextHandler:WorkbenchTestable: Stopped o.e.j.s.ServletContextHandler@65a44b1{/sbasic,null,UNAVAILABLE}
17:45:24 [2020-08-23T21:45:24.389Z] Tests run: 1, Failures: 0, Errors: 0, Skipped: 0, Time elapsed: 1.756 s - in org.eclipse.egit.ui.httpauth.PushTest
17:45:24 [2020-08-23T21:45:24.389Z] testPush(org.eclipse.egit.ui.httpauth.PushTest)  Time elapsed: 1.756 s
17:45:24 [2020-08-23T21:45:24.389Z] Running org.eclipse.egit.ui.search.CommitSearchDialogTest
17:45:24 [2020-08-23T21:45:24.954Z] 
17:45:24 [2020-08-23T21:45:24.954Z] (SWT:1602): Gtk-WARNING **: 21:45:24.771: Negative content width -6 (allocation 1, extents 4x3) while allocating gadget (node toolbar, owner GtkToolbar)
17:45:24 [2020-08-23T21:45:24.954Z] 
17:45:24 [2020-08-23T21:45:24.954Z] (SWT:1602): Gtk-WARNING **: 21:45:24.783: Negative content width -6 (allocation 1, extents 4x3) while allocating gadget (node toolbar, owner GtkToolbar)
17:45:24 [2020-08-23T21:45:24.954Z] 
17:45:24 [2020-08-23T21:45:24.954Z] (SWT:1602): Gtk-WARNING **: 21:45:24.828: Negative content width -6 (allocation 1, extents 4x3) while allocating gadget (node toolbar, owner GtkToolbar)
17:45:24 [2020-08-23T21:45:24.954Z] 
17:45:24 [2020-08-23T21:45:24.954Z] (SWT:1602): Gtk-WARNING **: 21:45:24.890: Negative content width -6 (allocation 1, extents 4x3) while allocating gadget (node toolbar, owner GtkToolbar)
17:45:25 [2020-08-23T21:45:25.883Z] 
17:45:25 [2020-08-23T21:45:25.883Z] (SWT:1602): Gtk-WARNING **: 21:45:25.542: Negative content width -6 (allocation 1, extents 4x3) while allocating gadget (node toolbar, owner GtkToolbar)
17:45:25 [2020-08-23T21:45:25.883Z] Tests run: 1, Failures: 0, Errors: 0, Skipped: 0, Time elapsed: 1.573 s - in org.eclipse.egit.ui.search.CommitSearchDialogTest
17:45:25 [2020-08-23T21:45:25.883Z] openCommitTabOnSearchDialog(org.eclipse.egit.ui.search.CommitSearchDialogTest)  Time elapsed: 1.57 s
17:45:25 [2020-08-23T21:45:25.883Z] Running org.eclipse.egit.ui.search.CommitSearchQueryTest
17:45:30 [2020-08-23T21:45:30.060Z] Tests run: 7, Failures: 0, Errors: 0, Skipped: 0, Time elapsed: 4.282 s - in org.eclipse.egit.ui.search.CommitSearchQueryTest
17:45:30 [2020-08-23T21:45:30.060Z] testQuery(org.eclipse.egit.ui.search.CommitSearchQueryTest)  Time elapsed: 0.592 s
17:45:30 [2020-08-23T21:45:30.060Z] testMatchMessage(org.eclipse.egit.ui.search.CommitSearchQueryTest)  Time elapsed: 0.592 s
17:45:30 [2020-08-23T21:45:30.060Z] testCaseInsensitive(org.eclipse.egit.ui.search.CommitSearchQueryTest)  Time elapsed: 0.601 s
17:45:30 [2020-08-23T21:45:30.060Z] testMatchCommit(org.eclipse.egit.ui.search.CommitSearchQueryTest)  Time elapsed: 0.587 s
17:45:30 [2020-08-23T21:45:30.060Z] testMatchParent(org.eclipse.egit.ui.search.CommitSearchQueryTest)  Time elapsed: 0.663 s
17:45:30 [2020-08-23T21:45:30.060Z] testMatchTree(org.eclipse.egit.ui.search.CommitSearchQueryTest)  Time elapsed: 0.626 s
17:45:30 [2020-08-23T21:45:30.060Z] testEmptyMatches(org.eclipse.egit.ui.search.CommitSearchQueryTest)  Time elapsed: 0.602 s
17:45:30 [2020-08-23T21:45:30.060Z] Running org.eclipse.egit.ui.gitflow.CommandEnablementTest
17:45:31 [2020-08-23T21:45:31.441Z] 
17:45:31 [2020-08-23T21:45:31.441Z] (SWT:1602): Gtk-WARNING **: 21:45:31.187: Negative content width -6 (allocation 1, extents 4x3) while allocating gadget (node toolbar, owner GtkToolbar)
17:45:31 [2020-08-23T21:45:31.441Z] 
17:45:31 [2020-08-23T21:45:31.441Z] (SWT:1602): Gtk-WARNING **: 21:45:31.337: Negative content width -6 (allocation 1, extents 4x3) while allocating gadget (node toolbar, owner GtkToolbar)
17:45:31 [2020-08-23T21:45:31.701Z] Tests run: 2, Failures: 0, Errors: 0, Skipped: 0, Time elapsed: 1.729 s - in org.eclipse.egit.ui.gitflow.CommandEnablementTest
17:45:31 [2020-08-23T21:45:31.701Z] testPackageExplorerStartFinishEnablement(org.eclipse.egit.ui.gitflow.CommandEnablementTest)  Time elapsed: 0.706 s
17:45:31 [2020-08-23T21:45:31.701Z] testRepositoryViewStartFinishEnablement(org.eclipse.egit.ui.gitflow.CommandEnablementTest)  Time elapsed: 1.018 s
17:45:31 [2020-08-23T21:45:31.702Z] Running org.eclipse.egit.ui.gitflow.FeatureFinishSquashHandlerTest
17:45:32 [2020-08-23T21:45:32.633Z] 
17:45:32 [2020-08-23T21:45:32.633Z] (SWT:1602): Gtk-CRITICAL **: 21:45:32.362: gtk_box_gadget_distribute: assertion 'size >= 0' failed in GtkScrollbar
17:45:32 [2020-08-23T21:45:32.633Z] 
17:45:32 [2020-08-23T21:45:32.633Z] (SWT:1602): Gtk-CRITICAL **: 21:45:32.381: gtk_box_gadget_distribute: assertion 'size >= 0' failed in GtkScrollbar
17:45:32 [2020-08-23T21:45:32.633Z] 
17:45:32 [2020-08-23T21:45:32.633Z] (SWT:1602): Gtk-CRITICAL **: 21:45:32.398: gtk_box_gadget_distribute: assertion 'size >= 0' failed in GtkScrollbar
17:45:32 [2020-08-23T21:45:32.633Z] 
17:45:32 [2020-08-23T21:45:32.633Z] (SWT:1602): Gtk-CRITICAL **: 21:45:32.414: gtk_box_gadget_distribute: assertion 'size >= 0' failed in GtkScrollbar
17:45:32 [2020-08-23T21:45:32.633Z] 
17:45:32 [2020-08-23T21:45:32.633Z] (SWT:1602): Gtk-CRITICAL **: 21:45:32.430: gtk_box_gadget_distribute: assertion 'size >= 0' failed in GtkScrollbar
17:45:32 [2020-08-23T21:45:32.633Z] 
17:45:32 [2020-08-23T21:45:32.633Z] (SWT:1602): Gtk-CRITICAL **: 21:45:32.448: gtk_box_gadget_distribute: assertion 'size >= 0' failed in GtkScrollbar
17:45:32 [2020-08-23T21:45:32.633Z] 
17:45:32 [2020-08-23T21:45:32.633Z] (SWT:1602): Gtk-CRITICAL **: 21:45:32.464: gtk_box_gadget_distribute: assertion 'size >= 0' failed in GtkScrollbar
17:45:32 [2020-08-23T21:45:32.633Z] 
17:45:32 [2020-08-23T21:45:32.633Z] (SWT:1602): Gtk-CRITICAL **: 21:45:32.480: gtk_box_gadget_distribute: assertion 'size >= 0' failed in GtkScrollbar
17:45:32 [2020-08-23T21:45:32.633Z] 
17:45:32 [2020-08-23T21:45:32.633Z] (SWT:1602): Gtk-CRITICAL **: 21:45:32.497: gtk_box_gadget_distribute: assertion 'size >= 0' failed in GtkScrollbar
17:45:32 [2020-08-23T21:45:32.633Z] 
17:45:32 [2020-08-23T21:45:32.633Z] (SWT:1602): Gtk-CRITICAL **: 21:45:32.514: gtk_box_gadget_distribute: assertion 'size >= 0' failed in GtkScrollbar
17:45:32 [2020-08-23T21:45:32.633Z] 
17:45:32 [2020-08-23T21:45:32.633Z] (SWT:1602): Gtk-CRITICAL **: 21:45:32.531: gtk_box_gadget_distribute: assertion 'size >= 0' failed in GtkScrollbar
17:45:32 [2020-08-23T21:45:32.633Z] 
17:45:32 [2020-08-23T21:45:32.633Z] (SWT:1602): Gtk-CRITICAL **: 21:45:32.547: gtk_box_gadget_distribute: assertion 'size >= 0' failed in GtkScrollbar
17:45:32 [2020-08-23T21:45:32.634Z] 
17:45:32 [2020-08-23T21:45:32.634Z] (SWT:1602): Gtk-CRITICAL **: 21:45:32.564: gtk_box_gadget_distribute: assertion 'size >= 0' failed in GtkScrollbar
17:45:32 [2020-08-23T21:45:32.634Z] 
17:45:32 [2020-08-23T21:45:32.634Z] (SWT:1602): Gtk-CRITICAL **: 21:45:32.580: gtk_box_gadget_distribute: assertion 'size >= 0' failed in GtkScrollbar
17:45:32 [2020-08-23T21:45:32.634Z] 
17:45:32 [2020-08-23T21:45:32.634Z] (SWT:1602): Gtk-CRITICAL **: 21:45:32.597: gtk_box_gadget_distribute: assertion 'size >= 0' failed in GtkScrollbar
17:45:32 [2020-08-23T21:45:32.634Z] 
17:45:32 [2020-08-23T21:45:32.634Z] (SWT:1602): Gtk-CRITICAL **: 21:45:32.613: gtk_box_gadget_distribute: assertion 'size >= 0' failed in GtkScrollbar
17:45:33 [2020-08-23T21:45:33.197Z] 
17:45:33 [2020-08-23T21:45:33.197Z] (SWT:1602): Gtk-CRITICAL **: 21:45:33.074: gtk_box_gadget_distribute: assertion 'size >= 0' failed in GtkScrollbar
17:45:34 [2020-08-23T21:45:34.128Z] Tests run: 1, Failures: 0, Errors: 0, Skipped: 0, Time elapsed: 2.125 s - in org.eclipse.egit.ui.gitflow.FeatureFinishSquashHandlerTest
17:45:34 [2020-08-23T21:45:34.128Z] testFeatureFinishSquash(org.eclipse.egit.ui.gitflow.FeatureFinishSquashHandlerTest)  Time elapsed: 2.122 s
17:45:34 [2020-08-23T21:45:34.128Z] Running org.eclipse.egit.ui.gitflow.FeatureStartFinishHandlerTest
17:45:34 [2020-08-23T21:45:34.691Z] 
17:45:34 [2020-08-23T21:45:34.691Z] (SWT:1602): Gtk-CRITICAL **: 21:45:34.458: gtk_box_gadget_distribute: assertion 'size >= 0' failed in GtkScrollbar
17:45:34 [2020-08-23T21:45:34.691Z] 
17:45:34 [2020-08-23T21:45:34.691Z] (SWT:1602): Gtk-CRITICAL **: 21:45:34.472: gtk_box_gadget_distribute: assertion 'size >= 0' failed in GtkScrollbar
17:45:34 [2020-08-23T21:45:34.691Z] 
17:45:34 [2020-08-23T21:45:34.691Z] (SWT:1602): Gtk-CRITICAL **: 21:45:34.489: gtk_box_gadget_distribute: assertion 'size >= 0' failed in GtkScrollbar
17:45:34 [2020-08-23T21:45:34.691Z] 
17:45:34 [2020-08-23T21:45:34.691Z] (SWT:1602): Gtk-CRITICAL **: 21:45:34.505: gtk_box_gadget_distribute: assertion 'size >= 0' failed in GtkScrollbar
17:45:34 [2020-08-23T21:45:34.691Z] 
17:45:34 [2020-08-23T21:45:34.691Z] (SWT:1602): Gtk-CRITICAL **: 21:45:34.522: gtk_box_gadget_distribute: assertion 'size >= 0' failed in GtkScrollbar
17:45:34 [2020-08-23T21:45:34.691Z] 
17:45:34 [2020-08-23T21:45:34.691Z] (SWT:1602): Gtk-CRITICAL **: 21:45:34.539: gtk_box_gadget_distribute: assertion 'size >= 0' failed in GtkScrollbar
17:45:34 [2020-08-23T21:45:34.691Z] 
17:45:34 [2020-08-23T21:45:34.691Z] (SWT:1602): Gtk-CRITICAL **: 21:45:34.555: gtk_box_gadget_distribute: assertion 'size >= 0' failed in GtkScrollbar
17:45:34 [2020-08-23T21:45:34.691Z] 
17:45:34 [2020-08-23T21:45:34.691Z] (SWT:1602): Gtk-CRITICAL **: 21:45:34.571: gtk_box_gadget_distribute: assertion 'size >= 0' failed in GtkScrollbar
17:45:34 [2020-08-23T21:45:34.691Z] 
17:45:34 [2020-08-23T21:45:34.691Z] (SWT:1602): Gtk-CRITICAL **: 21:45:34.589: gtk_box_gadget_distribute: assertion 'size >= 0' failed in GtkScrollbar
17:45:34 [2020-08-23T21:45:34.691Z] 
17:45:34 [2020-08-23T21:45:34.691Z] (SWT:1602): Gtk-CRITICAL **: 21:45:34.605: gtk_box_gadget_distribute: assertion 'size >= 0' failed in GtkScrollbar
17:45:34 [2020-08-23T21:45:34.691Z] 
17:45:34 [2020-08-23T21:45:34.691Z] (SWT:1602): Gtk-CRITICAL **: 21:45:34.622: gtk_box_gadget_distribute: assertion 'size >= 0' failed in GtkScrollbar
17:45:34 [2020-08-23T21:45:34.691Z] 
17:45:34 [2020-08-23T21:45:34.691Z] (SWT:1602): Gtk-CRITICAL **: 21:45:34.639: gtk_box_gadget_distribute: assertion 'size >= 0' failed in GtkScrollbar
17:45:34 [2020-08-23T21:45:34.691Z] 
17:45:34 [2020-08-23T21:45:34.691Z] (SWT:1602): Gtk-CRITICAL **: 21:45:34.654: gtk_box_gadget_distribute: assertion 'size >= 0' failed in GtkScrollbar
17:45:34 [2020-08-23T21:45:34.691Z] 
17:45:34 [2020-08-23T21:45:34.691Z] (SWT:1602): Gtk-CRITICAL **: 21:45:34.672: gtk_box_gadget_distribute: assertion 'size >= 0' failed in GtkScrollbar
17:45:35 [2020-08-23T21:45:35.256Z] 
17:45:35 [2020-08-23T21:45:35.256Z] (SWT:1602): Gtk-CRITICAL **: 21:45:35.218: gtk_box_gadget_distribute: assertion 'size >= 0' failed in GtkScrollbar
17:45:35 [2020-08-23T21:45:35.820Z] Tests run: 1, Failures: 0, Errors: 0, Skipped: 0, Time elapsed: 1.996 s - in org.eclipse.egit.ui.gitflow.FeatureStartFinishHandlerTest
17:45:35 [2020-08-23T21:45:35.820Z] testFeatureStart(org.eclipse.egit.ui.gitflow.FeatureStartFinishHandlerTest)  Time elapsed: 1.992 s
17:45:35 [2020-08-23T21:45:35.820Z] Running org.eclipse.egit.ui.gitflow.FeatureFinishKeepBranchHandlerTest
17:45:36 [2020-08-23T21:45:36.752Z] 
17:45:36 [2020-08-23T21:45:36.752Z] (SWT:1602): Gtk-CRITICAL **: 21:45:36.488: gtk_box_gadget_distribute: assertion 'size >= 0' failed in GtkScrollbar
17:45:36 [2020-08-23T21:45:36.752Z] 
17:45:36 [2020-08-23T21:45:36.752Z] (SWT:1602): Gtk-CRITICAL **: 21:45:36.501: gtk_box_gadget_distribute: assertion 'size >= 0' failed in GtkScrollbar
17:45:36 [2020-08-23T21:45:36.752Z] 
17:45:36 [2020-08-23T21:45:36.752Z] (SWT:1602): Gtk-CRITICAL **: 21:45:36.517: gtk_box_gadget_distribute: assertion 'size >= 0' failed in GtkScrollbar
17:45:36 [2020-08-23T21:45:36.752Z] 
17:45:36 [2020-08-23T21:45:36.752Z] (SWT:1602): Gtk-CRITICAL **: 21:45:36.534: gtk_box_gadget_distribute: assertion 'size >= 0' failed in GtkScrollbar
17:45:36 [2020-08-23T21:45:36.752Z] 
17:45:36 [2020-08-23T21:45:36.752Z] (SWT:1602): Gtk-CRITICAL **: 21:45:36.551: gtk_box_gadget_distribute: assertion 'size >= 0' failed in GtkScrollbar
17:45:36 [2020-08-23T21:45:36.752Z] 
17:45:36 [2020-08-23T21:45:36.752Z] (SWT:1602): Gtk-CRITICAL **: 21:45:36.567: gtk_box_gadget_distribute: assertion 'size >= 0' failed in GtkScrollbar
17:45:36 [2020-08-23T21:45:36.752Z] 
17:45:36 [2020-08-23T21:45:36.752Z] (SWT:1602): Gtk-CRITICAL **: 21:45:36.584: gtk_box_gadget_distribute: assertion 'size >= 0' failed in GtkScrollbar
17:45:36 [2020-08-23T21:45:36.752Z] 
17:45:36 [2020-08-23T21:45:36.752Z] (SWT:1602): Gtk-CRITICAL **: 21:45:36.600: gtk_box_gadget_distribute: assertion 'size >= 0' failed in GtkScrollbar
17:45:36 [2020-08-23T21:45:36.752Z] 
17:45:36 [2020-08-23T21:45:36.752Z] (SWT:1602): Gtk-CRITICAL **: 21:45:36.617: gtk_box_gadget_distribute: assertion 'size >= 0' failed in GtkScrollbar
17:45:36 [2020-08-23T21:45:36.752Z] 
17:45:36 [2020-08-23T21:45:36.752Z] (SWT:1602): Gtk-CRITICAL **: 21:45:36.634: gtk_box_gadget_distribute: assertion 'size >= 0' failed in GtkScrollbar
17:45:36 [2020-08-23T21:45:36.752Z] 
17:45:36 [2020-08-23T21:45:36.752Z] (SWT:1602): Gtk-CRITICAL **: 21:45:36.651: gtk_box_gadget_distribute: assertion 'size >= 0' failed in GtkScrollbar
17:45:36 [2020-08-23T21:45:36.752Z] 
17:45:36 [2020-08-23T21:45:36.752Z] (SWT:1602): Gtk-CRITICAL **: 21:45:36.667: gtk_box_gadget_distribute: assertion 'size >= 0' failed in GtkScrollbar
17:45:36 [2020-08-23T21:45:36.752Z] 
17:45:36 [2020-08-23T21:45:36.752Z] (SWT:1602): Gtk-CRITICAL **: 21:45:36.683: gtk_box_gadget_distribute: assertion 'size >= 0' failed in GtkScrollbar
17:45:36 [2020-08-23T21:45:36.752Z] 
17:45:36 [2020-08-23T21:45:36.752Z] (SWT:1602): Gtk-CRITICAL **: 21:45:36.701: gtk_box_gadget_distribute: assertion 'size >= 0' failed in GtkScrollbar
17:45:36 [2020-08-23T21:45:36.752Z] 
17:45:36 [2020-08-23T21:45:36.752Z] (SWT:1602): Gtk-CRITICAL **: 21:45:36.717: gtk_box_gadget_distribute: assertion 'size >= 0' failed in GtkScrollbar
17:45:37 [2020-08-23T21:45:37.315Z] 
17:45:37 [2020-08-23T21:45:37.315Z] (SWT:1602): Gtk-CRITICAL **: 21:45:37.247: gtk_box_gadget_distribute: assertion 'size >= 0' failed in GtkScrollbar
17:45:37 [2020-08-23T21:45:37.878Z] Tests run: 1, Failures: 0, Errors: 0, Skipped: 0, Time elapsed: 2.039 s - in org.eclipse.egit.ui.gitflow.FeatureFinishKeepBranchHandlerTest
17:45:37 [2020-08-23T21:45:37.879Z] testFeatureFinishKeepBranch(org.eclipse.egit.ui.gitflow.FeatureFinishKeepBranchHandlerTest)  Time elapsed: 2.035 s
17:45:37 [2020-08-23T21:45:37.879Z] Running org.eclipse.egit.ui.gitflow.FeatureRebaseHandlerTest
17:45:38 [2020-08-23T21:45:38.811Z] 
17:45:38 [2020-08-23T21:45:38.812Z] (SWT:1602): Gtk-WARNING **: 21:45:38.676: Negative content width -6 (allocation 1, extents 4x3) while allocating gadget (node toolbar, owner GtkToolbar)
17:45:38 [2020-08-23T21:45:38.812Z] 
17:45:38 [2020-08-23T21:45:38.812Z] (SWT:1602): Gtk-WARNING **: 21:45:38.680: Negative content width -6 (allocation 1, extents 4x3) while allocating gadget (node toolbar, owner GtkToolbar)
17:45:38 [2020-08-23T21:45:38.812Z] 
17:45:38 [2020-08-23T21:45:38.812Z] (SWT:1602): Gtk-WARNING **: 21:45:38.684: Negative content width -6 (allocation 1, extents 4x3) while allocating gadget (node toolbar, owner GtkToolbar)
17:45:38 [2020-08-23T21:45:38.812Z] 
17:45:38 [2020-08-23T21:45:38.812Z] (SWT:1602): Gtk-WARNING **: 21:45:38.685: Negative content width -6 (allocation 1, extents 4x3) while allocating gadget (node toolbar, owner GtkToolbar)
17:45:38 [2020-08-23T21:45:38.812Z] 
17:45:38 [2020-08-23T21:45:38.812Z] (SWT:1602): Gtk-WARNING **: 21:45:38.686: Negative content width -6 (allocation 1, extents 4x3) while allocating gadget (node toolbar, owner GtkToolbar)
17:45:38 [2020-08-23T21:45:38.812Z] 
17:45:38 [2020-08-23T21:45:38.812Z] (SWT:1602): Gtk-WARNING **: 21:45:38.715: Negative content width -6 (allocation 1, extents 4x3) while allocating gadget (node toolbar, owner GtkToolbar)
17:45:39 [2020-08-23T21:45:39.376Z] 
17:45:39 [2020-08-23T21:45:39.376Z] (SWT:1602): Gtk-WARNING **: 21:45:39.153: Negative content height -1 (allocation 1, extents 1x1) while allocating gadget (node scrolledwindow, owner GtkScrolledWindow)
17:45:39 [2020-08-23T21:45:39.376Z] 
17:45:39 [2020-08-23T21:45:39.376Z] (SWT:1602): Gtk-CRITICAL **: 21:45:39.154: gtk_box_gadget_distribute: assertion 'size >= 0' failed in GtkScrollbar
17:45:39 [2020-08-23T21:45:39.376Z] 
17:45:39 [2020-08-23T21:45:39.376Z] (SWT:1602): Gtk-WARNING **: 21:45:39.202: Negative content width -6 (allocation 1, extents 4x3) while allocating gadget (node toolbar, owner GtkToolbar)
17:45:40 [2020-08-23T21:45:40.747Z] 
17:45:40 [2020-08-23T21:45:40.747Z] (SWT:1602): Gtk-WARNING **: 21:45:40.549: Negative content height -1 (allocation 1, extents 1x1) while allocating gadget (node scrolledwindow, owner GtkScrolledWindow)
17:45:40 [2020-08-23T21:45:40.747Z] 
17:45:40 [2020-08-23T21:45:40.747Z] (SWT:1602): Gtk-CRITICAL **: 21:45:40.549: gtk_box_gadget_distribute: assertion 'size >= 0' failed in GtkScrollbar
17:45:40 [2020-08-23T21:45:40.747Z] Tests run: 2, Failures: 0, Errors: 0, Skipped: 0, Time elapsed: 2.845 s - in org.eclipse.egit.ui.gitflow.FeatureRebaseHandlerTest
17:45:40 [2020-08-23T21:45:40.747Z] testRebaseFailOnConflict(org.eclipse.egit.ui.gitflow.FeatureRebaseHandlerTest)  Time elapsed: 1.463 s
17:45:40 [2020-08-23T21:45:40.747Z] testRebaseFailOnDirtyWorkingDirectory(org.eclipse.egit.ui.gitflow.FeatureRebaseHandlerTest)  Time elapsed: 1.375 s
17:45:40 [2020-08-23T21:45:40.747Z] Running org.eclipse.egit.ui.gitflow.InitHandlerTest
17:45:44 [2020-08-23T21:45:44.925Z] Tests run: 3, Failures: 0, Errors: 0, Skipped: 0, Time elapsed: 3.57 s - in org.eclipse.egit.ui.gitflow.InitHandlerTest
17:45:44 [2020-08-23T21:45:44.925Z] testInit(org.eclipse.egit.ui.gitflow.InitHandlerTest)  Time elapsed: 0.766 s
17:45:44 [2020-08-23T21:45:44.925Z] testInitEmptyRepoMissingMaster(org.eclipse.egit.ui.gitflow.InitHandlerTest)  Time elapsed: 1.426 s
17:45:44 [2020-08-23T21:45:44.925Z] testInitMissingMaster(org.eclipse.egit.ui.gitflow.InitHandlerTest)  Time elapsed: 1.372 s
17:45:44 [2020-08-23T21:45:44.925Z] Running org.eclipse.egit.ui.gitflow.FeatureStartCheckoutConflictTest
17:45:45 [2020-08-23T21:45:45.182Z] 
17:45:45 [2020-08-23T21:45:45.183Z] (SWT:1602): Gtk-CRITICAL **: 21:45:44.940: gtk_box_gadget_distribute: assertion 'size >= 0' failed in GtkScrollbar
17:45:45 [2020-08-23T21:45:45.183Z] 
17:45:45 [2020-08-23T21:45:45.183Z] (SWT:1602): Gtk-CRITICAL **: 21:45:44.950: gtk_box_gadget_distribute: assertion 'size >= 0' failed in GtkScrollbar
17:45:45 [2020-08-23T21:45:45.183Z] Tests run: 1, Failures: 0, Errors: 0, Skipped: 0, Time elapsed: 0.831 s - in org.eclipse.egit.ui.gitflow.FeatureStartCheckoutConflictTest
17:45:45 [2020-08-23T21:45:45.183Z] testFeatureStart(org.eclipse.egit.ui.gitflow.FeatureStartCheckoutConflictTest)  Time elapsed: 0.827 s
17:45:45 [2020-08-23T21:45:45.183Z] Running org.eclipse.egit.ui.variables.DynamicVariablesTest
17:45:49 [2020-08-23T21:45:49.364Z] Tests run: 4, Failures: 0, Errors: 0, Skipped: 0, Time elapsed: 4.253 s - in org.eclipse.egit.ui.variables.DynamicVariablesTest
17:45:49 [2020-08-23T21:45:49.364Z] testGitBranch(org.eclipse.egit.ui.variables.DynamicVariablesTest)  Time elapsed: 1.068 s
17:45:49 [2020-08-23T21:45:49.364Z] testGitPath(org.eclipse.egit.ui.variables.DynamicVariablesTest)  Time elapsed: 1.051 s
17:45:49 [2020-08-23T21:45:49.364Z] testGitWorkTree(org.eclipse.egit.ui.variables.DynamicVariablesTest)  Time elapsed: 1.062 s
17:45:49 [2020-08-23T21:45:49.364Z] testGitDir(org.eclipse.egit.ui.variables.DynamicVariablesTest)  Time elapsed: 1.072 s
17:45:49 [2020-08-23T21:45:49.364Z] Running org.eclipse.egit.ui.prefpages.configuration.GlobalConfigurationPageTest
17:45:49 [2020-08-23T21:45:49.622Z] 
17:45:49 [2020-08-23T21:45:49.622Z] !ENTRY org.eclipse.ui 2 2 2020-08-23 21:45:49.366
17:45:49 [2020-08-23T21:45:49.622Z] !MESSAGE Invalid preference category path: org.eclipse.ui.net.NetPreferences (bundle: org.eclipse.jsch.ui, page: org.eclipse.jsch.ui.SSHPreferences)
17:45:49 [2020-08-23T21:45:49.622Z] 
17:45:49 [2020-08-23T21:45:49.622Z] (SWT:1602): Gtk-WARNING **: 21:45:49.381: Negative content width -13 (allocation 5, extents 9x9) while allocating gadget (node entry, owner GtkEntry)
17:45:49 [2020-08-23T21:45:49.622Z] 
17:45:49 [2020-08-23T21:45:49.622Z] (SWT:1602): Gtk-WARNING **: 21:45:49.521: Negative content width -13 (allocation 5, extents 9x9) while allocating gadget (node entry, owner GtkEntry)
17:45:49 [2020-08-23T21:45:49.879Z] 
17:45:49 [2020-08-23T21:45:49.879Z] (SWT:1602): Gtk-WARNING **: 21:45:49.659: Negative content width -13 (allocation 5, extents 9x9) while allocating gadget (node entry, owner GtkEntry)
17:45:49 [2020-08-23T21:45:49.879Z] 
17:45:49 [2020-08-23T21:45:49.879Z] (SWT:1602): Gtk-WARNING **: 21:45:49.775: Negative content width -13 (allocation 5, extents 9x9) while allocating gadget (node entry, owner GtkEntry)
17:45:49 [2020-08-23T21:45:49.879Z] 
17:45:49 [2020-08-23T21:45:49.879Z] (SWT:1602): Gtk-WARNING **: 21:45:49.850: Negative content width -13 (allocation 5, extents 9x9) while allocating gadget (node entry, owner GtkEntry)
17:45:50 [2020-08-23T21:45:50.136Z] 
17:45:50 [2020-08-23T21:45:50.136Z] (SWT:1602): Gtk-WARNING **: 21:45:49.936: Negative content width -13 (allocation 5, extents 9x9) while allocating gadget (node entry, owner GtkEntry)
17:45:50 [2020-08-23T21:45:50.136Z] 
17:45:50 [2020-08-23T21:45:50.136Z] (SWT:1602): Gtk-WARNING **: 21:45:50.053: Negative content width -13 (allocation 5, extents 9x9) while allocating gadget (node entry, owner GtkEntry)
17:45:50 [2020-08-23T21:45:50.136Z] 
17:45:50 [2020-08-23T21:45:50.136Z] (SWT:1602): Gtk-WARNING **: 21:45:50.102: Negative content width -6 (allocation 1, extents 4x3) while allocating gadget (node toolbar, owner GtkToolbar)
17:45:50 [2020-08-23T21:45:50.136Z] 
17:45:50 [2020-08-23T21:45:50.136Z] (SWT:1602): Gtk-WARNING **: 21:45:50.102: Negative content height -3 (allocation 1, extents 2x2) while allocating gadget (node toolbar, owner GtkToolbar)
17:45:50 [2020-08-23T21:45:50.136Z] 
17:45:50 [2020-08-23T21:45:50.136Z] (SWT:1602): Gtk-WARNING **: 21:45:50.102: Negative content width -6 (allocation 1, extents 4x3) while allocating gadget (node toolbar, owner GtkToolbar)
17:45:50 [2020-08-23T21:45:50.136Z] 
17:45:50 [2020-08-23T21:45:50.136Z] (SWT:1602): Gtk-WARNING **: 21:45:50.102: Negative content height -3 (allocation 1, extents 2x2) while allocating gadget (node toolbar, owner GtkToolbar)
17:45:50 [2020-08-23T21:45:50.393Z] 
17:45:50 [2020-08-23T21:45:50.393Z] (SWT:1602): Gtk-WARNING **: 21:45:50.199: Negative content width -13 (allocation 5, extents 9x9) while allocating gadget (node entry, owner GtkEntry)
17:45:50 [2020-08-23T21:45:50.393Z] 
17:45:50 [2020-08-23T21:45:50.393Z] (SWT:1602): Gtk-WARNING **: 21:45:50.314: Negative content width -13 (allocation 5, extents 9x9) while allocating gadget (node entry, owner GtkEntry)
17:45:50 [2020-08-23T21:45:50.650Z] 
17:45:50 [2020-08-23T21:45:50.650Z] (SWT:1602): Gtk-WARNING **: 21:45:50.454: Negative content width -13 (allocation 5, extents 9x9) while allocating gadget (node entry, owner GtkEntry)
17:45:50 [2020-08-23T21:45:50.650Z] 
17:45:50 [2020-08-23T21:45:50.650Z] (SWT:1602): Gtk-WARNING **: 21:45:50.566: Negative content width -13 (allocation 5, extents 9x9) while allocating gadget (node entry, owner GtkEntry)
17:45:50 [2020-08-23T21:45:50.907Z] 
17:45:50 [2020-08-23T21:45:50.907Z] (SWT:1602): Gtk-WARNING **: 21:45:50.683: Negative content width -13 (allocation 5, extents 9x9) while allocating gadget (node entry, owner GtkEntry)
17:45:50 [2020-08-23T21:45:50.907Z] Tests run: 11, Failures: 0, Errors: 0, Skipped: 0, Time elapsed: 1.438 s - in org.eclipse.egit.ui.prefpages.configuration.GlobalConfigurationPageTest
17:45:50 [2020-08-23T21:45:50.907Z] testAddSubSectionEntry(org.eclipse.egit.ui.prefpages.configuration.GlobalConfigurationPageTest)  Time elapsed: 0.161 s
17:45:50 [2020-08-23T21:45:50.907Z] testAddSectionEntry(org.eclipse.egit.ui.prefpages.configuration.GlobalConfigurationPageTest)  Time elapsed: 0.138 s
17:45:50 [2020-08-23T21:45:50.907Z] testCanCreateSameEntryValue(org.eclipse.egit.ui.prefpages.configuration.GlobalConfigurationPageTest)  Time elapsed: 0.116 s
17:45:50 [2020-08-23T21:45:50.907Z] testNodes(org.eclipse.egit.ui.prefpages.configuration.GlobalConfigurationPageTest)  Time elapsed: 0.075 s
17:45:50 [2020-08-23T21:45:50.907Z] testRemoveValue(org.eclipse.egit.ui.prefpages.configuration.GlobalConfigurationPageTest)  Time elapsed: 0.086 s
17:45:50 [2020-08-23T21:45:50.907Z] testAddSubSectionEntryWithSuggestion(org.eclipse.egit.ui.prefpages.configuration.GlobalConfigurationPageTest)  Time elapsed: 0.118 s
17:45:50 [2020-08-23T21:45:50.907Z] testOpenEditor(org.eclipse.egit.ui.prefpages.configuration.GlobalConfigurationPageTest)  Time elapsed: 0.146 s
17:45:50 [2020-08-23T21:45:50.907Z] testSubsectionWithDot(org.eclipse.egit.ui.prefpages.configuration.GlobalConfigurationPageTest)  Time elapsed: 0.114 s
17:45:50 [2020-08-23T21:45:50.907Z] testChecksForKey(org.eclipse.egit.ui.prefpages.configuration.GlobalConfigurationPageTest)  Time elapsed: 0.14 s
17:45:50 [2020-08-23T21:45:50.907Z] testRemoveSubSection(org.eclipse.egit.ui.prefpages.configuration.GlobalConfigurationPageTest)  Time elapsed: 0.112 s
17:45:50 [2020-08-23T21:45:50.907Z] testRemoveSection(org.eclipse.egit.ui.prefpages.configuration.GlobalConfigurationPageTest)  Time elapsed: 0.117 s
17:45:50 [2020-08-23T21:45:50.908Z] Running org.eclipse.egit.ui.operations.GitScopeUtilTest
17:45:55 [2020-08-23T21:45:55.084Z] Tests run: 5, Failures: 0, Errors: 0, Skipped: 0, Time elapsed: 4.223 s - in org.eclipse.egit.ui.operations.GitScopeUtilTest
17:45:55 [2020-08-23T21:45:55.084Z] relatedChangesWithPrompt(org.eclipse.egit.ui.operations.GitScopeUtilTest)  Time elapsed: 1.538 s
17:45:55 [2020-08-23T21:45:55.084Z] modelProviderWithExtensionFiles(org.eclipse.egit.ui.operations.GitScopeUtilTest)  Time elapsed: 0.736 s
17:45:55 [2020-08-23T21:45:55.084Z] relatedChangesWithInvalidParams(org.eclipse.egit.ui.operations.GitScopeUtilTest)  Time elapsed: 0.591 s
17:45:55 [2020-08-23T21:45:55.084Z] relatedChangesWithNullResources(org.eclipse.egit.ui.operations.GitScopeUtilTest)  Time elapsed: 0.662 s
17:45:55 [2020-08-23T21:45:55.084Z] relatedChangesWithEmptyResources(org.eclipse.egit.ui.operations.GitScopeUtilTest)  Time elapsed: 0.695 s
17:45:55 [2020-08-23T21:45:55.084Z] 
17:45:55 [2020-08-23T21:45:55.084Z] Results:
17:45:55 [2020-08-23T21:45:55.084Z] 
17:45:55 [2020-08-23T21:45:55.084Z] Errors: 
17:45:55 [2020-08-23T21:45:55.084Z]   CommitNonWSChangesTest>LocalRepositoryTestCase.afterClassBase:288 » IO Could n...
17:45:55 [2020-08-23T21:45:55.084Z] 
17:45:55 [2020-08-23T21:45:55.084Z] Tests run: 542, Failures: 0, Errors: 1, Skipped: 12
17:45:55 [2020-08-23T21:45:55.084Z] 
17:45:56 [2020-08-23T21:45:56.016Z] 
17:45:56 [2020-08-23T21:45:56.016Z] !ENTRY org.eclipse.core.resources 2 10035 2020-08-23 21:45:55.957
17:45:56 [2020-08-23T21:45:56.016Z] !MESSAGE The workspace will exit with unsaved changes in this session.
17:45:57 [2020-08-23T21:45:57.421Z] [INFO] ------------------------------------------------------------------------
17:45:57 [2020-08-23T21:45:57.421Z] [INFO] Reactor Summary for EGit Parent 5.9.0-SNAPSHOT:
17:45:57 [2020-08-23T21:45:57.421Z] [INFO] 
17:45:57 [2020-08-23T21:45:57.421Z] [INFO] EGit Parent ........................................ SUCCESS [ 34.498 s]
17:45:57 [2020-08-23T21:45:57.421Z] [INFO] EGit Target Platform Definition .................... SUCCESS [  1.217 s]
17:45:57 [2020-08-23T21:45:57.421Z] [INFO] Eclipse EGit ....................................... SUCCESS [  6.563 s]
17:45:57 [2020-08-23T21:45:57.421Z] [INFO] Git Team Provider (Core) ........................... SUCCESS [ 16.389 s]
17:45:57 [2020-08-23T21:45:57.421Z] [INFO] Git Team Provider (UI) ............................. SUCCESS [ 43.834 s]
17:45:57 [2020-08-23T21:45:57.421Z] [INFO] EGit Mylyn UI ...................................... SUCCESS [  6.380 s]
17:45:57 [2020-08-23T21:45:57.421Z] [INFO] Git Team Provider (Documentation) .................. SUCCESS [  4.578 s]
17:45:57 [2020-08-23T21:45:57.421Z] [INFO] Eclipse EGit Feature ............................... SUCCESS [  1.140 s]
17:45:57 [2020-08-23T21:45:57.421Z] [INFO] EGit Mylyn Feature ................................. SUCCESS [  1.092 s]
17:45:57 [2020-08-23T21:45:57.421Z] [INFO] Git Flow ........................................... SUCCESS [  5.984 s]
17:45:57 [2020-08-23T21:45:57.421Z] [INFO] Git Flow UI ........................................ SUCCESS [  7.866 s]
17:45:57 [2020-08-23T21:45:57.421Z] [INFO] Eclipse EGit Gitflow Feature ....................... SUCCESS [  1.089 s]
17:45:57 [2020-08-23T21:45:57.421Z] [INFO] EGit JUnit Support ................................. SUCCESS [  6.183 s]
17:45:57 [2020-08-23T21:45:57.421Z] [INFO] GitFlow Test Plug-in ............................... SUCCESS [ 24.531 s]
17:45:57 [2020-08-23T21:45:57.421Z] [INFO] Eclipse EGit Source Feature ........................ SUCCESS [  1.068 s]
17:45:57 [2020-08-23T21:45:57.421Z] [INFO] EGit P2 Repository ................................. SUCCESS [ 15.461 s]
17:45:57 [2020-08-23T21:45:57.421Z] [INFO] EGit Core Test Plug-in ............................. SUCCESS [02:12 min]
17:45:57 [2020-08-23T21:45:57.421Z] [INFO] EGit UI Test Plug-in ............................... FAILURE [12:40 min]
17:45:57 [2020-08-23T21:45:57.421Z] [INFO] EGit Mylyn UI Test Plug-in ......................... SKIPPED
17:45:57 [2020-08-23T21:45:57.421Z] [INFO] ------------------------------------------------------------------------
17:45:57 [2020-08-23T21:45:57.421Z] [INFO] BUILD FAILURE
17:45:57 [2020-08-23T21:45:57.421Z] [INFO] ------------------------------------------------------------------------
17:45:57 [2020-08-23T21:45:57.421Z] [INFO] Total time:  20:26 min
17:45:57 [2020-08-23T21:45:57.421Z] [INFO] Finished at: 2020-08-23T21:45:57Z
17:45:57 [2020-08-23T21:45:57.421Z] [INFO] ------------------------------------------------------------------------
17:45:57 [2020-08-23T21:45:57.421Z] [ERROR] Failed to execute goal org.eclipse.tycho:tycho-surefire-plugin:1.7.0:test (default-test) on project org.eclipse.egit.ui.test: There are test failures.
17:45:57 [2020-08-23T21:45:57.421Z] [ERROR] 
17:45:57 [2020-08-23T21:45:57.421Z] [ERROR] Please refer to /home/jenkins/agent/workspace/egit/repo/org.eclipse.egit.ui.test/target/surefire-reports for the individual test results.
17:45:57 [2020-08-23T21:45:57.421Z] [ERROR] -> [Help 1]
17:45:57 [2020-08-23T21:45:57.421Z] org.apache.maven.lifecycle.LifecycleExecutionException: Failed to execute goal org.eclipse.tycho:tycho-surefire-plugin:1.7.0:test (default-test) on project org.eclipse.egit.ui.test: There are test failures.
17:45:57 [2020-08-23T21:45:57.421Z] 
17:45:57 [2020-08-23T21:45:57.421Z] Please refer to /home/jenkins/agent/workspace/egit/repo/org.eclipse.egit.ui.test/target/surefire-reports for the individual test results.
17:45:57 [2020-08-23T21:45:57.421Z]     at org.apache.maven.lifecycle.internal.MojoExecutor.execute (MojoExecutor.java:215)
17:45:57 [2020-08-23T21:45:57.422Z]     at org.apache.maven.lifecycle.internal.MojoExecutor.execute (MojoExecutor.java:156)
17:45:57 [2020-08-23T21:45:57.422Z]     at org.apache.maven.lifecycle.internal.MojoExecutor.execute (MojoExecutor.java:148)
17:45:57 [2020-08-23T21:45:57.422Z]     at org.apache.maven.lifecycle.internal.LifecycleModuleBuilder.buildProject (LifecycleModuleBuilder.java:117)
17:45:57 [2020-08-23T21:45:57.422Z]     at org.apache.maven.lifecycle.internal.LifecycleModuleBuilder.buildProject (LifecycleModuleBuilder.java:81)
17:45:57 [2020-08-23T21:45:57.422Z]     at org.apache.maven.lifecycle.internal.builder.singlethreaded.SingleThreadedBuilder.build (SingleThreadedBuilder.java:56)
17:45:57 [2020-08-23T21:45:57.422Z]     at org.apache.maven.lifecycle.internal.LifecycleStarter.execute (LifecycleStarter.java:128)
17:45:57 [2020-08-23T21:45:57.422Z]     at org.apache.maven.DefaultMaven.doExecute (DefaultMaven.java:305)
17:45:57 [2020-08-23T21:45:57.422Z]     at org.apache.maven.DefaultMaven.doExecute (DefaultMaven.java:192)
17:45:57 [2020-08-23T21:45:57.422Z]     at org.apache.maven.DefaultMaven.execute (DefaultMaven.java:105)
17:45:57 [2020-08-23T21:45:57.422Z]     at org.apache.maven.cli.MavenCli.execute (MavenCli.java:957)
17:45:57 [2020-08-23T21:45:57.422Z]     at org.apache.maven.cli.MavenCli.doMain (MavenCli.java:289)
17:45:57 [2020-08-23T21:45:57.422Z]     at org.apache.maven.cli.MavenCli.main (MavenCli.java:193)
17:45:57 [2020-08-23T21:45:57.422Z]     at sun.reflect.NativeMethodAccessorImpl.invoke0 (Native Method)
17:45:57 [2020-08-23T21:45:57.422Z]     at sun.reflect.NativeMethodAccessorImpl.invoke (NativeMethodAccessorImpl.java:62)
17:45:57 [2020-08-23T21:45:57.422Z]     at sun.reflect.DelegatingMethodAccessorImpl.invoke (DelegatingMethodAccessorImpl.java:43)
17:45:57 [2020-08-23T21:45:57.422Z]     at java.lang.reflect.Method.invoke (Method.java:498)
17:45:57 [2020-08-23T21:45:57.422Z]     at org.codehaus.plexus.classworlds.launcher.Launcher.launchEnhanced (Launcher.java:282)
17:45:57 [2020-08-23T21:45:57.422Z]     at org.codehaus.plexus.classworlds.launcher.Launcher.launch (Launcher.java:225)
17:45:57 [2020-08-23T21:45:57.422Z]     at org.codehaus.plexus.classworlds.launcher.Launcher.mainWithExitCode (Launcher.java:406)
17:45:57 [2020-08-23T21:45:57.422Z]     at org.codehaus.plexus.classworlds.launcher.Launcher.main (Launcher.java:347)
17:45:57 [2020-08-23T21:45:57.422Z] Caused by: org.apache.maven.plugin.MojoFailureException: There are test failures.
17:45:57 [2020-08-23T21:45:57.422Z] 
17:45:57 [2020-08-23T21:45:57.422Z] Please refer to /home/jenkins/agent/workspace/egit/repo/org.eclipse.egit.ui.test/target/surefire-reports for the individual test results.
17:45:57 [2020-08-23T21:45:57.422Z]     at org.eclipse.tycho.surefire.TestMojo.runTest (TestMojo.java:1063)
17:45:57 [2020-08-23T21:45:57.422Z]     at org.eclipse.tycho.surefire.TestMojo.execute (TestMojo.java:712)
17:45:57 [2020-08-23T21:45:57.422Z]     at org.apache.maven.plugin.DefaultBuildPluginManager.executeMojo (DefaultBuildPluginManager.java:137)
17:45:57 [2020-08-23T21:45:57.422Z]     at org.apache.maven.lifecycle.internal.MojoExecutor.execute (MojoExecutor.java:210)
17:45:57 [2020-08-23T21:45:57.422Z]     at org.apache.maven.lifecycle.internal.MojoExecutor.execute (MojoExecutor.java:156)
17:45:57 [2020-08-23T21:45:57.422Z]     at org.apache.maven.lifecycle.internal.MojoExecutor.execute (MojoExecutor.java:148)
17:45:57 [2020-08-23T21:45:57.422Z]     at org.apache.maven.lifecycle.internal.LifecycleModuleBuilder.buildProject (LifecycleModuleBuilder.java:117)
17:45:57 [2020-08-23T21:45:57.422Z]     at org.apache.maven.lifecycle.internal.LifecycleModuleBuilder.buildProject (LifecycleModuleBuilder.java:81)
17:45:57 [2020-08-23T21:45:57.422Z]     at org.apache.maven.lifecycle.internal.builder.singlethreaded.SingleThreadedBuilder.build (SingleThreadedBuilder.java:56)
17:45:57 [2020-08-23T21:45:57.422Z]     at org.apache.maven.lifecycle.internal.LifecycleStarter.execute (LifecycleStarter.java:128)
17:45:57 [2020-08-23T21:45:57.422Z]     at org.apache.maven.DefaultMaven.doExecute (DefaultMaven.java:305)
17:45:57 [2020-08-23T21:45:57.422Z]     at org.apache.maven.DefaultMaven.doExecute (DefaultMaven.java:192)
17:45:57 [2020-08-23T21:45:57.422Z]     at org.apache.maven.DefaultMaven.execute (DefaultMaven.java:105)
17:45:57 [2020-08-23T21:45:57.422Z]     at org.apache.maven.cli.MavenCli.execute (MavenCli.java:957)
17:45:57 [2020-08-23T21:45:57.422Z]     at org.apache.maven.cli.MavenCli.doMain (MavenCli.java:289)
17:45:57 [2020-08-23T21:45:57.422Z]     at org.apache.maven.cli.MavenCli.main (MavenCli.java:193)
17:45:57 [2020-08-23T21:45:57.422Z]     at sun.reflect.NativeMethodAccessorImpl.invoke0 (Native Method)
17:45:57 [2020-08-23T21:45:57.422Z]     at sun.reflect.NativeMethodAccessorImpl.invoke (NativeMethodAccessorImpl.java:62)
17:45:57 [2020-08-23T21:45:57.422Z]     at sun.reflect.DelegatingMethodAccessorImpl.invoke (DelegatingMethodAccessorImpl.java:43)
17:45:57 [2020-08-23T21:45:57.422Z]     at java.lang.reflect.Method.invoke (Method.java:498)
17:45:57 [2020-08-23T21:45:57.422Z]     at org.codehaus.plexus.classworlds.launcher.Launcher.launchEnhanced (Launcher.java:282)
17:45:57 [2020-08-23T21:45:57.422Z]     at org.codehaus.plexus.classworlds.launcher.Launcher.launch (Launcher.java:225)
17:45:57 [2020-08-23T21:45:57.422Z]     at org.codehaus.plexus.classworlds.launcher.Launcher.mainWithExitCode (Launcher.java:406)
17:45:57 [2020-08-23T21:45:57.422Z]     at org.codehaus.plexus.classworlds.launcher.Launcher.main (Launcher.java:347)
17:45:57 [2020-08-23T21:45:57.422Z] [ERROR] 
17:45:57 [2020-08-23T21:45:57.422Z] [ERROR] Re-run Maven using the -X switch to enable full debug logging.
17:45:57 [2020-08-23T21:45:57.422Z] [ERROR] 
17:45:57 [2020-08-23T21:45:57.422Z] [ERROR] For more information about the errors and possible solutions, please read the following articles:
17:45:57 [2020-08-23T21:45:57.422Z] [ERROR] [Help 1] http://cwiki.apache.org/confluence/display/MAVEN/MojoFailureException
17:45:57 [2020-08-23T21:45:57.422Z] [ERROR] 
17:45:57 [2020-08-23T21:45:57.422Z] [ERROR] After correcting the problems, you can resume the build with the command
17:45:57 [2020-08-23T21:45:57.422Z] [ERROR]   mvn <args> -rf :org.eclipse.egit.ui.test
[Pipeline] }
[Pipeline] // stage
[Pipeline] stage
[Pipeline] { (Results)
[Pipeline] junit
17:45:58 [2020-08-23T21:45:58.413Z] Recording test results
[Pipeline] archiveArtifacts
17:45:59 [2020-08-23T21:45:59.198Z] Archiving artifacts
[Pipeline] findbugs
17:46:02 [2020-08-23T21:46:02.029Z] [FINDBUGS] Collecting findbugs analysis files...
17:46:05 [2020-08-23T21:46:05.429Z] [FINDBUGS] Searching for all files in /home/jenkins/agent/workspace/egit/repo that match the pattern */target/*bugsXml.xml
17:46:05 [2020-08-23T21:46:05.430Z] [FINDBUGS] Parsing 8 files in /home/jenkins/agent/workspace/egit/repo
17:46:05 [2020-08-23T21:46:05.430Z] [FINDBUGS] Successfully parsed file /home/jenkins/agent/workspace/egit/repo/org.eclipse.egit.core.junit/target/spotbugsXml.xml with 4 unique warnings and 0 duplicates.
17:46:05 [2020-08-23T21:46:05.430Z] [FINDBUGS] Successfully parsed file /home/jenkins/agent/workspace/egit/repo/org.eclipse.egit.core.test/target/spotbugsXml.xml with 9 unique warnings and 0 duplicates.
17:46:05 [2020-08-23T21:46:05.430Z] [FINDBUGS] Successfully parsed file /home/jenkins/agent/workspace/egit/repo/org.eclipse.egit.core/target/spotbugsXml.xml with 20 unique warnings and 0 duplicates.
17:46:05 [2020-08-23T21:46:05.430Z] [FINDBUGS] Successfully parsed file /home/jenkins/agent/workspace/egit/repo/org.eclipse.egit.gitflow.test/target/spotbugsXml.xml with 20 unique warnings and 0 duplicates.
17:46:05 [2020-08-23T21:46:05.430Z] [FINDBUGS] Successfully parsed file /home/jenkins/agent/workspace/egit/repo/org.eclipse.egit.gitflow.ui/target/spotbugsXml.xml with 20 unique warnings and 0 duplicates.
17:46:05 [2020-08-23T21:46:05.430Z] [FINDBUGS] Successfully parsed file /home/jenkins/agent/workspace/egit/repo/org.eclipse.egit.gitflow/target/spotbugsXml.xml with 22 unique warnings and 0 duplicates.
17:46:05 [2020-08-23T21:46:05.430Z] [FINDBUGS] Successfully parsed file /home/jenkins/agent/workspace/egit/repo/org.eclipse.egit.mylyn.ui/target/spotbugsXml.xml with 22 unique warnings and 0 duplicates.
17:46:05 [2020-08-23T21:46:05.430Z] [FINDBUGS] Successfully parsed file /home/jenkins/agent/workspace/egit/repo/org.eclipse.egit.ui/target/spotbugsXml.xml with 59 unique warnings and 0 duplicates.
17:46:05 [2020-08-23T21:46:05.430Z] Skipping warnings blame since pipelines do not have an SCM link.%n
17:46:05 [2020-08-23T21:46:05.491Z] [FINDBUGS] Computing warning deltas based on reference build #464
[Pipeline] dry
17:46:05 [2020-08-23T21:46:05.680Z] [DRY] Collecting duplicate code analysis files...
17:46:05 [2020-08-23T21:46:05.909Z] [DRY] Searching for all files in /home/jenkins/agent/workspace/egit/repo that match the pattern **/cpd.xml
17:46:05 [2020-08-23T21:46:05.909Z] [DRY] Parsing 15 files in /home/jenkins/agent/workspace/egit/repo
17:46:05 [2020-08-23T21:46:05.909Z] [DRY] Successfully parsed file /home/jenkins/agent/workspace/egit/repo/org.eclipse.egit-feature/target/cpd.xml with 0 unique warnings and 0 duplicates.
17:46:05 [2020-08-23T21:46:05.909Z] [DRY] Successfully parsed file /home/jenkins/agent/workspace/egit/repo/org.eclipse.egit.core.junit/target/cpd.xml with 0 unique warnings and 0 duplicates.
17:46:05 [2020-08-23T21:46:05.909Z] [DRY] Successfully parsed file /home/jenkins/agent/workspace/egit/repo/org.eclipse.egit.core.test/target/cpd.xml with 0 unique warnings and 0 duplicates.
17:46:05 [2020-08-23T21:46:05.909Z] [DRY] Successfully parsed file /home/jenkins/agent/workspace/egit/repo/org.eclipse.egit.core/target/cpd.xml with 4 unique warnings and 0 duplicates.
17:46:05 [2020-08-23T21:46:05.909Z] [DRY] Successfully parsed file /home/jenkins/agent/workspace/egit/repo/org.eclipse.egit.doc/target/cpd.xml with 4 unique warnings and 0 duplicates.
17:46:05 [2020-08-23T21:46:05.909Z] [DRY] Successfully parsed file /home/jenkins/agent/workspace/egit/repo/org.eclipse.egit.gitflow-feature/target/cpd.xml with 4 unique warnings and 0 duplicates.
17:46:05 [2020-08-23T21:46:05.909Z] [DRY] Successfully parsed file /home/jenkins/agent/workspace/egit/repo/org.eclipse.egit.gitflow.test/target/cpd.xml with 4 unique warnings and 0 duplicates.
17:46:05 [2020-08-23T21:46:05.909Z] [DRY] Successfully parsed file /home/jenkins/agent/workspace/egit/repo/org.eclipse.egit.gitflow.ui/target/cpd.xml with 4 unique warnings and 0 duplicates.
17:46:05 [2020-08-23T21:46:05.909Z] [DRY] Successfully parsed file /home/jenkins/agent/workspace/egit/repo/org.eclipse.egit.gitflow/target/cpd.xml with 4 unique warnings and 0 duplicates.
17:46:05 [2020-08-23T21:46:05.909Z] [DRY] Successfully parsed file /home/jenkins/agent/workspace/egit/repo/org.eclipse.egit.mylyn-feature/target/cpd.xml with 4 unique warnings and 0 duplicates.
17:46:05 [2020-08-23T21:46:05.909Z] [DRY] Successfully parsed file /home/jenkins/agent/workspace/egit/repo/org.eclipse.egit.mylyn.ui/target/cpd.xml with 4 unique warnings and 0 duplicates.
17:46:05 [2020-08-23T21:46:05.909Z] [DRY] Successfully parsed file /home/jenkins/agent/workspace/egit/repo/org.eclipse.egit.repository/target/cpd.xml with 4 unique warnings and 0 duplicates.
17:46:05 [2020-08-23T21:46:05.909Z] [DRY] Successfully parsed file /home/jenkins/agent/workspace/egit/repo/org.eclipse.egit.source-feature/target/cpd.xml with 4 unique warnings and 0 duplicates.
17:46:05 [2020-08-23T21:46:05.909Z] [DRY] Successfully parsed file /home/jenkins/agent/workspace/egit/repo/org.eclipse.egit.ui/target/cpd.xml with 37 unique warnings and 0 duplicates.
17:46:05 [2020-08-23T21:46:05.909Z] [DRY] Successfully parsed file /home/jenkins/agent/workspace/egit/repo/org.eclipse.egit/target/cpd.xml with 37 unique warnings and 0 duplicates.
17:46:05 [2020-08-23T21:46:05.909Z] Skipping warnings blame since pipelines do not have an SCM link.%n
17:46:05 [2020-08-23T21:46:05.945Z] [DRY] Computing warning deltas based on reference build #464
[Pipeline] }
[Pipeline] // stage
[Pipeline] step
17:46:06 [2020-08-23T21:46:06.366Z] Sending e-mails to: egit-build@eclipse.org
[Pipeline] }
[Pipeline] // dir
[Pipeline] }
17:46:06 [2020-08-23T21:46:06.562Z] Terminating xvnc.
[Pipeline] // wrap
[Pipeline] }
[Pipeline] // timeout
[Pipeline] }
[Pipeline] // node
[Pipeline] }
[Pipeline] // timestamps
[Pipeline] End of Pipeline
ERROR: script returned exit code 1
Finished: FAILURE