FailedConsole Output

Skipping 942 KB.. Full Log
ar)
15:11:45 [2020-08-22T19:11:45.724Z] 
15:11:45 [2020-08-22T19:11:45.724Z] (SWT:1623): Gtk-WARNING **: 19:11:45.405: Negative content width -6 (allocation 1, extents 4x3) while allocating gadget (node toolbar, owner GtkToolbar)
15:11:45 [2020-08-22T19:11:45.724Z] 
15:11:45 [2020-08-22T19:11:45.724Z] (SWT:1623): Gtk-WARNING **: 19:11:45.614: Negative content width -6 (allocation 1, extents 4x3) while allocating gadget (node toolbar, owner GtkToolbar)
15:11:46 [2020-08-22T19:11:46.289Z] 
15:11:46 [2020-08-22T19:11:46.289Z] (SWT:1623): Gtk-WARNING **: 19:11:46.135: Negative content width -6 (allocation 1, extents 4x3) while allocating gadget (node toolbar, owner GtkToolbar)
15:11:46 [2020-08-22T19:11:46.547Z] 
15:11:46 [2020-08-22T19:11:46.547Z] (SWT:1623): Gtk-WARNING **: 19:11:46.345: Negative content width -6 (allocation 1, extents 4x3) while allocating gadget (node toolbar, owner GtkToolbar)
15:11:47 [2020-08-22T19:11:47.112Z] 
15:11:47 [2020-08-22T19:11:47.112Z] (SWT:1623): Gtk-CRITICAL **: 19:11:46.872: gtk_box_gadget_distribute: assertion 'size >= 0' failed in GtkScrollbar
15:11:47 [2020-08-22T19:11:47.112Z] 
15:11:47 [2020-08-22T19:11:47.112Z] (SWT:1623): Gtk-WARNING **: 19:11:46.874: Negative content width -6 (allocation 1, extents 4x3) while allocating gadget (node toolbar, owner GtkToolbar)
15:11:47 [2020-08-22T19:11:47.112Z] 
15:11:47 [2020-08-22T19:11:47.112Z] (SWT:1623): Gtk-CRITICAL **: 19:11:46.886: gtk_box_gadget_distribute: assertion 'size >= 0' failed in GtkScrollbar
15:11:47 [2020-08-22T19:11:47.112Z] 
15:11:47 [2020-08-22T19:11:47.112Z] (SWT:1623): Gtk-CRITICAL **: 19:11:46.886: gtk_box_gadget_distribute: assertion 'size >= 0' failed in GtkScrollbar
15:11:47 [2020-08-22T19:11:47.112Z] 
15:11:47 [2020-08-22T19:11:47.112Z] (SWT:1623): Gtk-CRITICAL **: 19:11:46.895: gtk_box_gadget_distribute: assertion 'size >= 0' failed in GtkScrollbar
15:11:47 [2020-08-22T19:11:47.112Z] 
15:11:47 [2020-08-22T19:11:47.112Z] (SWT:1623): Gtk-WARNING **: 19:11:47.077: Negative content width -6 (allocation 1, extents 4x3) while allocating gadget (node toolbar, owner GtkToolbar)
15:11:47 [2020-08-22T19:11:47.676Z] 
15:11:47 [2020-08-22T19:11:47.676Z] (SWT:1623): Gtk-WARNING **: 19:11:47.516: Negative content width -6 (allocation 1, extents 4x3) while allocating gadget (node toolbar, owner GtkToolbar)
15:11:47 [2020-08-22T19:11:47.676Z] 
15:11:47 [2020-08-22T19:11:47.676Z] (SWT:1623): Gtk-CRITICAL **: 19:11:47.522: gtk_box_gadget_distribute: assertion 'size >= 0' failed in GtkScrollbar
15:11:47 [2020-08-22T19:11:47.676Z] 
15:11:47 [2020-08-22T19:11:47.676Z] (SWT:1623): Gtk-CRITICAL **: 19:11:47.537: gtk_box_gadget_distribute: assertion 'size >= 0' failed in GtkScrollbar
15:11:47 [2020-08-22T19:11:47.933Z] 
15:11:47 [2020-08-22T19:11:47.933Z] (SWT:1623): Gtk-WARNING **: 19:11:47.720: Negative content width -6 (allocation 1, extents 4x3) while allocating gadget (node toolbar, owner GtkToolbar)
15:11:48 [2020-08-22T19:11:48.865Z] 
15:11:48 [2020-08-22T19:11:48.865Z] (SWT:1623): Gtk-WARNING **: 19:11:48.606: Negative content width -6 (allocation 1, extents 4x3) while allocating gadget (node toolbar, owner GtkToolbar)
15:11:48 [2020-08-22T19:11:48.865Z] 
15:11:48 [2020-08-22T19:11:48.865Z] (SWT:1623): Gtk-WARNING **: 19:11:48.618: Negative content width -6 (allocation 1, extents 4x3) while allocating gadget (node toolbar, owner GtkToolbar)
15:11:48 [2020-08-22T19:11:48.865Z] Tests run: 3, Failures: 0, Errors: 0, Skipped: 1, Time elapsed: 11.496 s - in org.eclipse.egit.ui.internal.selection.SelectionForViewsTest
15:11:48 [2020-08-22T19:11:48.865Z] testViewsReactOnRepoSwitchInStaging(org.eclipse.egit.ui.internal.selection.SelectionForViewsTest) skipped
15:11:48 [2020-08-22T19:11:48.865Z] testViewsReactOnBareRepoViewSelection(org.eclipse.egit.ui.internal.selection.SelectionForViewsTest)  Time elapsed: 5.705 s
15:11:48 [2020-08-22T19:11:48.865Z] testViewsReactOnRepoViewSelection(org.eclipse.egit.ui.internal.selection.SelectionForViewsTest)  Time elapsed: 5.781 s
15:11:48 [2020-08-22T19:11:48.865Z] Running org.eclipse.egit.ui.internal.selection.SelectionUtilsTest
15:11:48 [2020-08-22T19:11:48.865Z] Tests run: 1, Failures: 0, Errors: 0, Skipped: 0, Time elapsed: 0.065 s - in org.eclipse.egit.ui.internal.selection.SelectionUtilsTest
15:11:48 [2020-08-22T19:11:48.865Z] getSelectedResourcesShouldUseAllTraversals(org.eclipse.egit.ui.internal.selection.SelectionUtilsTest)  Time elapsed: 0.065 s
15:11:48 [2020-08-22T19:11:48.865Z] Running org.eclipse.egit.ui.internal.CommonUtilsTest
15:11:48 [2020-08-22T19:11:48.865Z] Tests run: 10, Failures: 0, Errors: 0, Skipped: 0, Time elapsed: 0.045 s - in org.eclipse.egit.ui.internal.CommonUtilsTest
15:11:48 [2020-08-22T19:11:48.865Z] sortingShouldWorkForBigNumbers(org.eclipse.egit.ui.internal.CommonUtilsTest)  Time elapsed: 0.001 s
15:11:48 [2020-08-22T19:11:48.865Z] sortingShouldWorkForMixedParts(org.eclipse.egit.ui.internal.CommonUtilsTest)  Time elapsed: 0 s
15:11:48 [2020-08-22T19:11:48.865Z] sortingShouldWorkForNumbers(org.eclipse.egit.ui.internal.CommonUtilsTest)  Time elapsed: 0 s
15:11:48 [2020-08-22T19:11:48.865Z] testFooterOffset(org.eclipse.egit.ui.internal.CommonUtilsTest)  Time elapsed: 0 s
15:11:48 [2020-08-22T19:11:48.865Z] sortingShouldWorkForEqualAndEmptyStrings(org.eclipse.egit.ui.internal.CommonUtilsTest)  Time elapsed: 0 s
15:11:48 [2020-08-22T19:11:48.865Z] sortingShouldIgnoreCase(org.eclipse.egit.ui.internal.CommonUtilsTest)  Time elapsed: 0 s
15:11:48 [2020-08-22T19:11:48.865Z] testFooterOffsetNoFooter(org.eclipse.egit.ui.internal.CommonUtilsTest)  Time elapsed: 0 s
15:11:48 [2020-08-22T19:11:48.865Z] sortingShouldIgnoreLeadingZeros(org.eclipse.egit.ui.internal.CommonUtilsTest)  Time elapsed: 0 s
15:11:48 [2020-08-22T19:11:48.865Z] testResourceCompare(org.eclipse.egit.ui.internal.CommonUtilsTest)  Time elapsed: 0.044 s
15:11:48 [2020-08-22T19:11:48.865Z] sortingShouldWorkForEasyStrings(org.eclipse.egit.ui.internal.CommonUtilsTest)  Time elapsed: 0 s
15:11:48 [2020-08-22T19:11:48.865Z] Running org.eclipse.egit.ui.internal.dialogs.HyperlinkTokenScannerTest
15:11:49 [2020-08-22T19:11:49.123Z] Tests run: 10, Failures: 0, Errors: 0, Skipped: 0, Time elapsed: 0.122 s - in org.eclipse.egit.ui.internal.dialogs.HyperlinkTokenScannerTest
15:11:49 [2020-08-22T19:11:49.123Z] tokenizeEmbeddedHyperlink(org.eclipse.egit.ui.internal.dialogs.HyperlinkTokenScannerTest)  Time elapsed: 0.114 s
15:11:49 [2020-08-22T19:11:49.123Z] tokenizeWithFailingDetector(org.eclipse.egit.ui.internal.dialogs.HyperlinkTokenScannerTest)  Time elapsed: 0.001 s
15:11:49 [2020-08-22T19:11:49.123Z] tokenizeWithoutDetectors(org.eclipse.egit.ui.internal.dialogs.HyperlinkTokenScannerTest)  Time elapsed: 0 s
15:11:49 [2020-08-22T19:11:49.123Z] tokenizeHyperlinksOutsideRegion(org.eclipse.egit.ui.internal.dialogs.HyperlinkTokenScannerTest)  Time elapsed: 0.001 s
15:11:49 [2020-08-22T19:11:49.123Z] tokenizeMultipleHyperlinksSimple(org.eclipse.egit.ui.internal.dialogs.HyperlinkTokenScannerTest)  Time elapsed: 0 s
15:11:49 [2020-08-22T19:11:49.123Z] tokenizeMultipleHyperlinksMultiline(org.eclipse.egit.ui.internal.dialogs.HyperlinkTokenScannerTest)  Time elapsed: 0.001 s
15:11:49 [2020-08-22T19:11:49.123Z] tokenizeLeadingHyperlink(org.eclipse.egit.ui.internal.dialogs.HyperlinkTokenScannerTest)  Time elapsed: 0 s
15:11:49 [2020-08-22T19:11:49.123Z] tokenizeEmpty(org.eclipse.egit.ui.internal.dialogs.HyperlinkTokenScannerTest)  Time elapsed: 0 s
15:11:49 [2020-08-22T19:11:49.123Z] tokenizeHyperlinksCutByRegion(org.eclipse.egit.ui.internal.dialogs.HyperlinkTokenScannerTest)  Time elapsed: 0.001 s
15:11:49 [2020-08-22T19:11:49.123Z] tokenizeNoHyperlinks(org.eclipse.egit.ui.internal.dialogs.HyperlinkTokenScannerTest)  Time elapsed: 0 s
15:11:49 [2020-08-22T19:11:49.123Z] Running org.eclipse.egit.ui.internal.dialogs.CommitMessageBuilderTest
15:11:49 [2020-08-22T19:11:49.123Z] 
15:11:49 [2020-08-22T19:11:49.123Z] !ENTRY org.eclipse.egit.ui 4 0 2020-08-22 19:11:49.089
15:11:49 [2020-08-22T19:11:49.123Z] !MESSAGE CrashingCommitMessageProvider fails on purpose.
15:11:49 [2020-08-22T19:11:49.123Z] !STACK 0
15:11:49 [2020-08-22T19:11:49.123Z] java.lang.IllegalStateException: CrashingCommitMessageProvider fails on purpose.
15:11:49 [2020-08-22T19:11:49.123Z] 	at org.eclipse.egit.ui.internal.dialogs.CommitMessageBuilderTest$CrashingCommitMessageProvider.getMessage(CommitMessageBuilderTest.java:474)
15:11:49 [2020-08-22T19:11:49.123Z] 	at org.eclipse.egit.ui.internal.dialogs.CommitMessageBuilder.build(CommitMessageBuilder.java:90)
15:11:49 [2020-08-22T19:11:49.123Z] 	at org.eclipse.egit.ui.internal.dialogs.CommitMessageBuilderTest.commitMessageProvider_oneCrashingProvider(CommitMessageBuilderTest.java:99)
15:11:49 [2020-08-22T19:11:49.123Z] 	at sun.reflect.NativeMethodAccessorImpl.invoke0(Native Method)
15:11:49 [2020-08-22T19:11:49.123Z] 	at sun.reflect.NativeMethodAccessorImpl.invoke(NativeMethodAccessorImpl.java:62)
15:11:49 [2020-08-22T19:11:49.123Z] 	at sun.reflect.DelegatingMethodAccessorImpl.invoke(DelegatingMethodAccessorImpl.java:43)
15:11:49 [2020-08-22T19:11:49.123Z] 	at java.lang.reflect.Method.invoke(Method.java:498)
15:11:49 [2020-08-22T19:11:49.123Z] 	at org.junit.runners.model.FrameworkMethod$1.runReflectiveCall(FrameworkMethod.java:59)
15:11:49 [2020-08-22T19:11:49.123Z] 	at org.junit.internal.runners.model.ReflectiveCallable.run(ReflectiveCallable.java:12)
15:11:49 [2020-08-22T19:11:49.123Z] 	at org.junit.runners.model.FrameworkMethod.invokeExplosively(FrameworkMethod.java:56)
15:11:49 [2020-08-22T19:11:49.123Z] 	at org.junit.internal.runners.statements.InvokeMethod.evaluate(InvokeMethod.java:17)
15:11:49 [2020-08-22T19:11:49.123Z] 	at org.junit.internal.runners.statements.RunBefores.evaluate(RunBefores.java:26)
15:11:49 [2020-08-22T19:11:49.123Z] 	at org.junit.internal.runners.statements.RunAfters.evaluate(RunAfters.java:27)
15:11:49 [2020-08-22T19:11:49.123Z] 	at org.junit.runners.ParentRunner$3.evaluate(ParentRunner.java:306)
15:11:49 [2020-08-22T19:11:49.123Z] 	at org.junit.runners.BlockJUnit4ClassRunner$1.evaluate(BlockJUnit4ClassRunner.java:100)
15:11:49 [2020-08-22T19:11:49.123Z] 	at org.junit.runners.ParentRunner.runLeaf(ParentRunner.java:366)
15:11:49 [2020-08-22T19:11:49.123Z] 	at org.junit.runners.BlockJUnit4ClassRunner.runChild(BlockJUnit4ClassRunner.java:103)
15:11:49 [2020-08-22T19:11:49.123Z] 	at org.junit.runners.BlockJUnit4ClassRunner.runChild(BlockJUnit4ClassRunner.java:63)
15:11:49 [2020-08-22T19:11:49.123Z] 	at org.junit.runners.ParentRunner$4.run(ParentRunner.java:331)
15:11:49 [2020-08-22T19:11:49.123Z] 	at org.junit.runners.ParentRunner$1.schedule(ParentRunner.java:79)
15:11:49 [2020-08-22T19:11:49.123Z] 	at org.junit.runners.ParentRunner.runChildren(ParentRunner.java:329)
15:11:49 [2020-08-22T19:11:49.123Z] 	at org.junit.runners.ParentRunner.access$100(ParentRunner.java:66)
15:11:49 [2020-08-22T19:11:49.123Z] 	at org.junit.runners.ParentRunner$2.evaluate(ParentRunner.java:293)
15:11:49 [2020-08-22T19:11:49.123Z] 	at org.junit.internal.runners.statements.RunBefores.evaluate(RunBefores.java:26)
15:11:49 [2020-08-22T19:11:49.123Z] 	at org.junit.runners.ParentRunner$3.evaluate(ParentRunner.java:306)
15:11:49 [2020-08-22T19:11:49.123Z] 	at org.junit.runners.ParentRunner.run(ParentRunner.java:413)
15:11:49 [2020-08-22T19:11:49.123Z] 	at org.apache.maven.surefire.junit4.JUnit4Provider.execute(JUnit4Provider.java:365)
15:11:49 [2020-08-22T19:11:49.123Z] 	at org.apache.maven.surefire.junit4.JUnit4Provider.executeWithRerun(JUnit4Provider.java:273)
15:11:49 [2020-08-22T19:11:49.123Z] 	at org.apache.maven.surefire.junit4.JUnit4Provider.executeTestSet(JUnit4Provider.java:238)
15:11:49 [2020-08-22T19:11:49.123Z] 	at org.apache.maven.surefire.junit4.JUnit4Provider.invoke(JUnit4Provider.java:159)
15:11:49 [2020-08-22T19:11:49.123Z] 	at sun.reflect.NativeMethodAccessorImpl.invoke0(Native Method)
15:11:49 [2020-08-22T19:11:49.123Z] 	at sun.reflect.NativeMethodAccessorImpl.invoke(NativeMethodAccessorImpl.java:62)
15:11:49 [2020-08-22T19:11:49.123Z] 	at sun.reflect.DelegatingMethodAccessorImpl.invoke(DelegatingMethodAccessorImpl.java:43)
15:11:49 [2020-08-22T19:11:49.123Z] 	at java.lang.reflect.Method.invoke(Method.java:498)
15:11:49 [2020-08-22T19:11:49.123Z] 	at org.apache.maven.surefire.util.ReflectionUtils.invokeMethodWithArray2(ReflectionUtils.java:206)
15:11:49 [2020-08-22T19:11:49.123Z] 	at org.apache.maven.surefire.booter.ProviderFactory$ProviderProxy.invoke(ProviderFactory.java:161)
15:11:49 [2020-08-22T19:11:49.123Z] 	at org.apache.maven.surefire.booter.ProviderFactory.invokeProvider(ProviderFactory.java:84)
15:11:49 [2020-08-22T19:11:49.123Z] 	at org.eclipse.tycho.surefire.osgibooter.OsgiSurefireBooter.run(OsgiSurefireBooter.java:113)
15:11:49 [2020-08-22T19:11:49.123Z] 	at org.eclipse.tycho.surefire.osgibooter.AbstractUITestApplication.runTests(AbstractUITestApplication.java:44)
15:11:49 [2020-08-22T19:11:49.123Z] 	at org.eclipse.e4.ui.internal.workbench.swt.E4Testable$1.run(E4Testable.java:73)
15:11:49 [2020-08-22T19:11:49.123Z] 	at java.lang.Thread.run(Thread.java:748)
15:11:49 [2020-08-22T19:11:49.381Z] 
15:11:49 [2020-08-22T19:11:49.381Z] !ENTRY org.eclipse.egit.ui 4 0 2020-08-22 19:11:49.276
15:11:49 [2020-08-22T19:11:49.381Z] !MESSAGE CrashingCommitMessageProviderWithCaretPositioning fails on purpose.
15:11:49 [2020-08-22T19:11:49.381Z] !STACK 0
15:11:49 [2020-08-22T19:11:49.381Z] java.lang.IllegalStateException: CrashingCommitMessageProviderWithCaretPositioning fails on purpose.
15:11:49 [2020-08-22T19:11:49.381Z] 	at org.eclipse.egit.ui.internal.dialogs.CommitMessageBuilderTest$CrashingCommitMessageProviderWithCaretPositioning.getCommitMessageWithPosition(CommitMessageBuilderTest.java:491)
15:11:49 [2020-08-22T19:11:49.381Z] 	at org.eclipse.egit.ui.internal.dialogs.CommitMessageBuilder.build(CommitMessageBuilder.java:81)
15:11:49 [2020-08-22T19:11:49.381Z] 	at org.eclipse.egit.ui.internal.dialogs.CommitMessageBuilderTest.commitMessageProvider_oneCrashingProviderWithCaretPosition(CommitMessageBuilderTest.java:112)
15:11:49 [2020-08-22T19:11:49.381Z] 	at sun.reflect.NativeMethodAccessorImpl.invoke0(Native Method)
15:11:49 [2020-08-22T19:11:49.381Z] 	at sun.reflect.NativeMethodAccessorImpl.invoke(NativeMethodAccessorImpl.java:62)
15:11:49 [2020-08-22T19:11:49.381Z] 	at sun.reflect.DelegatingMethodAccessorImpl.invoke(DelegatingMethodAccessorImpl.java:43)
15:11:49 [2020-08-22T19:11:49.381Z] 	at java.lang.reflect.Method.invoke(Method.java:498)
15:11:49 [2020-08-22T19:11:49.381Z] 	at org.junit.runners.model.FrameworkMethod$1.runReflectiveCall(FrameworkMethod.java:59)
15:11:49 [2020-08-22T19:11:49.381Z] 	at org.junit.internal.runners.model.ReflectiveCallable.run(ReflectiveCallable.java:12)
15:11:49 [2020-08-22T19:11:49.381Z] 	at org.junit.runners.model.FrameworkMethod.invokeExplosively(FrameworkMethod.java:56)
15:11:49 [2020-08-22T19:11:49.381Z] 	at org.junit.internal.runners.statements.InvokeMethod.evaluate(InvokeMethod.java:17)
15:11:49 [2020-08-22T19:11:49.381Z] 	at org.junit.internal.runners.statements.RunBefores.evaluate(RunBefores.java:26)
15:11:49 [2020-08-22T19:11:49.381Z] 	at org.junit.internal.runners.statements.RunAfters.evaluate(RunAfters.java:27)
15:11:49 [2020-08-22T19:11:49.381Z] 	at org.junit.runners.ParentRunner$3.evaluate(ParentRunner.java:306)
15:11:49 [2020-08-22T19:11:49.381Z] 	at org.junit.runners.BlockJUnit4ClassRunner$1.evaluate(BlockJUnit4ClassRunner.java:100)
15:11:49 [2020-08-22T19:11:49.381Z] 	at org.junit.runners.ParentRunner.runLeaf(ParentRunner.java:366)
15:11:49 [2020-08-22T19:11:49.381Z] 	at org.junit.runners.BlockJUnit4ClassRunner.runChild(BlockJUnit4ClassRunner.java:103)
15:11:49 [2020-08-22T19:11:49.381Z] 	at org.junit.runners.BlockJUnit4ClassRunner.runChild(BlockJUnit4ClassRunner.java:63)
15:11:49 [2020-08-22T19:11:49.381Z] 	at org.junit.runners.ParentRunner$4.run(ParentRunner.java:331)
15:11:49 [2020-08-22T19:11:49.381Z] 	at org.junit.runners.ParentRunner$1.schedule(ParentRunner.java:79)
15:11:49 [2020-08-22T19:11:49.381Z] 	at org.junit.runners.ParentRunner.runChildren(ParentRunner.java:329)
15:11:49 [2020-08-22T19:11:49.381Z] 	at org.junit.runners.ParentRunner.access$100(ParentRunner.java:66)
15:11:49 [2020-08-22T19:11:49.381Z] 	at org.junit.runners.ParentRunner$2.evaluate(ParentRunner.java:293)
15:11:49 [2020-08-22T19:11:49.381Z] 	at org.junit.internal.runners.statements.RunBefores.evaluate(RunBefores.java:26)
15:11:49 [2020-08-22T19:11:49.381Z] 	at org.junit.runners.ParentRunner$3.evaluate(ParentRunner.java:306)
15:11:49 [2020-08-22T19:11:49.381Z] 	at org.junit.runners.ParentRunner.run(ParentRunner.java:413)
15:11:49 [2020-08-22T19:11:49.381Z] 	at org.apache.maven.surefire.junit4.JUnit4Provider.execute(JUnit4Provider.java:365)
15:11:49 [2020-08-22T19:11:49.381Z] 	at org.apache.maven.surefire.junit4.JUnit4Provider.executeWithRerun(JUnit4Provider.java:273)
15:11:49 [2020-08-22T19:11:49.381Z] 	at org.apache.maven.surefire.junit4.JUnit4Provider.executeTestSet(JUnit4Provider.java:238)
15:11:49 [2020-08-22T19:11:49.381Z] 	at org.apache.maven.surefire.junit4.JUnit4Provider.invoke(JUnit4Provider.java:159)
15:11:49 [2020-08-22T19:11:49.381Z] 	at sun.reflect.NativeMethodAccessorImpl.invoke0(Native Method)
15:11:49 [2020-08-22T19:11:49.381Z] 	at sun.reflect.NativeMethodAccessorImpl.invoke(NativeMethodAccessorImpl.java:62)
15:11:49 [2020-08-22T19:11:49.381Z] 	at sun.reflect.DelegatingMethodAccessorImpl.invoke(DelegatingMethodAccessorImpl.java:43)
15:11:49 [2020-08-22T19:11:49.381Z] 	at java.lang.reflect.Method.invoke(Method.java:498)
15:11:49 [2020-08-22T19:11:49.381Z] 	at org.apache.maven.surefire.util.ReflectionUtils.invokeMethodWithArray2(ReflectionUtils.java:206)
15:11:49 [2020-08-22T19:11:49.381Z] 	at org.apache.maven.surefire.booter.ProviderFactory$ProviderProxy.invoke(ProviderFactory.java:161)
15:11:49 [2020-08-22T19:11:49.381Z] 	at org.apache.maven.surefire.booter.ProviderFactory.invokeProvider(ProviderFactory.java:84)
15:11:49 [2020-08-22T19:11:49.381Z] 	at org.eclipse.tycho.surefire.osgibooter.OsgiSurefireBooter.run(OsgiSurefireBooter.java:113)
15:11:49 [2020-08-22T19:11:49.381Z] 	at org.eclipse.tycho.surefire.osgibooter.AbstractUITestApplication.runTests(AbstractUITestApplication.java:44)
15:11:49 [2020-08-22T19:11:49.381Z] 	at org.eclipse.e4.ui.internal.workbench.swt.E4Testable$1.run(E4Testable.java:73)
15:11:49 [2020-08-22T19:11:49.381Z] 	at java.lang.Thread.run(Thread.java:748)
15:11:50 [2020-08-22T19:11:50.378Z] 
15:11:50 [2020-08-22T19:11:50.378Z] !ENTRY org.eclipse.egit.ui 4 0 2020-08-22 19:11:50.316
15:11:50 [2020-08-22T19:11:50.378Z] !MESSAGE CrashingCommitMessageProvider fails on purpose.
15:11:50 [2020-08-22T19:11:50.378Z] !STACK 0
15:11:50 [2020-08-22T19:11:50.378Z] java.lang.IllegalStateException: CrashingCommitMessageProvider fails on purpose.
15:11:50 [2020-08-22T19:11:50.378Z] 	at org.eclipse.egit.ui.internal.dialogs.CommitMessageBuilderTest$CrashingCommitMessageProvider.getMessage(CommitMessageBuilderTest.java:474)
15:11:50 [2020-08-22T19:11:50.378Z] 	at org.eclipse.egit.ui.internal.dialogs.CommitMessageBuilder.build(CommitMessageBuilder.java:90)
15:11:50 [2020-08-22T19:11:50.378Z] 	at org.eclipse.egit.ui.internal.dialogs.CommitMessageBuilderTest.commitMessageProvider_twoProvidersFirstOneCrashing(CommitMessageBuilderTest.java:146)
15:11:50 [2020-08-22T19:11:50.378Z] 	at sun.reflect.NativeMethodAccessorImpl.invoke0(Native Method)
15:11:50 [2020-08-22T19:11:50.378Z] 	at sun.reflect.NativeMethodAccessorImpl.invoke(NativeMethodAccessorImpl.java:62)
15:11:50 [2020-08-22T19:11:50.378Z] 	at sun.reflect.DelegatingMethodAccessorImpl.invoke(DelegatingMethodAccessorImpl.java:43)
15:11:50 [2020-08-22T19:11:50.378Z] 	at java.lang.reflect.Method.invoke(Method.java:498)
15:11:50 [2020-08-22T19:11:50.378Z] 	at org.junit.runners.model.FrameworkMethod$1.runReflectiveCall(FrameworkMethod.java:59)
15:11:50 [2020-08-22T19:11:50.378Z] 	at org.junit.internal.runners.model.ReflectiveCallable.run(ReflectiveCallable.java:12)
15:11:50 [2020-08-22T19:11:50.378Z] 	at org.junit.runners.model.FrameworkMethod.invokeExplosively(FrameworkMethod.java:56)
15:11:50 [2020-08-22T19:11:50.378Z] 	at org.junit.internal.runners.statements.InvokeMethod.evaluate(InvokeMethod.java:17)
15:11:50 [2020-08-22T19:11:50.378Z] 	at org.junit.internal.runners.statements.RunBefores.evaluate(RunBefores.java:26)
15:11:50 [2020-08-22T19:11:50.378Z] 	at org.junit.internal.runners.statements.RunAfters.evaluate(RunAfters.java:27)
15:11:50 [2020-08-22T19:11:50.378Z] 	at org.junit.runners.ParentRunner$3.evaluate(ParentRunner.java:306)
15:11:50 [2020-08-22T19:11:50.378Z] 	at org.junit.runners.BlockJUnit4ClassRunner$1.evaluate(BlockJUnit4ClassRunner.java:100)
15:11:50 [2020-08-22T19:11:50.378Z] 	at org.junit.runners.ParentRunner.runLeaf(ParentRunner.java:366)
15:11:50 [2020-08-22T19:11:50.378Z] 	at org.junit.runners.BlockJUnit4ClassRunner.runChild(BlockJUnit4ClassRunner.java:103)
15:11:50 [2020-08-22T19:11:50.378Z] 	at org.junit.runners.BlockJUnit4ClassRunner.runChild(BlockJUnit4ClassRunner.java:63)
15:11:50 [2020-08-22T19:11:50.378Z] 	at org.junit.runners.ParentRunner$4.run(ParentRunner.java:331)
15:11:50 [2020-08-22T19:11:50.378Z] 	at org.junit.runners.ParentRunner$1.schedule(ParentRunner.java:79)
15:11:50 [2020-08-22T19:11:50.378Z] 	at org.junit.runners.ParentRunner.runChildren(ParentRunner.java:329)
15:11:50 [2020-08-22T19:11:50.378Z] 	at org.junit.runners.ParentRunner.access$100(ParentRunner.java:66)
15:11:50 [2020-08-22T19:11:50.378Z] 	at org.junit.runners.ParentRunner$2.evaluate(ParentRunner.java:293)
15:11:50 [2020-08-22T19:11:50.378Z] 	at org.junit.internal.runners.statements.RunBefores.evaluate(RunBefores.java:26)
15:11:50 [2020-08-22T19:11:50.378Z] 	at org.junit.runners.ParentRunner$3.evaluate(ParentRunner.java:306)
15:11:50 [2020-08-22T19:11:50.378Z] 	at org.junit.runners.ParentRunner.run(ParentRunner.java:413)
15:11:50 [2020-08-22T19:11:50.378Z] 	at org.apache.maven.surefire.junit4.JUnit4Provider.execute(JUnit4Provider.java:365)
15:11:50 [2020-08-22T19:11:50.378Z] 	at org.apache.maven.surefire.junit4.JUnit4Provider.executeWithRerun(JUnit4Provider.java:273)
15:11:50 [2020-08-22T19:11:50.378Z] 	at org.apache.maven.surefire.junit4.JUnit4Provider.executeTestSet(JUnit4Provider.java:238)
15:11:50 [2020-08-22T19:11:50.378Z] 	at org.apache.maven.surefire.junit4.JUnit4Provider.invoke(JUnit4Provider.java:159)
15:11:50 [2020-08-22T19:11:50.378Z] 	at sun.reflect.NativeMethodAccessorImpl.invoke0(Native Method)
15:11:50 [2020-08-22T19:11:50.378Z] 	at sun.reflect.NativeMethodAccessorImpl.invoke(NativeMethodAccessorImpl.java:62)
15:11:50 [2020-08-22T19:11:50.378Z] 	at sun.reflect.DelegatingMethodAccessorImpl.invoke(DelegatingMethodAccessorImpl.java:43)
15:11:50 [2020-08-22T19:11:50.378Z] 	at java.lang.reflect.Method.invoke(Method.java:498)
15:11:50 [2020-08-22T19:11:50.378Z] 	at org.apache.maven.surefire.util.ReflectionUtils.invokeMethodWithArray2(ReflectionUtils.java:206)
15:11:50 [2020-08-22T19:11:50.378Z] 	at org.apache.maven.surefire.booter.ProviderFactory$ProviderProxy.invoke(ProviderFactory.java:161)
15:11:50 [2020-08-22T19:11:50.378Z] 	at org.apache.maven.surefire.booter.ProviderFactory.invokeProvider(ProviderFactory.java:84)
15:11:50 [2020-08-22T19:11:50.378Z] 	at org.eclipse.tycho.surefire.osgibooter.OsgiSurefireBooter.run(OsgiSurefireBooter.java:113)
15:11:50 [2020-08-22T19:11:50.378Z] 	at org.eclipse.tycho.surefire.osgibooter.AbstractUITestApplication.runTests(AbstractUITestApplication.java:44)
15:11:50 [2020-08-22T19:11:50.378Z] 	at org.eclipse.e4.ui.internal.workbench.swt.E4Testable$1.run(E4Testable.java:73)
15:11:50 [2020-08-22T19:11:50.378Z] 	at java.lang.Thread.run(Thread.java:748)
15:11:50 [2020-08-22T19:11:50.636Z] 
15:11:50 [2020-08-22T19:11:50.636Z] !ENTRY org.eclipse.egit.ui 4 0 2020-08-22 19:11:50.628
15:11:50 [2020-08-22T19:11:50.636Z] !MESSAGE CrashingCommitMessageProvider fails on purpose.
15:11:50 [2020-08-22T19:11:50.636Z] !STACK 0
15:11:50 [2020-08-22T19:11:50.636Z] java.lang.IllegalStateException: CrashingCommitMessageProvider fails on purpose.
15:11:50 [2020-08-22T19:11:50.636Z] 	at org.eclipse.egit.ui.internal.dialogs.CommitMessageBuilderTest$CrashingCommitMessageProvider.getMessage(CommitMessageBuilderTest.java:474)
15:11:50 [2020-08-22T19:11:50.636Z] 	at org.eclipse.egit.ui.internal.dialogs.CommitMessageBuilder.build(CommitMessageBuilder.java:90)
15:11:50 [2020-08-22T19:11:50.636Z] 	at org.eclipse.egit.ui.internal.dialogs.CommitMessageBuilderTest.commitMessageProvider_multipleProvidersWithCrashAndNull(CommitMessageBuilderTest.java:165)
15:11:50 [2020-08-22T19:11:50.636Z] 	at sun.reflect.NativeMethodAccessorImpl.invoke0(Native Method)
15:11:50 [2020-08-22T19:11:50.636Z] 	at sun.reflect.NativeMethodAccessorImpl.invoke(NativeMethodAccessorImpl.java:62)
15:11:50 [2020-08-22T19:11:50.636Z] 	at sun.reflect.DelegatingMethodAccessorImpl.invoke(DelegatingMethodAccessorImpl.java:43)
15:11:50 [2020-08-22T19:11:50.636Z] 	at java.lang.reflect.Method.invoke(Method.java:498)
15:11:50 [2020-08-22T19:11:50.636Z] 	at org.junit.runners.model.FrameworkMethod$1.runReflectiveCall(FrameworkMethod.java:59)
15:11:50 [2020-08-22T19:11:50.636Z] 	at org.junit.internal.runners.model.ReflectiveCallable.run(ReflectiveCallable.java:12)
15:11:50 [2020-08-22T19:11:50.636Z] 	at org.junit.runners.model.FrameworkMethod.invokeExplosively(FrameworkMethod.java:56)
15:11:50 [2020-08-22T19:11:50.636Z] 	at org.junit.internal.runners.statements.InvokeMethod.evaluate(InvokeMethod.java:17)
15:11:50 [2020-08-22T19:11:50.636Z] 	at org.junit.internal.runners.statements.RunBefores.evaluate(RunBefores.java:26)
15:11:50 [2020-08-22T19:11:50.636Z] 	at org.junit.internal.runners.statements.RunAfters.evaluate(RunAfters.java:27)
15:11:50 [2020-08-22T19:11:50.636Z] 	at org.junit.runners.ParentRunner$3.evaluate(ParentRunner.java:306)
15:11:50 [2020-08-22T19:11:50.636Z] 	at org.junit.runners.BlockJUnit4ClassRunner$1.evaluate(BlockJUnit4ClassRunner.java:100)
15:11:50 [2020-08-22T19:11:50.636Z] 	at org.junit.runners.ParentRunner.runLeaf(ParentRunner.java:366)
15:11:50 [2020-08-22T19:11:50.636Z] 	at org.junit.runners.BlockJUnit4ClassRunner.runChild(BlockJUnit4ClassRunner.java:103)
15:11:50 [2020-08-22T19:11:50.636Z] 	at org.junit.runners.BlockJUnit4ClassRunner.runChild(BlockJUnit4ClassRunner.java:63)
15:11:50 [2020-08-22T19:11:50.636Z] 	at org.junit.runners.ParentRunner$4.run(ParentRunner.java:331)
15:11:50 [2020-08-22T19:11:50.636Z] 	at org.junit.runners.ParentRunner$1.schedule(ParentRunner.java:79)
15:11:50 [2020-08-22T19:11:50.636Z] 	at org.junit.runners.ParentRunner.runChildren(ParentRunner.java:329)
15:11:50 [2020-08-22T19:11:50.636Z] 	at org.junit.runners.ParentRunner.access$100(ParentRunner.java:66)
15:11:50 [2020-08-22T19:11:50.636Z] 	at org.junit.runners.ParentRunner$2.evaluate(ParentRunner.java:293)
15:11:50 [2020-08-22T19:11:50.636Z] 	at org.junit.internal.runners.statements.RunBefores.evaluate(RunBefores.java:26)
15:11:50 [2020-08-22T19:11:50.636Z] 	at org.junit.runners.ParentRunner$3.evaluate(ParentRunner.java:306)
15:11:50 [2020-08-22T19:11:50.636Z] 	at org.junit.runners.ParentRunner.run(ParentRunner.java:413)
15:11:50 [2020-08-22T19:11:50.636Z] 	at org.apache.maven.surefire.junit4.JUnit4Provider.execute(JUnit4Provider.java:365)
15:11:50 [2020-08-22T19:11:50.636Z] 	at org.apache.maven.surefire.junit4.JUnit4Provider.executeWithRerun(JUnit4Provider.java:273)
15:11:50 [2020-08-22T19:11:50.636Z] 	at org.apache.maven.surefire.junit4.JUnit4Provider.executeTestSet(JUnit4Provider.java:238)
15:11:50 [2020-08-22T19:11:50.636Z] 	at org.apache.maven.surefire.junit4.JUnit4Provider.invoke(JUnit4Provider.java:159)
15:11:50 [2020-08-22T19:11:50.636Z] 	at sun.reflect.NativeMethodAccessorImpl.invoke0(Native Method)
15:11:50 [2020-08-22T19:11:50.636Z] 	at sun.reflect.NativeMethodAccessorImpl.invoke(NativeMethodAccessorImpl.java:62)
15:11:50 [2020-08-22T19:11:50.636Z] 	at sun.reflect.DelegatingMethodAccessorImpl.invoke(DelegatingMethodAccessorImpl.java:43)
15:11:50 [2020-08-22T19:11:50.636Z] 	at java.lang.reflect.Method.invoke(Method.java:498)
15:11:50 [2020-08-22T19:11:50.636Z] 	at org.apache.maven.surefire.util.ReflectionUtils.invokeMethodWithArray2(ReflectionUtils.java:206)
15:11:50 [2020-08-22T19:11:50.636Z] 	at org.apache.maven.surefire.booter.ProviderFactory$ProviderProxy.invoke(ProviderFactory.java:161)
15:11:50 [2020-08-22T19:11:50.636Z] 	at org.apache.maven.surefire.booter.ProviderFactory.invokeProvider(ProviderFactory.java:84)
15:11:50 [2020-08-22T19:11:50.636Z] 	at org.eclipse.tycho.surefire.osgibooter.OsgiSurefireBooter.run(OsgiSurefireBooter.java:113)
15:11:50 [2020-08-22T19:11:50.636Z] 	at org.eclipse.tycho.surefire.osgibooter.AbstractUITestApplication.runTests(AbstractUITestApplication.java:44)
15:11:50 [2020-08-22T19:11:50.636Z] 	at org.eclipse.e4.ui.internal.workbench.swt.E4Testable$1.run(E4Testable.java:73)
15:11:50 [2020-08-22T19:11:50.636Z] 	at java.lang.Thread.run(Thread.java:748)
15:11:50 [2020-08-22T19:11:50.636Z] 
15:11:50 [2020-08-22T19:11:50.636Z] !ENTRY org.eclipse.egit.ui 4 0 2020-08-22 19:11:50.628
15:11:50 [2020-08-22T19:11:50.636Z] !MESSAGE CrashingCommitMessageProvider fails on purpose.
15:11:50 [2020-08-22T19:11:50.637Z] !STACK 0
15:11:50 [2020-08-22T19:11:50.637Z] java.lang.IllegalStateException: CrashingCommitMessageProvider fails on purpose.
15:11:50 [2020-08-22T19:11:50.637Z] 	at org.eclipse.egit.ui.internal.dialogs.CommitMessageBuilderTest$CrashingCommitMessageProvider.getMessage(CommitMessageBuilderTest.java:474)
15:11:50 [2020-08-22T19:11:50.637Z] 	at org.eclipse.egit.ui.internal.dialogs.CommitMessageBuilder.build(CommitMessageBuilder.java:90)
15:11:50 [2020-08-22T19:11:50.637Z] 	at org.eclipse.egit.ui.internal.dialogs.CommitMessageBuilderTest.commitMessageProvider_multipleProvidersWithCrashAndNull(CommitMessageBuilderTest.java:165)
15:11:50 [2020-08-22T19:11:50.637Z] 	at sun.reflect.NativeMethodAccessorImpl.invoke0(Native Method)
15:11:50 [2020-08-22T19:11:50.637Z] 	at sun.reflect.NativeMethodAccessorImpl.invoke(NativeMethodAccessorImpl.java:62)
15:11:50 [2020-08-22T19:11:50.637Z] 	at sun.reflect.DelegatingMethodAccessorImpl.invoke(DelegatingMethodAccessorImpl.java:43)
15:11:50 [2020-08-22T19:11:50.637Z] 	at java.lang.reflect.Method.invoke(Method.java:498)
15:11:50 [2020-08-22T19:11:50.637Z] 	at org.junit.runners.model.FrameworkMethod$1.runReflectiveCall(FrameworkMethod.java:59)
15:11:50 [2020-08-22T19:11:50.637Z] 	at org.junit.internal.runners.model.ReflectiveCallable.run(ReflectiveCallable.java:12)
15:11:50 [2020-08-22T19:11:50.637Z] 	at org.junit.runners.model.FrameworkMethod.invokeExplosively(FrameworkMethod.java:56)
15:11:50 [2020-08-22T19:11:50.637Z] 	at org.junit.internal.runners.statements.InvokeMethod.evaluate(InvokeMethod.java:17)
15:11:50 [2020-08-22T19:11:50.637Z] 	at org.junit.internal.runners.statements.RunBefores.evaluate(RunBefores.java:26)
15:11:50 [2020-08-22T19:11:50.637Z] 	at org.junit.internal.runners.statements.RunAfters.evaluate(RunAfters.java:27)
15:11:50 [2020-08-22T19:11:50.637Z] 	at org.junit.runners.ParentRunner$3.evaluate(ParentRunner.java:306)
15:11:50 [2020-08-22T19:11:50.637Z] 	at org.junit.runners.BlockJUnit4ClassRunner$1.evaluate(BlockJUnit4ClassRunner.java:100)
15:11:50 [2020-08-22T19:11:50.637Z] 	at org.junit.runners.ParentRunner.runLeaf(ParentRunner.java:366)
15:11:50 [2020-08-22T19:11:50.637Z] 	at org.junit.runners.BlockJUnit4ClassRunner.runChild(BlockJUnit4ClassRunner.java:103)
15:11:50 [2020-08-22T19:11:50.637Z] 	at org.junit.runners.BlockJUnit4ClassRunner.runChild(BlockJUnit4ClassRunner.java:63)
15:11:50 [2020-08-22T19:11:50.637Z] 	at org.junit.runners.ParentRunner$4.run(ParentRunner.java:331)
15:11:50 [2020-08-22T19:11:50.637Z] 	at org.junit.runners.ParentRunner$1.schedule(ParentRunner.java:79)
15:11:50 [2020-08-22T19:11:50.637Z] 	at org.junit.runners.ParentRunner.runChildren(ParentRunner.java:329)
15:11:50 [2020-08-22T19:11:50.637Z] 	at org.junit.runners.ParentRunner.access$100(ParentRunner.java:66)
15:11:50 [2020-08-22T19:11:50.637Z] 	at org.junit.runners.ParentRunner$2.evaluate(ParentRunner.java:293)
15:11:50 [2020-08-22T19:11:50.637Z] 	at org.junit.internal.runners.statements.RunBefores.evaluate(RunBefores.java:26)
15:11:50 [2020-08-22T19:11:50.637Z] 	at org.junit.runners.ParentRunner$3.evaluate(ParentRunner.java:306)
15:11:50 [2020-08-22T19:11:50.637Z] 	at org.junit.runners.ParentRunner.run(ParentRunner.java:413)
15:11:50 [2020-08-22T19:11:50.637Z] 	at org.apache.maven.surefire.junit4.JUnit4Provider.execute(JUnit4Provider.java:365)
15:11:50 [2020-08-22T19:11:50.637Z] 	at org.apache.maven.surefire.junit4.JUnit4Provider.executeWithRerun(JUnit4Provider.java:273)
15:11:50 [2020-08-22T19:11:50.637Z] 	at org.apache.maven.surefire.junit4.JUnit4Provider.executeTestSet(JUnit4Provider.java:238)
15:11:50 [2020-08-22T19:11:50.637Z] 	at org.apache.maven.surefire.junit4.JUnit4Provider.invoke(JUnit4Provider.java:159)
15:11:50 [2020-08-22T19:11:50.637Z] 	at sun.reflect.NativeMethodAccessorImpl.invoke0(Native Method)
15:11:50 [2020-08-22T19:11:50.637Z] 	at sun.reflect.NativeMethodAccessorImpl.invoke(NativeMethodAccessorImpl.java:62)
15:11:50 [2020-08-22T19:11:50.637Z] 	at sun.reflect.DelegatingMethodAccessorImpl.invoke(DelegatingMethodAccessorImpl.java:43)
15:11:50 [2020-08-22T19:11:50.637Z] 	at java.lang.reflect.Method.invoke(Method.java:498)
15:11:50 [2020-08-22T19:11:50.637Z] 	at org.apache.maven.surefire.util.ReflectionUtils.invokeMethodWithArray2(ReflectionUtils.java:206)
15:11:50 [2020-08-22T19:11:50.637Z] 	at org.apache.maven.surefire.booter.ProviderFactory$ProviderProxy.invoke(ProviderFactory.java:161)
15:11:50 [2020-08-22T19:11:50.637Z] 	at org.apache.maven.surefire.booter.ProviderFactory.invokeProvider(ProviderFactory.java:84)
15:11:50 [2020-08-22T19:11:50.637Z] 	at org.eclipse.tycho.surefire.osgibooter.OsgiSurefireBooter.run(OsgiSurefireBooter.java:113)
15:11:50 [2020-08-22T19:11:50.637Z] 	at org.eclipse.tycho.surefire.osgibooter.AbstractUITestApplication.runTests(AbstractUITestApplication.java:44)
15:11:50 [2020-08-22T19:11:50.637Z] 	at org.eclipse.e4.ui.internal.workbench.swt.E4Testable$1.run(E4Testable.java:73)
15:11:50 [2020-08-22T19:11:50.637Z] 	at java.lang.Thread.run(Thread.java:748)
15:11:50 [2020-08-22T19:11:50.894Z] 
15:11:50 [2020-08-22T19:11:50.894Z] !ENTRY org.eclipse.egit.ui 2 0 2020-08-22 19:11:50.733
15:11:50 [2020-08-22T19:11:50.894Z] !MESSAGE The ICommitMessageProvider2 implementation org.eclipse.egit.ui.internal.dialogs.CommitMessageBuilderTest$3 provided the caret position -42, which exceeds the length of the commit message or is negative. The caret position is ignored.
15:11:51 [2020-08-22T19:11:51.151Z] 
15:11:51 [2020-08-22T19:11:51.151Z] (SWT:1623): Gtk-WARNING **: 19:11:50.911: Negative content width -1 (allocation 1, extents 1x1) while allocating gadget (node trough, owner GtkProgressBar)
15:11:52 [2020-08-22T19:11:52.522Z] 
15:11:52 [2020-08-22T19:11:52.522Z] !ENTRY org.eclipse.egit.ui 2 0 2020-08-22 19:11:52.241
15:11:52 [2020-08-22T19:11:52.522Z] !MESSAGE Found multiple implementations of ICommitMessageProvider2. Ignoring caret positioning for org.eclipse.egit.ui.internal.dialogs.CommitMessageBuilderTest$3.
15:11:53 [2020-08-22T19:11:53.896Z] 
15:11:53 [2020-08-22T19:11:53.896Z] !ENTRY org.eclipse.egit.ui 4 0 2020-08-22 19:11:53.636
15:11:53 [2020-08-22T19:11:53.896Z] !MESSAGE CrashingCommitMessageProvider fails on purpose.
15:11:53 [2020-08-22T19:11:53.896Z] !STACK 0
15:11:53 [2020-08-22T19:11:53.896Z] java.lang.IllegalStateException: CrashingCommitMessageProvider fails on purpose.
15:11:53 [2020-08-22T19:11:53.896Z] 	at org.eclipse.egit.ui.internal.dialogs.CommitMessageBuilderTest$CrashingCommitMessageProvider.getMessage(CommitMessageBuilderTest.java:474)
15:11:53 [2020-08-22T19:11:53.896Z] 	at org.eclipse.egit.ui.internal.dialogs.CommitMessageBuilder.build(CommitMessageBuilder.java:90)
15:11:53 [2020-08-22T19:11:53.896Z] 	at org.eclipse.egit.ui.internal.dialogs.CommitMessageBuilderTest.commitMessageProvider_twoProvidersSecondOneCrashing(CommitMessageBuilderTest.java:130)
15:11:53 [2020-08-22T19:11:53.896Z] 	at sun.reflect.NativeMethodAccessorImpl.invoke0(Native Method)
15:11:53 [2020-08-22T19:11:53.896Z] 	at sun.reflect.NativeMethodAccessorImpl.invoke(NativeMethodAccessorImpl.java:62)
15:11:53 [2020-08-22T19:11:53.896Z] 	at sun.reflect.DelegatingMethodAccessorImpl.invoke(DelegatingMethodAccessorImpl.java:43)
15:11:53 [2020-08-22T19:11:53.896Z] 	at java.lang.reflect.Method.invoke(Method.java:498)
15:11:53 [2020-08-22T19:11:53.896Z] 	at org.junit.runners.model.FrameworkMethod$1.runReflectiveCall(FrameworkMethod.java:59)
15:11:53 [2020-08-22T19:11:53.896Z] 	at org.junit.internal.runners.model.ReflectiveCallable.run(ReflectiveCallable.java:12)
15:11:53 [2020-08-22T19:11:53.896Z] 	at org.junit.runners.model.FrameworkMethod.invokeExplosively(FrameworkMethod.java:56)
15:11:53 [2020-08-22T19:11:53.896Z] 	at org.junit.internal.runners.statements.InvokeMethod.evaluate(InvokeMethod.java:17)
15:11:53 [2020-08-22T19:11:53.896Z] 	at org.junit.internal.runners.statements.RunBefores.evaluate(RunBefores.java:26)
15:11:53 [2020-08-22T19:11:53.896Z] 	at org.junit.internal.runners.statements.RunAfters.evaluate(RunAfters.java:27)
15:11:53 [2020-08-22T19:11:53.896Z] 	at org.junit.runners.ParentRunner$3.evaluate(ParentRunner.java:306)
15:11:53 [2020-08-22T19:11:53.896Z] 	at org.junit.runners.BlockJUnit4ClassRunner$1.evaluate(BlockJUnit4ClassRunner.java:100)
15:11:53 [2020-08-22T19:11:53.896Z] 	at org.junit.runners.ParentRunner.runLeaf(ParentRunner.java:366)
15:11:53 [2020-08-22T19:11:53.896Z] 	at org.junit.runners.BlockJUnit4ClassRunner.runChild(BlockJUnit4ClassRunner.java:103)
15:11:53 [2020-08-22T19:11:53.896Z] 	at org.junit.runners.BlockJUnit4ClassRunner.runChild(BlockJUnit4ClassRunner.java:63)
15:11:53 [2020-08-22T19:11:53.896Z] 	at org.junit.runners.ParentRunner$4.run(ParentRunner.java:331)
15:11:53 [2020-08-22T19:11:53.896Z] 	at org.junit.runners.ParentRunner$1.schedule(ParentRunner.java:79)
15:11:53 [2020-08-22T19:11:53.896Z] 	at org.junit.runners.ParentRunner.runChildren(ParentRunner.java:329)
15:11:53 [2020-08-22T19:11:53.896Z] 	at org.junit.runners.ParentRunner.access$100(ParentRunner.java:66)
15:11:53 [2020-08-22T19:11:53.896Z] 	at org.junit.runners.ParentRunner$2.evaluate(ParentRunner.java:293)
15:11:53 [2020-08-22T19:11:53.896Z] 	at org.junit.internal.runners.statements.RunBefores.evaluate(RunBefores.java:26)
15:11:53 [2020-08-22T19:11:53.896Z] 	at org.junit.runners.ParentRunner$3.evaluate(ParentRunner.java:306)
15:11:53 [2020-08-22T19:11:53.896Z] 	at org.junit.runners.ParentRunner.run(ParentRunner.java:413)
15:11:53 [2020-08-22T19:11:53.896Z] 	at org.apache.maven.surefire.junit4.JUnit4Provider.execute(JUnit4Provider.java:365)
15:11:53 [2020-08-22T19:11:53.896Z] 	at org.apache.maven.surefire.junit4.JUnit4Provider.executeWithRerun(JUnit4Provider.java:273)
15:11:53 [2020-08-22T19:11:53.896Z] 	at org.apache.maven.surefire.junit4.JUnit4Provider.executeTestSet(JUnit4Provider.java:238)
15:11:53 [2020-08-22T19:11:53.896Z] 	at org.apache.maven.surefire.junit4.JUnit4Provider.invoke(JUnit4Provider.java:159)
15:11:53 [2020-08-22T19:11:53.896Z] 	at sun.reflect.NativeMethodAccessorImpl.invoke0(Native Method)
15:11:53 [2020-08-22T19:11:53.896Z] 	at sun.reflect.NativeMethodAccessorImpl.invoke(NativeMethodAccessorImpl.java:62)
15:11:53 [2020-08-22T19:11:53.896Z] 	at sun.reflect.DelegatingMethodAccessorImpl.invoke(DelegatingMethodAccessorImpl.java:43)
15:11:53 [2020-08-22T19:11:53.896Z] 	at java.lang.reflect.Method.invoke(Method.java:498)
15:11:53 [2020-08-22T19:11:53.896Z] 	at org.apache.maven.surefire.util.ReflectionUtils.invokeMethodWithArray2(ReflectionUtils.java:206)
15:11:53 [2020-08-22T19:11:53.896Z] 	at org.apache.maven.surefire.booter.ProviderFactory$ProviderProxy.invoke(ProviderFactory.java:161)
15:11:53 [2020-08-22T19:11:53.896Z] 	at org.apache.maven.surefire.booter.ProviderFactory.invokeProvider(ProviderFactory.java:84)
15:11:53 [2020-08-22T19:11:53.896Z] 	at org.eclipse.tycho.surefire.osgibooter.OsgiSurefireBooter.run(OsgiSurefireBooter.java:113)
15:11:53 [2020-08-22T19:11:53.896Z] 	at org.eclipse.tycho.surefire.osgibooter.AbstractUITestApplication.runTests(AbstractUITestApplication.java:44)
15:11:53 [2020-08-22T19:11:53.896Z] 	at org.eclipse.e4.ui.internal.workbench.swt.E4Testable$1.run(E4Testable.java:73)
15:11:53 [2020-08-22T19:11:53.896Z] 	at java.lang.Thread.run(Thread.java:748)
15:11:53 [2020-08-22T19:11:53.896Z] 
15:11:53 [2020-08-22T19:11:53.896Z] !ENTRY org.eclipse.egit.ui 4 0 2020-08-22 19:11:53.729
15:11:53 [2020-08-22T19:11:53.896Z] !MESSAGE CrashingCommitMessageProvider fails on purpose.
15:11:53 [2020-08-22T19:11:53.896Z] !STACK 0
15:11:53 [2020-08-22T19:11:53.896Z] java.lang.IllegalStateException: CrashingCommitMessageProvider fails on purpose.
15:11:53 [2020-08-22T19:11:53.896Z] 	at org.eclipse.egit.ui.internal.dialogs.CommitMessageBuilderTest$CrashingCommitMessageProvider.getMessage(CommitMessageBuilderTest.java:474)
15:11:53 [2020-08-22T19:11:53.896Z] 	at org.eclipse.egit.ui.internal.dialogs.CommitMessageBuilder.build(CommitMessageBuilder.java:90)
15:11:53 [2020-08-22T19:11:53.896Z] 	at org.eclipse.egit.ui.internal.dialogs.CommitMessageBuilderTest.commitMessageProvider_multipleProvidersWithCrashingAndNullAndOneCaretPositioning(CommitMessageBuilderTest.java:414)
15:11:53 [2020-08-22T19:11:53.896Z] 	at sun.reflect.NativeMethodAccessorImpl.invoke0(Native Method)
15:11:53 [2020-08-22T19:11:53.896Z] 	at sun.reflect.NativeMethodAccessorImpl.invoke(NativeMethodAccessorImpl.java:62)
15:11:53 [2020-08-22T19:11:53.896Z] 	at sun.reflect.DelegatingMethodAccessorImpl.invoke(DelegatingMethodAccessorImpl.java:43)
15:11:53 [2020-08-22T19:11:53.896Z] 	at java.lang.reflect.Method.invoke(Method.java:498)
15:11:53 [2020-08-22T19:11:53.896Z] 	at org.junit.runners.model.FrameworkMethod$1.runReflectiveCall(FrameworkMethod.java:59)
15:11:53 [2020-08-22T19:11:53.896Z] 	at org.junit.internal.runners.model.ReflectiveCallable.run(ReflectiveCallable.java:12)
15:11:53 [2020-08-22T19:11:53.896Z] 	at org.junit.runners.model.FrameworkMethod.invokeExplosively(FrameworkMethod.java:56)
15:11:53 [2020-08-22T19:11:53.896Z] 	at org.junit.internal.runners.statements.InvokeMethod.evaluate(InvokeMethod.java:17)
15:11:53 [2020-08-22T19:11:53.896Z] 	at org.junit.internal.runners.statements.RunBefores.evaluate(RunBefores.java:26)
15:11:53 [2020-08-22T19:11:53.896Z] 	at org.junit.internal.runners.statements.RunAfters.evaluate(RunAfters.java:27)
15:11:53 [2020-08-22T19:11:53.896Z] 	at org.junit.runners.ParentRunner$3.evaluate(ParentRunner.java:306)
15:11:53 [2020-08-22T19:11:53.896Z] 	at org.junit.runners.BlockJUnit4ClassRunner$1.evaluate(BlockJUnit4ClassRunner.java:100)
15:11:53 [2020-08-22T19:11:53.896Z] 	at org.junit.runners.ParentRunner.runLeaf(ParentRunner.java:366)
15:11:53 [2020-08-22T19:11:53.896Z] 	at org.junit.runners.BlockJUnit4ClassRunner.runChild(BlockJUnit4ClassRunner.java:103)
15:11:53 [2020-08-22T19:11:53.896Z] 	at org.junit.runners.BlockJUnit4ClassRunner.runChild(BlockJUnit4ClassRunner.java:63)
15:11:53 [2020-08-22T19:11:53.896Z] 	at org.junit.runners.ParentRunner$4.run(ParentRunner.java:331)
15:11:53 [2020-08-22T19:11:53.896Z] 	at org.junit.runners.ParentRunner$1.schedule(ParentRunner.java:79)
15:11:53 [2020-08-22T19:11:53.896Z] 	at org.junit.runners.ParentRunner.runChildren(ParentRunner.java:329)
15:11:53 [2020-08-22T19:11:53.896Z] 	at org.junit.runners.ParentRunner.access$100(ParentRunner.java:66)
15:11:53 [2020-08-22T19:11:53.896Z] 	at org.junit.runners.ParentRunner$2.evaluate(ParentRunner.java:293)
15:11:53 [2020-08-22T19:11:53.896Z] 	at org.junit.internal.runners.statements.RunBefores.evaluate(RunBefores.java:26)
15:11:53 [2020-08-22T19:11:53.897Z] 	at org.junit.runners.ParentRunner$3.evaluate(ParentRunner.java:306)
15:11:53 [2020-08-22T19:11:53.897Z] 	at org.junit.runners.ParentRunner.run(ParentRunner.java:413)
15:11:53 [2020-08-22T19:11:53.897Z] 	at org.apache.maven.surefire.junit4.JUnit4Provider.execute(JUnit4Provider.java:365)
15:11:53 [2020-08-22T19:11:53.897Z] 	at org.apache.maven.surefire.junit4.JUnit4Provider.executeWithRerun(JUnit4Provider.java:273)
15:11:53 [2020-08-22T19:11:53.897Z] 	at org.apache.maven.surefire.junit4.JUnit4Provider.executeTestSet(JUnit4Provider.java:238)
15:11:53 [2020-08-22T19:11:53.897Z] 	at org.apache.maven.surefire.junit4.JUnit4Provider.invoke(JUnit4Provider.java:159)
15:11:53 [2020-08-22T19:11:53.897Z] 	at sun.reflect.NativeMethodAccessorImpl.invoke0(Native Method)
15:11:53 [2020-08-22T19:11:53.897Z] 	at sun.reflect.NativeMethodAccessorImpl.invoke(NativeMethodAccessorImpl.java:62)
15:11:53 [2020-08-22T19:11:53.897Z] 	at sun.reflect.DelegatingMethodAccessorImpl.invoke(DelegatingMethodAccessorImpl.java:43)
15:11:53 [2020-08-22T19:11:53.897Z] 	at java.lang.reflect.Method.invoke(Method.java:498)
15:11:53 [2020-08-22T19:11:53.897Z] 	at org.apache.maven.surefire.util.ReflectionUtils.invokeMethodWithArray2(ReflectionUtils.java:206)
15:11:53 [2020-08-22T19:11:53.897Z] 	at org.apache.maven.surefire.booter.ProviderFactory$ProviderProxy.invoke(ProviderFactory.java:161)
15:11:53 [2020-08-22T19:11:53.897Z] 	at org.apache.maven.surefire.booter.ProviderFactory.invokeProvider(ProviderFactory.java:84)
15:11:53 [2020-08-22T19:11:53.897Z] 	at org.eclipse.tycho.surefire.osgibooter.OsgiSurefireBooter.run(OsgiSurefireBooter.java:113)
15:11:53 [2020-08-22T19:11:53.897Z] 	at org.eclipse.tycho.surefire.osgibooter.AbstractUITestApplication.runTests(AbstractUITestApplication.java:44)
15:11:53 [2020-08-22T19:11:53.897Z] 	at org.eclipse.e4.ui.internal.workbench.swt.E4Testable$1.run(E4Testable.java:73)
15:11:53 [2020-08-22T19:11:53.897Z] 	at java.lang.Thread.run(Thread.java:748)
15:11:53 [2020-08-22T19:11:53.897Z] 
15:11:53 [2020-08-22T19:11:53.897Z] !ENTRY org.eclipse.egit.ui 4 0 2020-08-22 19:11:53.730
15:11:53 [2020-08-22T19:11:53.897Z] !MESSAGE CrashingCommitMessageProvider fails on purpose.
15:11:53 [2020-08-22T19:11:53.897Z] !STACK 0
15:11:53 [2020-08-22T19:11:53.897Z] java.lang.IllegalStateException: CrashingCommitMessageProvider fails on purpose.
15:11:53 [2020-08-22T19:11:53.897Z] 	at org.eclipse.egit.ui.internal.dialogs.CommitMessageBuilderTest$CrashingCommitMessageProvider.getMessage(CommitMessageBuilderTest.java:474)
15:11:53 [2020-08-22T19:11:53.897Z] 	at org.eclipse.egit.ui.internal.dialogs.CommitMessageBuilder.build(CommitMessageBuilder.java:90)
15:11:53 [2020-08-22T19:11:53.897Z] 	at org.eclipse.egit.ui.internal.dialogs.CommitMessageBuilderTest.commitMessageProvider_multipleProvidersWithCrashingAndNullAndOneCaretPositioning(CommitMessageBuilderTest.java:414)
15:11:53 [2020-08-22T19:11:53.897Z] 	at sun.reflect.NativeMethodAccessorImpl.invoke0(Native Method)
15:11:53 [2020-08-22T19:11:53.897Z] 	at sun.reflect.NativeMethodAccessorImpl.invoke(NativeMethodAccessorImpl.java:62)
15:11:53 [2020-08-22T19:11:53.897Z] 	at sun.reflect.DelegatingMethodAccessorImpl.invoke(DelegatingMethodAccessorImpl.java:43)
15:11:53 [2020-08-22T19:11:53.897Z] 	at java.lang.reflect.Method.invoke(Method.java:498)
15:11:53 [2020-08-22T19:11:53.897Z] 	at org.junit.runners.model.FrameworkMethod$1.runReflectiveCall(FrameworkMethod.java:59)
15:11:53 [2020-08-22T19:11:53.897Z] 	at org.junit.internal.runners.model.ReflectiveCallable.run(ReflectiveCallable.java:12)
15:11:53 [2020-08-22T19:11:53.897Z] 	at org.junit.runners.model.FrameworkMethod.invokeExplosively(FrameworkMethod.java:56)
15:11:53 [2020-08-22T19:11:53.897Z] 	at org.junit.internal.runners.statements.InvokeMethod.evaluate(InvokeMethod.java:17)
15:11:53 [2020-08-22T19:11:53.897Z] 	at org.junit.internal.runners.statements.RunBefores.evaluate(RunBefores.java:26)
15:11:53 [2020-08-22T19:11:53.897Z] 	at org.junit.internal.runners.statements.RunAfters.evaluate(RunAfters.java:27)
15:11:53 [2020-08-22T19:11:53.897Z] 	at org.junit.runners.ParentRunner$3.evaluate(ParentRunner.java:306)
15:11:53 [2020-08-22T19:11:53.897Z] 	at org.junit.runners.BlockJUnit4ClassRunner$1.evaluate(BlockJUnit4ClassRunner.java:100)
15:11:53 [2020-08-22T19:11:53.897Z] 	at org.junit.runners.ParentRunner.runLeaf(ParentRunner.java:366)
15:11:53 [2020-08-22T19:11:53.897Z] 	at org.junit.runners.BlockJUnit4ClassRunner.runChild(BlockJUnit4ClassRunner.java:103)
15:11:53 [2020-08-22T19:11:53.897Z] 	at org.junit.runners.BlockJUnit4ClassRunner.runChild(BlockJUnit4ClassRunner.java:63)
15:11:53 [2020-08-22T19:11:53.897Z] 	at org.junit.runners.ParentRunner$4.run(ParentRunner.java:331)
15:11:53 [2020-08-22T19:11:53.897Z] 	at org.junit.runners.ParentRunner$1.schedule(ParentRunner.java:79)
15:11:53 [2020-08-22T19:11:53.897Z] 	at org.junit.runners.ParentRunner.runChildren(ParentRunner.java:329)
15:11:53 [2020-08-22T19:11:53.897Z] 	at org.junit.runners.ParentRunner.access$100(ParentRunner.java:66)
15:11:53 [2020-08-22T19:11:53.897Z] 	at org.junit.runners.ParentRunner$2.evaluate(ParentRunner.java:293)
15:11:53 [2020-08-22T19:11:53.897Z] 	at org.junit.internal.runners.statements.RunBefores.evaluate(RunBefores.java:26)
15:11:53 [2020-08-22T19:11:53.897Z] 	at org.junit.runners.ParentRunner$3.evaluate(ParentRunner.java:306)
15:11:53 [2020-08-22T19:11:53.897Z] 	at org.junit.runners.ParentRunner.run(ParentRunner.java:413)
15:11:53 [2020-08-22T19:11:53.897Z] 	at org.apache.maven.surefire.junit4.JUnit4Provider.execute(JUnit4Provider.java:365)
15:11:53 [2020-08-22T19:11:53.897Z] 	at org.apache.maven.surefire.junit4.JUnit4Provider.executeWithRerun(JUnit4Provider.java:273)
15:11:53 [2020-08-22T19:11:53.897Z] 	at org.apache.maven.surefire.junit4.JUnit4Provider.executeTestSet(JUnit4Provider.java:238)
15:11:53 [2020-08-22T19:11:53.897Z] 	at org.apache.maven.surefire.junit4.JUnit4Provider.invoke(JUnit4Provider.java:159)
15:11:53 [2020-08-22T19:11:53.897Z] 	at sun.reflect.NativeMethodAccessorImpl.invoke0(Native Method)
15:11:53 [2020-08-22T19:11:53.897Z] 	at sun.reflect.NativeMethodAccessorImpl.invoke(NativeMethodAccessorImpl.java:62)
15:11:53 [2020-08-22T19:11:53.897Z] 	at sun.reflect.DelegatingMethodAccessorImpl.invoke(DelegatingMethodAccessorImpl.java:43)
15:11:53 [2020-08-22T19:11:53.897Z] 	at java.lang.reflect.Method.invoke(Method.java:498)
15:11:53 [2020-08-22T19:11:53.897Z] 	at org.apache.maven.surefire.util.ReflectionUtils.invokeMethodWithArray2(ReflectionUtils.java:206)
15:11:53 [2020-08-22T19:11:53.897Z] 	at org.apache.maven.surefire.booter.ProviderFactory$ProviderProxy.invoke(ProviderFactory.java:161)
15:11:53 [2020-08-22T19:11:53.897Z] 	at org.apache.maven.surefire.booter.ProviderFactory.invokeProvider(ProviderFactory.java:84)
15:11:53 [2020-08-22T19:11:53.897Z] 	at org.eclipse.tycho.surefire.osgibooter.OsgiSurefireBooter.run(OsgiSurefireBooter.java:113)
15:11:53 [2020-08-22T19:11:53.897Z] 	at org.eclipse.tycho.surefire.osgibooter.AbstractUITestApplication.runTests(AbstractUITestApplication.java:44)
15:11:53 [2020-08-22T19:11:53.897Z] 	at org.eclipse.e4.ui.internal.workbench.swt.E4Testable$1.run(E4Testable.java:73)
15:11:53 [2020-08-22T19:11:53.897Z] 	at java.lang.Thread.run(Thread.java:748)
15:11:53 [2020-08-22T19:11:53.897Z] 
15:11:53 [2020-08-22T19:11:53.897Z] !ENTRY org.eclipse.egit.ui 2 0 2020-08-22 19:11:53.814
15:11:53 [2020-08-22T19:11:53.897Z] !MESSAGE Found multiple implementations of ICommitMessageProvider2. Ignoring caret positioning for org.eclipse.egit.ui.internal.dialogs.CommitMessageBuilderTest$3.
15:11:54 [2020-08-22T19:11:54.154Z] 
15:11:54 [2020-08-22T19:11:54.154Z] (SWT:1623): Gtk-WARNING **: 19:11:53.969: Negative content width -1 (allocation 1, extents 1x1) while allocating gadget (node trough, owner GtkProgressBar)
15:11:55 [2020-08-22T19:11:55.087Z] 
15:11:55 [2020-08-22T19:11:55.087Z] !ENTRY org.eclipse.egit.ui 2 0 2020-08-22 19:11:54.957
15:11:55 [2020-08-22T19:11:55.087Z] !MESSAGE The ICommitMessageProvider2 implementation org.eclipse.egit.ui.internal.dialogs.CommitMessageBuilderTest$3 provided the caret position 14, which exceeds the length of the commit message or is negative. The caret position is ignored.
15:11:55 [2020-08-22T19:11:55.087Z] Tests run: 20, Failures: 0, Errors: 0, Skipped: 0, Time elapsed: 5.965 s - in org.eclipse.egit.ui.internal.dialogs.CommitMessageBuilderTest
15:11:55 [2020-08-22T19:11:55.087Z] commitMessageProvider_oneCrashingProvider(org.eclipse.egit.ui.internal.dialogs.CommitMessageBuilderTest)  Time elapsed: 0.087 s
15:11:55 [2020-08-22T19:11:55.087Z] commitMessageProvider_twoProvidersSecondWithCaretPositioning(org.eclipse.egit.ui.internal.dialogs.CommitMessageBuilderTest)  Time elapsed: 0.103 s
15:11:55 [2020-08-22T19:11:55.087Z] commitMessageProvider_oneCrashingProviderWithCaretPosition(org.eclipse.egit.ui.internal.dialogs.CommitMessageBuilderTest)  Time elapsed: 0.083 s
15:11:55 [2020-08-22T19:11:55.087Z] commitMessageProvider_twoProvidersFirstOneCrashing(org.eclipse.egit.ui.internal.dialogs.CommitMessageBuilderTest)  Time elapsed: 1.057 s
15:11:55 [2020-08-22T19:11:55.087Z] commitMessageProvider_noProvider(org.eclipse.egit.ui.internal.dialogs.CommitMessageBuilderTest)  Time elapsed: 0.095 s
15:11:55 [2020-08-22T19:11:55.087Z] commitMessageProvider_oneProvider(org.eclipse.egit.ui.internal.dialogs.CommitMessageBuilderTest)  Time elapsed: 0.093 s
15:11:55 [2020-08-22T19:11:55.087Z] commitMessageProvider_multipleProvidersWithCrashAndNull(org.eclipse.egit.ui.internal.dialogs.CommitMessageBuilderTest)  Time elapsed: 0.118 s
15:11:55 [2020-08-22T19:11:55.087Z] commitMessageProvider_oneProviderWithInvalidNegativeCaretPosition(org.eclipse.egit.ui.internal.dialogs.CommitMessageBuilderTest)  Time elapsed: 0.092 s
15:11:55 [2020-08-22T19:11:55.087Z] commitMessageProvider_twoProvidersSecondWithUndefinedCaretPosition(org.eclipse.egit.ui.internal.dialogs.CommitMessageBuilderTest)  Time elapsed: 1.146 s
15:11:55 [2020-08-22T19:11:55.087Z] commitMessageProvider_twoProvidersWithCaretPositioningFirstWithUndefinedCaretPosition(org.eclipse.egit.ui.internal.dialogs.CommitMessageBuilderTest)  Time elapsed: 0.102 s
15:11:55 [2020-08-22T19:11:55.087Z] commitMessageProvider_oneProviderWithCaretPositionEqualsMessageLength(org.eclipse.egit.ui.internal.dialogs.CommitMessageBuilderTest)  Time elapsed: 0.088 s
15:11:55 [2020-08-22T19:11:55.087Z] commitMessageProvider_twoProvidersFirstWithCaretPositioning(org.eclipse.egit.ui.internal.dialogs.CommitMessageBuilderTest)  Time elapsed: 0.089 s
15:11:55 [2020-08-22T19:11:55.087Z] commitMessageProvider_twoProvidersWithCaretPositioningSecondWithUndefinedCaretPosition(org.eclipse.egit.ui.internal.dialogs.CommitMessageBuilderTest)  Time elapsed: 0.084 s
15:11:55 [2020-08-22T19:11:55.087Z] commitMessageProvider_oneProviderWithCaretPositioning(org.eclipse.egit.ui.internal.dialogs.CommitMessageBuilderTest)  Time elapsed: 0.087 s
15:11:55 [2020-08-22T19:11:55.087Z] commitMessageProvider_twoProvidersSecondWithCaretPositionZero(org.eclipse.egit.ui.internal.dialogs.CommitMessageBuilderTest)  Time elapsed: 1.097 s
15:11:55 [2020-08-22T19:11:55.087Z] commitMessageProvider_twoProviders(org.eclipse.egit.ui.internal.dialogs.CommitMessageBuilderTest)  Time elapsed: 0.108 s
15:11:55 [2020-08-22T19:11:55.087Z] commitMessageProvider_twoProvidersSecondOneCrashing(org.eclipse.egit.ui.internal.dialogs.CommitMessageBuilderTest)  Time elapsed: 0.101 s
15:11:55 [2020-08-22T19:11:55.087Z] commitMessageProvider_multipleProvidersWithCrashingAndNullAndOneCaretPositioning(org.eclipse.egit.ui.internal.dialogs.CommitMessageBuilderTest)  Time elapsed: 0.095 s
15:11:55 [2020-08-22T19:11:55.087Z] commitMessageProvider_twoProvidersWithCaretPositioning(org.eclipse.egit.ui.internal.dialogs.CommitMessageBuilderTest)  Time elapsed: 0.084 s
15:11:55 [2020-08-22T19:11:55.087Z] commitMessageProvider_oneProviderWithInvalidCaretPositionExceedingMessageLength(org.eclipse.egit.ui.internal.dialogs.CommitMessageBuilderTest)  Time elapsed: 1.15 s
15:11:55 [2020-08-22T19:11:55.087Z] Running org.eclipse.egit.ui.internal.dialogs.SpellcheckableMessageAreaTest
15:11:55 [2020-08-22T19:11:55.087Z] Tests run: 25, Failures: 0, Errors: 0, Skipped: 0, Time elapsed: 0.003 s - in org.eclipse.egit.ui.internal.dialogs.SpellcheckableMessageAreaTest
15:11:55 [2020-08-22T19:11:55.087Z] testWrappingLongWords(org.eclipse.egit.ui.internal.dialogs.SpellcheckableMessageAreaTest)  Time elapsed: 0 s
15:11:55 [2020-08-22T19:11:55.087Z] wrapOnlyCommitMessageBody(org.eclipse.egit.ui.internal.dialogs.SpellcheckableMessageAreaTest)  Time elapsed: 0 s
15:11:55 [2020-08-22T19:11:55.087Z] dontWrapMaximumLengthText(org.eclipse.egit.ui.internal.dialogs.SpellcheckableMessageAreaTest)  Time elapsed: 0 s
15:11:55 [2020-08-22T19:11:55.087Z] keepTrailingSpace(org.eclipse.egit.ui.internal.dialogs.SpellcheckableMessageAreaTest)  Time elapsed: 0 s
15:11:55 [2020-08-22T19:11:55.087Z] dontWrapShortMessage(org.eclipse.egit.ui.internal.dialogs.SpellcheckableMessageAreaTest)  Time elapsed: 0 s
15:11:55 [2020-08-22T19:11:55.087Z] lineAfterWrappedWordShouldNotBeJoined(org.eclipse.egit.ui.internal.dialogs.SpellcheckableMessageAreaTest)  Time elapsed: 0 s
15:11:55 [2020-08-22T19:11:55.087Z] lineAfterWrappedWordShouldNotBeJoined2(org.eclipse.egit.ui.internal.dialogs.SpellcheckableMessageAreaTest)  Time elapsed: 0 s
15:11:55 [2020-08-22T19:11:55.087Z] lineAfterWrappedWordShouldNotBeJoined3(org.eclipse.egit.ui.internal.dialogs.SpellcheckableMessageAreaTest)  Time elapsed: 0 s
15:11:55 [2020-08-22T19:11:55.087Z] dontWrapWordLongerThanOneLine(org.eclipse.egit.ui.internal.dialogs.SpellcheckableMessageAreaTest)  Time elapsed: 0 s
15:11:55 [2020-08-22T19:11:55.087Z] keepExistingNewlines(org.eclipse.egit.ui.internal.dialogs.SpellcheckableMessageAreaTest)  Time elapsed: 0 s
15:11:55 [2020-08-22T19:11:55.087Z] dontWrapShortText(org.eclipse.egit.ui.internal.dialogs.SpellcheckableMessageAreaTest)  Time elapsed: 0 s
15:11:55 [2020-08-22T19:11:55.087Z] dontWrapWordLongerThanOneLineAtStart(org.eclipse.egit.ui.internal.dialogs.SpellcheckableMessageAreaTest)  Time elapsed: 0.001 s
15:11:55 [2020-08-22T19:11:55.087Z] dontWrapAlreadyWrappedText(org.eclipse.egit.ui.internal.dialogs.SpellcheckableMessageAreaTest)  Time elapsed: 0 s
15:11:55 [2020-08-22T19:11:55.087Z] wrapOverlengthText2(org.eclipse.egit.ui.internal.dialogs.SpellcheckableMessageAreaTest)  Time elapsed: 0 s
15:11:55 [2020-08-22T19:11:55.087Z] lineAfterWrappedWordShouldNotBeJoinedIfItStartsWithASymbol(org.eclipse.egit.ui.internal.dialogs.SpellcheckableMessageAreaTest)  Time elapsed: 0 s
15:11:55 [2020-08-22T19:11:55.087Z] wrapAlternatingBlankNonBlank(org.eclipse.egit.ui.internal.dialogs.SpellcheckableMessageAreaTest)  Time elapsed: 0 s
15:11:55 [2020-08-22T19:11:55.087Z] keepWhitespace(org.eclipse.egit.ui.internal.dialogs.SpellcheckableMessageAreaTest)  Time elapsed: 0 s
15:11:55 [2020-08-22T19:11:55.087Z] lineAfterWrappedWordShouldNotBeJoinedIfItsEmpty(org.eclipse.egit.ui.internal.dialogs.SpellcheckableMessageAreaTest)  Time elapsed: 0 s
15:11:55 [2020-08-22T19:11:55.087Z] dontWrapLongCommitMessageFooter(org.eclipse.egit.ui.internal.dialogs.SpellcheckableMessageAreaTest)  Time elapsed: 0 s
15:11:55 [2020-08-22T19:11:55.087Z] lineAfterWrappedLineShouldBeJoinedAndFollowingLineWrappedCorrectly(org.eclipse.egit.ui.internal.dialogs.SpellcheckableMessageAreaTest)  Time elapsed: 0 s
15:11:55 [2020-08-22T19:11:55.087Z] wrapOverlengthText(org.eclipse.egit.ui.internal.dialogs.SpellcheckableMessageAreaTest)  Time elapsed: 0 s
15:11:55 [2020-08-22T19:11:55.087Z] dontWrapWordLongerThanOneLineAndKeepSpaceAtFront(org.eclipse.egit.ui.internal.dialogs.SpellcheckableMessageAreaTest)  Time elapsed: 0 s
15:11:55 [2020-08-22T19:11:55.087Z] wrapSecondLongLine(org.eclipse.egit.ui.internal.dialogs.SpellcheckableMessageAreaTest)  Time elapsed: 0 s
15:11:55 [2020-08-22T19:11:55.087Z] wrapOverlengthTextByOne(org.eclipse.egit.ui.internal.dialogs.SpellcheckableMessageAreaTest)  Time elapsed: 0 s
15:11:55 [2020-08-22T19:11:55.088Z] keepNewlineAtEnd(org.eclipse.egit.ui.internal.dialogs.SpellcheckableMessageAreaTest)  Time elapsed: 0 s
15:11:55 [2020-08-22T19:11:55.088Z] Running org.eclipse.egit.ui.internal.dialogs.CommitMessageComponentTest
15:11:55 [2020-08-22T19:11:55.088Z] Tests run: 5, Failures: 0, Errors: 0, Skipped: 0, Time elapsed: 0 s - in org.eclipse.egit.ui.internal.dialogs.CommitMessageComponentTest
15:11:55 [2020-08-22T19:11:55.088Z] commitFormat_MultipleLines_notOk2(org.eclipse.egit.ui.internal.dialogs.CommitMessageComponentTest)  Time elapsed: 0 s
15:11:55 [2020-08-22T19:11:55.088Z] commitFormat_simple(org.eclipse.egit.ui.internal.dialogs.CommitMessageComponentTest)  Time elapsed: 0 s
15:11:55 [2020-08-22T19:11:55.088Z] commitFormat_MultipleLines_ok(org.eclipse.egit.ui.internal.dialogs.CommitMessageComponentTest)  Time elapsed: 0 s
15:11:55 [2020-08-22T19:11:55.088Z] commitFormat_trailingWhitespace_ok(org.eclipse.egit.ui.internal.dialogs.CommitMessageComponentTest)  Time elapsed: 0 s
15:11:55 [2020-08-22T19:11:55.088Z] commitFormat_MultipleLines_notOk(org.eclipse.egit.ui.internal.dialogs.CommitMessageComponentTest)  Time elapsed: 0 s
15:11:55 [2020-08-22T19:11:55.088Z] Running org.eclipse.egit.ui.internal.actions.StashesMenuTest
15:11:56 [2020-08-22T19:11:56.983Z] 
15:11:56 [2020-08-22T19:11:56.983Z] (SWT:1623): Gtk-WARNING **: 19:11:56.555: Negative content width -6 (allocation 1, extents 4x3) while allocating gadget (node toolbar, owner GtkToolbar)
15:11:56 [2020-08-22T19:11:56.983Z] 
15:11:56 [2020-08-22T19:11:56.983Z] (SWT:1623): Gtk-WARNING **: 19:11:56.556: Negative content height -3 (allocation 1, extents 2x2) while allocating gadget (node toolbar, owner GtkToolbar)
15:11:56 [2020-08-22T19:11:56.983Z] 
15:11:56 [2020-08-22T19:11:56.983Z] (SWT:1623): Gtk-WARNING **: 19:11:56.556: Negative content width -6 (allocation 1, extents 4x3) while allocating gadget (node toolbar, owner GtkToolbar)
15:11:56 [2020-08-22T19:11:56.983Z] 
15:11:56 [2020-08-22T19:11:56.983Z] (SWT:1623): Gtk-WARNING **: 19:11:56.556: Negative content height -3 (allocation 1, extents 2x2) while allocating gadget (node toolbar, owner GtkToolbar)
15:11:56 [2020-08-22T19:11:56.983Z] 
15:11:56 [2020-08-22T19:11:56.983Z] (SWT:1623): Gtk-WARNING **: 19:11:56.604: Negative content width -6 (allocation 1, extents 4x3) while allocating gadget (node toolbar, owner GtkToolbar)
15:11:56 [2020-08-22T19:11:56.983Z] 
15:11:56 [2020-08-22T19:11:56.983Z] (SWT:1623): Gtk-WARNING **: 19:11:56.616: Negative content width -6 (allocation 1, extents 4x3) while allocating gadget (node toolbar, owner GtkToolbar)
15:11:56 [2020-08-22T19:11:56.983Z] 
15:11:56 [2020-08-22T19:11:56.983Z] (SWT:1623): Gtk-WARNING **: 19:11:56.629: Negative content width -6 (allocation 1, extents 4x3) while allocating gadget (node toolbar, owner GtkToolbar)
15:11:57 [2020-08-22T19:11:57.240Z] Tests run: 2, Failures: 0, Errors: 0, Skipped: 0, Time elapsed: 2.07 s - in org.eclipse.egit.ui.internal.actions.StashesMenuTest
15:11:57 [2020-08-22T19:11:57.240Z] menuWithoutStashes(org.eclipse.egit.ui.internal.actions.StashesMenuTest)  Time elapsed: 0.727 s
15:11:57 [2020-08-22T19:11:57.240Z] stashAndApplyChanges(org.eclipse.egit.ui.internal.actions.StashesMenuTest)  Time elapsed: 1.338 s
15:11:57 [2020-08-22T19:11:57.240Z] Running org.eclipse.egit.ui.internal.actions.LinkedResourcesTest
15:11:58 [2020-08-22T19:11:58.611Z] Tests run: 2, Failures: 0, Errors: 0, Skipped: 0, Time elapsed: 1.223 s - in org.eclipse.egit.ui.internal.actions.LinkedResourcesTest
15:11:58 [2020-08-22T19:11:58.611Z] testSomeActionsWithoutLinkedResources(org.eclipse.egit.ui.internal.actions.LinkedResourcesTest)  Time elapsed: 0.577 s
15:11:58 [2020-08-22T19:11:58.611Z] testNoActionOnLinkedResources(org.eclipse.egit.ui.internal.actions.LinkedResourcesTest)  Time elapsed: 0.641 s
15:11:58 [2020-08-22T19:11:58.611Z] Running org.eclipse.egit.ui.internal.actions.SwitchToMenuTest
15:12:08 [2020-08-22T19:12:08.575Z] 
15:12:08 [2020-08-22T19:12:08.575Z] !ENTRY org.eclipse.egit.core 4 0 2020-08-22 19:12:07.355
15:12:08 [2020-08-22T19:12:08.575Z] !MESSAGE Cannot parse the reflog for HEAD in repository /home/jenkins/agent/workspace/egit/tmp/egit.tmp/5b2a700255bf44639f8d920f954b2798/LocalRepositoriesTests264_selectionWithCorruptedReflog/FirstRepository/.git
15:12:08 [2020-08-22T19:12:08.575Z] !STACK 0
15:12:08 [2020-08-22T19:12:08.575Z] org.eclipse.jgit.errors.InvalidObjectIdException: Invalid id: INTENTIONALLY CORRUPTED REFLOG. Just som
15:12:08 [2020-08-22T19:12:08.575Z] 	at org.eclipse.jgit.lib.ObjectId.fromHexString(ObjectId.java:217)
15:12:08 [2020-08-22T19:12:08.575Z] 	at org.eclipse.jgit.lib.ObjectId.fromString(ObjectId.java:191)
15:12:08 [2020-08-22T19:12:08.575Z] 	at org.eclipse.jgit.internal.storage.file.ReflogEntryImpl.<init>(ReflogEntryImpl.java:39)
15:12:08 [2020-08-22T19:12:08.575Z] 	at org.eclipse.jgit.internal.storage.file.ReflogReaderImpl.getReverseEntries(ReflogReaderImpl.java:109)
15:12:08 [2020-08-22T19:12:08.575Z] 	at org.eclipse.jgit.internal.storage.file.ReflogReaderImpl.getReverseEntries(ReflogReaderImpl.java:56)
15:12:08 [2020-08-22T19:12:08.575Z] 	at org.eclipse.egit.core.RepositoryUtil.safeReadReflog(RepositoryUtil.java:193)
15:12:08 [2020-08-22T19:12:08.575Z] 	at org.eclipse.egit.ui.internal.actions.SwitchToMenu.getMostActiveBranches(SwitchToMenu.java:465)
15:12:08 [2020-08-22T19:12:08.575Z] 	at org.eclipse.egit.ui.internal.actions.SwitchToMenu.createMostActiveBranchesMenuItems(SwitchToMenu.java:306)
15:12:08 [2020-08-22T19:12:08.575Z] 	at org.eclipse.egit.ui.internal.actions.SwitchToMenu.createDynamicMenu(SwitchToMenu.java:142)
15:12:08 [2020-08-22T19:12:08.575Z] 	at org.eclipse.egit.ui.internal.actions.SwitchToMenu.fill(SwitchToMenu.java:122)
15:12:08 [2020-08-22T19:12:08.575Z] 	at org.eclipse.egit.ui.internal.actions.SwitchToMenuTest$1.run(SwitchToMenuTest.java:310)
15:12:08 [2020-08-22T19:12:08.575Z] 	at org.eclipse.swt.widgets.RunnableLock.run(RunnableLock.java:35)
15:12:08 [2020-08-22T19:12:08.575Z] 	at org.eclipse.swt.widgets.Synchronizer.runAsyncMessages(Synchronizer.java:182)
15:12:08 [2020-08-22T19:12:08.575Z] 	at org.eclipse.swt.widgets.Display.runAsyncMessages(Display.java:4536)
15:12:08 [2020-08-22T19:12:08.575Z] 	at org.eclipse.swt.widgets.Display.readAndDispatch(Display.java:4154)
15:12:08 [2020-08-22T19:12:08.575Z] 	at org.eclipse.e4.ui.internal.workbench.swt.PartRenderingEngine$4.run(PartRenderingEngine.java:1121)
15:12:08 [2020-08-22T19:12:08.575Z] 	at org.eclipse.core.databinding.observable.Realm.runWithDefault(Realm.java:336)
15:12:08 [2020-08-22T19:12:08.575Z] 	at org.eclipse.e4.ui.internal.workbench.swt.PartRenderingEngine.run(PartRenderingEngine.java:1022)
15:12:08 [2020-08-22T19:12:08.575Z] 	at org.eclipse.e4.ui.internal.workbench.E4Workbench.createAndRunUI(E4Workbench.java:150)
15:12:08 [2020-08-22T19:12:08.575Z] 	at org.eclipse.ui.internal.Workbench$5.run(Workbench.java:693)
15:12:08 [2020-08-22T19:12:08.575Z] 	at org.eclipse.core.databinding.observable.Realm.runWithDefault(Realm.java:336)
15:12:08 [2020-08-22T19:12:08.575Z] 	at org.eclipse.ui.internal.Workbench.createAndRunWorkbench(Workbench.java:610)
15:12:08 [2020-08-22T19:12:08.575Z] 	at org.eclipse.ui.PlatformUI.createAndRunWorkbench(PlatformUI.java:148)
15:12:08 [2020-08-22T19:12:08.575Z] 	at org.eclipse.ui.internal.ide.application.IDEApplication.start(IDEApplication.java:138)
15:12:08 [2020-08-22T19:12:08.575Z] 	at org.eclipse.tycho.surefire.osgibooter.UITestApplication.runApplication(UITestApplication.java:31)
15:12:08 [2020-08-22T19:12:08.575Z] 	at org.eclipse.tycho.surefire.osgibooter.AbstractUITestApplication.run(AbstractUITestApplication.java:120)
15:12:08 [2020-08-22T19:12:08.575Z] 	at org.eclipse.tycho.surefire.osgibooter.UITestApplication.start(UITestApplication.java:37)
15:12:08 [2020-08-22T19:12:08.575Z] 	at org.eclipse.equinox.internal.app.EclipseAppHandle.run(EclipseAppHandle.java:196)
15:12:08 [2020-08-22T19:12:08.575Z] 	at org.eclipse.core.runtime.internal.adaptor.EclipseAppLauncher.runApplication(EclipseAppLauncher.java:134)
15:12:08 [2020-08-22T19:12:08.575Z] 	at org.eclipse.core.runtime.internal.adaptor.EclipseAppLauncher.start(EclipseAppLauncher.java:104)
15:12:08 [2020-08-22T19:12:08.575Z] 	at org.eclipse.core.runtime.adaptor.EclipseStarter.run(EclipseStarter.java:388)
15:12:08 [2020-08-22T19:12:08.575Z] 	at org.eclipse.core.runtime.adaptor.EclipseStarter.run(EclipseStarter.java:243)
15:12:08 [2020-08-22T19:12:08.575Z] 	at sun.reflect.NativeMethodAccessorImpl.invoke0(Native Method)
15:12:08 [2020-08-22T19:12:08.575Z] 	at sun.reflect.NativeMethodAccessorImpl.invoke(NativeMethodAccessorImpl.java:62)
15:12:08 [2020-08-22T19:12:08.575Z] 	at sun.reflect.DelegatingMethodAccessorImpl.invoke(DelegatingMethodAccessorImpl.java:43)
15:12:08 [2020-08-22T19:12:08.575Z] 	at java.lang.reflect.Method.invoke(Method.java:498)
15:12:08 [2020-08-22T19:12:08.575Z] 	at org.eclipse.equinox.launcher.Main.invokeFramework(Main.java:673)
15:12:08 [2020-08-22T19:12:08.575Z] 	at org.eclipse.equinox.launcher.Main.basicRun(Main.java:610)
15:12:08 [2020-08-22T19:12:08.575Z] 	at org.eclipse.equinox.launcher.Main.run(Main.java:1519)
15:12:08 [2020-08-22T19:12:08.575Z] 	at org.eclipse.equinox.launcher.Main.main(Main.java:1492)
15:12:08 [2020-08-22T19:12:08.575Z] Caused by: java.lang.ArrayIndexOutOfBoundsException
15:12:08 [2020-08-22T19:12:08.575Z] 	at org.eclipse.jgit.util.RawParseUtils.parseHexInt32(RawParseUtils.java:336)
15:12:08 [2020-08-22T19:12:08.575Z] 	at org.eclipse.jgit.lib.ObjectId.fromHexString(ObjectId.java:210)
15:12:08 [2020-08-22T19:12:08.575Z] 	... 39 more
15:12:08 [2020-08-22T19:12:08.575Z] Tests run: 9, Failures: 0, Errors: 0, Skipped: 0, Time elapsed: 9.217 s - in org.eclipse.egit.ui.internal.actions.SwitchToMenuTest
15:12:08 [2020-08-22T19:12:08.575Z] multipleSelectionWithMultipleRepositoriesAndNoCommonBranches(org.eclipse.egit.ui.internal.actions.SwitchToMenuTest)  Time elapsed: 1.073 s
15:12:08 [2020-08-22T19:12:08.575Z] selectionWithProj1(org.eclipse.egit.ui.internal.actions.SwitchToMenuTest)  Time elapsed: 0.586 s
15:12:08 [2020-08-22T19:12:08.575Z] selectionNotAdaptableToRepository(org.eclipse.egit.ui.internal.actions.SwitchToMenuTest)  Time elapsed: 0.053 s
15:12:08 [2020-08-22T19:12:08.575Z] selectionWithProj1AndReflog(org.eclipse.egit.ui.internal.actions.SwitchToMenuTest)  Time elapsed: 0.648 s
15:12:08 [2020-08-22T19:12:08.575Z] validateMenuEntriesForMultiSelectionWithMultipleRepositories(org.eclipse.egit.ui.internal.actions.SwitchToMenuTest)  Time elapsed: 3.307 s
15:12:08 [2020-08-22T19:12:08.575Z] validateBranchSwitchingForForMultiSelectionWithMultipleRepositories(org.eclipse.egit.ui.internal.actions.SwitchToMenuTest)  Time elapsed: 1.251 s
15:12:08 [2020-08-22T19:12:08.575Z] selectionWithRepositoryHavingOver20Branches(org.eclipse.egit.ui.internal.actions.SwitchToMenuTest)  Time elapsed: 1.619 s
15:12:08 [2020-08-22T19:12:08.575Z] emptySelection(org.eclipse.egit.ui.internal.actions.SwitchToMenuTest)  Time elapsed: 0.054 s
15:12:08 [2020-08-22T19:12:08.575Z] selectionWithCorruptedReflog(org.eclipse.egit.ui.internal.actions.SwitchToMenuTest)  Time elapsed: 0.604 s
15:12:08 [2020-08-22T19:12:08.575Z] Running org.eclipse.egit.ui.internal.submodules.SubmoduleFolderTest
15:12:11 [2020-08-22T19:12:11.860Z] 
15:12:11 [2020-08-22T19:12:11.860Z] (SWT:1623): Gtk-WARNING **: 19:12:11.445: Negative content width -6 (allocation 1, extents 4x3) while allocating gadget (node toolbar, owner GtkToolbar)
15:12:11 [2020-08-22T19:12:11.860Z] 
15:12:11 [2020-08-22T19:12:11.860Z] (SWT:1623): Gtk-WARNING **: 19:12:11.445: Negative content height -3 (allocation 1, extents 2x2) while allocating gadget (node toolbar, owner GtkToolbar)
15:12:11 [2020-08-22T19:12:11.860Z] 
15:12:11 [2020-08-22T19:12:11.860Z] (SWT:1623): Gtk-WARNING **: 19:12:11.445: Negative content width -6 (allocation 1, extents 4x3) while allocating gadget (node toolbar, owner GtkToolbar)
15:12:11 [2020-08-22T19:12:11.860Z] 
15:12:11 [2020-08-22T19:12:11.860Z] (SWT:1623): Gtk-WARNING **: 19:12:11.445: Negative content height -3 (allocation 1, extents 2x2) while allocating gadget (node toolbar, owner GtkToolbar)
15:12:11 [2020-08-22T19:12:11.860Z] 
15:12:11 [2020-08-22T19:12:11.860Z] (SWT:1623): Gtk-WARNING **: 19:12:11.775: Negative content width -6 (allocation 1, extents 4x3) while allocating gadget (node toolbar, owner GtkToolbar)
15:12:11 [2020-08-22T19:12:11.860Z] 
15:12:11 [2020-08-22T19:12:11.860Z] (SWT:1623): Gtk-WARNING **: 19:12:11.778: Negative content width -6 (allocation 1, extents 4x3) while allocating gadget (node toolbar, owner GtkToolbar)
15:12:11 [2020-08-22T19:12:11.860Z] 
15:12:11 [2020-08-22T19:12:11.860Z] (SWT:1623): Gtk-WARNING **: 19:12:11.781: Negative content width -6 (allocation 1, extents 4x3) while allocating gadget (node toolbar, owner GtkToolbar)
15:12:11 [2020-08-22T19:12:11.860Z] 
15:12:11 [2020-08-22T19:12:11.860Z] (SWT:1623): Gtk-WARNING **: 19:12:11.785: Negative content width -6 (allocation 1, extents 4x3) while allocating gadget (node toolbar, owner GtkToolbar)
15:12:11 [2020-08-22T19:12:11.860Z] 
15:12:11 [2020-08-22T19:12:11.860Z] (SWT:1623): Gtk-WARNING **: 19:12:11.801: Negative content width -6 (allocation 1, extents 4x3) while allocating gadget (node toolbar, owner GtkToolbar)
15:12:11 [2020-08-22T19:12:11.860Z] 
15:12:11 [2020-08-22T19:12:11.860Z] (SWT:1623): Gtk-WARNING **: 19:12:11.802: Negative content width -6 (allocation 1, extents 4x3) while allocating gadget (node toolbar, owner GtkToolbar)
15:12:11 [2020-08-22T19:12:11.860Z] 
15:12:11 [2020-08-22T19:12:11.860Z] (SWT:1623): Gtk-WARNING **: 19:12:11.850: Negative content width -6 (allocation 1, extents 4x3) while allocating gadget (node toolbar, owner GtkToolbar)
15:12:11 [2020-08-22T19:12:11.860Z] 
15:12:11 [2020-08-22T19:12:11.860Z] (SWT:1623): Gtk-WARNING **: 19:12:11.850: Negative content width -6 (allocation 1, extents 4x3) while allocating gadget (node toolbar, owner GtkToolbar)
15:12:19 [2020-08-22T19:12:19.970Z] 
15:12:19 [2020-08-22T19:12:19.970Z] (SWT:1623): Gtk-WARNING **: 19:12:18.936: Negative content width -6 (allocation 1, extents 4x3) while allocating gadget (node toolbar, owner GtkToolbar)
15:12:19 [2020-08-22T19:12:19.970Z] 
15:12:19 [2020-08-22T19:12:19.970Z] (SWT:1623): Gtk-WARNING **: 19:12:18.951: Negative content width -6 (allocation 1, extents 4x3) while allocating gadget (node toolbar, owner GtkToolbar)
15:12:19 [2020-08-22T19:12:19.970Z] 
15:12:19 [2020-08-22T19:12:19.970Z] (SWT:1623): Gtk-WARNING **: 19:12:18.990: Negative content width -6 (allocation 1, extents 4x3) while allocating gadget (node toolbar, owner GtkToolbar)
15:12:19 [2020-08-22T19:12:19.970Z] 
15:12:19 [2020-08-22T19:12:19.970Z] (SWT:1623): Gtk-WARNING **: 19:12:18.991: Negative content width -6 (allocation 1, extents 4x3) while allocating gadget (node toolbar, owner GtkToolbar)
15:12:19 [2020-08-22T19:12:19.970Z] 
15:12:19 [2020-08-22T19:12:19.970Z] (SWT:1623): Gtk-CRITICAL **: 19:12:19.023: gtk_box_gadget_distribute: assertion 'size >= 0' failed in GtkScrollbar
15:12:19 [2020-08-22T19:12:19.970Z] 
15:12:19 [2020-08-22T19:12:19.970Z] (SWT:1623): Gtk-CRITICAL **: 19:12:19.031: gtk_box_gadget_distribute: assertion 'size >= 0' failed in GtkScrollbar
15:12:19 [2020-08-22T19:12:19.970Z] 
15:12:19 [2020-08-22T19:12:19.970Z] (SWT:1623): Gtk-CRITICAL **: 19:12:19.045: gtk_box_gadget_distribute: assertion 'size >= 0' failed in GtkScrollbar
15:12:19 [2020-08-22T19:12:19.970Z] 
15:12:19 [2020-08-22T19:12:19.970Z] (SWT:1623): Gtk-CRITICAL **: 19:12:19.061: gtk_box_gadget_distribute: assertion 'size >= 0' failed in GtkScrollbar
15:12:19 [2020-08-22T19:12:19.970Z] 
15:12:19 [2020-08-22T19:12:19.970Z] (SWT:1623): Gtk-CRITICAL **: 19:12:19.078: gtk_box_gadget_distribute: assertion 'size >= 0' failed in GtkScrollbar
15:12:19 [2020-08-22T19:12:19.970Z] 
15:12:19 [2020-08-22T19:12:19.970Z] (SWT:1623): Gtk-CRITICAL **: 19:12:19.095: gtk_box_gadget_distribute: assertion 'size >= 0' failed in GtkScrollbar
15:12:19 [2020-08-22T19:12:19.970Z] 
15:12:19 [2020-08-22T19:12:19.970Z] (SWT:1623): Gtk-CRITICAL **: 19:12:19.112: gtk_box_gadget_distribute: assertion 'size >= 0' failed in GtkScrollbar
15:12:19 [2020-08-22T19:12:19.970Z] 
15:12:19 [2020-08-22T19:12:19.970Z] (SWT:1623): Gtk-CRITICAL **: 19:12:19.130: gtk_box_gadget_distribute: assertion 'size >= 0' failed in GtkScrollbar
15:12:19 [2020-08-22T19:12:19.970Z] 
15:12:19 [2020-08-22T19:12:19.970Z] (SWT:1623): Gtk-WARNING **: 19:12:19.136: Negative content width -6 (allocation 1, extents 4x3) while allocating gadget (node toolbar, owner GtkToolbar)
15:12:19 [2020-08-22T19:12:19.970Z] 
15:12:19 [2020-08-22T19:12:19.970Z] (SWT:1623): Gtk-WARNING **: 19:12:19.146: Negative content width -6 (allocation 1, extents 4x3) while allocating gadget (node toolbar, owner GtkToolbar)
15:12:19 [2020-08-22T19:12:19.970Z] 
15:12:19 [2020-08-22T19:12:19.970Z] (SWT:1623): Gtk-WARNING **: 19:12:19.172: Negative content width -6 (allocation 1, extents 4x3) while allocating gadget (node toolbar, owner GtkToolbar)
15:12:19 [2020-08-22T19:12:19.970Z] 
15:12:19 [2020-08-22T19:12:19.970Z] (SWT:1623): Gtk-CRITICAL **: 19:12:19.175: gtk_box_gadget_distribute: assertion 'size >= 0' failed in GtkScrollbar
15:12:19 [2020-08-22T19:12:19.970Z] 
15:12:19 [2020-08-22T19:12:19.970Z] (SWT:1623): Gtk-WARNING **: 19:12:19.220: Negative content width -6 (allocation 1, extents 4x3) while allocating gadget (node toolbar, owner GtkToolbar)
15:12:25 [2020-08-22T19:12:25.227Z] 
15:12:25 [2020-08-22T19:12:25.227Z] (SWT:1623): Gtk-WARNING **: 19:12:24.462: Negative content width -6 (allocation 1, extents 4x3) while allocating gadget (node toolbar, owner GtkToolbar)
15:12:25 [2020-08-22T19:12:25.227Z] 
15:12:25 [2020-08-22T19:12:25.227Z] (SWT:1623): Gtk-WARNING **: 19:12:24.959: Negative content width -6 (allocation 1, extents 4x3) while allocating gadget (node toolbar, owner GtkToolbar)
15:12:25 [2020-08-22T19:12:25.791Z] 
15:12:25 [2020-08-22T19:12:25.791Z] (SWT:1623): Gtk-WARNING **: 19:12:25.689: Negative content width -6 (allocation 1, extents 4x3) while allocating gadget (node toolbar, owner GtkToolbar)
15:12:25 [2020-08-22T19:12:25.791Z] 
15:12:25 [2020-08-22T19:12:25.791Z] (SWT:1623): Gtk-WARNING **: 19:12:25.727: Negative content width -6 (allocation 1, extents 4x3) while allocating gadget (node toolbar, owner GtkToolbar)
15:12:30 [2020-08-22T19:12:30.020Z] Tests run: 11, Failures: 0, Errors: 0, Skipped: 0, Time elapsed: 22.077 s - in org.eclipse.egit.ui.internal.submodules.SubmoduleFolderTest
15:12:30 [2020-08-22T19:12:30.020Z] testSwitchToMenu(org.eclipse.egit.ui.internal.submodules.SubmoduleFolderTest)  Time elapsed: 2.098 s
15:12:30 [2020-08-22T19:12:30.020Z] compareWithHeadInSubmoduleFolder(org.eclipse.egit.ui.internal.submodules.SubmoduleFolderTest)  Time elapsed: 2.435 s
15:12:30 [2020-08-22T19:12:30.021Z] testStageUnstageInSubRepo(org.eclipse.egit.ui.internal.submodules.SubmoduleFolderTest)  Time elapsed: 3.142 s
15:12:30 [2020-08-22T19:12:30.021Z] testDecoration(org.eclipse.egit.ui.internal.submodules.SubmoduleFolderTest)  Time elapsed: 2.15 s
15:12:30 [2020-08-22T19:12:30.021Z] testHistoryFromProjectExplorerIsFromSubRepository(org.eclipse.egit.ui.internal.submodules.SubmoduleFolderTest)  Time elapsed: 2.011 s
15:12:30 [2020-08-22T19:12:30.021Z] testParentFolderMapsToParentRepo(org.eclipse.egit.ui.internal.submodules.SubmoduleFolderTest)  Time elapsed: 1.652 s
15:12:30 [2020-08-22T19:12:30.021Z] testDisconnect(org.eclipse.egit.ui.internal.submodules.SubmoduleFolderTest)  Time elapsed: 2.29 s
15:12:30 [2020-08-22T19:12:30.021Z] testRepoViewFollowSelection(org.eclipse.egit.ui.internal.submodules.SubmoduleFolderTest)  Time elapsed: 2.552 s
15:12:30 [2020-08-22T19:12:30.021Z] testRepoRemoval(org.eclipse.egit.ui.internal.submodules.SubmoduleFolderTest)  Time elapsed: 1.21 s
15:12:30 [2020-08-22T19:12:30.021Z] testChildProjectMapsToSubRepo(org.eclipse.egit.ui.internal.submodules.SubmoduleFolderTest)  Time elapsed: 1.236 s
15:12:30 [2020-08-22T19:12:30.021Z] testChildFolderMapsToSubRepo(org.eclipse.egit.ui.internal.submodules.SubmoduleFolderTest)  Time elapsed: 1.238 s
15:12:30 [2020-08-22T19:12:30.021Z] Running org.eclipse.egit.ui.internal.synchronize.model.GitModelWorkingFileTest
15:12:33 [2020-08-22T19:12:33.309Z] Tests run: 5, Failures: 0, Errors: 0, Skipped: 0, Time elapsed: 3.689 s - in org.eclipse.egit.ui.internal.synchronize.model.GitModelWorkingFileTest
15:12:33 [2020-08-22T19:12:33.309Z] shouldReturnNotEqualForDifferentLocation(org.eclipse.egit.ui.internal.synchronize.model.GitModelWorkingFileTest)  Time elapsed: 0.804 s
15:12:33 [2020-08-22T19:12:33.309Z] shouldReturnNotEqualWhenComparingWorkingFileAndCacheFile(org.eclipse.egit.ui.internal.synchronize.model.GitModelWorkingFileTest)  Time elapsed: 0.68 s
15:12:33 [2020-08-22T19:12:33.309Z] shouldReturnEqualForSameInstance(org.eclipse.egit.ui.internal.synchronize.model.GitModelWorkingFileTest)  Time elapsed: 0.602 s
15:12:33 [2020-08-22T19:12:33.309Z] shouldReturnNotEqualWhenComparingWorkingFileAndBlob(org.eclipse.egit.ui.internal.synchronize.model.GitModelWorkingFileTest)  Time elapsed: 0.647 s
15:12:33 [2020-08-22T19:12:33.309Z] shouldReturnEqualForSameLocation(org.eclipse.egit.ui.internal.synchronize.model.GitModelWorkingFileTest)  Time elapsed: 0.945 s
15:12:33 [2020-08-22T19:12:33.309Z] Running org.eclipse.egit.ui.internal.synchronize.model.GitModelBlobTest
15:12:41 [2020-08-22T19:12:41.409Z] Tests run: 15, Failures: 0, Errors: 0, Skipped: 2, Time elapsed: 8.065 s - in org.eclipse.egit.ui.internal.synchronize.model.GitModelBlobTest
15:12:41 [2020-08-22T19:12:41.409Z] shouldReturnEqualSameData1(org.eclipse.egit.ui.internal.synchronize.model.GitModelBlobTest) skipped
15:12:41 [2020-08-22T19:12:41.409Z] shouldReturnNotEqualForDifferentLocation(org.eclipse.egit.ui.internal.synchronize.model.GitModelBlobTest)  Time elapsed: 0.655 s
15:12:41 [2020-08-22T19:12:41.409Z] shouldReturnNotEqualForBlobAndCommit(org.eclipse.egit.ui.internal.synchronize.model.GitModelBlobTest)  Time elapsed: 0.69 s
15:12:41 [2020-08-22T19:12:41.409Z] shouldReturnEqualForSameData(org.eclipse.egit.ui.internal.synchronize.model.GitModelBlobTest) skipped
15:12:41 [2020-08-22T19:12:41.409Z] shouldReturnNotEqualForDifferentFiles(org.eclipse.egit.ui.internal.synchronize.model.GitModelBlobTest)  Time elapsed: 0.603 s
15:12:41 [2020-08-22T19:12:41.409Z] shouldReturnNotEqualForBlobAndCacheFile(org.eclipse.egit.ui.internal.synchronize.model.GitModelBlobTest)  Time elapsed: 0.608 s
15:12:41 [2020-08-22T19:12:41.409Z] shouldReturnNotEqualForBlobAndTree(org.eclipse.egit.ui.internal.synchronize.model.GitModelBlobTest)  Time elapsed: 0.66 s
15:12:41 [2020-08-22T19:12:41.409Z] shouldBeSymmetric1(org.eclipse.egit.ui.internal.synchronize.model.GitModelBlobTest)  Time elapsed: 0.596 s
15:12:41 [2020-08-22T19:12:41.409Z] shouldBeSymmetric(org.eclipse.egit.ui.internal.synchronize.model.GitModelBlobTest)  Time elapsed: 0.599 s
15:12:41 [2020-08-22T19:12:41.409Z] shouldReturnEqualForSameInstance(org.eclipse.egit.ui.internal.synchronize.model.GitModelBlobTest)  Time elapsed: 0.616 s
15:12:41 [2020-08-22T19:12:41.409Z] shouldActAsResourceProvider(org.eclipse.egit.ui.internal.synchronize.model.GitModelBlobTest)  Time elapsed: 0.591 s
15:12:41 [2020-08-22T19:12:41.409Z] shouldReturnNotEqualForDifferentBaseObjectId2(org.eclipse.egit.ui.internal.synchronize.model.GitModelBlobTest)  Time elapsed: 0.595 s
15:12:41 [2020-08-22T19:12:41.409Z] shouldReturnNotEqualForDifferentBaseObjectId3(org.eclipse.egit.ui.internal.synchronize.model.GitModelBlobTest)  Time elapsed: 0.602 s
15:12:41 [2020-08-22T19:12:41.409Z] shouldReturnNotEqualForBlobAndWorkingFile(org.eclipse.egit.ui.internal.synchronize.model.GitModelBlobTest)  Time elapsed: 0.622 s
15:12:41 [2020-08-22T19:12:41.409Z] shouldReturnNotEqualForDifferentBaseObjectId(org.eclipse.egit.ui.internal.synchronize.model.GitModelBlobTest)  Time elapsed: 0.603 s
15:12:41 [2020-08-22T19:12:41.409Z] Running org.eclipse.egit.ui.internal.synchronize.model.GitModelCacheFileTest
15:12:44 [2020-08-22T19:12:44.688Z] Tests run: 7, Failures: 0, Errors: 0, Skipped: 2, Time elapsed: 2.982 s - in org.eclipse.egit.ui.internal.synchronize.model.GitModelCacheFileTest
15:12:44 [2020-08-22T19:12:44.688Z] shouldReturnEqualForSameObjectIdsAndLocation(org.eclipse.egit.ui.internal.synchronize.model.GitModelCacheFileTest)  Time elapsed: 0.581 s
15:12:44 [2020-08-22T19:12:44.689Z] shouldReturnNotEqualWhenComparingCacheFileAndBlob(org.eclipse.egit.ui.internal.synchronize.model.GitModelCacheFileTest)  Time elapsed: 0.584 s
15:12:44 [2020-08-22T19:12:44.689Z] shouldReturnNotEqualForDifferentCacheIds(org.eclipse.egit.ui.internal.synchronize.model.GitModelCacheFileTest) skipped
15:12:44 [2020-08-22T19:12:44.689Z] shouldReturnEqualForSameInstance(org.eclipse.egit.ui.internal.synchronize.model.GitModelCacheFileTest)  Time elapsed: 0.605 s
15:12:44 [2020-08-22T19:12:44.689Z] shouldReturnNotEqualWhenComparingCacheFileAndWorkingFile(org.eclipse.egit.ui.internal.synchronize.model.GitModelCacheFileTest)  Time elapsed: 0.621 s
15:12:44 [2020-08-22T19:12:44.689Z] shouldReturnNotEqualForDifferentBaseIds(org.eclipse.egit.ui.internal.synchronize.model.GitModelCacheFileTest)  Time elapsed: 0.581 s
15:12:44 [2020-08-22T19:12:44.689Z] shouldReturnNotEqualForDifferentLocations(org.eclipse.egit.ui.internal.synchronize.model.GitModelCacheFileTest) skipped
15:12:44 [2020-08-22T19:12:44.689Z] Running org.eclipse.egit.ui.internal.synchronize.model.GitModelWorkingTreeTest
15:12:45 [2020-08-22T19:12:45.642Z] Tests run: 2, Failures: 0, Errors: 0, Skipped: 0, Time elapsed: 1.193 s - in org.eclipse.egit.ui.internal.synchronize.model.GitModelWorkingTreeTest
15:12:45 [2020-08-22T19:12:45.642Z] shouldReturnNotEqualsWhenComparingWorkingTreeAndCache(org.eclipse.egit.ui.internal.synchronize.model.GitModelWorkingTreeTest)  Time elapsed: 0.61 s
15:12:45 [2020-08-22T19:12:45.642Z] shouldReturnEqualsForTheSameInstance(org.eclipse.egit.ui.internal.synchronize.model.GitModelWorkingTreeTest)  Time elapsed: 0.578 s
15:12:45 [2020-08-22T19:12:45.642Z] Running org.eclipse.egit.ui.internal.synchronize.model.GitModelCacheTreeTest
15:12:48 [2020-08-22T19:12:48.202Z] Tests run: 4, Failures: 0, Errors: 0, Skipped: 0, Time elapsed: 2.399 s - in org.eclipse.egit.ui.internal.synchronize.model.GitModelCacheTreeTest
15:12:48 [2020-08-22T19:12:48.202Z] shouldReturnEqualForSameData(org.eclipse.egit.ui.internal.synchronize.model.GitModelCacheTreeTest)  Time elapsed: 0.57 s
15:12:48 [2020-08-22T19:12:48.202Z] shouldReturnNotEqualForDifferetnLocation(org.eclipse.egit.ui.internal.synchronize.model.GitModelCacheTreeTest)  Time elapsed: 0.614 s
15:12:48 [2020-08-22T19:12:48.202Z] shouldReturnEqualForSameInstance(org.eclipse.egit.ui.internal.synchronize.model.GitModelCacheTreeTest)  Time elapsed: 0.592 s
15:12:48 [2020-08-22T19:12:48.203Z] shouldReturnNotEqualWhenComparingCacheTreeAndTree(org.eclipse.egit.ui.internal.synchronize.model.GitModelCacheTreeTest)  Time elapsed: 0.615 s
15:12:48 [2020-08-22T19:12:48.203Z] Running org.eclipse.egit.ui.internal.synchronize.model.GitModelRootTest
15:12:49 [2020-08-22T19:12:49.573Z] Tests run: 1, Failures: 0, Errors: 0, Skipped: 0, Time elapsed: 1.406 s - in org.eclipse.egit.ui.internal.synchronize.model.GitModelRootTest
15:12:49 [2020-08-22T19:12:49.573Z] shouldIgnoreEmptyRepositories(org.eclipse.egit.ui.internal.synchronize.model.GitModelRootTest)  Time elapsed: 1.402 s
15:12:49 [2020-08-22T19:12:49.573Z] Running org.eclipse.egit.ui.internal.synchronize.model.GitModelCommitTest
15:12:54 [2020-08-22T19:12:54.829Z] Tests run: 7, Failures: 0, Errors: 0, Skipped: 0, Time elapsed: 4.855 s - in org.eclipse.egit.ui.internal.synchronize.model.GitModelCommitTest
15:12:54 [2020-08-22T19:12:54.830Z] shouldReturnNotEqualForDifferentCommits(org.eclipse.egit.ui.internal.synchronize.model.GitModelCommitTest)  Time elapsed: 0.569 s
15:12:54 [2020-08-22T19:12:54.830Z] shouldReturnNotEqualWhenCommitTreeAndBlob(org.eclipse.egit.ui.internal.synchronize.model.GitModelCommitTest)  Time elapsed: 0.587 s
15:12:54 [2020-08-22T19:12:54.830Z] shouldReturnNotEqualWhenCommitTreeAndTree(org.eclipse.egit.ui.internal.synchronize.model.GitModelCommitTest)  Time elapsed: 0.587 s
15:12:54 [2020-08-22T19:12:54.830Z] shouldReturnNotEqualWhenCommitTreeAndCache(org.eclipse.egit.ui.internal.synchronize.model.GitModelCommitTest)  Time elapsed: 0.62 s
15:12:54 [2020-08-22T19:12:54.830Z] shouldReturnEqualForSameInstance(org.eclipse.egit.ui.internal.synchronize.model.GitModelCommitTest)  Time elapsed: 0.595 s
15:12:54 [2020-08-22T19:12:54.830Z] shouldReturnNotEqualForDifferentParents(org.eclipse.egit.ui.internal.synchronize.model.GitModelCommitTest)  Time elapsed: 1.283 s
15:12:54 [2020-08-22T19:12:54.830Z] shouldReturnEqualForSameCommits(org.eclipse.egit.ui.internal.synchronize.model.GitModelCommitTest)  Time elapsed: 0.599 s
15:12:54 [2020-08-22T19:12:54.830Z] Running org.eclipse.egit.ui.internal.synchronize.model.GitModelRepositoryTest
15:12:56 [2020-08-22T19:12:56.724Z] Tests run: 3, Failures: 0, Errors: 0, Skipped: 0, Time elapsed: 2.262 s - in org.eclipse.egit.ui.internal.synchronize.model.GitModelRepositoryTest
15:12:56 [2020-08-22T19:12:56.724Z] shouldReturnEqual(org.eclipse.egit.ui.internal.synchronize.model.GitModelRepositoryTest)  Time elapsed: 0.777 s
15:12:56 [2020-08-22T19:12:56.724Z] shouldReturnNotEqual(org.eclipse.egit.ui.internal.synchronize.model.GitModelRepositoryTest)  Time elapsed: 0.762 s
15:12:56 [2020-08-22T19:12:56.724Z] shouldReturnEqualForSameInstance(org.eclipse.egit.ui.internal.synchronize.model.GitModelRepositoryTest)  Time elapsed: 0.714 s
15:12:56 [2020-08-22T19:12:56.724Z] Running org.eclipse.egit.ui.internal.synchronize.model.GitModelCacheTest
15:13:00 [2020-08-22T19:13:00.902Z] Tests run: 6, Failures: 0, Errors: 0, Skipped: 0, Time elapsed: 4.388 s - in org.eclipse.egit.ui.internal.synchronize.model.GitModelCacheTest
15:13:00 [2020-08-22T19:13:00.902Z] shouldReturnChildren(org.eclipse.egit.ui.internal.synchronize.model.GitModelCacheTest)  Time elapsed: 0.582 s
15:13:00 [2020-08-22T19:13:00.902Z] shouldReturnNotEqualWhenCacheTreeAndCommit(org.eclipse.egit.ui.internal.synchronize.model.GitModelCacheTest)  Time elapsed: 0.597 s
15:13:00 [2020-08-22T19:13:00.902Z] shouldReturnEqualForSameInstance(org.eclipse.egit.ui.internal.synchronize.model.GitModelCacheTest)  Time elapsed: 0.595 s
15:13:00 [2020-08-22T19:13:00.902Z] shouldReturnEqualForSameCommits(org.eclipse.egit.ui.internal.synchronize.model.GitModelCacheTest)  Time elapsed: 0.664 s
15:13:00 [2020-08-22T19:13:00.902Z] shouldReturnNotEqualWhenComparingCacheAndWorkingTree(org.eclipse.egit.ui.internal.synchronize.model.GitModelCacheTest)  Time elapsed: 0.637 s
15:13:00 [2020-08-22T19:13:00.902Z] shouldReturnNotEqualForDifferentRepositories(org.eclipse.egit.ui.internal.synchronize.model.GitModelCacheTest)  Time elapsed: 1.299 s
15:13:00 [2020-08-22T19:13:00.902Z] Running org.eclipse.egit.ui.internal.synchronize.model.GitModelTreeTest
15:13:06 [2020-08-22T19:13:06.159Z] Tests run: 6, Failures: 0, Errors: 0, Skipped: 0, Time elapsed: 4.256 s - in org.eclipse.egit.ui.internal.synchronize.model.GitModelTreeTest
15:13:06 [2020-08-22T19:13:06.159Z] shouldReturnNotEqualForDifferentLocation(org.eclipse.egit.ui.internal.synchronize.model.GitModelTreeTest)  Time elapsed: 0.655 s
15:13:06 [2020-08-22T19:13:06.159Z] shouldReturnNotEqualForTreeAndCacheTree(org.eclipse.egit.ui.internal.synchronize.model.GitModelTreeTest)  Time elapsed: 0.585 s
15:13:06 [2020-08-22T19:13:06.159Z] shouldReturnNotEqualForTreeAndCommit(org.eclipse.egit.ui.internal.synchronize.model.GitModelTreeTest)  Time elapsed: 0.586 s
15:13:06 [2020-08-22T19:13:06.159Z] shouldReturnEqualForSameBaseCommit(org.eclipse.egit.ui.internal.synchronize.model.GitModelTreeTest)  Time elapsed: 1.029 s
15:13:06 [2020-08-22T19:13:06.159Z] shouldReturnEqualForSameInstance(org.eclipse.egit.ui.internal.synchronize.model.GitModelTreeTest)  Time elapsed: 0.785 s
15:13:06 [2020-08-22T19:13:06.159Z] shouldReturnNotEqualForTreeAndBlob(org.eclipse.egit.ui.internal.synchronize.model.GitModelTreeTest)  Time elapsed: 0.601 s
15:13:06 [2020-08-22T19:13:06.159Z] Running org.eclipse.egit.ui.internal.synchronize.mapping.GitChangeSetSorterTest
15:13:06 [2020-08-22T19:13:06.159Z] Tests run: 23, Failures: 0, Errors: 0, Skipped: 0, Time elapsed: 0.191 s - in org.eclipse.egit.ui.internal.synchronize.mapping.GitChangeSetSorterTest
15:13:06 [2020-08-22T19:13:06.159Z] commitTreeShouldBeLessThanBlob(org.eclipse.egit.ui.internal.synchronize.mapping.GitChangeSetSorterTest)  Time elapsed: 0.026 s
15:13:06 [2020-08-22T19:13:06.159Z] commitTreeShouldBeLessThanTree(org.eclipse.egit.ui.internal.synchronize.mapping.GitChangeSetSorterTest)  Time elapsed: 0 s
15:13:06 [2020-08-22T19:13:06.159Z] blobShouldBeGreaterThanTree(org.eclipse.egit.ui.internal.synchronize.mapping.GitChangeSetSorterTest)  Time elapsed: 0 s
15:13:06 [2020-08-22T19:13:06.159Z] cacheTreeShouldBeLessThanCommit(org.eclipse.egit.ui.internal.synchronize.mapping.GitChangeSetSorterTest)  Time elapsed: 0 s
15:13:06 [2020-08-22T19:13:06.159Z] shouldOrderTreesAlphabetically(org.eclipse.egit.ui.internal.synchronize.mapping.GitChangeSetSorterTest)  Time elapsed: 0.14 s
15:13:06 [2020-08-22T19:13:06.159Z] commitTreeShouldBeGreaterThanCache(org.eclipse.egit.ui.internal.synchronize.mapping.GitChangeSetSorterTest)  Time elapsed: 0 s
15:13:06 [2020-08-22T19:13:06.159Z] blobShouldBeGreaterThanWorkingTree(org.eclipse.egit.ui.internal.synchronize.mapping.GitChangeSetSorterTest)  Time elapsed: 0 s
15:13:06 [2020-08-22T19:13:06.159Z] treeShouldBeGreaterThanCache(org.eclipse.egit.ui.internal.synchronize.mapping.GitChangeSetSorterTest)  Time elapsed: 0 s
15:13:06 [2020-08-22T19:13:06.159Z] treeShouldBeGreaterThanCommit(org.eclipse.egit.ui.internal.synchronize.mapping.GitChangeSetSorterTest)  Time elapsed: 0 s
15:13:06 [2020-08-22T19:13:06.159Z] workingTreeShouldBeLessThanCacheTree(org.eclipse.egit.ui.internal.synchronize.mapping.GitChangeSetSorterTest)  Time elapsed: 0 s
15:13:06 [2020-08-22T19:13:06.159Z] treeShouldBeGreaterThanWorkingTree(org.eclipse.egit.ui.internal.synchronize.mapping.GitChangeSetSorterTest)  Time elapsed: 0 s
15:13:06 [2020-08-22T19:13:06.159Z] blobShouldBeGreaterThanCache(org.eclipse.egit.ui.internal.synchronize.mapping.GitChangeSetSorterTest)  Time elapsed: 0 s
15:13:06 [2020-08-22T19:13:06.159Z] cacheTreeShouldBeLessThanBlob(org.eclipse.egit.ui.internal.synchronize.mapping.GitChangeSetSorterTest)  Time elapsed: 0 s
15:13:06 [2020-08-22T19:13:06.159Z] cacheTreeShouldBeLessThanTree(org.eclipse.egit.ui.internal.synchronize.mapping.GitChangeSetSorterTest)  Time elapsed: 0 s
15:13:06 [2020-08-22T19:13:06.159Z] shouldOrderBlobsAlphabetically(org.eclipse.egit.ui.internal.synchronize.mapping.GitChangeSetSorterTest)  Time elapsed: 0 s
15:13:06 [2020-08-22T19:13:06.159Z] commitTreeShouldBeGreaterThanWorkingTree(org.eclipse.egit.ui.internal.synchronize.mapping.GitChangeSetSorterTest)  Time elapsed: 0.001 s
15:13:06 [2020-08-22T19:13:06.159Z] treeShouldBeLessThanBlob(org.eclipse.egit.ui.internal.synchronize.mapping.GitChangeSetSorterTest)  Time elapsed: 0 s
15:13:06 [2020-08-22T19:13:06.159Z] cacheTreeShouldBeGreaterThanWorkingTree(org.eclipse.egit.ui.internal.synchronize.mapping.GitChangeSetSorterTest)  Time elapsed: 0 s
15:13:06 [2020-08-22T19:13:06.159Z] workingTreeShouldBeLessThanBlob(org.eclipse.egit.ui.internal.synchronize.mapping.GitChangeSetSorterTest)  Time elapsed: 0 s
15:13:06 [2020-08-22T19:13:06.159Z] workingTreeShouldBeLessThanTree(org.eclipse.egit.ui.internal.synchronize.mapping.GitChangeSetSorterTest)  Time elapsed: 0 s
15:13:06 [2020-08-22T19:13:06.159Z] shouldOrderCommitsByCommitDate(org.eclipse.egit.ui.internal.synchronize.mapping.GitChangeSetSorterTest)  Time elapsed: 0.023 s
15:13:06 [2020-08-22T19:13:06.159Z] workingTreeShouldBeLessThanCommit(org.eclipse.egit.ui.internal.synchronize.mapping.GitChangeSetSorterTest)  Time elapsed: 0 s
15:13:06 [2020-08-22T19:13:06.160Z] blobShouldBeGreaterThanCommit(org.eclipse.egit.ui.internal.synchronize.mapping.GitChangeSetSorterTest)  Time elapsed: 0 s
15:13:06 [2020-08-22T19:13:06.160Z] Running org.eclipse.egit.ui.internal.CompareUtilsTest
15:13:08 [2020-08-22T19:13:08.056Z] Tests run: 3, Failures: 0, Errors: 0, Skipped: 0, Time elapsed: 2.633 s - in org.eclipse.egit.ui.internal.CompareUtilsTest
15:13:08 [2020-08-22T19:13:08.056Z] testIndexEditWithAttributes(org.eclipse.egit.ui.internal.CompareUtilsTest)  Time elapsed: 0.957 s
15:13:08 [2020-08-22T19:13:08.056Z] testIndexEdit(org.eclipse.egit.ui.internal.CompareUtilsTest)  Time elapsed: 0.947 s
15:13:08 [2020-08-22T19:13:08.056Z] testIndexEditExecutable(org.eclipse.egit.ui.internal.CompareUtilsTest)  Time elapsed: 0.72 s
15:13:08 [2020-08-22T19:13:08.056Z] Running org.eclipse.egit.ui.internal.clone.SmartImportWizardTest
15:13:09 [2020-08-22T19:13:09.006Z] Tests run: 1, Failures: 0, Errors: 0, Skipped: 0, Time elapsed: 0.965 s - in org.eclipse.egit.ui.internal.clone.SmartImportWizardTest
15:13:09 [2020-08-22T19:13:09.006Z] test(org.eclipse.egit.ui.internal.clone.SmartImportWizardTest)  Time elapsed: 0.963 s
15:13:09 [2020-08-22T19:13:09.006Z] Running org.eclipse.egit.ui.internal.push.PushBranchWizardTest
15:13:09 [2020-08-22T19:13:09.937Z] 
15:13:09 [2020-08-22T19:13:09.937Z] (SWT:1623): Gtk-CRITICAL **: 19:13:09.665: gtk_box_gadget_distribute: assertion 'size >= 0' failed in GtkScrollbar
15:13:09 [2020-08-22T19:13:09.937Z] 
15:13:09 [2020-08-22T19:13:09.937Z] (SWT:1623): Gtk-CRITICAL **: 19:13:09.665: gtk_box_gadget_distribute: assertion 'size >= 0' failed in GtkScrollbar
15:13:09 [2020-08-22T19:13:09.937Z] 
15:13:09 [2020-08-22T19:13:09.937Z] (SWT:1623): Gtk-CRITICAL **: 19:13:09.668: gtk_box_gadget_distribute: assertion 'size >= 0' failed in GtkScrollbar
15:13:09 [2020-08-22T19:13:09.937Z] 
15:13:09 [2020-08-22T19:13:09.937Z] (SWT:1623): Gtk-CRITICAL **: 19:13:09.672: gtk_box_gadget_distribute: assertion 'size >= 0' failed in GtkScrollbar
15:13:16 [2020-08-22T19:13:16.493Z] 
15:13:16 [2020-08-22T19:13:16.493Z] (SWT:1623): Gtk-WARNING **: 19:13:16.431: Negative content width -1 (allocation 1, extents 1x1) while allocating gadget (node trough, owner GtkProgressBar)
15:13:16 [2020-08-22T19:13:16.493Z] 
15:13:16 [2020-08-22T19:13:16.493Z] (SWT:1623): Gtk-WARNING **: 19:13:16.434: Negative content width -1 (allocation 1, extents 1x1) while allocating gadget (node trough, owner GtkProgressBar)
15:13:16 [2020-08-22T19:13:16.493Z] 
15:13:16 [2020-08-22T19:13:16.493Z] (SWT:1623): Gtk-WARNING **: 19:13:16.450: Negative content width -1 (allocation 1, extents 1x1) while allocating gadget (node trough, owner GtkProgressBar)
15:13:19 [2020-08-22T19:13:19.049Z] Tests run: 9, Failures: 0, Errors: 0, Skipped: 0, Time elapsed: 9.941 s - in org.eclipse.egit.ui.internal.push.PushBranchWizardTest
15:13:19 [2020-08-22T19:13:19.050Z] pushHeadToExistingRemote(org.eclipse.egit.ui.internal.push.PushBranchWizardTest)  Time elapsed: 1.016 s
15:13:19 [2020-08-22T19:13:19.050Z] pushWithRemoteUpstreamConfiguration(org.eclipse.egit.ui.internal.push.PushBranchWizardTest)  Time elapsed: 1.019 s
15:13:19 [2020-08-22T19:13:19.050Z] pushWithDifferentBranchName(org.eclipse.egit.ui.internal.push.PushBranchWizardTest)  Time elapsed: 0.987 s
15:13:19 [2020-08-22T19:13:19.050Z] pushToExistingRemoteAndSetRebase(org.eclipse.egit.ui.internal.push.PushBranchWizardTest)  Time elapsed: 1.235 s
15:13:19 [2020-08-22T19:13:19.050Z] pushToNewRemote(org.eclipse.egit.ui.internal.push.PushBranchWizardTest)  Time elapsed: 1.188 s
15:13:19 [2020-08-22T19:13:19.050Z] pushToExistingRemoteWithoutConfiguringUpstream(org.eclipse.egit.ui.internal.push.PushBranchWizardTest)  Time elapsed: 1.075 s
15:13:19 [2020-08-22T19:13:19.050Z] pushToExistingRemote(org.eclipse.egit.ui.internal.push.PushBranchWizardTest)  Time elapsed: 1.203 s
15:13:19 [2020-08-22T19:13:19.050Z] pushWhenNoRemoteExistsYet(org.eclipse.egit.ui.internal.push.PushBranchWizardTest)  Time elapsed: 1.121 s
15:13:19 [2020-08-22T19:13:19.050Z] pushWithLocalUpstreamConfiguration(org.eclipse.egit.ui.internal.push.PushBranchWizardTest)  Time elapsed: 1.074 s
15:13:19 [2020-08-22T19:13:19.050Z] Running org.eclipse.egit.ui.internal.push.PushTagsWizardTest
15:13:20 [2020-08-22T19:13:20.442Z] Tests run: 1, Failures: 0, Errors: 0, Skipped: 0, Time elapsed: 1.422 s - in org.eclipse.egit.ui.internal.push.PushTagsWizardTest
15:13:20 [2020-08-22T19:13:20.442Z] pushTag(org.eclipse.egit.ui.internal.push.PushTagsWizardTest)  Time elapsed: 1.418 s
15:13:20 [2020-08-22T19:13:20.442Z] Running org.eclipse.egit.ui.internal.push.PushToUpstreamTest
15:13:23 [2020-08-22T19:13:23.718Z] Tests run: 3, Failures: 0, Errors: 0, Skipped: 0, Time elapsed: 3.073 s - in org.eclipse.egit.ui.internal.push.PushToUpstreamTest
15:13:23 [2020-08-22T19:13:23.718Z] pushWithExistingUpstreamConfiguration(org.eclipse.egit.ui.internal.push.PushToUpstreamTest)  Time elapsed: 1.378 s
15:13:23 [2020-08-22T19:13:23.718Z] pushWithoutConfig(org.eclipse.egit.ui.internal.push.PushToUpstreamTest)  Time elapsed: 0.783 s
15:13:23 [2020-08-22T19:13:23.718Z] pushWithDefaultRemoteWithPushRefSpecs(org.eclipse.egit.ui.internal.push.PushToUpstreamTest)  Time elapsed: 0.903 s
15:13:23 [2020-08-22T19:13:23.718Z] Running org.eclipse.egit.ui.internal.branch.BranchProjectTrackerTest
15:13:24 [2020-08-22T19:13:24.649Z] Tests run: 1, Failures: 0, Errors: 0, Skipped: 0, Time elapsed: 1.171 s - in org.eclipse.egit.ui.internal.branch.BranchProjectTrackerTest
15:13:24 [2020-08-22T19:13:24.649Z] twoProjectsWithOnlyOneOnBranch(org.eclipse.egit.ui.internal.branch.BranchProjectTrackerTest)  Time elapsed: 1.168 s
15:13:24 [2020-08-22T19:13:24.649Z] Running org.eclipse.egit.ui.internal.decorators.DecoratableResourceAdapterTest
15:13:39 [2020-08-22T19:13:39.508Z] Tests run: 13, Failures: 0, Errors: 0, Skipped: 0, Time elapsed: 12.756 s - in org.eclipse.egit.ui.internal.decorators.DecoratableResourceAdapterTest
15:13:39 [2020-08-22T19:13:39.508Z] testDecorationDeletedFile(org.eclipse.egit.ui.internal.decorators.DecoratableResourceAdapterTest)  Time elapsed: 0.883 s
15:13:39 [2020-08-22T19:13:39.508Z] testDecorationModifiedFile(org.eclipse.egit.ui.internal.decorators.DecoratableResourceAdapterTest)  Time elapsed: 0.999 s
15:13:39 [2020-08-22T19:13:39.508Z] testDecorationEmptyProject(org.eclipse.egit.ui.internal.decorators.DecoratableResourceAdapterTest)  Time elapsed: 0.769 s
15:13:39 [2020-08-22T19:13:39.508Z] testDecorationConflictingFile(org.eclipse.egit.ui.internal.decorators.DecoratableResourceAdapterTest)  Time elapsed: 1.193 s
15:13:39 [2020-08-22T19:13:39.508Z] testDecorationNewEmptyFolder(org.eclipse.egit.ui.internal.decorators.DecoratableResourceAdapterTest)  Time elapsed: 1.012 s
15:13:39 [2020-08-22T19:13:39.508Z] testDecorationFolderPrefixOfOtherFolder(org.eclipse.egit.ui.internal.decorators.DecoratableResourceAdapterTest)  Time elapsed: 1.192 s
15:13:39 [2020-08-22T19:13:39.508Z] testDecorationNewFileInOneSubfolder(org.eclipse.egit.ui.internal.decorators.DecoratableResourceAdapterTest)  Time elapsed: 1.291 s
15:13:39 [2020-08-22T19:13:39.508Z] testDecorationNewFile(org.eclipse.egit.ui.internal.decorators.DecoratableResourceAdapterTest)  Time elapsed: 0.885 s
15:13:39 [2020-08-22T19:13:39.508Z] testDecorationNewFileInSubfolder(org.eclipse.egit.ui.internal.decorators.DecoratableResourceAdapterTest)  Time elapsed: 1.198 s
15:13:39 [2020-08-22T19:13:39.508Z] testDecorationCommittedFile(org.eclipse.egit.ui.internal.decorators.DecoratableResourceAdapterTest)  Time elapsed: 0.804 s
15:13:39 [2020-08-22T19:13:39.508Z] testDecorationFileInIgnoredFolder(org.eclipse.egit.ui.internal.decorators.DecoratableResourceAdapterTest)  Time elapsed: 0.797 s
15:13:39 [2020-08-22T19:13:39.508Z] testDecorationIgnoredFile(org.eclipse.egit.ui.internal.decorators.DecoratableResourceAdapterTest)  Time elapsed: 0.894 s
15:13:39 [2020-08-22T19:13:39.508Z] testDecorationAddedFile(org.eclipse.egit.ui.internal.decorators.DecoratableResourceAdapterTest)  Time elapsed: 0.813 s
15:13:39 [2020-08-22T19:13:39.508Z] Running org.eclipse.egit.ui.internal.decorators.DecoratableWorkingSetTest
15:13:46 [2020-08-22T19:13:46.059Z] Tests run: 7, Failures: 0, Errors: 0, Skipped: 0, Time elapsed: 7.598 s - in org.eclipse.egit.ui.internal.decorators.DecoratableWorkingSetTest
15:13:46 [2020-08-22T19:13:46.059Z] testAnyConflictsIsConflicts(org.eclipse.egit.ui.internal.decorators.DecoratableWorkingSetTest)  Time elapsed: 1.014 s
15:13:46 [2020-08-22T19:13:46.059Z] testUntrackedContentIsUndecorated(org.eclipse.egit.ui.internal.decorators.DecoratableWorkingSetTest)  Time elapsed: 0.793 s
15:13:46 [2020-08-22T19:13:46.059Z] testAnyDirtyIsDirty(org.eclipse.egit.ui.internal.decorators.DecoratableWorkingSetTest)  Time elapsed: 0.886 s
15:13:46 [2020-08-22T19:13:46.059Z] testDecorationConflictingOverDirty(org.eclipse.egit.ui.internal.decorators.DecoratableWorkingSetTest)  Time elapsed: 1.263 s
15:13:46 [2020-08-22T19:13:46.059Z] testEmptyWorkingSetIsUndecorated(org.eclipse.egit.ui.internal.decorators.DecoratableWorkingSetTest)  Time elapsed: 1.089 s
15:13:46 [2020-08-22T19:13:46.059Z] testStagingStateHasNoInfluence_Modified(org.eclipse.egit.ui.internal.decorators.DecoratableWorkingSetTest)  Time elapsed: 1.383 s
15:13:46 [2020-08-22T19:13:46.059Z] testAnyTrackedIsTracked(org.eclipse.egit.ui.internal.decorators.DecoratableWorkingSetTest)  Time elapsed: 1.164 s
15:13:46 [2020-08-22T19:13:46.059Z] Running org.eclipse.egit.ui.internal.decorators.DecoratableResourceMappingTest
15:13:52 [2020-08-22T19:13:52.608Z] 
15:13:52 [2020-08-22T19:13:52.608Z] (SWT:1623): Gtk-WARNING **: 19:13:51.351: Negative content width -1 (allocation 1, extents 1x1) while allocating gadget (node trough, owner GtkProgressBar)
15:13:53 [2020-08-22T19:13:53.541Z] Tests run: 9, Failures: 0, Errors: 0, Skipped: 0, Time elapsed: 8.532 s - in org.eclipse.egit.ui.internal.decorators.DecoratableResourceMappingTest
15:13:53 [2020-08-22T19:13:53.541Z] testAnyConflictsIsConflicts(org.eclipse.egit.ui.internal.decorators.DecoratableResourceMappingTest)  Time elapsed: 1.64 s
15:13:53 [2020-08-22T19:13:53.541Z] testSameStagingStateIsState_Added(org.eclipse.egit.ui.internal.decorators.DecoratableResourceMappingTest)  Time elapsed: 0.81 s
15:13:53 [2020-08-22T19:13:53.541Z] testAnyDirtyIsDirty(org.eclipse.egit.ui.internal.decorators.DecoratableResourceMappingTest)  Time elapsed: 0.801 s
15:13:53 [2020-08-22T19:13:53.541Z] testMixedStagingStateIsModified_RemovedAdded(org.eclipse.egit.ui.internal.decorators.DecoratableResourceMappingTest)  Time elapsed: 0.792 s
15:13:53 [2020-08-22T19:13:53.541Z] testAllIgnoredIsUnstaged(org.eclipse.egit.ui.internal.decorators.DecoratableResourceMappingTest)  Time elapsed: 0.794 s
15:13:53 [2020-08-22T19:13:53.541Z] testDecorationConflictingOverDirty(org.eclipse.egit.ui.internal.decorators.DecoratableResourceMappingTest)  Time elapsed: 0.997 s
15:13:53 [2020-08-22T19:13:53.541Z] testMixedStagingStateIsModified_AddedNotStaged(org.eclipse.egit.ui.internal.decorators.DecoratableResourceMappingTest)  Time elapsed: 1.047 s
15:13:53 [2020-08-22T19:13:53.541Z] testNewResourceMappingIsUnstaged(org.eclipse.egit.ui.internal.decorators.DecoratableResourceMappingTest)  Time elapsed: 0.806 s
15:13:53 [2020-08-22T19:13:53.541Z] testAnyTrackedIsTracked(org.eclipse.egit.ui.internal.decorators.DecoratableResourceMappingTest)  Time elapsed: 0.792 s
15:13:53 [2020-08-22T19:13:53.541Z] Running org.eclipse.egit.ui.internal.fetch.FetchGerritChangeTest
15:13:53 [2020-08-22T19:13:53.541Z] Tests run: 15, Failures: 0, Errors: 0, Skipped: 0, Time elapsed: 0.004 s - in org.eclipse.egit.ui.internal.fetch.FetchGerritChangeTest
15:13:53 [2020-08-22T19:13:53.541Z] testChangeStringNoDigits(org.eclipse.egit.ui.internal.fetch.FetchGerritChangeTest)  Time elapsed: 0.002 s
15:13:53 [2020-08-22T19:13:53.541Z] testChangeStringOverflow(org.eclipse.egit.ui.internal.fetch.FetchGerritChangeTest)  Time elapsed: 0 s
15:13:53 [2020-08-22T19:13:53.541Z] testChangeStringTwoNumbers(org.eclipse.egit.ui.internal.fetch.FetchGerritChangeTest)  Time elapsed: 0.001 s
15:13:53 [2020-08-22T19:13:53.541Z] testFromRef(org.eclipse.egit.ui.internal.fetch.FetchGerritChangeTest)  Time elapsed: 0 s
15:13:53 [2020-08-22T19:13:53.541Z] testChangeStringNegative(org.eclipse.egit.ui.internal.fetch.FetchGerritChangeTest)  Time elapsed: 0 s
15:13:53 [2020-08-22T19:13:53.541Z] testChangeStringUri(org.eclipse.egit.ui.internal.fetch.FetchGerritChangeTest)  Time elapsed: 0 s
15:13:53 [2020-08-22T19:13:53.541Z] testRefFromChange(org.eclipse.egit.ui.internal.fetch.FetchGerritChangeTest)  Time elapsed: 0 s
15:13:53 [2020-08-22T19:13:53.541Z] testChangeStringUriNonsense(org.eclipse.egit.ui.internal.fetch.FetchGerritChangeTest)  Time elapsed: 0 s
15:13:53 [2020-08-22T19:13:53.541Z] testChangeStringThreeNumbers(org.eclipse.egit.ui.internal.fetch.FetchGerritChangeTest)  Time elapsed: 0 s
15:13:53 [2020-08-22T19:13:53.541Z] testChangeStringMultiline(org.eclipse.egit.ui.internal.fetch.FetchGerritChangeTest)  Time elapsed: 0 s
15:13:53 [2020-08-22T19:13:53.541Z] testChangeStringSingleNumber(org.eclipse.egit.ui.internal.fetch.FetchGerritChangeTest)  Time elapsed: 0 s
15:13:53 [2020-08-22T19:13:53.541Z] testChangeRefs(org.eclipse.egit.ui.internal.fetch.FetchGerritChangeTest)  Time elapsed: 0 s
15:13:53 [2020-08-22T19:13:53.541Z] testChangeStringEmpty(org.eclipse.egit.ui.internal.fetch.FetchGerritChangeTest)  Time elapsed: 0 s
15:13:53 [2020-08-22T19:13:53.541Z] testChangeStringNull(org.eclipse.egit.ui.internal.fetch.FetchGerritChangeTest)  Time elapsed: 0 s
15:13:53 [2020-08-22T19:13:53.541Z] testChangeStringZero(org.eclipse.egit.ui.internal.fetch.FetchGerritChangeTest)  Time elapsed: 0 s
15:13:53 [2020-08-22T19:13:53.541Z] Running org.eclipse.egit.ui.submodule.SubmoduleUpdateTest
15:13:54 [2020-08-22T19:13:54.472Z] 
15:13:54 [2020-08-22T19:13:54.472Z] (SWT:1623): Gtk-WARNING **: 19:13:54.364: Negative content width -6 (allocation 1, extents 4x3) while allocating gadget (node toolbar, owner GtkToolbar)
15:13:57 [2020-08-22T19:13:57.749Z] 
15:13:57 [2020-08-22T19:13:57.749Z] (SWT:1623): Gtk-WARNING **: 19:13:57.226: Negative content width -6 (allocation 1, extents 4x3) while allocating gadget (node toolbar, owner GtkToolbar)
15:13:57 [2020-08-22T19:13:57.749Z] Tests run: 1, Failures: 0, Errors: 0, Skipped: 0, Time elapsed: 3.913 s - in org.eclipse.egit.ui.submodule.SubmoduleUpdateTest
15:13:57 [2020-08-22T19:13:57.749Z] updateSubmodule(org.eclipse.egit.ui.submodule.SubmoduleUpdateTest)  Time elapsed: 3.909 s
15:13:57 [2020-08-22T19:13:57.749Z] Running org.eclipse.egit.ui.submodule.SubmoduleAddTest
15:13:58 [2020-08-22T19:13:58.312Z] 
15:13:58 [2020-08-22T19:13:58.312Z] (SWT:1623): Gtk-WARNING **: 19:13:58.137: Negative content width -6 (allocation 1, extents 4x3) while allocating gadget (node toolbar, owner GtkToolbar)
15:14:01 [2020-08-22T19:14:01.596Z] 
15:14:01 [2020-08-22T19:14:01.596Z] (SWT:1623): Gtk-WARNING **: 19:14:00.910: Negative content width -6 (allocation 1, extents 4x3) while allocating gadget (node toolbar, owner GtkToolbar)
15:14:01 [2020-08-22T19:14:01.596Z] Tests run: 1, Failures: 0, Errors: 0, Skipped: 0, Time elapsed: 3.682 s - in org.eclipse.egit.ui.submodule.SubmoduleAddTest
15:14:01 [2020-08-22T19:14:01.596Z] addAtRoot(org.eclipse.egit.ui.submodule.SubmoduleAddTest)  Time elapsed: 3.678 s
15:14:01 [2020-08-22T19:14:01.596Z] Running org.eclipse.egit.ui.submodule.SubmoduleSyncTest
15:14:01 [2020-08-22T19:14:01.853Z] 
15:14:01 [2020-08-22T19:14:01.853Z] (SWT:1623): Gtk-WARNING **: 19:14:01.755: Negative content width -6 (allocation 1, extents 4x3) while allocating gadget (node toolbar, owner GtkToolbar)
15:14:05 [2020-08-22T19:14:05.131Z] 
15:14:05 [2020-08-22T19:14:05.131Z] (SWT:1623): Gtk-WARNING **: 19:14:04.603: Negative content width -6 (allocation 1, extents 4x3) while allocating gadget (node toolbar, owner GtkToolbar)
15:14:05 [2020-08-22T19:14:05.131Z] Tests run: 1, Failures: 0, Errors: 0, Skipped: 0, Time elapsed: 3.69 s - in org.eclipse.egit.ui.submodule.SubmoduleSyncTest
15:14:05 [2020-08-22T19:14:05.131Z] syncSubmodule(org.eclipse.egit.ui.submodule.SubmoduleSyncTest)  Time elapsed: 3.686 s
15:14:05 [2020-08-22T19:14:05.131Z] Running org.eclipse.egit.ui.httpauth.PushTest
15:14:05 [2020-08-22T19:14:05.131Z] 2020-08-22 19:14:04.790:INFO:oejs.Server:WorkbenchTestable: jetty-9.4.30.v20200611; built: 2020-06-16T05:54:33.713Z; git: 271836e4c1f4612f12b7bb13ef5a92a927634b0d; jvm 1.8.0_262-b10
15:14:05 [2020-08-22T19:14:05.131Z] 2020-08-22 19:14:04.791:INFO:oejsh.ContextHandler:WorkbenchTestable: Started o.e.j.s.ServletContextHandler@2a2367fb{/sbasic,null,AVAILABLE}
15:14:05 [2020-08-22T19:14:05.131Z] 2020-08-22 19:14:04.796:INFO:oejs.AbstractConnector:WorkbenchTestable: Started ServerConnector@7bb64d6b{HTTP/1.1, (http/1.1)}{127.0.0.1:41166}
15:14:05 [2020-08-22T19:14:05.131Z] 2020-08-22 19:14:04.796:INFO:oejs.Server:WorkbenchTestable: Started @755316ms
15:14:05 [2020-08-22T19:14:05.390Z] 
15:14:05 [2020-08-22T19:14:05.390Z] (SWT:1623): Gtk-CRITICAL **: 19:14:05.205: gtk_box_gadget_distribute: assertion 'size >= 0' failed in GtkCheckButton
15:14:05 [2020-08-22T19:14:05.647Z] 
15:14:05 [2020-08-22T19:14:05.647Z] (SWT:1623): Gtk-WARNING **: 19:14:05.529: Negative content width -1 (allocation 1, extents 1x1) while allocating gadget (node trough, owner GtkProgressBar)
15:14:05 [2020-08-22T19:14:05.647Z] 
15:14:05 [2020-08-22T19:14:05.647Z] (SWT:1623): Gtk-WARNING **: 19:14:05.532: Negative content width -1 (allocation 1, extents 1x1) while allocating gadget (node trough, owner GtkProgressBar)
15:14:05 [2020-08-22T19:14:05.647Z] 
15:14:05 [2020-08-22T19:14:05.647Z] (SWT:1623): Gtk-WARNING **: 19:14:05.543: Negative content width -1 (allocation 1, extents 1x1) while allocating gadget (node trough, owner GtkProgressBar)
15:14:05 [2020-08-22T19:14:05.647Z] 
15:14:05 [2020-08-22T19:14:05.647Z] (SWT:1623): Gtk-WARNING **: 19:14:05.548: Negative content width -1 (allocation 1, extents 1x1) while allocating gadget (node trough, owner GtkProgressBar)
15:14:05 [2020-08-22T19:14:05.647Z] 
15:14:05 [2020-08-22T19:14:05.647Z] (SWT:1623): Gtk-WARNING **: 19:14:05.560: Negative content width -1 (allocation 1, extents 1x1) while allocating gadget (node trough, owner GtkProgressBar)
15:14:05 [2020-08-22T19:14:05.647Z] 
15:14:05 [2020-08-22T19:14:05.647Z] (SWT:1623): Gtk-WARNING **: 19:14:05.564: Negative content width -1 (allocation 1, extents 1x1) while allocating gadget (node trough, owner GtkProgressBar)
15:14:06 [2020-08-22T19:14:06.212Z] 2020-08-22 19:14:06.113:INFO:oejs.AbstractConnector:WorkbenchTestable: Stopped ServerConnector@7bb64d6b{HTTP/1.1, (http/1.1)}{127.0.0.1:0}
15:14:06 [2020-08-22T19:14:06.212Z] 2020-08-22 19:14:06.113:INFO:oejsh.ContextHandler:WorkbenchTestable: Stopped o.e.j.s.ServletContextHandler@2a2367fb{/sbasic,null,UNAVAILABLE}
15:14:06 [2020-08-22T19:14:06.212Z] Tests run: 1, Failures: 0, Errors: 0, Skipped: 0, Time elapsed: 1.404 s - in org.eclipse.egit.ui.httpauth.PushTest
15:14:06 [2020-08-22T19:14:06.212Z] testPush(org.eclipse.egit.ui.httpauth.PushTest)  Time elapsed: 1.403 s
15:14:06 [2020-08-22T19:14:06.212Z] Running org.eclipse.egit.ui.search.CommitSearchDialogTest
15:14:07 [2020-08-22T19:14:07.142Z] 
15:14:07 [2020-08-22T19:14:07.142Z] (SWT:1623): Gtk-WARNING **: 19:14:06.787: Negative content width -6 (allocation 1, extents 4x3) while allocating gadget (node toolbar, owner GtkToolbar)
15:14:07 [2020-08-22T19:14:07.142Z] 
15:14:07 [2020-08-22T19:14:07.142Z] (SWT:1623): Gtk-WARNING **: 19:14:06.799: Negative content width -6 (allocation 1, extents 4x3) while allocating gadget (node toolbar, owner GtkToolbar)
15:14:07 [2020-08-22T19:14:07.142Z] 
15:14:07 [2020-08-22T19:14:07.142Z] (SWT:1623): Gtk-WARNING **: 19:14:06.850: Negative content width -6 (allocation 1, extents 4x3) while allocating gadget (node toolbar, owner GtkToolbar)
15:14:07 [2020-08-22T19:14:07.142Z] 
15:14:07 [2020-08-22T19:14:07.142Z] (SWT:1623): Gtk-WARNING **: 19:14:06.899: Negative content width -6 (allocation 1, extents 4x3) while allocating gadget (node toolbar, owner GtkToolbar)
15:14:07 [2020-08-22T19:14:07.706Z] 
15:14:07 [2020-08-22T19:14:07.706Z] (SWT:1623): Gtk-WARNING **: 19:14:07.538: Negative content width -6 (allocation 1, extents 4x3) while allocating gadget (node toolbar, owner GtkToolbar)
15:14:07 [2020-08-22T19:14:07.706Z] Tests run: 1, Failures: 0, Errors: 0, Skipped: 0, Time elapsed: 1.535 s - in org.eclipse.egit.ui.search.CommitSearchDialogTest
15:14:07 [2020-08-22T19:14:07.706Z] openCommitTabOnSearchDialog(org.eclipse.egit.ui.search.CommitSearchDialogTest)  Time elapsed: 1.532 s
15:14:07 [2020-08-22T19:14:07.706Z] Running org.eclipse.egit.ui.search.CommitSearchQueryTest
15:14:12 [2020-08-22T19:14:12.963Z] Tests run: 7, Failures: 0, Errors: 0, Skipped: 0, Time elapsed: 4.464 s - in org.eclipse.egit.ui.search.CommitSearchQueryTest
15:14:12 [2020-08-22T19:14:12.963Z] testQuery(org.eclipse.egit.ui.search.CommitSearchQueryTest)  Time elapsed: 0.663 s
15:14:12 [2020-08-22T19:14:12.963Z] testMatchMessage(org.eclipse.egit.ui.search.CommitSearchQueryTest)  Time elapsed: 0.789 s
15:14:12 [2020-08-22T19:14:12.963Z] testCaseInsensitive(org.eclipse.egit.ui.search.CommitSearchQueryTest)  Time elapsed: 0.584 s
15:14:12 [2020-08-22T19:14:12.963Z] testMatchCommit(org.eclipse.egit.ui.search.CommitSearchQueryTest)  Time elapsed: 0.599 s
15:14:12 [2020-08-22T19:14:12.963Z] testMatchParent(org.eclipse.egit.ui.search.CommitSearchQueryTest)  Time elapsed: 0.6 s
15:14:12 [2020-08-22T19:14:12.963Z] testMatchTree(org.eclipse.egit.ui.search.CommitSearchQueryTest)  Time elapsed: 0.617 s
15:14:12 [2020-08-22T19:14:12.963Z] testEmptyMatches(org.eclipse.egit.ui.search.CommitSearchQueryTest)  Time elapsed: 0.598 s
15:14:12 [2020-08-22T19:14:12.963Z] Running org.eclipse.egit.ui.gitflow.CommandEnablementTest
15:14:13 [2020-08-22T19:14:13.528Z] 
15:14:13 [2020-08-22T19:14:13.528Z] (SWT:1623): Gtk-WARNING **: 19:14:13.338: Negative content width -6 (allocation 1, extents 4x3) while allocating gadget (node toolbar, owner GtkToolbar)
15:14:13 [2020-08-22T19:14:13.528Z] 
15:14:13 [2020-08-22T19:14:13.528Z] (SWT:1623): Gtk-WARNING **: 19:14:13.492: Negative content width -6 (allocation 1, extents 4x3) while allocating gadget (node toolbar, owner GtkToolbar)
15:14:13 [2020-08-22T19:14:13.784Z] Tests run: 2, Failures: 0, Errors: 0, Skipped: 0, Time elapsed: 1.479 s - in org.eclipse.egit.ui.gitflow.CommandEnablementTest
15:14:13 [2020-08-22T19:14:13.784Z] testPackageExplorerStartFinishEnablement(org.eclipse.egit.ui.gitflow.CommandEnablementTest)  Time elapsed: 0.7 s
15:14:13 [2020-08-22T19:14:13.784Z] testRepositoryViewStartFinishEnablement(org.eclipse.egit.ui.gitflow.CommandEnablementTest)  Time elapsed: 0.774 s
15:14:13 [2020-08-22T19:14:13.784Z] Running org.eclipse.egit.ui.gitflow.FeatureFinishSquashHandlerTest
15:14:14 [2020-08-22T19:14:14.348Z] 
15:14:14 [2020-08-22T19:14:14.348Z] (SWT:1623): Gtk-CRITICAL **: 19:14:14.332: gtk_box_gadget_distribute: assertion 'size >= 0' failed in GtkScrollbar
15:14:14 [2020-08-22T19:14:14.606Z] 
15:14:14 [2020-08-22T19:14:14.606Z] (SWT:1623): Gtk-CRITICAL **: 19:14:14.351: gtk_box_gadget_distribute: assertion 'size >= 0' failed in GtkScrollbar
15:14:14 [2020-08-22T19:14:14.606Z] 
15:14:14 [2020-08-22T19:14:14.606Z] (SWT:1623): Gtk-CRITICAL **: 19:14:14.367: gtk_box_gadget_distribute: assertion 'size >= 0' failed in GtkScrollbar
15:14:14 [2020-08-22T19:14:14.606Z] 
15:14:14 [2020-08-22T19:14:14.606Z] (SWT:1623): Gtk-CRITICAL **: 19:14:14.384: gtk_box_gadget_distribute: assertion 'size >= 0' failed in GtkScrollbar
15:14:14 [2020-08-22T19:14:14.606Z] 
15:14:14 [2020-08-22T19:14:14.607Z] (SWT:1623): Gtk-CRITICAL **: 19:14:14.400: gtk_box_gadget_distribute: assertion 'size >= 0' failed in GtkScrollbar
15:14:14 [2020-08-22T19:14:14.607Z] 
15:14:14 [2020-08-22T19:14:14.607Z] (SWT:1623): Gtk-CRITICAL **: 19:14:14.417: gtk_box_gadget_distribute: assertion 'size >= 0' failed in GtkScrollbar
15:14:14 [2020-08-22T19:14:14.607Z] 
15:14:14 [2020-08-22T19:14:14.607Z] (SWT:1623): Gtk-CRITICAL **: 19:14:14.434: gtk_box_gadget_distribute: assertion 'size >= 0' failed in GtkScrollbar
15:14:14 [2020-08-22T19:14:14.607Z] 
15:14:14 [2020-08-22T19:14:14.607Z] (SWT:1623): Gtk-CRITICAL **: 19:14:14.450: gtk_box_gadget_distribute: assertion 'size >= 0' failed in GtkScrollbar
15:14:14 [2020-08-22T19:14:14.607Z] 
15:14:14 [2020-08-22T19:14:14.607Z] (SWT:1623): Gtk-CRITICAL **: 19:14:14.467: gtk_box_gadget_distribute: assertion 'size >= 0' failed in GtkScrollbar
15:14:14 [2020-08-22T19:14:14.607Z] 
15:14:14 [2020-08-22T19:14:14.607Z] (SWT:1623): Gtk-CRITICAL **: 19:14:14.484: gtk_box_gadget_distribute: assertion 'size >= 0' failed in GtkScrollbar
15:14:14 [2020-08-22T19:14:14.607Z] 
15:14:14 [2020-08-22T19:14:14.607Z] (SWT:1623): Gtk-CRITICAL **: 19:14:14.500: gtk_box_gadget_distribute: assertion 'size >= 0' failed in GtkScrollbar
15:14:14 [2020-08-22T19:14:14.607Z] 
15:14:14 [2020-08-22T19:14:14.607Z] (SWT:1623): Gtk-CRITICAL **: 19:14:14.517: gtk_box_gadget_distribute: assertion 'size >= 0' failed in GtkScrollbar
15:14:14 [2020-08-22T19:14:14.607Z] 
15:14:14 [2020-08-22T19:14:14.607Z] (SWT:1623): Gtk-CRITICAL **: 19:14:14.534: gtk_box_gadget_distribute: assertion 'size >= 0' failed in GtkScrollbar
15:14:14 [2020-08-22T19:14:14.607Z] 
15:14:14 [2020-08-22T19:14:14.607Z] (SWT:1623): Gtk-CRITICAL **: 19:14:14.553: gtk_box_gadget_distribute: assertion 'size >= 0' failed in GtkScrollbar
15:14:15 [2020-08-22T19:14:15.172Z] 
15:14:15 [2020-08-22T19:14:15.172Z] (SWT:1623): Gtk-CRITICAL **: 19:14:15.042: gtk_box_gadget_distribute: assertion 'size >= 0' failed in GtkScrollbar
15:14:16 [2020-08-22T19:14:16.172Z] Tests run: 1, Failures: 0, Errors: 0, Skipped: 0, Time elapsed: 2.2 s - in org.eclipse.egit.ui.gitflow.FeatureFinishSquashHandlerTest
15:14:16 [2020-08-22T19:14:16.172Z] testFeatureFinishSquash(org.eclipse.egit.ui.gitflow.FeatureFinishSquashHandlerTest)  Time elapsed: 2.196 s
15:14:16 [2020-08-22T19:14:16.172Z] Running org.eclipse.egit.ui.gitflow.FeatureStartFinishHandlerTest
15:14:16 [2020-08-22T19:14:16.736Z] 
15:14:16 [2020-08-22T19:14:16.736Z] (SWT:1623): Gtk-CRITICAL **: 19:14:16.474: gtk_box_gadget_distribute: assertion 'size >= 0' failed in GtkScrollbar
15:14:16 [2020-08-22T19:14:16.736Z] 
15:14:16 [2020-08-22T19:14:16.736Z] (SWT:1623): Gtk-CRITICAL **: 19:14:16.488: gtk_box_gadget_distribute: assertion 'size >= 0' failed in GtkScrollbar
15:14:16 [2020-08-22T19:14:16.736Z] 
15:14:16 [2020-08-22T19:14:16.736Z] (SWT:1623): Gtk-CRITICAL **: 19:14:16.504: gtk_box_gadget_distribute: assertion 'size >= 0' failed in GtkScrollbar
15:14:16 [2020-08-22T19:14:16.736Z] 
15:14:16 [2020-08-22T19:14:16.736Z] (SWT:1623): Gtk-CRITICAL **: 19:14:16.520: gtk_box_gadget_distribute: assertion 'size >= 0' failed in GtkScrollbar
15:14:16 [2020-08-22T19:14:16.736Z] 
15:14:16 [2020-08-22T19:14:16.737Z] (SWT:1623): Gtk-CRITICAL **: 19:14:16.537: gtk_box_gadget_distribute: assertion 'size >= 0' failed in GtkScrollbar
15:14:16 [2020-08-22T19:14:16.737Z] 
15:14:16 [2020-08-22T19:14:16.737Z] (SWT:1623): Gtk-CRITICAL **: 19:14:16.554: gtk_box_gadget_distribute: assertion 'size >= 0' failed in GtkScrollbar
15:14:16 [2020-08-22T19:14:16.737Z] 
15:14:16 [2020-08-22T19:14:16.737Z] (SWT:1623): Gtk-CRITICAL **: 19:14:16.570: gtk_box_gadget_distribute: assertion 'size >= 0' failed in GtkScrollbar
15:14:16 [2020-08-22T19:14:16.737Z] 
15:14:16 [2020-08-22T19:14:16.737Z] (SWT:1623): Gtk-CRITICAL **: 19:14:16.587: gtk_box_gadget_distribute: assertion 'size >= 0' failed in GtkScrollbar
15:14:16 [2020-08-22T19:14:16.737Z] 
15:14:16 [2020-08-22T19:14:16.737Z] (SWT:1623): Gtk-CRITICAL **: 19:14:16.604: gtk_box_gadget_distribute: assertion 'size >= 0' failed in GtkScrollbar
15:14:16 [2020-08-22T19:14:16.737Z] 
15:14:16 [2020-08-22T19:14:16.737Z] (SWT:1623): Gtk-CRITICAL **: 19:14:16.620: gtk_box_gadget_distribute: assertion 'size >= 0' failed in GtkScrollbar
15:14:16 [2020-08-22T19:14:16.737Z] 
15:14:16 [2020-08-22T19:14:16.737Z] (SWT:1623): Gtk-CRITICAL **: 19:14:16.637: gtk_box_gadget_distribute: assertion 'size >= 0' failed in GtkScrollbar
15:14:16 [2020-08-22T19:14:16.737Z] 
15:14:16 [2020-08-22T19:14:16.737Z] (SWT:1623): Gtk-CRITICAL **: 19:14:16.656: gtk_box_gadget_distribute: assertion 'size >= 0' failed in GtkScrollbar
15:14:16 [2020-08-22T19:14:16.737Z] 
15:14:16 [2020-08-22T19:14:16.737Z] (SWT:1623): Gtk-CRITICAL **: 19:14:16.670: gtk_box_gadget_distribute: assertion 'size >= 0' failed in GtkScrollbar
15:14:16 [2020-08-22T19:14:16.737Z] 
15:14:16 [2020-08-22T19:14:16.737Z] (SWT:1623): Gtk-CRITICAL **: 19:14:16.686: gtk_box_gadget_distribute: assertion 'size >= 0' failed in GtkScrollbar
15:14:16 [2020-08-22T19:14:16.737Z] 
15:14:16 [2020-08-22T19:14:16.737Z] (SWT:1623): Gtk-CRITICAL **: 19:14:16.704: gtk_box_gadget_distribute: assertion 'size >= 0' failed in GtkScrollbar
15:14:17 [2020-08-22T19:14:17.301Z] 
15:14:17 [2020-08-22T19:14:17.301Z] (SWT:1623): Gtk-CRITICAL **: 19:14:17.227: gtk_box_gadget_distribute: assertion 'size >= 0' failed in GtkScrollbar
15:14:18 [2020-08-22T19:14:18.232Z] Tests run: 1, Failures: 0, Errors: 0, Skipped: 0, Time elapsed: 2.055 s - in org.eclipse.egit.ui.gitflow.FeatureStartFinishHandlerTest
15:14:18 [2020-08-22T19:14:18.232Z] testFeatureStart(org.eclipse.egit.ui.gitflow.FeatureStartFinishHandlerTest)  Time elapsed: 2.052 s
15:14:18 [2020-08-22T19:14:18.232Z] Running org.eclipse.egit.ui.gitflow.FeatureFinishKeepBranchHandlerTest
15:14:18 [2020-08-22T19:14:18.797Z] 
15:14:18 [2020-08-22T19:14:18.797Z] (SWT:1623): Gtk-CRITICAL **: 19:14:18.616: gtk_box_gadget_distribute: assertion 'size >= 0' failed in GtkScrollbar
15:14:18 [2020-08-22T19:14:18.797Z] 
15:14:18 [2020-08-22T19:14:18.797Z] (SWT:1623): Gtk-CRITICAL **: 19:14:18.630: gtk_box_gadget_distribute: assertion 'size >= 0' failed in GtkScrollbar
15:14:18 [2020-08-22T19:14:18.797Z] 
15:14:18 [2020-08-22T19:14:18.797Z] (SWT:1623): Gtk-CRITICAL **: 19:14:18.646: gtk_box_gadget_distribute: assertion 'size >= 0' failed in GtkScrollbar
15:14:18 [2020-08-22T19:14:18.797Z] 
15:14:18 [2020-08-22T19:14:18.797Z] (SWT:1623): Gtk-CRITICAL **: 19:14:18.662: gtk_box_gadget_distribute: assertion 'size >= 0' failed in GtkScrollbar
15:14:18 [2020-08-22T19:14:18.797Z] 
15:14:18 [2020-08-22T19:14:18.797Z] (SWT:1623): Gtk-CRITICAL **: 19:14:18.680: gtk_box_gadget_distribute: assertion 'size >= 0' failed in GtkScrollbar
15:14:18 [2020-08-22T19:14:18.797Z] 
15:14:18 [2020-08-22T19:14:18.797Z] (SWT:1623): Gtk-CRITICAL **: 19:14:18.696: gtk_box_gadget_distribute: assertion 'size >= 0' failed in GtkScrollbar
15:14:18 [2020-08-22T19:14:18.797Z] 
15:14:18 [2020-08-22T19:14:18.797Z] (SWT:1623): Gtk-CRITICAL **: 19:14:18.713: gtk_box_gadget_distribute: assertion 'size >= 0' failed in GtkScrollbar
15:14:18 [2020-08-22T19:14:18.797Z] 
15:14:18 [2020-08-22T19:14:18.797Z] (SWT:1623): Gtk-CRITICAL **: 19:14:18.729: gtk_box_gadget_distribute: assertion 'size >= 0' failed in GtkScrollbar
15:14:18 [2020-08-22T19:14:18.797Z] 
15:14:18 [2020-08-22T19:14:18.797Z] (SWT:1623): Gtk-CRITICAL **: 19:14:18.746: gtk_box_gadget_distribute: assertion 'size >= 0' failed in GtkScrollbar
15:14:18 [2020-08-22T19:14:18.797Z] 
15:14:18 [2020-08-22T19:14:18.797Z] (SWT:1623): Gtk-CRITICAL **: 19:14:18.763: gtk_box_gadget_distribute: assertion 'size >= 0' failed in GtkScrollbar
15:14:18 [2020-08-22T19:14:18.797Z] 
15:14:18 [2020-08-22T19:14:18.797Z] (SWT:1623): Gtk-CRITICAL **: 19:14:18.779: gtk_box_gadget_distribute: assertion 'size >= 0' failed in GtkScrollbar
15:14:19 [2020-08-22T19:14:19.054Z] 
15:14:19 [2020-08-22T19:14:19.055Z] (SWT:1623): Gtk-CRITICAL **: 19:14:18.796: gtk_box_gadget_distribute: assertion 'size >= 0' failed in GtkScrollbar
15:14:19 [2020-08-22T19:14:19.055Z] 
15:14:19 [2020-08-22T19:14:19.055Z] (SWT:1623): Gtk-CRITICAL **: 19:14:18.813: gtk_box_gadget_distribute: assertion 'size >= 0' failed in GtkScrollbar
15:14:19 [2020-08-22T19:14:19.055Z] 
15:14:19 [2020-08-22T19:14:19.055Z] (SWT:1623): Gtk-CRITICAL **: 19:14:18.829: gtk_box_gadget_distribute: assertion 'size >= 0' failed in GtkScrollbar
15:14:19 [2020-08-22T19:14:19.055Z] 
15:14:19 [2020-08-22T19:14:19.055Z] (SWT:1623): Gtk-CRITICAL **: 19:14:18.846: gtk_box_gadget_distribute: assertion 'size >= 0' failed in GtkScrollbar
15:14:19 [2020-08-22T19:14:19.055Z] 
15:14:19 [2020-08-22T19:14:19.055Z] (SWT:1623): Gtk-CRITICAL **: 19:14:18.862: gtk_box_gadget_distribute: assertion 'size >= 0' failed in GtkScrollbar
15:14:19 [2020-08-22T19:14:19.620Z] 
15:14:19 [2020-08-22T19:14:19.620Z] (SWT:1623): Gtk-CRITICAL **: 19:14:19.373: gtk_box_gadget_distribute: assertion 'size >= 0' failed in GtkScrollbar
15:14:20 [2020-08-22T19:14:20.185Z] Tests run: 1, Failures: 0, Errors: 0, Skipped: 0, Time elapsed: 2.111 s - in org.eclipse.egit.ui.gitflow.FeatureFinishKeepBranchHandlerTest
15:14:20 [2020-08-22T19:14:20.185Z] testFeatureFinishKeepBranch(org.eclipse.egit.ui.gitflow.FeatureFinishKeepBranchHandlerTest)  Time elapsed: 2.107 s
15:14:20 [2020-08-22T19:14:20.185Z] Running org.eclipse.egit.ui.gitflow.FeatureRebaseHandlerTest
15:14:21 [2020-08-22T19:14:21.117Z] 
15:14:21 [2020-08-22T19:14:21.118Z] (SWT:1623): Gtk-WARNING **: 19:14:20.805: Negative content width -6 (allocation 1, extents 4x3) while allocating gadget (node toolbar, owner GtkToolbar)
15:14:21 [2020-08-22T19:14:21.118Z] 
15:14:21 [2020-08-22T19:14:21.118Z] (SWT:1623): Gtk-WARNING **: 19:14:20.809: Negative content width -6 (allocation 1, extents 4x3) while allocating gadget (node toolbar, owner GtkToolbar)
15:14:21 [2020-08-22T19:14:21.118Z] 
15:14:21 [2020-08-22T19:14:21.118Z] (SWT:1623): Gtk-WARNING **: 19:14:20.813: Negative content width -6 (allocation 1, extents 4x3) while allocating gadget (node toolbar, owner GtkToolbar)
15:14:21 [2020-08-22T19:14:21.118Z] 
15:14:21 [2020-08-22T19:14:21.118Z] (SWT:1623): Gtk-WARNING **: 19:14:20.815: Negative content width -6 (allocation 1, extents 4x3) while allocating gadget (node toolbar, owner GtkToolbar)
15:14:21 [2020-08-22T19:14:21.118Z] 
15:14:21 [2020-08-22T19:14:21.118Z] (SWT:1623): Gtk-WARNING **: 19:14:20.815: Negative content width -6 (allocation 1, extents 4x3) while allocating gadget (node toolbar, owner GtkToolbar)
15:14:21 [2020-08-22T19:14:21.118Z] 
15:14:21 [2020-08-22T19:14:21.118Z] (SWT:1623): Gtk-WARNING **: 19:14:20.844: Negative content width -6 (allocation 1, extents 4x3) while allocating gadget (node toolbar, owner GtkToolbar)
15:14:21 [2020-08-22T19:14:21.375Z] 
15:14:21 [2020-08-22T19:14:21.375Z] (SWT:1623): Gtk-WARNING **: 19:14:21.252: Negative content height -1 (allocation 1, extents 1x1) while allocating gadget (node scrolledwindow, owner GtkScrolledWindow)
15:14:21 [2020-08-22T19:14:21.375Z] 
15:14:21 [2020-08-22T19:14:21.375Z] (SWT:1623): Gtk-CRITICAL **: 19:14:21.253: gtk_box_gadget_distribute: assertion 'size >= 0' failed in GtkScrollbar
15:14:21 [2020-08-22T19:14:21.375Z] 
15:14:21 [2020-08-22T19:14:21.375Z] (SWT:1623): Gtk-WARNING **: 19:14:21.302: Negative content width -6 (allocation 1, extents 4x3) while allocating gadget (node toolbar, owner GtkToolbar)
15:14:22 [2020-08-22T19:14:22.746Z] 
15:14:22 [2020-08-22T19:14:22.746Z] (SWT:1623): Gtk-WARNING **: 19:14:22.675: Negative content height -1 (allocation 1, extents 1x1) while allocating gadget (node scrolledwindow, owner GtkScrolledWindow)
15:14:22 [2020-08-22T19:14:22.746Z] 
15:14:22 [2020-08-22T19:14:22.746Z] (SWT:1623): Gtk-CRITICAL **: 19:14:22.676: gtk_box_gadget_distribute: assertion 'size >= 0' failed in GtkScrollbar
15:14:23 [2020-08-22T19:14:23.003Z] Tests run: 2, Failures: 0, Errors: 0, Skipped: 0, Time elapsed: 2.838 s - in org.eclipse.egit.ui.gitflow.FeatureRebaseHandlerTest
15:14:23 [2020-08-22T19:14:23.003Z] testRebaseFailOnConflict(org.eclipse.egit.ui.gitflow.FeatureRebaseHandlerTest)  Time elapsed: 1.43 s
15:14:23 [2020-08-22T19:14:23.003Z] testRebaseFailOnDirtyWorkingDirectory(org.eclipse.egit.ui.gitflow.FeatureRebaseHandlerTest)  Time elapsed: 1.4 s
15:14:23 [2020-08-22T19:14:23.003Z] Running org.eclipse.egit.ui.gitflow.InitHandlerTest
15:14:27 [2020-08-22T19:14:27.177Z] Tests run: 3, Failures: 0, Errors: 0, Skipped: 0, Time elapsed: 3.461 s - in org.eclipse.egit.ui.gitflow.InitHandlerTest
15:14:27 [2020-08-22T19:14:27.177Z] testInit(org.eclipse.egit.ui.gitflow.InitHandlerTest)  Time elapsed: 0.754 s
15:14:27 [2020-08-22T19:14:27.177Z] testInitEmptyRepoMissingMaster(org.eclipse.egit.ui.gitflow.InitHandlerTest)  Time elapsed: 1.456 s
15:14:27 [2020-08-22T19:14:27.177Z] testInitMissingMaster(org.eclipse.egit.ui.gitflow.InitHandlerTest)  Time elapsed: 1.244 s
15:14:27 [2020-08-22T19:14:27.177Z] Running org.eclipse.egit.ui.gitflow.FeatureStartCheckoutConflictTest
15:14:27 [2020-08-22T19:14:27.177Z] 
15:14:27 [2020-08-22T19:14:27.177Z] (SWT:1623): Gtk-CRITICAL **: 19:14:26.926: gtk_box_gadget_distribute: assertion 'size >= 0' failed in GtkScrollbar
15:14:27 [2020-08-22T19:14:27.177Z] 
15:14:27 [2020-08-22T19:14:27.177Z] (SWT:1623): Gtk-CRITICAL **: 19:14:26.937: gtk_box_gadget_distribute: assertion 'size >= 0' failed in GtkScrollbar
15:14:27 [2020-08-22T19:14:27.177Z] 
15:14:27 [2020-08-22T19:14:27.177Z] (SWT:1623): Gtk-CRITICAL **: 19:14:26.972: gtk_box_gadget_distribute: assertion 'size >= 0' failed in GtkScrollbar
15:14:27 [2020-08-22T19:14:27.177Z] Tests run: 1, Failures: 0, Errors: 0, Skipped: 0, Time elapsed: 0.85 s - in org.eclipse.egit.ui.gitflow.FeatureStartCheckoutConflictTest
15:14:27 [2020-08-22T19:14:27.177Z] testFeatureStart(org.eclipse.egit.ui.gitflow.FeatureStartCheckoutConflictTest)  Time elapsed: 0.847 s
15:14:27 [2020-08-22T19:14:27.177Z] Running org.eclipse.egit.ui.variables.DynamicVariablesTest
15:14:31 [2020-08-22T19:14:31.359Z] Tests run: 4, Failures: 0, Errors: 0, Skipped: 0, Time elapsed: 4.213 s - in org.eclipse.egit.ui.variables.DynamicVariablesTest
15:14:31 [2020-08-22T19:14:31.359Z] testGitBranch(org.eclipse.egit.ui.variables.DynamicVariablesTest)  Time elapsed: 1.053 s
15:14:31 [2020-08-22T19:14:31.359Z] testGitPath(org.eclipse.egit.ui.variables.DynamicVariablesTest)  Time elapsed: 1.049 s
15:14:31 [2020-08-22T19:14:31.359Z] testGitWorkTree(org.eclipse.egit.ui.variables.DynamicVariablesTest)  Time elapsed: 1.052 s
15:14:31 [2020-08-22T19:14:31.359Z] testGitDir(org.eclipse.egit.ui.variables.DynamicVariablesTest)  Time elapsed: 1.058 s
15:14:31 [2020-08-22T19:14:31.359Z] Running org.eclipse.egit.ui.prefpages.configuration.GlobalConfigurationPageTest
15:14:31 [2020-08-22T19:14:31.616Z] 
15:14:31 [2020-08-22T19:14:31.616Z] !ENTRY org.eclipse.ui 2 2 2020-08-22 19:14:31.359
15:14:31 [2020-08-22T19:14:31.616Z] !MESSAGE Invalid preference category path: org.eclipse.ui.net.NetPreferences (bundle: org.eclipse.jsch.ui, page: org.eclipse.jsch.ui.SSHPreferences)
15:14:31 [2020-08-22T19:14:31.616Z] 
15:14:31 [2020-08-22T19:14:31.616Z] (SWT:1623): Gtk-WARNING **: 19:14:31.373: Negative content width -13 (allocation 5, extents 9x9) while allocating gadget (node entry, owner GtkEntry)
15:14:31 [2020-08-22T19:14:31.616Z] 
15:14:31 [2020-08-22T19:14:31.616Z] (SWT:1623): Gtk-WARNING **: 19:14:31.527: Negative content width -13 (allocation 5, extents 9x9) while allocating gadget (node entry, owner GtkEntry)
15:14:31 [2020-08-22T19:14:31.873Z] 
15:14:31 [2020-08-22T19:14:31.873Z] (SWT:1623): Gtk-WARNING **: 19:14:31.657: Negative content width -13 (allocation 5, extents 9x9) while allocating gadget (node entry, owner GtkEntry)
15:14:31 [2020-08-22T19:14:31.873Z] 
15:14:31 [2020-08-22T19:14:31.873Z] (SWT:1623): Gtk-WARNING **: 19:14:31.773: Negative content width -13 (allocation 5, extents 9x9) while allocating gadget (node entry, owner GtkEntry)
15:14:31 [2020-08-22T19:14:31.873Z] 
15:14:31 [2020-08-22T19:14:31.873Z] (SWT:1623): Gtk-WARNING **: 19:14:31.850: Negative content width -13 (allocation 5, extents 9x9) while allocating gadget (node entry, owner GtkEntry)
15:14:32 [2020-08-22T19:14:32.131Z] 
15:14:32 [2020-08-22T19:14:32.131Z] (SWT:1623): Gtk-WARNING **: 19:14:31.936: Negative content width -13 (allocation 5, extents 9x9) while allocating gadget (node entry, owner GtkEntry)
15:14:32 [2020-08-22T19:14:32.131Z] 
15:14:32 [2020-08-22T19:14:32.131Z] (SWT:1623): Gtk-WARNING **: 19:14:32.058: Negative content width -13 (allocation 5, extents 9x9) while allocating gadget (node entry, owner GtkEntry)
15:14:32 [2020-08-22T19:14:32.131Z] 
15:14:32 [2020-08-22T19:14:32.131Z] (SWT:1623): Gtk-WARNING **: 19:14:32.107: Negative content width -6 (allocation 1, extents 4x3) while allocating gadget (node toolbar, owner GtkToolbar)
15:14:32 [2020-08-22T19:14:32.131Z] 
15:14:32 [2020-08-22T19:14:32.131Z] (SWT:1623): Gtk-WARNING **: 19:14:32.107: Negative content height -3 (allocation 1, extents 2x2) while allocating gadget (node toolbar, owner GtkToolbar)
15:14:32 [2020-08-22T19:14:32.131Z] 
15:14:32 [2020-08-22T19:14:32.131Z] (SWT:1623): Gtk-WARNING **: 19:14:32.107: Negative content width -6 (allocation 1, extents 4x3) while allocating gadget (node toolbar, owner GtkToolbar)
15:14:32 [2020-08-22T19:14:32.131Z] 
15:14:32 [2020-08-22T19:14:32.131Z] (SWT:1623): Gtk-WARNING **: 19:14:32.107: Negative content height -3 (allocation 1, extents 2x2) while allocating gadget (node toolbar, owner GtkToolbar)
15:14:32 [2020-08-22T19:14:32.389Z] 
15:14:32 [2020-08-22T19:14:32.389Z] (SWT:1623): Gtk-WARNING **: 19:14:32.213: Negative content width -13 (allocation 5, extents 9x9) while allocating gadget (node entry, owner GtkEntry)
15:14:32 [2020-08-22T19:14:32.389Z] 
15:14:32 [2020-08-22T19:14:32.389Z] (SWT:1623): Gtk-WARNING **: 19:14:32.327: Negative content width -13 (allocation 5, extents 9x9) while allocating gadget (node entry, owner GtkEntry)
15:14:32 [2020-08-22T19:14:32.646Z] 
15:14:32 [2020-08-22T19:14:32.646Z] (SWT:1623): Gtk-WARNING **: 19:14:32.464: Negative content width -13 (allocation 5, extents 9x9) while allocating gadget (node entry, owner GtkEntry)
15:14:32 [2020-08-22T19:14:32.646Z] 
15:14:32 [2020-08-22T19:14:32.646Z] (SWT:1623): Gtk-WARNING **: 19:14:32.572: Negative content width -13 (allocation 5, extents 9x9) while allocating gadget (node entry, owner GtkEntry)
15:14:32 [2020-08-22T19:14:32.908Z] 
15:14:32 [2020-08-22T19:14:32.908Z] (SWT:1623): Gtk-WARNING **: 19:14:32.682: Negative content width -13 (allocation 5, extents 9x9) while allocating gadget (node entry, owner GtkEntry)
15:14:32 [2020-08-22T19:14:32.908Z] Tests run: 11, Failures: 0, Errors: 0, Skipped: 0, Time elapsed: 1.436 s - in org.eclipse.egit.ui.prefpages.configuration.GlobalConfigurationPageTest
15:14:32 [2020-08-22T19:14:32.908Z] testAddSubSectionEntry(org.eclipse.egit.ui.prefpages.configuration.GlobalConfigurationPageTest)  Time elapsed: 0.174 s
15:14:32 [2020-08-22T19:14:32.908Z] testAddSectionEntry(org.eclipse.egit.ui.prefpages.configuration.GlobalConfigurationPageTest)  Time elapsed: 0.13 s
15:14:32 [2020-08-22T19:14:32.908Z] testCanCreateSameEntryValue(org.eclipse.egit.ui.prefpages.configuration.GlobalConfigurationPageTest)  Time elapsed: 0.117 s
15:14:32 [2020-08-22T19:14:32.908Z] testNodes(org.eclipse.egit.ui.prefpages.configuration.GlobalConfigurationPageTest)  Time elapsed: 0.076 s
15:14:32 [2020-08-22T19:14:32.909Z] testRemoveValue(org.eclipse.egit.ui.prefpages.configuration.GlobalConfigurationPageTest)  Time elapsed: 0.086 s
15:14:32 [2020-08-22T19:14:32.909Z] testAddSubSectionEntryWithSuggestion(org.eclipse.egit.ui.prefpages.configuration.GlobalConfigurationPageTest)  Time elapsed: 0.122 s
15:14:32 [2020-08-22T19:14:32.909Z] testOpenEditor(org.eclipse.egit.ui.prefpages.configuration.GlobalConfigurationPageTest)  Time elapsed: 0.156 s
15:14:32 [2020-08-22T19:14:32.909Z] testSubsectionWithDot(org.eclipse.egit.ui.prefpages.configuration.GlobalConfigurationPageTest)  Time elapsed: 0.113 s
15:14:32 [2020-08-22T19:14:32.909Z] testChecksForKey(org.eclipse.egit.ui.prefpages.configuration.GlobalConfigurationPageTest)  Time elapsed: 0.137 s
15:14:32 [2020-08-22T19:14:32.909Z] testRemoveSubSection(org.eclipse.egit.ui.prefpages.configuration.GlobalConfigurationPageTest)  Time elapsed: 0.108 s
15:14:32 [2020-08-22T19:14:32.909Z] testRemoveSection(org.eclipse.egit.ui.prefpages.configuration.GlobalConfigurationPageTest)  Time elapsed: 0.11 s
15:14:32 [2020-08-22T19:14:32.909Z] Running org.eclipse.egit.ui.operations.GitScopeUtilTest
15:14:37 [2020-08-22T19:14:37.114Z] Tests run: 5, Failures: 0, Errors: 0, Skipped: 0, Time elapsed: 4.013 s - in org.eclipse.egit.ui.operations.GitScopeUtilTest
15:14:37 [2020-08-22T19:14:37.114Z] relatedChangesWithPrompt(org.eclipse.egit.ui.operations.GitScopeUtilTest)  Time elapsed: 1.529 s
15:14:37 [2020-08-22T19:14:37.114Z] modelProviderWithExtensionFiles(org.eclipse.egit.ui.operations.GitScopeUtilTest)  Time elapsed: 0.622 s
15:14:37 [2020-08-22T19:14:37.114Z] relatedChangesWithInvalidParams(org.eclipse.egit.ui.operations.GitScopeUtilTest)  Time elapsed: 0.635 s
15:14:37 [2020-08-22T19:14:37.114Z] relatedChangesWithNullResources(org.eclipse.egit.ui.operations.GitScopeUtilTest)  Time elapsed: 0.591 s
15:14:37 [2020-08-22T19:14:37.114Z] relatedChangesWithEmptyResources(org.eclipse.egit.ui.operations.GitScopeUtilTest)  Time elapsed: 0.635 s
15:14:37 [2020-08-22T19:14:37.114Z] 
15:14:37 [2020-08-22T19:14:37.114Z] Results:
15:14:37 [2020-08-22T19:14:37.114Z] 
15:14:37 [2020-08-22T19:14:37.114Z] Failures: 
15:14:37 [2020-08-22T19:14:37.114Z]   HistoryViewTest.setupTests:109->LocalRepositoryTestCase.createProjectAndCommitToRepository:326->LocalRepositoryTestCase.createProjectAndCommitToRepository:331->LocalRepositoryTestCase.createProjectAndCommitToRepository:373->LocalRepositoryTestCase.assertConnected:465 Project not shared with git: P/ProjectWithoutDotProject
15:14:37 [2020-08-22T19:14:37.114Z] 
15:14:37 [2020-08-22T19:14:37.114Z] Tests run: 541, Failures: 1, Errors: 0, Skipped: 12
15:14:37 [2020-08-22T19:14:37.114Z] 
15:14:38 [2020-08-22T19:14:38.047Z] 
15:14:38 [2020-08-22T19:14:38.047Z] !ENTRY org.eclipse.core.resources 2 10035 2020-08-22 19:14:37.707
15:14:38 [2020-08-22T19:14:38.047Z] !MESSAGE The workspace will exit with unsaved changes in this session.
15:14:38 [2020-08-22T19:14:38.980Z] [INFO] ------------------------------------------------------------------------
15:14:38 [2020-08-22T19:14:38.980Z] [INFO] Reactor Summary for EGit Parent 5.9.0-SNAPSHOT:
15:14:38 [2020-08-22T19:14:38.980Z] [INFO] 
15:14:38 [2020-08-22T19:14:38.980Z] [INFO] EGit Parent ........................................ SUCCESS [ 34.758 s]
15:14:38 [2020-08-22T19:14:38.980Z] [INFO] EGit Target Platform Definition .................... SUCCESS [  1.198 s]
15:14:38 [2020-08-22T19:14:38.980Z] [INFO] Eclipse EGit ....................................... SUCCESS [  4.398 s]
15:14:38 [2020-08-22T19:14:38.980Z] [INFO] Git Team Provider (Core) ........................... SUCCESS [ 19.395 s]
15:14:38 [2020-08-22T19:14:38.980Z] [INFO] Git Team Provider (UI) ............................. SUCCESS [ 46.277 s]
15:14:38 [2020-08-22T19:14:38.980Z] [INFO] EGit Mylyn UI ...................................... SUCCESS [  7.356 s]
15:14:38 [2020-08-22T19:14:38.980Z] [INFO] Git Team Provider (Documentation) .................. SUCCESS [  5.653 s]
15:14:38 [2020-08-22T19:14:38.980Z] [INFO] Eclipse EGit Feature ............................... SUCCESS [  1.171 s]
15:14:38 [2020-08-22T19:14:38.980Z] [INFO] EGit Mylyn Feature ................................. SUCCESS [  1.098 s]
15:14:38 [2020-08-22T19:14:38.980Z] [INFO] Git Flow ........................................... SUCCESS [  5.981 s]
15:14:38 [2020-08-22T19:14:38.980Z] [INFO] Git Flow UI ........................................ SUCCESS [  8.522 s]
15:14:38 [2020-08-22T19:14:38.980Z] [INFO] Eclipse EGit Gitflow Feature ....................... SUCCESS [  1.113 s]
15:14:38 [2020-08-22T19:14:38.980Z] [INFO] EGit JUnit Support ................................. SUCCESS [  7.085 s]
15:14:38 [2020-08-22T19:14:38.980Z] [INFO] GitFlow Test Plug-in ............................... SUCCESS [ 25.545 s]
15:14:38 [2020-08-22T19:14:38.980Z] [INFO] Eclipse EGit Source Feature ........................ SUCCESS [  1.116 s]
15:14:38 [2020-08-22T19:14:38.980Z] [INFO] EGit P2 Repository ................................. SUCCESS [ 15.432 s]
15:14:38 [2020-08-22T19:14:38.980Z] [INFO] EGit Core Test Plug-in ............................. SUCCESS [02:16 min]
15:14:38 [2020-08-22T19:14:38.980Z] [INFO] EGit UI Test Plug-in ............................... FAILURE [13:10 min]
15:14:38 [2020-08-22T19:14:38.980Z] [INFO] EGit Mylyn UI Test Plug-in ......................... SKIPPED
15:14:38 [2020-08-22T19:14:38.980Z] [INFO] ------------------------------------------------------------------------
15:14:38 [2020-08-22T19:14:38.980Z] [INFO] BUILD FAILURE
15:14:38 [2020-08-22T19:14:38.980Z] [INFO] ------------------------------------------------------------------------
15:14:38 [2020-08-22T19:14:38.980Z] [INFO] Total time:  21:13 min
15:14:38 [2020-08-22T19:14:38.980Z] [INFO] Finished at: 2020-08-22T19:14:38Z
15:14:38 [2020-08-22T19:14:38.980Z] [INFO] ------------------------------------------------------------------------
15:14:38 [2020-08-22T19:14:38.980Z] [ERROR] Failed to execute goal org.eclipse.tycho:tycho-surefire-plugin:1.7.0:test (default-test) on project org.eclipse.egit.ui.test: There are test failures.
15:14:38 [2020-08-22T19:14:38.980Z] [ERROR] 
15:14:38 [2020-08-22T19:14:38.980Z] [ERROR] Please refer to /home/jenkins/agent/workspace/egit/repo/org.eclipse.egit.ui.test/target/surefire-reports for the individual test results.
15:14:38 [2020-08-22T19:14:38.980Z] [ERROR] -> [Help 1]
15:14:38 [2020-08-22T19:14:38.980Z] org.apache.maven.lifecycle.LifecycleExecutionException: Failed to execute goal org.eclipse.tycho:tycho-surefire-plugin:1.7.0:test (default-test) on project org.eclipse.egit.ui.test: There are test failures.
15:14:38 [2020-08-22T19:14:38.980Z] 
15:14:38 [2020-08-22T19:14:38.980Z] Please refer to /home/jenkins/agent/workspace/egit/repo/org.eclipse.egit.ui.test/target/surefire-reports for the individual test results.
15:14:38 [2020-08-22T19:14:38.980Z]     at org.apache.maven.lifecycle.internal.MojoExecutor.execute (MojoExecutor.java:215)
15:14:38 [2020-08-22T19:14:38.980Z]     at org.apache.maven.lifecycle.internal.MojoExecutor.execute (MojoExecutor.java:156)
15:14:38 [2020-08-22T19:14:38.980Z]     at org.apache.maven.lifecycle.internal.MojoExecutor.execute (MojoExecutor.java:148)
15:14:38 [2020-08-22T19:14:38.980Z]     at org.apache.maven.lifecycle.internal.LifecycleModuleBuilder.buildProject (LifecycleModuleBuilder.java:117)
15:14:38 [2020-08-22T19:14:38.980Z]     at org.apache.maven.lifecycle.internal.LifecycleModuleBuilder.buildProject (LifecycleModuleBuilder.java:81)
15:14:38 [2020-08-22T19:14:38.980Z]     at org.apache.maven.lifecycle.internal.builder.singlethreaded.SingleThreadedBuilder.build (SingleThreadedBuilder.java:56)
15:14:38 [2020-08-22T19:14:38.980Z]     at org.apache.maven.lifecycle.internal.LifecycleStarter.execute (LifecycleStarter.java:128)
15:14:38 [2020-08-22T19:14:38.980Z]     at org.apache.maven.DefaultMaven.doExecute (DefaultMaven.java:305)
15:14:38 [2020-08-22T19:14:38.980Z]     at org.apache.maven.DefaultMaven.doExecute (DefaultMaven.java:192)
15:14:38 [2020-08-22T19:14:38.980Z]     at org.apache.maven.DefaultMaven.execute (DefaultMaven.java:105)
15:14:38 [2020-08-22T19:14:38.980Z]     at org.apache.maven.cli.MavenCli.execute (MavenCli.java:957)
15:14:38 [2020-08-22T19:14:38.980Z]     at org.apache.maven.cli.MavenCli.doMain (MavenCli.java:289)
15:14:38 [2020-08-22T19:14:38.980Z]     at org.apache.maven.cli.MavenCli.main (MavenCli.java:193)
15:14:38 [2020-08-22T19:14:38.980Z]     at sun.reflect.NativeMethodAccessorImpl.invoke0 (Native Method)
15:14:38 [2020-08-22T19:14:38.980Z]     at sun.reflect.NativeMethodAccessorImpl.invoke (NativeMethodAccessorImpl.java:62)
15:14:38 [2020-08-22T19:14:38.980Z]     at sun.reflect.DelegatingMethodAccessorImpl.invoke (DelegatingMethodAccessorImpl.java:43)
15:14:38 [2020-08-22T19:14:38.980Z]     at java.lang.reflect.Method.invoke (Method.java:498)
15:14:38 [2020-08-22T19:14:38.980Z]     at org.codehaus.plexus.classworlds.launcher.Launcher.launchEnhanced (Launcher.java:282)
15:14:38 [2020-08-22T19:14:38.980Z]     at org.codehaus.plexus.classworlds.launcher.Launcher.launch (Launcher.java:225)
15:14:38 [2020-08-22T19:14:38.980Z]     at org.codehaus.plexus.classworlds.launcher.Launcher.mainWithExitCode (Launcher.java:406)
15:14:38 [2020-08-22T19:14:38.980Z]     at org.codehaus.plexus.classworlds.launcher.Launcher.main (Launcher.java:347)
15:14:38 [2020-08-22T19:14:38.980Z] Caused by: org.apache.maven.plugin.MojoFailureException: There are test failures.
15:14:38 [2020-08-22T19:14:38.980Z] 
15:14:38 [2020-08-22T19:14:38.980Z] Please refer to /home/jenkins/agent/workspace/egit/repo/org.eclipse.egit.ui.test/target/surefire-reports for the individual test results.
15:14:38 [2020-08-22T19:14:38.980Z]     at org.eclipse.tycho.surefire.TestMojo.runTest (TestMojo.java:1063)
15:14:38 [2020-08-22T19:14:38.980Z]     at org.eclipse.tycho.surefire.TestMojo.execute (TestMojo.java:712)
15:14:38 [2020-08-22T19:14:38.980Z]     at org.apache.maven.plugin.DefaultBuildPluginManager.executeMojo (DefaultBuildPluginManager.java:137)
15:14:38 [2020-08-22T19:14:38.980Z]     at org.apache.maven.lifecycle.internal.MojoExecutor.execute (MojoExecutor.java:210)
15:14:38 [2020-08-22T19:14:38.980Z]     at org.apache.maven.lifecycle.internal.MojoExecutor.execute (MojoExecutor.java:156)
15:14:38 [2020-08-22T19:14:38.980Z]     at org.apache.maven.lifecycle.internal.MojoExecutor.execute (MojoExecutor.java:148)
15:14:38 [2020-08-22T19:14:38.980Z]     at org.apache.maven.lifecycle.internal.LifecycleModuleBuilder.buildProject (LifecycleModuleBuilder.java:117)
15:14:38 [2020-08-22T19:14:38.980Z]     at org.apache.maven.lifecycle.internal.LifecycleModuleBuilder.buildProject (LifecycleModuleBuilder.java:81)
15:14:38 [2020-08-22T19:14:38.981Z]     at org.apache.maven.lifecycle.internal.builder.singlethreaded.SingleThreadedBuilder.build (SingleThreadedBuilder.java:56)
15:14:38 [2020-08-22T19:14:38.981Z]     at org.apache.maven.lifecycle.internal.LifecycleStarter.execute (LifecycleStarter.java:128)
15:14:38 [2020-08-22T19:14:38.981Z]     at org.apache.maven.DefaultMaven.doExecute (DefaultMaven.java:305)
15:14:38 [2020-08-22T19:14:38.981Z]     at org.apache.maven.DefaultMaven.doExecute (DefaultMaven.java:192)
15:14:38 [2020-08-22T19:14:38.981Z]     at org.apache.maven.DefaultMaven.execute (DefaultMaven.java:105)
15:14:38 [2020-08-22T19:14:38.981Z]     at org.apache.maven.cli.MavenCli.execute (MavenCli.java:957)
15:14:38 [2020-08-22T19:14:38.981Z]     at org.apache.maven.cli.MavenCli.doMain (MavenCli.java:289)
15:14:38 [2020-08-22T19:14:38.981Z]     at org.apache.maven.cli.MavenCli.main (MavenCli.java:193)
15:14:38 [2020-08-22T19:14:38.981Z]     at sun.reflect.NativeMethodAccessorImpl.invoke0 (Native Method)
15:14:38 [2020-08-22T19:14:38.981Z]     at sun.reflect.NativeMethodAccessorImpl.invoke (NativeMethodAccessorImpl.java:62)
15:14:38 [2020-08-22T19:14:38.981Z]     at sun.reflect.DelegatingMethodAccessorImpl.invoke (DelegatingMethodAccessorImpl.java:43)
15:14:38 [2020-08-22T19:14:38.981Z]     at java.lang.reflect.Method.invoke (Method.java:498)
15:14:38 [2020-08-22T19:14:38.981Z]     at org.codehaus.plexus.classworlds.launcher.Launcher.launchEnhanced (Launcher.java:282)
15:14:38 [2020-08-22T19:14:38.981Z]     at org.codehaus.plexus.classworlds.launcher.Launcher.launch (Launcher.java:225)
15:14:38 [2020-08-22T19:14:38.981Z]     at org.codehaus.plexus.classworlds.launcher.Launcher.mainWithExitCode (Launcher.java:406)
15:14:38 [2020-08-22T19:14:38.981Z]     at org.codehaus.plexus.classworlds.launcher.Launcher.main (Launcher.java:347)
15:14:38 [2020-08-22T19:14:38.981Z] [ERROR] 
15:14:38 [2020-08-22T19:14:38.981Z] [ERROR] Re-run Maven using the -X switch to enable full debug logging.
15:14:38 [2020-08-22T19:14:38.981Z] [ERROR] 
15:14:38 [2020-08-22T19:14:38.981Z] [ERROR] For more information about the errors and possible solutions, please read the following articles:
15:14:38 [2020-08-22T19:14:38.981Z] [ERROR] [Help 1] http://cwiki.apache.org/confluence/display/MAVEN/MojoFailureException
15:14:38 [2020-08-22T19:14:38.981Z] [ERROR] 
15:14:38 [2020-08-22T19:14:38.981Z] [ERROR] After correcting the problems, you can resume the build with the command
15:14:38 [2020-08-22T19:14:38.981Z] [ERROR]   mvn <args> -rf :org.eclipse.egit.ui.test
[Pipeline] }
[Pipeline] // stage
[Pipeline] stage
[Pipeline] { (Results)
[Pipeline] junit
15:14:40 [2020-08-22T19:14:40.390Z] Recording test results
[Pipeline] archiveArtifacts
15:14:41 [2020-08-22T19:14:41.214Z] Archiving artifacts
[Pipeline] findbugs
15:14:43 [2020-08-22T19:14:43.885Z] [FINDBUGS] Collecting findbugs analysis files...
15:14:47 [2020-08-22T19:14:47.255Z] [FINDBUGS] Searching for all files in /home/jenkins/agent/workspace/egit/repo that match the pattern */target/*bugsXml.xml
15:14:47 [2020-08-22T19:14:47.256Z] [FINDBUGS] Parsing 8 files in /home/jenkins/agent/workspace/egit/repo
15:14:47 [2020-08-22T19:14:47.256Z] [FINDBUGS] Successfully parsed file /home/jenkins/agent/workspace/egit/repo/org.eclipse.egit.core.junit/target/spotbugsXml.xml with 4 unique warnings and 0 duplicates.
15:14:47 [2020-08-22T19:14:47.256Z] [FINDBUGS] Successfully parsed file /home/jenkins/agent/workspace/egit/repo/org.eclipse.egit.core.test/target/spotbugsXml.xml with 9 unique warnings and 0 duplicates.
15:14:47 [2020-08-22T19:14:47.256Z] [FINDBUGS] Successfully parsed file /home/jenkins/agent/workspace/egit/repo/org.eclipse.egit.core/target/spotbugsXml.xml with 20 unique warnings and 0 duplicates.
15:14:47 [2020-08-22T19:14:47.256Z] [FINDBUGS] Successfully parsed file /home/jenkins/agent/workspace/egit/repo/org.eclipse.egit.gitflow.test/target/spotbugsXml.xml with 20 unique warnings and 0 duplicates.
15:14:47 [2020-08-22T19:14:47.256Z] [FINDBUGS] Successfully parsed file /home/jenkins/agent/workspace/egit/repo/org.eclipse.egit.gitflow.ui/target/spotbugsXml.xml with 20 unique warnings and 0 duplicates.
15:14:47 [2020-08-22T19:14:47.256Z] [FINDBUGS] Successfully parsed file /home/jenkins/agent/workspace/egit/repo/org.eclipse.egit.gitflow/target/spotbugsXml.xml with 22 unique warnings and 0 duplicates.
15:14:47 [2020-08-22T19:14:47.256Z] [FINDBUGS] Successfully parsed file /home/jenkins/agent/workspace/egit/repo/org.eclipse.egit.mylyn.ui/target/spotbugsXml.xml with 22 unique warnings and 0 duplicates.
15:14:47 [2020-08-22T19:14:47.256Z] [FINDBUGS] Successfully parsed file /home/jenkins/agent/workspace/egit/repo/org.eclipse.egit.ui/target/spotbugsXml.xml with 59 unique warnings and 0 duplicates.
15:14:47 [2020-08-22T19:14:47.256Z] Skipping warnings blame since pipelines do not have an SCM link.%n
15:14:47 [2020-08-22T19:14:47.315Z] [FINDBUGS] Computing warning deltas based on reference build #464
[Pipeline] dry
15:14:47 [2020-08-22T19:14:47.516Z] [DRY] Collecting duplicate code analysis files...
15:14:47 [2020-08-22T19:14:47.745Z] [DRY] Searching for all files in /home/jenkins/agent/workspace/egit/repo that match the pattern **/cpd.xml
15:14:47 [2020-08-22T19:14:47.745Z] [DRY] Parsing 15 files in /home/jenkins/agent/workspace/egit/repo
15:14:47 [2020-08-22T19:14:47.745Z] [DRY] Successfully parsed file /home/jenkins/agent/workspace/egit/repo/org.eclipse.egit-feature/target/cpd.xml with 0 unique warnings and 0 duplicates.
15:14:47 [2020-08-22T19:14:47.745Z] [DRY] Successfully parsed file /home/jenkins/agent/workspace/egit/repo/org.eclipse.egit.core.junit/target/cpd.xml with 0 unique warnings and 0 duplicates.
15:14:47 [2020-08-22T19:14:47.745Z] [DRY] Successfully parsed file /home/jenkins/agent/workspace/egit/repo/org.eclipse.egit.core.test/target/cpd.xml with 0 unique warnings and 0 duplicates.
15:14:47 [2020-08-22T19:14:47.745Z] [DRY] Successfully parsed file /home/jenkins/agent/workspace/egit/repo/org.eclipse.egit.core/target/cpd.xml with 4 unique warnings and 0 duplicates.
15:14:47 [2020-08-22T19:14:47.745Z] [DRY] Successfully parsed file /home/jenkins/agent/workspace/egit/repo/org.eclipse.egit.doc/target/cpd.xml with 4 unique warnings and 0 duplicates.
15:14:47 [2020-08-22T19:14:47.745Z] [DRY] Successfully parsed file /home/jenkins/agent/workspace/egit/repo/org.eclipse.egit.gitflow-feature/target/cpd.xml with 4 unique warnings and 0 duplicates.
15:14:47 [2020-08-22T19:14:47.745Z] [DRY] Successfully parsed file /home/jenkins/agent/workspace/egit/repo/org.eclipse.egit.gitflow.test/target/cpd.xml with 4 unique warnings and 0 duplicates.
15:14:47 [2020-08-22T19:14:47.745Z] [DRY] Successfully parsed file /home/jenkins/agent/workspace/egit/repo/org.eclipse.egit.gitflow.ui/target/cpd.xml with 4 unique warnings and 0 duplicates.
15:14:47 [2020-08-22T19:14:47.745Z] [DRY] Successfully parsed file /home/jenkins/agent/workspace/egit/repo/org.eclipse.egit.gitflow/target/cpd.xml with 4 unique warnings and 0 duplicates.
15:14:47 [2020-08-22T19:14:47.745Z] [DRY] Successfully parsed file /home/jenkins/agent/workspace/egit/repo/org.eclipse.egit.mylyn-feature/target/cpd.xml with 4 unique warnings and 0 duplicates.
15:14:47 [2020-08-22T19:14:47.745Z] [DRY] Successfully parsed file /home/jenkins/agent/workspace/egit/repo/org.eclipse.egit.mylyn.ui/target/cpd.xml with 4 unique warnings and 0 duplicates.
15:14:47 [2020-08-22T19:14:47.745Z] [DRY] Successfully parsed file /home/jenkins/agent/workspace/egit/repo/org.eclipse.egit.repository/target/cpd.xml with 4 unique warnings and 0 duplicates.
15:14:47 [2020-08-22T19:14:47.746Z] [DRY] Successfully parsed file /home/jenkins/agent/workspace/egit/repo/org.eclipse.egit.source-feature/target/cpd.xml with 4 unique warnings and 0 duplicates.
15:14:47 [2020-08-22T19:14:47.746Z] [DRY] Successfully parsed file /home/jenkins/agent/workspace/egit/repo/org.eclipse.egit.ui/target/cpd.xml with 37 unique warnings and 0 duplicates.
15:14:47 [2020-08-22T19:14:47.746Z] [DRY] Successfully parsed file /home/jenkins/agent/workspace/egit/repo/org.eclipse.egit/target/cpd.xml with 37 unique warnings and 0 duplicates.
15:14:47 [2020-08-22T19:14:47.746Z] Skipping warnings blame since pipelines do not have an SCM link.%n
15:14:47 [2020-08-22T19:14:47.788Z] [DRY] Computing warning deltas based on reference build #464
[Pipeline] }
[Pipeline] // stage
[Pipeline] step
15:14:47 [2020-08-22T19:14:47.934Z] Sending e-mails to: egit-build@eclipse.org
[Pipeline] }
[Pipeline] // dir
[Pipeline] }
15:14:48 [2020-08-22T19:14:48.015Z] Terminating xvnc.
[Pipeline] // wrap
[Pipeline] }
[Pipeline] // timeout
[Pipeline] }
[Pipeline] // node
[Pipeline] }
[Pipeline] // timestamps
[Pipeline] End of Pipeline
ERROR: script returned exit code 1
Finished: FAILURE