SuccessConsole Output

Skipping 898 KB.. Full Log
ad.run(Thread.java:748)
12:39:22 [2020-08-12T16:39:22.964Z] 
12:39:22 [2020-08-12T16:39:22.964Z] !ENTRY org.eclipse.egit.ui 4 0 2020-08-12 16:39:22.865
12:39:22 [2020-08-12T16:39:22.964Z] !MESSAGE CrashingCommitMessageProvider fails on purpose.
12:39:22 [2020-08-12T16:39:22.964Z] !STACK 0
12:39:22 [2020-08-12T16:39:22.965Z] java.lang.IllegalStateException: CrashingCommitMessageProvider fails on purpose.
12:39:22 [2020-08-12T16:39:22.965Z] 	at org.eclipse.egit.ui.internal.dialogs.CommitMessageBuilderTest$CrashingCommitMessageProvider.getMessage(CommitMessageBuilderTest.java:474)
12:39:22 [2020-08-12T16:39:22.965Z] 	at org.eclipse.egit.ui.internal.dialogs.CommitMessageBuilder.build(CommitMessageBuilder.java:90)
12:39:22 [2020-08-12T16:39:22.965Z] 	at org.eclipse.egit.ui.internal.dialogs.CommitMessageBuilderTest.commitMessageProvider_twoProvidersFirstOneCrashing(CommitMessageBuilderTest.java:146)
12:39:22 [2020-08-12T16:39:22.965Z] 	at sun.reflect.NativeMethodAccessorImpl.invoke0(Native Method)
12:39:22 [2020-08-12T16:39:22.965Z] 	at sun.reflect.NativeMethodAccessorImpl.invoke(NativeMethodAccessorImpl.java:62)
12:39:22 [2020-08-12T16:39:22.965Z] 	at sun.reflect.DelegatingMethodAccessorImpl.invoke(DelegatingMethodAccessorImpl.java:43)
12:39:22 [2020-08-12T16:39:22.965Z] 	at java.lang.reflect.Method.invoke(Method.java:498)
12:39:22 [2020-08-12T16:39:22.965Z] 	at org.junit.runners.model.FrameworkMethod$1.runReflectiveCall(FrameworkMethod.java:59)
12:39:22 [2020-08-12T16:39:22.965Z] 	at org.junit.internal.runners.model.ReflectiveCallable.run(ReflectiveCallable.java:12)
12:39:22 [2020-08-12T16:39:22.965Z] 	at org.junit.runners.model.FrameworkMethod.invokeExplosively(FrameworkMethod.java:56)
12:39:22 [2020-08-12T16:39:22.965Z] 	at org.junit.internal.runners.statements.InvokeMethod.evaluate(InvokeMethod.java:17)
12:39:22 [2020-08-12T16:39:22.965Z] 	at org.junit.internal.runners.statements.RunBefores.evaluate(RunBefores.java:26)
12:39:22 [2020-08-12T16:39:22.965Z] 	at org.junit.internal.runners.statements.RunAfters.evaluate(RunAfters.java:27)
12:39:22 [2020-08-12T16:39:22.965Z] 	at org.junit.runners.ParentRunner$3.evaluate(ParentRunner.java:306)
12:39:22 [2020-08-12T16:39:22.965Z] 	at org.junit.runners.BlockJUnit4ClassRunner$1.evaluate(BlockJUnit4ClassRunner.java:100)
12:39:22 [2020-08-12T16:39:22.965Z] 	at org.junit.runners.ParentRunner.runLeaf(ParentRunner.java:366)
12:39:22 [2020-08-12T16:39:22.965Z] 	at org.junit.runners.BlockJUnit4ClassRunner.runChild(BlockJUnit4ClassRunner.java:103)
12:39:22 [2020-08-12T16:39:22.965Z] 	at org.junit.runners.BlockJUnit4ClassRunner.runChild(BlockJUnit4ClassRunner.java:63)
12:39:22 [2020-08-12T16:39:22.965Z] 	at org.junit.runners.ParentRunner$4.run(ParentRunner.java:331)
12:39:22 [2020-08-12T16:39:22.965Z] 	at org.junit.runners.ParentRunner$1.schedule(ParentRunner.java:79)
12:39:22 [2020-08-12T16:39:22.965Z] 	at org.junit.runners.ParentRunner.runChildren(ParentRunner.java:329)
12:39:22 [2020-08-12T16:39:22.965Z] 	at org.junit.runners.ParentRunner.access$100(ParentRunner.java:66)
12:39:22 [2020-08-12T16:39:22.965Z] 	at org.junit.runners.ParentRunner$2.evaluate(ParentRunner.java:293)
12:39:22 [2020-08-12T16:39:22.965Z] 	at org.junit.internal.runners.statements.RunBefores.evaluate(RunBefores.java:26)
12:39:22 [2020-08-12T16:39:22.965Z] 	at org.junit.runners.ParentRunner$3.evaluate(ParentRunner.java:306)
12:39:22 [2020-08-12T16:39:22.965Z] 	at org.junit.runners.ParentRunner.run(ParentRunner.java:413)
12:39:22 [2020-08-12T16:39:22.965Z] 	at org.apache.maven.surefire.junit4.JUnit4Provider.execute(JUnit4Provider.java:365)
12:39:22 [2020-08-12T16:39:22.965Z] 	at org.apache.maven.surefire.junit4.JUnit4Provider.executeWithRerun(JUnit4Provider.java:273)
12:39:22 [2020-08-12T16:39:22.965Z] 	at org.apache.maven.surefire.junit4.JUnit4Provider.executeTestSet(JUnit4Provider.java:238)
12:39:22 [2020-08-12T16:39:22.965Z] 	at org.apache.maven.surefire.junit4.JUnit4Provider.invoke(JUnit4Provider.java:159)
12:39:22 [2020-08-12T16:39:22.965Z] 	at sun.reflect.NativeMethodAccessorImpl.invoke0(Native Method)
12:39:22 [2020-08-12T16:39:22.965Z] 	at sun.reflect.NativeMethodAccessorImpl.invoke(NativeMethodAccessorImpl.java:62)
12:39:22 [2020-08-12T16:39:22.965Z] 	at sun.reflect.DelegatingMethodAccessorImpl.invoke(DelegatingMethodAccessorImpl.java:43)
12:39:22 [2020-08-12T16:39:22.965Z] 	at java.lang.reflect.Method.invoke(Method.java:498)
12:39:22 [2020-08-12T16:39:22.965Z] 	at org.apache.maven.surefire.util.ReflectionUtils.invokeMethodWithArray2(ReflectionUtils.java:206)
12:39:22 [2020-08-12T16:39:22.965Z] 	at org.apache.maven.surefire.booter.ProviderFactory$ProviderProxy.invoke(ProviderFactory.java:161)
12:39:22 [2020-08-12T16:39:22.965Z] 	at org.apache.maven.surefire.booter.ProviderFactory.invokeProvider(ProviderFactory.java:84)
12:39:22 [2020-08-12T16:39:22.965Z] 	at org.eclipse.tycho.surefire.osgibooter.OsgiSurefireBooter.run(OsgiSurefireBooter.java:113)
12:39:22 [2020-08-12T16:39:22.965Z] 	at org.eclipse.tycho.surefire.osgibooter.AbstractUITestApplication.runTests(AbstractUITestApplication.java:44)
12:39:22 [2020-08-12T16:39:22.965Z] 	at org.eclipse.e4.ui.internal.workbench.swt.E4Testable$1.run(E4Testable.java:73)
12:39:22 [2020-08-12T16:39:22.965Z] 	at java.lang.Thread.run(Thread.java:748)
12:39:23 [2020-08-12T16:39:23.224Z] 
12:39:23 [2020-08-12T16:39:23.224Z] !ENTRY org.eclipse.egit.ui 4 0 2020-08-12 16:39:23.117
12:39:23 [2020-08-12T16:39:23.224Z] !MESSAGE CrashingCommitMessageProvider fails on purpose.
12:39:23 [2020-08-12T16:39:23.224Z] !STACK 0
12:39:23 [2020-08-12T16:39:23.224Z] java.lang.IllegalStateException: CrashingCommitMessageProvider fails on purpose.
12:39:23 [2020-08-12T16:39:23.224Z] 	at org.eclipse.egit.ui.internal.dialogs.CommitMessageBuilderTest$CrashingCommitMessageProvider.getMessage(CommitMessageBuilderTest.java:474)
12:39:23 [2020-08-12T16:39:23.224Z] 	at org.eclipse.egit.ui.internal.dialogs.CommitMessageBuilder.build(CommitMessageBuilder.java:90)
12:39:23 [2020-08-12T16:39:23.224Z] 	at org.eclipse.egit.ui.internal.dialogs.CommitMessageBuilderTest.commitMessageProvider_multipleProvidersWithCrashAndNull(CommitMessageBuilderTest.java:165)
12:39:23 [2020-08-12T16:39:23.224Z] 	at sun.reflect.NativeMethodAccessorImpl.invoke0(Native Method)
12:39:23 [2020-08-12T16:39:23.224Z] 	at sun.reflect.NativeMethodAccessorImpl.invoke(NativeMethodAccessorImpl.java:62)
12:39:23 [2020-08-12T16:39:23.224Z] 	at sun.reflect.DelegatingMethodAccessorImpl.invoke(DelegatingMethodAccessorImpl.java:43)
12:39:23 [2020-08-12T16:39:23.224Z] 	at java.lang.reflect.Method.invoke(Method.java:498)
12:39:23 [2020-08-12T16:39:23.224Z] 	at org.junit.runners.model.FrameworkMethod$1.runReflectiveCall(FrameworkMethod.java:59)
12:39:23 [2020-08-12T16:39:23.224Z] 	at org.junit.internal.runners.model.ReflectiveCallable.run(ReflectiveCallable.java:12)
12:39:23 [2020-08-12T16:39:23.224Z] 	at org.junit.runners.model.FrameworkMethod.invokeExplosively(FrameworkMethod.java:56)
12:39:23 [2020-08-12T16:39:23.225Z] 	at org.junit.internal.runners.statements.InvokeMethod.evaluate(InvokeMethod.java:17)
12:39:23 [2020-08-12T16:39:23.225Z] 	at org.junit.internal.runners.statements.RunBefores.evaluate(RunBefores.java:26)
12:39:23 [2020-08-12T16:39:23.225Z] 	at org.junit.internal.runners.statements.RunAfters.evaluate(RunAfters.java:27)
12:39:23 [2020-08-12T16:39:23.225Z] 	at org.junit.runners.ParentRunner$3.evaluate(ParentRunner.java:306)
12:39:23 [2020-08-12T16:39:23.225Z] 	at org.junit.runners.BlockJUnit4ClassRunner$1.evaluate(BlockJUnit4ClassRunner.java:100)
12:39:23 [2020-08-12T16:39:23.225Z] 	at org.junit.runners.ParentRunner.runLeaf(ParentRunner.java:366)
12:39:23 [2020-08-12T16:39:23.225Z] 	at org.junit.runners.BlockJUnit4ClassRunner.runChild(BlockJUnit4ClassRunner.java:103)
12:39:23 [2020-08-12T16:39:23.225Z] 	at org.junit.runners.BlockJUnit4ClassRunner.runChild(BlockJUnit4ClassRunner.java:63)
12:39:23 [2020-08-12T16:39:23.225Z] 	at org.junit.runners.ParentRunner$4.run(ParentRunner.java:331)
12:39:23 [2020-08-12T16:39:23.225Z] 	at org.junit.runners.ParentRunner$1.schedule(ParentRunner.java:79)
12:39:23 [2020-08-12T16:39:23.225Z] 	at org.junit.runners.ParentRunner.runChildren(ParentRunner.java:329)
12:39:23 [2020-08-12T16:39:23.225Z] 	at org.junit.runners.ParentRunner.access$100(ParentRunner.java:66)
12:39:23 [2020-08-12T16:39:23.225Z] 	at org.junit.runners.ParentRunner$2.evaluate(ParentRunner.java:293)
12:39:23 [2020-08-12T16:39:23.225Z] 	at org.junit.internal.runners.statements.RunBefores.evaluate(RunBefores.java:26)
12:39:23 [2020-08-12T16:39:23.225Z] 	at org.junit.runners.ParentRunner$3.evaluate(ParentRunner.java:306)
12:39:23 [2020-08-12T16:39:23.225Z] 	at org.junit.runners.ParentRunner.run(ParentRunner.java:413)
12:39:23 [2020-08-12T16:39:23.225Z] 	at org.apache.maven.surefire.junit4.JUnit4Provider.execute(JUnit4Provider.java:365)
12:39:23 [2020-08-12T16:39:23.225Z] 	at org.apache.maven.surefire.junit4.JUnit4Provider.executeWithRerun(JUnit4Provider.java:273)
12:39:23 [2020-08-12T16:39:23.225Z] 	at org.apache.maven.surefire.junit4.JUnit4Provider.executeTestSet(JUnit4Provider.java:238)
12:39:23 [2020-08-12T16:39:23.225Z] 	at org.apache.maven.surefire.junit4.JUnit4Provider.invoke(JUnit4Provider.java:159)
12:39:23 [2020-08-12T16:39:23.225Z] 	at sun.reflect.NativeMethodAccessorImpl.invoke0(Native Method)
12:39:23 [2020-08-12T16:39:23.225Z] 	at sun.reflect.NativeMethodAccessorImpl.invoke(NativeMethodAccessorImpl.java:62)
12:39:23 [2020-08-12T16:39:23.225Z] 	at sun.reflect.DelegatingMethodAccessorImpl.invoke(DelegatingMethodAccessorImpl.java:43)
12:39:23 [2020-08-12T16:39:23.225Z] 	at java.lang.reflect.Method.invoke(Method.java:498)
12:39:23 [2020-08-12T16:39:23.225Z] 	at org.apache.maven.surefire.util.ReflectionUtils.invokeMethodWithArray2(ReflectionUtils.java:206)
12:39:23 [2020-08-12T16:39:23.225Z] 	at org.apache.maven.surefire.booter.ProviderFactory$ProviderProxy.invoke(ProviderFactory.java:161)
12:39:23 [2020-08-12T16:39:23.225Z] 	at org.apache.maven.surefire.booter.ProviderFactory.invokeProvider(ProviderFactory.java:84)
12:39:23 [2020-08-12T16:39:23.225Z] 	at org.eclipse.tycho.surefire.osgibooter.OsgiSurefireBooter.run(OsgiSurefireBooter.java:113)
12:39:23 [2020-08-12T16:39:23.225Z] 	at org.eclipse.tycho.surefire.osgibooter.AbstractUITestApplication.runTests(AbstractUITestApplication.java:44)
12:39:23 [2020-08-12T16:39:23.225Z] 	at org.eclipse.e4.ui.internal.workbench.swt.E4Testable$1.run(E4Testable.java:73)
12:39:23 [2020-08-12T16:39:23.225Z] 	at java.lang.Thread.run(Thread.java:748)
12:39:23 [2020-08-12T16:39:23.225Z] 
12:39:23 [2020-08-12T16:39:23.225Z] !ENTRY org.eclipse.egit.ui 4 0 2020-08-12 16:39:23.118
12:39:23 [2020-08-12T16:39:23.225Z] !MESSAGE CrashingCommitMessageProvider fails on purpose.
12:39:23 [2020-08-12T16:39:23.225Z] !STACK 0
12:39:23 [2020-08-12T16:39:23.225Z] java.lang.IllegalStateException: CrashingCommitMessageProvider fails on purpose.
12:39:23 [2020-08-12T16:39:23.225Z] 	at org.eclipse.egit.ui.internal.dialogs.CommitMessageBuilderTest$CrashingCommitMessageProvider.getMessage(CommitMessageBuilderTest.java:474)
12:39:23 [2020-08-12T16:39:23.225Z] 	at org.eclipse.egit.ui.internal.dialogs.CommitMessageBuilder.build(CommitMessageBuilder.java:90)
12:39:23 [2020-08-12T16:39:23.225Z] 	at org.eclipse.egit.ui.internal.dialogs.CommitMessageBuilderTest.commitMessageProvider_multipleProvidersWithCrashAndNull(CommitMessageBuilderTest.java:165)
12:39:23 [2020-08-12T16:39:23.225Z] 	at sun.reflect.NativeMethodAccessorImpl.invoke0(Native Method)
12:39:23 [2020-08-12T16:39:23.225Z] 	at sun.reflect.NativeMethodAccessorImpl.invoke(NativeMethodAccessorImpl.java:62)
12:39:23 [2020-08-12T16:39:23.225Z] 	at sun.reflect.DelegatingMethodAccessorImpl.invoke(DelegatingMethodAccessorImpl.java:43)
12:39:23 [2020-08-12T16:39:23.225Z] 	at java.lang.reflect.Method.invoke(Method.java:498)
12:39:23 [2020-08-12T16:39:23.225Z] 	at org.junit.runners.model.FrameworkMethod$1.runReflectiveCall(FrameworkMethod.java:59)
12:39:23 [2020-08-12T16:39:23.225Z] 	at org.junit.internal.runners.model.ReflectiveCallable.run(ReflectiveCallable.java:12)
12:39:23 [2020-08-12T16:39:23.225Z] 	at org.junit.runners.model.FrameworkMethod.invokeExplosively(FrameworkMethod.java:56)
12:39:23 [2020-08-12T16:39:23.225Z] 	at org.junit.internal.runners.statements.InvokeMethod.evaluate(InvokeMethod.java:17)
12:39:23 [2020-08-12T16:39:23.225Z] 	at org.junit.internal.runners.statements.RunBefores.evaluate(RunBefores.java:26)
12:39:23 [2020-08-12T16:39:23.225Z] 	at org.junit.internal.runners.statements.RunAfters.evaluate(RunAfters.java:27)
12:39:23 [2020-08-12T16:39:23.225Z] 	at org.junit.runners.ParentRunner$3.evaluate(ParentRunner.java:306)
12:39:23 [2020-08-12T16:39:23.225Z] 	at org.junit.runners.BlockJUnit4ClassRunner$1.evaluate(BlockJUnit4ClassRunner.java:100)
12:39:23 [2020-08-12T16:39:23.225Z] 	at org.junit.runners.ParentRunner.runLeaf(ParentRunner.java:366)
12:39:23 [2020-08-12T16:39:23.225Z] 	at org.junit.runners.BlockJUnit4ClassRunner.runChild(BlockJUnit4ClassRunner.java:103)
12:39:23 [2020-08-12T16:39:23.225Z] 	at org.junit.runners.BlockJUnit4ClassRunner.runChild(BlockJUnit4ClassRunner.java:63)
12:39:23 [2020-08-12T16:39:23.225Z] 	at org.junit.runners.ParentRunner$4.run(ParentRunner.java:331)
12:39:23 [2020-08-12T16:39:23.225Z] 	at org.junit.runners.ParentRunner$1.schedule(ParentRunner.java:79)
12:39:23 [2020-08-12T16:39:23.225Z] 	at org.junit.runners.ParentRunner.runChildren(ParentRunner.java:329)
12:39:23 [2020-08-12T16:39:23.225Z] 	at org.junit.runners.ParentRunner.access$100(ParentRunner.java:66)
12:39:23 [2020-08-12T16:39:23.225Z] 	at org.junit.runners.ParentRunner$2.evaluate(ParentRunner.java:293)
12:39:23 [2020-08-12T16:39:23.225Z] 	at org.junit.internal.runners.statements.RunBefores.evaluate(RunBefores.java:26)
12:39:23 [2020-08-12T16:39:23.225Z] 	at org.junit.runners.ParentRunner$3.evaluate(ParentRunner.java:306)
12:39:23 [2020-08-12T16:39:23.225Z] 	at org.junit.runners.ParentRunner.run(ParentRunner.java:413)
12:39:23 [2020-08-12T16:39:23.225Z] 	at org.apache.maven.surefire.junit4.JUnit4Provider.execute(JUnit4Provider.java:365)
12:39:23 [2020-08-12T16:39:23.225Z] 	at org.apache.maven.surefire.junit4.JUnit4Provider.executeWithRerun(JUnit4Provider.java:273)
12:39:23 [2020-08-12T16:39:23.225Z] 	at org.apache.maven.surefire.junit4.JUnit4Provider.executeTestSet(JUnit4Provider.java:238)
12:39:23 [2020-08-12T16:39:23.225Z] 	at org.apache.maven.surefire.junit4.JUnit4Provider.invoke(JUnit4Provider.java:159)
12:39:23 [2020-08-12T16:39:23.225Z] 	at sun.reflect.NativeMethodAccessorImpl.invoke0(Native Method)
12:39:23 [2020-08-12T16:39:23.225Z] 	at sun.reflect.NativeMethodAccessorImpl.invoke(NativeMethodAccessorImpl.java:62)
12:39:23 [2020-08-12T16:39:23.225Z] 	at sun.reflect.DelegatingMethodAccessorImpl.invoke(DelegatingMethodAccessorImpl.java:43)
12:39:23 [2020-08-12T16:39:23.225Z] 	at java.lang.reflect.Method.invoke(Method.java:498)
12:39:23 [2020-08-12T16:39:23.225Z] 	at org.apache.maven.surefire.util.ReflectionUtils.invokeMethodWithArray2(ReflectionUtils.java:206)
12:39:23 [2020-08-12T16:39:23.225Z] 	at org.apache.maven.surefire.booter.ProviderFactory$ProviderProxy.invoke(ProviderFactory.java:161)
12:39:23 [2020-08-12T16:39:23.225Z] 	at org.apache.maven.surefire.booter.ProviderFactory.invokeProvider(ProviderFactory.java:84)
12:39:23 [2020-08-12T16:39:23.225Z] 	at org.eclipse.tycho.surefire.osgibooter.OsgiSurefireBooter.run(OsgiSurefireBooter.java:113)
12:39:23 [2020-08-12T16:39:23.225Z] 	at org.eclipse.tycho.surefire.osgibooter.AbstractUITestApplication.runTests(AbstractUITestApplication.java:44)
12:39:23 [2020-08-12T16:39:23.225Z] 	at org.eclipse.e4.ui.internal.workbench.swt.E4Testable$1.run(E4Testable.java:73)
12:39:23 [2020-08-12T16:39:23.225Z] 	at java.lang.Thread.run(Thread.java:748)
12:39:23 [2020-08-12T16:39:23.225Z] 
12:39:23 [2020-08-12T16:39:23.225Z] !ENTRY org.eclipse.egit.ui 2 0 2020-08-12 16:39:23.200
12:39:23 [2020-08-12T16:39:23.225Z] !MESSAGE The ICommitMessageProvider2 implementation org.eclipse.egit.ui.internal.dialogs.CommitMessageBuilderTest$3 provided the caret position -42, which exceeds the length of the commit message or is negative. The caret position is ignored.
12:39:25 [2020-08-12T16:39:25.122Z] 
12:39:25 [2020-08-12T16:39:25.122Z] !ENTRY org.eclipse.egit.ui 2 0 2020-08-12 16:39:24.619
12:39:25 [2020-08-12T16:39:25.122Z] !MESSAGE Found multiple implementations of ICommitMessageProvider2. Ignoring caret positioning for org.eclipse.egit.ui.internal.dialogs.CommitMessageBuilderTest$3.
12:39:26 [2020-08-12T16:39:26.054Z] 
12:39:26 [2020-08-12T16:39:26.054Z] !ENTRY org.eclipse.egit.ui 4 0 2020-08-12 16:39:25.984
12:39:26 [2020-08-12T16:39:26.054Z] !MESSAGE CrashingCommitMessageProvider fails on purpose.
12:39:26 [2020-08-12T16:39:26.054Z] !STACK 0
12:39:26 [2020-08-12T16:39:26.054Z] java.lang.IllegalStateException: CrashingCommitMessageProvider fails on purpose.
12:39:26 [2020-08-12T16:39:26.054Z] 	at org.eclipse.egit.ui.internal.dialogs.CommitMessageBuilderTest$CrashingCommitMessageProvider.getMessage(CommitMessageBuilderTest.java:474)
12:39:26 [2020-08-12T16:39:26.054Z] 	at org.eclipse.egit.ui.internal.dialogs.CommitMessageBuilder.build(CommitMessageBuilder.java:90)
12:39:26 [2020-08-12T16:39:26.054Z] 	at org.eclipse.egit.ui.internal.dialogs.CommitMessageBuilderTest.commitMessageProvider_twoProvidersSecondOneCrashing(CommitMessageBuilderTest.java:130)
12:39:26 [2020-08-12T16:39:26.054Z] 	at sun.reflect.NativeMethodAccessorImpl.invoke0(Native Method)
12:39:26 [2020-08-12T16:39:26.054Z] 	at sun.reflect.NativeMethodAccessorImpl.invoke(NativeMethodAccessorImpl.java:62)
12:39:26 [2020-08-12T16:39:26.054Z] 	at sun.reflect.DelegatingMethodAccessorImpl.invoke(DelegatingMethodAccessorImpl.java:43)
12:39:26 [2020-08-12T16:39:26.054Z] 	at java.lang.reflect.Method.invoke(Method.java:498)
12:39:26 [2020-08-12T16:39:26.054Z] 	at org.junit.runners.model.FrameworkMethod$1.runReflectiveCall(FrameworkMethod.java:59)
12:39:26 [2020-08-12T16:39:26.054Z] 	at org.junit.internal.runners.model.ReflectiveCallable.run(ReflectiveCallable.java:12)
12:39:26 [2020-08-12T16:39:26.054Z] 	at org.junit.runners.model.FrameworkMethod.invokeExplosively(FrameworkMethod.java:56)
12:39:26 [2020-08-12T16:39:26.054Z] 	at org.junit.internal.runners.statements.InvokeMethod.evaluate(InvokeMethod.java:17)
12:39:26 [2020-08-12T16:39:26.054Z] 	at org.junit.internal.runners.statements.RunBefores.evaluate(RunBefores.java:26)
12:39:26 [2020-08-12T16:39:26.054Z] 	at org.junit.internal.runners.statements.RunAfters.evaluate(RunAfters.java:27)
12:39:26 [2020-08-12T16:39:26.054Z] 	at org.junit.runners.ParentRunner$3.evaluate(ParentRunner.java:306)
12:39:26 [2020-08-12T16:39:26.054Z] 	at org.junit.runners.BlockJUnit4ClassRunner$1.evaluate(BlockJUnit4ClassRunner.java:100)
12:39:26 [2020-08-12T16:39:26.054Z] 	at org.junit.runners.ParentRunner.runLeaf(ParentRunner.java:366)
12:39:26 [2020-08-12T16:39:26.054Z] 	at org.junit.runners.BlockJUnit4ClassRunner.runChild(BlockJUnit4ClassRunner.java:103)
12:39:26 [2020-08-12T16:39:26.054Z] 	at org.junit.runners.BlockJUnit4ClassRunner.runChild(BlockJUnit4ClassRunner.java:63)
12:39:26 [2020-08-12T16:39:26.054Z] 	at org.junit.runners.ParentRunner$4.run(ParentRunner.java:331)
12:39:26 [2020-08-12T16:39:26.054Z] 	at org.junit.runners.ParentRunner$1.schedule(ParentRunner.java:79)
12:39:26 [2020-08-12T16:39:26.054Z] 	at org.junit.runners.ParentRunner.runChildren(ParentRunner.java:329)
12:39:26 [2020-08-12T16:39:26.054Z] 	at org.junit.runners.ParentRunner.access$100(ParentRunner.java:66)
12:39:26 [2020-08-12T16:39:26.054Z] 	at org.junit.runners.ParentRunner$2.evaluate(ParentRunner.java:293)
12:39:26 [2020-08-12T16:39:26.054Z] 	at org.junit.internal.runners.statements.RunBefores.evaluate(RunBefores.java:26)
12:39:26 [2020-08-12T16:39:26.054Z] 	at org.junit.runners.ParentRunner$3.evaluate(ParentRunner.java:306)
12:39:26 [2020-08-12T16:39:26.054Z] 	at org.junit.runners.ParentRunner.run(ParentRunner.java:413)
12:39:26 [2020-08-12T16:39:26.054Z] 	at org.apache.maven.surefire.junit4.JUnit4Provider.execute(JUnit4Provider.java:365)
12:39:26 [2020-08-12T16:39:26.054Z] 	at org.apache.maven.surefire.junit4.JUnit4Provider.executeWithRerun(JUnit4Provider.java:273)
12:39:26 [2020-08-12T16:39:26.054Z] 	at org.apache.maven.surefire.junit4.JUnit4Provider.executeTestSet(JUnit4Provider.java:238)
12:39:26 [2020-08-12T16:39:26.054Z] 	at org.apache.maven.surefire.junit4.JUnit4Provider.invoke(JUnit4Provider.java:159)
12:39:26 [2020-08-12T16:39:26.054Z] 	at sun.reflect.NativeMethodAccessorImpl.invoke0(Native Method)
12:39:26 [2020-08-12T16:39:26.054Z] 	at sun.reflect.NativeMethodAccessorImpl.invoke(NativeMethodAccessorImpl.java:62)
12:39:26 [2020-08-12T16:39:26.054Z] 	at sun.reflect.DelegatingMethodAccessorImpl.invoke(DelegatingMethodAccessorImpl.java:43)
12:39:26 [2020-08-12T16:39:26.054Z] 	at java.lang.reflect.Method.invoke(Method.java:498)
12:39:26 [2020-08-12T16:39:26.054Z] 	at org.apache.maven.surefire.util.ReflectionUtils.invokeMethodWithArray2(ReflectionUtils.java:206)
12:39:26 [2020-08-12T16:39:26.054Z] 	at org.apache.maven.surefire.booter.ProviderFactory$ProviderProxy.invoke(ProviderFactory.java:161)
12:39:26 [2020-08-12T16:39:26.054Z] 	at org.apache.maven.surefire.booter.ProviderFactory.invokeProvider(ProviderFactory.java:84)
12:39:26 [2020-08-12T16:39:26.054Z] 	at org.eclipse.tycho.surefire.osgibooter.OsgiSurefireBooter.run(OsgiSurefireBooter.java:113)
12:39:26 [2020-08-12T16:39:26.054Z] 	at org.eclipse.tycho.surefire.osgibooter.AbstractUITestApplication.runTests(AbstractUITestApplication.java:44)
12:39:26 [2020-08-12T16:39:26.054Z] 	at org.eclipse.e4.ui.internal.workbench.swt.E4Testable$1.run(E4Testable.java:73)
12:39:26 [2020-08-12T16:39:26.055Z] 	at java.lang.Thread.run(Thread.java:748)
12:39:26 [2020-08-12T16:39:26.312Z] 
12:39:26 [2020-08-12T16:39:26.312Z] !ENTRY org.eclipse.egit.ui 4 0 2020-08-12 16:39:26.069
12:39:26 [2020-08-12T16:39:26.312Z] !MESSAGE CrashingCommitMessageProvider fails on purpose.
12:39:26 [2020-08-12T16:39:26.312Z] !STACK 0
12:39:26 [2020-08-12T16:39:26.312Z] java.lang.IllegalStateException: CrashingCommitMessageProvider fails on purpose.
12:39:26 [2020-08-12T16:39:26.312Z] 	at org.eclipse.egit.ui.internal.dialogs.CommitMessageBuilderTest$CrashingCommitMessageProvider.getMessage(CommitMessageBuilderTest.java:474)
12:39:26 [2020-08-12T16:39:26.312Z] 	at org.eclipse.egit.ui.internal.dialogs.CommitMessageBuilder.build(CommitMessageBuilder.java:90)
12:39:26 [2020-08-12T16:39:26.312Z] 	at org.eclipse.egit.ui.internal.dialogs.CommitMessageBuilderTest.commitMessageProvider_multipleProvidersWithCrashingAndNullAndOneCaretPositioning(CommitMessageBuilderTest.java:414)
12:39:26 [2020-08-12T16:39:26.312Z] 	at sun.reflect.NativeMethodAccessorImpl.invoke0(Native Method)
12:39:26 [2020-08-12T16:39:26.312Z] 	at sun.reflect.NativeMethodAccessorImpl.invoke(NativeMethodAccessorImpl.java:62)
12:39:26 [2020-08-12T16:39:26.312Z] 	at sun.reflect.DelegatingMethodAccessorImpl.invoke(DelegatingMethodAccessorImpl.java:43)
12:39:26 [2020-08-12T16:39:26.312Z] 	at java.lang.reflect.Method.invoke(Method.java:498)
12:39:26 [2020-08-12T16:39:26.312Z] 	at org.junit.runners.model.FrameworkMethod$1.runReflectiveCall(FrameworkMethod.java:59)
12:39:26 [2020-08-12T16:39:26.313Z] 	at org.junit.internal.runners.model.ReflectiveCallable.run(ReflectiveCallable.java:12)
12:39:26 [2020-08-12T16:39:26.313Z] 	at org.junit.runners.model.FrameworkMethod.invokeExplosively(FrameworkMethod.java:56)
12:39:26 [2020-08-12T16:39:26.313Z] 	at org.junit.internal.runners.statements.InvokeMethod.evaluate(InvokeMethod.java:17)
12:39:26 [2020-08-12T16:39:26.313Z] 	at org.junit.internal.runners.statements.RunBefores.evaluate(RunBefores.java:26)
12:39:26 [2020-08-12T16:39:26.313Z] 	at org.junit.internal.runners.statements.RunAfters.evaluate(RunAfters.java:27)
12:39:26 [2020-08-12T16:39:26.313Z] 	at org.junit.runners.ParentRunner$3.evaluate(ParentRunner.java:306)
12:39:26 [2020-08-12T16:39:26.313Z] 	at org.junit.runners.BlockJUnit4ClassRunner$1.evaluate(BlockJUnit4ClassRunner.java:100)
12:39:26 [2020-08-12T16:39:26.313Z] 	at org.junit.runners.ParentRunner.runLeaf(ParentRunner.java:366)
12:39:26 [2020-08-12T16:39:26.313Z] 	at org.junit.runners.BlockJUnit4ClassRunner.runChild(BlockJUnit4ClassRunner.java:103)
12:39:26 [2020-08-12T16:39:26.313Z] 	at org.junit.runners.BlockJUnit4ClassRunner.runChild(BlockJUnit4ClassRunner.java:63)
12:39:26 [2020-08-12T16:39:26.313Z] 	at org.junit.runners.ParentRunner$4.run(ParentRunner.java:331)
12:39:26 [2020-08-12T16:39:26.313Z] 	at org.junit.runners.ParentRunner$1.schedule(ParentRunner.java:79)
12:39:26 [2020-08-12T16:39:26.313Z] 	at org.junit.runners.ParentRunner.runChildren(ParentRunner.java:329)
12:39:26 [2020-08-12T16:39:26.313Z] 	at org.junit.runners.ParentRunner.access$100(ParentRunner.java:66)
12:39:26 [2020-08-12T16:39:26.313Z] 	at org.junit.runners.ParentRunner$2.evaluate(ParentRunner.java:293)
12:39:26 [2020-08-12T16:39:26.313Z] 	at org.junit.internal.runners.statements.RunBefores.evaluate(RunBefores.java:26)
12:39:26 [2020-08-12T16:39:26.313Z] 	at org.junit.runners.ParentRunner$3.evaluate(ParentRunner.java:306)
12:39:26 [2020-08-12T16:39:26.313Z] 	at org.junit.runners.ParentRunner.run(ParentRunner.java:413)
12:39:26 [2020-08-12T16:39:26.313Z] 	at org.apache.maven.surefire.junit4.JUnit4Provider.execute(JUnit4Provider.java:365)
12:39:26 [2020-08-12T16:39:26.313Z] 	at org.apache.maven.surefire.junit4.JUnit4Provider.executeWithRerun(JUnit4Provider.java:273)
12:39:26 [2020-08-12T16:39:26.313Z] 	at org.apache.maven.surefire.junit4.JUnit4Provider.executeTestSet(JUnit4Provider.java:238)
12:39:26 [2020-08-12T16:39:26.313Z] 	at org.apache.maven.surefire.junit4.JUnit4Provider.invoke(JUnit4Provider.java:159)
12:39:26 [2020-08-12T16:39:26.313Z] 	at sun.reflect.NativeMethodAccessorImpl.invoke0(Native Method)
12:39:26 [2020-08-12T16:39:26.313Z] 	at sun.reflect.NativeMethodAccessorImpl.invoke(NativeMethodAccessorImpl.java:62)
12:39:26 [2020-08-12T16:39:26.313Z] 	at sun.reflect.DelegatingMethodAccessorImpl.invoke(DelegatingMethodAccessorImpl.java:43)
12:39:26 [2020-08-12T16:39:26.313Z] 	at java.lang.reflect.Method.invoke(Method.java:498)
12:39:26 [2020-08-12T16:39:26.313Z] 	at org.apache.maven.surefire.util.ReflectionUtils.invokeMethodWithArray2(ReflectionUtils.java:206)
12:39:26 [2020-08-12T16:39:26.313Z] 	at org.apache.maven.surefire.booter.ProviderFactory$ProviderProxy.invoke(ProviderFactory.java:161)
12:39:26 [2020-08-12T16:39:26.313Z] 	at org.apache.maven.surefire.booter.ProviderFactory.invokeProvider(ProviderFactory.java:84)
12:39:26 [2020-08-12T16:39:26.313Z] 	at org.eclipse.tycho.surefire.osgibooter.OsgiSurefireBooter.run(OsgiSurefireBooter.java:113)
12:39:26 [2020-08-12T16:39:26.313Z] 	at org.eclipse.tycho.surefire.osgibooter.AbstractUITestApplication.runTests(AbstractUITestApplication.java:44)
12:39:26 [2020-08-12T16:39:26.313Z] 	at org.eclipse.e4.ui.internal.workbench.swt.E4Testable$1.run(E4Testable.java:73)
12:39:26 [2020-08-12T16:39:26.313Z] 	at java.lang.Thread.run(Thread.java:748)
12:39:26 [2020-08-12T16:39:26.313Z] 
12:39:26 [2020-08-12T16:39:26.313Z] !ENTRY org.eclipse.egit.ui 4 0 2020-08-12 16:39:26.070
12:39:26 [2020-08-12T16:39:26.313Z] !MESSAGE CrashingCommitMessageProvider fails on purpose.
12:39:26 [2020-08-12T16:39:26.313Z] !STACK 0
12:39:26 [2020-08-12T16:39:26.313Z] java.lang.IllegalStateException: CrashingCommitMessageProvider fails on purpose.
12:39:26 [2020-08-12T16:39:26.313Z] 	at org.eclipse.egit.ui.internal.dialogs.CommitMessageBuilderTest$CrashingCommitMessageProvider.getMessage(CommitMessageBuilderTest.java:474)
12:39:26 [2020-08-12T16:39:26.313Z] 	at org.eclipse.egit.ui.internal.dialogs.CommitMessageBuilder.build(CommitMessageBuilder.java:90)
12:39:26 [2020-08-12T16:39:26.313Z] 	at org.eclipse.egit.ui.internal.dialogs.CommitMessageBuilderTest.commitMessageProvider_multipleProvidersWithCrashingAndNullAndOneCaretPositioning(CommitMessageBuilderTest.java:414)
12:39:26 [2020-08-12T16:39:26.313Z] 	at sun.reflect.NativeMethodAccessorImpl.invoke0(Native Method)
12:39:26 [2020-08-12T16:39:26.313Z] 	at sun.reflect.NativeMethodAccessorImpl.invoke(NativeMethodAccessorImpl.java:62)
12:39:26 [2020-08-12T16:39:26.313Z] 	at sun.reflect.DelegatingMethodAccessorImpl.invoke(DelegatingMethodAccessorImpl.java:43)
12:39:26 [2020-08-12T16:39:26.313Z] 	at java.lang.reflect.Method.invoke(Method.java:498)
12:39:26 [2020-08-12T16:39:26.313Z] 	at org.junit.runners.model.FrameworkMethod$1.runReflectiveCall(FrameworkMethod.java:59)
12:39:26 [2020-08-12T16:39:26.313Z] 	at org.junit.internal.runners.model.ReflectiveCallable.run(ReflectiveCallable.java:12)
12:39:26 [2020-08-12T16:39:26.313Z] 	at org.junit.runners.model.FrameworkMethod.invokeExplosively(FrameworkMethod.java:56)
12:39:26 [2020-08-12T16:39:26.313Z] 	at org.junit.internal.runners.statements.InvokeMethod.evaluate(InvokeMethod.java:17)
12:39:26 [2020-08-12T16:39:26.313Z] 	at org.junit.internal.runners.statements.RunBefores.evaluate(RunBefores.java:26)
12:39:26 [2020-08-12T16:39:26.313Z] 	at org.junit.internal.runners.statements.RunAfters.evaluate(RunAfters.java:27)
12:39:26 [2020-08-12T16:39:26.313Z] 	at org.junit.runners.ParentRunner$3.evaluate(ParentRunner.java:306)
12:39:26 [2020-08-12T16:39:26.313Z] 	at org.junit.runners.BlockJUnit4ClassRunner$1.evaluate(BlockJUnit4ClassRunner.java:100)
12:39:26 [2020-08-12T16:39:26.313Z] 	at org.junit.runners.ParentRunner.runLeaf(ParentRunner.java:366)
12:39:26 [2020-08-12T16:39:26.313Z] 	at org.junit.runners.BlockJUnit4ClassRunner.runChild(BlockJUnit4ClassRunner.java:103)
12:39:26 [2020-08-12T16:39:26.313Z] 	at org.junit.runners.BlockJUnit4ClassRunner.runChild(BlockJUnit4ClassRunner.java:63)
12:39:26 [2020-08-12T16:39:26.313Z] 	at org.junit.runners.ParentRunner$4.run(ParentRunner.java:331)
12:39:26 [2020-08-12T16:39:26.313Z] 	at org.junit.runners.ParentRunner$1.schedule(ParentRunner.java:79)
12:39:26 [2020-08-12T16:39:26.313Z] 	at org.junit.runners.ParentRunner.runChildren(ParentRunner.java:329)
12:39:26 [2020-08-12T16:39:26.313Z] 	at org.junit.runners.ParentRunner.access$100(ParentRunner.java:66)
12:39:26 [2020-08-12T16:39:26.313Z] 	at org.junit.runners.ParentRunner$2.evaluate(ParentRunner.java:293)
12:39:26 [2020-08-12T16:39:26.313Z] 	at org.junit.internal.runners.statements.RunBefores.evaluate(RunBefores.java:26)
12:39:26 [2020-08-12T16:39:26.313Z] 	at org.junit.runners.ParentRunner$3.evaluate(ParentRunner.java:306)
12:39:26 [2020-08-12T16:39:26.313Z] 	at org.junit.runners.ParentRunner.run(ParentRunner.java:413)
12:39:26 [2020-08-12T16:39:26.313Z] 	at org.apache.maven.surefire.junit4.JUnit4Provider.execute(JUnit4Provider.java:365)
12:39:26 [2020-08-12T16:39:26.313Z] 	at org.apache.maven.surefire.junit4.JUnit4Provider.executeWithRerun(JUnit4Provider.java:273)
12:39:26 [2020-08-12T16:39:26.313Z] 	at org.apache.maven.surefire.junit4.JUnit4Provider.executeTestSet(JUnit4Provider.java:238)
12:39:26 [2020-08-12T16:39:26.313Z] 	at org.apache.maven.surefire.junit4.JUnit4Provider.invoke(JUnit4Provider.java:159)
12:39:26 [2020-08-12T16:39:26.313Z] 	at sun.reflect.NativeMethodAccessorImpl.invoke0(Native Method)
12:39:26 [2020-08-12T16:39:26.313Z] 	at sun.reflect.NativeMethodAccessorImpl.invoke(NativeMethodAccessorImpl.java:62)
12:39:26 [2020-08-12T16:39:26.313Z] 	at sun.reflect.DelegatingMethodAccessorImpl.invoke(DelegatingMethodAccessorImpl.java:43)
12:39:26 [2020-08-12T16:39:26.313Z] 	at java.lang.reflect.Method.invoke(Method.java:498)
12:39:26 [2020-08-12T16:39:26.313Z] 	at org.apache.maven.surefire.util.ReflectionUtils.invokeMethodWithArray2(ReflectionUtils.java:206)
12:39:26 [2020-08-12T16:39:26.313Z] 	at org.apache.maven.surefire.booter.ProviderFactory$ProviderProxy.invoke(ProviderFactory.java:161)
12:39:26 [2020-08-12T16:39:26.313Z] 	at org.apache.maven.surefire.booter.ProviderFactory.invokeProvider(ProviderFactory.java:84)
12:39:26 [2020-08-12T16:39:26.313Z] 	at org.eclipse.tycho.surefire.osgibooter.OsgiSurefireBooter.run(OsgiSurefireBooter.java:113)
12:39:26 [2020-08-12T16:39:26.313Z] 	at org.eclipse.tycho.surefire.osgibooter.AbstractUITestApplication.runTests(AbstractUITestApplication.java:44)
12:39:26 [2020-08-12T16:39:26.313Z] 	at org.eclipse.e4.ui.internal.workbench.swt.E4Testable$1.run(E4Testable.java:73)
12:39:26 [2020-08-12T16:39:26.313Z] 	at java.lang.Thread.run(Thread.java:748)
12:39:26 [2020-08-12T16:39:26.313Z] 
12:39:26 [2020-08-12T16:39:26.313Z] !ENTRY org.eclipse.egit.ui 2 0 2020-08-12 16:39:26.149
12:39:26 [2020-08-12T16:39:26.313Z] !MESSAGE Found multiple implementations of ICommitMessageProvider2. Ignoring caret positioning for org.eclipse.egit.ui.internal.dialogs.CommitMessageBuilderTest$3.
12:39:26 [2020-08-12T16:39:26.313Z] 
12:39:26 [2020-08-12T16:39:26.313Z] !ENTRY org.eclipse.egit.ui 2 0 2020-08-12 16:39:26.226
12:39:26 [2020-08-12T16:39:26.313Z] !MESSAGE The ICommitMessageProvider2 implementation org.eclipse.egit.ui.internal.dialogs.CommitMessageBuilderTest$3 provided the caret position 14, which exceeds the length of the commit message or is negative. The caret position is ignored.
12:39:26 [2020-08-12T16:39:26.313Z] Tests run: 20, Failures: 0, Errors: 0, Skipped: 0, Time elapsed: 4.71 s - in org.eclipse.egit.ui.internal.dialogs.CommitMessageBuilderTest
12:39:26 [2020-08-12T16:39:26.313Z] commitMessageProvider_oneCrashingProvider(org.eclipse.egit.ui.internal.dialogs.CommitMessageBuilderTest)  Time elapsed: 0.091 s
12:39:26 [2020-08-12T16:39:26.313Z] commitMessageProvider_twoProvidersSecondWithCaretPositioning(org.eclipse.egit.ui.internal.dialogs.CommitMessageBuilderTest)  Time elapsed: 0.087 s
12:39:26 [2020-08-12T16:39:26.313Z] commitMessageProvider_oneCrashingProviderWithCaretPosition(org.eclipse.egit.ui.internal.dialogs.CommitMessageBuilderTest)  Time elapsed: 0.081 s
12:39:26 [2020-08-12T16:39:26.313Z] commitMessageProvider_twoProvidersFirstOneCrashing(org.eclipse.egit.ui.internal.dialogs.CommitMessageBuilderTest)  Time elapsed: 1.088 s
12:39:26 [2020-08-12T16:39:26.313Z] commitMessageProvider_noProvider(org.eclipse.egit.ui.internal.dialogs.CommitMessageBuilderTest)  Time elapsed: 0.086 s
12:39:26 [2020-08-12T16:39:26.313Z] commitMessageProvider_oneProvider(org.eclipse.egit.ui.internal.dialogs.CommitMessageBuilderTest)  Time elapsed: 0.084 s
12:39:26 [2020-08-12T16:39:26.313Z] commitMessageProvider_multipleProvidersWithCrashAndNull(org.eclipse.egit.ui.internal.dialogs.CommitMessageBuilderTest)  Time elapsed: 0.083 s
12:39:26 [2020-08-12T16:39:26.313Z] commitMessageProvider_oneProviderWithInvalidNegativeCaretPosition(org.eclipse.egit.ui.internal.dialogs.CommitMessageBuilderTest)  Time elapsed: 0.082 s
12:39:26 [2020-08-12T16:39:26.313Z] commitMessageProvider_twoProvidersSecondWithUndefinedCaretPosition(org.eclipse.egit.ui.internal.dialogs.CommitMessageBuilderTest)  Time elapsed: 0.089 s
12:39:26 [2020-08-12T16:39:26.313Z] commitMessageProvider_twoProvidersWithCaretPositioningFirstWithUndefinedCaretPosition(org.eclipse.egit.ui.internal.dialogs.CommitMessageBuilderTest)  Time elapsed: 1.085 s
12:39:26 [2020-08-12T16:39:26.313Z] commitMessageProvider_oneProviderWithCaretPositionEqualsMessageLength(org.eclipse.egit.ui.internal.dialogs.CommitMessageBuilderTest)  Time elapsed: 0.085 s
12:39:26 [2020-08-12T16:39:26.313Z] commitMessageProvider_twoProvidersFirstWithCaretPositioning(org.eclipse.egit.ui.internal.dialogs.CommitMessageBuilderTest)  Time elapsed: 0.078 s
12:39:26 [2020-08-12T16:39:26.313Z] commitMessageProvider_twoProvidersWithCaretPositioningSecondWithUndefinedCaretPosition(org.eclipse.egit.ui.internal.dialogs.CommitMessageBuilderTest)  Time elapsed: 0.082 s
12:39:26 [2020-08-12T16:39:26.313Z] commitMessageProvider_oneProviderWithCaretPositioning(org.eclipse.egit.ui.internal.dialogs.CommitMessageBuilderTest)  Time elapsed: 0.08 s
12:39:26 [2020-08-12T16:39:26.313Z] commitMessageProvider_twoProvidersSecondWithCaretPositionZero(org.eclipse.egit.ui.internal.dialogs.CommitMessageBuilderTest)  Time elapsed: 0.105 s
12:39:26 [2020-08-12T16:39:26.313Z] commitMessageProvider_twoProviders(org.eclipse.egit.ui.internal.dialogs.CommitMessageBuilderTest)  Time elapsed: 1.085 s
12:39:26 [2020-08-12T16:39:26.313Z] commitMessageProvider_twoProvidersSecondOneCrashing(org.eclipse.egit.ui.internal.dialogs.CommitMessageBuilderTest)  Time elapsed: 0.095 s
12:39:26 [2020-08-12T16:39:26.314Z] commitMessageProvider_multipleProvidersWithCrashingAndNullAndOneCaretPositioning(org.eclipse.egit.ui.internal.dialogs.CommitMessageBuilderTest)  Time elapsed: 0.085 s
12:39:26 [2020-08-12T16:39:26.314Z] commitMessageProvider_twoProvidersWithCaretPositioning(org.eclipse.egit.ui.internal.dialogs.CommitMessageBuilderTest)  Time elapsed: 0.079 s
12:39:26 [2020-08-12T16:39:26.314Z] commitMessageProvider_oneProviderWithInvalidCaretPositionExceedingMessageLength(org.eclipse.egit.ui.internal.dialogs.CommitMessageBuilderTest)  Time elapsed: 0.078 s
12:39:26 [2020-08-12T16:39:26.314Z] Running org.eclipse.egit.ui.internal.dialogs.SpellcheckableMessageAreaTest
12:39:26 [2020-08-12T16:39:26.314Z] Tests run: 25, Failures: 0, Errors: 0, Skipped: 0, Time elapsed: 0.003 s - in org.eclipse.egit.ui.internal.dialogs.SpellcheckableMessageAreaTest
12:39:26 [2020-08-12T16:39:26.314Z] testWrappingLongWords(org.eclipse.egit.ui.internal.dialogs.SpellcheckableMessageAreaTest)  Time elapsed: 0 s
12:39:26 [2020-08-12T16:39:26.314Z] wrapOnlyCommitMessageBody(org.eclipse.egit.ui.internal.dialogs.SpellcheckableMessageAreaTest)  Time elapsed: 0 s
12:39:26 [2020-08-12T16:39:26.314Z] dontWrapMaximumLengthText(org.eclipse.egit.ui.internal.dialogs.SpellcheckableMessageAreaTest)  Time elapsed: 0 s
12:39:26 [2020-08-12T16:39:26.314Z] keepTrailingSpace(org.eclipse.egit.ui.internal.dialogs.SpellcheckableMessageAreaTest)  Time elapsed: 0 s
12:39:26 [2020-08-12T16:39:26.314Z] dontWrapShortMessage(org.eclipse.egit.ui.internal.dialogs.SpellcheckableMessageAreaTest)  Time elapsed: 0 s
12:39:26 [2020-08-12T16:39:26.314Z] lineAfterWrappedWordShouldNotBeJoined(org.eclipse.egit.ui.internal.dialogs.SpellcheckableMessageAreaTest)  Time elapsed: 0 s
12:39:26 [2020-08-12T16:39:26.314Z] lineAfterWrappedWordShouldNotBeJoined2(org.eclipse.egit.ui.internal.dialogs.SpellcheckableMessageAreaTest)  Time elapsed: 0 s
12:39:26 [2020-08-12T16:39:26.314Z] lineAfterWrappedWordShouldNotBeJoined3(org.eclipse.egit.ui.internal.dialogs.SpellcheckableMessageAreaTest)  Time elapsed: 0 s
12:39:26 [2020-08-12T16:39:26.314Z] dontWrapWordLongerThanOneLine(org.eclipse.egit.ui.internal.dialogs.SpellcheckableMessageAreaTest)  Time elapsed: 0 s
12:39:26 [2020-08-12T16:39:26.314Z] keepExistingNewlines(org.eclipse.egit.ui.internal.dialogs.SpellcheckableMessageAreaTest)  Time elapsed: 0 s
12:39:26 [2020-08-12T16:39:26.314Z] dontWrapShortText(org.eclipse.egit.ui.internal.dialogs.SpellcheckableMessageAreaTest)  Time elapsed: 0.001 s
12:39:26 [2020-08-12T16:39:26.314Z] dontWrapWordLongerThanOneLineAtStart(org.eclipse.egit.ui.internal.dialogs.SpellcheckableMessageAreaTest)  Time elapsed: 0 s
12:39:26 [2020-08-12T16:39:26.314Z] dontWrapAlreadyWrappedText(org.eclipse.egit.ui.internal.dialogs.SpellcheckableMessageAreaTest)  Time elapsed: 0 s
12:39:26 [2020-08-12T16:39:26.314Z] wrapOverlengthText2(org.eclipse.egit.ui.internal.dialogs.SpellcheckableMessageAreaTest)  Time elapsed: 0 s
12:39:26 [2020-08-12T16:39:26.314Z] lineAfterWrappedWordShouldNotBeJoinedIfItStartsWithASymbol(org.eclipse.egit.ui.internal.dialogs.SpellcheckableMessageAreaTest)  Time elapsed: 0 s
12:39:26 [2020-08-12T16:39:26.314Z] wrapAlternatingBlankNonBlank(org.eclipse.egit.ui.internal.dialogs.SpellcheckableMessageAreaTest)  Time elapsed: 0 s
12:39:26 [2020-08-12T16:39:26.314Z] keepWhitespace(org.eclipse.egit.ui.internal.dialogs.SpellcheckableMessageAreaTest)  Time elapsed: 0 s
12:39:26 [2020-08-12T16:39:26.314Z] lineAfterWrappedWordShouldNotBeJoinedIfItsEmpty(org.eclipse.egit.ui.internal.dialogs.SpellcheckableMessageAreaTest)  Time elapsed: 0 s
12:39:26 [2020-08-12T16:39:26.314Z] dontWrapLongCommitMessageFooter(org.eclipse.egit.ui.internal.dialogs.SpellcheckableMessageAreaTest)  Time elapsed: 0 s
12:39:26 [2020-08-12T16:39:26.314Z] lineAfterWrappedLineShouldBeJoinedAndFollowingLineWrappedCorrectly(org.eclipse.egit.ui.internal.dialogs.SpellcheckableMessageAreaTest)  Time elapsed: 0.001 s
12:39:26 [2020-08-12T16:39:26.314Z] wrapOverlengthText(org.eclipse.egit.ui.internal.dialogs.SpellcheckableMessageAreaTest)  Time elapsed: 0 s
12:39:26 [2020-08-12T16:39:26.314Z] dontWrapWordLongerThanOneLineAndKeepSpaceAtFront(org.eclipse.egit.ui.internal.dialogs.SpellcheckableMessageAreaTest)  Time elapsed: 0 s
12:39:26 [2020-08-12T16:39:26.314Z] wrapSecondLongLine(org.eclipse.egit.ui.internal.dialogs.SpellcheckableMessageAreaTest)  Time elapsed: 0 s
12:39:26 [2020-08-12T16:39:26.314Z] wrapOverlengthTextByOne(org.eclipse.egit.ui.internal.dialogs.SpellcheckableMessageAreaTest)  Time elapsed: 0 s
12:39:26 [2020-08-12T16:39:26.314Z] keepNewlineAtEnd(org.eclipse.egit.ui.internal.dialogs.SpellcheckableMessageAreaTest)  Time elapsed: 0 s
12:39:26 [2020-08-12T16:39:26.314Z] Running org.eclipse.egit.ui.internal.dialogs.CommitMessageComponentTest
12:39:26 [2020-08-12T16:39:26.314Z] Tests run: 5, Failures: 0, Errors: 0, Skipped: 0, Time elapsed: 0.001 s - in org.eclipse.egit.ui.internal.dialogs.CommitMessageComponentTest
12:39:26 [2020-08-12T16:39:26.314Z] commitFormat_MultipleLines_notOk2(org.eclipse.egit.ui.internal.dialogs.CommitMessageComponentTest)  Time elapsed: 0 s
12:39:26 [2020-08-12T16:39:26.314Z] commitFormat_simple(org.eclipse.egit.ui.internal.dialogs.CommitMessageComponentTest)  Time elapsed: 0 s
12:39:26 [2020-08-12T16:39:26.314Z] commitFormat_MultipleLines_ok(org.eclipse.egit.ui.internal.dialogs.CommitMessageComponentTest)  Time elapsed: 0 s
12:39:26 [2020-08-12T16:39:26.314Z] commitFormat_trailingWhitespace_ok(org.eclipse.egit.ui.internal.dialogs.CommitMessageComponentTest)  Time elapsed: 0 s
12:39:26 [2020-08-12T16:39:26.314Z] commitFormat_MultipleLines_notOk(org.eclipse.egit.ui.internal.dialogs.CommitMessageComponentTest)  Time elapsed: 0 s
12:39:26 [2020-08-12T16:39:26.314Z] Running org.eclipse.egit.ui.internal.actions.StashesMenuTest
12:39:28 [2020-08-12T16:39:28.851Z] 
12:39:28 [2020-08-12T16:39:28.851Z] (SWT:1664): Gtk-WARNING **: 16:39:28.645: Negative content width -6 (allocation 1, extents 4x3) while allocating gadget (node toolbar, owner GtkToolbar)
12:39:28 [2020-08-12T16:39:28.851Z] 
12:39:28 [2020-08-12T16:39:28.851Z] (SWT:1664): Gtk-WARNING **: 16:39:28.646: Negative content height -3 (allocation 1, extents 2x2) while allocating gadget (node toolbar, owner GtkToolbar)
12:39:28 [2020-08-12T16:39:28.852Z] 
12:39:28 [2020-08-12T16:39:28.852Z] (SWT:1664): Gtk-WARNING **: 16:39:28.646: Negative content width -6 (allocation 1, extents 4x3) while allocating gadget (node toolbar, owner GtkToolbar)
12:39:28 [2020-08-12T16:39:28.852Z] 
12:39:28 [2020-08-12T16:39:28.852Z] (SWT:1664): Gtk-WARNING **: 16:39:28.646: Negative content height -3 (allocation 1, extents 2x2) while allocating gadget (node toolbar, owner GtkToolbar)
12:39:28 [2020-08-12T16:39:28.852Z] 
12:39:28 [2020-08-12T16:39:28.852Z] (SWT:1664): Gtk-WARNING **: 16:39:28.693: Negative content width -6 (allocation 1, extents 4x3) while allocating gadget (node toolbar, owner GtkToolbar)
12:39:28 [2020-08-12T16:39:28.852Z] 
12:39:28 [2020-08-12T16:39:28.852Z] (SWT:1664): Gtk-WARNING **: 16:39:28.705: Negative content width -6 (allocation 1, extents 4x3) while allocating gadget (node toolbar, owner GtkToolbar)
12:39:28 [2020-08-12T16:39:28.852Z] 
12:39:28 [2020-08-12T16:39:28.852Z] (SWT:1664): Gtk-WARNING **: 16:39:28.717: Negative content width -6 (allocation 1, extents 4x3) while allocating gadget (node toolbar, owner GtkToolbar)
12:39:29 [2020-08-12T16:39:29.109Z] Tests run: 2, Failures: 0, Errors: 0, Skipped: 0, Time elapsed: 2.775 s - in org.eclipse.egit.ui.internal.actions.StashesMenuTest
12:39:29 [2020-08-12T16:39:29.109Z] menuWithoutStashes(org.eclipse.egit.ui.internal.actions.StashesMenuTest)  Time elapsed: 1.604 s
12:39:29 [2020-08-12T16:39:29.109Z] stashAndApplyChanges(org.eclipse.egit.ui.internal.actions.StashesMenuTest)  Time elapsed: 1.166 s
12:39:29 [2020-08-12T16:39:29.109Z] Running org.eclipse.egit.ui.internal.actions.LinkedResourcesTest
12:39:30 [2020-08-12T16:39:30.479Z] Tests run: 2, Failures: 0, Errors: 0, Skipped: 0, Time elapsed: 1.292 s - in org.eclipse.egit.ui.internal.actions.LinkedResourcesTest
12:39:30 [2020-08-12T16:39:30.479Z] testSomeActionsWithoutLinkedResources(org.eclipse.egit.ui.internal.actions.LinkedResourcesTest)  Time elapsed: 0.576 s
12:39:30 [2020-08-12T16:39:30.479Z] testNoActionOnLinkedResources(org.eclipse.egit.ui.internal.actions.LinkedResourcesTest)  Time elapsed: 0.711 s
12:39:30 [2020-08-12T16:39:30.479Z] Running org.eclipse.egit.ui.internal.actions.SwitchToMenuTest
12:39:40 [2020-08-12T16:39:40.438Z] 
12:39:40 [2020-08-12T16:39:40.438Z] !ENTRY org.eclipse.egit.core 4 0 2020-08-12 16:39:39.047
12:39:40 [2020-08-12T16:39:40.438Z] !MESSAGE Cannot parse the reflog for HEAD in repository /home/jenkins/agent/workspace/egit/tmp/egit.tmp/e758c456623d4595b454506418aab4ac/LocalRepositoriesTests264_selectionWithCorruptedReflog/FirstRepository/.git
12:39:40 [2020-08-12T16:39:40.438Z] !STACK 0
12:39:40 [2020-08-12T16:39:40.438Z] org.eclipse.jgit.errors.InvalidObjectIdException: Invalid id: INTENTIONALLY CORRUPTED REFLOG. Just som
12:39:40 [2020-08-12T16:39:40.438Z] 	at org.eclipse.jgit.lib.ObjectId.fromHexString(ObjectId.java:217)
12:39:40 [2020-08-12T16:39:40.438Z] 	at org.eclipse.jgit.lib.ObjectId.fromString(ObjectId.java:191)
12:39:40 [2020-08-12T16:39:40.438Z] 	at org.eclipse.jgit.internal.storage.file.ReflogEntryImpl.<init>(ReflogEntryImpl.java:39)
12:39:40 [2020-08-12T16:39:40.439Z] 	at org.eclipse.jgit.internal.storage.file.ReflogReaderImpl.getReverseEntries(ReflogReaderImpl.java:109)
12:39:40 [2020-08-12T16:39:40.439Z] 	at org.eclipse.jgit.internal.storage.file.ReflogReaderImpl.getReverseEntries(ReflogReaderImpl.java:56)
12:39:40 [2020-08-12T16:39:40.439Z] 	at org.eclipse.egit.core.RepositoryUtil.safeReadReflog(RepositoryUtil.java:193)
12:39:40 [2020-08-12T16:39:40.439Z] 	at org.eclipse.egit.ui.internal.actions.SwitchToMenu.getMostActiveBranches(SwitchToMenu.java:465)
12:39:40 [2020-08-12T16:39:40.439Z] 	at org.eclipse.egit.ui.internal.actions.SwitchToMenu.createMostActiveBranchesMenuItems(SwitchToMenu.java:306)
12:39:40 [2020-08-12T16:39:40.439Z] 	at org.eclipse.egit.ui.internal.actions.SwitchToMenu.createDynamicMenu(SwitchToMenu.java:142)
12:39:40 [2020-08-12T16:39:40.439Z] 	at org.eclipse.egit.ui.internal.actions.SwitchToMenu.fill(SwitchToMenu.java:122)
12:39:40 [2020-08-12T16:39:40.439Z] 	at org.eclipse.egit.ui.internal.actions.SwitchToMenuTest$1.run(SwitchToMenuTest.java:310)
12:39:40 [2020-08-12T16:39:40.439Z] 	at org.eclipse.swt.widgets.RunnableLock.run(RunnableLock.java:35)
12:39:40 [2020-08-12T16:39:40.439Z] 	at org.eclipse.swt.widgets.Synchronizer.runAsyncMessages(Synchronizer.java:182)
12:39:40 [2020-08-12T16:39:40.439Z] 	at org.eclipse.swt.widgets.Display.runAsyncMessages(Display.java:4536)
12:39:40 [2020-08-12T16:39:40.439Z] 	at org.eclipse.swt.widgets.Display.readAndDispatch(Display.java:4154)
12:39:40 [2020-08-12T16:39:40.439Z] 	at org.eclipse.e4.ui.internal.workbench.swt.PartRenderingEngine$4.run(PartRenderingEngine.java:1121)
12:39:40 [2020-08-12T16:39:40.439Z] 	at org.eclipse.core.databinding.observable.Realm.runWithDefault(Realm.java:336)
12:39:40 [2020-08-12T16:39:40.439Z] 	at org.eclipse.e4.ui.internal.workbench.swt.PartRenderingEngine.run(PartRenderingEngine.java:1022)
12:39:40 [2020-08-12T16:39:40.439Z] 	at org.eclipse.e4.ui.internal.workbench.E4Workbench.createAndRunUI(E4Workbench.java:150)
12:39:40 [2020-08-12T16:39:40.439Z] 	at org.eclipse.ui.internal.Workbench$5.run(Workbench.java:693)
12:39:40 [2020-08-12T16:39:40.439Z] 	at org.eclipse.core.databinding.observable.Realm.runWithDefault(Realm.java:336)
12:39:40 [2020-08-12T16:39:40.439Z] 	at org.eclipse.ui.internal.Workbench.createAndRunWorkbench(Workbench.java:610)
12:39:40 [2020-08-12T16:39:40.439Z] 	at org.eclipse.ui.PlatformUI.createAndRunWorkbench(PlatformUI.java:148)
12:39:40 [2020-08-12T16:39:40.439Z] 	at org.eclipse.ui.internal.ide.application.IDEApplication.start(IDEApplication.java:138)
12:39:40 [2020-08-12T16:39:40.439Z] 	at org.eclipse.tycho.surefire.osgibooter.UITestApplication.runApplication(UITestApplication.java:31)
12:39:40 [2020-08-12T16:39:40.439Z] 	at org.eclipse.tycho.surefire.osgibooter.AbstractUITestApplication.run(AbstractUITestApplication.java:120)
12:39:40 [2020-08-12T16:39:40.439Z] 	at org.eclipse.tycho.surefire.osgibooter.UITestApplication.start(UITestApplication.java:37)
12:39:40 [2020-08-12T16:39:40.439Z] 	at org.eclipse.equinox.internal.app.EclipseAppHandle.run(EclipseAppHandle.java:196)
12:39:40 [2020-08-12T16:39:40.439Z] 	at org.eclipse.core.runtime.internal.adaptor.EclipseAppLauncher.runApplication(EclipseAppLauncher.java:134)
12:39:40 [2020-08-12T16:39:40.439Z] 	at org.eclipse.core.runtime.internal.adaptor.EclipseAppLauncher.start(EclipseAppLauncher.java:104)
12:39:40 [2020-08-12T16:39:40.439Z] 	at org.eclipse.core.runtime.adaptor.EclipseStarter.run(EclipseStarter.java:388)
12:39:40 [2020-08-12T16:39:40.439Z] 	at org.eclipse.core.runtime.adaptor.EclipseStarter.run(EclipseStarter.java:243)
12:39:40 [2020-08-12T16:39:40.439Z] 	at sun.reflect.NativeMethodAccessorImpl.invoke0(Native Method)
12:39:40 [2020-08-12T16:39:40.439Z] 	at sun.reflect.NativeMethodAccessorImpl.invoke(NativeMethodAccessorImpl.java:62)
12:39:40 [2020-08-12T16:39:40.439Z] 	at sun.reflect.DelegatingMethodAccessorImpl.invoke(DelegatingMethodAccessorImpl.java:43)
12:39:40 [2020-08-12T16:39:40.439Z] 	at java.lang.reflect.Method.invoke(Method.java:498)
12:39:40 [2020-08-12T16:39:40.439Z] 	at org.eclipse.equinox.launcher.Main.invokeFramework(Main.java:673)
12:39:40 [2020-08-12T16:39:40.439Z] 	at org.eclipse.equinox.launcher.Main.basicRun(Main.java:610)
12:39:40 [2020-08-12T16:39:40.439Z] 	at org.eclipse.equinox.launcher.Main.run(Main.java:1519)
12:39:40 [2020-08-12T16:39:40.439Z] 	at org.eclipse.equinox.launcher.Main.main(Main.java:1492)
12:39:40 [2020-08-12T16:39:40.439Z] Caused by: java.lang.ArrayIndexOutOfBoundsException
12:39:40 [2020-08-12T16:39:40.439Z] 	at org.eclipse.jgit.util.RawParseUtils.parseHexInt32(RawParseUtils.java:336)
12:39:40 [2020-08-12T16:39:40.439Z] 	at org.eclipse.jgit.lib.ObjectId.fromHexString(ObjectId.java:210)
12:39:40 [2020-08-12T16:39:40.439Z] 	... 39 more
12:39:40 [2020-08-12T16:39:40.439Z] Tests run: 9, Failures: 0, Errors: 0, Skipped: 0, Time elapsed: 8.863 s - in org.eclipse.egit.ui.internal.actions.SwitchToMenuTest
12:39:40 [2020-08-12T16:39:40.439Z] multipleSelectionWithMultipleRepositoriesAndNoCommonBranches(org.eclipse.egit.ui.internal.actions.SwitchToMenuTest)  Time elapsed: 1.096 s
12:39:40 [2020-08-12T16:39:40.439Z] selectionWithProj1(org.eclipse.egit.ui.internal.actions.SwitchToMenuTest)  Time elapsed: 0.59 s
12:39:40 [2020-08-12T16:39:40.439Z] selectionNotAdaptableToRepository(org.eclipse.egit.ui.internal.actions.SwitchToMenuTest)  Time elapsed: 0.053 s
12:39:40 [2020-08-12T16:39:40.439Z] selectionWithProj1AndReflog(org.eclipse.egit.ui.internal.actions.SwitchToMenuTest)  Time elapsed: 0.616 s
12:39:40 [2020-08-12T16:39:40.439Z] validateMenuEntriesForMultiSelectionWithMultipleRepositories(org.eclipse.egit.ui.internal.actions.SwitchToMenuTest)  Time elapsed: 2.899 s
12:39:40 [2020-08-12T16:39:40.439Z] validateBranchSwitchingForForMultiSelectionWithMultipleRepositories(org.eclipse.egit.ui.internal.actions.SwitchToMenuTest)  Time elapsed: 1.293 s
12:39:40 [2020-08-12T16:39:40.439Z] selectionWithRepositoryHavingOver20Branches(org.eclipse.egit.ui.internal.actions.SwitchToMenuTest)  Time elapsed: 1.627 s
12:39:40 [2020-08-12T16:39:40.439Z] emptySelection(org.eclipse.egit.ui.internal.actions.SwitchToMenuTest)  Time elapsed: 0.054 s
12:39:40 [2020-08-12T16:39:40.439Z] selectionWithCorruptedReflog(org.eclipse.egit.ui.internal.actions.SwitchToMenuTest)  Time elapsed: 0.611 s
12:39:40 [2020-08-12T16:39:40.439Z] Running org.eclipse.egit.ui.internal.submodules.SubmoduleFolderTest
12:39:42 [2020-08-12T16:39:42.968Z] 
12:39:42 [2020-08-12T16:39:42.968Z] (SWT:1664): Gtk-WARNING **: 16:39:42.775: Negative content width -6 (allocation 1, extents 4x3) while allocating gadget (node toolbar, owner GtkToolbar)
12:39:42 [2020-08-12T16:39:42.968Z] 
12:39:42 [2020-08-12T16:39:42.968Z] (SWT:1664): Gtk-WARNING **: 16:39:42.775: Negative content height -3 (allocation 1, extents 2x2) while allocating gadget (node toolbar, owner GtkToolbar)
12:39:42 [2020-08-12T16:39:42.968Z] 
12:39:42 [2020-08-12T16:39:42.968Z] (SWT:1664): Gtk-WARNING **: 16:39:42.775: Negative content width -6 (allocation 1, extents 4x3) while allocating gadget (node toolbar, owner GtkToolbar)
12:39:42 [2020-08-12T16:39:42.968Z] 
12:39:42 [2020-08-12T16:39:42.968Z] (SWT:1664): Gtk-WARNING **: 16:39:42.775: Negative content height -3 (allocation 1, extents 2x2) while allocating gadget (node toolbar, owner GtkToolbar)
12:39:43 [2020-08-12T16:39:43.225Z] 
12:39:43 [2020-08-12T16:39:43.225Z] (SWT:1664): Gtk-WARNING **: 16:39:43.081: Negative content width -6 (allocation 1, extents 4x3) while allocating gadget (node toolbar, owner GtkToolbar)
12:39:43 [2020-08-12T16:39:43.225Z] 
12:39:43 [2020-08-12T16:39:43.225Z] (SWT:1664): Gtk-WARNING **: 16:39:43.084: Negative content width -6 (allocation 1, extents 4x3) while allocating gadget (node toolbar, owner GtkToolbar)
12:39:43 [2020-08-12T16:39:43.225Z] 
12:39:43 [2020-08-12T16:39:43.225Z] (SWT:1664): Gtk-WARNING **: 16:39:43.087: Negative content width -6 (allocation 1, extents 4x3) while allocating gadget (node toolbar, owner GtkToolbar)
12:39:43 [2020-08-12T16:39:43.225Z] 
12:39:43 [2020-08-12T16:39:43.225Z] (SWT:1664): Gtk-WARNING **: 16:39:43.091: Negative content width -6 (allocation 1, extents 4x3) while allocating gadget (node toolbar, owner GtkToolbar)
12:39:43 [2020-08-12T16:39:43.225Z] 
12:39:43 [2020-08-12T16:39:43.225Z] (SWT:1664): Gtk-WARNING **: 16:39:43.107: Negative content width -6 (allocation 1, extents 4x3) while allocating gadget (node toolbar, owner GtkToolbar)
12:39:43 [2020-08-12T16:39:43.225Z] 
12:39:43 [2020-08-12T16:39:43.225Z] (SWT:1664): Gtk-WARNING **: 16:39:43.107: Negative content width -6 (allocation 1, extents 4x3) while allocating gadget (node toolbar, owner GtkToolbar)
12:39:43 [2020-08-12T16:39:43.225Z] 
12:39:43 [2020-08-12T16:39:43.225Z] (SWT:1664): Gtk-WARNING **: 16:39:43.137: Negative content width -6 (allocation 1, extents 4x3) while allocating gadget (node toolbar, owner GtkToolbar)
12:39:43 [2020-08-12T16:39:43.225Z] 
12:39:43 [2020-08-12T16:39:43.225Z] (SWT:1664): Gtk-WARNING **: 16:39:43.138: Negative content width -6 (allocation 1, extents 4x3) while allocating gadget (node toolbar, owner GtkToolbar)
12:39:51 [2020-08-12T16:39:51.326Z] 
12:39:51 [2020-08-12T16:39:51.326Z] (SWT:1664): Gtk-WARNING **: 16:39:49.978: Negative content width -6 (allocation 1, extents 4x3) while allocating gadget (node toolbar, owner GtkToolbar)
12:39:51 [2020-08-12T16:39:51.326Z] 
12:39:51 [2020-08-12T16:39:51.326Z] (SWT:1664): Gtk-WARNING **: 16:39:49.991: Negative content width -6 (allocation 1, extents 4x3) while allocating gadget (node toolbar, owner GtkToolbar)
12:39:51 [2020-08-12T16:39:51.326Z] 
12:39:51 [2020-08-12T16:39:51.326Z] (SWT:1664): Gtk-WARNING **: 16:39:50.027: Negative content width -6 (allocation 1, extents 4x3) while allocating gadget (node toolbar, owner GtkToolbar)
12:39:51 [2020-08-12T16:39:51.326Z] 
12:39:51 [2020-08-12T16:39:51.327Z] (SWT:1664): Gtk-WARNING **: 16:39:50.028: Negative content width -6 (allocation 1, extents 4x3) while allocating gadget (node toolbar, owner GtkToolbar)
12:39:51 [2020-08-12T16:39:51.327Z] 
12:39:51 [2020-08-12T16:39:51.327Z] (SWT:1664): Gtk-CRITICAL **: 16:39:50.050: gtk_box_gadget_distribute: assertion 'size >= 0' failed in GtkScrollbar
12:39:51 [2020-08-12T16:39:51.327Z] 
12:39:51 [2020-08-12T16:39:51.327Z] (SWT:1664): Gtk-CRITICAL **: 16:39:50.063: gtk_box_gadget_distribute: assertion 'size >= 0' failed in GtkScrollbar
12:39:51 [2020-08-12T16:39:51.327Z] 
12:39:51 [2020-08-12T16:39:51.327Z] (SWT:1664): Gtk-CRITICAL **: 16:39:50.078: gtk_box_gadget_distribute: assertion 'size >= 0' failed in GtkScrollbar
12:39:51 [2020-08-12T16:39:51.327Z] 
12:39:51 [2020-08-12T16:39:51.327Z] (SWT:1664): Gtk-CRITICAL **: 16:39:50.095: gtk_box_gadget_distribute: assertion 'size >= 0' failed in GtkScrollbar
12:39:51 [2020-08-12T16:39:51.327Z] 
12:39:51 [2020-08-12T16:39:51.327Z] (SWT:1664): Gtk-CRITICAL **: 16:39:50.111: gtk_box_gadget_distribute: assertion 'size >= 0' failed in GtkScrollbar
12:39:51 [2020-08-12T16:39:51.327Z] 
12:39:51 [2020-08-12T16:39:51.327Z] (SWT:1664): Gtk-CRITICAL **: 16:39:50.128: gtk_box_gadget_distribute: assertion 'size >= 0' failed in GtkScrollbar
12:39:51 [2020-08-12T16:39:51.327Z] 
12:39:51 [2020-08-12T16:39:51.327Z] (SWT:1664): Gtk-CRITICAL **: 16:39:50.145: gtk_box_gadget_distribute: assertion 'size >= 0' failed in GtkScrollbar
12:39:51 [2020-08-12T16:39:51.327Z] 
12:39:51 [2020-08-12T16:39:51.327Z] (SWT:1664): Gtk-WARNING **: 16:39:50.150: Negative content width -6 (allocation 1, extents 4x3) while allocating gadget (node toolbar, owner GtkToolbar)
12:39:51 [2020-08-12T16:39:51.327Z] 
12:39:51 [2020-08-12T16:39:51.327Z] (SWT:1664): Gtk-WARNING **: 16:39:50.158: Negative content width -6 (allocation 1, extents 4x3) while allocating gadget (node toolbar, owner GtkToolbar)
12:39:51 [2020-08-12T16:39:51.327Z] 
12:39:51 [2020-08-12T16:39:51.327Z] (SWT:1664): Gtk-WARNING **: 16:39:50.203: Negative content width -6 (allocation 1, extents 4x3) while allocating gadget (node toolbar, owner GtkToolbar)
12:39:51 [2020-08-12T16:39:51.327Z] 
12:39:51 [2020-08-12T16:39:51.327Z] (SWT:1664): Gtk-CRITICAL **: 16:39:50.206: gtk_box_gadget_distribute: assertion 'size >= 0' failed in GtkScrollbar
12:39:51 [2020-08-12T16:39:51.327Z] 
12:39:51 [2020-08-12T16:39:51.327Z] (SWT:1664): Gtk-WARNING **: 16:39:50.231: Negative content width -6 (allocation 1, extents 4x3) while allocating gadget (node toolbar, owner GtkToolbar)
12:39:55 [2020-08-12T16:39:55.505Z] 
12:39:55 [2020-08-12T16:39:55.505Z] (SWT:1664): Gtk-WARNING **: 16:39:55.160: Negative content width -6 (allocation 1, extents 4x3) while allocating gadget (node toolbar, owner GtkToolbar)
12:39:55 [2020-08-12T16:39:55.505Z] 
12:39:55 [2020-08-12T16:39:55.505Z] (SWT:1664): Gtk-WARNING **: 16:39:55.277: Negative content width -6 (allocation 1, extents 4x3) while allocating gadget (node toolbar, owner GtkToolbar)
12:39:56 [2020-08-12T16:39:56.070Z] 
12:39:56 [2020-08-12T16:39:56.070Z] (SWT:1664): Gtk-WARNING **: 16:39:56.018: Negative content width -6 (allocation 1, extents 4x3) while allocating gadget (node toolbar, owner GtkToolbar)
12:39:56 [2020-08-12T16:39:56.070Z] 
12:39:56 [2020-08-12T16:39:56.070Z] (SWT:1664): Gtk-WARNING **: 16:39:56.055: Negative content width -6 (allocation 1, extents 4x3) while allocating gadget (node toolbar, owner GtkToolbar)
12:40:01 [2020-08-12T16:40:01.331Z] Tests run: 11, Failures: 0, Errors: 0, Skipped: 0, Time elapsed: 21.505 s - in org.eclipse.egit.ui.internal.submodules.SubmoduleFolderTest
12:40:01 [2020-08-12T16:40:01.331Z] testSwitchToMenu(org.eclipse.egit.ui.internal.submodules.SubmoduleFolderTest)  Time elapsed: 2.21 s
12:40:01 [2020-08-12T16:40:01.331Z] compareWithHeadInSubmoduleFolder(org.eclipse.egit.ui.internal.submodules.SubmoduleFolderTest)  Time elapsed: 1.916 s
12:40:01 [2020-08-12T16:40:01.331Z] testStageUnstageInSubRepo(org.eclipse.egit.ui.internal.submodules.SubmoduleFolderTest)  Time elapsed: 3.043 s
12:40:01 [2020-08-12T16:40:01.331Z] testDecoration(org.eclipse.egit.ui.internal.submodules.SubmoduleFolderTest)  Time elapsed: 2.002 s
12:40:01 [2020-08-12T16:40:01.332Z] testHistoryFromProjectExplorerIsFromSubRepository(org.eclipse.egit.ui.internal.submodules.SubmoduleFolderTest)  Time elapsed: 2.024 s
12:40:01 [2020-08-12T16:40:01.332Z] testParentFolderMapsToParentRepo(org.eclipse.egit.ui.internal.submodules.SubmoduleFolderTest)  Time elapsed: 1.579 s
12:40:01 [2020-08-12T16:40:01.332Z] testDisconnect(org.eclipse.egit.ui.internal.submodules.SubmoduleFolderTest)  Time elapsed: 2.018 s
12:40:01 [2020-08-12T16:40:01.332Z] testRepoViewFollowSelection(org.eclipse.egit.ui.internal.submodules.SubmoduleFolderTest)  Time elapsed: 2.202 s
12:40:01 [2020-08-12T16:40:01.332Z] testRepoRemoval(org.eclipse.egit.ui.internal.submodules.SubmoduleFolderTest)  Time elapsed: 1.246 s
12:40:01 [2020-08-12T16:40:01.332Z] testChildProjectMapsToSubRepo(org.eclipse.egit.ui.internal.submodules.SubmoduleFolderTest)  Time elapsed: 1.28 s
12:40:01 [2020-08-12T16:40:01.332Z] testChildFolderMapsToSubRepo(org.eclipse.egit.ui.internal.submodules.SubmoduleFolderTest)  Time elapsed: 1.918 s
12:40:01 [2020-08-12T16:40:01.332Z] Running org.eclipse.egit.ui.internal.synchronize.model.GitModelWorkingFileTest
12:40:03 [2020-08-12T16:40:03.854Z] Tests run: 5, Failures: 0, Errors: 0, Skipped: 0, Time elapsed: 3.066 s - in org.eclipse.egit.ui.internal.synchronize.model.GitModelWorkingFileTest
12:40:03 [2020-08-12T16:40:03.854Z] shouldReturnNotEqualForDifferentLocation(org.eclipse.egit.ui.internal.synchronize.model.GitModelWorkingFileTest)  Time elapsed: 0.591 s
12:40:03 [2020-08-12T16:40:03.854Z] shouldReturnNotEqualWhenComparingWorkingFileAndCacheFile(org.eclipse.egit.ui.internal.synchronize.model.GitModelWorkingFileTest)  Time elapsed: 0.632 s
12:40:03 [2020-08-12T16:40:03.854Z] shouldReturnEqualForSameInstance(org.eclipse.egit.ui.internal.synchronize.model.GitModelWorkingFileTest)  Time elapsed: 0.588 s
12:40:03 [2020-08-12T16:40:03.854Z] shouldReturnNotEqualWhenComparingWorkingFileAndBlob(org.eclipse.egit.ui.internal.synchronize.model.GitModelWorkingFileTest)  Time elapsed: 0.641 s
12:40:03 [2020-08-12T16:40:03.854Z] shouldReturnEqualForSameLocation(org.eclipse.egit.ui.internal.synchronize.model.GitModelWorkingFileTest)  Time elapsed: 0.603 s
12:40:03 [2020-08-12T16:40:03.854Z] Running org.eclipse.egit.ui.internal.synchronize.model.GitModelBlobTest
12:40:11 [2020-08-12T16:40:11.955Z] Tests run: 15, Failures: 0, Errors: 0, Skipped: 2, Time elapsed: 7.884 s - in org.eclipse.egit.ui.internal.synchronize.model.GitModelBlobTest
12:40:11 [2020-08-12T16:40:11.955Z] shouldReturnEqualSameData1(org.eclipse.egit.ui.internal.synchronize.model.GitModelBlobTest) skipped
12:40:11 [2020-08-12T16:40:11.955Z] shouldReturnNotEqualForDifferentLocation(org.eclipse.egit.ui.internal.synchronize.model.GitModelBlobTest)  Time elapsed: 0.591 s
12:40:11 [2020-08-12T16:40:11.955Z] shouldReturnNotEqualForBlobAndCommit(org.eclipse.egit.ui.internal.synchronize.model.GitModelBlobTest)  Time elapsed: 0.582 s
12:40:11 [2020-08-12T16:40:11.955Z] shouldReturnEqualForSameData(org.eclipse.egit.ui.internal.synchronize.model.GitModelBlobTest) skipped
12:40:11 [2020-08-12T16:40:11.955Z] shouldReturnNotEqualForDifferentFiles(org.eclipse.egit.ui.internal.synchronize.model.GitModelBlobTest)  Time elapsed: 0.584 s
12:40:11 [2020-08-12T16:40:11.955Z] shouldReturnNotEqualForBlobAndCacheFile(org.eclipse.egit.ui.internal.synchronize.model.GitModelBlobTest)  Time elapsed: 0.623 s
12:40:11 [2020-08-12T16:40:11.955Z] shouldReturnNotEqualForBlobAndTree(org.eclipse.egit.ui.internal.synchronize.model.GitModelBlobTest)  Time elapsed: 0.606 s
12:40:11 [2020-08-12T16:40:11.955Z] shouldBeSymmetric1(org.eclipse.egit.ui.internal.synchronize.model.GitModelBlobTest)  Time elapsed: 0.589 s
12:40:11 [2020-08-12T16:40:11.955Z] shouldBeSymmetric(org.eclipse.egit.ui.internal.synchronize.model.GitModelBlobTest)  Time elapsed: 0.589 s
12:40:11 [2020-08-12T16:40:11.955Z] shouldReturnEqualForSameInstance(org.eclipse.egit.ui.internal.synchronize.model.GitModelBlobTest)  Time elapsed: 0.595 s
12:40:11 [2020-08-12T16:40:11.955Z] shouldActAsResourceProvider(org.eclipse.egit.ui.internal.synchronize.model.GitModelBlobTest)  Time elapsed: 0.663 s
12:40:11 [2020-08-12T16:40:11.955Z] shouldReturnNotEqualForDifferentBaseObjectId2(org.eclipse.egit.ui.internal.synchronize.model.GitModelBlobTest)  Time elapsed: 0.625 s
12:40:11 [2020-08-12T16:40:11.955Z] shouldReturnNotEqualForDifferentBaseObjectId3(org.eclipse.egit.ui.internal.synchronize.model.GitModelBlobTest)  Time elapsed: 0.595 s
12:40:11 [2020-08-12T16:40:11.955Z] shouldReturnNotEqualForBlobAndWorkingFile(org.eclipse.egit.ui.internal.synchronize.model.GitModelBlobTest)  Time elapsed: 0.619 s
12:40:11 [2020-08-12T16:40:11.955Z] shouldReturnNotEqualForDifferentBaseObjectId(org.eclipse.egit.ui.internal.synchronize.model.GitModelBlobTest)  Time elapsed: 0.595 s
12:40:11 [2020-08-12T16:40:11.955Z] Running org.eclipse.egit.ui.internal.synchronize.model.GitModelCacheFileTest
12:40:15 [2020-08-12T16:40:15.231Z] Tests run: 7, Failures: 0, Errors: 0, Skipped: 2, Time elapsed: 3.302 s - in org.eclipse.egit.ui.internal.synchronize.model.GitModelCacheFileTest
12:40:15 [2020-08-12T16:40:15.231Z] shouldReturnEqualForSameObjectIdsAndLocation(org.eclipse.egit.ui.internal.synchronize.model.GitModelCacheFileTest)  Time elapsed: 0.654 s
12:40:15 [2020-08-12T16:40:15.232Z] shouldReturnNotEqualWhenComparingCacheFileAndBlob(org.eclipse.egit.ui.internal.synchronize.model.GitModelCacheFileTest)  Time elapsed: 0.581 s
12:40:15 [2020-08-12T16:40:15.232Z] shouldReturnNotEqualForDifferentCacheIds(org.eclipse.egit.ui.internal.synchronize.model.GitModelCacheFileTest) skipped
12:40:15 [2020-08-12T16:40:15.232Z] shouldReturnEqualForSameInstance(org.eclipse.egit.ui.internal.synchronize.model.GitModelCacheFileTest)  Time elapsed: 0.784 s
12:40:15 [2020-08-12T16:40:15.232Z] shouldReturnNotEqualWhenComparingCacheFileAndWorkingFile(org.eclipse.egit.ui.internal.synchronize.model.GitModelCacheFileTest)  Time elapsed: 0.604 s
12:40:15 [2020-08-12T16:40:15.232Z] shouldReturnNotEqualForDifferentBaseIds(org.eclipse.egit.ui.internal.synchronize.model.GitModelCacheFileTest)  Time elapsed: 0.667 s
12:40:15 [2020-08-12T16:40:15.232Z] shouldReturnNotEqualForDifferentLocations(org.eclipse.egit.ui.internal.synchronize.model.GitModelCacheFileTest) skipped
12:40:15 [2020-08-12T16:40:15.232Z] Running org.eclipse.egit.ui.internal.synchronize.model.GitModelWorkingTreeTest
12:40:16 [2020-08-12T16:40:16.604Z] Tests run: 2, Failures: 0, Errors: 0, Skipped: 0, Time elapsed: 1.27 s - in org.eclipse.egit.ui.internal.synchronize.model.GitModelWorkingTreeTest
12:40:16 [2020-08-12T16:40:16.604Z] shouldReturnNotEqualsWhenComparingWorkingTreeAndCache(org.eclipse.egit.ui.internal.synchronize.model.GitModelWorkingTreeTest)  Time elapsed: 0.59 s
12:40:16 [2020-08-12T16:40:16.604Z] shouldReturnEqualsForTheSameInstance(org.eclipse.egit.ui.internal.synchronize.model.GitModelWorkingTreeTest)  Time elapsed: 0.675 s
12:40:16 [2020-08-12T16:40:16.604Z] Running org.eclipse.egit.ui.internal.synchronize.model.GitModelCacheTreeTest
12:40:19 [2020-08-12T16:40:19.149Z] Tests run: 4, Failures: 0, Errors: 0, Skipped: 0, Time elapsed: 2.674 s - in org.eclipse.egit.ui.internal.synchronize.model.GitModelCacheTreeTest
12:40:19 [2020-08-12T16:40:19.149Z] shouldReturnEqualForSameData(org.eclipse.egit.ui.internal.synchronize.model.GitModelCacheTreeTest)  Time elapsed: 0.581 s
12:40:19 [2020-08-12T16:40:19.149Z] shouldReturnNotEqualForDifferetnLocation(org.eclipse.egit.ui.internal.synchronize.model.GitModelCacheTreeTest)  Time elapsed: 0.585 s
12:40:19 [2020-08-12T16:40:19.149Z] shouldReturnEqualForSameInstance(org.eclipse.egit.ui.internal.synchronize.model.GitModelCacheTreeTest)  Time elapsed: 0.896 s
12:40:19 [2020-08-12T16:40:19.149Z] shouldReturnNotEqualWhenComparingCacheTreeAndTree(org.eclipse.egit.ui.internal.synchronize.model.GitModelCacheTreeTest)  Time elapsed: 0.602 s
12:40:19 [2020-08-12T16:40:19.149Z] Running org.eclipse.egit.ui.internal.synchronize.model.GitModelRootTest
12:40:20 [2020-08-12T16:40:20.521Z] Tests run: 1, Failures: 0, Errors: 0, Skipped: 0, Time elapsed: 1.42 s - in org.eclipse.egit.ui.internal.synchronize.model.GitModelRootTest
12:40:20 [2020-08-12T16:40:20.521Z] shouldIgnoreEmptyRepositories(org.eclipse.egit.ui.internal.synchronize.model.GitModelRootTest)  Time elapsed: 1.414 s
12:40:20 [2020-08-12T16:40:20.521Z] Running org.eclipse.egit.ui.internal.synchronize.model.GitModelCommitTest
12:40:25 [2020-08-12T16:40:25.777Z] Tests run: 7, Failures: 0, Errors: 0, Skipped: 0, Time elapsed: 5.427 s - in org.eclipse.egit.ui.internal.synchronize.model.GitModelCommitTest
12:40:25 [2020-08-12T16:40:25.777Z] shouldReturnNotEqualForDifferentCommits(org.eclipse.egit.ui.internal.synchronize.model.GitModelCommitTest)  Time elapsed: 0.656 s
12:40:25 [2020-08-12T16:40:25.777Z] shouldReturnNotEqualWhenCommitTreeAndBlob(org.eclipse.egit.ui.internal.synchronize.model.GitModelCommitTest)  Time elapsed: 0.577 s
12:40:25 [2020-08-12T16:40:25.778Z] shouldReturnNotEqualWhenCommitTreeAndTree(org.eclipse.egit.ui.internal.synchronize.model.GitModelCommitTest)  Time elapsed: 0.87 s
12:40:25 [2020-08-12T16:40:25.778Z] shouldReturnNotEqualWhenCommitTreeAndCache(org.eclipse.egit.ui.internal.synchronize.model.GitModelCommitTest)  Time elapsed: 0.619 s
12:40:25 [2020-08-12T16:40:25.778Z] shouldReturnEqualForSameInstance(org.eclipse.egit.ui.internal.synchronize.model.GitModelCommitTest)  Time elapsed: 0.606 s
12:40:25 [2020-08-12T16:40:25.778Z] shouldReturnNotEqualForDifferentParents(org.eclipse.egit.ui.internal.synchronize.model.GitModelCommitTest)  Time elapsed: 1.285 s
12:40:25 [2020-08-12T16:40:25.778Z] shouldReturnEqualForSameCommits(org.eclipse.egit.ui.internal.synchronize.model.GitModelCommitTest)  Time elapsed: 0.796 s
12:40:25 [2020-08-12T16:40:25.778Z] Running org.eclipse.egit.ui.internal.synchronize.model.GitModelRepositoryTest
12:40:28 [2020-08-12T16:40:28.303Z] Tests run: 3, Failures: 0, Errors: 0, Skipped: 0, Time elapsed: 2.447 s - in org.eclipse.egit.ui.internal.synchronize.model.GitModelRepositoryTest
12:40:28 [2020-08-12T16:40:28.303Z] shouldReturnEqual(org.eclipse.egit.ui.internal.synchronize.model.GitModelRepositoryTest)  Time elapsed: 0.995 s
12:40:28 [2020-08-12T16:40:28.303Z] shouldReturnNotEqual(org.eclipse.egit.ui.internal.synchronize.model.GitModelRepositoryTest)  Time elapsed: 0.739 s
12:40:28 [2020-08-12T16:40:28.303Z] shouldReturnEqualForSameInstance(org.eclipse.egit.ui.internal.synchronize.model.GitModelRepositoryTest)  Time elapsed: 0.701 s
12:40:28 [2020-08-12T16:40:28.303Z] Running org.eclipse.egit.ui.internal.synchronize.model.GitModelCacheTest
12:40:33 [2020-08-12T16:40:33.563Z] Tests run: 6, Failures: 0, Errors: 0, Skipped: 0, Time elapsed: 4.877 s - in org.eclipse.egit.ui.internal.synchronize.model.GitModelCacheTest
12:40:33 [2020-08-12T16:40:33.563Z] shouldReturnChildren(org.eclipse.egit.ui.internal.synchronize.model.GitModelCacheTest)  Time elapsed: 0.633 s
12:40:33 [2020-08-12T16:40:33.563Z] shouldReturnNotEqualWhenCacheTreeAndCommit(org.eclipse.egit.ui.internal.synchronize.model.GitModelCacheTest)  Time elapsed: 0.594 s
12:40:33 [2020-08-12T16:40:33.563Z] shouldReturnEqualForSameInstance(org.eclipse.egit.ui.internal.synchronize.model.GitModelCacheTest)  Time elapsed: 1.032 s
12:40:33 [2020-08-12T16:40:33.563Z] shouldReturnEqualForSameCommits(org.eclipse.egit.ui.internal.synchronize.model.GitModelCacheTest)  Time elapsed: 0.593 s
12:40:33 [2020-08-12T16:40:33.563Z] shouldReturnNotEqualWhenComparingCacheAndWorkingTree(org.eclipse.egit.ui.internal.synchronize.model.GitModelCacheTest)  Time elapsed: 0.638 s
12:40:33 [2020-08-12T16:40:33.563Z] shouldReturnNotEqualForDifferentRepositories(org.eclipse.egit.ui.internal.synchronize.model.GitModelCacheTest)  Time elapsed: 1.372 s
12:40:33 [2020-08-12T16:40:33.563Z] Running org.eclipse.egit.ui.internal.synchronize.model.GitModelTreeTest
12:40:36 [2020-08-12T16:40:36.857Z] Tests run: 6, Failures: 0, Errors: 0, Skipped: 0, Time elapsed: 3.57 s - in org.eclipse.egit.ui.internal.synchronize.model.GitModelTreeTest
12:40:36 [2020-08-12T16:40:36.857Z] shouldReturnNotEqualForDifferentLocation(org.eclipse.egit.ui.internal.synchronize.model.GitModelTreeTest)  Time elapsed: 0.567 s
12:40:36 [2020-08-12T16:40:36.857Z] shouldReturnNotEqualForTreeAndCacheTree(org.eclipse.egit.ui.internal.synchronize.model.GitModelTreeTest)  Time elapsed: 0.596 s
12:40:36 [2020-08-12T16:40:36.857Z] shouldReturnNotEqualForTreeAndCommit(org.eclipse.egit.ui.internal.synchronize.model.GitModelTreeTest)  Time elapsed: 0.594 s
12:40:36 [2020-08-12T16:40:36.857Z] shouldReturnEqualForSameBaseCommit(org.eclipse.egit.ui.internal.synchronize.model.GitModelTreeTest)  Time elapsed: 0.632 s
12:40:36 [2020-08-12T16:40:36.857Z] shouldReturnEqualForSameInstance(org.eclipse.egit.ui.internal.synchronize.model.GitModelTreeTest)  Time elapsed: 0.584 s
12:40:36 [2020-08-12T16:40:36.857Z] shouldReturnNotEqualForTreeAndBlob(org.eclipse.egit.ui.internal.synchronize.model.GitModelTreeTest)  Time elapsed: 0.584 s
12:40:36 [2020-08-12T16:40:36.857Z] Running org.eclipse.egit.ui.internal.synchronize.mapping.GitChangeSetSorterTest
12:40:37 [2020-08-12T16:40:37.155Z] Tests run: 23, Failures: 0, Errors: 0, Skipped: 0, Time elapsed: 0.19 s - in org.eclipse.egit.ui.internal.synchronize.mapping.GitChangeSetSorterTest
12:40:37 [2020-08-12T16:40:37.155Z] commitTreeShouldBeLessThanBlob(org.eclipse.egit.ui.internal.synchronize.mapping.GitChangeSetSorterTest)  Time elapsed: 0.021 s
12:40:37 [2020-08-12T16:40:37.155Z] commitTreeShouldBeLessThanTree(org.eclipse.egit.ui.internal.synchronize.mapping.GitChangeSetSorterTest)  Time elapsed: 0.001 s
12:40:37 [2020-08-12T16:40:37.155Z] blobShouldBeGreaterThanTree(org.eclipse.egit.ui.internal.synchronize.mapping.GitChangeSetSorterTest)  Time elapsed: 0 s
12:40:37 [2020-08-12T16:40:37.155Z] cacheTreeShouldBeLessThanCommit(org.eclipse.egit.ui.internal.synchronize.mapping.GitChangeSetSorterTest)  Time elapsed: 0 s
12:40:37 [2020-08-12T16:40:37.155Z] shouldOrderTreesAlphabetically(org.eclipse.egit.ui.internal.synchronize.mapping.GitChangeSetSorterTest)  Time elapsed: 0.164 s
12:40:37 [2020-08-12T16:40:37.155Z] commitTreeShouldBeGreaterThanCache(org.eclipse.egit.ui.internal.synchronize.mapping.GitChangeSetSorterTest)  Time elapsed: 0 s
12:40:37 [2020-08-12T16:40:37.155Z] blobShouldBeGreaterThanWorkingTree(org.eclipse.egit.ui.internal.synchronize.mapping.GitChangeSetSorterTest)  Time elapsed: 0 s
12:40:37 [2020-08-12T16:40:37.155Z] treeShouldBeGreaterThanCache(org.eclipse.egit.ui.internal.synchronize.mapping.GitChangeSetSorterTest)  Time elapsed: 0 s
12:40:37 [2020-08-12T16:40:37.155Z] treeShouldBeGreaterThanCommit(org.eclipse.egit.ui.internal.synchronize.mapping.GitChangeSetSorterTest)  Time elapsed: 0 s
12:40:37 [2020-08-12T16:40:37.155Z] workingTreeShouldBeLessThanCacheTree(org.eclipse.egit.ui.internal.synchronize.mapping.GitChangeSetSorterTest)  Time elapsed: 0 s
12:40:37 [2020-08-12T16:40:37.155Z] treeShouldBeGreaterThanWorkingTree(org.eclipse.egit.ui.internal.synchronize.mapping.GitChangeSetSorterTest)  Time elapsed: 0 s
12:40:37 [2020-08-12T16:40:37.155Z] blobShouldBeGreaterThanCache(org.eclipse.egit.ui.internal.synchronize.mapping.GitChangeSetSorterTest)  Time elapsed: 0 s
12:40:37 [2020-08-12T16:40:37.155Z] cacheTreeShouldBeLessThanBlob(org.eclipse.egit.ui.internal.synchronize.mapping.GitChangeSetSorterTest)  Time elapsed: 0 s
12:40:37 [2020-08-12T16:40:37.155Z] cacheTreeShouldBeLessThanTree(org.eclipse.egit.ui.internal.synchronize.mapping.GitChangeSetSorterTest)  Time elapsed: 0 s
12:40:37 [2020-08-12T16:40:37.155Z] shouldOrderBlobsAlphabetically(org.eclipse.egit.ui.internal.synchronize.mapping.GitChangeSetSorterTest)  Time elapsed: 0.001 s
12:40:37 [2020-08-12T16:40:37.155Z] commitTreeShouldBeGreaterThanWorkingTree(org.eclipse.egit.ui.internal.synchronize.mapping.GitChangeSetSorterTest)  Time elapsed: 0 s
12:40:37 [2020-08-12T16:40:37.155Z] treeShouldBeLessThanBlob(org.eclipse.egit.ui.internal.synchronize.mapping.GitChangeSetSorterTest)  Time elapsed: 0 s
12:40:37 [2020-08-12T16:40:37.155Z] cacheTreeShouldBeGreaterThanWorkingTree(org.eclipse.egit.ui.internal.synchronize.mapping.GitChangeSetSorterTest)  Time elapsed: 0 s
12:40:37 [2020-08-12T16:40:37.155Z] workingTreeShouldBeLessThanBlob(org.eclipse.egit.ui.internal.synchronize.mapping.GitChangeSetSorterTest)  Time elapsed: 0 s
12:40:37 [2020-08-12T16:40:37.155Z] workingTreeShouldBeLessThanTree(org.eclipse.egit.ui.internal.synchronize.mapping.GitChangeSetSorterTest)  Time elapsed: 0 s
12:40:37 [2020-08-12T16:40:37.155Z] shouldOrderCommitsByCommitDate(org.eclipse.egit.ui.internal.synchronize.mapping.GitChangeSetSorterTest)  Time elapsed: 0.002 s
12:40:37 [2020-08-12T16:40:37.155Z] workingTreeShouldBeLessThanCommit(org.eclipse.egit.ui.internal.synchronize.mapping.GitChangeSetSorterTest)  Time elapsed: 0 s
12:40:37 [2020-08-12T16:40:37.155Z] blobShouldBeGreaterThanCommit(org.eclipse.egit.ui.internal.synchronize.mapping.GitChangeSetSorterTest)  Time elapsed: 0 s
12:40:37 [2020-08-12T16:40:37.156Z] Running org.eclipse.egit.ui.internal.CompareUtilsTest
12:40:39 [2020-08-12T16:40:39.679Z] Tests run: 3, Failures: 0, Errors: 0, Skipped: 0, Time elapsed: 2.587 s - in org.eclipse.egit.ui.internal.CompareUtilsTest
12:40:39 [2020-08-12T16:40:39.679Z] testIndexEditWithAttributes(org.eclipse.egit.ui.internal.CompareUtilsTest)  Time elapsed: 1.034 s
12:40:39 [2020-08-12T16:40:39.679Z] testIndexEdit(org.eclipse.egit.ui.internal.CompareUtilsTest)  Time elapsed: 0.845 s
12:40:39 [2020-08-12T16:40:39.679Z] testIndexEditExecutable(org.eclipse.egit.ui.internal.CompareUtilsTest)  Time elapsed: 0.7 s
12:40:39 [2020-08-12T16:40:39.679Z] Running org.eclipse.egit.ui.internal.clone.SmartImportWizardTest
12:40:40 [2020-08-12T16:40:40.611Z] Tests run: 1, Failures: 0, Errors: 0, Skipped: 0, Time elapsed: 0.974 s - in org.eclipse.egit.ui.internal.clone.SmartImportWizardTest
12:40:40 [2020-08-12T16:40:40.611Z] test(org.eclipse.egit.ui.internal.clone.SmartImportWizardTest)  Time elapsed: 0.972 s
12:40:40 [2020-08-12T16:40:40.611Z] Running org.eclipse.egit.ui.internal.push.PushBranchWizardTest
12:40:41 [2020-08-12T16:40:41.177Z] 
12:40:41 [2020-08-12T16:40:41.177Z] (SWT:1664): Gtk-CRITICAL **: 16:40:41.153: gtk_box_gadget_distribute: assertion 'size >= 0' failed in GtkScrollbar
12:40:41 [2020-08-12T16:40:41.177Z] 
12:40:41 [2020-08-12T16:40:41.177Z] (SWT:1664): Gtk-CRITICAL **: 16:40:41.154: gtk_box_gadget_distribute: assertion 'size >= 0' failed in GtkScrollbar
12:40:41 [2020-08-12T16:40:41.177Z] 
12:40:41 [2020-08-12T16:40:41.177Z] (SWT:1664): Gtk-CRITICAL **: 16:40:41.156: gtk_box_gadget_distribute: assertion 'size >= 0' failed in GtkScrollbar
12:40:41 [2020-08-12T16:40:41.177Z] 
12:40:41 [2020-08-12T16:40:41.177Z] (SWT:1664): Gtk-CRITICAL **: 16:40:41.160: gtk_box_gadget_distribute: assertion 'size >= 0' failed in GtkScrollbar
12:40:51 [2020-08-12T16:40:51.137Z] Tests run: 9, Failures: 0, Errors: 0, Skipped: 0, Time elapsed: 9.304 s - in org.eclipse.egit.ui.internal.push.PushBranchWizardTest
12:40:51 [2020-08-12T16:40:51.137Z] pushHeadToExistingRemote(org.eclipse.egit.ui.internal.push.PushBranchWizardTest)  Time elapsed: 0.94 s
12:40:51 [2020-08-12T16:40:51.137Z] pushWithRemoteUpstreamConfiguration(org.eclipse.egit.ui.internal.push.PushBranchWizardTest)  Time elapsed: 1.189 s
12:40:51 [2020-08-12T16:40:51.137Z] pushWithDifferentBranchName(org.eclipse.egit.ui.internal.push.PushBranchWizardTest)  Time elapsed: 1.009 s
12:40:51 [2020-08-12T16:40:51.137Z] pushToExistingRemoteAndSetRebase(org.eclipse.egit.ui.internal.push.PushBranchWizardTest)  Time elapsed: 1.023 s
12:40:51 [2020-08-12T16:40:51.137Z] pushToNewRemote(org.eclipse.egit.ui.internal.push.PushBranchWizardTest)  Time elapsed: 1.057 s
12:40:51 [2020-08-12T16:40:51.137Z] pushToExistingRemoteWithoutConfiguringUpstream(org.eclipse.egit.ui.internal.push.PushBranchWizardTest)  Time elapsed: 0.976 s
12:40:51 [2020-08-12T16:40:51.137Z] pushToExistingRemote(org.eclipse.egit.ui.internal.push.PushBranchWizardTest)  Time elapsed: 1.036 s
12:40:51 [2020-08-12T16:40:51.137Z] pushWhenNoRemoteExistsYet(org.eclipse.egit.ui.internal.push.PushBranchWizardTest)  Time elapsed: 1.043 s
12:40:51 [2020-08-12T16:40:51.137Z] pushWithLocalUpstreamConfiguration(org.eclipse.egit.ui.internal.push.PushBranchWizardTest)  Time elapsed: 1.005 s
12:40:51 [2020-08-12T16:40:51.137Z] Running org.eclipse.egit.ui.internal.push.PushTagsWizardTest
12:40:51 [2020-08-12T16:40:51.137Z] Tests run: 1, Failures: 0, Errors: 0, Skipped: 0, Time elapsed: 0.969 s - in org.eclipse.egit.ui.internal.push.PushTagsWizardTest
12:40:51 [2020-08-12T16:40:51.137Z] pushTag(org.eclipse.egit.ui.internal.push.PushTagsWizardTest)  Time elapsed: 0.965 s
12:40:51 [2020-08-12T16:40:51.137Z] Running org.eclipse.egit.ui.internal.push.PushToUpstreamTest
12:40:53 [2020-08-12T16:40:53.661Z] Tests run: 3, Failures: 0, Errors: 0, Skipped: 0, Time elapsed: 2.823 s - in org.eclipse.egit.ui.internal.push.PushToUpstreamTest
12:40:53 [2020-08-12T16:40:53.661Z] pushWithExistingUpstreamConfiguration(org.eclipse.egit.ui.internal.push.PushToUpstreamTest)  Time elapsed: 1.176 s
12:40:53 [2020-08-12T16:40:53.661Z] pushWithoutConfig(org.eclipse.egit.ui.internal.push.PushToUpstreamTest)  Time elapsed: 0.748 s
12:40:53 [2020-08-12T16:40:53.661Z] pushWithDefaultRemoteWithPushRefSpecs(org.eclipse.egit.ui.internal.push.PushToUpstreamTest)  Time elapsed: 0.889 s
12:40:53 [2020-08-12T16:40:53.661Z] Running org.eclipse.egit.ui.internal.branch.BranchProjectTrackerTest
12:40:55 [2020-08-12T16:40:55.033Z] Tests run: 1, Failures: 0, Errors: 0, Skipped: 0, Time elapsed: 1.225 s - in org.eclipse.egit.ui.internal.branch.BranchProjectTrackerTest
12:40:55 [2020-08-12T16:40:55.033Z] twoProjectsWithOnlyOneOnBranch(org.eclipse.egit.ui.internal.branch.BranchProjectTrackerTest)  Time elapsed: 1.222 s
12:40:55 [2020-08-12T16:40:55.033Z] Running org.eclipse.egit.ui.internal.decorators.DecoratableResourceAdapterTest
12:41:09 [2020-08-12T16:41:09.894Z] Tests run: 13, Failures: 0, Errors: 0, Skipped: 0, Time elapsed: 12.627 s - in org.eclipse.egit.ui.internal.decorators.DecoratableResourceAdapterTest
12:41:09 [2020-08-12T16:41:09.894Z] testDecorationDeletedFile(org.eclipse.egit.ui.internal.decorators.DecoratableResourceAdapterTest)  Time elapsed: 0.976 s
12:41:09 [2020-08-12T16:41:09.894Z] testDecorationModifiedFile(org.eclipse.egit.ui.internal.decorators.DecoratableResourceAdapterTest)  Time elapsed: 1.18 s
12:41:09 [2020-08-12T16:41:09.894Z] testDecorationEmptyProject(org.eclipse.egit.ui.internal.decorators.DecoratableResourceAdapterTest)  Time elapsed: 0.878 s
12:41:09 [2020-08-12T16:41:09.894Z] testDecorationConflictingFile(org.eclipse.egit.ui.internal.decorators.DecoratableResourceAdapterTest)  Time elapsed: 1.087 s
12:41:09 [2020-08-12T16:41:09.894Z] testDecorationNewEmptyFolder(org.eclipse.egit.ui.internal.decorators.DecoratableResourceAdapterTest)  Time elapsed: 1.322 s
12:41:09 [2020-08-12T16:41:09.894Z] testDecorationFolderPrefixOfOtherFolder(org.eclipse.egit.ui.internal.decorators.DecoratableResourceAdapterTest)  Time elapsed: 0.808 s
12:41:09 [2020-08-12T16:41:09.894Z] testDecorationNewFileInOneSubfolder(org.eclipse.egit.ui.internal.decorators.DecoratableResourceAdapterTest)  Time elapsed: 0.795 s
12:41:09 [2020-08-12T16:41:09.894Z] testDecorationNewFile(org.eclipse.egit.ui.internal.decorators.DecoratableResourceAdapterTest)  Time elapsed: 1.005 s
12:41:09 [2020-08-12T16:41:09.895Z] testDecorationNewFileInSubfolder(org.eclipse.egit.ui.internal.decorators.DecoratableResourceAdapterTest)  Time elapsed: 0.804 s
12:41:09 [2020-08-12T16:41:09.895Z] testDecorationCommittedFile(org.eclipse.egit.ui.internal.decorators.DecoratableResourceAdapterTest)  Time elapsed: 0.794 s
12:41:09 [2020-08-12T16:41:09.895Z] testDecorationFileInIgnoredFolder(org.eclipse.egit.ui.internal.decorators.DecoratableResourceAdapterTest)  Time elapsed: 0.976 s
12:41:09 [2020-08-12T16:41:09.895Z] testDecorationIgnoredFile(org.eclipse.egit.ui.internal.decorators.DecoratableResourceAdapterTest)  Time elapsed: 0.988 s
12:41:09 [2020-08-12T16:41:09.895Z] testDecorationAddedFile(org.eclipse.egit.ui.internal.decorators.DecoratableResourceAdapterTest)  Time elapsed: 0.981 s
12:41:09 [2020-08-12T16:41:09.895Z] Running org.eclipse.egit.ui.internal.decorators.DecoratableWorkingSetTest
12:41:14 [2020-08-12T16:41:14.074Z] Tests run: 7, Failures: 0, Errors: 0, Skipped: 0, Time elapsed: 6.692 s - in org.eclipse.egit.ui.internal.decorators.DecoratableWorkingSetTest
12:41:14 [2020-08-12T16:41:14.074Z] testAnyConflictsIsConflicts(org.eclipse.egit.ui.internal.decorators.DecoratableWorkingSetTest)  Time elapsed: 1.457 s
12:41:14 [2020-08-12T16:41:14.074Z] testUntrackedContentIsUndecorated(org.eclipse.egit.ui.internal.decorators.DecoratableWorkingSetTest)  Time elapsed: 0.773 s
12:41:14 [2020-08-12T16:41:14.074Z] testAnyDirtyIsDirty(org.eclipse.egit.ui.internal.decorators.DecoratableWorkingSetTest)  Time elapsed: 0.999 s
12:41:14 [2020-08-12T16:41:14.074Z] testDecorationConflictingOverDirty(org.eclipse.egit.ui.internal.decorators.DecoratableWorkingSetTest)  Time elapsed: 1.081 s
12:41:14 [2020-08-12T16:41:14.074Z] testEmptyWorkingSetIsUndecorated(org.eclipse.egit.ui.internal.decorators.DecoratableWorkingSetTest)  Time elapsed: 0.703 s
12:41:14 [2020-08-12T16:41:14.074Z] testStagingStateHasNoInfluence_Modified(org.eclipse.egit.ui.internal.decorators.DecoratableWorkingSetTest)  Time elapsed: 0.876 s
12:41:14 [2020-08-12T16:41:14.074Z] testAnyTrackedIsTracked(org.eclipse.egit.ui.internal.decorators.DecoratableWorkingSetTest)  Time elapsed: 0.799 s
12:41:14 [2020-08-12T16:41:14.074Z] Running org.eclipse.egit.ui.internal.decorators.DecoratableResourceMappingTest
12:41:24 [2020-08-12T16:41:24.030Z] Tests run: 9, Failures: 0, Errors: 0, Skipped: 0, Time elapsed: 8.254 s - in org.eclipse.egit.ui.internal.decorators.DecoratableResourceMappingTest
12:41:24 [2020-08-12T16:41:24.030Z] testAnyConflictsIsConflicts(org.eclipse.egit.ui.internal.decorators.DecoratableResourceMappingTest)  Time elapsed: 0.879 s
12:41:24 [2020-08-12T16:41:24.030Z] testSameStagingStateIsState_Added(org.eclipse.egit.ui.internal.decorators.DecoratableResourceMappingTest)  Time elapsed: 0.791 s
12:41:24 [2020-08-12T16:41:24.030Z] testAnyDirtyIsDirty(org.eclipse.egit.ui.internal.decorators.DecoratableResourceMappingTest)  Time elapsed: 0.901 s
12:41:24 [2020-08-12T16:41:24.030Z] testMixedStagingStateIsModified_RemovedAdded(org.eclipse.egit.ui.internal.decorators.DecoratableResourceMappingTest)  Time elapsed: 1.09 s
12:41:24 [2020-08-12T16:41:24.030Z] testAllIgnoredIsUnstaged(org.eclipse.egit.ui.internal.decorators.DecoratableResourceMappingTest)  Time elapsed: 1.1 s
12:41:24 [2020-08-12T16:41:24.030Z] testDecorationConflictingOverDirty(org.eclipse.egit.ui.internal.decorators.DecoratableResourceMappingTest)  Time elapsed: 0.997 s
12:41:24 [2020-08-12T16:41:24.030Z] testMixedStagingStateIsModified_AddedNotStaged(org.eclipse.egit.ui.internal.decorators.DecoratableResourceMappingTest)  Time elapsed: 0.86 s
12:41:24 [2020-08-12T16:41:24.030Z] testNewResourceMappingIsUnstaged(org.eclipse.egit.ui.internal.decorators.DecoratableResourceMappingTest)  Time elapsed: 0.798 s
12:41:24 [2020-08-12T16:41:24.030Z] testAnyTrackedIsTracked(org.eclipse.egit.ui.internal.decorators.DecoratableResourceMappingTest)  Time elapsed: 0.801 s
12:41:24 [2020-08-12T16:41:24.030Z] Running org.eclipse.egit.ui.internal.fetch.FetchGerritChangeTest
12:41:24 [2020-08-12T16:41:24.030Z] Tests run: 15, Failures: 0, Errors: 0, Skipped: 0, Time elapsed: 0.004 s - in org.eclipse.egit.ui.internal.fetch.FetchGerritChangeTest
12:41:24 [2020-08-12T16:41:24.030Z] testChangeStringNoDigits(org.eclipse.egit.ui.internal.fetch.FetchGerritChangeTest)  Time elapsed: 0.002 s
12:41:24 [2020-08-12T16:41:24.030Z] testChangeStringOverflow(org.eclipse.egit.ui.internal.fetch.FetchGerritChangeTest)  Time elapsed: 0 s
12:41:24 [2020-08-12T16:41:24.030Z] testChangeStringTwoNumbers(org.eclipse.egit.ui.internal.fetch.FetchGerritChangeTest)  Time elapsed: 0.001 s
12:41:24 [2020-08-12T16:41:24.030Z] testFromRef(org.eclipse.egit.ui.internal.fetch.FetchGerritChangeTest)  Time elapsed: 0 s
12:41:24 [2020-08-12T16:41:24.031Z] testChangeStringNegative(org.eclipse.egit.ui.internal.fetch.FetchGerritChangeTest)  Time elapsed: 0 s
12:41:24 [2020-08-12T16:41:24.031Z] testChangeStringUri(org.eclipse.egit.ui.internal.fetch.FetchGerritChangeTest)  Time elapsed: 0 s
12:41:24 [2020-08-12T16:41:24.031Z] testRefFromChange(org.eclipse.egit.ui.internal.fetch.FetchGerritChangeTest)  Time elapsed: 0 s
12:41:24 [2020-08-12T16:41:24.031Z] testChangeStringUriNonsense(org.eclipse.egit.ui.internal.fetch.FetchGerritChangeTest)  Time elapsed: 0 s
12:41:24 [2020-08-12T16:41:24.031Z] testChangeStringThreeNumbers(org.eclipse.egit.ui.internal.fetch.FetchGerritChangeTest)  Time elapsed: 0 s
12:41:24 [2020-08-12T16:41:24.031Z] testChangeStringMultiline(org.eclipse.egit.ui.internal.fetch.FetchGerritChangeTest)  Time elapsed: 0 s
12:41:24 [2020-08-12T16:41:24.031Z] testChangeStringSingleNumber(org.eclipse.egit.ui.internal.fetch.FetchGerritChangeTest)  Time elapsed: 0 s
12:41:24 [2020-08-12T16:41:24.031Z] testChangeRefs(org.eclipse.egit.ui.internal.fetch.FetchGerritChangeTest)  Time elapsed: 0.001 s
12:41:24 [2020-08-12T16:41:24.031Z] testChangeStringEmpty(org.eclipse.egit.ui.internal.fetch.FetchGerritChangeTest)  Time elapsed: 0 s
12:41:24 [2020-08-12T16:41:24.031Z] testChangeStringNull(org.eclipse.egit.ui.internal.fetch.FetchGerritChangeTest)  Time elapsed: 0 s
12:41:24 [2020-08-12T16:41:24.031Z] testChangeStringZero(org.eclipse.egit.ui.internal.fetch.FetchGerritChangeTest)  Time elapsed: 0 s
12:41:24 [2020-08-12T16:41:24.031Z] Running org.eclipse.egit.ui.submodule.SubmoduleUpdateTest
12:41:24 [2020-08-12T16:41:24.031Z] 
12:41:24 [2020-08-12T16:41:24.031Z] (SWT:1664): Gtk-WARNING **: 16:41:23.179: Negative content width -6 (allocation 1, extents 4x3) while allocating gadget (node toolbar, owner GtkToolbar)
12:41:25 [2020-08-12T16:41:25.952Z] 
12:41:25 [2020-08-12T16:41:25.952Z] (SWT:1664): Gtk-WARNING **: 16:41:25.715: Negative content width -6 (allocation 1, extents 4x3) while allocating gadget (node toolbar, owner GtkToolbar)
12:41:25 [2020-08-12T16:41:25.952Z] Tests run: 1, Failures: 0, Errors: 0, Skipped: 0, Time elapsed: 3.478 s - in org.eclipse.egit.ui.submodule.SubmoduleUpdateTest
12:41:25 [2020-08-12T16:41:25.952Z] updateSubmodule(org.eclipse.egit.ui.submodule.SubmoduleUpdateTest)  Time elapsed: 3.474 s
12:41:25 [2020-08-12T16:41:25.952Z] Running org.eclipse.egit.ui.submodule.SubmoduleAddTest
12:41:26 [2020-08-12T16:41:26.887Z] 
12:41:26 [2020-08-12T16:41:26.887Z] (SWT:1664): Gtk-WARNING **: 16:41:26.567: Negative content width -6 (allocation 1, extents 4x3) while allocating gadget (node toolbar, owner GtkToolbar)
12:41:29 [2020-08-12T16:41:29.412Z] 
12:41:29 [2020-08-12T16:41:29.412Z] (SWT:1664): Gtk-WARNING **: 16:41:29.068: Negative content width -6 (allocation 1, extents 4x3) while allocating gadget (node toolbar, owner GtkToolbar)
12:41:29 [2020-08-12T16:41:29.412Z] Tests run: 1, Failures: 0, Errors: 0, Skipped: 0, Time elapsed: 3.35 s - in org.eclipse.egit.ui.submodule.SubmoduleAddTest
12:41:29 [2020-08-12T16:41:29.412Z] addAtRoot(org.eclipse.egit.ui.submodule.SubmoduleAddTest)  Time elapsed: 3.347 s
12:41:29 [2020-08-12T16:41:29.412Z] Running org.eclipse.egit.ui.submodule.SubmoduleSyncTest
12:41:29 [2020-08-12T16:41:29.977Z] 
12:41:29 [2020-08-12T16:41:29.977Z] (SWT:1664): Gtk-WARNING **: 16:41:29.906: Negative content width -6 (allocation 1, extents 4x3) while allocating gadget (node toolbar, owner GtkToolbar)
12:41:32 [2020-08-12T16:41:32.500Z] 
12:41:32 [2020-08-12T16:41:32.500Z] (SWT:1664): Gtk-WARNING **: 16:41:32.169: Negative content width -6 (allocation 1, extents 4x3) while allocating gadget (node toolbar, owner GtkToolbar)
12:41:32 [2020-08-12T16:41:32.500Z] Tests run: 1, Failures: 0, Errors: 0, Skipped: 0, Time elapsed: 3.099 s - in org.eclipse.egit.ui.submodule.SubmoduleSyncTest
12:41:32 [2020-08-12T16:41:32.500Z] syncSubmodule(org.eclipse.egit.ui.submodule.SubmoduleSyncTest)  Time elapsed: 3.094 s
12:41:32 [2020-08-12T16:41:32.500Z] Running org.eclipse.egit.ui.httpauth.PushTest
12:41:32 [2020-08-12T16:41:32.500Z] 2020-08-12 16:41:32.341:INFO:oejs.Server:WorkbenchTestable: jetty-9.4.30.v20200611; built: 2020-06-16T05:54:33.713Z; git: 271836e4c1f4612f12b7bb13ef5a92a927634b0d; jvm 1.8.0_252-b09
12:41:32 [2020-08-12T16:41:32.500Z] 2020-08-12 16:41:32.342:INFO:oejsh.ContextHandler:WorkbenchTestable: Started o.e.j.s.ServletContextHandler@48c7d35e{/sbasic,null,AVAILABLE}
12:41:32 [2020-08-12T16:41:32.500Z] 2020-08-12 16:41:32.346:INFO:oejs.AbstractConnector:WorkbenchTestable: Started ServerConnector@324e8a09{HTTP/1.1, (http/1.1)}{127.0.0.1:42716}
12:41:32 [2020-08-12T16:41:32.500Z] 2020-08-12 16:41:32.346:INFO:oejs.Server:WorkbenchTestable: Started @738499ms
12:41:33 [2020-08-12T16:41:33.432Z] 
12:41:33 [2020-08-12T16:41:33.432Z] (SWT:1664): Gtk-CRITICAL **: 16:41:33.124: gtk_box_gadget_distribute: assertion 'size >= 0' failed in GtkCheckButton
12:41:33 [2020-08-12T16:41:33.996Z] 2020-08-12 16:41:33.992:INFO:oejs.AbstractConnector:WorkbenchTestable: Stopped ServerConnector@324e8a09{HTTP/1.1, (http/1.1)}{127.0.0.1:0}
12:41:33 [2020-08-12T16:41:33.996Z] 2020-08-12 16:41:33.992:INFO:oejsh.ContextHandler:WorkbenchTestable: Stopped o.e.j.s.ServletContextHandler@48c7d35e{/sbasic,null,UNAVAILABLE}
12:41:34 [2020-08-12T16:41:34.253Z] Tests run: 1, Failures: 0, Errors: 0, Skipped: 0, Time elapsed: 1.721 s - in org.eclipse.egit.ui.httpauth.PushTest
12:41:34 [2020-08-12T16:41:34.253Z] testPush(org.eclipse.egit.ui.httpauth.PushTest)  Time elapsed: 1.721 s
12:41:34 [2020-08-12T16:41:34.253Z] Running org.eclipse.egit.ui.search.CommitSearchDialogTest
12:41:34 [2020-08-12T16:41:34.816Z] 
12:41:34 [2020-08-12T16:41:34.816Z] (SWT:1664): Gtk-WARNING **: 16:41:34.665: Negative content width -6 (allocation 1, extents 4x3) while allocating gadget (node toolbar, owner GtkToolbar)
12:41:34 [2020-08-12T16:41:34.816Z] 
12:41:34 [2020-08-12T16:41:34.816Z] (SWT:1664): Gtk-WARNING **: 16:41:34.678: Negative content width -6 (allocation 1, extents 4x3) while allocating gadget (node toolbar, owner GtkToolbar)
12:41:34 [2020-08-12T16:41:34.816Z] 
12:41:34 [2020-08-12T16:41:34.816Z] (SWT:1664): Gtk-WARNING **: 16:41:34.733: Negative content width -6 (allocation 1, extents 4x3) while allocating gadget (node toolbar, owner GtkToolbar)
12:41:34 [2020-08-12T16:41:34.816Z] 
12:41:34 [2020-08-12T16:41:34.816Z] (SWT:1664): Gtk-WARNING **: 16:41:34.783: Negative content width -6 (allocation 1, extents 4x3) while allocating gadget (node toolbar, owner GtkToolbar)
12:41:35 [2020-08-12T16:41:35.748Z] 
12:41:35 [2020-08-12T16:41:35.748Z] (SWT:1664): Gtk-WARNING **: 16:41:35.425: Negative content width -6 (allocation 1, extents 4x3) while allocating gadget (node toolbar, owner GtkToolbar)
12:41:35 [2020-08-12T16:41:35.748Z] Tests run: 1, Failures: 0, Errors: 0, Skipped: 0, Time elapsed: 1.529 s - in org.eclipse.egit.ui.search.CommitSearchDialogTest
12:41:35 [2020-08-12T16:41:35.748Z] openCommitTabOnSearchDialog(org.eclipse.egit.ui.search.CommitSearchDialogTest)  Time elapsed: 1.527 s
12:41:35 [2020-08-12T16:41:35.748Z] Running org.eclipse.egit.ui.search.CommitSearchQueryTest
12:41:39 [2020-08-12T16:41:39.939Z] Tests run: 7, Failures: 0, Errors: 0, Skipped: 0, Time elapsed: 4.168 s - in org.eclipse.egit.ui.search.CommitSearchQueryTest
12:41:39 [2020-08-12T16:41:39.939Z] testQuery(org.eclipse.egit.ui.search.CommitSearchQueryTest)  Time elapsed: 0.581 s
12:41:39 [2020-08-12T16:41:39.939Z] testMatchMessage(org.eclipse.egit.ui.search.CommitSearchQueryTest)  Time elapsed: 0.592 s
12:41:39 [2020-08-12T16:41:39.939Z] testCaseInsensitive(org.eclipse.egit.ui.search.CommitSearchQueryTest)  Time elapsed: 0.591 s
12:41:39 [2020-08-12T16:41:39.939Z] testMatchCommit(org.eclipse.egit.ui.search.CommitSearchQueryTest)  Time elapsed: 0.584 s
12:41:39 [2020-08-12T16:41:39.939Z] testMatchParent(org.eclipse.egit.ui.search.CommitSearchQueryTest)  Time elapsed: 0.592 s
12:41:39 [2020-08-12T16:41:39.939Z] testMatchTree(org.eclipse.egit.ui.search.CommitSearchQueryTest)  Time elapsed: 0.616 s
12:41:39 [2020-08-12T16:41:39.939Z] testEmptyMatches(org.eclipse.egit.ui.search.CommitSearchQueryTest)  Time elapsed: 0.596 s
12:41:39 [2020-08-12T16:41:39.939Z] Running org.eclipse.egit.ui.gitflow.CommandEnablementTest
12:41:41 [2020-08-12T16:41:41.311Z] 
12:41:41 [2020-08-12T16:41:41.311Z] (SWT:1664): Gtk-WARNING **: 16:41:40.920: Negative content width -6 (allocation 1, extents 4x3) while allocating gadget (node toolbar, owner GtkToolbar)
12:41:41 [2020-08-12T16:41:41.311Z] 
12:41:41 [2020-08-12T16:41:41.311Z] (SWT:1664): Gtk-WARNING **: 16:41:41.072: Negative content width -6 (allocation 1, extents 4x3) while allocating gadget (node toolbar, owner GtkToolbar)
12:41:41 [2020-08-12T16:41:41.311Z] Tests run: 2, Failures: 0, Errors: 0, Skipped: 0, Time elapsed: 1.487 s - in org.eclipse.egit.ui.gitflow.CommandEnablementTest
12:41:41 [2020-08-12T16:41:41.311Z] testPackageExplorerStartFinishEnablement(org.eclipse.egit.ui.gitflow.CommandEnablementTest)  Time elapsed: 0.709 s
12:41:41 [2020-08-12T16:41:41.311Z] testRepositoryViewStartFinishEnablement(org.eclipse.egit.ui.gitflow.CommandEnablementTest)  Time elapsed: 0.773 s
12:41:41 [2020-08-12T16:41:41.311Z] Running org.eclipse.egit.ui.gitflow.FeatureFinishSquashHandlerTest
12:41:41 [2020-08-12T16:41:41.875Z] 
12:41:41 [2020-08-12T16:41:41.875Z] (SWT:1664): Gtk-CRITICAL **: 16:41:41.853: gtk_box_gadget_distribute: assertion 'size >= 0' failed in GtkScrollbar
12:41:42 [2020-08-12T16:41:42.132Z] 
12:41:42 [2020-08-12T16:41:42.132Z] (SWT:1664): Gtk-CRITICAL **: 16:41:41.872: gtk_box_gadget_distribute: assertion 'size >= 0' failed in GtkScrollbar
12:41:42 [2020-08-12T16:41:42.132Z] 
12:41:42 [2020-08-12T16:41:42.132Z] (SWT:1664): Gtk-CRITICAL **: 16:41:41.888: gtk_box_gadget_distribute: assertion 'size >= 0' failed in GtkScrollbar
12:41:42 [2020-08-12T16:41:42.132Z] 
12:41:42 [2020-08-12T16:41:42.132Z] (SWT:1664): Gtk-CRITICAL **: 16:41:41.905: gtk_box_gadget_distribute: assertion 'size >= 0' failed in GtkScrollbar
12:41:42 [2020-08-12T16:41:42.132Z] 
12:41:42 [2020-08-12T16:41:42.132Z] (SWT:1664): Gtk-CRITICAL **: 16:41:41.924: gtk_box_gadget_distribute: assertion 'size >= 0' failed in GtkScrollbar
12:41:42 [2020-08-12T16:41:42.132Z] 
12:41:42 [2020-08-12T16:41:42.132Z] (SWT:1664): Gtk-CRITICAL **: 16:41:41.938: gtk_box_gadget_distribute: assertion 'size >= 0' failed in GtkScrollbar
12:41:42 [2020-08-12T16:41:42.132Z] 
12:41:42 [2020-08-12T16:41:42.132Z] (SWT:1664): Gtk-CRITICAL **: 16:41:41.955: gtk_box_gadget_distribute: assertion 'size >= 0' failed in GtkScrollbar
12:41:42 [2020-08-12T16:41:42.132Z] 
12:41:42 [2020-08-12T16:41:42.132Z] (SWT:1664): Gtk-CRITICAL **: 16:41:41.983: gtk_box_gadget_distribute: assertion 'size >= 0' failed in GtkScrollbar
12:41:42 [2020-08-12T16:41:42.132Z] 
12:41:42 [2020-08-12T16:41:42.132Z] (SWT:1664): Gtk-CRITICAL **: 16:41:41.989: gtk_box_gadget_distribute: assertion 'size >= 0' failed in GtkScrollbar
12:41:42 [2020-08-12T16:41:42.132Z] 
12:41:42 [2020-08-12T16:41:42.132Z] (SWT:1664): Gtk-CRITICAL **: 16:41:42.005: gtk_box_gadget_distribute: assertion 'size >= 0' failed in GtkScrollbar
12:41:42 [2020-08-12T16:41:42.132Z] 
12:41:42 [2020-08-12T16:41:42.132Z] (SWT:1664): Gtk-CRITICAL **: 16:41:42.022: gtk_box_gadget_distribute: assertion 'size >= 0' failed in GtkScrollbar
12:41:42 [2020-08-12T16:41:42.132Z] 
12:41:42 [2020-08-12T16:41:42.132Z] (SWT:1664): Gtk-CRITICAL **: 16:41:42.038: gtk_box_gadget_distribute: assertion 'size >= 0' failed in GtkScrollbar
12:41:42 [2020-08-12T16:41:42.132Z] 
12:41:42 [2020-08-12T16:41:42.132Z] (SWT:1664): Gtk-CRITICAL **: 16:41:42.055: gtk_box_gadget_distribute: assertion 'size >= 0' failed in GtkScrollbar
12:41:42 [2020-08-12T16:41:42.697Z] 
12:41:42 [2020-08-12T16:41:42.697Z] (SWT:1664): Gtk-CRITICAL **: 16:41:42.565: gtk_box_gadget_distribute: assertion 'size >= 0' failed in GtkScrollbar
12:41:43 [2020-08-12T16:41:43.627Z] Tests run: 1, Failures: 0, Errors: 0, Skipped: 0, Time elapsed: 2.079 s - in org.eclipse.egit.ui.gitflow.FeatureFinishSquashHandlerTest
12:41:43 [2020-08-12T16:41:43.627Z] testFeatureFinishSquash(org.eclipse.egit.ui.gitflow.FeatureFinishSquashHandlerTest)  Time elapsed: 2.075 s
12:41:43 [2020-08-12T16:41:43.627Z] Running org.eclipse.egit.ui.gitflow.FeatureStartFinishHandlerTest
12:41:44 [2020-08-12T16:41:44.192Z] 
12:41:44 [2020-08-12T16:41:44.192Z] (SWT:1664): Gtk-CRITICAL **: 16:41:43.933: gtk_box_gadget_distribute: assertion 'size >= 0' failed in GtkScrollbar
12:41:44 [2020-08-12T16:41:44.192Z] 
12:41:44 [2020-08-12T16:41:44.192Z] (SWT:1664): Gtk-CRITICAL **: 16:41:43.947: gtk_box_gadget_distribute: assertion 'size >= 0' failed in GtkScrollbar
12:41:44 [2020-08-12T16:41:44.192Z] 
12:41:44 [2020-08-12T16:41:44.192Z] (SWT:1664): Gtk-CRITICAL **: 16:41:43.964: gtk_box_gadget_distribute: assertion 'size >= 0' failed in GtkScrollbar
12:41:44 [2020-08-12T16:41:44.192Z] 
12:41:44 [2020-08-12T16:41:44.192Z] (SWT:1664): Gtk-CRITICAL **: 16:41:43.981: gtk_box_gadget_distribute: assertion 'size >= 0' failed in GtkScrollbar
12:41:44 [2020-08-12T16:41:44.192Z] 
12:41:44 [2020-08-12T16:41:44.192Z] (SWT:1664): Gtk-CRITICAL **: 16:41:43.997: gtk_box_gadget_distribute: assertion 'size >= 0' failed in GtkScrollbar
12:41:44 [2020-08-12T16:41:44.192Z] 
12:41:44 [2020-08-12T16:41:44.192Z] (SWT:1664): Gtk-CRITICAL **: 16:41:44.014: gtk_box_gadget_distribute: assertion 'size >= 0' failed in GtkScrollbar
12:41:44 [2020-08-12T16:41:44.192Z] 
12:41:44 [2020-08-12T16:41:44.192Z] (SWT:1664): Gtk-CRITICAL **: 16:41:44.031: gtk_box_gadget_distribute: assertion 'size >= 0' failed in GtkScrollbar
12:41:44 [2020-08-12T16:41:44.192Z] 
12:41:44 [2020-08-12T16:41:44.192Z] (SWT:1664): Gtk-CRITICAL **: 16:41:44.048: gtk_box_gadget_distribute: assertion 'size >= 0' failed in GtkScrollbar
12:41:44 [2020-08-12T16:41:44.192Z] 
12:41:44 [2020-08-12T16:41:44.192Z] (SWT:1664): Gtk-CRITICAL **: 16:41:44.064: gtk_box_gadget_distribute: assertion 'size >= 0' failed in GtkScrollbar
12:41:44 [2020-08-12T16:41:44.192Z] 
12:41:44 [2020-08-12T16:41:44.192Z] (SWT:1664): Gtk-CRITICAL **: 16:41:44.081: gtk_box_gadget_distribute: assertion 'size >= 0' failed in GtkScrollbar
12:41:44 [2020-08-12T16:41:44.192Z] 
12:41:44 [2020-08-12T16:41:44.192Z] (SWT:1664): Gtk-CRITICAL **: 16:41:44.098: gtk_box_gadget_distribute: assertion 'size >= 0' failed in GtkScrollbar
12:41:44 [2020-08-12T16:41:44.192Z] 
12:41:44 [2020-08-12T16:41:44.192Z] (SWT:1664): Gtk-CRITICAL **: 16:41:44.114: gtk_box_gadget_distribute: assertion 'size >= 0' failed in GtkScrollbar
12:41:44 [2020-08-12T16:41:44.192Z] 
12:41:44 [2020-08-12T16:41:44.192Z] (SWT:1664): Gtk-CRITICAL **: 16:41:44.131: gtk_box_gadget_distribute: assertion 'size >= 0' failed in GtkScrollbar
12:41:44 [2020-08-12T16:41:44.192Z] 
12:41:44 [2020-08-12T16:41:44.192Z] (SWT:1664): Gtk-CRITICAL **: 16:41:44.147: gtk_box_gadget_distribute: assertion 'size >= 0' failed in GtkScrollbar
12:41:44 [2020-08-12T16:41:44.192Z] 
12:41:44 [2020-08-12T16:41:44.192Z] (SWT:1664): Gtk-CRITICAL **: 16:41:44.163: gtk_box_gadget_distribute: assertion 'size >= 0' failed in GtkScrollbar
12:41:44 [2020-08-12T16:41:44.192Z] 
12:41:44 [2020-08-12T16:41:44.192Z] (SWT:1664): Gtk-CRITICAL **: 16:41:44.181: gtk_box_gadget_distribute: assertion 'size >= 0' failed in GtkScrollbar
12:41:44 [2020-08-12T16:41:44.756Z] 
12:41:44 [2020-08-12T16:41:44.756Z] (SWT:1664): Gtk-CRITICAL **: 16:41:44.693: gtk_box_gadget_distribute: assertion 'size >= 0' failed in GtkScrollbar
12:41:45 [2020-08-12T16:41:45.320Z] Tests run: 1, Failures: 0, Errors: 0, Skipped: 0, Time elapsed: 2.008 s - in org.eclipse.egit.ui.gitflow.FeatureStartFinishHandlerTest
12:41:45 [2020-08-12T16:41:45.320Z] testFeatureStart(org.eclipse.egit.ui.gitflow.FeatureStartFinishHandlerTest)  Time elapsed: 2.002 s
12:41:45 [2020-08-12T16:41:45.321Z] Running org.eclipse.egit.ui.gitflow.FeatureFinishKeepBranchHandlerTest
12:41:46 [2020-08-12T16:41:46.251Z] 
12:41:46 [2020-08-12T16:41:46.251Z] (SWT:1664): Gtk-CRITICAL **: 16:41:45.909: gtk_box_gadget_distribute: assertion 'size >= 0' failed in GtkScrollbar
12:41:46 [2020-08-12T16:41:46.251Z] 
12:41:46 [2020-08-12T16:41:46.251Z] (SWT:1664): Gtk-CRITICAL **: 16:41:45.932: gtk_box_gadget_distribute: assertion 'size >= 0' failed in GtkScrollbar
12:41:46 [2020-08-12T16:41:46.251Z] 
12:41:46 [2020-08-12T16:41:46.251Z] (SWT:1664): Gtk-CRITICAL **: 16:41:45.945: gtk_box_gadget_distribute: assertion 'size >= 0' failed in GtkScrollbar
12:41:46 [2020-08-12T16:41:46.251Z] 
12:41:46 [2020-08-12T16:41:46.251Z] (SWT:1664): Gtk-CRITICAL **: 16:41:45.962: gtk_box_gadget_distribute: assertion 'size >= 0' failed in GtkScrollbar
12:41:46 [2020-08-12T16:41:46.251Z] 
12:41:46 [2020-08-12T16:41:46.251Z] (SWT:1664): Gtk-CRITICAL **: 16:41:45.978: gtk_box_gadget_distribute: assertion 'size >= 0' failed in GtkScrollbar
12:41:46 [2020-08-12T16:41:46.251Z] 
12:41:46 [2020-08-12T16:41:46.251Z] (SWT:1664): Gtk-CRITICAL **: 16:41:45.995: gtk_box_gadget_distribute: assertion 'size >= 0' failed in GtkScrollbar
12:41:46 [2020-08-12T16:41:46.251Z] 
12:41:46 [2020-08-12T16:41:46.251Z] (SWT:1664): Gtk-CRITICAL **: 16:41:46.011: gtk_box_gadget_distribute: assertion 'size >= 0' failed in GtkScrollbar
12:41:46 [2020-08-12T16:41:46.251Z] 
12:41:46 [2020-08-12T16:41:46.251Z] (SWT:1664): Gtk-CRITICAL **: 16:41:46.029: gtk_box_gadget_distribute: assertion 'size >= 0' failed in GtkScrollbar
12:41:46 [2020-08-12T16:41:46.251Z] 
12:41:46 [2020-08-12T16:41:46.251Z] (SWT:1664): Gtk-CRITICAL **: 16:41:46.045: gtk_box_gadget_distribute: assertion 'size >= 0' failed in GtkScrollbar
12:41:46 [2020-08-12T16:41:46.251Z] 
12:41:46 [2020-08-12T16:41:46.251Z] (SWT:1664): Gtk-CRITICAL **: 16:41:46.062: gtk_box_gadget_distribute: assertion 'size >= 0' failed in GtkScrollbar
12:41:46 [2020-08-12T16:41:46.251Z] 
12:41:46 [2020-08-12T16:41:46.251Z] (SWT:1664): Gtk-CRITICAL **: 16:41:46.078: gtk_box_gadget_distribute: assertion 'size >= 0' failed in GtkScrollbar
12:41:46 [2020-08-12T16:41:46.251Z] 
12:41:46 [2020-08-12T16:41:46.251Z] (SWT:1664): Gtk-CRITICAL **: 16:41:46.095: gtk_box_gadget_distribute: assertion 'size >= 0' failed in GtkScrollbar
12:41:46 [2020-08-12T16:41:46.251Z] 
12:41:46 [2020-08-12T16:41:46.251Z] (SWT:1664): Gtk-CRITICAL **: 16:41:46.111: gtk_box_gadget_distribute: assertion 'size >= 0' failed in GtkScrollbar
12:41:46 [2020-08-12T16:41:46.251Z] 
12:41:46 [2020-08-12T16:41:46.251Z] (SWT:1664): Gtk-CRITICAL **: 16:41:46.128: gtk_box_gadget_distribute: assertion 'size >= 0' failed in GtkScrollbar
12:41:46 [2020-08-12T16:41:46.815Z] 
12:41:46 [2020-08-12T16:41:46.815Z] (SWT:1664): Gtk-CRITICAL **: 16:41:46.621: gtk_box_gadget_distribute: assertion 'size >= 0' failed in GtkScrollbar
12:41:47 [2020-08-12T16:41:47.379Z] Tests run: 1, Failures: 0, Errors: 0, Skipped: 0, Time elapsed: 1.972 s - in org.eclipse.egit.ui.gitflow.FeatureFinishKeepBranchHandlerTest
12:41:47 [2020-08-12T16:41:47.379Z] testFeatureFinishKeepBranch(org.eclipse.egit.ui.gitflow.FeatureFinishKeepBranchHandlerTest)  Time elapsed: 1.967 s
12:41:47 [2020-08-12T16:41:47.379Z] Running org.eclipse.egit.ui.gitflow.FeatureRebaseHandlerTest
12:41:48 [2020-08-12T16:41:48.312Z] 
12:41:48 [2020-08-12T16:41:48.312Z] (SWT:1664): Gtk-WARNING **: 16:41:48.059: Negative content width -6 (allocation 1, extents 4x3) while allocating gadget (node toolbar, owner GtkToolbar)
12:41:48 [2020-08-12T16:41:48.312Z] 
12:41:48 [2020-08-12T16:41:48.312Z] (SWT:1664): Gtk-WARNING **: 16:41:48.064: Negative content width -6 (allocation 1, extents 4x3) while allocating gadget (node toolbar, owner GtkToolbar)
12:41:48 [2020-08-12T16:41:48.312Z] 
12:41:48 [2020-08-12T16:41:48.312Z] (SWT:1664): Gtk-WARNING **: 16:41:48.068: Negative content width -6 (allocation 1, extents 4x3) while allocating gadget (node toolbar, owner GtkToolbar)
12:41:48 [2020-08-12T16:41:48.312Z] 
12:41:48 [2020-08-12T16:41:48.312Z] (SWT:1664): Gtk-WARNING **: 16:41:48.069: Negative content width -6 (allocation 1, extents 4x3) while allocating gadget (node toolbar, owner GtkToolbar)
12:41:48 [2020-08-12T16:41:48.312Z] 
12:41:48 [2020-08-12T16:41:48.312Z] (SWT:1664): Gtk-WARNING **: 16:41:48.069: Negative content width -6 (allocation 1, extents 4x3) while allocating gadget (node toolbar, owner GtkToolbar)
12:41:48 [2020-08-12T16:41:48.312Z] 
12:41:48 [2020-08-12T16:41:48.312Z] (SWT:1664): Gtk-WARNING **: 16:41:48.102: Negative content width -6 (allocation 1, extents 4x3) while allocating gadget (node toolbar, owner GtkToolbar)
12:41:48 [2020-08-12T16:41:48.572Z] 
12:41:48 [2020-08-12T16:41:48.572Z] (SWT:1664): Gtk-WARNING **: 16:41:48.533: Negative content height -1 (allocation 1, extents 1x1) while allocating gadget (node scrolledwindow, owner GtkScrolledWindow)
12:41:48 [2020-08-12T16:41:48.572Z] 
12:41:48 [2020-08-12T16:41:48.572Z] (SWT:1664): Gtk-CRITICAL **: 16:41:48.533: gtk_box_gadget_distribute: assertion 'size >= 0' failed in GtkScrollbar
12:41:48 [2020-08-12T16:41:48.835Z] 
12:41:48 [2020-08-12T16:41:48.835Z] (SWT:1664): Gtk-WARNING **: 16:41:48.584: Negative content width -6 (allocation 1, extents 4x3) while allocating gadget (node toolbar, owner GtkToolbar)
12:41:50 [2020-08-12T16:41:50.205Z] 
12:41:50 [2020-08-12T16:41:50.205Z] (SWT:1664): Gtk-WARNING **: 16:41:49.794: Negative content height -1 (allocation 1, extents 1x1) while allocating gadget (node scrolledwindow, owner GtkScrolledWindow)
12:41:50 [2020-08-12T16:41:50.205Z] 
12:41:50 [2020-08-12T16:41:50.205Z] (SWT:1664): Gtk-CRITICAL **: 16:41:49.794: gtk_box_gadget_distribute: assertion 'size >= 0' failed in GtkScrollbar
12:41:50 [2020-08-12T16:41:50.205Z] Tests run: 2, Failures: 0, Errors: 0, Skipped: 0, Time elapsed: 2.669 s - in org.eclipse.egit.ui.gitflow.FeatureRebaseHandlerTest
12:41:50 [2020-08-12T16:41:50.205Z] testRebaseFailOnConflict(org.eclipse.egit.ui.gitflow.FeatureRebaseHandlerTest)  Time elapsed: 1.431 s
12:41:50 [2020-08-12T16:41:50.205Z] testRebaseFailOnDirtyWorkingDirectory(org.eclipse.egit.ui.gitflow.FeatureRebaseHandlerTest)  Time elapsed: 1.231 s
12:41:50 [2020-08-12T16:41:50.205Z] Running org.eclipse.egit.ui.gitflow.InitHandlerTest
12:41:54 [2020-08-12T16:41:54.382Z] Tests run: 3, Failures: 0, Errors: 0, Skipped: 0, Time elapsed: 3.766 s - in org.eclipse.egit.ui.gitflow.InitHandlerTest
12:41:54 [2020-08-12T16:41:54.382Z] testInit(org.eclipse.egit.ui.gitflow.InitHandlerTest)  Time elapsed: 1.138 s
12:41:54 [2020-08-12T16:41:54.382Z] testInitEmptyRepoMissingMaster(org.eclipse.egit.ui.gitflow.InitHandlerTest)  Time elapsed: 1.458 s
12:41:54 [2020-08-12T16:41:54.382Z] testInitMissingMaster(org.eclipse.egit.ui.gitflow.InitHandlerTest)  Time elapsed: 1.162 s
12:41:54 [2020-08-12T16:41:54.382Z] Running org.eclipse.egit.ui.gitflow.FeatureStartCheckoutConflictTest
12:41:54 [2020-08-12T16:41:54.382Z] 
12:41:54 [2020-08-12T16:41:54.382Z] (SWT:1664): Gtk-CRITICAL **: 16:41:54.321: gtk_box_gadget_distribute: assertion 'size >= 0' failed in GtkScrollbar
12:41:54 [2020-08-12T16:41:54.382Z] 
12:41:54 [2020-08-12T16:41:54.382Z] (SWT:1664): Gtk-CRITICAL **: 16:41:54.330: gtk_box_gadget_distribute: assertion 'size >= 0' failed in GtkScrollbar
12:41:54 [2020-08-12T16:41:54.640Z] Tests run: 1, Failures: 0, Errors: 0, Skipped: 0, Time elapsed: 0.79 s - in org.eclipse.egit.ui.gitflow.FeatureStartCheckoutConflictTest
12:41:54 [2020-08-12T16:41:54.640Z] testFeatureStart(org.eclipse.egit.ui.gitflow.FeatureStartCheckoutConflictTest)  Time elapsed: 0.786 s
12:41:54 [2020-08-12T16:41:54.640Z] Running org.eclipse.egit.ui.variables.DynamicVariablesTest
12:41:58 [2020-08-12T16:41:58.823Z] Tests run: 4, Failures: 0, Errors: 0, Skipped: 0, Time elapsed: 4.25 s - in org.eclipse.egit.ui.variables.DynamicVariablesTest
12:41:58 [2020-08-12T16:41:58.823Z] testGitBranch(org.eclipse.egit.ui.variables.DynamicVariablesTest)  Time elapsed: 1.072 s
12:41:58 [2020-08-12T16:41:58.823Z] testGitPath(org.eclipse.egit.ui.variables.DynamicVariablesTest)  Time elapsed: 1.058 s
12:41:58 [2020-08-12T16:41:58.823Z] testGitWorkTree(org.eclipse.egit.ui.variables.DynamicVariablesTest)  Time elapsed: 1.056 s
12:41:58 [2020-08-12T16:41:58.823Z] testGitDir(org.eclipse.egit.ui.variables.DynamicVariablesTest)  Time elapsed: 1.064 s
12:41:58 [2020-08-12T16:41:58.823Z] Running org.eclipse.egit.ui.prefpages.configuration.GlobalConfigurationPageTest
12:41:58 [2020-08-12T16:41:58.823Z] 
12:41:58 [2020-08-12T16:41:58.823Z] !ENTRY org.eclipse.ui 2 2 2020-08-12 16:41:58.753
12:41:58 [2020-08-12T16:41:58.823Z] !MESSAGE Invalid preference category path: org.eclipse.ui.net.NetPreferences (bundle: org.eclipse.jsch.ui, page: org.eclipse.jsch.ui.SSHPreferences)
12:41:58 [2020-08-12T16:41:58.823Z] 
12:41:58 [2020-08-12T16:41:58.823Z] (SWT:1664): Gtk-WARNING **: 16:41:58.766: Negative content width -13 (allocation 5, extents 9x9) while allocating gadget (node entry, owner GtkEntry)
12:41:59 [2020-08-12T16:41:59.080Z] 
12:41:59 [2020-08-12T16:41:59.080Z] (SWT:1664): Gtk-WARNING **: 16:41:58.923: Negative content width -13 (allocation 5, extents 9x9) while allocating gadget (node entry, owner GtkEntry)
12:41:59 [2020-08-12T16:41:59.080Z] 
12:41:59 [2020-08-12T16:41:59.080Z] (SWT:1664): Gtk-WARNING **: 16:41:59.051: Negative content width -13 (allocation 5, extents 9x9) while allocating gadget (node entry, owner GtkEntry)
12:41:59 [2020-08-12T16:41:59.338Z] 
12:41:59 [2020-08-12T16:41:59.338Z] (SWT:1664): Gtk-WARNING **: 16:41:59.170: Negative content width -13 (allocation 5, extents 9x9) while allocating gadget (node entry, owner GtkEntry)
12:41:59 [2020-08-12T16:41:59.338Z] 
12:41:59 [2020-08-12T16:41:59.338Z] (SWT:1664): Gtk-WARNING **: 16:41:59.249: Negative content width -13 (allocation 5, extents 9x9) while allocating gadget (node entry, owner GtkEntry)
12:41:59 [2020-08-12T16:41:59.338Z] 
12:41:59 [2020-08-12T16:41:59.338Z] (SWT:1664): Gtk-WARNING **: 16:41:59.333: Negative content width -13 (allocation 5, extents 9x9) while allocating gadget (node entry, owner GtkEntry)
12:41:59 [2020-08-12T16:41:59.595Z] 
12:41:59 [2020-08-12T16:41:59.595Z] (SWT:1664): Gtk-WARNING **: 16:41:59.452: Negative content width -13 (allocation 5, extents 9x9) while allocating gadget (node entry, owner GtkEntry)
12:41:59 [2020-08-12T16:41:59.595Z] 
12:41:59 [2020-08-12T16:41:59.595Z] (SWT:1664): Gtk-WARNING **: 16:41:59.501: Negative content width -6 (allocation 1, extents 4x3) while allocating gadget (node toolbar, owner GtkToolbar)
12:41:59 [2020-08-12T16:41:59.595Z] 
12:41:59 [2020-08-12T16:41:59.595Z] (SWT:1664): Gtk-WARNING **: 16:41:59.501: Negative content height -3 (allocation 1, extents 2x2) while allocating gadget (node toolbar, owner GtkToolbar)
12:41:59 [2020-08-12T16:41:59.595Z] 
12:41:59 [2020-08-12T16:41:59.595Z] (SWT:1664): Gtk-WARNING **: 16:41:59.501: Negative content width -6 (allocation 1, extents 4x3) while allocating gadget (node toolbar, owner GtkToolbar)
12:41:59 [2020-08-12T16:41:59.595Z] 
12:41:59 [2020-08-12T16:41:59.595Z] (SWT:1664): Gtk-WARNING **: 16:41:59.501: Negative content height -3 (allocation 1, extents 2x2) while allocating gadget (node toolbar, owner GtkToolbar)
12:41:59 [2020-08-12T16:41:59.852Z] 
12:41:59 [2020-08-12T16:41:59.852Z] (SWT:1664): Gtk-WARNING **: 16:41:59.599: Negative content width -13 (allocation 5, extents 9x9) while allocating gadget (node entry, owner GtkEntry)
12:41:59 [2020-08-12T16:41:59.852Z] 
12:41:59 [2020-08-12T16:41:59.852Z] (SWT:1664): Gtk-WARNING **: 16:41:59.713: Negative content width -13 (allocation 5, extents 9x9) while allocating gadget (node entry, owner GtkEntry)
12:42:00 [2020-08-12T16:42:00.109Z] 
12:42:00 [2020-08-12T16:42:00.109Z] (SWT:1664): Gtk-WARNING **: 16:41:59.852: Negative content width -13 (allocation 5, extents 9x9) while allocating gadget (node entry, owner GtkEntry)
12:42:00 [2020-08-12T16:42:00.109Z] 
12:42:00 [2020-08-12T16:42:00.109Z] (SWT:1664): Gtk-WARNING **: 16:41:59.953: Negative content width -13 (allocation 5, extents 9x9) while allocating gadget (node entry, owner GtkEntry)
12:42:00 [2020-08-12T16:42:00.109Z] 
12:42:00 [2020-08-12T16:42:00.109Z] (SWT:1664): Gtk-WARNING **: 16:42:00.057: Negative content width -13 (allocation 5, extents 9x9) while allocating gadget (node entry, owner GtkEntry)
12:42:00 [2020-08-12T16:42:00.366Z] Tests run: 11, Failures: 0, Errors: 0, Skipped: 0, Time elapsed: 1.416 s - in org.eclipse.egit.ui.prefpages.configuration.GlobalConfigurationPageTest
12:42:00 [2020-08-12T16:42:00.366Z] testAddSubSectionEntry(org.eclipse.egit.ui.prefpages.configuration.GlobalConfigurationPageTest)  Time elapsed: 0.174 s
12:42:00 [2020-08-12T16:42:00.366Z] testAddSectionEntry(org.eclipse.egit.ui.prefpages.configuration.GlobalConfigurationPageTest)  Time elapsed: 0.129 s
12:42:00 [2020-08-12T16:42:00.366Z] testCanCreateSameEntryValue(org.eclipse.egit.ui.prefpages.configuration.GlobalConfigurationPageTest)  Time elapsed: 0.119 s
12:42:00 [2020-08-12T16:42:00.366Z] testNodes(org.eclipse.egit.ui.prefpages.configuration.GlobalConfigurationPageTest)  Time elapsed: 0.078 s
12:42:00 [2020-08-12T16:42:00.366Z] testRemoveValue(org.eclipse.egit.ui.prefpages.configuration.GlobalConfigurationPageTest)  Time elapsed: 0.084 s
12:42:00 [2020-08-12T16:42:00.366Z] testAddSubSectionEntryWithSuggestion(org.eclipse.egit.ui.prefpages.configuration.GlobalConfigurationPageTest)  Time elapsed: 0.119 s
12:42:00 [2020-08-12T16:42:00.366Z] testOpenEditor(org.eclipse.egit.ui.prefpages.configuration.GlobalConfigurationPageTest)  Time elapsed: 0.148 s
12:42:00 [2020-08-12T16:42:00.366Z] testSubsectionWithDot(org.eclipse.egit.ui.prefpages.configuration.GlobalConfigurationPageTest)  Time elapsed: 0.113 s
12:42:00 [2020-08-12T16:42:00.366Z] testChecksForKey(org.eclipse.egit.ui.prefpages.configuration.GlobalConfigurationPageTest)  Time elapsed: 0.138 s
12:42:00 [2020-08-12T16:42:00.366Z] testRemoveSubSection(org.eclipse.egit.ui.prefpages.configuration.GlobalConfigurationPageTest)  Time elapsed: 0.101 s
12:42:00 [2020-08-12T16:42:00.366Z] testRemoveSection(org.eclipse.egit.ui.prefpages.configuration.GlobalConfigurationPageTest)  Time elapsed: 0.104 s
12:42:00 [2020-08-12T16:42:00.366Z] Running org.eclipse.egit.ui.operations.GitScopeUtilTest
12:42:04 [2020-08-12T16:42:04.556Z] Tests run: 5, Failures: 0, Errors: 0, Skipped: 0, Time elapsed: 4.019 s - in org.eclipse.egit.ui.operations.GitScopeUtilTest
12:42:04 [2020-08-12T16:42:04.556Z] relatedChangesWithPrompt(org.eclipse.egit.ui.operations.GitScopeUtilTest)  Time elapsed: 1.534 s
12:42:04 [2020-08-12T16:42:04.556Z] modelProviderWithExtensionFiles(org.eclipse.egit.ui.operations.GitScopeUtilTest)  Time elapsed: 0.62 s
12:42:04 [2020-08-12T16:42:04.556Z] relatedChangesWithInvalidParams(org.eclipse.egit.ui.operations.GitScopeUtilTest)  Time elapsed: 0.595 s
12:42:04 [2020-08-12T16:42:04.556Z] relatedChangesWithNullResources(org.eclipse.egit.ui.operations.GitScopeUtilTest)  Time elapsed: 0.622 s
12:42:04 [2020-08-12T16:42:04.556Z] relatedChangesWithEmptyResources(org.eclipse.egit.ui.operations.GitScopeUtilTest)  Time elapsed: 0.647 s
12:42:04 [2020-08-12T16:42:04.556Z] 
12:42:04 [2020-08-12T16:42:04.556Z] Results:
12:42:04 [2020-08-12T16:42:04.556Z] 
12:42:04 [2020-08-12T16:42:04.556Z] Tests run: 541, Failures: 0, Errors: 0, Skipped: 12
12:42:04 [2020-08-12T16:42:04.556Z] 
12:42:05 [2020-08-12T16:42:05.120Z] 
12:42:05 [2020-08-12T16:42:05.120Z] !ENTRY org.eclipse.core.resources 2 10035 2020-08-12 16:42:05.027
12:42:05 [2020-08-12T16:42:05.120Z] !MESSAGE The workspace will exit with unsaved changes in this session.
12:42:06 [2020-08-12T16:42:06.051Z] [INFO] All tests passed!
12:42:06 [2020-08-12T16:42:06.051Z] [INFO] 
12:42:06 [2020-08-12T16:42:06.051Z] [INFO] >>> spotbugs-maven-plugin:3.1.12:check (default) > :spotbugs @ org.eclipse.egit.ui.test >>>
12:42:06 [2020-08-12T16:42:06.309Z] [INFO] 
12:42:06 [2020-08-12T16:42:06.309Z] [INFO] --- spotbugs-maven-plugin:3.1.12:spotbugs (spotbugs) @ org.eclipse.egit.ui.test ---
12:42:06 [2020-08-12T16:42:06.309Z] [INFO] Fork Value is true
12:42:18 [2020-08-12T16:42:18.627Z]      [java] Warnings generated: 21
12:42:18 [2020-08-12T16:42:18.627Z] [INFO] Done SpotBugs Analysis....
12:42:18 [2020-08-12T16:42:18.627Z] [INFO] 
12:42:18 [2020-08-12T16:42:18.627Z] [INFO] <<< spotbugs-maven-plugin:3.1.12:check (default) < :spotbugs @ org.eclipse.egit.ui.test <<<
12:42:18 [2020-08-12T16:42:18.627Z] [INFO] 
12:42:18 [2020-08-12T16:42:18.627Z] [INFO] 
12:42:18 [2020-08-12T16:42:18.627Z] [INFO] --- spotbugs-maven-plugin:3.1.12:check (default) @ org.eclipse.egit.ui.test ---
12:42:18 [2020-08-12T16:42:18.627Z] [INFO] BugInstance size is 21
12:42:18 [2020-08-12T16:42:18.627Z] [INFO] Error size is 0
12:42:18 [2020-08-12T16:42:18.627Z] [INFO] Total bugs: 21
12:42:18 [2020-08-12T16:42:18.627Z] [ERROR] Possible null pointer dereference in org.eclipse.egit.ui.common.LocalRepositoryTestCase.shareProjects(File) due to return value of called method [org.eclipse.egit.ui.common.LocalRepositoryTestCase, org.eclipse.egit.ui.common.LocalRepositoryTestCase] Dereferenced at LocalRepositoryTestCase.java:[line 628]Known null at LocalRepositoryTestCase.java:[line 628] NP_NULL_ON_SOME_PATH_FROM_RETURN_VALUE
12:42:18 [2020-08-12T16:42:18.627Z] [ERROR] Possible null pointer dereference in org.eclipse.egit.ui.common.LocalRepositoryTestCase.shareProjects(File) due to return value of called method [org.eclipse.egit.ui.common.LocalRepositoryTestCase, org.eclipse.egit.ui.common.LocalRepositoryTestCase] Dereferenced at LocalRepositoryTestCase.java:[line 630]Known null at LocalRepositoryTestCase.java:[line 630] NP_NULL_ON_SOME_PATH_FROM_RETURN_VALUE
12:42:18 [2020-08-12T16:42:18.627Z] [ERROR] Write to static field org.eclipse.egit.ui.common.LocalRepositoryTestCase.testMethodNumber from instance method org.eclipse.egit.ui.common.LocalRepositoryTestCase.initNewTestDirectory() [org.eclipse.egit.ui.common.LocalRepositoryTestCase] At LocalRepositoryTestCase.java:[line 193] ST_WRITE_TO_STATIC_FROM_INSTANCE_METHOD
12:42:18 [2020-08-12T16:42:18.627Z] [ERROR] Exceptional return value of java.io.File.delete() ignored in org.eclipse.egit.ui.internal.actions.SwitchToMenuTest.multipleSelectionWithMultipleRepositoriesAndNoCommonBranches() [org.eclipse.egit.ui.internal.actions.SwitchToMenuTest, org.eclipse.egit.ui.internal.actions.SwitchToMenuTest] At SwitchToMenuTest.java:[line 283]Another occurrence at SwitchToMenuTest.java:[line 284] RV_RETURN_VALUE_IGNORED_BAD_PRACTICE
12:42:18 [2020-08-12T16:42:18.627Z] [ERROR] Call to org.eclipse.egit.ui.internal.decorators.TestDecoratableResource.equals(org.eclipse.egit.ui.internal.decorators.DecoratableResourceAdapter) in org.eclipse.egit.ui.internal.decorators.DecoratableResourceAdapterTest.testDecorationDeletedFile() [org.eclipse.egit.ui.internal.decorators.DecoratableResourceAdapterTest] At DecoratableResourceAdapterTest.java:[line 384] EC_UNRELATED_TYPES
12:42:18 [2020-08-12T16:42:18.627Z] [ERROR] Call to org.eclipse.egit.ui.internal.synchronize.model.GitModelCommit.equals(org.eclipse.egit.ui.internal.synchronize.model.GitModelBlob) in org.eclipse.egit.ui.internal.synchronize.model.GitModelBlobTest.shouldBeSymmetric1() [org.eclipse.egit.ui.internal.synchronize.model.GitModelBlobTest] At GitModelBlobTest.java:[line 123] EC_UNRELATED_TYPES
12:42:18 [2020-08-12T16:42:18.627Z] [ERROR] Call to org.eclipse.egit.ui.internal.synchronize.model.GitModelBlob.equals(org.eclipse.egit.ui.internal.synchronize.model.GitModelCommit) in org.eclipse.egit.ui.internal.synchronize.model.GitModelBlobTest.shouldBeSymmetric1() [org.eclipse.egit.ui.internal.synchronize.model.GitModelBlobTest] At GitModelBlobTest.java:[line 122] EC_UNRELATED_TYPES
12:42:18 [2020-08-12T16:42:18.627Z] [ERROR] Call to org.eclipse.egit.ui.internal.synchronize.model.GitModelBlob.equals(org.eclipse.egit.ui.internal.synchronize.model.GitModelCommit) in org.eclipse.egit.ui.internal.synchronize.model.GitModelBlobTest.shouldReturnNotEqualForBlobAndCommit() [org.eclipse.egit.ui.internal.synchronize.model.GitModelBlobTest] At GitModelBlobTest.java:[line 199] EC_UNRELATED_TYPES
12:42:18 [2020-08-12T16:42:18.627Z] [ERROR] Write to static field org.eclipse.egit.ui.internal.synchronize.model.GitModelRootTest.repo1 from instance method org.eclipse.egit.ui.internal.synchronize.model.GitModelRootTest.setupEnvironment() [org.eclipse.egit.ui.internal.synchronize.model.GitModelRootTest] At GitModelRootTest.java:[line 32] ST_WRITE_TO_STATIC_FROM_INSTANCE_METHOD
12:42:18 [2020-08-12T16:42:18.627Z] [ERROR] Write to static field org.eclipse.egit.ui.internal.synchronize.model.GitModelRootTest.repo2 from instance method org.eclipse.egit.ui.internal.synchronize.model.GitModelRootTest.setupEnvironment() [org.eclipse.egit.ui.internal.synchronize.model.GitModelRootTest] At GitModelRootTest.java:[line 35] ST_WRITE_TO_STATIC_FROM_INSTANCE_METHOD
12:42:18 [2020-08-12T16:42:18.627Z] [ERROR] Exceptional return value of java.io.File.delete() ignored in org.eclipse.egit.ui.prefpages.configuration.GlobalConfigurationPageTest.afterTest() [org.eclipse.egit.ui.prefpages.configuration.GlobalConfigurationPageTest] At GlobalConfigurationPageTest.java:[line 124] RV_RETURN_VALUE_IGNORED_BAD_PRACTICE
12:42:18 [2020-08-12T16:42:18.627Z] [ERROR] Return value of org.eclipse.swtbot.eclipse.finder.waits.Conditions.waitForView(Matcher) ignored, but method has no side effect [org.eclipse.egit.ui.test.TestUtil] At TestUtil.java:[line 746] RV_RETURN_VALUE_IGNORED_NO_SIDE_EFFECT
12:42:18 [2020-08-12T16:42:18.627Z] [ERROR] Return value of org.eclipse.swtbot.eclipse.finder.waits.Conditions.waitForView(Matcher) ignored, but method has no side effect [org.eclipse.egit.ui.test.TestUtil] At TestUtil.java:[line 762] RV_RETURN_VALUE_IGNORED_NO_SIDE_EFFECT
12:42:18 [2020-08-12T16:42:18.627Z] [ERROR] Write to static field org.eclipse.egit.ui.test.team.actions.BranchAndResetActionTest.LOCAL_BRANCHES from instance method org.eclipse.egit.ui.test.team.actions.BranchAndResetActionTest.setup() [org.eclipse.egit.ui.test.team.actions.BranchAndResetActionTest] At BranchAndResetActionTest.java:[line 99] ST_WRITE_TO_STATIC_FROM_INSTANCE_METHOD
12:42:18 [2020-08-12T16:42:18.627Z] [ERROR] Write to static field org.eclipse.egit.ui.test.team.actions.BranchAndResetActionTest.TAGS from instance method org.eclipse.egit.ui.test.team.actions.BranchAndResetActionTest.setup() [org.eclipse.egit.ui.test.team.actions.BranchAndResetActionTest] At BranchAndResetActionTest.java:[line 100] ST_WRITE_TO_STATIC_FROM_INSTANCE_METHOD
12:42:18 [2020-08-12T16:42:18.627Z] [ERROR] Write to static field org.eclipse.egit.ui.test.team.actions.CompareActionsTest.TAGS from instance method org.eclipse.egit.ui.test.team.actions.CompareActionsTest.setup() [org.eclipse.egit.ui.test.team.actions.CompareActionsTest] At CompareActionsTest.java:[line 94] ST_WRITE_TO_STATIC_FROM_INSTANCE_METHOD
12:42:18 [2020-08-12T16:42:18.627Z] [ERROR] Write to static field org.eclipse.egit.ui.test.team.actions.CompareActionsTest.commitOfTag from instance method org.eclipse.egit.ui.test.team.actions.CompareActionsTest.setup() [org.eclipse.egit.ui.test.team.actions.CompareActionsTest] At CompareActionsTest.java:[line 89] ST_WRITE_TO_STATIC_FROM_INSTANCE_METHOD
12:42:18 [2020-08-12T16:42:18.627Z] [ERROR] VERY confusing to have methods org.eclipse.egit.ui.view.repositories.GitRepositoriesViewBranchHandlingTest.setUp() and org.eclipse.egit.ui.view.repositories.GitRepositoriesViewTestBase.setup() [org.eclipse.egit.ui.view.repositories.GitRepositoriesViewBranchHandlingTest] At GitRepositoriesViewBranchHandlingTest.java:[lines 84-108] NM_VERY_CONFUSING
12:42:18 [2020-08-12T16:42:18.627Z] [ERROR] Possible null pointer dereference in org.eclipse.egit.ui.view.repositories.GitRepositoriesViewTest.testExpandWorkDir() due to return value of called method [org.eclipse.egit.ui.view.repositories.GitRepositoriesViewTest, org.eclipse.egit.ui.view.repositories.GitRepositoriesViewTest] Method invoked at GitRepositoriesViewTest.java:[line 247]Known null at GitRepositoriesViewTest.java:[line 247] NP_NULL_ON_SOME_PATH_FROM_RETURN_VALUE
12:42:18 [2020-08-12T16:42:18.627Z] [ERROR] org.eclipse.egit.ui.view.repositories.GitRepositoriesViewTestBase.myRepoViewUtil isn't final and can't be protected from malicious code  [org.eclipse.egit.ui.view.repositories.GitRepositoriesViewTestBase] In GitRepositoriesViewTestBase.java MS_CANNOT_BE_FINAL
12:42:18 [2020-08-12T16:42:18.627Z] [ERROR] VERY confusing to have methods org.eclipse.egit.ui.wizards.pull.PullWizardTest.setUp() and org.eclipse.egit.ui.view.repositories.GitRepositoriesViewTestBase.setup() [org.eclipse.egit.ui.wizards.pull.PullWizardTest] At PullWizardTest.java:[lines 80-88] NM_VERY_CONFUSING
12:42:18 [2020-08-12T16:42:18.627Z] [INFO] 
12:42:18 [2020-08-12T16:42:18.627Z] 
12:42:18 [2020-08-12T16:42:18.627Z] 
12:42:18 [2020-08-12T16:42:18.627Z] To see bug detail using the Spotbugs GUI, use the following command "mvn spotbugs:gui"
12:42:18 [2020-08-12T16:42:18.627Z] 
12:42:18 [2020-08-12T16:42:18.627Z] 
12:42:18 [2020-08-12T16:42:18.627Z] 
12:42:18 [2020-08-12T16:42:18.627Z] [INFO] 
12:42:18 [2020-08-12T16:42:18.627Z] [INFO] >>> maven-pmd-plugin:3.12.0:cpd-check (default) > :cpd @ org.eclipse.egit.ui.test >>>
12:42:18 [2020-08-12T16:42:18.627Z] [INFO] 
12:42:18 [2020-08-12T16:42:18.627Z] [INFO] --- maven-pmd-plugin:3.12.0:cpd (cpd) @ org.eclipse.egit.ui.test ---
12:42:18 [2020-08-12T16:42:18.627Z] [INFO] 
12:42:18 [2020-08-12T16:42:18.627Z] [INFO] <<< maven-pmd-plugin:3.12.0:cpd-check (default) < :cpd @ org.eclipse.egit.ui.test <<<
12:42:18 [2020-08-12T16:42:18.627Z] [INFO] 
12:42:18 [2020-08-12T16:42:18.627Z] [INFO] 
12:42:18 [2020-08-12T16:42:18.627Z] [INFO] --- maven-pmd-plugin:3.12.0:cpd-check (default) @ org.eclipse.egit.ui.test ---
12:42:18 [2020-08-12T16:42:18.627Z] [INFO] 
12:42:18 [2020-08-12T16:42:18.627Z] [INFO] 
12:42:18 [2020-08-12T16:42:18.627Z] [INFO] --- tycho-pack200a-plugin:1.7.0:normalize (pack200-normalize) @ org.eclipse.egit.ui.test ---
12:42:18 [2020-08-12T16:42:18.627Z] [INFO] Pack200 normalizing jar /home/jenkins/agent/workspace/egit/repo/org.eclipse.egit.ui.test/target/org.eclipse.egit.ui.test-5.9.0-SNAPSHOT.jar
12:42:18 [2020-08-12T16:42:18.627Z] [INFO] 
12:42:18 [2020-08-12T16:42:18.627Z] [INFO] --- eclipse-jarsigner-plugin:1.1.5:sign (sign) @ org.eclipse.egit.ui.test ---
12:42:18 [2020-08-12T16:42:18.627Z] [INFO] Signing jar: /home/jenkins/agent/workspace/egit/repo/org.eclipse.egit.ui.test/target/org.eclipse.egit.ui.test-5.9.0-SNAPSHOT.jar
12:42:20 [2020-08-12T16:42:20.000Z] [INFO] 
12:42:20 [2020-08-12T16:42:20.000Z] [INFO] --- tycho-pack200b-plugin:1.7.0:pack (pack200-pack) @ org.eclipse.egit.ui.test ---
12:42:20 [2020-08-12T16:42:20.000Z] [INFO] Pack200 packing jar /home/jenkins/agent/workspace/egit/repo/org.eclipse.egit.ui.test/target/org.eclipse.egit.ui.test-5.9.0-SNAPSHOT.jar
12:42:20 [2020-08-12T16:42:20.258Z] [INFO] 
12:42:20 [2020-08-12T16:42:20.258Z] [INFO] --- tycho-p2-plugin:1.7.0:p2-metadata (p2-metadata) @ org.eclipse.egit.ui.test ---
12:42:20 [2020-08-12T16:42:20.258Z] [INFO] 
12:42:20 [2020-08-12T16:42:20.258Z] [INFO] --- maven-install-plugin:2.3.1:install (default-install) @ org.eclipse.egit.ui.test ---
12:42:20 [2020-08-12T16:42:20.258Z] [INFO] Installing /home/jenkins/agent/workspace/egit/repo/org.eclipse.egit.ui.test/target/org.eclipse.egit.ui.test-5.9.0-SNAPSHOT.jar to /home/jenkins/agent/workspace/egit/.repository/org/eclipse/egit/org.eclipse.egit.ui.test/5.9.0-SNAPSHOT/org.eclipse.egit.ui.test-5.9.0-SNAPSHOT.jar
12:42:20 [2020-08-12T16:42:20.258Z] [INFO] Installing /home/jenkins/agent/workspace/egit/repo/org.eclipse.egit.ui.test/pom.xml to /home/jenkins/agent/workspace/egit/.repository/org/eclipse/egit/org.eclipse.egit.ui.test/5.9.0-SNAPSHOT/org.eclipse.egit.ui.test-5.9.0-SNAPSHOT.pom
12:42:20 [2020-08-12T16:42:20.258Z] [INFO] Installing /home/jenkins/agent/workspace/egit/repo/org.eclipse.egit.ui.test/target/org.eclipse.egit.ui.test-5.9.0-SNAPSHOT.jar.pack.gz to /home/jenkins/agent/workspace/egit/.repository/org/eclipse/egit/org.eclipse.egit.ui.test/5.9.0-SNAPSHOT/org.eclipse.egit.ui.test-5.9.0-SNAPSHOT-pack200.jar.pack.gz
12:42:20 [2020-08-12T16:42:20.258Z] [INFO] Installing /home/jenkins/agent/workspace/egit/repo/org.eclipse.egit.ui.test/target/p2content.xml to /home/jenkins/agent/workspace/egit/.repository/org/eclipse/egit/org.eclipse.egit.ui.test/5.9.0-SNAPSHOT/org.eclipse.egit.ui.test-5.9.0-SNAPSHOT-p2metadata.xml
12:42:20 [2020-08-12T16:42:20.258Z] [INFO] Installing /home/jenkins/agent/workspace/egit/repo/org.eclipse.egit.ui.test/target/p2artifacts.xml to /home/jenkins/agent/workspace/egit/.repository/org/eclipse/egit/org.eclipse.egit.ui.test/5.9.0-SNAPSHOT/org.eclipse.egit.ui.test-5.9.0-SNAPSHOT-p2artifacts.xml
12:42:20 [2020-08-12T16:42:20.258Z] [INFO] 
12:42:20 [2020-08-12T16:42:20.258Z] [INFO] --- tycho-p2-plugin:1.7.0:update-local-index (default-update-local-index) @ org.eclipse.egit.ui.test ---
12:42:20 [2020-08-12T16:42:20.258Z] [INFO] 
12:42:20 [2020-08-12T16:42:20.258Z] [INFO] ----------< org.eclipse.egit:org.eclipse.egit.mylyn.ui.test >-----------
12:42:20 [2020-08-12T16:42:20.258Z] [INFO] Building EGit Mylyn UI Test Plug-in 5.9.0-SNAPSHOT               [19/19]
12:42:20 [2020-08-12T16:42:20.258Z] [INFO] ------------------------[ eclipse-test-plugin ]-------------------------
12:42:20 [2020-08-12T16:42:20.258Z] [INFO] 
12:42:20 [2020-08-12T16:42:20.258Z] [INFO] --- maven-clean-plugin:2.5:clean (default-clean) @ org.eclipse.egit.mylyn.ui.test ---
12:42:20 [2020-08-12T16:42:20.258Z] [INFO] 
12:42:20 [2020-08-12T16:42:20.258Z] [INFO] --- tycho-packaging-plugin:1.7.0:build-qualifier (default-build-qualifier) @ org.eclipse.egit.mylyn.ui.test ---
12:42:20 [2020-08-12T16:42:20.258Z] [INFO] The project's OSGi version is 5.9.0.202008121621
12:42:20 [2020-08-12T16:42:20.258Z] [INFO] 
12:42:20 [2020-08-12T16:42:20.258Z] [INFO] --- tycho-packaging-plugin:1.7.0:validate-id (default-validate-id) @ org.eclipse.egit.mylyn.ui.test ---
12:42:20 [2020-08-12T16:42:20.258Z] [INFO] 
12:42:20 [2020-08-12T16:42:20.258Z] [INFO] --- tycho-packaging-plugin:1.7.0:validate-version (default-validate-version) @ org.eclipse.egit.mylyn.ui.test ---
12:42:20 [2020-08-12T16:42:20.258Z] [INFO] 
12:42:20 [2020-08-12T16:42:20.258Z] [INFO] --- maven-enforcer-plugin:3.0.0-M3:enforce (enforce-maven) @ org.eclipse.egit.mylyn.ui.test ---
12:42:20 [2020-08-12T16:42:20.258Z] [INFO] 
12:42:20 [2020-08-12T16:42:20.258Z] [INFO] --- maven-resources-plugin:2.4.3:resources (default-resources) @ org.eclipse.egit.mylyn.ui.test ---
12:42:20 [2020-08-12T16:42:20.258Z] [INFO] Using 'UTF-8' encoding to copy filtered resources.
12:42:20 [2020-08-12T16:42:20.258Z] [INFO] skip non existing resourceDirectory /home/jenkins/agent/workspace/egit/repo/org.eclipse.egit.mylyn.ui.test/src/main/resources
12:42:20 [2020-08-12T16:42:20.258Z] [INFO] 
12:42:20 [2020-08-12T16:42:20.258Z] [INFO] --- tycho-compiler-plugin:1.7.0:compile (default-compile) @ org.eclipse.egit.mylyn.ui.test ---
12:42:20 [2020-08-12T16:42:20.258Z] [INFO] Compiling 1 source file to /home/jenkins/agent/workspace/egit/repo/org.eclipse.egit.mylyn.ui.test/target/classes
12:42:20 [2020-08-12T16:42:20.515Z] [INFO] 
12:42:20 [2020-08-12T16:42:20.515Z] [INFO] --- maven-resources-plugin:2.4.3:testResources (default-testResources) @ org.eclipse.egit.mylyn.ui.test ---
12:42:20 [2020-08-12T16:42:20.515Z] [INFO] Using 'UTF-8' encoding to copy filtered resources.
12:42:20 [2020-08-12T16:42:20.515Z] [INFO] skip non existing resourceDirectory /home/jenkins/agent/workspace/egit/repo/org.eclipse.egit.mylyn.ui.test/src/test/resources
12:42:20 [2020-08-12T16:42:20.515Z] [INFO] 
12:42:20 [2020-08-12T16:42:20.515Z] [INFO] --- target-platform-configuration:1.7.0:target-platform (default-target-platform) @ org.eclipse.egit.mylyn.ui.test ---
12:42:20 [2020-08-12T16:42:20.515Z] [INFO] 
12:42:20 [2020-08-12T16:42:20.515Z] [INFO] --- tycho-packaging-plugin:1.7.0:package-plugin (default-package-plugin) @ org.eclipse.egit.mylyn.ui.test ---
12:42:20 [2020-08-12T16:42:20.515Z] [INFO] Building jar: /home/jenkins/agent/workspace/egit/repo/org.eclipse.egit.mylyn.ui.test/target/org.eclipse.egit.mylyn.ui.test-5.9.0-SNAPSHOT.jar
12:42:20 [2020-08-12T16:42:20.515Z] [INFO] 
12:42:20 [2020-08-12T16:42:20.515Z] [INFO] --- tycho-p2-plugin:1.7.0:p2-metadata-default (default-p2-metadata-default) @ org.eclipse.egit.mylyn.ui.test ---
12:42:20 [2020-08-12T16:42:20.515Z] [INFO] 
12:42:20 [2020-08-12T16:42:20.515Z] [INFO] --- tycho-surefire-plugin:1.7.0:test (default-test) @ org.eclipse.egit.mylyn.ui.test ---
12:42:20 [2020-08-12T16:42:20.791Z] [INFO] Executing Test Runtime with timeout 0, logs (if any) will be placed at: /home/jenkins/agent/workspace/egit/repo/org.eclipse.egit.mylyn.ui.test/target/work/data/.metadata/.log
12:42:20 [2020-08-12T16:42:20.791Z] [INFO] Command line:
12:42:20 [2020-08-12T16:42:20.791Z] 	[/usr/lib/jvm/java-1.8.0-openjdk-1.8.0.252.b09-2.el7_8.x86_64/jre/bin/java, -Dosgi.noShutdown=false, -Dosgi.os=linux, -Dosgi.ws=gtk, -Dosgi.arch=x86_64, -Declipse.consoleLog=true, -Xmx512m, -Dosgi.clean=true, -jar, /home/jenkins/agent/workspace/egit/.repository/p2/osgi/bundle/org.eclipse.equinox.launcher/1.3.201.v20161025-1711/org.eclipse.equinox.launcher-1.3.201.v20161025-1711.jar, -data, /home/jenkins/agent/workspace/egit/repo/org.eclipse.egit.mylyn.ui.test/target/work/data, -install, /home/jenkins/agent/workspace/egit/repo/org.eclipse.egit.mylyn.ui.test/target/work, -configuration, /home/jenkins/agent/workspace/egit/repo/org.eclipse.egit.mylyn.ui.test/target/work/configuration, -application, org.eclipse.tycho.surefire.osgibooter.uitest, -testproperties, /home/jenkins/agent/workspace/egit/repo/org.eclipse.egit.mylyn.ui.test/target/surefire.properties, -testApplication, org.eclipse.ui.ide.workbench]
12:42:22 [2020-08-12T16:42:22.724Z] !SESSION 2020-08-12 16:42:20.726 -----------------------------------------------
12:42:22 [2020-08-12T16:42:22.724Z] eclipse.buildId=unknown
12:42:22 [2020-08-12T16:42:22.724Z] java.version=1.8.0_252
12:42:22 [2020-08-12T16:42:22.724Z] java.vendor=Oracle Corporation
12:42:22 [2020-08-12T16:42:22.724Z] BootLoader constants: OS=linux, ARCH=x86_64, WS=gtk, NL=en_US
12:42:22 [2020-08-12T16:42:22.724Z] Framework arguments:  -application org.eclipse.tycho.surefire.osgibooter.uitest -testproperties /home/jenkins/agent/workspace/egit/repo/org.eclipse.egit.mylyn.ui.test/target/surefire.properties -testApplication org.eclipse.ui.ide.workbench
12:42:22 [2020-08-12T16:42:22.724Z] Command-line arguments:  -data /home/jenkins/agent/workspace/egit/repo/org.eclipse.egit.mylyn.ui.test/target/work/data -application org.eclipse.tycho.surefire.osgibooter.uitest -testproperties /home/jenkins/agent/workspace/egit/repo/org.eclipse.egit.mylyn.ui.test/target/surefire.properties -testApplication org.eclipse.ui.ide.workbench
12:42:22 [2020-08-12T16:42:22.724Z] 
12:42:22 [2020-08-12T16:42:22.724Z] !ENTRY org.eclipse.jdt.launching.macosx 4 0 2020-08-12 16:42:22.411
12:42:22 [2020-08-12T16:42:22.724Z] !MESSAGE FrameworkEvent ERROR
12:42:22 [2020-08-12T16:42:22.724Z] !STACK 0
12:42:22 [2020-08-12T16:42:22.724Z] org.osgi.framework.BundleException: Could not resolve module: org.eclipse.jdt.launching.macosx [250]
12:42:22 [2020-08-12T16:42:22.724Z]   Unresolved requirement: Require-Capability: eclipse.platform; filter:="(osgi.os=macosx)"
12:42:22 [2020-08-12T16:42:22.724Z] 
12:42:22 [2020-08-12T16:42:22.724Z] 	at org.eclipse.osgi.container.Module.start(Module.java:444)
12:42:22 [2020-08-12T16:42:22.724Z] 	at org.eclipse.osgi.container.ModuleContainer$ContainerStartLevel.incStartLevel(ModuleContainer.java:1620)
12:42:22 [2020-08-12T16:42:22.724Z] 	at org.eclipse.osgi.container.ModuleContainer$ContainerStartLevel.incStartLevel(ModuleContainer.java:1599)
12:42:22 [2020-08-12T16:42:22.724Z] 	at org.eclipse.osgi.container.ModuleContainer$ContainerStartLevel.doContainerStartLevel(ModuleContainer.java:1571)
12:42:22 [2020-08-12T16:42:22.724Z] 	at org.eclipse.osgi.container.ModuleContainer$ContainerStartLevel.dispatchEvent(ModuleContainer.java:1514)
12:42:22 [2020-08-12T16:42:22.724Z] 	at org.eclipse.osgi.container.ModuleContainer$ContainerStartLevel.dispatchEvent(ModuleContainer.java:1)
12:42:22 [2020-08-12T16:42:22.724Z] 	at org.eclipse.osgi.framework.eventmgr.EventManager.dispatchEvent(EventManager.java:230)
12:42:22 [2020-08-12T16:42:22.724Z] 	at org.eclipse.osgi.framework.eventmgr.EventManager$EventThread.run(EventManager.java:340)
12:42:22 [2020-08-12T16:42:22.724Z] 
12:42:22 [2020-08-12T16:42:22.724Z] !ENTRY org.eclipse.jdt.launching.ui.macosx 4 0 2020-08-12 16:42:22.412
12:42:22 [2020-08-12T16:42:22.724Z] !MESSAGE FrameworkEvent ERROR
12:42:22 [2020-08-12T16:42:22.724Z] !STACK 0
12:42:22 [2020-08-12T16:42:22.724Z] org.osgi.framework.BundleException: Could not resolve module: org.eclipse.jdt.launching.ui.macosx [251]
12:42:22 [2020-08-12T16:42:22.724Z]   Unresolved requirement: Require-Capability: eclipse.platform; filter:="(osgi.os=macosx)"
12:42:22 [2020-08-12T16:42:22.724Z] 
12:42:22 [2020-08-12T16:42:22.724Z] 	at org.eclipse.osgi.container.Module.start(Module.java:444)
12:42:22 [2020-08-12T16:42:22.724Z] 	at org.eclipse.osgi.container.ModuleContainer$ContainerStartLevel.incStartLevel(ModuleContainer.java:1620)
12:42:22 [2020-08-12T16:42:22.724Z] 	at org.eclipse.osgi.container.ModuleContainer$ContainerStartLevel.incStartLevel(ModuleContainer.java:1599)
12:42:22 [2020-08-12T16:42:22.724Z] 	at org.eclipse.osgi.container.ModuleContainer$ContainerStartLevel.doContainerStartLevel(ModuleContainer.java:1571)
12:42:22 [2020-08-12T16:42:22.724Z] 	at org.eclipse.osgi.container.ModuleContainer$ContainerStartLevel.dispatchEvent(ModuleContainer.java:1514)
12:42:22 [2020-08-12T16:42:22.724Z] 	at org.eclipse.osgi.container.ModuleContainer$ContainerStartLevel.dispatchEvent(ModuleContainer.java:1)
12:42:22 [2020-08-12T16:42:22.724Z] 	at org.eclipse.osgi.framework.eventmgr.EventManager.dispatchEvent(EventManager.java:230)
12:42:22 [2020-08-12T16:42:22.724Z] 	at org.eclipse.osgi.framework.eventmgr.EventManager$EventThread.run(EventManager.java:340)
12:42:22 [2020-08-12T16:42:22.724Z] Launching application org.eclipse.ui.ide.workbench...
12:42:24 [2020-08-12T16:42:24.628Z] SLF4J: Failed to load class "org.slf4j.impl.StaticLoggerBinder".
12:42:24 [2020-08-12T16:42:24.628Z] SLF4J: Defaulting to no-operation (NOP) logger implementation
12:42:24 [2020-08-12T16:42:24.628Z] SLF4J: See http://www.slf4j.org/codes.html#StaticLoggerBinder for further details.
12:42:24 [2020-08-12T16:42:24.887Z] 
12:42:24 [2020-08-12T16:42:24.887Z] (SWT:3463): Gtk-WARNING **: 16:42:24.858: Negative content width -6 (allocation 1, extents 4x3) while allocating gadget (node toolbar, owner GtkToolbar)
12:42:24 [2020-08-12T16:42:24.887Z] 
12:42:24 [2020-08-12T16:42:24.887Z] (SWT:3463): Gtk-WARNING **: 16:42:24.858: Negative content height -3 (allocation 1, extents 2x2) while allocating gadget (node toolbar, owner GtkToolbar)
12:42:24 [2020-08-12T16:42:24.887Z] 
12:42:24 [2020-08-12T16:42:24.887Z] (SWT:3463): Gtk-WARNING **: 16:42:24.858: Negative content width -6 (allocation 1, extents 4x3) while allocating gadget (node toolbar, owner GtkToolbar)
12:42:24 [2020-08-12T16:42:24.887Z] 
12:42:24 [2020-08-12T16:42:24.887Z] (SWT:3463): Gtk-WARNING **: 16:42:24.858: Negative content height -3 (allocation 1, extents 2x2) while allocating gadget (node toolbar, owner GtkToolbar)
12:42:24 [2020-08-12T16:42:24.887Z] 
12:42:24 [2020-08-12T16:42:24.887Z] (SWT:3463): Gtk-WARNING **: 16:42:24.862: Negative content width -6 (allocation 1, extents 4x3) while allocating gadget (node toolbar, owner GtkToolbar)
12:42:24 [2020-08-12T16:42:24.887Z] 
12:42:24 [2020-08-12T16:42:24.887Z] (SWT:3463): Gtk-WARNING **: 16:42:24.862: Negative content height -3 (allocation 1, extents 2x2) while allocating gadget (node toolbar, owner GtkToolbar)
12:42:24 [2020-08-12T16:42:24.887Z] 
12:42:24 [2020-08-12T16:42:24.887Z] (SWT:3463): Gtk-WARNING **: 16:42:24.862: Negative content width -6 (allocation 1, extents 4x3) while allocating gadget (node toolbar, owner GtkToolbar)
12:42:24 [2020-08-12T16:42:24.887Z] 
12:42:24 [2020-08-12T16:42:24.887Z] (SWT:3463): Gtk-WARNING **: 16:42:24.862: Negative content height -3 (allocation 1, extents 2x2) while allocating gadget (node toolbar, owner GtkToolbar)
12:42:25 [2020-08-12T16:42:25.145Z] 
12:42:25 [2020-08-12T16:42:25.145Z] (SWT:3463): Gtk-WARNING **: 16:42:24.998: Negative content width -6 (allocation 1, extents 4x3) while allocating gadget (node toolbar, owner GtkToolbar)
12:42:25 [2020-08-12T16:42:25.145Z] 
12:42:25 [2020-08-12T16:42:25.145Z] (SWT:3463): Gtk-WARNING **: 16:42:24.998: Negative content height -3 (allocation 1, extents 2x2) while allocating gadget (node toolbar, owner GtkToolbar)
12:42:25 [2020-08-12T16:42:25.145Z] 
12:42:25 [2020-08-12T16:42:25.145Z] (SWT:3463): Gtk-WARNING **: 16:42:24.998: Negative content width -6 (allocation 1, extents 4x3) while allocating gadget (node toolbar, owner GtkToolbar)
12:42:25 [2020-08-12T16:42:25.145Z] 
12:42:25 [2020-08-12T16:42:25.145Z] (SWT:3463): Gtk-WARNING **: 16:42:24.998: Negative content height -3 (allocation 1, extents 2x2) while allocating gadget (node toolbar, owner GtkToolbar)
12:42:25 [2020-08-12T16:42:25.145Z] 
12:42:25 [2020-08-12T16:42:25.145Z] (SWT:3463): Gtk-WARNING **: 16:42:25.004: gtk_widget_size_allocate(): attempt to allocate widget with width -3 and height -3
12:42:25 [2020-08-12T16:42:25.403Z] 
12:42:25 [2020-08-12T16:42:25.403Z] (SWT:3463): Gtk-WARNING **: 16:42:25.293: Negative content width -6 (allocation 1, extents 4x3) while allocating gadget (node toolbar, owner GtkToolbar)
12:42:25 [2020-08-12T16:42:25.403Z] 
12:42:25 [2020-08-12T16:42:25.403Z] (SWT:3463): Gtk-WARNING **: 16:42:25.293: Negative content height -3 (allocation 1, extents 2x2) while allocating gadget (node toolbar, owner GtkToolbar)
12:42:25 [2020-08-12T16:42:25.403Z] 
12:42:25 [2020-08-12T16:42:25.403Z] (SWT:3463): Gtk-WARNING **: 16:42:25.293: Negative content width -6 (allocation 1, extents 4x3) while allocating gadget (node toolbar, owner GtkToolbar)
12:42:25 [2020-08-12T16:42:25.403Z] 
12:42:25 [2020-08-12T16:42:25.403Z] (SWT:3463): Gtk-WARNING **: 16:42:25.293: Negative content height -3 (allocation 1, extents 2x2) while allocating gadget (node toolbar, owner GtkToolbar)
12:42:25 [2020-08-12T16:42:25.403Z] 
12:42:25 [2020-08-12T16:42:25.403Z] (SWT:3463): Gtk-WARNING **: 16:42:25.305: Negative content width -6 (allocation 1, extents 4x3) while allocating gadget (node toolbar, owner GtkToolbar)
12:42:25 [2020-08-12T16:42:25.403Z] 
12:42:25 [2020-08-12T16:42:25.403Z] (SWT:3463): Gtk-WARNING **: 16:42:25.305: Negative content height -3 (allocation 1, extents 2x2) while allocating gadget (node toolbar, owner GtkToolbar)
12:42:25 [2020-08-12T16:42:25.403Z] 
12:42:25 [2020-08-12T16:42:25.403Z] (SWT:3463): Gtk-WARNING **: 16:42:25.305: Negative content width -6 (allocation 1, extents 4x3) while allocating gadget (node toolbar, owner GtkToolbar)
12:42:25 [2020-08-12T16:42:25.403Z] 
12:42:25 [2020-08-12T16:42:25.403Z] (SWT:3463): Gtk-WARNING **: 16:42:25.305: Negative content height -3 (allocation 1, extents 2x2) while allocating gadget (node toolbar, owner GtkToolbar)
12:42:25 [2020-08-12T16:42:25.403Z] 
12:42:25 [2020-08-12T16:42:25.403Z] (SWT:3463): Gtk-WARNING **: 16:42:25.307: Negative content width -6 (allocation 1, extents 4x3) while allocating gadget (node toolbar, owner GtkToolbar)
12:42:25 [2020-08-12T16:42:25.403Z] 
12:42:25 [2020-08-12T16:42:25.403Z] (SWT:3463): Gtk-WARNING **: 16:42:25.307: Negative content height -3 (allocation 1, extents 2x2) while allocating gadget (node toolbar, owner GtkToolbar)
12:42:25 [2020-08-12T16:42:25.403Z] 
12:42:25 [2020-08-12T16:42:25.403Z] (SWT:3463): Gtk-WARNING **: 16:42:25.307: Negative content width -6 (allocation 1, extents 4x3) while allocating gadget (node toolbar, owner GtkToolbar)
12:42:25 [2020-08-12T16:42:25.403Z] 
12:42:25 [2020-08-12T16:42:25.403Z] (SWT:3463): Gtk-WARNING **: 16:42:25.307: Negative content height -3 (allocation 1, extents 2x2) while allocating gadget (node toolbar, owner GtkToolbar)
12:42:25 [2020-08-12T16:42:25.403Z] 
12:42:25 [2020-08-12T16:42:25.403Z] (SWT:3463): Gtk-WARNING **: 16:42:25.311: Negative content width -6 (allocation 1, extents 4x3) while allocating gadget (node toolbar, owner GtkToolbar)
12:42:25 [2020-08-12T16:42:25.403Z] 
12:42:25 [2020-08-12T16:42:25.403Z] (SWT:3463): Gtk-WARNING **: 16:42:25.311: Negative content height -3 (allocation 1, extents 2x2) while allocating gadget (node toolbar, owner GtkToolbar)
12:42:25 [2020-08-12T16:42:25.403Z] 
12:42:25 [2020-08-12T16:42:25.403Z] (SWT:3463): Gtk-WARNING **: 16:42:25.311: Negative content width -6 (allocation 1, extents 4x3) while allocating gadget (node toolbar, owner GtkToolbar)
12:42:25 [2020-08-12T16:42:25.403Z] 
12:42:25 [2020-08-12T16:42:25.403Z] (SWT:3463): Gtk-WARNING **: 16:42:25.311: Negative content height -3 (allocation 1, extents 2x2) while allocating gadget (node toolbar, owner GtkToolbar)
12:42:25 [2020-08-12T16:42:25.967Z] 
12:42:25 [2020-08-12T16:42:25.967Z] (SWT:3463): Gtk-WARNING **: 16:42:25.773: Negative content height -9 (allocation 1, extents 5x5) while allocating gadget (node button, owner GtkButton)
12:42:26 [2020-08-12T16:42:26.226Z] 
12:42:26 [2020-08-12T16:42:26.226Z] (SWT:3463): Gtk-WARNING **: 16:42:26.010: Negative content width -6 (allocation 1, extents 4x3) while allocating gadget (node toolbar, owner GtkToolbar)
12:42:26 [2020-08-12T16:42:26.226Z] 
12:42:26 [2020-08-12T16:42:26.226Z] (SWT:3463): Gtk-WARNING **: 16:42:26.010: Negative content height -3 (allocation 1, extents 2x2) while allocating gadget (node toolbar, owner GtkToolbar)
12:42:26 [2020-08-12T16:42:26.226Z] 
12:42:26 [2020-08-12T16:42:26.226Z] (SWT:3463): Gtk-WARNING **: 16:42:26.010: Negative content width -6 (allocation 1, extents 4x3) while allocating gadget (node toolbar, owner GtkToolbar)
12:42:26 [2020-08-12T16:42:26.226Z] 
12:42:26 [2020-08-12T16:42:26.226Z] (SWT:3463): Gtk-WARNING **: 16:42:26.010: Negative content height -3 (allocation 1, extents 2x2) while allocating gadget (node toolbar, owner GtkToolbar)
12:42:26 [2020-08-12T16:42:26.226Z] 
12:42:26 [2020-08-12T16:42:26.226Z] (SWT:3463): Gtk-WARNING **: 16:42:26.020: Negative content width -6 (allocation 1, extents 4x3) while allocating gadget (node toolbar, owner GtkToolbar)
12:42:26 [2020-08-12T16:42:26.226Z] 
12:42:26 [2020-08-12T16:42:26.226Z] (SWT:3463): Gtk-WARNING **: 16:42:26.020: Negative content height -3 (allocation 1, extents 2x2) while allocating gadget (node toolbar, owner GtkToolbar)
12:42:26 [2020-08-12T16:42:26.226Z] 
12:42:26 [2020-08-12T16:42:26.226Z] (SWT:3463): Gtk-WARNING **: 16:42:26.020: Negative content width -6 (allocation 1, extents 4x3) while allocating gadget (node toolbar, owner GtkToolbar)
12:42:26 [2020-08-12T16:42:26.226Z] 
12:42:26 [2020-08-12T16:42:26.226Z] (SWT:3463): Gtk-WARNING **: 16:42:26.020: Negative content height -3 (allocation 1, extents 2x2) while allocating gadget (node toolbar, owner GtkToolbar)
12:42:26 [2020-08-12T16:42:26.226Z] 
12:42:26 [2020-08-12T16:42:26.226Z] (SWT:3463): Gtk-WARNING **: 16:42:26.050: Negative content width -6 (allocation 1, extents 4x3) while allocating gadget (node toolbar, owner GtkToolbar)
12:42:26 [2020-08-12T16:42:26.226Z] 
12:42:26 [2020-08-12T16:42:26.226Z] (SWT:3463): Gtk-WARNING **: 16:42:26.052: Negative content width -6 (allocation 1, extents 4x3) while allocating gadget (node toolbar, owner GtkToolbar)
12:42:26 [2020-08-12T16:42:26.226Z] 
12:42:26 [2020-08-12T16:42:26.226Z] (SWT:3463): Gtk-WARNING **: 16:42:26.056: Negative content width -6 (allocation 1, extents 4x3) while allocating gadget (node toolbar, owner GtkToolbar)
12:42:26 [2020-08-12T16:42:26.226Z] 
12:42:26 [2020-08-12T16:42:26.226Z] (SWT:3463): Gtk-WARNING **: 16:42:26.058: Negative content width -6 (allocation 1, extents 4x3) while allocating gadget (node toolbar, owner GtkToolbar)
12:42:26 [2020-08-12T16:42:26.226Z] 
12:42:26 [2020-08-12T16:42:26.226Z] (SWT:3463): Gtk-WARNING **: 16:42:26.060: Negative content width -6 (allocation 1, extents 4x3) while allocating gadget (node toolbar, owner GtkToolbar)
12:42:26 [2020-08-12T16:42:26.226Z] 
12:42:26 [2020-08-12T16:42:26.227Z] (SWT:3463): Gtk-WARNING **: 16:42:26.060: Negative content width -1 (allocation 1, extents 1x1) while allocating gadget (node trough, owner GtkProgressBar)
12:42:26 [2020-08-12T16:42:26.227Z] 
12:42:26 [2020-08-12T16:42:26.227Z] (SWT:3463): Gtk-WARNING **: 16:42:26.060: Negative content width -1 (allocation 1, extents 1x1) while allocating gadget (node trough, owner GtkProgressBar)
12:42:26 [2020-08-12T16:42:26.227Z] 
12:42:26 [2020-08-12T16:42:26.227Z] (SWT:3463): Gtk-WARNING **: 16:42:26.087: Negative content width -6 (allocation 1, extents 4x3) while allocating gadget (node toolbar, owner GtkToolbar)
12:42:26 [2020-08-12T16:42:26.227Z] 
12:42:26 [2020-08-12T16:42:26.227Z] (SWT:3463): Gtk-WARNING **: 16:42:26.087: Negative content width -6 (allocation 1, extents 4x3) while allocating gadget (node toolbar, owner GtkToolbar)
12:42:26 [2020-08-12T16:42:26.227Z] 
12:42:26 [2020-08-12T16:42:26.227Z] (SWT:3463): Gtk-WARNING **: 16:42:26.090: Negative content width -6 (allocation 1, extents 4x3) while allocating gadget (node toolbar, owner GtkToolbar)
12:42:26 [2020-08-12T16:42:26.227Z] 
12:42:26 [2020-08-12T16:42:26.227Z] (SWT:3463): Gtk-WARNING **: 16:42:26.091: Negative content width -6 (allocation 1, extents 4x3) while allocating gadget (node toolbar, owner GtkToolbar)
12:42:26 [2020-08-12T16:42:26.227Z] 
12:42:26 [2020-08-12T16:42:26.227Z] (SWT:3463): Gtk-WARNING **: 16:42:26.093: Negative content width -6 (allocation 1, extents 4x3) while allocating gadget (node toolbar, owner GtkToolbar)
12:42:26 [2020-08-12T16:42:26.227Z] 
12:42:26 [2020-08-12T16:42:26.227Z] (SWT:3463): Gtk-WARNING **: 16:42:26.094: Negative content width -6 (allocation 1, extents 4x3) while allocating gadget (node toolbar, owner GtkToolbar)
12:42:26 [2020-08-12T16:42:26.227Z] Running org.eclipse.egit.internal.mylyn.CommitHyperlinkDetectorTest
12:42:26 [2020-08-12T16:42:26.483Z] Tests run: 14, Failures: 0, Errors: 0, Skipped: 0, Time elapsed: 0.105 s - in org.eclipse.egit.internal.mylyn.CommitHyperlinkDetectorTest
12:42:26 [2020-08-12T16:42:26.484Z] testEndLine(org.eclipse.egit.internal.mylyn.CommitHyperlinkDetectorTest)  Time elapsed: 0.03 s
12:42:26 [2020-08-12T16:42:26.484Z] testGerritId(org.eclipse.egit.internal.mylyn.CommitHyperlinkDetectorTest)  Time elapsed: 0.003 s
12:42:26 [2020-08-12T16:42:26.484Z] testMiddleLine(org.eclipse.egit.internal.mylyn.CommitHyperlinkDetectorTest)  Time elapsed: 0.003 s
12:42:26 [2020-08-12T16:42:26.484Z] testOffsetOff(org.eclipse.egit.internal.mylyn.CommitHyperlinkDetectorTest)  Time elapsed: 0.002 s
12:42:26 [2020-08-12T16:42:26.484Z] testEmpty(org.eclipse.egit.internal.mylyn.CommitHyperlinkDetectorTest)  Time elapsed: 0.003 s
12:42:26 [2020-08-12T16:42:26.484Z] testBadLocation(org.eclipse.egit.internal.mylyn.CommitHyperlinkDetectorTest)  Time elapsed: 0.001 s
12:42:26 [2020-08-12T16:42:26.484Z] testEndSentence(org.eclipse.egit.internal.mylyn.CommitHyperlinkDetectorTest)  Time elapsed: 0.003 s
12:42:26 [2020-08-12T16:42:26.484Z] testMultiLine(org.eclipse.egit.internal.mylyn.CommitHyperlinkDetectorTest)  Time elapsed: 0.002 s
12:42:26 [2020-08-12T16:42:26.484Z] testBeginSentence(org.eclipse.egit.internal.mylyn.CommitHyperlinkDetectorTest)  Time elapsed: 0.002 s
12:42:26 [2020-08-12T16:42:26.484Z] testGerritIdWithinText(org.eclipse.egit.internal.mylyn.CommitHyperlinkDetectorTest)  Time elapsed: 0.003 s
12:42:26 [2020-08-12T16:42:26.484Z] testMultiId(org.eclipse.egit.internal.mylyn.CommitHyperlinkDetectorTest)  Time elapsed: 0.002 s
12:42:26 [2020-08-12T16:42:26.484Z] testSimpleId(org.eclipse.egit.internal.mylyn.CommitHyperlinkDetectorTest)  Time elapsed: 0.003 s
12:42:26 [2020-08-12T16:42:26.484Z] testNoDocument(org.eclipse.egit.internal.mylyn.CommitHyperlinkDetectorTest)  Time elapsed: 0.002 s
12:42:26 [2020-08-12T16:42:26.484Z] testOffsetMiddle(org.eclipse.egit.internal.mylyn.CommitHyperlinkDetectorTest)  Time elapsed: 0.002 s
12:42:26 [2020-08-12T16:42:26.484Z] 
12:42:26 [2020-08-12T16:42:26.484Z] Results:
12:42:26 [2020-08-12T16:42:26.484Z] 
12:42:26 [2020-08-12T16:42:26.484Z] Tests run: 14, Failures: 0, Errors: 0, Skipped: 0
12:42:26 [2020-08-12T16:42:26.484Z] 
12:42:26 [2020-08-12T16:42:26.484Z] 
12:42:26 [2020-08-12T16:42:26.484Z] (SWT:3463): Gtk-WARNING **: 16:42:26.302: Negative content width -6 (allocation 1, extents 4x3) while allocating gadget (node toolbar, owner GtkToolbar)
12:42:26 [2020-08-12T16:42:26.484Z] 
12:42:26 [2020-08-12T16:42:26.484Z] (SWT:3463): Gtk-WARNING **: 16:42:26.302: Negative content width -6 (allocation 1, extents 4x3) while allocating gadget (node toolbar, owner GtkToolbar)
12:42:29 [2020-08-12T16:42:29.008Z] [INFO] All tests passed!
12:42:29 [2020-08-12T16:42:29.008Z] [INFO] 
12:42:29 [2020-08-12T16:42:29.008Z] [INFO] >>> spotbugs-maven-plugin:3.1.12:check (default) > :spotbugs @ org.eclipse.egit.mylyn.ui.test >>>
12:42:29 [2020-08-12T16:42:29.008Z] [INFO] 
12:42:29 [2020-08-12T16:42:29.008Z] [INFO] --- spotbugs-maven-plugin:3.1.12:spotbugs (spotbugs) @ org.eclipse.egit.mylyn.ui.test ---
12:42:29 [2020-08-12T16:42:29.008Z] [INFO] Fork Value is true
12:42:31 [2020-08-12T16:42:31.547Z] [INFO] Done SpotBugs Analysis....
12:42:31 [2020-08-12T16:42:31.547Z] [INFO] 
12:42:31 [2020-08-12T16:42:31.547Z] [INFO] <<< spotbugs-maven-plugin:3.1.12:check (default) < :spotbugs @ org.eclipse.egit.mylyn.ui.test <<<
12:42:31 [2020-08-12T16:42:31.547Z] [INFO] 
12:42:31 [2020-08-12T16:42:31.547Z] [INFO] 
12:42:31 [2020-08-12T16:42:31.547Z] [INFO] --- spotbugs-maven-plugin:3.1.12:check (default) @ org.eclipse.egit.mylyn.ui.test ---
12:42:31 [2020-08-12T16:42:31.547Z] [INFO] BugInstance size is 0
12:42:31 [2020-08-12T16:42:31.547Z] [INFO] Error size is 0
12:42:31 [2020-08-12T16:42:31.547Z] [INFO] No errors/warnings found
12:42:31 [2020-08-12T16:42:31.547Z] [INFO] 
12:42:31 [2020-08-12T16:42:31.547Z] [INFO] >>> maven-pmd-plugin:3.12.0:cpd-check (default) > :cpd @ org.eclipse.egit.mylyn.ui.test >>>
12:42:31 [2020-08-12T16:42:31.547Z] [INFO] 
12:42:31 [2020-08-12T16:42:31.547Z] [INFO] --- maven-pmd-plugin:3.12.0:cpd (cpd) @ org.eclipse.egit.mylyn.ui.test ---
12:42:31 [2020-08-12T16:42:31.547Z] [INFO] 
12:42:31 [2020-08-12T16:42:31.547Z] [INFO] <<< maven-pmd-plugin:3.12.0:cpd-check (default) < :cpd @ org.eclipse.egit.mylyn.ui.test <<<
12:42:31 [2020-08-12T16:42:31.547Z] [INFO] 
12:42:31 [2020-08-12T16:42:31.547Z] [INFO] 
12:42:31 [2020-08-12T16:42:31.547Z] [INFO] --- maven-pmd-plugin:3.12.0:cpd-check (default) @ org.eclipse.egit.mylyn.ui.test ---
12:42:31 [2020-08-12T16:42:31.547Z] [INFO] 
12:42:31 [2020-08-12T16:42:31.547Z] [INFO] 
12:42:31 [2020-08-12T16:42:31.547Z] [INFO] --- tycho-pack200a-plugin:1.7.0:normalize (pack200-normalize) @ org.eclipse.egit.mylyn.ui.test ---
12:42:31 [2020-08-12T16:42:31.547Z] [INFO] Pack200 normalizing jar /home/jenkins/agent/workspace/egit/repo/org.eclipse.egit.mylyn.ui.test/target/org.eclipse.egit.mylyn.ui.test-5.9.0-SNAPSHOT.jar
12:42:31 [2020-08-12T16:42:31.547Z] [INFO] 
12:42:31 [2020-08-12T16:42:31.547Z] [INFO] --- eclipse-jarsigner-plugin:1.1.5:sign (sign) @ org.eclipse.egit.mylyn.ui.test ---
12:42:31 [2020-08-12T16:42:31.547Z] [INFO] Signing jar: /home/jenkins/agent/workspace/egit/repo/org.eclipse.egit.mylyn.ui.test/target/org.eclipse.egit.mylyn.ui.test-5.9.0-SNAPSHOT.jar
12:42:32 [2020-08-12T16:42:32.111Z] [INFO] 
12:42:32 [2020-08-12T16:42:32.111Z] [INFO] --- tycho-pack200b-plugin:1.7.0:pack (pack200-pack) @ org.eclipse.egit.mylyn.ui.test ---
12:42:32 [2020-08-12T16:42:32.111Z] [INFO] Pack200 packing jar /home/jenkins/agent/workspace/egit/repo/org.eclipse.egit.mylyn.ui.test/target/org.eclipse.egit.mylyn.ui.test-5.9.0-SNAPSHOT.jar
12:42:32 [2020-08-12T16:42:32.111Z] [INFO] 
12:42:32 [2020-08-12T16:42:32.111Z] [INFO] --- tycho-p2-plugin:1.7.0:p2-metadata (p2-metadata) @ org.eclipse.egit.mylyn.ui.test ---
12:42:32 [2020-08-12T16:42:32.111Z] [INFO] 
12:42:32 [2020-08-12T16:42:32.111Z] [INFO] --- maven-install-plugin:2.3.1:install (default-install) @ org.eclipse.egit.mylyn.ui.test ---
12:42:32 [2020-08-12T16:42:32.111Z] [INFO] Installing /home/jenkins/agent/workspace/egit/repo/org.eclipse.egit.mylyn.ui.test/target/org.eclipse.egit.mylyn.ui.test-5.9.0-SNAPSHOT.jar to /home/jenkins/agent/workspace/egit/.repository/org/eclipse/egit/org.eclipse.egit.mylyn.ui.test/5.9.0-SNAPSHOT/org.eclipse.egit.mylyn.ui.test-5.9.0-SNAPSHOT.jar
12:42:32 [2020-08-12T16:42:32.111Z] [INFO] Installing /home/jenkins/agent/workspace/egit/repo/org.eclipse.egit.mylyn.ui.test/pom.xml to /home/jenkins/agent/workspace/egit/.repository/org/eclipse/egit/org.eclipse.egit.mylyn.ui.test/5.9.0-SNAPSHOT/org.eclipse.egit.mylyn.ui.test-5.9.0-SNAPSHOT.pom
12:42:32 [2020-08-12T16:42:32.111Z] [INFO] Installing /home/jenkins/agent/workspace/egit/repo/org.eclipse.egit.mylyn.ui.test/target/org.eclipse.egit.mylyn.ui.test-5.9.0-SNAPSHOT.jar.pack.gz to /home/jenkins/agent/workspace/egit/.repository/org/eclipse/egit/org.eclipse.egit.mylyn.ui.test/5.9.0-SNAPSHOT/org.eclipse.egit.mylyn.ui.test-5.9.0-SNAPSHOT-pack200.jar.pack.gz
12:42:32 [2020-08-12T16:42:32.111Z] [INFO] Installing /home/jenkins/agent/workspace/egit/repo/org.eclipse.egit.mylyn.ui.test/target/p2content.xml to /home/jenkins/agent/workspace/egit/.repository/org/eclipse/egit/org.eclipse.egit.mylyn.ui.test/5.9.0-SNAPSHOT/org.eclipse.egit.mylyn.ui.test-5.9.0-SNAPSHOT-p2metadata.xml
12:42:32 [2020-08-12T16:42:32.370Z] [INFO] Installing /home/jenkins/agent/workspace/egit/repo/org.eclipse.egit.mylyn.ui.test/target/p2artifacts.xml to /home/jenkins/agent/workspace/egit/.repository/org/eclipse/egit/org.eclipse.egit.mylyn.ui.test/5.9.0-SNAPSHOT/org.eclipse.egit.mylyn.ui.test-5.9.0-SNAPSHOT-p2artifacts.xml
12:42:32 [2020-08-12T16:42:32.370Z] [INFO] 
12:42:32 [2020-08-12T16:42:32.370Z] [INFO] --- tycho-p2-plugin:1.7.0:update-local-index (default-update-local-index) @ org.eclipse.egit.mylyn.ui.test ---
12:42:32 [2020-08-12T16:42:32.370Z] [INFO] ------------------------------------------------------------------------
12:42:32 [2020-08-12T16:42:32.370Z] [INFO] Reactor Summary for EGit Parent 5.9.0-SNAPSHOT:
12:42:32 [2020-08-12T16:42:32.370Z] [INFO] 
12:42:32 [2020-08-12T16:42:32.370Z] [INFO] EGit Parent ........................................ SUCCESS [ 29.576 s]
12:42:32 [2020-08-12T16:42:32.370Z] [INFO] EGit Target Platform Definition .................... SUCCESS [  1.202 s]
12:42:32 [2020-08-12T16:42:32.370Z] [INFO] Eclipse EGit ....................................... SUCCESS [  4.943 s]
12:42:32 [2020-08-12T16:42:32.370Z] [INFO] Git Team Provider (Core) ........................... SUCCESS [ 21.787 s]
12:42:32 [2020-08-12T16:42:32.370Z] [INFO] Git Team Provider (UI) ............................. SUCCESS [ 45.992 s]
12:42:32 [2020-08-12T16:42:32.370Z] [INFO] EGit Mylyn UI ...................................... SUCCESS [  7.083 s]
12:42:32 [2020-08-12T16:42:32.370Z] [INFO] Git Team Provider (Documentation) .................. SUCCESS [  4.484 s]
12:42:32 [2020-08-12T16:42:32.370Z] [INFO] Eclipse EGit Feature ............................... SUCCESS [  1.124 s]
12:42:32 [2020-08-12T16:42:32.370Z] [INFO] EGit Mylyn Feature ................................. SUCCESS [  1.076 s]
12:42:32 [2020-08-12T16:42:32.370Z] [INFO] Git Flow ........................................... SUCCESS [  7.165 s]
12:42:32 [2020-08-12T16:42:32.370Z] [INFO] Git Flow UI ........................................ SUCCESS [  8.198 s]
12:42:32 [2020-08-12T16:42:32.370Z] [INFO] Eclipse EGit Gitflow Feature ....................... SUCCESS [  1.104 s]
12:42:32 [2020-08-12T16:42:32.370Z] [INFO] EGit JUnit Support ................................. SUCCESS [  7.169 s]
12:42:32 [2020-08-12T16:42:32.370Z] [INFO] GitFlow Test Plug-in ............................... SUCCESS [ 26.502 s]
12:42:32 [2020-08-12T16:42:32.370Z] [INFO] Eclipse EGit Source Feature ........................ SUCCESS [  2.314 s]
12:42:32 [2020-08-12T16:42:32.370Z] [INFO] EGit P2 Repository ................................. SUCCESS [ 14.785 s]
12:42:32 [2020-08-12T16:42:32.370Z] [INFO] EGit Core Test Plug-in ............................. SUCCESS [02:14 min]
12:42:32 [2020-08-12T16:42:32.370Z] [INFO] EGit UI Test Plug-in ............................... SUCCESS [13:07 min]
12:42:32 [2020-08-12T16:42:32.370Z] [INFO] EGit Mylyn UI Test Plug-in ......................... SUCCESS [ 11.971 s]
12:42:32 [2020-08-12T16:42:32.370Z] [INFO] ------------------------------------------------------------------------
12:42:32 [2020-08-12T16:42:32.370Z] [INFO] BUILD SUCCESS
12:42:32 [2020-08-12T16:42:32.370Z] [INFO] ------------------------------------------------------------------------
12:42:32 [2020-08-12T16:42:32.370Z] [INFO] Total time:  21:25 min
12:42:32 [2020-08-12T16:42:32.370Z] [INFO] Finished at: 2020-08-12T16:42:32Z
12:42:32 [2020-08-12T16:42:32.370Z] [INFO] ------------------------------------------------------------------------