FailedConsole Output

Skipping 927 KB.. Full Log
k_box_gadget_distribute: assertion 'size >= 0' failed in GtkScrollbar
09:29:54 [2020-07-23T13:29:54.265Z] 
09:29:54 [2020-07-23T13:29:54.265Z] (SWT:1587): Gtk-CRITICAL **: 13:29:54.035: gtk_box_gadget_distribute: assertion 'size >= 0' failed in GtkScrollbar
09:29:54 [2020-07-23T13:29:54.265Z] 
09:29:54 [2020-07-23T13:29:54.265Z] (SWT:1587): Gtk-CRITICAL **: 13:29:54.052: gtk_box_gadget_distribute: assertion 'size >= 0' failed in GtkScrollbar
09:29:54 [2020-07-23T13:29:54.265Z] 
09:29:54 [2020-07-23T13:29:54.265Z] (SWT:1587): Gtk-CRITICAL **: 13:29:54.068: gtk_box_gadget_distribute: assertion 'size >= 0' failed in GtkScrollbar
09:29:54 [2020-07-23T13:29:54.265Z] 
09:29:54 [2020-07-23T13:29:54.265Z] (SWT:1587): Gtk-CRITICAL **: 13:29:54.085: gtk_box_gadget_distribute: assertion 'size >= 0' failed in GtkScrollbar
09:29:54 [2020-07-23T13:29:54.265Z] 
09:29:54 [2020-07-23T13:29:54.265Z] (SWT:1587): Gtk-CRITICAL **: 13:29:54.102: gtk_box_gadget_distribute: assertion 'size >= 0' failed in GtkScrollbar
09:29:54 [2020-07-23T13:29:54.265Z] 
09:29:54 [2020-07-23T13:29:54.265Z] (SWT:1587): Gtk-CRITICAL **: 13:29:54.118: gtk_box_gadget_distribute: assertion 'size >= 0' failed in GtkScrollbar
09:29:54 [2020-07-23T13:29:54.265Z] 
09:29:54 [2020-07-23T13:29:54.265Z] (SWT:1587): Gtk-CRITICAL **: 13:29:54.135: gtk_box_gadget_distribute: assertion 'size >= 0' failed in GtkScrollbar
09:29:54 [2020-07-23T13:29:54.265Z] 
09:29:54 [2020-07-23T13:29:54.265Z] (SWT:1587): Gtk-CRITICAL **: 13:29:54.151: gtk_box_gadget_distribute: assertion 'size >= 0' failed in GtkScrollbar
09:29:54 [2020-07-23T13:29:54.265Z] 
09:29:54 [2020-07-23T13:29:54.265Z] (SWT:1587): Gtk-CRITICAL **: 13:29:54.167: gtk_box_gadget_distribute: assertion 'size >= 0' failed in GtkScrollbar
09:29:54 [2020-07-23T13:29:54.265Z] 
09:29:54 [2020-07-23T13:29:54.265Z] (SWT:1587): Gtk-CRITICAL **: 13:29:54.184: gtk_box_gadget_distribute: assertion 'size >= 0' failed in GtkScrollbar
09:29:54 [2020-07-23T13:29:54.265Z] 
09:29:54 [2020-07-23T13:29:54.265Z] (SWT:1587): Gtk-CRITICAL **: 13:29:54.201: gtk_box_gadget_distribute: assertion 'size >= 0' failed in GtkScrollbar
09:29:54 [2020-07-23T13:29:54.265Z] 
09:29:54 [2020-07-23T13:29:54.265Z] (SWT:1587): Gtk-CRITICAL **: 13:29:54.218: gtk_box_gadget_distribute: assertion 'size >= 0' failed in GtkScrollbar
09:29:54 [2020-07-23T13:29:54.265Z] 
09:29:54 [2020-07-23T13:29:54.265Z] (SWT:1587): Gtk-CRITICAL **: 13:29:54.234: gtk_box_gadget_distribute: assertion 'size >= 0' failed in GtkScrollbar
09:29:54 [2020-07-23T13:29:54.265Z] 
09:29:54 [2020-07-23T13:29:54.265Z] (SWT:1587): Gtk-CRITICAL **: 13:29:54.251: gtk_box_gadget_distribute: assertion 'size >= 0' failed in GtkScrollbar
09:29:54 [2020-07-23T13:29:54.522Z] 
09:29:54 [2020-07-23T13:29:54.522Z] (SWT:1587): Gtk-WARNING **: 13:29:54.476: Negative content width -6 (allocation 1, extents 4x3) while allocating gadget (node toolbar, owner GtkToolbar)
09:29:54 [2020-07-23T13:29:54.522Z] 
09:29:54 [2020-07-23T13:29:54.522Z] (SWT:1587): Gtk-WARNING **: 13:29:54.483: Negative content width -6 (allocation 1, extents 4x3) while allocating gadget (node toolbar, owner GtkToolbar)
09:29:55 [2020-07-23T13:29:55.890Z] 
09:29:55 [2020-07-23T13:29:55.890Z] (SWT:1587): Gtk-WARNING **: 13:29:55.739: Negative content width -6 (allocation 1, extents 4x3) while allocating gadget (node toolbar, owner GtkToolbar)
09:29:56 [2020-07-23T13:29:56.147Z] 
09:29:56 [2020-07-23T13:29:56.147Z] (SWT:1587): Gtk-WARNING **: 13:29:55.943: Negative content width -6 (allocation 1, extents 4x3) while allocating gadget (node toolbar, owner GtkToolbar)
09:29:56 [2020-07-23T13:29:56.712Z] 
09:29:56 [2020-07-23T13:29:56.712Z] (SWT:1587): Gtk-WARNING **: 13:29:56.460: Negative content width -6 (allocation 1, extents 4x3) while allocating gadget (node toolbar, owner GtkToolbar)
09:29:56 [2020-07-23T13:29:56.712Z] 
09:29:56 [2020-07-23T13:29:56.712Z] (SWT:1587): Gtk-WARNING **: 13:29:56.670: Negative content width -6 (allocation 1, extents 4x3) while allocating gadget (node toolbar, owner GtkToolbar)
09:29:57 [2020-07-23T13:29:57.277Z] 
09:29:57 [2020-07-23T13:29:57.277Z] (SWT:1587): Gtk-CRITICAL **: 13:29:57.195: gtk_box_gadget_distribute: assertion 'size >= 0' failed in GtkScrollbar
09:29:57 [2020-07-23T13:29:57.277Z] 
09:29:57 [2020-07-23T13:29:57.277Z] (SWT:1587): Gtk-WARNING **: 13:29:57.197: Negative content width -6 (allocation 1, extents 4x3) while allocating gadget (node toolbar, owner GtkToolbar)
09:29:57 [2020-07-23T13:29:57.277Z] 
09:29:57 [2020-07-23T13:29:57.277Z] (SWT:1587): Gtk-CRITICAL **: 13:29:57.208: gtk_box_gadget_distribute: assertion 'size >= 0' failed in GtkScrollbar
09:29:57 [2020-07-23T13:29:57.277Z] 
09:29:57 [2020-07-23T13:29:57.277Z] (SWT:1587): Gtk-CRITICAL **: 13:29:57.208: gtk_box_gadget_distribute: assertion 'size >= 0' failed in GtkScrollbar
09:29:57 [2020-07-23T13:29:57.277Z] 
09:29:57 [2020-07-23T13:29:57.277Z] (SWT:1587): Gtk-CRITICAL **: 13:29:57.218: gtk_box_gadget_distribute: assertion 'size >= 0' failed in GtkScrollbar
09:29:57 [2020-07-23T13:29:57.533Z] 
09:29:57 [2020-07-23T13:29:57.533Z] (SWT:1587): Gtk-WARNING **: 13:29:57.401: Negative content width -6 (allocation 1, extents 4x3) while allocating gadget (node toolbar, owner GtkToolbar)
09:29:58 [2020-07-23T13:29:58.096Z] 
09:29:58 [2020-07-23T13:29:58.096Z] (SWT:1587): Gtk-WARNING **: 13:29:57.934: Negative content width -6 (allocation 1, extents 4x3) while allocating gadget (node toolbar, owner GtkToolbar)
09:29:58 [2020-07-23T13:29:58.096Z] 
09:29:58 [2020-07-23T13:29:58.096Z] (SWT:1587): Gtk-CRITICAL **: 13:29:57.939: gtk_box_gadget_distribute: assertion 'size >= 0' failed in GtkScrollbar
09:29:58 [2020-07-23T13:29:58.096Z] 
09:29:58 [2020-07-23T13:29:58.096Z] (SWT:1587): Gtk-CRITICAL **: 13:29:57.951: gtk_box_gadget_distribute: assertion 'size >= 0' failed in GtkScrollbar
09:29:58 [2020-07-23T13:29:58.353Z] 
09:29:58 [2020-07-23T13:29:58.353Z] (SWT:1587): Gtk-WARNING **: 13:29:58.136: Negative content width -6 (allocation 1, extents 4x3) while allocating gadget (node toolbar, owner GtkToolbar)
09:29:59 [2020-07-23T13:29:59.301Z] 
09:29:59 [2020-07-23T13:29:59.301Z] (SWT:1587): Gtk-WARNING **: 13:29:59.023: Negative content width -6 (allocation 1, extents 4x3) while allocating gadget (node toolbar, owner GtkToolbar)
09:29:59 [2020-07-23T13:29:59.301Z] 
09:29:59 [2020-07-23T13:29:59.301Z] (SWT:1587): Gtk-WARNING **: 13:29:59.033: Negative content width -6 (allocation 1, extents 4x3) while allocating gadget (node toolbar, owner GtkToolbar)
09:29:59 [2020-07-23T13:29:59.301Z] Tests run: 3, Failures: 0, Errors: 0, Skipped: 1, Time elapsed: 12.522 s - in org.eclipse.egit.ui.internal.selection.SelectionForViewsTest
09:29:59 [2020-07-23T13:29:59.301Z] testViewsReactOnRepoSwitchInStaging(org.eclipse.egit.ui.internal.selection.SelectionForViewsTest) skipped
09:29:59 [2020-07-23T13:29:59.301Z] testViewsReactOnBareRepoViewSelection(org.eclipse.egit.ui.internal.selection.SelectionForViewsTest)  Time elapsed: 6.246 s
09:29:59 [2020-07-23T13:29:59.301Z] testViewsReactOnRepoViewSelection(org.eclipse.egit.ui.internal.selection.SelectionForViewsTest)  Time elapsed: 6.268 s
09:29:59 [2020-07-23T13:29:59.301Z] Running org.eclipse.egit.ui.internal.selection.SelectionUtilsTest
09:29:59 [2020-07-23T13:29:59.301Z] Tests run: 1, Failures: 0, Errors: 0, Skipped: 0, Time elapsed: 0.06 s - in org.eclipse.egit.ui.internal.selection.SelectionUtilsTest
09:29:59 [2020-07-23T13:29:59.301Z] getSelectedResourcesShouldUseAllTraversals(org.eclipse.egit.ui.internal.selection.SelectionUtilsTest)  Time elapsed: 0.06 s
09:29:59 [2020-07-23T13:29:59.301Z] Running org.eclipse.egit.ui.internal.CommonUtilsTest
09:29:59 [2020-07-23T13:29:59.301Z] Tests run: 10, Failures: 0, Errors: 0, Skipped: 0, Time elapsed: 0.042 s - in org.eclipse.egit.ui.internal.CommonUtilsTest
09:29:59 [2020-07-23T13:29:59.301Z] sortingShouldWorkForBigNumbers(org.eclipse.egit.ui.internal.CommonUtilsTest)  Time elapsed: 0.001 s
09:29:59 [2020-07-23T13:29:59.301Z] sortingShouldWorkForMixedParts(org.eclipse.egit.ui.internal.CommonUtilsTest)  Time elapsed: 0 s
09:29:59 [2020-07-23T13:29:59.301Z] sortingShouldWorkForNumbers(org.eclipse.egit.ui.internal.CommonUtilsTest)  Time elapsed: 0 s
09:29:59 [2020-07-23T13:29:59.301Z] testFooterOffset(org.eclipse.egit.ui.internal.CommonUtilsTest)  Time elapsed: 0 s
09:29:59 [2020-07-23T13:29:59.301Z] sortingShouldWorkForEqualAndEmptyStrings(org.eclipse.egit.ui.internal.CommonUtilsTest)  Time elapsed: 0 s
09:29:59 [2020-07-23T13:29:59.301Z] sortingShouldIgnoreCase(org.eclipse.egit.ui.internal.CommonUtilsTest)  Time elapsed: 0 s
09:29:59 [2020-07-23T13:29:59.301Z] testFooterOffsetNoFooter(org.eclipse.egit.ui.internal.CommonUtilsTest)  Time elapsed: 0 s
09:29:59 [2020-07-23T13:29:59.301Z] sortingShouldIgnoreLeadingZeros(org.eclipse.egit.ui.internal.CommonUtilsTest)  Time elapsed: 0 s
09:29:59 [2020-07-23T13:29:59.301Z] testResourceCompare(org.eclipse.egit.ui.internal.CommonUtilsTest)  Time elapsed: 0.041 s
09:29:59 [2020-07-23T13:29:59.301Z] sortingShouldWorkForEasyStrings(org.eclipse.egit.ui.internal.CommonUtilsTest)  Time elapsed: 0 s
09:29:59 [2020-07-23T13:29:59.301Z] Running org.eclipse.egit.ui.internal.dialogs.HyperlinkTokenScannerTest
09:29:59 [2020-07-23T13:29:59.560Z] Tests run: 10, Failures: 0, Errors: 0, Skipped: 0, Time elapsed: 0.164 s - in org.eclipse.egit.ui.internal.dialogs.HyperlinkTokenScannerTest
09:29:59 [2020-07-23T13:29:59.560Z] tokenizeEmbeddedHyperlink(org.eclipse.egit.ui.internal.dialogs.HyperlinkTokenScannerTest)  Time elapsed: 0.155 s
09:29:59 [2020-07-23T13:29:59.560Z] tokenizeWithFailingDetector(org.eclipse.egit.ui.internal.dialogs.HyperlinkTokenScannerTest)  Time elapsed: 0.001 s
09:29:59 [2020-07-23T13:29:59.560Z] tokenizeWithoutDetectors(org.eclipse.egit.ui.internal.dialogs.HyperlinkTokenScannerTest)  Time elapsed: 0 s
09:29:59 [2020-07-23T13:29:59.560Z] tokenizeHyperlinksOutsideRegion(org.eclipse.egit.ui.internal.dialogs.HyperlinkTokenScannerTest)  Time elapsed: 0 s
09:29:59 [2020-07-23T13:29:59.560Z] tokenizeMultipleHyperlinksSimple(org.eclipse.egit.ui.internal.dialogs.HyperlinkTokenScannerTest)  Time elapsed: 0.001 s
09:29:59 [2020-07-23T13:29:59.560Z] tokenizeMultipleHyperlinksMultiline(org.eclipse.egit.ui.internal.dialogs.HyperlinkTokenScannerTest)  Time elapsed: 0 s
09:29:59 [2020-07-23T13:29:59.560Z] tokenizeLeadingHyperlink(org.eclipse.egit.ui.internal.dialogs.HyperlinkTokenScannerTest)  Time elapsed: 0.001 s
09:29:59 [2020-07-23T13:29:59.560Z] tokenizeEmpty(org.eclipse.egit.ui.internal.dialogs.HyperlinkTokenScannerTest)  Time elapsed: 0 s
09:29:59 [2020-07-23T13:29:59.560Z] tokenizeHyperlinksCutByRegion(org.eclipse.egit.ui.internal.dialogs.HyperlinkTokenScannerTest)  Time elapsed: 0.001 s
09:29:59 [2020-07-23T13:29:59.560Z] tokenizeNoHyperlinks(org.eclipse.egit.ui.internal.dialogs.HyperlinkTokenScannerTest)  Time elapsed: 0 s
09:29:59 [2020-07-23T13:29:59.560Z] Running org.eclipse.egit.ui.internal.dialogs.CommitMessageBuilderTest
09:29:59 [2020-07-23T13:29:59.560Z] 
09:29:59 [2020-07-23T13:29:59.560Z] !ENTRY org.eclipse.egit.ui 4 0 2020-07-23 13:29:59.522
09:29:59 [2020-07-23T13:29:59.560Z] !MESSAGE CrashingCommitMessageProvider fails on purpose.
09:29:59 [2020-07-23T13:29:59.560Z] !STACK 0
09:29:59 [2020-07-23T13:29:59.560Z] java.lang.IllegalStateException: CrashingCommitMessageProvider fails on purpose.
09:29:59 [2020-07-23T13:29:59.560Z] 	at org.eclipse.egit.ui.internal.dialogs.CommitMessageBuilderTest$CrashingCommitMessageProvider.getMessage(CommitMessageBuilderTest.java:474)
09:29:59 [2020-07-23T13:29:59.560Z] 	at org.eclipse.egit.ui.internal.dialogs.CommitMessageBuilder.build(CommitMessageBuilder.java:90)
09:29:59 [2020-07-23T13:29:59.560Z] 	at org.eclipse.egit.ui.internal.dialogs.CommitMessageBuilderTest.commitMessageProvider_oneCrashingProvider(CommitMessageBuilderTest.java:99)
09:29:59 [2020-07-23T13:29:59.560Z] 	at sun.reflect.NativeMethodAccessorImpl.invoke0(Native Method)
09:29:59 [2020-07-23T13:29:59.560Z] 	at sun.reflect.NativeMethodAccessorImpl.invoke(NativeMethodAccessorImpl.java:62)
09:29:59 [2020-07-23T13:29:59.560Z] 	at sun.reflect.DelegatingMethodAccessorImpl.invoke(DelegatingMethodAccessorImpl.java:43)
09:29:59 [2020-07-23T13:29:59.560Z] 	at java.lang.reflect.Method.invoke(Method.java:498)
09:29:59 [2020-07-23T13:29:59.560Z] 	at org.junit.runners.model.FrameworkMethod$1.runReflectiveCall(FrameworkMethod.java:59)
09:29:59 [2020-07-23T13:29:59.560Z] 	at org.junit.internal.runners.model.ReflectiveCallable.run(ReflectiveCallable.java:12)
09:29:59 [2020-07-23T13:29:59.560Z] 	at org.junit.runners.model.FrameworkMethod.invokeExplosively(FrameworkMethod.java:56)
09:29:59 [2020-07-23T13:29:59.560Z] 	at org.junit.internal.runners.statements.InvokeMethod.evaluate(InvokeMethod.java:17)
09:29:59 [2020-07-23T13:29:59.560Z] 	at org.junit.internal.runners.statements.RunBefores.evaluate(RunBefores.java:26)
09:29:59 [2020-07-23T13:29:59.560Z] 	at org.junit.internal.runners.statements.RunAfters.evaluate(RunAfters.java:27)
09:29:59 [2020-07-23T13:29:59.560Z] 	at org.junit.runners.ParentRunner$3.evaluate(ParentRunner.java:306)
09:29:59 [2020-07-23T13:29:59.560Z] 	at org.junit.runners.BlockJUnit4ClassRunner$1.evaluate(BlockJUnit4ClassRunner.java:100)
09:29:59 [2020-07-23T13:29:59.561Z] 	at org.junit.runners.ParentRunner.runLeaf(ParentRunner.java:366)
09:29:59 [2020-07-23T13:29:59.561Z] 	at org.junit.runners.BlockJUnit4ClassRunner.runChild(BlockJUnit4ClassRunner.java:103)
09:29:59 [2020-07-23T13:29:59.561Z] 	at org.junit.runners.BlockJUnit4ClassRunner.runChild(BlockJUnit4ClassRunner.java:63)
09:29:59 [2020-07-23T13:29:59.561Z] 	at org.junit.runners.ParentRunner$4.run(ParentRunner.java:331)
09:29:59 [2020-07-23T13:29:59.561Z] 	at org.junit.runners.ParentRunner$1.schedule(ParentRunner.java:79)
09:29:59 [2020-07-23T13:29:59.561Z] 	at org.junit.runners.ParentRunner.runChildren(ParentRunner.java:329)
09:29:59 [2020-07-23T13:29:59.561Z] 	at org.junit.runners.ParentRunner.access$100(ParentRunner.java:66)
09:29:59 [2020-07-23T13:29:59.561Z] 	at org.junit.runners.ParentRunner$2.evaluate(ParentRunner.java:293)
09:29:59 [2020-07-23T13:29:59.561Z] 	at org.junit.internal.runners.statements.RunBefores.evaluate(RunBefores.java:26)
09:29:59 [2020-07-23T13:29:59.561Z] 	at org.junit.runners.ParentRunner$3.evaluate(ParentRunner.java:306)
09:29:59 [2020-07-23T13:29:59.561Z] 	at org.junit.runners.ParentRunner.run(ParentRunner.java:413)
09:29:59 [2020-07-23T13:29:59.561Z] 	at org.apache.maven.surefire.junit4.JUnit4Provider.execute(JUnit4Provider.java:365)
09:29:59 [2020-07-23T13:29:59.561Z] 	at org.apache.maven.surefire.junit4.JUnit4Provider.executeWithRerun(JUnit4Provider.java:273)
09:29:59 [2020-07-23T13:29:59.561Z] 	at org.apache.maven.surefire.junit4.JUnit4Provider.executeTestSet(JUnit4Provider.java:238)
09:29:59 [2020-07-23T13:29:59.561Z] 	at org.apache.maven.surefire.junit4.JUnit4Provider.invoke(JUnit4Provider.java:159)
09:29:59 [2020-07-23T13:29:59.561Z] 	at sun.reflect.NativeMethodAccessorImpl.invoke0(Native Method)
09:29:59 [2020-07-23T13:29:59.561Z] 	at sun.reflect.NativeMethodAccessorImpl.invoke(NativeMethodAccessorImpl.java:62)
09:29:59 [2020-07-23T13:29:59.561Z] 	at sun.reflect.DelegatingMethodAccessorImpl.invoke(DelegatingMethodAccessorImpl.java:43)
09:29:59 [2020-07-23T13:29:59.561Z] 	at java.lang.reflect.Method.invoke(Method.java:498)
09:29:59 [2020-07-23T13:29:59.561Z] 	at org.apache.maven.surefire.util.ReflectionUtils.invokeMethodWithArray2(ReflectionUtils.java:206)
09:29:59 [2020-07-23T13:29:59.561Z] 	at org.apache.maven.surefire.booter.ProviderFactory$ProviderProxy.invoke(ProviderFactory.java:161)
09:29:59 [2020-07-23T13:29:59.561Z] 	at org.apache.maven.surefire.booter.ProviderFactory.invokeProvider(ProviderFactory.java:84)
09:29:59 [2020-07-23T13:29:59.561Z] 	at org.eclipse.tycho.surefire.osgibooter.OsgiSurefireBooter.run(OsgiSurefireBooter.java:113)
09:29:59 [2020-07-23T13:29:59.561Z] 	at org.eclipse.tycho.surefire.osgibooter.AbstractUITestApplication.runTests(AbstractUITestApplication.java:44)
09:29:59 [2020-07-23T13:29:59.561Z] 	at org.eclipse.e4.ui.internal.workbench.swt.E4Testable$1.run(E4Testable.java:73)
09:29:59 [2020-07-23T13:29:59.561Z] 	at java.lang.Thread.run(Thread.java:748)
09:30:00 [2020-07-23T13:30:00.932Z] 
09:30:00 [2020-07-23T13:30:00.932Z] !ENTRY org.eclipse.egit.ui 4 0 2020-07-23 13:30:00.758
09:30:00 [2020-07-23T13:30:00.932Z] !MESSAGE CrashingCommitMessageProviderWithCaretPositioning fails on purpose.
09:30:00 [2020-07-23T13:30:00.932Z] !STACK 0
09:30:00 [2020-07-23T13:30:00.932Z] java.lang.IllegalStateException: CrashingCommitMessageProviderWithCaretPositioning fails on purpose.
09:30:00 [2020-07-23T13:30:00.932Z] 	at org.eclipse.egit.ui.internal.dialogs.CommitMessageBuilderTest$CrashingCommitMessageProviderWithCaretPositioning.getCommitMessageWithPosition(CommitMessageBuilderTest.java:491)
09:30:00 [2020-07-23T13:30:00.932Z] 	at org.eclipse.egit.ui.internal.dialogs.CommitMessageBuilder.build(CommitMessageBuilder.java:81)
09:30:00 [2020-07-23T13:30:00.932Z] 	at org.eclipse.egit.ui.internal.dialogs.CommitMessageBuilderTest.commitMessageProvider_oneCrashingProviderWithCaretPosition(CommitMessageBuilderTest.java:112)
09:30:00 [2020-07-23T13:30:00.932Z] 	at sun.reflect.NativeMethodAccessorImpl.invoke0(Native Method)
09:30:00 [2020-07-23T13:30:00.932Z] 	at sun.reflect.NativeMethodAccessorImpl.invoke(NativeMethodAccessorImpl.java:62)
09:30:00 [2020-07-23T13:30:00.932Z] 	at sun.reflect.DelegatingMethodAccessorImpl.invoke(DelegatingMethodAccessorImpl.java:43)
09:30:00 [2020-07-23T13:30:00.932Z] 	at java.lang.reflect.Method.invoke(Method.java:498)
09:30:00 [2020-07-23T13:30:00.932Z] 	at org.junit.runners.model.FrameworkMethod$1.runReflectiveCall(FrameworkMethod.java:59)
09:30:00 [2020-07-23T13:30:00.932Z] 	at org.junit.internal.runners.model.ReflectiveCallable.run(ReflectiveCallable.java:12)
09:30:00 [2020-07-23T13:30:00.932Z] 	at org.junit.runners.model.FrameworkMethod.invokeExplosively(FrameworkMethod.java:56)
09:30:00 [2020-07-23T13:30:00.932Z] 	at org.junit.internal.runners.statements.InvokeMethod.evaluate(InvokeMethod.java:17)
09:30:00 [2020-07-23T13:30:00.932Z] 	at org.junit.internal.runners.statements.RunBefores.evaluate(RunBefores.java:26)
09:30:00 [2020-07-23T13:30:00.932Z] 	at org.junit.internal.runners.statements.RunAfters.evaluate(RunAfters.java:27)
09:30:00 [2020-07-23T13:30:00.932Z] 	at org.junit.runners.ParentRunner$3.evaluate(ParentRunner.java:306)
09:30:00 [2020-07-23T13:30:00.932Z] 	at org.junit.runners.BlockJUnit4ClassRunner$1.evaluate(BlockJUnit4ClassRunner.java:100)
09:30:00 [2020-07-23T13:30:00.932Z] 	at org.junit.runners.ParentRunner.runLeaf(ParentRunner.java:366)
09:30:00 [2020-07-23T13:30:00.932Z] 	at org.junit.runners.BlockJUnit4ClassRunner.runChild(BlockJUnit4ClassRunner.java:103)
09:30:00 [2020-07-23T13:30:00.932Z] 	at org.junit.runners.BlockJUnit4ClassRunner.runChild(BlockJUnit4ClassRunner.java:63)
09:30:00 [2020-07-23T13:30:00.932Z] 	at org.junit.runners.ParentRunner$4.run(ParentRunner.java:331)
09:30:00 [2020-07-23T13:30:00.932Z] 	at org.junit.runners.ParentRunner$1.schedule(ParentRunner.java:79)
09:30:00 [2020-07-23T13:30:00.932Z] 	at org.junit.runners.ParentRunner.runChildren(ParentRunner.java:329)
09:30:00 [2020-07-23T13:30:00.932Z] 	at org.junit.runners.ParentRunner.access$100(ParentRunner.java:66)
09:30:00 [2020-07-23T13:30:00.932Z] 	at org.junit.runners.ParentRunner$2.evaluate(ParentRunner.java:293)
09:30:00 [2020-07-23T13:30:00.932Z] 	at org.junit.internal.runners.statements.RunBefores.evaluate(RunBefores.java:26)
09:30:00 [2020-07-23T13:30:00.932Z] 	at org.junit.runners.ParentRunner$3.evaluate(ParentRunner.java:306)
09:30:00 [2020-07-23T13:30:00.932Z] 	at org.junit.runners.ParentRunner.run(ParentRunner.java:413)
09:30:00 [2020-07-23T13:30:00.932Z] 	at org.apache.maven.surefire.junit4.JUnit4Provider.execute(JUnit4Provider.java:365)
09:30:00 [2020-07-23T13:30:00.932Z] 	at org.apache.maven.surefire.junit4.JUnit4Provider.executeWithRerun(JUnit4Provider.java:273)
09:30:00 [2020-07-23T13:30:00.932Z] 	at org.apache.maven.surefire.junit4.JUnit4Provider.executeTestSet(JUnit4Provider.java:238)
09:30:00 [2020-07-23T13:30:00.932Z] 	at org.apache.maven.surefire.junit4.JUnit4Provider.invoke(JUnit4Provider.java:159)
09:30:00 [2020-07-23T13:30:00.932Z] 	at sun.reflect.NativeMethodAccessorImpl.invoke0(Native Method)
09:30:00 [2020-07-23T13:30:00.932Z] 	at sun.reflect.NativeMethodAccessorImpl.invoke(NativeMethodAccessorImpl.java:62)
09:30:00 [2020-07-23T13:30:00.932Z] 	at sun.reflect.DelegatingMethodAccessorImpl.invoke(DelegatingMethodAccessorImpl.java:43)
09:30:00 [2020-07-23T13:30:00.932Z] 	at java.lang.reflect.Method.invoke(Method.java:498)
09:30:00 [2020-07-23T13:30:00.932Z] 	at org.apache.maven.surefire.util.ReflectionUtils.invokeMethodWithArray2(ReflectionUtils.java:206)
09:30:00 [2020-07-23T13:30:00.932Z] 	at org.apache.maven.surefire.booter.ProviderFactory$ProviderProxy.invoke(ProviderFactory.java:161)
09:30:00 [2020-07-23T13:30:00.932Z] 	at org.apache.maven.surefire.booter.ProviderFactory.invokeProvider(ProviderFactory.java:84)
09:30:00 [2020-07-23T13:30:00.932Z] 	at org.eclipse.tycho.surefire.osgibooter.OsgiSurefireBooter.run(OsgiSurefireBooter.java:113)
09:30:00 [2020-07-23T13:30:00.932Z] 	at org.eclipse.tycho.surefire.osgibooter.AbstractUITestApplication.runTests(AbstractUITestApplication.java:44)
09:30:00 [2020-07-23T13:30:00.932Z] 	at org.eclipse.e4.ui.internal.workbench.swt.E4Testable$1.run(E4Testable.java:73)
09:30:00 [2020-07-23T13:30:00.932Z] 	at java.lang.Thread.run(Thread.java:748)
09:30:00 [2020-07-23T13:30:00.932Z] 
09:30:00 [2020-07-23T13:30:00.932Z] !ENTRY org.eclipse.egit.ui 4 0 2020-07-23 13:30:00.879
09:30:00 [2020-07-23T13:30:00.932Z] !MESSAGE CrashingCommitMessageProvider fails on purpose.
09:30:00 [2020-07-23T13:30:00.932Z] !STACK 0
09:30:00 [2020-07-23T13:30:00.932Z] java.lang.IllegalStateException: CrashingCommitMessageProvider fails on purpose.
09:30:00 [2020-07-23T13:30:00.932Z] 	at org.eclipse.egit.ui.internal.dialogs.CommitMessageBuilderTest$CrashingCommitMessageProvider.getMessage(CommitMessageBuilderTest.java:474)
09:30:00 [2020-07-23T13:30:00.932Z] 	at org.eclipse.egit.ui.internal.dialogs.CommitMessageBuilder.build(CommitMessageBuilder.java:90)
09:30:00 [2020-07-23T13:30:00.932Z] 	at org.eclipse.egit.ui.internal.dialogs.CommitMessageBuilderTest.commitMessageProvider_twoProvidersFirstOneCrashing(CommitMessageBuilderTest.java:146)
09:30:00 [2020-07-23T13:30:00.932Z] 	at sun.reflect.NativeMethodAccessorImpl.invoke0(Native Method)
09:30:00 [2020-07-23T13:30:00.932Z] 	at sun.reflect.NativeMethodAccessorImpl.invoke(NativeMethodAccessorImpl.java:62)
09:30:00 [2020-07-23T13:30:00.932Z] 	at sun.reflect.DelegatingMethodAccessorImpl.invoke(DelegatingMethodAccessorImpl.java:43)
09:30:00 [2020-07-23T13:30:00.932Z] 	at java.lang.reflect.Method.invoke(Method.java:498)
09:30:00 [2020-07-23T13:30:00.932Z] 	at org.junit.runners.model.FrameworkMethod$1.runReflectiveCall(FrameworkMethod.java:59)
09:30:00 [2020-07-23T13:30:00.932Z] 	at org.junit.internal.runners.model.ReflectiveCallable.run(ReflectiveCallable.java:12)
09:30:00 [2020-07-23T13:30:00.932Z] 	at org.junit.runners.model.FrameworkMethod.invokeExplosively(FrameworkMethod.java:56)
09:30:00 [2020-07-23T13:30:00.932Z] 	at org.junit.internal.runners.statements.InvokeMethod.evaluate(InvokeMethod.java:17)
09:30:00 [2020-07-23T13:30:00.932Z] 	at org.junit.internal.runners.statements.RunBefores.evaluate(RunBefores.java:26)
09:30:00 [2020-07-23T13:30:00.932Z] 	at org.junit.internal.runners.statements.RunAfters.evaluate(RunAfters.java:27)
09:30:00 [2020-07-23T13:30:00.932Z] 	at org.junit.runners.ParentRunner$3.evaluate(ParentRunner.java:306)
09:30:00 [2020-07-23T13:30:00.932Z] 	at org.junit.runners.BlockJUnit4ClassRunner$1.evaluate(BlockJUnit4ClassRunner.java:100)
09:30:00 [2020-07-23T13:30:00.932Z] 	at org.junit.runners.ParentRunner.runLeaf(ParentRunner.java:366)
09:30:00 [2020-07-23T13:30:00.932Z] 	at org.junit.runners.BlockJUnit4ClassRunner.runChild(BlockJUnit4ClassRunner.java:103)
09:30:00 [2020-07-23T13:30:00.932Z] 	at org.junit.runners.BlockJUnit4ClassRunner.runChild(BlockJUnit4ClassRunner.java:63)
09:30:00 [2020-07-23T13:30:00.932Z] 	at org.junit.runners.ParentRunner$4.run(ParentRunner.java:331)
09:30:00 [2020-07-23T13:30:00.932Z] 	at org.junit.runners.ParentRunner$1.schedule(ParentRunner.java:79)
09:30:00 [2020-07-23T13:30:00.933Z] 	at org.junit.runners.ParentRunner.runChildren(ParentRunner.java:329)
09:30:00 [2020-07-23T13:30:00.933Z] 	at org.junit.runners.ParentRunner.access$100(ParentRunner.java:66)
09:30:00 [2020-07-23T13:30:00.933Z] 	at org.junit.runners.ParentRunner$2.evaluate(ParentRunner.java:293)
09:30:00 [2020-07-23T13:30:00.933Z] 	at org.junit.internal.runners.statements.RunBefores.evaluate(RunBefores.java:26)
09:30:00 [2020-07-23T13:30:00.933Z] 	at org.junit.runners.ParentRunner$3.evaluate(ParentRunner.java:306)
09:30:00 [2020-07-23T13:30:00.933Z] 	at org.junit.runners.ParentRunner.run(ParentRunner.java:413)
09:30:00 [2020-07-23T13:30:00.933Z] 	at org.apache.maven.surefire.junit4.JUnit4Provider.execute(JUnit4Provider.java:365)
09:30:00 [2020-07-23T13:30:00.933Z] 	at org.apache.maven.surefire.junit4.JUnit4Provider.executeWithRerun(JUnit4Provider.java:273)
09:30:00 [2020-07-23T13:30:00.933Z] 	at org.apache.maven.surefire.junit4.JUnit4Provider.executeTestSet(JUnit4Provider.java:238)
09:30:00 [2020-07-23T13:30:00.933Z] 	at org.apache.maven.surefire.junit4.JUnit4Provider.invoke(JUnit4Provider.java:159)
09:30:00 [2020-07-23T13:30:00.933Z] 	at sun.reflect.NativeMethodAccessorImpl.invoke0(Native Method)
09:30:00 [2020-07-23T13:30:00.933Z] 	at sun.reflect.NativeMethodAccessorImpl.invoke(NativeMethodAccessorImpl.java:62)
09:30:00 [2020-07-23T13:30:00.933Z] 	at sun.reflect.DelegatingMethodAccessorImpl.invoke(DelegatingMethodAccessorImpl.java:43)
09:30:00 [2020-07-23T13:30:00.933Z] 	at java.lang.reflect.Method.invoke(Method.java:498)
09:30:00 [2020-07-23T13:30:00.933Z] 	at org.apache.maven.surefire.util.ReflectionUtils.invokeMethodWithArray2(ReflectionUtils.java:206)
09:30:00 [2020-07-23T13:30:00.933Z] 	at org.apache.maven.surefire.booter.ProviderFactory$ProviderProxy.invoke(ProviderFactory.java:161)
09:30:00 [2020-07-23T13:30:00.933Z] 	at org.apache.maven.surefire.booter.ProviderFactory.invokeProvider(ProviderFactory.java:84)
09:30:00 [2020-07-23T13:30:00.933Z] 	at org.eclipse.tycho.surefire.osgibooter.OsgiSurefireBooter.run(OsgiSurefireBooter.java:113)
09:30:00 [2020-07-23T13:30:00.933Z] 	at org.eclipse.tycho.surefire.osgibooter.AbstractUITestApplication.runTests(AbstractUITestApplication.java:44)
09:30:00 [2020-07-23T13:30:00.933Z] 	at org.eclipse.e4.ui.internal.workbench.swt.E4Testable$1.run(E4Testable.java:73)
09:30:00 [2020-07-23T13:30:00.933Z] 	at java.lang.Thread.run(Thread.java:748)
09:30:01 [2020-07-23T13:30:01.191Z] 
09:30:01 [2020-07-23T13:30:01.191Z] !ENTRY org.eclipse.egit.ui 4 0 2020-07-23 13:30:01.166
09:30:01 [2020-07-23T13:30:01.191Z] !MESSAGE CrashingCommitMessageProvider fails on purpose.
09:30:01 [2020-07-23T13:30:01.191Z] !STACK 0
09:30:01 [2020-07-23T13:30:01.191Z] java.lang.IllegalStateException: CrashingCommitMessageProvider fails on purpose.
09:30:01 [2020-07-23T13:30:01.191Z] 	at org.eclipse.egit.ui.internal.dialogs.CommitMessageBuilderTest$CrashingCommitMessageProvider.getMessage(CommitMessageBuilderTest.java:474)
09:30:01 [2020-07-23T13:30:01.191Z] 	at org.eclipse.egit.ui.internal.dialogs.CommitMessageBuilder.build(CommitMessageBuilder.java:90)
09:30:01 [2020-07-23T13:30:01.191Z] 	at org.eclipse.egit.ui.internal.dialogs.CommitMessageBuilderTest.commitMessageProvider_multipleProvidersWithCrashAndNull(CommitMessageBuilderTest.java:165)
09:30:01 [2020-07-23T13:30:01.191Z] 	at sun.reflect.NativeMethodAccessorImpl.invoke0(Native Method)
09:30:01 [2020-07-23T13:30:01.191Z] 	at sun.reflect.NativeMethodAccessorImpl.invoke(NativeMethodAccessorImpl.java:62)
09:30:01 [2020-07-23T13:30:01.191Z] 	at sun.reflect.DelegatingMethodAccessorImpl.invoke(DelegatingMethodAccessorImpl.java:43)
09:30:01 [2020-07-23T13:30:01.191Z] 	at java.lang.reflect.Method.invoke(Method.java:498)
09:30:01 [2020-07-23T13:30:01.191Z] 	at org.junit.runners.model.FrameworkMethod$1.runReflectiveCall(FrameworkMethod.java:59)
09:30:01 [2020-07-23T13:30:01.191Z] 	at org.junit.internal.runners.model.ReflectiveCallable.run(ReflectiveCallable.java:12)
09:30:01 [2020-07-23T13:30:01.191Z] 	at org.junit.runners.model.FrameworkMethod.invokeExplosively(FrameworkMethod.java:56)
09:30:01 [2020-07-23T13:30:01.191Z] 	at org.junit.internal.runners.statements.InvokeMethod.evaluate(InvokeMethod.java:17)
09:30:01 [2020-07-23T13:30:01.191Z] 	at org.junit.internal.runners.statements.RunBefores.evaluate(RunBefores.java:26)
09:30:01 [2020-07-23T13:30:01.191Z] 	at org.junit.internal.runners.statements.RunAfters.evaluate(RunAfters.java:27)
09:30:01 [2020-07-23T13:30:01.191Z] 	at org.junit.runners.ParentRunner$3.evaluate(ParentRunner.java:306)
09:30:01 [2020-07-23T13:30:01.191Z] 	at org.junit.runners.BlockJUnit4ClassRunner$1.evaluate(BlockJUnit4ClassRunner.java:100)
09:30:01 [2020-07-23T13:30:01.191Z] 	at org.junit.runners.ParentRunner.runLeaf(ParentRunner.java:366)
09:30:01 [2020-07-23T13:30:01.191Z] 	at org.junit.runners.BlockJUnit4ClassRunner.runChild(BlockJUnit4ClassRunner.java:103)
09:30:01 [2020-07-23T13:30:01.191Z] 	at org.junit.runners.BlockJUnit4ClassRunner.runChild(BlockJUnit4ClassRunner.java:63)
09:30:01 [2020-07-23T13:30:01.191Z] 	at org.junit.runners.ParentRunner$4.run(ParentRunner.java:331)
09:30:01 [2020-07-23T13:30:01.191Z] 	at org.junit.runners.ParentRunner$1.schedule(ParentRunner.java:79)
09:30:01 [2020-07-23T13:30:01.191Z] 	at org.junit.runners.ParentRunner.runChildren(ParentRunner.java:329)
09:30:01 [2020-07-23T13:30:01.191Z] 	at org.junit.runners.ParentRunner.access$100(ParentRunner.java:66)
09:30:01 [2020-07-23T13:30:01.191Z] 	at org.junit.runners.ParentRunner$2.evaluate(ParentRunner.java:293)
09:30:01 [2020-07-23T13:30:01.191Z] 	at org.junit.internal.runners.statements.RunBefores.evaluate(RunBefores.java:26)
09:30:01 [2020-07-23T13:30:01.191Z] 	at org.junit.runners.ParentRunner$3.evaluate(ParentRunner.java:306)
09:30:01 [2020-07-23T13:30:01.191Z] 	at org.junit.runners.ParentRunner.run(ParentRunner.java:413)
09:30:01 [2020-07-23T13:30:01.191Z] 	at org.apache.maven.surefire.junit4.JUnit4Provider.execute(JUnit4Provider.java:365)
09:30:01 [2020-07-23T13:30:01.191Z] 	at org.apache.maven.surefire.junit4.JUnit4Provider.executeWithRerun(JUnit4Provider.java:273)
09:30:01 [2020-07-23T13:30:01.191Z] 	at org.apache.maven.surefire.junit4.JUnit4Provider.executeTestSet(JUnit4Provider.java:238)
09:30:01 [2020-07-23T13:30:01.191Z] 	at org.apache.maven.surefire.junit4.JUnit4Provider.invoke(JUnit4Provider.java:159)
09:30:01 [2020-07-23T13:30:01.191Z] 	at sun.reflect.NativeMethodAccessorImpl.invoke0(Native Method)
09:30:01 [2020-07-23T13:30:01.191Z] 	at sun.reflect.NativeMethodAccessorImpl.invoke(NativeMethodAccessorImpl.java:62)
09:30:01 [2020-07-23T13:30:01.191Z] 	at sun.reflect.DelegatingMethodAccessorImpl.invoke(DelegatingMethodAccessorImpl.java:43)
09:30:01 [2020-07-23T13:30:01.191Z] 	at java.lang.reflect.Method.invoke(Method.java:498)
09:30:01 [2020-07-23T13:30:01.191Z] 	at org.apache.maven.surefire.util.ReflectionUtils.invokeMethodWithArray2(ReflectionUtils.java:206)
09:30:01 [2020-07-23T13:30:01.191Z] 	at org.apache.maven.surefire.booter.ProviderFactory$ProviderProxy.invoke(ProviderFactory.java:161)
09:30:01 [2020-07-23T13:30:01.191Z] 	at org.apache.maven.surefire.booter.ProviderFactory.invokeProvider(ProviderFactory.java:84)
09:30:01 [2020-07-23T13:30:01.191Z] 	at org.eclipse.tycho.surefire.osgibooter.OsgiSurefireBooter.run(OsgiSurefireBooter.java:113)
09:30:01 [2020-07-23T13:30:01.191Z] 	at org.eclipse.tycho.surefire.osgibooter.AbstractUITestApplication.runTests(AbstractUITestApplication.java:44)
09:30:01 [2020-07-23T13:30:01.191Z] 	at org.eclipse.e4.ui.internal.workbench.swt.E4Testable$1.run(E4Testable.java:73)
09:30:01 [2020-07-23T13:30:01.191Z] 	at java.lang.Thread.run(Thread.java:748)
09:30:01 [2020-07-23T13:30:01.191Z] 
09:30:01 [2020-07-23T13:30:01.191Z] !ENTRY org.eclipse.egit.ui 4 0 2020-07-23 13:30:01.166
09:30:01 [2020-07-23T13:30:01.191Z] !MESSAGE CrashingCommitMessageProvider fails on purpose.
09:30:01 [2020-07-23T13:30:01.191Z] !STACK 0
09:30:01 [2020-07-23T13:30:01.191Z] java.lang.IllegalStateException: CrashingCommitMessageProvider fails on purpose.
09:30:01 [2020-07-23T13:30:01.191Z] 	at org.eclipse.egit.ui.internal.dialogs.CommitMessageBuilderTest$CrashingCommitMessageProvider.getMessage(CommitMessageBuilderTest.java:474)
09:30:01 [2020-07-23T13:30:01.191Z] 	at org.eclipse.egit.ui.internal.dialogs.CommitMessageBuilder.build(CommitMessageBuilder.java:90)
09:30:01 [2020-07-23T13:30:01.191Z] 	at org.eclipse.egit.ui.internal.dialogs.CommitMessageBuilderTest.commitMessageProvider_multipleProvidersWithCrashAndNull(CommitMessageBuilderTest.java:165)
09:30:01 [2020-07-23T13:30:01.191Z] 	at sun.reflect.NativeMethodAccessorImpl.invoke0(Native Method)
09:30:01 [2020-07-23T13:30:01.191Z] 	at sun.reflect.NativeMethodAccessorImpl.invoke(NativeMethodAccessorImpl.java:62)
09:30:01 [2020-07-23T13:30:01.191Z] 	at sun.reflect.DelegatingMethodAccessorImpl.invoke(DelegatingMethodAccessorImpl.java:43)
09:30:01 [2020-07-23T13:30:01.191Z] 	at java.lang.reflect.Method.invoke(Method.java:498)
09:30:01 [2020-07-23T13:30:01.191Z] 	at org.junit.runners.model.FrameworkMethod$1.runReflectiveCall(FrameworkMethod.java:59)
09:30:01 [2020-07-23T13:30:01.191Z] 	at org.junit.internal.runners.model.ReflectiveCallable.run(ReflectiveCallable.java:12)
09:30:01 [2020-07-23T13:30:01.191Z] 	at org.junit.runners.model.FrameworkMethod.invokeExplosively(FrameworkMethod.java:56)
09:30:01 [2020-07-23T13:30:01.191Z] 	at org.junit.internal.runners.statements.InvokeMethod.evaluate(InvokeMethod.java:17)
09:30:01 [2020-07-23T13:30:01.191Z] 	at org.junit.internal.runners.statements.RunBefores.evaluate(RunBefores.java:26)
09:30:01 [2020-07-23T13:30:01.191Z] 	at org.junit.internal.runners.statements.RunAfters.evaluate(RunAfters.java:27)
09:30:01 [2020-07-23T13:30:01.191Z] 	at org.junit.runners.ParentRunner$3.evaluate(ParentRunner.java:306)
09:30:01 [2020-07-23T13:30:01.191Z] 	at org.junit.runners.BlockJUnit4ClassRunner$1.evaluate(BlockJUnit4ClassRunner.java:100)
09:30:01 [2020-07-23T13:30:01.191Z] 	at org.junit.runners.ParentRunner.runLeaf(ParentRunner.java:366)
09:30:01 [2020-07-23T13:30:01.191Z] 	at org.junit.runners.BlockJUnit4ClassRunner.runChild(BlockJUnit4ClassRunner.java:103)
09:30:01 [2020-07-23T13:30:01.191Z] 	at org.junit.runners.BlockJUnit4ClassRunner.runChild(BlockJUnit4ClassRunner.java:63)
09:30:01 [2020-07-23T13:30:01.191Z] 	at org.junit.runners.ParentRunner$4.run(ParentRunner.java:331)
09:30:01 [2020-07-23T13:30:01.191Z] 	at org.junit.runners.ParentRunner$1.schedule(ParentRunner.java:79)
09:30:01 [2020-07-23T13:30:01.191Z] 	at org.junit.runners.ParentRunner.runChildren(ParentRunner.java:329)
09:30:01 [2020-07-23T13:30:01.191Z] 	at org.junit.runners.ParentRunner.access$100(ParentRunner.java:66)
09:30:01 [2020-07-23T13:30:01.191Z] 	at org.junit.runners.ParentRunner$2.evaluate(ParentRunner.java:293)
09:30:01 [2020-07-23T13:30:01.191Z] 	at org.junit.internal.runners.statements.RunBefores.evaluate(RunBefores.java:26)
09:30:01 [2020-07-23T13:30:01.191Z] 	at org.junit.runners.ParentRunner$3.evaluate(ParentRunner.java:306)
09:30:01 [2020-07-23T13:30:01.191Z] 	at org.junit.runners.ParentRunner.run(ParentRunner.java:413)
09:30:01 [2020-07-23T13:30:01.191Z] 	at org.apache.maven.surefire.junit4.JUnit4Provider.execute(JUnit4Provider.java:365)
09:30:01 [2020-07-23T13:30:01.191Z] 	at org.apache.maven.surefire.junit4.JUnit4Provider.executeWithRerun(JUnit4Provider.java:273)
09:30:01 [2020-07-23T13:30:01.191Z] 	at org.apache.maven.surefire.junit4.JUnit4Provider.executeTestSet(JUnit4Provider.java:238)
09:30:01 [2020-07-23T13:30:01.191Z] 	at org.apache.maven.surefire.junit4.JUnit4Provider.invoke(JUnit4Provider.java:159)
09:30:01 [2020-07-23T13:30:01.191Z] 	at sun.reflect.NativeMethodAccessorImpl.invoke0(Native Method)
09:30:01 [2020-07-23T13:30:01.191Z] 	at sun.reflect.NativeMethodAccessorImpl.invoke(NativeMethodAccessorImpl.java:62)
09:30:01 [2020-07-23T13:30:01.191Z] 	at sun.reflect.DelegatingMethodAccessorImpl.invoke(DelegatingMethodAccessorImpl.java:43)
09:30:01 [2020-07-23T13:30:01.191Z] 	at java.lang.reflect.Method.invoke(Method.java:498)
09:30:01 [2020-07-23T13:30:01.191Z] 	at org.apache.maven.surefire.util.ReflectionUtils.invokeMethodWithArray2(ReflectionUtils.java:206)
09:30:01 [2020-07-23T13:30:01.191Z] 	at org.apache.maven.surefire.booter.ProviderFactory$ProviderProxy.invoke(ProviderFactory.java:161)
09:30:01 [2020-07-23T13:30:01.191Z] 	at org.apache.maven.surefire.booter.ProviderFactory.invokeProvider(ProviderFactory.java:84)
09:30:01 [2020-07-23T13:30:01.191Z] 	at org.eclipse.tycho.surefire.osgibooter.OsgiSurefireBooter.run(OsgiSurefireBooter.java:113)
09:30:01 [2020-07-23T13:30:01.191Z] 	at org.eclipse.tycho.surefire.osgibooter.AbstractUITestApplication.runTests(AbstractUITestApplication.java:44)
09:30:01 [2020-07-23T13:30:01.191Z] 	at org.eclipse.e4.ui.internal.workbench.swt.E4Testable$1.run(E4Testable.java:73)
09:30:01 [2020-07-23T13:30:01.191Z] 	at java.lang.Thread.run(Thread.java:748)
09:30:01 [2020-07-23T13:30:01.449Z] 
09:30:01 [2020-07-23T13:30:01.449Z] !ENTRY org.eclipse.egit.ui 2 0 2020-07-23 13:30:01.267
09:30:01 [2020-07-23T13:30:01.449Z] !MESSAGE The ICommitMessageProvider2 implementation org.eclipse.egit.ui.internal.dialogs.CommitMessageBuilderTest$3 provided the caret position -42, which exceeds the length of the commit message or is negative. The caret position is ignored.
09:30:02 [2020-07-23T13:30:02.819Z] 
09:30:02 [2020-07-23T13:30:02.820Z] !ENTRY org.eclipse.egit.ui 2 0 2020-07-23 13:30:02.764
09:30:02 [2020-07-23T13:30:02.820Z] !MESSAGE Found multiple implementations of ICommitMessageProvider2. Ignoring caret positioning for org.eclipse.egit.ui.internal.dialogs.CommitMessageBuilderTest$3.
09:30:04 [2020-07-23T13:30:04.195Z] 
09:30:04 [2020-07-23T13:30:04.195Z] !ENTRY org.eclipse.egit.ui 4 0 2020-07-23 13:30:04.185
09:30:04 [2020-07-23T13:30:04.195Z] !MESSAGE CrashingCommitMessageProvider fails on purpose.
09:30:04 [2020-07-23T13:30:04.195Z] !STACK 0
09:30:04 [2020-07-23T13:30:04.195Z] java.lang.IllegalStateException: CrashingCommitMessageProvider fails on purpose.
09:30:04 [2020-07-23T13:30:04.195Z] 	at org.eclipse.egit.ui.internal.dialogs.CommitMessageBuilderTest$CrashingCommitMessageProvider.getMessage(CommitMessageBuilderTest.java:474)
09:30:04 [2020-07-23T13:30:04.195Z] 	at org.eclipse.egit.ui.internal.dialogs.CommitMessageBuilder.build(CommitMessageBuilder.java:90)
09:30:04 [2020-07-23T13:30:04.195Z] 	at org.eclipse.egit.ui.internal.dialogs.CommitMessageBuilderTest.commitMessageProvider_twoProvidersSecondOneCrashing(CommitMessageBuilderTest.java:130)
09:30:04 [2020-07-23T13:30:04.195Z] 	at sun.reflect.NativeMethodAccessorImpl.invoke0(Native Method)
09:30:04 [2020-07-23T13:30:04.195Z] 	at sun.reflect.NativeMethodAccessorImpl.invoke(NativeMethodAccessorImpl.java:62)
09:30:04 [2020-07-23T13:30:04.195Z] 	at sun.reflect.DelegatingMethodAccessorImpl.invoke(DelegatingMethodAccessorImpl.java:43)
09:30:04 [2020-07-23T13:30:04.195Z] 	at java.lang.reflect.Method.invoke(Method.java:498)
09:30:04 [2020-07-23T13:30:04.195Z] 	at org.junit.runners.model.FrameworkMethod$1.runReflectiveCall(FrameworkMethod.java:59)
09:30:04 [2020-07-23T13:30:04.195Z] 	at org.junit.internal.runners.model.ReflectiveCallable.run(ReflectiveCallable.java:12)
09:30:04 [2020-07-23T13:30:04.195Z] 	at org.junit.runners.model.FrameworkMethod.invokeExplosively(FrameworkMethod.java:56)
09:30:04 [2020-07-23T13:30:04.195Z] 	at org.junit.internal.runners.statements.InvokeMethod.evaluate(InvokeMethod.java:17)
09:30:04 [2020-07-23T13:30:04.195Z] 	at org.junit.internal.runners.statements.RunBefores.evaluate(RunBefores.java:26)
09:30:04 [2020-07-23T13:30:04.195Z] 	at org.junit.internal.runners.statements.RunAfters.evaluate(RunAfters.java:27)
09:30:04 [2020-07-23T13:30:04.195Z] 	at org.junit.runners.ParentRunner$3.evaluate(ParentRunner.java:306)
09:30:04 [2020-07-23T13:30:04.195Z] 	at org.junit.runners.BlockJUnit4ClassRunner$1.evaluate(BlockJUnit4ClassRunner.java:100)
09:30:04 [2020-07-23T13:30:04.195Z] 	at org.junit.runners.ParentRunner.runLeaf(ParentRunner.java:366)
09:30:04 [2020-07-23T13:30:04.195Z] 	at org.junit.runners.BlockJUnit4ClassRunner.runChild(BlockJUnit4ClassRunner.java:103)
09:30:04 [2020-07-23T13:30:04.195Z] 	at org.junit.runners.BlockJUnit4ClassRunner.runChild(BlockJUnit4ClassRunner.java:63)
09:30:04 [2020-07-23T13:30:04.196Z] 	at org.junit.runners.ParentRunner$4.run(ParentRunner.java:331)
09:30:04 [2020-07-23T13:30:04.196Z] 	at org.junit.runners.ParentRunner$1.schedule(ParentRunner.java:79)
09:30:04 [2020-07-23T13:30:04.196Z] 	at org.junit.runners.ParentRunner.runChildren(ParentRunner.java:329)
09:30:04 [2020-07-23T13:30:04.196Z] 	at org.junit.runners.ParentRunner.access$100(ParentRunner.java:66)
09:30:04 [2020-07-23T13:30:04.196Z] 	at org.junit.runners.ParentRunner$2.evaluate(ParentRunner.java:293)
09:30:04 [2020-07-23T13:30:04.196Z] 	at org.junit.internal.runners.statements.RunBefores.evaluate(RunBefores.java:26)
09:30:04 [2020-07-23T13:30:04.196Z] 	at org.junit.runners.ParentRunner$3.evaluate(ParentRunner.java:306)
09:30:04 [2020-07-23T13:30:04.196Z] 	at org.junit.runners.ParentRunner.run(ParentRunner.java:413)
09:30:04 [2020-07-23T13:30:04.196Z] 	at org.apache.maven.surefire.junit4.JUnit4Provider.execute(JUnit4Provider.java:365)
09:30:04 [2020-07-23T13:30:04.196Z] 	at org.apache.maven.surefire.junit4.JUnit4Provider.executeWithRerun(JUnit4Provider.java:273)
09:30:04 [2020-07-23T13:30:04.196Z] 	at org.apache.maven.surefire.junit4.JUnit4Provider.executeTestSet(JUnit4Provider.java:238)
09:30:04 [2020-07-23T13:30:04.196Z] 	at org.apache.maven.surefire.junit4.JUnit4Provider.invoke(JUnit4Provider.java:159)
09:30:04 [2020-07-23T13:30:04.196Z] 	at sun.reflect.NativeMethodAccessorImpl.invoke0(Native Method)
09:30:04 [2020-07-23T13:30:04.196Z] 	at sun.reflect.NativeMethodAccessorImpl.invoke(NativeMethodAccessorImpl.java:62)
09:30:04 [2020-07-23T13:30:04.196Z] 	at sun.reflect.DelegatingMethodAccessorImpl.invoke(DelegatingMethodAccessorImpl.java:43)
09:30:04 [2020-07-23T13:30:04.196Z] 	at java.lang.reflect.Method.invoke(Method.java:498)
09:30:04 [2020-07-23T13:30:04.196Z] 	at org.apache.maven.surefire.util.ReflectionUtils.invokeMethodWithArray2(ReflectionUtils.java:206)
09:30:04 [2020-07-23T13:30:04.196Z] 	at org.apache.maven.surefire.booter.ProviderFactory$ProviderProxy.invoke(ProviderFactory.java:161)
09:30:04 [2020-07-23T13:30:04.196Z] 	at org.apache.maven.surefire.booter.ProviderFactory.invokeProvider(ProviderFactory.java:84)
09:30:04 [2020-07-23T13:30:04.196Z] 	at org.eclipse.tycho.surefire.osgibooter.OsgiSurefireBooter.run(OsgiSurefireBooter.java:113)
09:30:04 [2020-07-23T13:30:04.196Z] 	at org.eclipse.tycho.surefire.osgibooter.AbstractUITestApplication.runTests(AbstractUITestApplication.java:44)
09:30:04 [2020-07-23T13:30:04.196Z] 	at org.eclipse.e4.ui.internal.workbench.swt.E4Testable$1.run(E4Testable.java:73)
09:30:04 [2020-07-23T13:30:04.196Z] 	at java.lang.Thread.run(Thread.java:748)
09:30:04 [2020-07-23T13:30:04.466Z] 
09:30:04 [2020-07-23T13:30:04.466Z] !ENTRY org.eclipse.egit.ui 4 0 2020-07-23 13:30:04.270
09:30:04 [2020-07-23T13:30:04.466Z] !MESSAGE CrashingCommitMessageProvider fails on purpose.
09:30:04 [2020-07-23T13:30:04.466Z] !STACK 0
09:30:04 [2020-07-23T13:30:04.466Z] java.lang.IllegalStateException: CrashingCommitMessageProvider fails on purpose.
09:30:04 [2020-07-23T13:30:04.467Z] 	at org.eclipse.egit.ui.internal.dialogs.CommitMessageBuilderTest$CrashingCommitMessageProvider.getMessage(CommitMessageBuilderTest.java:474)
09:30:04 [2020-07-23T13:30:04.467Z] 	at org.eclipse.egit.ui.internal.dialogs.CommitMessageBuilder.build(CommitMessageBuilder.java:90)
09:30:04 [2020-07-23T13:30:04.467Z] 	at org.eclipse.egit.ui.internal.dialogs.CommitMessageBuilderTest.commitMessageProvider_multipleProvidersWithCrashingAndNullAndOneCaretPositioning(CommitMessageBuilderTest.java:414)
09:30:04 [2020-07-23T13:30:04.467Z] 	at sun.reflect.NativeMethodAccessorImpl.invoke0(Native Method)
09:30:04 [2020-07-23T13:30:04.467Z] 	at sun.reflect.NativeMethodAccessorImpl.invoke(NativeMethodAccessorImpl.java:62)
09:30:04 [2020-07-23T13:30:04.467Z] 	at sun.reflect.DelegatingMethodAccessorImpl.invoke(DelegatingMethodAccessorImpl.java:43)
09:30:04 [2020-07-23T13:30:04.467Z] 	at java.lang.reflect.Method.invoke(Method.java:498)
09:30:04 [2020-07-23T13:30:04.467Z] 	at org.junit.runners.model.FrameworkMethod$1.runReflectiveCall(FrameworkMethod.java:59)
09:30:04 [2020-07-23T13:30:04.467Z] 	at org.junit.internal.runners.model.ReflectiveCallable.run(ReflectiveCallable.java:12)
09:30:04 [2020-07-23T13:30:04.467Z] 	at org.junit.runners.model.FrameworkMethod.invokeExplosively(FrameworkMethod.java:56)
09:30:04 [2020-07-23T13:30:04.467Z] 	at org.junit.internal.runners.statements.InvokeMethod.evaluate(InvokeMethod.java:17)
09:30:04 [2020-07-23T13:30:04.467Z] 	at org.junit.internal.runners.statements.RunBefores.evaluate(RunBefores.java:26)
09:30:04 [2020-07-23T13:30:04.467Z] 	at org.junit.internal.runners.statements.RunAfters.evaluate(RunAfters.java:27)
09:30:04 [2020-07-23T13:30:04.467Z] 	at org.junit.runners.ParentRunner$3.evaluate(ParentRunner.java:306)
09:30:04 [2020-07-23T13:30:04.467Z] 	at org.junit.runners.BlockJUnit4ClassRunner$1.evaluate(BlockJUnit4ClassRunner.java:100)
09:30:04 [2020-07-23T13:30:04.467Z] 	at org.junit.runners.ParentRunner.runLeaf(ParentRunner.java:366)
09:30:04 [2020-07-23T13:30:04.467Z] 	at org.junit.runners.BlockJUnit4ClassRunner.runChild(BlockJUnit4ClassRunner.java:103)
09:30:04 [2020-07-23T13:30:04.467Z] 	at org.junit.runners.BlockJUnit4ClassRunner.runChild(BlockJUnit4ClassRunner.java:63)
09:30:04 [2020-07-23T13:30:04.467Z] 	at org.junit.runners.ParentRunner$4.run(ParentRunner.java:331)
09:30:04 [2020-07-23T13:30:04.467Z] 	at org.junit.runners.ParentRunner$1.schedule(ParentRunner.java:79)
09:30:04 [2020-07-23T13:30:04.467Z] 	at org.junit.runners.ParentRunner.runChildren(ParentRunner.java:329)
09:30:04 [2020-07-23T13:30:04.467Z] 	at org.junit.runners.ParentRunner.access$100(ParentRunner.java:66)
09:30:04 [2020-07-23T13:30:04.467Z] 	at org.junit.runners.ParentRunner$2.evaluate(ParentRunner.java:293)
09:30:04 [2020-07-23T13:30:04.467Z] 	at org.junit.internal.runners.statements.RunBefores.evaluate(RunBefores.java:26)
09:30:04 [2020-07-23T13:30:04.467Z] 	at org.junit.runners.ParentRunner$3.evaluate(ParentRunner.java:306)
09:30:04 [2020-07-23T13:30:04.467Z] 	at org.junit.runners.ParentRunner.run(ParentRunner.java:413)
09:30:04 [2020-07-23T13:30:04.467Z] 	at org.apache.maven.surefire.junit4.JUnit4Provider.execute(JUnit4Provider.java:365)
09:30:04 [2020-07-23T13:30:04.467Z] 	at org.apache.maven.surefire.junit4.JUnit4Provider.executeWithRerun(JUnit4Provider.java:273)
09:30:04 [2020-07-23T13:30:04.467Z] 	at org.apache.maven.surefire.junit4.JUnit4Provider.executeTestSet(JUnit4Provider.java:238)
09:30:04 [2020-07-23T13:30:04.467Z] 	at org.apache.maven.surefire.junit4.JUnit4Provider.invoke(JUnit4Provider.java:159)
09:30:04 [2020-07-23T13:30:04.467Z] 	at sun.reflect.NativeMethodAccessorImpl.invoke0(Native Method)
09:30:04 [2020-07-23T13:30:04.467Z] 	at sun.reflect.NativeMethodAccessorImpl.invoke(NativeMethodAccessorImpl.java:62)
09:30:04 [2020-07-23T13:30:04.467Z] 	at sun.reflect.DelegatingMethodAccessorImpl.invoke(DelegatingMethodAccessorImpl.java:43)
09:30:04 [2020-07-23T13:30:04.467Z] 	at java.lang.reflect.Method.invoke(Method.java:498)
09:30:04 [2020-07-23T13:30:04.467Z] 	at org.apache.maven.surefire.util.ReflectionUtils.invokeMethodWithArray2(ReflectionUtils.java:206)
09:30:04 [2020-07-23T13:30:04.467Z] 	at org.apache.maven.surefire.booter.ProviderFactory$ProviderProxy.invoke(ProviderFactory.java:161)
09:30:04 [2020-07-23T13:30:04.467Z] 	at org.apache.maven.surefire.booter.ProviderFactory.invokeProvider(ProviderFactory.java:84)
09:30:04 [2020-07-23T13:30:04.467Z] 	at org.eclipse.tycho.surefire.osgibooter.OsgiSurefireBooter.run(OsgiSurefireBooter.java:113)
09:30:04 [2020-07-23T13:30:04.467Z] 	at org.eclipse.tycho.surefire.osgibooter.AbstractUITestApplication.runTests(AbstractUITestApplication.java:44)
09:30:04 [2020-07-23T13:30:04.467Z] 	at org.eclipse.e4.ui.internal.workbench.swt.E4Testable$1.run(E4Testable.java:73)
09:30:04 [2020-07-23T13:30:04.467Z] 	at java.lang.Thread.run(Thread.java:748)
09:30:04 [2020-07-23T13:30:04.467Z] 
09:30:04 [2020-07-23T13:30:04.467Z] !ENTRY org.eclipse.egit.ui 4 0 2020-07-23 13:30:04.271
09:30:04 [2020-07-23T13:30:04.467Z] !MESSAGE CrashingCommitMessageProvider fails on purpose.
09:30:04 [2020-07-23T13:30:04.467Z] !STACK 0
09:30:04 [2020-07-23T13:30:04.467Z] java.lang.IllegalStateException: CrashingCommitMessageProvider fails on purpose.
09:30:04 [2020-07-23T13:30:04.467Z] 	at org.eclipse.egit.ui.internal.dialogs.CommitMessageBuilderTest$CrashingCommitMessageProvider.getMessage(CommitMessageBuilderTest.java:474)
09:30:04 [2020-07-23T13:30:04.467Z] 	at org.eclipse.egit.ui.internal.dialogs.CommitMessageBuilder.build(CommitMessageBuilder.java:90)
09:30:04 [2020-07-23T13:30:04.467Z] 	at org.eclipse.egit.ui.internal.dialogs.CommitMessageBuilderTest.commitMessageProvider_multipleProvidersWithCrashingAndNullAndOneCaretPositioning(CommitMessageBuilderTest.java:414)
09:30:04 [2020-07-23T13:30:04.467Z] 	at sun.reflect.NativeMethodAccessorImpl.invoke0(Native Method)
09:30:04 [2020-07-23T13:30:04.467Z] 	at sun.reflect.NativeMethodAccessorImpl.invoke(NativeMethodAccessorImpl.java:62)
09:30:04 [2020-07-23T13:30:04.467Z] 	at sun.reflect.DelegatingMethodAccessorImpl.invoke(DelegatingMethodAccessorImpl.java:43)
09:30:04 [2020-07-23T13:30:04.467Z] 	at java.lang.reflect.Method.invoke(Method.java:498)
09:30:04 [2020-07-23T13:30:04.467Z] 	at org.junit.runners.model.FrameworkMethod$1.runReflectiveCall(FrameworkMethod.java:59)
09:30:04 [2020-07-23T13:30:04.467Z] 	at org.junit.internal.runners.model.ReflectiveCallable.run(ReflectiveCallable.java:12)
09:30:04 [2020-07-23T13:30:04.467Z] 	at org.junit.runners.model.FrameworkMethod.invokeExplosively(FrameworkMethod.java:56)
09:30:04 [2020-07-23T13:30:04.467Z] 	at org.junit.internal.runners.statements.InvokeMethod.evaluate(InvokeMethod.java:17)
09:30:04 [2020-07-23T13:30:04.467Z] 	at org.junit.internal.runners.statements.RunBefores.evaluate(RunBefores.java:26)
09:30:04 [2020-07-23T13:30:04.467Z] 	at org.junit.internal.runners.statements.RunAfters.evaluate(RunAfters.java:27)
09:30:04 [2020-07-23T13:30:04.467Z] 	at org.junit.runners.ParentRunner$3.evaluate(ParentRunner.java:306)
09:30:04 [2020-07-23T13:30:04.467Z] 	at org.junit.runners.BlockJUnit4ClassRunner$1.evaluate(BlockJUnit4ClassRunner.java:100)
09:30:04 [2020-07-23T13:30:04.467Z] 	at org.junit.runners.ParentRunner.runLeaf(ParentRunner.java:366)
09:30:04 [2020-07-23T13:30:04.467Z] 	at org.junit.runners.BlockJUnit4ClassRunner.runChild(BlockJUnit4ClassRunner.java:103)
09:30:04 [2020-07-23T13:30:04.467Z] 	at org.junit.runners.BlockJUnit4ClassRunner.runChild(BlockJUnit4ClassRunner.java:63)
09:30:04 [2020-07-23T13:30:04.467Z] 	at org.junit.runners.ParentRunner$4.run(ParentRunner.java:331)
09:30:04 [2020-07-23T13:30:04.467Z] 	at org.junit.runners.ParentRunner$1.schedule(ParentRunner.java:79)
09:30:04 [2020-07-23T13:30:04.467Z] 	at org.junit.runners.ParentRunner.runChildren(ParentRunner.java:329)
09:30:04 [2020-07-23T13:30:04.467Z] 	at org.junit.runners.ParentRunner.access$100(ParentRunner.java:66)
09:30:04 [2020-07-23T13:30:04.467Z] 	at org.junit.runners.ParentRunner$2.evaluate(ParentRunner.java:293)
09:30:04 [2020-07-23T13:30:04.467Z] 	at org.junit.internal.runners.statements.RunBefores.evaluate(RunBefores.java:26)
09:30:04 [2020-07-23T13:30:04.467Z] 	at org.junit.runners.ParentRunner$3.evaluate(ParentRunner.java:306)
09:30:04 [2020-07-23T13:30:04.467Z] 	at org.junit.runners.ParentRunner.run(ParentRunner.java:413)
09:30:04 [2020-07-23T13:30:04.467Z] 	at org.apache.maven.surefire.junit4.JUnit4Provider.execute(JUnit4Provider.java:365)
09:30:04 [2020-07-23T13:30:04.467Z] 	at org.apache.maven.surefire.junit4.JUnit4Provider.executeWithRerun(JUnit4Provider.java:273)
09:30:04 [2020-07-23T13:30:04.467Z] 	at org.apache.maven.surefire.junit4.JUnit4Provider.executeTestSet(JUnit4Provider.java:238)
09:30:04 [2020-07-23T13:30:04.467Z] 	at org.apache.maven.surefire.junit4.JUnit4Provider.invoke(JUnit4Provider.java:159)
09:30:04 [2020-07-23T13:30:04.467Z] 	at sun.reflect.NativeMethodAccessorImpl.invoke0(Native Method)
09:30:04 [2020-07-23T13:30:04.467Z] 	at sun.reflect.NativeMethodAccessorImpl.invoke(NativeMethodAccessorImpl.java:62)
09:30:04 [2020-07-23T13:30:04.467Z] 	at sun.reflect.DelegatingMethodAccessorImpl.invoke(DelegatingMethodAccessorImpl.java:43)
09:30:04 [2020-07-23T13:30:04.467Z] 	at java.lang.reflect.Method.invoke(Method.java:498)
09:30:04 [2020-07-23T13:30:04.467Z] 	at org.apache.maven.surefire.util.ReflectionUtils.invokeMethodWithArray2(ReflectionUtils.java:206)
09:30:04 [2020-07-23T13:30:04.467Z] 	at org.apache.maven.surefire.booter.ProviderFactory$ProviderProxy.invoke(ProviderFactory.java:161)
09:30:04 [2020-07-23T13:30:04.467Z] 	at org.apache.maven.surefire.booter.ProviderFactory.invokeProvider(ProviderFactory.java:84)
09:30:04 [2020-07-23T13:30:04.467Z] 	at org.eclipse.tycho.surefire.osgibooter.OsgiSurefireBooter.run(OsgiSurefireBooter.java:113)
09:30:04 [2020-07-23T13:30:04.467Z] 	at org.eclipse.tycho.surefire.osgibooter.AbstractUITestApplication.runTests(AbstractUITestApplication.java:44)
09:30:04 [2020-07-23T13:30:04.467Z] 	at org.eclipse.e4.ui.internal.workbench.swt.E4Testable$1.run(E4Testable.java:73)
09:30:04 [2020-07-23T13:30:04.467Z] 	at java.lang.Thread.run(Thread.java:748)
09:30:05 [2020-07-23T13:30:05.399Z] 
09:30:05 [2020-07-23T13:30:05.399Z] !ENTRY org.eclipse.egit.ui 2 0 2020-07-23 13:30:05.374
09:30:05 [2020-07-23T13:30:05.399Z] !MESSAGE Found multiple implementations of ICommitMessageProvider2. Ignoring caret positioning for org.eclipse.egit.ui.internal.dialogs.CommitMessageBuilderTest$3.
09:30:05 [2020-07-23T13:30:05.657Z] 
09:30:05 [2020-07-23T13:30:05.657Z] !ENTRY org.eclipse.egit.ui 2 0 2020-07-23 13:30:05.478
09:30:05 [2020-07-23T13:30:05.657Z] !MESSAGE The ICommitMessageProvider2 implementation org.eclipse.egit.ui.internal.dialogs.CommitMessageBuilderTest$3 provided the caret position 14, which exceeds the length of the commit message or is negative. The caret position is ignored.
09:30:05 [2020-07-23T13:30:05.657Z] Tests run: 20, Failures: 0, Errors: 0, Skipped: 0, Time elapsed: 6.061 s - in org.eclipse.egit.ui.internal.dialogs.CommitMessageBuilderTest
09:30:05 [2020-07-23T13:30:05.657Z] commitMessageProvider_oneCrashingProvider(org.eclipse.egit.ui.internal.dialogs.CommitMessageBuilderTest)  Time elapsed: 0.103 s
09:30:05 [2020-07-23T13:30:05.657Z] commitMessageProvider_twoProvidersSecondWithCaretPositioning(org.eclipse.egit.ui.internal.dialogs.CommitMessageBuilderTest)  Time elapsed: 0.092 s
09:30:05 [2020-07-23T13:30:05.657Z] commitMessageProvider_oneCrashingProviderWithCaretPosition(org.eclipse.egit.ui.internal.dialogs.CommitMessageBuilderTest)  Time elapsed: 1.166 s
09:30:05 [2020-07-23T13:30:05.657Z] commitMessageProvider_twoProvidersFirstOneCrashing(org.eclipse.egit.ui.internal.dialogs.CommitMessageBuilderTest)  Time elapsed: 0.099 s
09:30:05 [2020-07-23T13:30:05.657Z] commitMessageProvider_noProvider(org.eclipse.egit.ui.internal.dialogs.CommitMessageBuilderTest)  Time elapsed: 0.104 s
09:30:05 [2020-07-23T13:30:05.657Z] commitMessageProvider_oneProvider(org.eclipse.egit.ui.internal.dialogs.CommitMessageBuilderTest)  Time elapsed: 0.088 s
09:30:05 [2020-07-23T13:30:05.657Z] commitMessageProvider_multipleProvidersWithCrashAndNull(org.eclipse.egit.ui.internal.dialogs.CommitMessageBuilderTest)  Time elapsed: 0.095 s
09:30:05 [2020-07-23T13:30:05.657Z] commitMessageProvider_oneProviderWithInvalidNegativeCaretPosition(org.eclipse.egit.ui.internal.dialogs.CommitMessageBuilderTest)  Time elapsed: 0.107 s
09:30:05 [2020-07-23T13:30:05.657Z] commitMessageProvider_twoProvidersSecondWithUndefinedCaretPosition(org.eclipse.egit.ui.internal.dialogs.CommitMessageBuilderTest)  Time elapsed: 1.056 s
09:30:05 [2020-07-23T13:30:05.657Z] commitMessageProvider_twoProvidersWithCaretPositioningFirstWithUndefinedCaretPosition(org.eclipse.egit.ui.internal.dialogs.CommitMessageBuilderTest)  Time elapsed: 0.152 s
09:30:05 [2020-07-23T13:30:05.657Z] commitMessageProvider_oneProviderWithCaretPositionEqualsMessageLength(org.eclipse.egit.ui.internal.dialogs.CommitMessageBuilderTest)  Time elapsed: 0.09 s
09:30:05 [2020-07-23T13:30:05.657Z] commitMessageProvider_twoProvidersFirstWithCaretPositioning(org.eclipse.egit.ui.internal.dialogs.CommitMessageBuilderTest)  Time elapsed: 0.095 s
09:30:05 [2020-07-23T13:30:05.657Z] commitMessageProvider_twoProvidersWithCaretPositioningSecondWithUndefinedCaretPosition(org.eclipse.egit.ui.internal.dialogs.CommitMessageBuilderTest)  Time elapsed: 0.095 s
09:30:05 [2020-07-23T13:30:05.657Z] commitMessageProvider_oneProviderWithCaretPositioning(org.eclipse.egit.ui.internal.dialogs.CommitMessageBuilderTest)  Time elapsed: 1.099 s
09:30:05 [2020-07-23T13:30:05.657Z] commitMessageProvider_twoProvidersSecondWithCaretPositionZero(org.eclipse.egit.ui.internal.dialogs.CommitMessageBuilderTest)  Time elapsed: 0.106 s
09:30:05 [2020-07-23T13:30:05.657Z] commitMessageProvider_twoProviders(org.eclipse.egit.ui.internal.dialogs.CommitMessageBuilderTest)  Time elapsed: 0.108 s
09:30:05 [2020-07-23T13:30:05.657Z] commitMessageProvider_twoProvidersSecondOneCrashing(org.eclipse.egit.ui.internal.dialogs.CommitMessageBuilderTest)  Time elapsed: 0.108 s
09:30:05 [2020-07-23T13:30:05.657Z] commitMessageProvider_multipleProvidersWithCrashingAndNullAndOneCaretPositioning(org.eclipse.egit.ui.internal.dialogs.CommitMessageBuilderTest)  Time elapsed: 0.085 s
09:30:05 [2020-07-23T13:30:05.657Z] commitMessageProvider_twoProvidersWithCaretPositioning(org.eclipse.egit.ui.internal.dialogs.CommitMessageBuilderTest)  Time elapsed: 1.114 s
09:30:05 [2020-07-23T13:30:05.657Z] commitMessageProvider_oneProviderWithInvalidCaretPositionExceedingMessageLength(org.eclipse.egit.ui.internal.dialogs.CommitMessageBuilderTest)  Time elapsed: 0.093 s
09:30:05 [2020-07-23T13:30:05.657Z] Running org.eclipse.egit.ui.internal.dialogs.SpellcheckableMessageAreaTest
09:30:05 [2020-07-23T13:30:05.657Z] Tests run: 25, Failures: 0, Errors: 0, Skipped: 0, Time elapsed: 0.003 s - in org.eclipse.egit.ui.internal.dialogs.SpellcheckableMessageAreaTest
09:30:05 [2020-07-23T13:30:05.657Z] testWrappingLongWords(org.eclipse.egit.ui.internal.dialogs.SpellcheckableMessageAreaTest)  Time elapsed: 0 s
09:30:05 [2020-07-23T13:30:05.657Z] wrapOnlyCommitMessageBody(org.eclipse.egit.ui.internal.dialogs.SpellcheckableMessageAreaTest)  Time elapsed: 0 s
09:30:05 [2020-07-23T13:30:05.657Z] dontWrapMaximumLengthText(org.eclipse.egit.ui.internal.dialogs.SpellcheckableMessageAreaTest)  Time elapsed: 0 s
09:30:05 [2020-07-23T13:30:05.657Z] keepTrailingSpace(org.eclipse.egit.ui.internal.dialogs.SpellcheckableMessageAreaTest)  Time elapsed: 0 s
09:30:05 [2020-07-23T13:30:05.657Z] dontWrapShortMessage(org.eclipse.egit.ui.internal.dialogs.SpellcheckableMessageAreaTest)  Time elapsed: 0 s
09:30:05 [2020-07-23T13:30:05.657Z] lineAfterWrappedWordShouldNotBeJoined(org.eclipse.egit.ui.internal.dialogs.SpellcheckableMessageAreaTest)  Time elapsed: 0 s
09:30:05 [2020-07-23T13:30:05.657Z] lineAfterWrappedWordShouldNotBeJoined2(org.eclipse.egit.ui.internal.dialogs.SpellcheckableMessageAreaTest)  Time elapsed: 0 s
09:30:05 [2020-07-23T13:30:05.657Z] lineAfterWrappedWordShouldNotBeJoined3(org.eclipse.egit.ui.internal.dialogs.SpellcheckableMessageAreaTest)  Time elapsed: 0.001 s
09:30:05 [2020-07-23T13:30:05.657Z] dontWrapWordLongerThanOneLine(org.eclipse.egit.ui.internal.dialogs.SpellcheckableMessageAreaTest)  Time elapsed: 0 s
09:30:05 [2020-07-23T13:30:05.657Z] keepExistingNewlines(org.eclipse.egit.ui.internal.dialogs.SpellcheckableMessageAreaTest)  Time elapsed: 0 s
09:30:05 [2020-07-23T13:30:05.657Z] dontWrapShortText(org.eclipse.egit.ui.internal.dialogs.SpellcheckableMessageAreaTest)  Time elapsed: 0 s
09:30:05 [2020-07-23T13:30:05.657Z] dontWrapWordLongerThanOneLineAtStart(org.eclipse.egit.ui.internal.dialogs.SpellcheckableMessageAreaTest)  Time elapsed: 0 s
09:30:05 [2020-07-23T13:30:05.657Z] dontWrapAlreadyWrappedText(org.eclipse.egit.ui.internal.dialogs.SpellcheckableMessageAreaTest)  Time elapsed: 0 s
09:30:05 [2020-07-23T13:30:05.657Z] wrapOverlengthText2(org.eclipse.egit.ui.internal.dialogs.SpellcheckableMessageAreaTest)  Time elapsed: 0 s
09:30:05 [2020-07-23T13:30:05.657Z] lineAfterWrappedWordShouldNotBeJoinedIfItStartsWithASymbol(org.eclipse.egit.ui.internal.dialogs.SpellcheckableMessageAreaTest)  Time elapsed: 0 s
09:30:05 [2020-07-23T13:30:05.657Z] wrapAlternatingBlankNonBlank(org.eclipse.egit.ui.internal.dialogs.SpellcheckableMessageAreaTest)  Time elapsed: 0 s
09:30:05 [2020-07-23T13:30:05.657Z] keepWhitespace(org.eclipse.egit.ui.internal.dialogs.SpellcheckableMessageAreaTest)  Time elapsed: 0 s
09:30:05 [2020-07-23T13:30:05.657Z] lineAfterWrappedWordShouldNotBeJoinedIfItsEmpty(org.eclipse.egit.ui.internal.dialogs.SpellcheckableMessageAreaTest)  Time elapsed: 0 s
09:30:05 [2020-07-23T13:30:05.657Z] dontWrapLongCommitMessageFooter(org.eclipse.egit.ui.internal.dialogs.SpellcheckableMessageAreaTest)  Time elapsed: 0 s
09:30:05 [2020-07-23T13:30:05.657Z] lineAfterWrappedLineShouldBeJoinedAndFollowingLineWrappedCorrectly(org.eclipse.egit.ui.internal.dialogs.SpellcheckableMessageAreaTest)  Time elapsed: 0 s
09:30:05 [2020-07-23T13:30:05.657Z] wrapOverlengthText(org.eclipse.egit.ui.internal.dialogs.SpellcheckableMessageAreaTest)  Time elapsed: 0 s
09:30:05 [2020-07-23T13:30:05.657Z] dontWrapWordLongerThanOneLineAndKeepSpaceAtFront(org.eclipse.egit.ui.internal.dialogs.SpellcheckableMessageAreaTest)  Time elapsed: 0 s
09:30:05 [2020-07-23T13:30:05.657Z] wrapSecondLongLine(org.eclipse.egit.ui.internal.dialogs.SpellcheckableMessageAreaTest)  Time elapsed: 0 s
09:30:05 [2020-07-23T13:30:05.657Z] wrapOverlengthTextByOne(org.eclipse.egit.ui.internal.dialogs.SpellcheckableMessageAreaTest)  Time elapsed: 0 s
09:30:05 [2020-07-23T13:30:05.657Z] keepNewlineAtEnd(org.eclipse.egit.ui.internal.dialogs.SpellcheckableMessageAreaTest)  Time elapsed: 0 s
09:30:05 [2020-07-23T13:30:05.657Z] Running org.eclipse.egit.ui.internal.dialogs.CommitMessageComponentTest
09:30:05 [2020-07-23T13:30:05.657Z] Tests run: 5, Failures: 0, Errors: 0, Skipped: 0, Time elapsed: 0.001 s - in org.eclipse.egit.ui.internal.dialogs.CommitMessageComponentTest
09:30:05 [2020-07-23T13:30:05.657Z] commitFormat_MultipleLines_notOk2(org.eclipse.egit.ui.internal.dialogs.CommitMessageComponentTest)  Time elapsed: 0.001 s
09:30:05 [2020-07-23T13:30:05.657Z] commitFormat_simple(org.eclipse.egit.ui.internal.dialogs.CommitMessageComponentTest)  Time elapsed: 0 s
09:30:05 [2020-07-23T13:30:05.657Z] commitFormat_MultipleLines_ok(org.eclipse.egit.ui.internal.dialogs.CommitMessageComponentTest)  Time elapsed: 0 s
09:30:05 [2020-07-23T13:30:05.657Z] commitFormat_trailingWhitespace_ok(org.eclipse.egit.ui.internal.dialogs.CommitMessageComponentTest)  Time elapsed: 0 s
09:30:05 [2020-07-23T13:30:05.657Z] commitFormat_MultipleLines_notOk(org.eclipse.egit.ui.internal.dialogs.CommitMessageComponentTest)  Time elapsed: 0 s
09:30:05 [2020-07-23T13:30:05.657Z] Running org.eclipse.egit.ui.internal.actions.StashesMenuTest
09:30:08 [2020-07-23T13:30:08.181Z] 
09:30:08 [2020-07-23T13:30:08.181Z] (SWT:1587): Gtk-WARNING **: 13:30:07.967: Negative content width -6 (allocation 1, extents 4x3) while allocating gadget (node toolbar, owner GtkToolbar)
09:30:08 [2020-07-23T13:30:08.181Z] 
09:30:08 [2020-07-23T13:30:08.181Z] (SWT:1587): Gtk-WARNING **: 13:30:07.967: Negative content height -3 (allocation 1, extents 2x2) while allocating gadget (node toolbar, owner GtkToolbar)
09:30:08 [2020-07-23T13:30:08.181Z] 
09:30:08 [2020-07-23T13:30:08.181Z] (SWT:1587): Gtk-WARNING **: 13:30:07.967: Negative content width -6 (allocation 1, extents 4x3) while allocating gadget (node toolbar, owner GtkToolbar)
09:30:08 [2020-07-23T13:30:08.181Z] 
09:30:08 [2020-07-23T13:30:08.181Z] (SWT:1587): Gtk-WARNING **: 13:30:07.967: Negative content height -3 (allocation 1, extents 2x2) while allocating gadget (node toolbar, owner GtkToolbar)
09:30:08 [2020-07-23T13:30:08.181Z] 
09:30:08 [2020-07-23T13:30:08.181Z] (SWT:1587): Gtk-WARNING **: 13:30:08.018: Negative content width -6 (allocation 1, extents 4x3) while allocating gadget (node toolbar, owner GtkToolbar)
09:30:08 [2020-07-23T13:30:08.181Z] 
09:30:08 [2020-07-23T13:30:08.181Z] (SWT:1587): Gtk-WARNING **: 13:30:08.027: Negative content width -6 (allocation 1, extents 4x3) while allocating gadget (node toolbar, owner GtkToolbar)
09:30:08 [2020-07-23T13:30:08.181Z] 
09:30:08 [2020-07-23T13:30:08.181Z] (SWT:1587): Gtk-WARNING **: 13:30:08.039: Negative content width -6 (allocation 1, extents 4x3) while allocating gadget (node toolbar, owner GtkToolbar)
09:30:08 [2020-07-23T13:30:08.438Z] Tests run: 2, Failures: 0, Errors: 0, Skipped: 0, Time elapsed: 2.865 s - in org.eclipse.egit.ui.internal.actions.StashesMenuTest
09:30:08 [2020-07-23T13:30:08.439Z] menuWithoutStashes(org.eclipse.egit.ui.internal.actions.StashesMenuTest)  Time elapsed: 1.628 s
09:30:08 [2020-07-23T13:30:08.439Z] stashAndApplyChanges(org.eclipse.egit.ui.internal.actions.StashesMenuTest)  Time elapsed: 1.231 s
09:30:08 [2020-07-23T13:30:08.439Z] Running org.eclipse.egit.ui.internal.actions.LinkedResourcesTest
09:30:10 [2020-07-23T13:30:10.335Z] Tests run: 2, Failures: 0, Errors: 0, Skipped: 0, Time elapsed: 1.745 s - in org.eclipse.egit.ui.internal.actions.LinkedResourcesTest
09:30:10 [2020-07-23T13:30:10.335Z] testSomeActionsWithoutLinkedResources(org.eclipse.egit.ui.internal.actions.LinkedResourcesTest)  Time elapsed: 1.107 s
09:30:10 [2020-07-23T13:30:10.335Z] testNoActionOnLinkedResources(org.eclipse.egit.ui.internal.actions.LinkedResourcesTest)  Time elapsed: 0.633 s
09:30:10 [2020-07-23T13:30:10.335Z] Running org.eclipse.egit.ui.internal.actions.SwitchToMenuTest
09:30:20 [2020-07-23T13:30:20.294Z] 
09:30:20 [2020-07-23T13:30:20.294Z] !ENTRY org.eclipse.egit.core 4 0 2020-07-23 13:30:18.744
09:30:20 [2020-07-23T13:30:20.294Z] !MESSAGE Cannot parse the reflog for HEAD in repository /home/jenkins/agent/workspace/egit/tmp/egit.tmp/62f68169e25b47fa9e1246d8e6866869/LocalRepositoriesTests264_selectionWithCorruptedReflog/FirstRepository/.git
09:30:20 [2020-07-23T13:30:20.294Z] !STACK 0
09:30:20 [2020-07-23T13:30:20.294Z] org.eclipse.jgit.errors.InvalidObjectIdException: Invalid id: INTENTIONALLY CORRUPTED REFLOG. Just som
09:30:20 [2020-07-23T13:30:20.294Z] 	at org.eclipse.jgit.lib.ObjectId.fromHexString(ObjectId.java:217)
09:30:20 [2020-07-23T13:30:20.294Z] 	at org.eclipse.jgit.lib.ObjectId.fromString(ObjectId.java:191)
09:30:20 [2020-07-23T13:30:20.294Z] 	at org.eclipse.jgit.internal.storage.file.ReflogEntryImpl.<init>(ReflogEntryImpl.java:39)
09:30:20 [2020-07-23T13:30:20.294Z] 	at org.eclipse.jgit.internal.storage.file.ReflogReaderImpl.getReverseEntries(ReflogReaderImpl.java:109)
09:30:20 [2020-07-23T13:30:20.294Z] 	at org.eclipse.jgit.internal.storage.file.ReflogReaderImpl.getReverseEntries(ReflogReaderImpl.java:56)
09:30:20 [2020-07-23T13:30:20.294Z] 	at org.eclipse.egit.core.RepositoryUtil.safeReadReflog(RepositoryUtil.java:193)
09:30:20 [2020-07-23T13:30:20.294Z] 	at org.eclipse.egit.ui.internal.actions.SwitchToMenu.getMostActiveBranches(SwitchToMenu.java:465)
09:30:20 [2020-07-23T13:30:20.294Z] 	at org.eclipse.egit.ui.internal.actions.SwitchToMenu.createMostActiveBranchesMenuItems(SwitchToMenu.java:306)
09:30:20 [2020-07-23T13:30:20.294Z] 	at org.eclipse.egit.ui.internal.actions.SwitchToMenu.createDynamicMenu(SwitchToMenu.java:142)
09:30:20 [2020-07-23T13:30:20.294Z] 	at org.eclipse.egit.ui.internal.actions.SwitchToMenu.fill(SwitchToMenu.java:122)
09:30:20 [2020-07-23T13:30:20.294Z] 	at org.eclipse.egit.ui.internal.actions.SwitchToMenuTest$1.run(SwitchToMenuTest.java:310)
09:30:20 [2020-07-23T13:30:20.295Z] 	at org.eclipse.swt.widgets.RunnableLock.run(RunnableLock.java:35)
09:30:20 [2020-07-23T13:30:20.295Z] 	at org.eclipse.swt.widgets.Synchronizer.runAsyncMessages(Synchronizer.java:182)
09:30:20 [2020-07-23T13:30:20.295Z] 	at org.eclipse.swt.widgets.Display.runAsyncMessages(Display.java:4536)
09:30:20 [2020-07-23T13:30:20.295Z] 	at org.eclipse.swt.widgets.Display.readAndDispatch(Display.java:4154)
09:30:20 [2020-07-23T13:30:20.295Z] 	at org.eclipse.e4.ui.internal.workbench.swt.PartRenderingEngine$4.run(PartRenderingEngine.java:1121)
09:30:20 [2020-07-23T13:30:20.295Z] 	at org.eclipse.core.databinding.observable.Realm.runWithDefault(Realm.java:336)
09:30:20 [2020-07-23T13:30:20.295Z] 	at org.eclipse.e4.ui.internal.workbench.swt.PartRenderingEngine.run(PartRenderingEngine.java:1022)
09:30:20 [2020-07-23T13:30:20.295Z] 	at org.eclipse.e4.ui.internal.workbench.E4Workbench.createAndRunUI(E4Workbench.java:150)
09:30:20 [2020-07-23T13:30:20.295Z] 	at org.eclipse.ui.internal.Workbench$5.run(Workbench.java:693)
09:30:20 [2020-07-23T13:30:20.295Z] 	at org.eclipse.core.databinding.observable.Realm.runWithDefault(Realm.java:336)
09:30:20 [2020-07-23T13:30:20.295Z] 	at org.eclipse.ui.internal.Workbench.createAndRunWorkbench(Workbench.java:610)
09:30:20 [2020-07-23T13:30:20.295Z] 	at org.eclipse.ui.PlatformUI.createAndRunWorkbench(PlatformUI.java:148)
09:30:20 [2020-07-23T13:30:20.295Z] 	at org.eclipse.ui.internal.ide.application.IDEApplication.start(IDEApplication.java:138)
09:30:20 [2020-07-23T13:30:20.295Z] 	at org.eclipse.tycho.surefire.osgibooter.UITestApplication.runApplication(UITestApplication.java:31)
09:30:20 [2020-07-23T13:30:20.295Z] 	at org.eclipse.tycho.surefire.osgibooter.AbstractUITestApplication.run(AbstractUITestApplication.java:120)
09:30:20 [2020-07-23T13:30:20.295Z] 	at org.eclipse.tycho.surefire.osgibooter.UITestApplication.start(UITestApplication.java:37)
09:30:20 [2020-07-23T13:30:20.295Z] 	at org.eclipse.equinox.internal.app.EclipseAppHandle.run(EclipseAppHandle.java:196)
09:30:20 [2020-07-23T13:30:20.295Z] 	at org.eclipse.core.runtime.internal.adaptor.EclipseAppLauncher.runApplication(EclipseAppLauncher.java:134)
09:30:20 [2020-07-23T13:30:20.295Z] 	at org.eclipse.core.runtime.internal.adaptor.EclipseAppLauncher.start(EclipseAppLauncher.java:104)
09:30:20 [2020-07-23T13:30:20.295Z] 	at org.eclipse.core.runtime.adaptor.EclipseStarter.run(EclipseStarter.java:388)
09:30:20 [2020-07-23T13:30:20.295Z] 	at org.eclipse.core.runtime.adaptor.EclipseStarter.run(EclipseStarter.java:243)
09:30:20 [2020-07-23T13:30:20.295Z] 	at sun.reflect.NativeMethodAccessorImpl.invoke0(Native Method)
09:30:20 [2020-07-23T13:30:20.295Z] 	at sun.reflect.NativeMethodAccessorImpl.invoke(NativeMethodAccessorImpl.java:62)
09:30:20 [2020-07-23T13:30:20.295Z] 	at sun.reflect.DelegatingMethodAccessorImpl.invoke(DelegatingMethodAccessorImpl.java:43)
09:30:20 [2020-07-23T13:30:20.295Z] 	at java.lang.reflect.Method.invoke(Method.java:498)
09:30:20 [2020-07-23T13:30:20.295Z] 	at org.eclipse.equinox.launcher.Main.invokeFramework(Main.java:673)
09:30:20 [2020-07-23T13:30:20.295Z] 	at org.eclipse.equinox.launcher.Main.basicRun(Main.java:610)
09:30:20 [2020-07-23T13:30:20.295Z] 	at org.eclipse.equinox.launcher.Main.run(Main.java:1519)
09:30:20 [2020-07-23T13:30:20.295Z] 	at org.eclipse.equinox.launcher.Main.main(Main.java:1492)
09:30:20 [2020-07-23T13:30:20.295Z] Caused by: java.lang.ArrayIndexOutOfBoundsException
09:30:20 [2020-07-23T13:30:20.295Z] 	at org.eclipse.jgit.util.RawParseUtils.parseHexInt32(RawParseUtils.java:336)
09:30:20 [2020-07-23T13:30:20.295Z] 	at org.eclipse.jgit.lib.ObjectId.fromHexString(ObjectId.java:210)
09:30:20 [2020-07-23T13:30:20.295Z] 	... 39 more
09:30:20 [2020-07-23T13:30:20.295Z] Tests run: 9, Failures: 0, Errors: 0, Skipped: 0, Time elapsed: 8.801 s - in org.eclipse.egit.ui.internal.actions.SwitchToMenuTest
09:30:20 [2020-07-23T13:30:20.295Z] multipleSelectionWithMultipleRepositoriesAndNoCommonBranches(org.eclipse.egit.ui.internal.actions.SwitchToMenuTest)  Time elapsed: 0.929 s
09:30:20 [2020-07-23T13:30:20.295Z] selectionWithProj1(org.eclipse.egit.ui.internal.actions.SwitchToMenuTest)  Time elapsed: 0.608 s
09:30:20 [2020-07-23T13:30:20.295Z] selectionNotAdaptableToRepository(org.eclipse.egit.ui.internal.actions.SwitchToMenuTest)  Time elapsed: 0.056 s
09:30:20 [2020-07-23T13:30:20.295Z] selectionWithProj1AndReflog(org.eclipse.egit.ui.internal.actions.SwitchToMenuTest)  Time elapsed: 0.647 s
09:30:20 [2020-07-23T13:30:20.295Z] validateMenuEntriesForMultiSelectionWithMultipleRepositories(org.eclipse.egit.ui.internal.actions.SwitchToMenuTest)  Time elapsed: 2.941 s
09:30:20 [2020-07-23T13:30:20.295Z] validateBranchSwitchingForForMultiSelectionWithMultipleRepositories(org.eclipse.egit.ui.internal.actions.SwitchToMenuTest)  Time elapsed: 1.222 s
09:30:20 [2020-07-23T13:30:20.295Z] selectionWithRepositoryHavingOver20Branches(org.eclipse.egit.ui.internal.actions.SwitchToMenuTest)  Time elapsed: 1.651 s
09:30:20 [2020-07-23T13:30:20.295Z] emptySelection(org.eclipse.egit.ui.internal.actions.SwitchToMenuTest)  Time elapsed: 0.056 s
09:30:20 [2020-07-23T13:30:20.295Z] selectionWithCorruptedReflog(org.eclipse.egit.ui.internal.actions.SwitchToMenuTest)  Time elapsed: 0.67 s
09:30:20 [2020-07-23T13:30:20.295Z] Running org.eclipse.egit.ui.internal.submodules.SubmoduleFolderTest
09:30:22 [2020-07-23T13:30:22.819Z] 
09:30:22 [2020-07-23T13:30:22.819Z] (SWT:1587): Gtk-WARNING **: 13:30:22.446: Negative content width -6 (allocation 1, extents 4x3) while allocating gadget (node toolbar, owner GtkToolbar)
09:30:22 [2020-07-23T13:30:22.819Z] 
09:30:22 [2020-07-23T13:30:22.819Z] (SWT:1587): Gtk-WARNING **: 13:30:22.446: Negative content height -3 (allocation 1, extents 2x2) while allocating gadget (node toolbar, owner GtkToolbar)
09:30:22 [2020-07-23T13:30:22.819Z] 
09:30:22 [2020-07-23T13:30:22.819Z] (SWT:1587): Gtk-WARNING **: 13:30:22.447: Negative content width -6 (allocation 1, extents 4x3) while allocating gadget (node toolbar, owner GtkToolbar)
09:30:22 [2020-07-23T13:30:22.819Z] 
09:30:22 [2020-07-23T13:30:22.819Z] (SWT:1587): Gtk-WARNING **: 13:30:22.447: Negative content height -3 (allocation 1, extents 2x2) while allocating gadget (node toolbar, owner GtkToolbar)
09:30:22 [2020-07-23T13:30:22.819Z] 
09:30:22 [2020-07-23T13:30:22.819Z] (SWT:1587): Gtk-WARNING **: 13:30:22.743: Negative content width -6 (allocation 1, extents 4x3) while allocating gadget (node toolbar, owner GtkToolbar)
09:30:22 [2020-07-23T13:30:22.819Z] 
09:30:22 [2020-07-23T13:30:22.819Z] (SWT:1587): Gtk-WARNING **: 13:30:22.746: Negative content width -6 (allocation 1, extents 4x3) while allocating gadget (node toolbar, owner GtkToolbar)
09:30:22 [2020-07-23T13:30:22.819Z] 
09:30:22 [2020-07-23T13:30:22.819Z] (SWT:1587): Gtk-WARNING **: 13:30:22.749: Negative content width -6 (allocation 1, extents 4x3) while allocating gadget (node toolbar, owner GtkToolbar)
09:30:22 [2020-07-23T13:30:22.819Z] 
09:30:22 [2020-07-23T13:30:22.819Z] (SWT:1587): Gtk-WARNING **: 13:30:22.754: Negative content width -6 (allocation 1, extents 4x3) while allocating gadget (node toolbar, owner GtkToolbar)
09:30:22 [2020-07-23T13:30:22.819Z] 
09:30:22 [2020-07-23T13:30:22.819Z] (SWT:1587): Gtk-WARNING **: 13:30:22.769: Negative content width -6 (allocation 1, extents 4x3) while allocating gadget (node toolbar, owner GtkToolbar)
09:30:22 [2020-07-23T13:30:22.819Z] 
09:30:22 [2020-07-23T13:30:22.819Z] (SWT:1587): Gtk-WARNING **: 13:30:22.769: Negative content width -6 (allocation 1, extents 4x3) while allocating gadget (node toolbar, owner GtkToolbar)
09:30:22 [2020-07-23T13:30:22.819Z] 
09:30:22 [2020-07-23T13:30:22.819Z] (SWT:1587): Gtk-WARNING **: 13:30:22.807: Negative content width -6 (allocation 1, extents 4x3) while allocating gadget (node toolbar, owner GtkToolbar)
09:30:22 [2020-07-23T13:30:22.819Z] 
09:30:22 [2020-07-23T13:30:22.819Z] (SWT:1587): Gtk-WARNING **: 13:30:22.807: Negative content width -6 (allocation 1, extents 4x3) while allocating gadget (node toolbar, owner GtkToolbar)
09:30:30 [2020-07-23T13:30:30.947Z] 
09:30:30 [2020-07-23T13:30:30.947Z] (SWT:1587): Gtk-WARNING **: 13:30:29.823: Negative content width -6 (allocation 1, extents 4x3) while allocating gadget (node toolbar, owner GtkToolbar)
09:30:30 [2020-07-23T13:30:30.947Z] 
09:30:30 [2020-07-23T13:30:30.947Z] (SWT:1587): Gtk-WARNING **: 13:30:29.837: Negative content width -6 (allocation 1, extents 4x3) while allocating gadget (node toolbar, owner GtkToolbar)
09:30:30 [2020-07-23T13:30:30.947Z] 
09:30:30 [2020-07-23T13:30:30.947Z] (SWT:1587): Gtk-WARNING **: 13:30:29.876: Negative content width -6 (allocation 1, extents 4x3) while allocating gadget (node toolbar, owner GtkToolbar)
09:30:30 [2020-07-23T13:30:30.947Z] 
09:30:30 [2020-07-23T13:30:30.947Z] (SWT:1587): Gtk-WARNING **: 13:30:29.877: Negative content width -6 (allocation 1, extents 4x3) while allocating gadget (node toolbar, owner GtkToolbar)
09:30:30 [2020-07-23T13:30:30.947Z] 
09:30:30 [2020-07-23T13:30:30.947Z] (SWT:1587): Gtk-CRITICAL **: 13:30:29.901: gtk_box_gadget_distribute: assertion 'size >= 0' failed in GtkScrollbar
09:30:30 [2020-07-23T13:30:30.947Z] 
09:30:30 [2020-07-23T13:30:30.947Z] (SWT:1587): Gtk-CRITICAL **: 13:30:29.913: gtk_box_gadget_distribute: assertion 'size >= 0' failed in GtkScrollbar
09:30:30 [2020-07-23T13:30:30.947Z] 
09:30:30 [2020-07-23T13:30:30.947Z] (SWT:1587): Gtk-CRITICAL **: 13:30:29.926: gtk_box_gadget_distribute: assertion 'size >= 0' failed in GtkScrollbar
09:30:30 [2020-07-23T13:30:30.947Z] 
09:30:30 [2020-07-23T13:30:30.947Z] (SWT:1587): Gtk-CRITICAL **: 13:30:29.943: gtk_box_gadget_distribute: assertion 'size >= 0' failed in GtkScrollbar
09:30:30 [2020-07-23T13:30:30.947Z] 
09:30:30 [2020-07-23T13:30:30.947Z] (SWT:1587): Gtk-CRITICAL **: 13:30:29.960: gtk_box_gadget_distribute: assertion 'size >= 0' failed in GtkScrollbar
09:30:30 [2020-07-23T13:30:30.947Z] 
09:30:30 [2020-07-23T13:30:30.947Z] (SWT:1587): Gtk-CRITICAL **: 13:30:29.976: gtk_box_gadget_distribute: assertion 'size >= 0' failed in GtkScrollbar
09:30:30 [2020-07-23T13:30:30.947Z] 
09:30:30 [2020-07-23T13:30:30.947Z] (SWT:1587): Gtk-CRITICAL **: 13:30:29.993: gtk_box_gadget_distribute: assertion 'size >= 0' failed in GtkScrollbar
09:30:30 [2020-07-23T13:30:30.947Z] 
09:30:30 [2020-07-23T13:30:30.947Z] (SWT:1587): Gtk-WARNING **: 13:30:30.001: Negative content width -6 (allocation 1, extents 4x3) while allocating gadget (node toolbar, owner GtkToolbar)
09:30:30 [2020-07-23T13:30:30.947Z] 
09:30:30 [2020-07-23T13:30:30.947Z] (SWT:1587): Gtk-WARNING **: 13:30:30.013: Negative content width -6 (allocation 1, extents 4x3) while allocating gadget (node toolbar, owner GtkToolbar)
09:30:30 [2020-07-23T13:30:30.947Z] 
09:30:30 [2020-07-23T13:30:30.947Z] (SWT:1587): Gtk-WARNING **: 13:30:30.073: Negative content width -6 (allocation 1, extents 4x3) while allocating gadget (node toolbar, owner GtkToolbar)
09:30:30 [2020-07-23T13:30:30.947Z] 
09:30:30 [2020-07-23T13:30:30.947Z] (SWT:1587): Gtk-CRITICAL **: 13:30:30.076: gtk_box_gadget_distribute: assertion 'size >= 0' failed in GtkScrollbar
09:30:30 [2020-07-23T13:30:30.947Z] 
09:30:30 [2020-07-23T13:30:30.947Z] (SWT:1587): Gtk-WARNING **: 13:30:30.103: Negative content width -6 (allocation 1, extents 4x3) while allocating gadget (node toolbar, owner GtkToolbar)
09:30:36 [2020-07-23T13:30:36.204Z] 
09:30:36 [2020-07-23T13:30:36.204Z] (SWT:1587): Gtk-WARNING **: 13:30:35.383: Negative content width -6 (allocation 1, extents 4x3) while allocating gadget (node toolbar, owner GtkToolbar)
09:30:36 [2020-07-23T13:30:36.204Z] 
09:30:36 [2020-07-23T13:30:36.204Z] (SWT:1587): Gtk-WARNING **: 13:30:35.793: Negative content width -6 (allocation 1, extents 4x3) while allocating gadget (node toolbar, owner GtkToolbar)
09:30:36 [2020-07-23T13:30:36.461Z] 
09:30:36 [2020-07-23T13:30:36.461Z] (SWT:1587): Gtk-WARNING **: 13:30:36.322: Negative content width -6 (allocation 1, extents 4x3) while allocating gadget (node toolbar, owner GtkToolbar)
09:30:36 [2020-07-23T13:30:36.461Z] 
09:30:36 [2020-07-23T13:30:36.461Z] (SWT:1587): Gtk-WARNING **: 13:30:36.360: Negative content width -6 (allocation 1, extents 4x3) while allocating gadget (node toolbar, owner GtkToolbar)
09:30:41 [2020-07-23T13:30:41.716Z] Tests run: 11, Failures: 0, Errors: 0, Skipped: 0, Time elapsed: 21.764 s - in org.eclipse.egit.ui.internal.submodules.SubmoduleFolderTest
09:30:41 [2020-07-23T13:30:41.716Z] testSwitchToMenu(org.eclipse.egit.ui.internal.submodules.SubmoduleFolderTest)  Time elapsed: 2.1 s
09:30:41 [2020-07-23T13:30:41.716Z] compareWithHeadInSubmoduleFolder(org.eclipse.egit.ui.internal.submodules.SubmoduleFolderTest)  Time elapsed: 1.997 s
09:30:41 [2020-07-23T13:30:41.716Z] testStageUnstageInSubRepo(org.eclipse.egit.ui.internal.submodules.SubmoduleFolderTest)  Time elapsed: 3.729 s
09:30:41 [2020-07-23T13:30:41.716Z] testDecoration(org.eclipse.egit.ui.internal.submodules.SubmoduleFolderTest)  Time elapsed: 1.844 s
09:30:41 [2020-07-23T13:30:41.716Z] testHistoryFromProjectExplorerIsFromSubRepository(org.eclipse.egit.ui.internal.submodules.SubmoduleFolderTest)  Time elapsed: 1.661 s
09:30:41 [2020-07-23T13:30:41.716Z] testParentFolderMapsToParentRepo(org.eclipse.egit.ui.internal.submodules.SubmoduleFolderTest)  Time elapsed: 1.61 s
09:30:41 [2020-07-23T13:30:41.716Z] testDisconnect(org.eclipse.egit.ui.internal.submodules.SubmoduleFolderTest)  Time elapsed: 2.1 s
09:30:41 [2020-07-23T13:30:41.716Z] testRepoViewFollowSelection(org.eclipse.egit.ui.internal.submodules.SubmoduleFolderTest)  Time elapsed: 2.525 s
09:30:41 [2020-07-23T13:30:41.716Z] testRepoRemoval(org.eclipse.egit.ui.internal.submodules.SubmoduleFolderTest)  Time elapsed: 1.251 s
09:30:41 [2020-07-23T13:30:41.716Z] testChildProjectMapsToSubRepo(org.eclipse.egit.ui.internal.submodules.SubmoduleFolderTest)  Time elapsed: 1.628 s
09:30:41 [2020-07-23T13:30:41.716Z] testChildFolderMapsToSubRepo(org.eclipse.egit.ui.internal.submodules.SubmoduleFolderTest)  Time elapsed: 1.236 s
09:30:41 [2020-07-23T13:30:41.716Z] Running org.eclipse.egit.ui.internal.synchronize.model.GitModelWorkingFileTest
09:30:44 [2020-07-23T13:30:44.293Z] Tests run: 5, Failures: 0, Errors: 0, Skipped: 0, Time elapsed: 3.09 s - in org.eclipse.egit.ui.internal.synchronize.model.GitModelWorkingFileTest
09:30:44 [2020-07-23T13:30:44.293Z] shouldReturnNotEqualForDifferentLocation(org.eclipse.egit.ui.internal.synchronize.model.GitModelWorkingFileTest)  Time elapsed: 0.618 s
09:30:44 [2020-07-23T13:30:44.293Z] shouldReturnNotEqualWhenComparingWorkingFileAndCacheFile(org.eclipse.egit.ui.internal.synchronize.model.GitModelWorkingFileTest)  Time elapsed: 0.625 s
09:30:44 [2020-07-23T13:30:44.293Z] shouldReturnEqualForSameInstance(org.eclipse.egit.ui.internal.synchronize.model.GitModelWorkingFileTest)  Time elapsed: 0.583 s
09:30:44 [2020-07-23T13:30:44.293Z] shouldReturnNotEqualWhenComparingWorkingFileAndBlob(org.eclipse.egit.ui.internal.synchronize.model.GitModelWorkingFileTest)  Time elapsed: 0.664 s
09:30:44 [2020-07-23T13:30:44.293Z] shouldReturnEqualForSameLocation(org.eclipse.egit.ui.internal.synchronize.model.GitModelWorkingFileTest)  Time elapsed: 0.591 s
09:30:44 [2020-07-23T13:30:44.293Z] Running org.eclipse.egit.ui.internal.synchronize.model.GitModelBlobTest
09:30:52 [2020-07-23T13:30:52.398Z] Tests run: 15, Failures: 0, Errors: 0, Skipped: 2, Time elapsed: 7.815 s - in org.eclipse.egit.ui.internal.synchronize.model.GitModelBlobTest
09:30:52 [2020-07-23T13:30:52.398Z] shouldReturnEqualSameData1(org.eclipse.egit.ui.internal.synchronize.model.GitModelBlobTest) skipped
09:30:52 [2020-07-23T13:30:52.398Z] shouldReturnNotEqualForDifferentLocation(org.eclipse.egit.ui.internal.synchronize.model.GitModelBlobTest)  Time elapsed: 0.617 s
09:30:52 [2020-07-23T13:30:52.398Z] shouldReturnNotEqualForBlobAndCommit(org.eclipse.egit.ui.internal.synchronize.model.GitModelBlobTest)  Time elapsed: 0.587 s
09:30:52 [2020-07-23T13:30:52.398Z] shouldReturnEqualForSameData(org.eclipse.egit.ui.internal.synchronize.model.GitModelBlobTest) skipped
09:30:52 [2020-07-23T13:30:52.398Z] shouldReturnNotEqualForDifferentFiles(org.eclipse.egit.ui.internal.synchronize.model.GitModelBlobTest)  Time elapsed: 0.594 s
09:30:52 [2020-07-23T13:30:52.398Z] shouldReturnNotEqualForBlobAndCacheFile(org.eclipse.egit.ui.internal.synchronize.model.GitModelBlobTest)  Time elapsed: 0.609 s
09:30:52 [2020-07-23T13:30:52.398Z] shouldReturnNotEqualForBlobAndTree(org.eclipse.egit.ui.internal.synchronize.model.GitModelBlobTest)  Time elapsed: 0.613 s
09:30:52 [2020-07-23T13:30:52.398Z] shouldBeSymmetric1(org.eclipse.egit.ui.internal.synchronize.model.GitModelBlobTest)  Time elapsed: 0.584 s
09:30:52 [2020-07-23T13:30:52.398Z] shouldBeSymmetric(org.eclipse.egit.ui.internal.synchronize.model.GitModelBlobTest)  Time elapsed: 0.6 s
09:30:52 [2020-07-23T13:30:52.398Z] shouldReturnEqualForSameInstance(org.eclipse.egit.ui.internal.synchronize.model.GitModelBlobTest)  Time elapsed: 0.598 s
09:30:52 [2020-07-23T13:30:52.398Z] shouldActAsResourceProvider(org.eclipse.egit.ui.internal.synchronize.model.GitModelBlobTest)  Time elapsed: 0.589 s
09:30:52 [2020-07-23T13:30:52.398Z] shouldReturnNotEqualForDifferentBaseObjectId2(org.eclipse.egit.ui.internal.synchronize.model.GitModelBlobTest)  Time elapsed: 0.592 s
09:30:52 [2020-07-23T13:30:52.398Z] shouldReturnNotEqualForDifferentBaseObjectId3(org.eclipse.egit.ui.internal.synchronize.model.GitModelBlobTest)  Time elapsed: 0.591 s
09:30:52 [2020-07-23T13:30:52.399Z] shouldReturnNotEqualForBlobAndWorkingFile(org.eclipse.egit.ui.internal.synchronize.model.GitModelBlobTest)  Time elapsed: 0.63 s
09:30:52 [2020-07-23T13:30:52.399Z] shouldReturnNotEqualForDifferentBaseObjectId(org.eclipse.egit.ui.internal.synchronize.model.GitModelBlobTest)  Time elapsed: 0.588 s
09:30:52 [2020-07-23T13:30:52.399Z] Running org.eclipse.egit.ui.internal.synchronize.model.GitModelCacheFileTest
09:30:54 [2020-07-23T13:30:54.921Z] Tests run: 7, Failures: 0, Errors: 0, Skipped: 2, Time elapsed: 3.251 s - in org.eclipse.egit.ui.internal.synchronize.model.GitModelCacheFileTest
09:30:54 [2020-07-23T13:30:54.921Z] shouldReturnEqualForSameObjectIdsAndLocation(org.eclipse.egit.ui.internal.synchronize.model.GitModelCacheFileTest)  Time elapsed: 0.587 s
09:30:54 [2020-07-23T13:30:54.921Z] shouldReturnNotEqualWhenComparingCacheFileAndBlob(org.eclipse.egit.ui.internal.synchronize.model.GitModelCacheFileTest)  Time elapsed: 0.611 s
09:30:54 [2020-07-23T13:30:54.921Z] shouldReturnNotEqualForDifferentCacheIds(org.eclipse.egit.ui.internal.synchronize.model.GitModelCacheFileTest) skipped
09:30:54 [2020-07-23T13:30:54.921Z] shouldReturnEqualForSameInstance(org.eclipse.egit.ui.internal.synchronize.model.GitModelCacheFileTest)  Time elapsed: 0.58 s
09:30:54 [2020-07-23T13:30:54.921Z] shouldReturnNotEqualWhenComparingCacheFileAndWorkingFile(org.eclipse.egit.ui.internal.synchronize.model.GitModelCacheFileTest)  Time elapsed: 0.632 s
09:30:54 [2020-07-23T13:30:54.921Z] shouldReturnNotEqualForDifferentBaseIds(org.eclipse.egit.ui.internal.synchronize.model.GitModelCacheFileTest)  Time elapsed: 0.583 s
09:30:54 [2020-07-23T13:30:54.921Z] shouldReturnNotEqualForDifferentLocations(org.eclipse.egit.ui.internal.synchronize.model.GitModelCacheFileTest) skipped
09:30:54 [2020-07-23T13:30:54.921Z] Running org.eclipse.egit.ui.internal.synchronize.model.GitModelWorkingTreeTest
09:30:56 [2020-07-23T13:30:56.293Z] Tests run: 2, Failures: 0, Errors: 0, Skipped: 0, Time elapsed: 1.188 s - in org.eclipse.egit.ui.internal.synchronize.model.GitModelWorkingTreeTest
09:30:56 [2020-07-23T13:30:56.293Z] shouldReturnNotEqualsWhenComparingWorkingTreeAndCache(org.eclipse.egit.ui.internal.synchronize.model.GitModelWorkingTreeTest)  Time elapsed: 0.6 s
09:30:56 [2020-07-23T13:30:56.293Z] shouldReturnEqualsForTheSameInstance(org.eclipse.egit.ui.internal.synchronize.model.GitModelWorkingTreeTest)  Time elapsed: 0.583 s
09:30:56 [2020-07-23T13:30:56.293Z] Running org.eclipse.egit.ui.internal.synchronize.model.GitModelCacheTreeTest
09:30:58 [2020-07-23T13:30:58.816Z] Tests run: 4, Failures: 0, Errors: 0, Skipped: 0, Time elapsed: 2.691 s - in org.eclipse.egit.ui.internal.synchronize.model.GitModelCacheTreeTest
09:30:58 [2020-07-23T13:30:58.816Z] shouldReturnEqualForSameData(org.eclipse.egit.ui.internal.synchronize.model.GitModelCacheTreeTest)  Time elapsed: 0.588 s
09:30:58 [2020-07-23T13:30:58.816Z] shouldReturnNotEqualForDifferetnLocation(org.eclipse.egit.ui.internal.synchronize.model.GitModelCacheTreeTest)  Time elapsed: 0.662 s
09:30:58 [2020-07-23T13:30:58.816Z] shouldReturnEqualForSameInstance(org.eclipse.egit.ui.internal.synchronize.model.GitModelCacheTreeTest)  Time elapsed: 0.811 s
09:30:58 [2020-07-23T13:30:58.816Z] shouldReturnNotEqualWhenComparingCacheTreeAndTree(org.eclipse.egit.ui.internal.synchronize.model.GitModelCacheTreeTest)  Time elapsed: 0.619 s
09:30:58 [2020-07-23T13:30:58.816Z] Running org.eclipse.egit.ui.internal.synchronize.model.GitModelRootTest
09:31:00 [2020-07-23T13:31:00.711Z] Tests run: 1, Failures: 0, Errors: 0, Skipped: 0, Time elapsed: 1.476 s - in org.eclipse.egit.ui.internal.synchronize.model.GitModelRootTest
09:31:00 [2020-07-23T13:31:00.711Z] shouldIgnoreEmptyRepositories(org.eclipse.egit.ui.internal.synchronize.model.GitModelRootTest)  Time elapsed: 1.472 s
09:31:00 [2020-07-23T13:31:00.711Z] Running org.eclipse.egit.ui.internal.synchronize.model.GitModelCommitTest
09:31:07 [2020-07-23T13:31:07.262Z] Tests run: 7, Failures: 0, Errors: 0, Skipped: 0, Time elapsed: 5.849 s - in org.eclipse.egit.ui.internal.synchronize.model.GitModelCommitTest
09:31:07 [2020-07-23T13:31:07.262Z] shouldReturnNotEqualForDifferentCommits(org.eclipse.egit.ui.internal.synchronize.model.GitModelCommitTest)  Time elapsed: 0.791 s
09:31:07 [2020-07-23T13:31:07.262Z] shouldReturnNotEqualWhenCommitTreeAndBlob(org.eclipse.egit.ui.internal.synchronize.model.GitModelCommitTest)  Time elapsed: 0.586 s
09:31:07 [2020-07-23T13:31:07.262Z] shouldReturnNotEqualWhenCommitTreeAndTree(org.eclipse.egit.ui.internal.synchronize.model.GitModelCommitTest)  Time elapsed: 0.719 s
09:31:07 [2020-07-23T13:31:07.262Z] shouldReturnNotEqualWhenCommitTreeAndCache(org.eclipse.egit.ui.internal.synchronize.model.GitModelCommitTest)  Time elapsed: 0.653 s
09:31:07 [2020-07-23T13:31:07.262Z] shouldReturnEqualForSameInstance(org.eclipse.egit.ui.internal.synchronize.model.GitModelCommitTest)  Time elapsed: 0.786 s
09:31:07 [2020-07-23T13:31:07.263Z] shouldReturnNotEqualForDifferentParents(org.eclipse.egit.ui.internal.synchronize.model.GitModelCommitTest)  Time elapsed: 1.647 s
09:31:07 [2020-07-23T13:31:07.263Z] shouldReturnEqualForSameCommits(org.eclipse.egit.ui.internal.synchronize.model.GitModelCommitTest)  Time elapsed: 0.652 s
09:31:07 [2020-07-23T13:31:07.263Z] Running org.eclipse.egit.ui.internal.synchronize.model.GitModelRepositoryTest
09:31:09 [2020-07-23T13:31:09.159Z] Tests run: 3, Failures: 0, Errors: 0, Skipped: 0, Time elapsed: 2.686 s - in org.eclipse.egit.ui.internal.synchronize.model.GitModelRepositoryTest
09:31:09 [2020-07-23T13:31:09.159Z] shouldReturnEqual(org.eclipse.egit.ui.internal.synchronize.model.GitModelRepositoryTest)  Time elapsed: 1.028 s
09:31:09 [2020-07-23T13:31:09.159Z] shouldReturnNotEqual(org.eclipse.egit.ui.internal.synchronize.model.GitModelRepositoryTest)  Time elapsed: 0.831 s
09:31:09 [2020-07-23T13:31:09.159Z] shouldReturnEqualForSameInstance(org.eclipse.egit.ui.internal.synchronize.model.GitModelRepositoryTest)  Time elapsed: 0.818 s
09:31:09 [2020-07-23T13:31:09.159Z] Running org.eclipse.egit.ui.internal.synchronize.model.GitModelCacheTest
09:31:14 [2020-07-23T13:31:14.416Z] Tests run: 6, Failures: 0, Errors: 0, Skipped: 0, Time elapsed: 4.686 s - in org.eclipse.egit.ui.internal.synchronize.model.GitModelCacheTest
09:31:14 [2020-07-23T13:31:14.416Z] shouldReturnChildren(org.eclipse.egit.ui.internal.synchronize.model.GitModelCacheTest)  Time elapsed: 0.585 s
09:31:14 [2020-07-23T13:31:14.416Z] shouldReturnNotEqualWhenCacheTreeAndCommit(org.eclipse.egit.ui.internal.synchronize.model.GitModelCacheTest)  Time elapsed: 0.597 s
09:31:14 [2020-07-23T13:31:14.416Z] shouldReturnEqualForSameInstance(org.eclipse.egit.ui.internal.synchronize.model.GitModelCacheTest)  Time elapsed: 0.59 s
09:31:14 [2020-07-23T13:31:14.416Z] shouldReturnEqualForSameCommits(org.eclipse.egit.ui.internal.synchronize.model.GitModelCacheTest)  Time elapsed: 0.65 s
09:31:14 [2020-07-23T13:31:14.416Z] shouldReturnNotEqualWhenComparingCacheAndWorkingTree(org.eclipse.egit.ui.internal.synchronize.model.GitModelCacheTest)  Time elapsed: 0.968 s
09:31:14 [2020-07-23T13:31:14.416Z] shouldReturnNotEqualForDifferentRepositories(org.eclipse.egit.ui.internal.synchronize.model.GitModelCacheTest)  Time elapsed: 1.282 s
09:31:14 [2020-07-23T13:31:14.416Z] Running org.eclipse.egit.ui.internal.synchronize.model.GitModelTreeTest
09:31:17 [2020-07-23T13:31:17.689Z] Tests run: 6, Failures: 0, Errors: 0, Skipped: 0, Time elapsed: 3.702 s - in org.eclipse.egit.ui.internal.synchronize.model.GitModelTreeTest
09:31:17 [2020-07-23T13:31:17.689Z] shouldReturnNotEqualForDifferentLocation(org.eclipse.egit.ui.internal.synchronize.model.GitModelTreeTest)  Time elapsed: 0.656 s
09:31:17 [2020-07-23T13:31:17.689Z] shouldReturnNotEqualForTreeAndCacheTree(org.eclipse.egit.ui.internal.synchronize.model.GitModelTreeTest)  Time elapsed: 0.589 s
09:31:17 [2020-07-23T13:31:17.689Z] shouldReturnNotEqualForTreeAndCommit(org.eclipse.egit.ui.internal.synchronize.model.GitModelTreeTest)  Time elapsed: 0.585 s
09:31:17 [2020-07-23T13:31:17.689Z] shouldReturnEqualForSameBaseCommit(org.eclipse.egit.ui.internal.synchronize.model.GitModelTreeTest)  Time elapsed: 0.612 s
09:31:17 [2020-07-23T13:31:17.689Z] shouldReturnEqualForSameInstance(org.eclipse.egit.ui.internal.synchronize.model.GitModelTreeTest)  Time elapsed: 0.66 s
09:31:17 [2020-07-23T13:31:17.689Z] shouldReturnNotEqualForTreeAndBlob(org.eclipse.egit.ui.internal.synchronize.model.GitModelTreeTest)  Time elapsed: 0.588 s
09:31:17 [2020-07-23T13:31:17.689Z] Running org.eclipse.egit.ui.internal.synchronize.mapping.GitChangeSetSorterTest
09:31:17 [2020-07-23T13:31:17.689Z] Tests run: 23, Failures: 0, Errors: 0, Skipped: 0, Time elapsed: 0.185 s - in org.eclipse.egit.ui.internal.synchronize.mapping.GitChangeSetSorterTest
09:31:17 [2020-07-23T13:31:17.689Z] commitTreeShouldBeLessThanBlob(org.eclipse.egit.ui.internal.synchronize.mapping.GitChangeSetSorterTest)  Time elapsed: 0.024 s
09:31:17 [2020-07-23T13:31:17.689Z] commitTreeShouldBeLessThanTree(org.eclipse.egit.ui.internal.synchronize.mapping.GitChangeSetSorterTest)  Time elapsed: 0 s
09:31:17 [2020-07-23T13:31:17.689Z] blobShouldBeGreaterThanTree(org.eclipse.egit.ui.internal.synchronize.mapping.GitChangeSetSorterTest)  Time elapsed: 0 s
09:31:17 [2020-07-23T13:31:17.689Z] cacheTreeShouldBeLessThanCommit(org.eclipse.egit.ui.internal.synchronize.mapping.GitChangeSetSorterTest)  Time elapsed: 0 s
09:31:17 [2020-07-23T13:31:17.689Z] shouldOrderTreesAlphabetically(org.eclipse.egit.ui.internal.synchronize.mapping.GitChangeSetSorterTest)  Time elapsed: 0.157 s
09:31:17 [2020-07-23T13:31:17.689Z] commitTreeShouldBeGreaterThanCache(org.eclipse.egit.ui.internal.synchronize.mapping.GitChangeSetSorterTest)  Time elapsed: 0 s
09:31:17 [2020-07-23T13:31:17.690Z] blobShouldBeGreaterThanWorkingTree(org.eclipse.egit.ui.internal.synchronize.mapping.GitChangeSetSorterTest)  Time elapsed: 0 s
09:31:17 [2020-07-23T13:31:17.690Z] treeShouldBeGreaterThanCache(org.eclipse.egit.ui.internal.synchronize.mapping.GitChangeSetSorterTest)  Time elapsed: 0 s
09:31:17 [2020-07-23T13:31:17.690Z] treeShouldBeGreaterThanCommit(org.eclipse.egit.ui.internal.synchronize.mapping.GitChangeSetSorterTest)  Time elapsed: 0 s
09:31:17 [2020-07-23T13:31:17.690Z] workingTreeShouldBeLessThanCacheTree(org.eclipse.egit.ui.internal.synchronize.mapping.GitChangeSetSorterTest)  Time elapsed: 0 s
09:31:17 [2020-07-23T13:31:17.690Z] treeShouldBeGreaterThanWorkingTree(org.eclipse.egit.ui.internal.synchronize.mapping.GitChangeSetSorterTest)  Time elapsed: 0 s
09:31:17 [2020-07-23T13:31:17.690Z] blobShouldBeGreaterThanCache(org.eclipse.egit.ui.internal.synchronize.mapping.GitChangeSetSorterTest)  Time elapsed: 0 s
09:31:17 [2020-07-23T13:31:17.690Z] cacheTreeShouldBeLessThanBlob(org.eclipse.egit.ui.internal.synchronize.mapping.GitChangeSetSorterTest)  Time elapsed: 0 s
09:31:17 [2020-07-23T13:31:17.690Z] cacheTreeShouldBeLessThanTree(org.eclipse.egit.ui.internal.synchronize.mapping.GitChangeSetSorterTest)  Time elapsed: 0 s
09:31:17 [2020-07-23T13:31:17.690Z] shouldOrderBlobsAlphabetically(org.eclipse.egit.ui.internal.synchronize.mapping.GitChangeSetSorterTest)  Time elapsed: 0.001 s
09:31:17 [2020-07-23T13:31:17.690Z] commitTreeShouldBeGreaterThanWorkingTree(org.eclipse.egit.ui.internal.synchronize.mapping.GitChangeSetSorterTest)  Time elapsed: 0 s
09:31:17 [2020-07-23T13:31:17.690Z] treeShouldBeLessThanBlob(org.eclipse.egit.ui.internal.synchronize.mapping.GitChangeSetSorterTest)  Time elapsed: 0 s
09:31:17 [2020-07-23T13:31:17.690Z] cacheTreeShouldBeGreaterThanWorkingTree(org.eclipse.egit.ui.internal.synchronize.mapping.GitChangeSetSorterTest)  Time elapsed: 0 s
09:31:17 [2020-07-23T13:31:17.690Z] workingTreeShouldBeLessThanBlob(org.eclipse.egit.ui.internal.synchronize.mapping.GitChangeSetSorterTest)  Time elapsed: 0 s
09:31:17 [2020-07-23T13:31:17.690Z] workingTreeShouldBeLessThanTree(org.eclipse.egit.ui.internal.synchronize.mapping.GitChangeSetSorterTest)  Time elapsed: 0 s
09:31:17 [2020-07-23T13:31:17.690Z] shouldOrderCommitsByCommitDate(org.eclipse.egit.ui.internal.synchronize.mapping.GitChangeSetSorterTest)  Time elapsed: 0.001 s
09:31:17 [2020-07-23T13:31:17.690Z] workingTreeShouldBeLessThanCommit(org.eclipse.egit.ui.internal.synchronize.mapping.GitChangeSetSorterTest)  Time elapsed: 0 s
09:31:17 [2020-07-23T13:31:17.690Z] blobShouldBeGreaterThanCommit(org.eclipse.egit.ui.internal.synchronize.mapping.GitChangeSetSorterTest)  Time elapsed: 0 s
09:31:17 [2020-07-23T13:31:17.690Z] Running org.eclipse.egit.ui.internal.CompareUtilsTest
09:31:20 [2020-07-23T13:31:20.269Z] Tests run: 3, Failures: 0, Errors: 0, Skipped: 0, Time elapsed: 2.487 s - in org.eclipse.egit.ui.internal.CompareUtilsTest
09:31:20 [2020-07-23T13:31:20.269Z] testIndexEditWithAttributes(org.eclipse.egit.ui.internal.CompareUtilsTest)  Time elapsed: 0.943 s
09:31:20 [2020-07-23T13:31:20.269Z] testIndexEdit(org.eclipse.egit.ui.internal.CompareUtilsTest)  Time elapsed: 0.844 s
09:31:20 [2020-07-23T13:31:20.269Z] testIndexEditExecutable(org.eclipse.egit.ui.internal.CompareUtilsTest)  Time elapsed: 0.693 s
09:31:20 [2020-07-23T13:31:20.269Z] Running org.eclipse.egit.ui.internal.clone.SmartImportWizardTest
09:31:20 [2020-07-23T13:31:20.834Z] Tests run: 1, Failures: 0, Errors: 0, Skipped: 0, Time elapsed: 0.969 s - in org.eclipse.egit.ui.internal.clone.SmartImportWizardTest
09:31:20 [2020-07-23T13:31:20.834Z] test(org.eclipse.egit.ui.internal.clone.SmartImportWizardTest)  Time elapsed: 0.948 s
09:31:20 [2020-07-23T13:31:20.834Z] Running org.eclipse.egit.ui.internal.push.PushBranchWizardTest
09:31:21 [2020-07-23T13:31:21.773Z] 
09:31:21 [2020-07-23T13:31:21.773Z] (SWT:1587): Gtk-CRITICAL **: 13:31:21.595: gtk_box_gadget_distribute: assertion 'size >= 0' failed in GtkScrollbar
09:31:21 [2020-07-23T13:31:21.773Z] 
09:31:21 [2020-07-23T13:31:21.773Z] (SWT:1587): Gtk-CRITICAL **: 13:31:21.596: gtk_box_gadget_distribute: assertion 'size >= 0' failed in GtkScrollbar
09:31:21 [2020-07-23T13:31:21.773Z] 
09:31:21 [2020-07-23T13:31:21.773Z] (SWT:1587): Gtk-CRITICAL **: 13:31:21.597: gtk_box_gadget_distribute: assertion 'size >= 0' failed in GtkScrollbar
09:31:21 [2020-07-23T13:31:21.773Z] 
09:31:21 [2020-07-23T13:31:21.773Z] (SWT:1587): Gtk-CRITICAL **: 13:31:21.600: gtk_box_gadget_distribute: assertion 'size >= 0' failed in GtkScrollbar
09:31:31 [2020-07-23T13:31:31.735Z] Tests run: 9, Failures: 0, Errors: 0, Skipped: 0, Time elapsed: 9.845 s - in org.eclipse.egit.ui.internal.push.PushBranchWizardTest
09:31:31 [2020-07-23T13:31:31.735Z] pushHeadToExistingRemote(org.eclipse.egit.ui.internal.push.PushBranchWizardTest)  Time elapsed: 1.028 s
09:31:31 [2020-07-23T13:31:31.735Z] pushWithRemoteUpstreamConfiguration(org.eclipse.egit.ui.internal.push.PushBranchWizardTest)  Time elapsed: 0.957 s
09:31:31 [2020-07-23T13:31:31.735Z] pushWithDifferentBranchName(org.eclipse.egit.ui.internal.push.PushBranchWizardTest)  Time elapsed: 0.966 s
09:31:31 [2020-07-23T13:31:31.735Z] pushToExistingRemoteAndSetRebase(org.eclipse.egit.ui.internal.push.PushBranchWizardTest)  Time elapsed: 1.252 s
09:31:31 [2020-07-23T13:31:31.735Z] pushToNewRemote(org.eclipse.egit.ui.internal.push.PushBranchWizardTest)  Time elapsed: 1.61 s
09:31:31 [2020-07-23T13:31:31.735Z] pushToExistingRemoteWithoutConfiguringUpstream(org.eclipse.egit.ui.internal.push.PushBranchWizardTest)  Time elapsed: 0.936 s
09:31:31 [2020-07-23T13:31:31.735Z] pushToExistingRemote(org.eclipse.egit.ui.internal.push.PushBranchWizardTest)  Time elapsed: 0.963 s
09:31:31 [2020-07-23T13:31:31.735Z] pushWhenNoRemoteExistsYet(org.eclipse.egit.ui.internal.push.PushBranchWizardTest)  Time elapsed: 1.053 s
09:31:31 [2020-07-23T13:31:31.735Z] pushWithLocalUpstreamConfiguration(org.eclipse.egit.ui.internal.push.PushBranchWizardTest)  Time elapsed: 1.057 s
09:31:31 [2020-07-23T13:31:31.735Z] Running org.eclipse.egit.ui.internal.push.PushTagsWizardTest
09:31:31 [2020-07-23T13:31:31.735Z] Tests run: 1, Failures: 0, Errors: 0, Skipped: 0, Time elapsed: 0.98 s - in org.eclipse.egit.ui.internal.push.PushTagsWizardTest
09:31:31 [2020-07-23T13:31:31.735Z] pushTag(org.eclipse.egit.ui.internal.push.PushTagsWizardTest)  Time elapsed: 0.977 s
09:31:31 [2020-07-23T13:31:31.735Z] Running org.eclipse.egit.ui.internal.push.PushToUpstreamTest
09:31:35 [2020-07-23T13:31:35.013Z] Tests run: 3, Failures: 0, Errors: 0, Skipped: 0, Time elapsed: 2.819 s - in org.eclipse.egit.ui.internal.push.PushToUpstreamTest
09:31:35 [2020-07-23T13:31:35.013Z] pushWithExistingUpstreamConfiguration(org.eclipse.egit.ui.internal.push.PushToUpstreamTest)  Time elapsed: 0.933 s
09:31:35 [2020-07-23T13:31:35.013Z] pushWithoutConfig(org.eclipse.egit.ui.internal.push.PushToUpstreamTest)  Time elapsed: 0.982 s
09:31:35 [2020-07-23T13:31:35.013Z] pushWithDefaultRemoteWithPushRefSpecs(org.eclipse.egit.ui.internal.push.PushToUpstreamTest)  Time elapsed: 0.896 s
09:31:35 [2020-07-23T13:31:35.013Z] Running org.eclipse.egit.ui.internal.branch.BranchProjectTrackerTest
09:31:35 [2020-07-23T13:31:35.946Z] Tests run: 1, Failures: 0, Errors: 0, Skipped: 0, Time elapsed: 1.423 s - in org.eclipse.egit.ui.internal.branch.BranchProjectTrackerTest
09:31:35 [2020-07-23T13:31:35.946Z] twoProjectsWithOnlyOneOnBranch(org.eclipse.egit.ui.internal.branch.BranchProjectTrackerTest)  Time elapsed: 1.42 s
09:31:35 [2020-07-23T13:31:35.946Z] Running org.eclipse.egit.ui.internal.decorators.DecoratableResourceAdapterTest
09:31:48 [2020-07-23T13:31:48.190Z] Tests run: 13, Failures: 0, Errors: 0, Skipped: 0, Time elapsed: 12.293 s - in org.eclipse.egit.ui.internal.decorators.DecoratableResourceAdapterTest
09:31:48 [2020-07-23T13:31:48.190Z] testDecorationDeletedFile(org.eclipse.egit.ui.internal.decorators.DecoratableResourceAdapterTest)  Time elapsed: 0.802 s
09:31:48 [2020-07-23T13:31:48.190Z] testDecorationModifiedFile(org.eclipse.egit.ui.internal.decorators.DecoratableResourceAdapterTest)  Time elapsed: 0.799 s
09:31:48 [2020-07-23T13:31:48.190Z] testDecorationEmptyProject(org.eclipse.egit.ui.internal.decorators.DecoratableResourceAdapterTest)  Time elapsed: 0.789 s
09:31:48 [2020-07-23T13:31:48.190Z] testDecorationConflictingFile(org.eclipse.egit.ui.internal.decorators.DecoratableResourceAdapterTest)  Time elapsed: 1.331 s
09:31:48 [2020-07-23T13:31:48.190Z] testDecorationNewEmptyFolder(org.eclipse.egit.ui.internal.decorators.DecoratableResourceAdapterTest)  Time elapsed: 0.826 s
09:31:48 [2020-07-23T13:31:48.190Z] testDecorationFolderPrefixOfOtherFolder(org.eclipse.egit.ui.internal.decorators.DecoratableResourceAdapterTest)  Time elapsed: 0.977 s
09:31:48 [2020-07-23T13:31:48.190Z] testDecorationNewFileInOneSubfolder(org.eclipse.egit.ui.internal.decorators.DecoratableResourceAdapterTest)  Time elapsed: 0.809 s
09:31:48 [2020-07-23T13:31:48.190Z] testDecorationNewFile(org.eclipse.egit.ui.internal.decorators.DecoratableResourceAdapterTest)  Time elapsed: 0.996 s
09:31:48 [2020-07-23T13:31:48.190Z] testDecorationNewFileInSubfolder(org.eclipse.egit.ui.internal.decorators.DecoratableResourceAdapterTest)  Time elapsed: 0.894 s
09:31:48 [2020-07-23T13:31:48.190Z] testDecorationCommittedFile(org.eclipse.egit.ui.internal.decorators.DecoratableResourceAdapterTest)  Time elapsed: 0.995 s
09:31:48 [2020-07-23T13:31:48.190Z] testDecorationFileInIgnoredFolder(org.eclipse.egit.ui.internal.decorators.DecoratableResourceAdapterTest)  Time elapsed: 0.986 s
09:31:48 [2020-07-23T13:31:48.190Z] testDecorationIgnoredFile(org.eclipse.egit.ui.internal.decorators.DecoratableResourceAdapterTest)  Time elapsed: 0.901 s
09:31:48 [2020-07-23T13:31:48.190Z] testDecorationAddedFile(org.eclipse.egit.ui.internal.decorators.DecoratableResourceAdapterTest)  Time elapsed: 1.161 s
09:31:48 [2020-07-23T13:31:48.190Z] Running org.eclipse.egit.ui.internal.decorators.DecoratableWorkingSetTest
09:31:58 [2020-07-23T13:31:58.149Z] Tests run: 7, Failures: 0, Errors: 0, Skipped: 0, Time elapsed: 8.285 s - in org.eclipse.egit.ui.internal.decorators.DecoratableWorkingSetTest
09:31:58 [2020-07-23T13:31:58.149Z] testAnyConflictsIsConflicts(org.eclipse.egit.ui.internal.decorators.DecoratableWorkingSetTest)  Time elapsed: 1.681 s
09:31:58 [2020-07-23T13:31:58.149Z] testUntrackedContentIsUndecorated(org.eclipse.egit.ui.internal.decorators.DecoratableWorkingSetTest)  Time elapsed: 0.848 s
09:31:58 [2020-07-23T13:31:58.149Z] testAnyDirtyIsDirty(org.eclipse.egit.ui.internal.decorators.DecoratableWorkingSetTest)  Time elapsed: 1.371 s
09:31:58 [2020-07-23T13:31:58.149Z] testDecorationConflictingOverDirty(org.eclipse.egit.ui.internal.decorators.DecoratableWorkingSetTest)  Time elapsed: 1.195 s
09:31:58 [2020-07-23T13:31:58.149Z] testEmptyWorkingSetIsUndecorated(org.eclipse.egit.ui.internal.decorators.DecoratableWorkingSetTest)  Time elapsed: 0.917 s
09:31:58 [2020-07-23T13:31:58.149Z] testStagingStateHasNoInfluence_Modified(org.eclipse.egit.ui.internal.decorators.DecoratableWorkingSetTest)  Time elapsed: 1.188 s
09:31:58 [2020-07-23T13:31:58.149Z] testAnyTrackedIsTracked(org.eclipse.egit.ui.internal.decorators.DecoratableWorkingSetTest)  Time elapsed: 1.081 s
09:31:58 [2020-07-23T13:31:58.149Z] Running org.eclipse.egit.ui.internal.decorators.DecoratableResourceMappingTest
09:32:06 [2020-07-23T13:32:06.247Z] Tests run: 9, Failures: 0, Errors: 0, Skipped: 0, Time elapsed: 8.373 s - in org.eclipse.egit.ui.internal.decorators.DecoratableResourceMappingTest
09:32:06 [2020-07-23T13:32:06.247Z] testAnyConflictsIsConflicts(org.eclipse.egit.ui.internal.decorators.DecoratableResourceMappingTest)  Time elapsed: 0.975 s
09:32:06 [2020-07-23T13:32:06.247Z] testSameStagingStateIsState_Added(org.eclipse.egit.ui.internal.decorators.DecoratableResourceMappingTest)  Time elapsed: 0.878 s
09:32:06 [2020-07-23T13:32:06.247Z] testAnyDirtyIsDirty(org.eclipse.egit.ui.internal.decorators.DecoratableResourceMappingTest)  Time elapsed: 0.804 s
09:32:06 [2020-07-23T13:32:06.247Z] testMixedStagingStateIsModified_RemovedAdded(org.eclipse.egit.ui.internal.decorators.DecoratableResourceMappingTest)  Time elapsed: 0.897 s
09:32:06 [2020-07-23T13:32:06.247Z] testAllIgnoredIsUnstaged(org.eclipse.egit.ui.internal.decorators.DecoratableResourceMappingTest)  Time elapsed: 1.072 s
09:32:06 [2020-07-23T13:32:06.247Z] testDecorationConflictingOverDirty(org.eclipse.egit.ui.internal.decorators.DecoratableResourceMappingTest)  Time elapsed: 0.892 s
09:32:06 [2020-07-23T13:32:06.247Z] testMixedStagingStateIsModified_AddedNotStaged(org.eclipse.egit.ui.internal.decorators.DecoratableResourceMappingTest)  Time elapsed: 0.779 s
09:32:06 [2020-07-23T13:32:06.247Z] testNewResourceMappingIsUnstaged(org.eclipse.egit.ui.internal.decorators.DecoratableResourceMappingTest)  Time elapsed: 1.02 s
09:32:06 [2020-07-23T13:32:06.247Z] testAnyTrackedIsTracked(org.eclipse.egit.ui.internal.decorators.DecoratableResourceMappingTest)  Time elapsed: 1.012 s
09:32:06 [2020-07-23T13:32:06.247Z] Running org.eclipse.egit.ui.internal.fetch.FetchGerritChangeTest
09:32:06 [2020-07-23T13:32:06.247Z] Tests run: 15, Failures: 0, Errors: 0, Skipped: 0, Time elapsed: 0.003 s - in org.eclipse.egit.ui.internal.fetch.FetchGerritChangeTest
09:32:06 [2020-07-23T13:32:06.247Z] testChangeStringNoDigits(org.eclipse.egit.ui.internal.fetch.FetchGerritChangeTest)  Time elapsed: 0.002 s
09:32:06 [2020-07-23T13:32:06.247Z] testChangeStringOverflow(org.eclipse.egit.ui.internal.fetch.FetchGerritChangeTest)  Time elapsed: 0 s
09:32:06 [2020-07-23T13:32:06.247Z] testChangeStringTwoNumbers(org.eclipse.egit.ui.internal.fetch.FetchGerritChangeTest)  Time elapsed: 0.001 s
09:32:06 [2020-07-23T13:32:06.247Z] testFromRef(org.eclipse.egit.ui.internal.fetch.FetchGerritChangeTest)  Time elapsed: 0 s
09:32:06 [2020-07-23T13:32:06.247Z] testChangeStringNegative(org.eclipse.egit.ui.internal.fetch.FetchGerritChangeTest)  Time elapsed: 0 s
09:32:06 [2020-07-23T13:32:06.247Z] testChangeStringUri(org.eclipse.egit.ui.internal.fetch.FetchGerritChangeTest)  Time elapsed: 0 s
09:32:06 [2020-07-23T13:32:06.247Z] testRefFromChange(org.eclipse.egit.ui.internal.fetch.FetchGerritChangeTest)  Time elapsed: 0 s
09:32:06 [2020-07-23T13:32:06.247Z] testChangeStringUriNonsense(org.eclipse.egit.ui.internal.fetch.FetchGerritChangeTest)  Time elapsed: 0 s
09:32:06 [2020-07-23T13:32:06.247Z] testChangeStringThreeNumbers(org.eclipse.egit.ui.internal.fetch.FetchGerritChangeTest)  Time elapsed: 0 s
09:32:06 [2020-07-23T13:32:06.247Z] testChangeStringMultiline(org.eclipse.egit.ui.internal.fetch.FetchGerritChangeTest)  Time elapsed: 0 s
09:32:06 [2020-07-23T13:32:06.247Z] testChangeStringSingleNumber(org.eclipse.egit.ui.internal.fetch.FetchGerritChangeTest)  Time elapsed: 0 s
09:32:06 [2020-07-23T13:32:06.247Z] testChangeRefs(org.eclipse.egit.ui.internal.fetch.FetchGerritChangeTest)  Time elapsed: 0 s
09:32:06 [2020-07-23T13:32:06.247Z] testChangeStringEmpty(org.eclipse.egit.ui.internal.fetch.FetchGerritChangeTest)  Time elapsed: 0 s
09:32:06 [2020-07-23T13:32:06.247Z] testChangeStringNull(org.eclipse.egit.ui.internal.fetch.FetchGerritChangeTest)  Time elapsed: 0 s
09:32:06 [2020-07-23T13:32:06.247Z] testChangeStringZero(org.eclipse.egit.ui.internal.fetch.FetchGerritChangeTest)  Time elapsed: 0 s
09:32:06 [2020-07-23T13:32:06.247Z] Running org.eclipse.egit.ui.submodule.SubmoduleUpdateTest
09:32:06 [2020-07-23T13:32:06.247Z] 
09:32:06 [2020-07-23T13:32:06.247Z] (SWT:1587): Gtk-WARNING **: 13:32:05.564: Negative content width -6 (allocation 1, extents 4x3) while allocating gadget (node toolbar, owner GtkToolbar)
09:32:08 [2020-07-23T13:32:08.146Z] 
09:32:08 [2020-07-23T13:32:08.146Z] (SWT:1587): Gtk-WARNING **: 13:32:07.947: Negative content width -6 (allocation 1, extents 4x3) while allocating gadget (node toolbar, owner GtkToolbar)
09:32:08 [2020-07-23T13:32:08.146Z] Tests run: 1, Failures: 0, Errors: 0, Skipped: 0, Time elapsed: 3.218 s - in org.eclipse.egit.ui.submodule.SubmoduleUpdateTest
09:32:08 [2020-07-23T13:32:08.146Z] updateSubmodule(org.eclipse.egit.ui.submodule.SubmoduleUpdateTest)  Time elapsed: 3.214 s
09:32:08 [2020-07-23T13:32:08.146Z] Running org.eclipse.egit.ui.submodule.SubmoduleAddTest
09:32:09 [2020-07-23T13:32:09.078Z] 
09:32:09 [2020-07-23T13:32:09.078Z] (SWT:1587): Gtk-WARNING **: 13:32:08.813: Negative content width -6 (allocation 1, extents 4x3) while allocating gadget (node toolbar, owner GtkToolbar)
09:32:11 [2020-07-23T13:32:11.603Z] 
09:32:11 [2020-07-23T13:32:11.603Z] (SWT:1587): Gtk-WARNING **: 13:32:11.121: Negative content width -6 (allocation 1, extents 4x3) while allocating gadget (node toolbar, owner GtkToolbar)
09:32:11 [2020-07-23T13:32:11.603Z] Tests run: 1, Failures: 0, Errors: 0, Skipped: 0, Time elapsed: 3.172 s - in org.eclipse.egit.ui.submodule.SubmoduleAddTest
09:32:11 [2020-07-23T13:32:11.603Z] addAtRoot(org.eclipse.egit.ui.submodule.SubmoduleAddTest)  Time elapsed: 3.168 s
09:32:11 [2020-07-23T13:32:11.603Z] Running org.eclipse.egit.ui.submodule.SubmoduleSyncTest
09:32:15 [2020-07-23T13:32:15.779Z] 
09:32:15 [2020-07-23T13:32:15.779Z] (SWT:1587): Gtk-WARNING **: 13:32:15.135: Negative content width -6 (allocation 1, extents 4x3) while allocating gadget (node toolbar, owner GtkToolbar)
09:32:18 [2020-07-23T13:32:18.304Z] 
09:32:18 [2020-07-23T13:32:18.304Z] (SWT:1587): Gtk-WARNING **: 13:32:18.108: Negative content width -6 (allocation 1, extents 4x3) while allocating gadget (node toolbar, owner GtkToolbar)
09:32:18 [2020-07-23T13:32:18.304Z] Tests run: 1, Failures: 0, Errors: 0, Skipped: 0, Time elapsed: 6.985 s - in org.eclipse.egit.ui.submodule.SubmoduleSyncTest
09:32:18 [2020-07-23T13:32:18.304Z] syncSubmodule(org.eclipse.egit.ui.submodule.SubmoduleSyncTest)  Time elapsed: 6.981 s
09:32:18 [2020-07-23T13:32:18.304Z] Running org.eclipse.egit.ui.httpauth.PushTest
09:32:18 [2020-07-23T13:32:18.304Z] 2020-07-23 13:32:18.285:INFO:oejs.Server:WorkbenchTestable: jetty-9.4.30.v20200611; built: 2020-06-16T05:54:33.713Z; git: 271836e4c1f4612f12b7bb13ef5a92a927634b0d; jvm 1.8.0_252-b09
09:32:18 [2020-07-23T13:32:18.304Z] 2020-07-23 13:32:18.286:INFO:oejsh.ContextHandler:WorkbenchTestable: Started o.e.j.s.ServletContextHandler@eefd8be{/sbasic,null,AVAILABLE}
09:32:18 [2020-07-23T13:32:18.304Z] 2020-07-23 13:32:18.293:INFO:oejs.AbstractConnector:WorkbenchTestable: Started ServerConnector@19728663{HTTP/1.1, (http/1.1)}{127.0.0.1:37201}
09:32:18 [2020-07-23T13:32:18.304Z] 2020-07-23 13:32:18.293:INFO:oejs.Server:WorkbenchTestable: Started @750066ms
09:32:18 [2020-07-23T13:32:18.869Z] 
09:32:18 [2020-07-23T13:32:18.869Z] (SWT:1587): Gtk-CRITICAL **: 13:32:18.635: gtk_box_gadget_distribute: assertion 'size >= 0' failed in GtkCheckButton
09:32:19 [2020-07-23T13:32:19.800Z] 2020-07-23 13:32:19.502:INFO:oejs.AbstractConnector:WorkbenchTestable: Stopped ServerConnector@19728663{HTTP/1.1, (http/1.1)}{127.0.0.1:0}
09:32:19 [2020-07-23T13:32:19.800Z] 2020-07-23 13:32:19.502:INFO:oejsh.ContextHandler:WorkbenchTestable: Stopped o.e.j.s.ServletContextHandler@eefd8be{/sbasic,null,UNAVAILABLE}
09:32:19 [2020-07-23T13:32:19.800Z] Tests run: 1, Failures: 0, Errors: 0, Skipped: 0, Time elapsed: 1.289 s - in org.eclipse.egit.ui.httpauth.PushTest
09:32:19 [2020-07-23T13:32:19.800Z] testPush(org.eclipse.egit.ui.httpauth.PushTest)  Time elapsed: 1.288 s
09:32:19 [2020-07-23T13:32:19.800Z] Running org.eclipse.egit.ui.search.CommitSearchDialogTest
09:32:20 [2020-07-23T13:32:20.364Z] 
09:32:20 [2020-07-23T13:32:20.364Z] (SWT:1587): Gtk-WARNING **: 13:32:20.269: Negative content width -6 (allocation 1, extents 4x3) while allocating gadget (node toolbar, owner GtkToolbar)
09:32:20 [2020-07-23T13:32:20.364Z] 
09:32:20 [2020-07-23T13:32:20.364Z] (SWT:1587): Gtk-WARNING **: 13:32:20.282: Negative content width -6 (allocation 1, extents 4x3) while allocating gadget (node toolbar, owner GtkToolbar)
09:32:20 [2020-07-23T13:32:20.364Z] 
09:32:20 [2020-07-23T13:32:20.364Z] (SWT:1587): Gtk-WARNING **: 13:32:20.342: Negative content width -6 (allocation 1, extents 4x3) while allocating gadget (node toolbar, owner GtkToolbar)
09:32:20 [2020-07-23T13:32:20.621Z] 
09:32:20 [2020-07-23T13:32:20.621Z] (SWT:1587): Gtk-WARNING **: 13:32:20.412: Negative content width -6 (allocation 1, extents 4x3) while allocating gadget (node toolbar, owner GtkToolbar)
09:32:21 [2020-07-23T13:32:21.202Z] 
09:32:21 [2020-07-23T13:32:21.202Z] (SWT:1587): Gtk-WARNING **: 13:32:21.064: Negative content width -6 (allocation 1, extents 4x3) while allocating gadget (node toolbar, owner GtkToolbar)
09:32:21 [2020-07-23T13:32:21.459Z] Tests run: 1, Failures: 0, Errors: 0, Skipped: 0, Time elapsed: 1.689 s - in org.eclipse.egit.ui.search.CommitSearchDialogTest
09:32:21 [2020-07-23T13:32:21.459Z] openCommitTabOnSearchDialog(org.eclipse.egit.ui.search.CommitSearchDialogTest)  Time elapsed: 1.678 s
09:32:21 [2020-07-23T13:32:21.459Z] Running org.eclipse.egit.ui.search.CommitSearchQueryTest
09:32:25 [2020-07-23T13:32:25.684Z] Tests run: 7, Failures: 0, Errors: 0, Skipped: 0, Time elapsed: 4.382 s - in org.eclipse.egit.ui.search.CommitSearchQueryTest
09:32:25 [2020-07-23T13:32:25.684Z] testQuery(org.eclipse.egit.ui.search.CommitSearchQueryTest)  Time elapsed: 0.593 s
09:32:25 [2020-07-23T13:32:25.684Z] testMatchMessage(org.eclipse.egit.ui.search.CommitSearchQueryTest)  Time elapsed: 0.582 s
09:32:25 [2020-07-23T13:32:25.684Z] testCaseInsensitive(org.eclipse.egit.ui.search.CommitSearchQueryTest)  Time elapsed: 0.595 s
09:32:25 [2020-07-23T13:32:25.684Z] testMatchCommit(org.eclipse.egit.ui.search.CommitSearchQueryTest)  Time elapsed: 0.611 s
09:32:25 [2020-07-23T13:32:25.684Z] testMatchParent(org.eclipse.egit.ui.search.CommitSearchQueryTest)  Time elapsed: 0.581 s
09:32:25 [2020-07-23T13:32:25.684Z] testMatchTree(org.eclipse.egit.ui.search.CommitSearchQueryTest)  Time elapsed: 0.612 s
09:32:25 [2020-07-23T13:32:25.684Z] testEmptyMatches(org.eclipse.egit.ui.search.CommitSearchQueryTest)  Time elapsed: 0.795 s
09:32:25 [2020-07-23T13:32:25.684Z] Running org.eclipse.egit.ui.gitflow.CommandEnablementTest
09:32:27 [2020-07-23T13:32:27.060Z] 
09:32:27 [2020-07-23T13:32:27.060Z] (SWT:1587): Gtk-WARNING **: 13:32:27.023: Negative content width -6 (allocation 1, extents 4x3) while allocating gadget (node toolbar, owner GtkToolbar)
09:32:27 [2020-07-23T13:32:27.317Z] 
09:32:27 [2020-07-23T13:32:27.317Z] (SWT:1587): Gtk-WARNING **: 13:32:27.198: Negative content width -6 (allocation 1, extents 4x3) while allocating gadget (node toolbar, owner GtkToolbar)
09:32:27 [2020-07-23T13:32:27.575Z] Tests run: 2, Failures: 0, Errors: 0, Skipped: 0, Time elapsed: 1.734 s - in org.eclipse.egit.ui.gitflow.CommandEnablementTest
09:32:27 [2020-07-23T13:32:27.575Z] testPackageExplorerStartFinishEnablement(org.eclipse.egit.ui.gitflow.CommandEnablementTest)  Time elapsed: 0.717 s
09:32:27 [2020-07-23T13:32:27.575Z] testRepositoryViewStartFinishEnablement(org.eclipse.egit.ui.gitflow.CommandEnablementTest)  Time elapsed: 1.012 s
09:32:27 [2020-07-23T13:32:27.575Z] Running org.eclipse.egit.ui.gitflow.FeatureFinishSquashHandlerTest
09:32:28 [2020-07-23T13:32:28.506Z] 
09:32:28 [2020-07-23T13:32:28.506Z] (SWT:1587): Gtk-CRITICAL **: 13:32:28.500: gtk_box_gadget_distribute: assertion 'size >= 0' failed in GtkScrollbar
09:32:28 [2020-07-23T13:32:28.764Z] 
09:32:28 [2020-07-23T13:32:28.764Z] (SWT:1587): Gtk-CRITICAL **: 13:32:28.522: gtk_box_gadget_distribute: assertion 'size >= 0' failed in GtkScrollbar
09:32:28 [2020-07-23T13:32:28.764Z] 
09:32:28 [2020-07-23T13:32:28.764Z] (SWT:1587): Gtk-CRITICAL **: 13:32:28.536: gtk_box_gadget_distribute: assertion 'size >= 0' failed in GtkScrollbar
09:32:28 [2020-07-23T13:32:28.764Z] 
09:32:28 [2020-07-23T13:32:28.764Z] (SWT:1587): Gtk-CRITICAL **: 13:32:28.553: gtk_box_gadget_distribute: assertion 'size >= 0' failed in GtkScrollbar
09:32:28 [2020-07-23T13:32:28.764Z] 
09:32:28 [2020-07-23T13:32:28.764Z] (SWT:1587): Gtk-CRITICAL **: 13:32:28.570: gtk_box_gadget_distribute: assertion 'size >= 0' failed in GtkScrollbar
09:32:28 [2020-07-23T13:32:28.764Z] 
09:32:28 [2020-07-23T13:32:28.764Z] (SWT:1587): Gtk-CRITICAL **: 13:32:28.586: gtk_box_gadget_distribute: assertion 'size >= 0' failed in GtkScrollbar
09:32:28 [2020-07-23T13:32:28.764Z] 
09:32:28 [2020-07-23T13:32:28.764Z] (SWT:1587): Gtk-CRITICAL **: 13:32:28.603: gtk_box_gadget_distribute: assertion 'size >= 0' failed in GtkScrollbar
09:32:28 [2020-07-23T13:32:28.764Z] 
09:32:28 [2020-07-23T13:32:28.764Z] (SWT:1587): Gtk-CRITICAL **: 13:32:28.620: gtk_box_gadget_distribute: assertion 'size >= 0' failed in GtkScrollbar
09:32:28 [2020-07-23T13:32:28.764Z] 
09:32:28 [2020-07-23T13:32:28.764Z] (SWT:1587): Gtk-CRITICAL **: 13:32:28.636: gtk_box_gadget_distribute: assertion 'size >= 0' failed in GtkScrollbar
09:32:28 [2020-07-23T13:32:28.764Z] 
09:32:28 [2020-07-23T13:32:28.764Z] (SWT:1587): Gtk-CRITICAL **: 13:32:28.653: gtk_box_gadget_distribute: assertion 'size >= 0' failed in GtkScrollbar
09:32:28 [2020-07-23T13:32:28.764Z] 
09:32:28 [2020-07-23T13:32:28.764Z] (SWT:1587): Gtk-CRITICAL **: 13:32:28.670: gtk_box_gadget_distribute: assertion 'size >= 0' failed in GtkScrollbar
09:32:28 [2020-07-23T13:32:28.764Z] 
09:32:28 [2020-07-23T13:32:28.764Z] (SWT:1587): Gtk-CRITICAL **: 13:32:28.686: gtk_box_gadget_distribute: assertion 'size >= 0' failed in GtkScrollbar
09:32:28 [2020-07-23T13:32:28.764Z] 
09:32:28 [2020-07-23T13:32:28.764Z] (SWT:1587): Gtk-CRITICAL **: 13:32:28.702: gtk_box_gadget_distribute: assertion 'size >= 0' failed in GtkScrollbar
09:32:28 [2020-07-23T13:32:28.764Z] 
09:32:28 [2020-07-23T13:32:28.764Z] (SWT:1587): Gtk-CRITICAL **: 13:32:28.720: gtk_box_gadget_distribute: assertion 'size >= 0' failed in GtkScrollbar
09:32:28 [2020-07-23T13:32:28.764Z] 
09:32:28 [2020-07-23T13:32:28.764Z] (SWT:1587): Gtk-CRITICAL **: 13:32:28.736: gtk_box_gadget_distribute: assertion 'size >= 0' failed in GtkScrollbar
09:32:28 [2020-07-23T13:32:28.764Z] 
09:32:28 [2020-07-23T13:32:28.764Z] (SWT:1587): Gtk-CRITICAL **: 13:32:28.753: gtk_box_gadget_distribute: assertion 'size >= 0' failed in GtkScrollbar
09:32:29 [2020-07-23T13:32:29.327Z] 
09:32:29 [2020-07-23T13:32:29.327Z] (SWT:1587): Gtk-CRITICAL **: 13:32:29.241: gtk_box_gadget_distribute: assertion 'size >= 0' failed in GtkScrollbar
09:32:30 [2020-07-23T13:32:30.258Z] Tests run: 1, Failures: 0, Errors: 0, Skipped: 0, Time elapsed: 2.646 s - in org.eclipse.egit.ui.gitflow.FeatureFinishSquashHandlerTest
09:32:30 [2020-07-23T13:32:30.258Z] testFeatureFinishSquash(org.eclipse.egit.ui.gitflow.FeatureFinishSquashHandlerTest)  Time elapsed: 2.642 s
09:32:30 [2020-07-23T13:32:30.258Z] Running org.eclipse.egit.ui.gitflow.FeatureStartFinishHandlerTest
09:32:30 [2020-07-23T13:32:30.823Z] 
09:32:30 [2020-07-23T13:32:30.823Z] (SWT:1587): Gtk-CRITICAL **: 13:32:30.617: gtk_box_gadget_distribute: assertion 'size >= 0' failed in GtkScrollbar
09:32:30 [2020-07-23T13:32:30.823Z] 
09:32:30 [2020-07-23T13:32:30.823Z] (SWT:1587): Gtk-CRITICAL **: 13:32:30.639: gtk_box_gadget_distribute: assertion 'size >= 0' failed in GtkScrollbar
09:32:30 [2020-07-23T13:32:30.823Z] 
09:32:30 [2020-07-23T13:32:30.823Z] (SWT:1587): Gtk-CRITICAL **: 13:32:30.653: gtk_box_gadget_distribute: assertion 'size >= 0' failed in GtkScrollbar
09:32:30 [2020-07-23T13:32:30.823Z] 
09:32:30 [2020-07-23T13:32:30.823Z] (SWT:1587): Gtk-CRITICAL **: 13:32:30.669: gtk_box_gadget_distribute: assertion 'size >= 0' failed in GtkScrollbar
09:32:30 [2020-07-23T13:32:30.823Z] 
09:32:30 [2020-07-23T13:32:30.823Z] (SWT:1587): Gtk-CRITICAL **: 13:32:30.686: gtk_box_gadget_distribute: assertion 'size >= 0' failed in GtkScrollbar
09:32:30 [2020-07-23T13:32:30.823Z] 
09:32:30 [2020-07-23T13:32:30.823Z] (SWT:1587): Gtk-CRITICAL **: 13:32:30.703: gtk_box_gadget_distribute: assertion 'size >= 0' failed in GtkScrollbar
09:32:30 [2020-07-23T13:32:30.823Z] 
09:32:30 [2020-07-23T13:32:30.823Z] (SWT:1587): Gtk-CRITICAL **: 13:32:30.719: gtk_box_gadget_distribute: assertion 'size >= 0' failed in GtkScrollbar
09:32:30 [2020-07-23T13:32:30.823Z] 
09:32:30 [2020-07-23T13:32:30.823Z] (SWT:1587): Gtk-CRITICAL **: 13:32:30.736: gtk_box_gadget_distribute: assertion 'size >= 0' failed in GtkScrollbar
09:32:30 [2020-07-23T13:32:30.823Z] 
09:32:30 [2020-07-23T13:32:30.823Z] (SWT:1587): Gtk-CRITICAL **: 13:32:30.752: gtk_box_gadget_distribute: assertion 'size >= 0' failed in GtkScrollbar
09:32:30 [2020-07-23T13:32:30.823Z] 
09:32:30 [2020-07-23T13:32:30.823Z] (SWT:1587): Gtk-CRITICAL **: 13:32:30.770: gtk_box_gadget_distribute: assertion 'size >= 0' failed in GtkScrollbar
09:32:30 [2020-07-23T13:32:30.823Z] 
09:32:30 [2020-07-23T13:32:30.823Z] (SWT:1587): Gtk-CRITICAL **: 13:32:30.786: gtk_box_gadget_distribute: assertion 'size >= 0' failed in GtkScrollbar
09:32:30 [2020-07-23T13:32:30.823Z] 
09:32:30 [2020-07-23T13:32:30.823Z] (SWT:1587): Gtk-CRITICAL **: 13:32:30.804: gtk_box_gadget_distribute: assertion 'size >= 0' failed in GtkScrollbar
09:32:31 [2020-07-23T13:32:31.080Z] 
09:32:31 [2020-07-23T13:32:31.080Z] (SWT:1587): Gtk-CRITICAL **: 13:32:30.819: gtk_box_gadget_distribute: assertion 'size >= 0' failed in GtkScrollbar
09:32:31 [2020-07-23T13:32:31.080Z] 
09:32:31 [2020-07-23T13:32:31.080Z] (SWT:1587): Gtk-CRITICAL **: 13:32:30.836: gtk_box_gadget_distribute: assertion 'size >= 0' failed in GtkScrollbar
09:32:31 [2020-07-23T13:32:31.645Z] 
09:32:31 [2020-07-23T13:32:31.645Z] (SWT:1587): Gtk-CRITICAL **: 13:32:31.378: gtk_box_gadget_distribute: assertion 'size >= 0' failed in GtkScrollbar
09:32:32 [2020-07-23T13:32:32.209Z] Tests run: 1, Failures: 0, Errors: 0, Skipped: 0, Time elapsed: 2.011 s - in org.eclipse.egit.ui.gitflow.FeatureStartFinishHandlerTest
09:32:32 [2020-07-23T13:32:32.209Z] testFeatureStart(org.eclipse.egit.ui.gitflow.FeatureStartFinishHandlerTest)  Time elapsed: 2.009 s
09:32:32 [2020-07-23T13:32:32.209Z] Running org.eclipse.egit.ui.gitflow.FeatureFinishKeepBranchHandlerTest
09:32:32 [2020-07-23T13:32:32.775Z] 
09:32:32 [2020-07-23T13:32:32.775Z] (SWT:1587): Gtk-CRITICAL **: 13:32:32.658: gtk_box_gadget_distribute: assertion 'size >= 0' failed in GtkScrollbar
09:32:32 [2020-07-23T13:32:32.775Z] 
09:32:32 [2020-07-23T13:32:32.775Z] (SWT:1587): Gtk-CRITICAL **: 13:32:32.677: gtk_box_gadget_distribute: assertion 'size >= 0' failed in GtkScrollbar
09:32:32 [2020-07-23T13:32:32.775Z] 
09:32:32 [2020-07-23T13:32:32.775Z] (SWT:1587): Gtk-CRITICAL **: 13:32:32.697: gtk_box_gadget_distribute: assertion 'size >= 0' failed in GtkScrollbar
09:32:32 [2020-07-23T13:32:32.775Z] 
09:32:32 [2020-07-23T13:32:32.775Z] (SWT:1587): Gtk-CRITICAL **: 13:32:32.710: gtk_box_gadget_distribute: assertion 'size >= 0' failed in GtkScrollbar
09:32:32 [2020-07-23T13:32:32.775Z] 
09:32:32 [2020-07-23T13:32:32.775Z] (SWT:1587): Gtk-CRITICAL **: 13:32:32.727: gtk_box_gadget_distribute: assertion 'size >= 0' failed in GtkScrollbar
09:32:32 [2020-07-23T13:32:32.775Z] 
09:32:32 [2020-07-23T13:32:32.775Z] (SWT:1587): Gtk-CRITICAL **: 13:32:32.744: gtk_box_gadget_distribute: assertion 'size >= 0' failed in GtkScrollbar
09:32:32 [2020-07-23T13:32:32.775Z] 
09:32:32 [2020-07-23T13:32:32.775Z] (SWT:1587): Gtk-CRITICAL **: 13:32:32.760: gtk_box_gadget_distribute: assertion 'size >= 0' failed in GtkScrollbar
09:32:33 [2020-07-23T13:32:33.032Z] 
09:32:33 [2020-07-23T13:32:33.032Z] (SWT:1587): Gtk-CRITICAL **: 13:32:32.796: gtk_box_gadget_distribute: assertion 'size >= 0' failed in GtkScrollbar
09:32:33 [2020-07-23T13:32:33.032Z] 
09:32:33 [2020-07-23T13:32:33.032Z] (SWT:1587): Gtk-CRITICAL **: 13:32:32.813: gtk_box_gadget_distribute: assertion 'size >= 0' failed in GtkScrollbar
09:32:33 [2020-07-23T13:32:33.032Z] 
09:32:33 [2020-07-23T13:32:33.032Z] (SWT:1587): Gtk-CRITICAL **: 13:32:32.829: gtk_box_gadget_distribute: assertion 'size >= 0' failed in GtkScrollbar
09:32:33 [2020-07-23T13:32:33.032Z] 
09:32:33 [2020-07-23T13:32:33.032Z] (SWT:1587): Gtk-CRITICAL **: 13:32:32.846: gtk_box_gadget_distribute: assertion 'size >= 0' failed in GtkScrollbar
09:32:33 [2020-07-23T13:32:33.032Z] 
09:32:33 [2020-07-23T13:32:33.032Z] (SWT:1587): Gtk-CRITICAL **: 13:32:32.862: gtk_box_gadget_distribute: assertion 'size >= 0' failed in GtkScrollbar
09:32:33 [2020-07-23T13:32:33.032Z] 
09:32:33 [2020-07-23T13:32:33.032Z] (SWT:1587): Gtk-CRITICAL **: 13:32:32.880: gtk_box_gadget_distribute: assertion 'size >= 0' failed in GtkScrollbar
09:32:33 [2020-07-23T13:32:33.032Z] 
09:32:33 [2020-07-23T13:32:33.032Z] (SWT:1587): Gtk-CRITICAL **: 13:32:32.896: gtk_box_gadget_distribute: assertion 'size >= 0' failed in GtkScrollbar
09:32:33 [2020-07-23T13:32:33.032Z] 
09:32:33 [2020-07-23T13:32:33.032Z] (SWT:1587): Gtk-CRITICAL **: 13:32:32.912: gtk_box_gadget_distribute: assertion 'size >= 0' failed in GtkScrollbar
09:32:33 [2020-07-23T13:32:33.609Z] 
09:32:33 [2020-07-23T13:32:33.609Z] (SWT:1587): Gtk-CRITICAL **: 13:32:33.401: gtk_box_gadget_distribute: assertion 'size >= 0' failed in GtkScrollbar
09:32:34 [2020-07-23T13:32:34.174Z] Tests run: 1, Failures: 0, Errors: 0, Skipped: 0, Time elapsed: 2.021 s - in org.eclipse.egit.ui.gitflow.FeatureFinishKeepBranchHandlerTest
09:32:34 [2020-07-23T13:32:34.174Z] testFeatureFinishKeepBranch(org.eclipse.egit.ui.gitflow.FeatureFinishKeepBranchHandlerTest)  Time elapsed: 2.016 s
09:32:34 [2020-07-23T13:32:34.174Z] Running org.eclipse.egit.ui.gitflow.FeatureRebaseHandlerTest
09:32:35 [2020-07-23T13:32:35.107Z] 
09:32:35 [2020-07-23T13:32:35.107Z] (SWT:1587): Gtk-WARNING **: 13:32:34.862: Negative content width -6 (allocation 1, extents 4x3) while allocating gadget (node toolbar, owner GtkToolbar)
09:32:35 [2020-07-23T13:32:35.107Z] 
09:32:35 [2020-07-23T13:32:35.107Z] (SWT:1587): Gtk-WARNING **: 13:32:34.872: Negative content width -6 (allocation 1, extents 4x3) while allocating gadget (node toolbar, owner GtkToolbar)
09:32:35 [2020-07-23T13:32:35.107Z] 
09:32:35 [2020-07-23T13:32:35.107Z] (SWT:1587): Gtk-WARNING **: 13:32:34.876: Negative content width -6 (allocation 1, extents 4x3) while allocating gadget (node toolbar, owner GtkToolbar)
09:32:35 [2020-07-23T13:32:35.107Z] 
09:32:35 [2020-07-23T13:32:35.107Z] (SWT:1587): Gtk-WARNING **: 13:32:34.877: Negative content width -6 (allocation 1, extents 4x3) while allocating gadget (node toolbar, owner GtkToolbar)
09:32:35 [2020-07-23T13:32:35.107Z] 
09:32:35 [2020-07-23T13:32:35.107Z] (SWT:1587): Gtk-WARNING **: 13:32:34.877: Negative content width -6 (allocation 1, extents 4x3) while allocating gadget (node toolbar, owner GtkToolbar)
09:32:35 [2020-07-23T13:32:35.107Z] 
09:32:35 [2020-07-23T13:32:35.107Z] (SWT:1587): Gtk-WARNING **: 13:32:34.909: Negative content width -6 (allocation 1, extents 4x3) while allocating gadget (node toolbar, owner GtkToolbar)
09:32:35 [2020-07-23T13:32:35.364Z] 
09:32:35 [2020-07-23T13:32:35.364Z] (SWT:1587): Gtk-WARNING **: 13:32:35.340: Negative content height -1 (allocation 1, extents 1x1) while allocating gadget (node scrolledwindow, owner GtkScrolledWindow)
09:32:35 [2020-07-23T13:32:35.364Z] 
09:32:35 [2020-07-23T13:32:35.364Z] (SWT:1587): Gtk-CRITICAL **: 13:32:35.340: gtk_box_gadget_distribute: assertion 'size >= 0' failed in GtkScrollbar
09:32:35 [2020-07-23T13:32:35.622Z] 
09:32:35 [2020-07-23T13:32:35.622Z] (SWT:1587): Gtk-WARNING **: 13:32:35.392: Negative content width -6 (allocation 1, extents 4x3) while allocating gadget (node toolbar, owner GtkToolbar)
09:32:36 [2020-07-23T13:32:36.994Z] 
09:32:36 [2020-07-23T13:32:36.994Z] (SWT:1587): Gtk-WARNING **: 13:32:36.578: Negative content height -1 (allocation 1, extents 1x1) while allocating gadget (node scrolledwindow, owner GtkScrolledWindow)
09:32:36 [2020-07-23T13:32:36.994Z] 
09:32:36 [2020-07-23T13:32:36.994Z] (SWT:1587): Gtk-CRITICAL **: 13:32:36.578: gtk_box_gadget_distribute: assertion 'size >= 0' failed in GtkScrollbar
09:32:36 [2020-07-23T13:32:36.994Z] Tests run: 2, Failures: 0, Errors: 0, Skipped: 0, Time elapsed: 2.709 s - in org.eclipse.egit.ui.gitflow.FeatureRebaseHandlerTest
09:32:36 [2020-07-23T13:32:36.994Z] testRebaseFailOnConflict(org.eclipse.egit.ui.gitflow.FeatureRebaseHandlerTest)  Time elapsed: 1.492 s
09:32:36 [2020-07-23T13:32:36.994Z] testRebaseFailOnDirtyWorkingDirectory(org.eclipse.egit.ui.gitflow.FeatureRebaseHandlerTest)  Time elapsed: 1.204 s
09:32:36 [2020-07-23T13:32:36.994Z] Running org.eclipse.egit.ui.gitflow.InitHandlerTest
09:32:41 [2020-07-23T13:32:41.176Z] Tests run: 3, Failures: 0, Errors: 0, Skipped: 0, Time elapsed: 4.297 s - in org.eclipse.egit.ui.gitflow.InitHandlerTest
09:32:41 [2020-07-23T13:32:41.176Z] testInit(org.eclipse.egit.ui.gitflow.InitHandlerTest)  Time elapsed: 1.141 s
09:32:41 [2020-07-23T13:32:41.176Z] testInitEmptyRepoMissingMaster(org.eclipse.egit.ui.gitflow.InitHandlerTest)  Time elapsed: 1.872 s
09:32:41 [2020-07-23T13:32:41.176Z] testInitMissingMaster(org.eclipse.egit.ui.gitflow.InitHandlerTest)  Time elapsed: 1.267 s
09:32:41 [2020-07-23T13:32:41.176Z] Running org.eclipse.egit.ui.gitflow.FeatureStartCheckoutConflictTest
09:32:41 [2020-07-23T13:32:41.740Z] 
09:32:41 [2020-07-23T13:32:41.740Z] (SWT:1587): Gtk-CRITICAL **: 13:32:41.639: gtk_box_gadget_distribute: assertion 'size >= 0' failed in GtkScrollbar
09:32:41 [2020-07-23T13:32:41.740Z] 
09:32:41 [2020-07-23T13:32:41.740Z] (SWT:1587): Gtk-CRITICAL **: 13:32:41.649: gtk_box_gadget_distribute: assertion 'size >= 0' failed in GtkScrollbar
09:32:41 [2020-07-23T13:32:41.998Z] Tests run: 1, Failures: 0, Errors: 0, Skipped: 0, Time elapsed: 0.786 s - in org.eclipse.egit.ui.gitflow.FeatureStartCheckoutConflictTest
09:32:41 [2020-07-23T13:32:41.998Z] testFeatureStart(org.eclipse.egit.ui.gitflow.FeatureStartCheckoutConflictTest)  Time elapsed: 0.782 s
09:32:41 [2020-07-23T13:32:41.998Z] Running org.eclipse.egit.ui.variables.DynamicVariablesTest
09:32:46 [2020-07-23T13:32:46.180Z] Tests run: 4, Failures: 0, Errors: 0, Skipped: 0, Time elapsed: 4.302 s - in org.eclipse.egit.ui.variables.DynamicVariablesTest
09:32:46 [2020-07-23T13:32:46.180Z] testGitBranch(org.eclipse.egit.ui.variables.DynamicVariablesTest)  Time elapsed: 1.084 s
09:32:46 [2020-07-23T13:32:46.180Z] testGitPath(org.eclipse.egit.ui.variables.DynamicVariablesTest)  Time elapsed: 1.077 s
09:32:46 [2020-07-23T13:32:46.180Z] testGitWorkTree(org.eclipse.egit.ui.variables.DynamicVariablesTest)  Time elapsed: 1.08 s
09:32:46 [2020-07-23T13:32:46.180Z] testGitDir(org.eclipse.egit.ui.variables.DynamicVariablesTest)  Time elapsed: 1.06 s
09:32:46 [2020-07-23T13:32:46.180Z] Running org.eclipse.egit.ui.prefpages.configuration.GlobalConfigurationPageTest
09:32:46 [2020-07-23T13:32:46.180Z] 
09:32:46 [2020-07-23T13:32:46.180Z] !ENTRY org.eclipse.ui 2 2 2020-07-23 13:32:46.121
09:32:46 [2020-07-23T13:32:46.180Z] !MESSAGE Invalid preference category path: org.eclipse.ui.net.NetPreferences (bundle: org.eclipse.jsch.ui, page: org.eclipse.jsch.ui.SSHPreferences)
09:32:46 [2020-07-23T13:32:46.180Z] 
09:32:46 [2020-07-23T13:32:46.180Z] (SWT:1587): Gtk-WARNING **: 13:32:46.136: Negative content width -13 (allocation 5, extents 9x9) while allocating gadget (node entry, owner GtkEntry)
09:32:46 [2020-07-23T13:32:46.437Z] 
09:32:46 [2020-07-23T13:32:46.437Z] (SWT:1587): Gtk-WARNING **: 13:32:46.300: Negative content width -13 (allocation 5, extents 9x9) while allocating gadget (node entry, owner GtkEntry)
09:32:46 [2020-07-23T13:32:46.702Z] 
09:32:46 [2020-07-23T13:32:46.702Z] (SWT:1587): Gtk-WARNING **: 13:32:46.437: Negative content width -13 (allocation 5, extents 9x9) while allocating gadget (node entry, owner GtkEntry)
09:32:46 [2020-07-23T13:32:46.702Z] 
09:32:46 [2020-07-23T13:32:46.702Z] (SWT:1587): Gtk-WARNING **: 13:32:46.575: Negative content width -13 (allocation 5, extents 9x9) while allocating gadget (node entry, owner GtkEntry)
09:32:46 [2020-07-23T13:32:46.702Z] 
09:32:46 [2020-07-23T13:32:46.702Z] (SWT:1587): Gtk-WARNING **: 13:32:46.662: Negative content width -13 (allocation 5, extents 9x9) while allocating gadget (node entry, owner GtkEntry)
09:32:46 [2020-07-23T13:32:46.960Z] 
09:32:46 [2020-07-23T13:32:46.960Z] (SWT:1587): Gtk-WARNING **: 13:32:46.801: Negative content width -13 (allocation 5, extents 9x9) while allocating gadget (node entry, owner GtkEntry)
09:32:46 [2020-07-23T13:32:46.960Z] 
09:32:46 [2020-07-23T13:32:46.960Z] (SWT:1587): Gtk-WARNING **: 13:32:46.936: Negative content width -13 (allocation 5, extents 9x9) while allocating gadget (node entry, owner GtkEntry)
09:32:47 [2020-07-23T13:32:47.217Z] 
09:32:47 [2020-07-23T13:32:47.217Z] (SWT:1587): Gtk-WARNING **: 13:32:47.000: Negative content width -6 (allocation 1, extents 4x3) while allocating gadget (node toolbar, owner GtkToolbar)
09:32:47 [2020-07-23T13:32:47.217Z] 
09:32:47 [2020-07-23T13:32:47.217Z] (SWT:1587): Gtk-WARNING **: 13:32:47.000: Negative content height -3 (allocation 1, extents 2x2) while allocating gadget (node toolbar, owner GtkToolbar)
09:32:47 [2020-07-23T13:32:47.217Z] 
09:32:47 [2020-07-23T13:32:47.217Z] (SWT:1587): Gtk-WARNING **: 13:32:47.000: Negative content width -6 (allocation 1, extents 4x3) while allocating gadget (node toolbar, owner GtkToolbar)
09:32:47 [2020-07-23T13:32:47.217Z] 
09:32:47 [2020-07-23T13:32:47.217Z] (SWT:1587): Gtk-WARNING **: 13:32:47.000: Negative content height -3 (allocation 1, extents 2x2) while allocating gadget (node toolbar, owner GtkToolbar)
09:32:47 [2020-07-23T13:32:47.218Z] 
09:32:47 [2020-07-23T13:32:47.218Z] (SWT:1587): Gtk-WARNING **: 13:32:47.111: Negative content width -13 (allocation 5, extents 9x9) while allocating gadget (node entry, owner GtkEntry)
09:32:47 [2020-07-23T13:32:47.475Z] 
09:32:47 [2020-07-23T13:32:47.475Z] (SWT:1587): Gtk-WARNING **: 13:32:47.236: Negative content width -13 (allocation 5, extents 9x9) while allocating gadget (node entry, owner GtkEntry)
09:32:47 [2020-07-23T13:32:47.475Z] 
09:32:47 [2020-07-23T13:32:47.475Z] (SWT:1587): Gtk-WARNING **: 13:32:47.371: Negative content width -13 (allocation 5, extents 9x9) while allocating gadget (node entry, owner GtkEntry)
09:32:47 [2020-07-23T13:32:47.733Z] 
09:32:47 [2020-07-23T13:32:47.733Z] (SWT:1587): Gtk-WARNING **: 13:32:47.490: Negative content width -13 (allocation 5, extents 9x9) while allocating gadget (node entry, owner GtkEntry)
09:32:47 [2020-07-23T13:32:47.733Z] 
09:32:47 [2020-07-23T13:32:47.733Z] (SWT:1587): Gtk-WARNING **: 13:32:47.605: Negative content width -13 (allocation 5, extents 9x9) while allocating gadget (node entry, owner GtkEntry)
09:32:47 [2020-07-23T13:32:47.733Z] Tests run: 11, Failures: 0, Errors: 0, Skipped: 0, Time elapsed: 1.611 s - in org.eclipse.egit.ui.prefpages.configuration.GlobalConfigurationPageTest
09:32:47 [2020-07-23T13:32:47.733Z] testAddSubSectionEntry(org.eclipse.egit.ui.prefpages.configuration.GlobalConfigurationPageTest)  Time elapsed: 0.175 s
09:32:47 [2020-07-23T13:32:47.733Z] testAddSectionEntry(org.eclipse.egit.ui.prefpages.configuration.GlobalConfigurationPageTest)  Time elapsed: 0.148 s
09:32:47 [2020-07-23T13:32:47.733Z] testCanCreateSameEntryValue(org.eclipse.egit.ui.prefpages.configuration.GlobalConfigurationPageTest)  Time elapsed: 0.138 s
09:32:47 [2020-07-23T13:32:47.733Z] testNodes(org.eclipse.egit.ui.prefpages.configuration.GlobalConfigurationPageTest)  Time elapsed: 0.086 s
09:32:47 [2020-07-23T13:32:47.733Z] testRemoveValue(org.eclipse.egit.ui.prefpages.configuration.GlobalConfigurationPageTest)  Time elapsed: 0.108 s
09:32:47 [2020-07-23T13:32:47.733Z] testAddSubSectionEntryWithSuggestion(org.eclipse.egit.ui.prefpages.configuration.GlobalConfigurationPageTest)  Time elapsed: 0.166 s
09:32:47 [2020-07-23T13:32:47.733Z] testOpenEditor(org.eclipse.egit.ui.prefpages.configuration.GlobalConfigurationPageTest)  Time elapsed: 0.174 s
09:32:47 [2020-07-23T13:32:47.733Z] testSubsectionWithDot(org.eclipse.egit.ui.prefpages.configuration.GlobalConfigurationPageTest)  Time elapsed: 0.126 s
09:32:47 [2020-07-23T13:32:47.733Z] testChecksForKey(org.eclipse.egit.ui.prefpages.configuration.GlobalConfigurationPageTest)  Time elapsed: 0.135 s
09:32:47 [2020-07-23T13:32:47.733Z] testRemoveSubSection(org.eclipse.egit.ui.prefpages.configuration.GlobalConfigurationPageTest)  Time elapsed: 0.12 s
09:32:47 [2020-07-23T13:32:47.733Z] testRemoveSection(org.eclipse.egit.ui.prefpages.configuration.GlobalConfigurationPageTest)  Time elapsed: 0.112 s
09:32:47 [2020-07-23T13:32:47.733Z] Running org.eclipse.egit.ui.operations.GitScopeUtilTest
09:32:51 [2020-07-23T13:32:51.910Z] Tests run: 5, Failures: 0, Errors: 0, Skipped: 0, Time elapsed: 4.041 s - in org.eclipse.egit.ui.operations.GitScopeUtilTest
09:32:51 [2020-07-23T13:32:51.910Z] relatedChangesWithPrompt(org.eclipse.egit.ui.operations.GitScopeUtilTest)  Time elapsed: 1.567 s
09:32:51 [2020-07-23T13:32:51.910Z] modelProviderWithExtensionFiles(org.eclipse.egit.ui.operations.GitScopeUtilTest)  Time elapsed: 0.628 s
09:32:51 [2020-07-23T13:32:51.910Z] relatedChangesWithInvalidParams(org.eclipse.egit.ui.operations.GitScopeUtilTest)  Time elapsed: 0.606 s
09:32:51 [2020-07-23T13:32:51.910Z] relatedChangesWithNullResources(org.eclipse.egit.ui.operations.GitScopeUtilTest)  Time elapsed: 0.607 s
09:32:51 [2020-07-23T13:32:51.910Z] relatedChangesWithEmptyResources(org.eclipse.egit.ui.operations.GitScopeUtilTest)  Time elapsed: 0.63 s
09:32:51 [2020-07-23T13:32:51.910Z] 
09:32:51 [2020-07-23T13:32:51.910Z] Results:
09:32:51 [2020-07-23T13:32:51.910Z] 
09:32:51 [2020-07-23T13:32:51.910Z] Failures: 
09:32:51 [2020-07-23T13:32:51.910Z]   BranchAndResetActionTest.setup:86->LocalRepositoryTestCase.createProjectAndCommitToRepository:326->LocalRepositoryTestCase.createProjectAndCommitToRepository:331->LocalRepositoryTestCase.createProjectAndCommitToRepository:373->LocalRepositoryTestCase.assertConnected:465 Project not shared with git: P/ProjectWithoutDotProject
09:32:51 [2020-07-23T13:32:51.910Z] 
09:32:51 [2020-07-23T13:32:51.910Z] Tests run: 541, Failures: 1, Errors: 0, Skipped: 12
09:32:51 [2020-07-23T13:32:51.910Z] 
09:32:52 [2020-07-23T13:32:52.843Z] 
09:32:52 [2020-07-23T13:32:52.843Z] !ENTRY org.eclipse.core.resources 2 10035 2020-07-23 13:32:52.769
09:32:52 [2020-07-23T13:32:52.843Z] !MESSAGE The workspace will exit with unsaved changes in this session.
09:32:54 [2020-07-23T13:32:54.219Z] [INFO] ------------------------------------------------------------------------
09:32:54 [2020-07-23T13:32:54.219Z] [INFO] Reactor Summary for EGit Parent 5.9.0-SNAPSHOT:
09:32:54 [2020-07-23T13:32:54.219Z] [INFO] 
09:32:54 [2020-07-23T13:32:54.219Z] [INFO] EGit Parent ........................................ SUCCESS [ 29.598 s]
09:32:54 [2020-07-23T13:32:54.219Z] [INFO] EGit Target Platform Definition .................... SUCCESS [  1.011 s]
09:32:54 [2020-07-23T13:32:54.219Z] [INFO] Eclipse EGit ....................................... SUCCESS [  4.591 s]
09:32:54 [2020-07-23T13:32:54.219Z] [INFO] Git Team Provider (Core) ........................... SUCCESS [ 16.930 s]
09:32:54 [2020-07-23T13:32:54.219Z] [INFO] Git Team Provider (UI) ............................. SUCCESS [ 45.140 s]
09:32:54 [2020-07-23T13:32:54.219Z] [INFO] EGit Mylyn UI ...................................... SUCCESS [  6.615 s]
09:32:54 [2020-07-23T13:32:54.219Z] [INFO] Git Team Provider (Documentation) .................. SUCCESS [  4.715 s]
09:32:54 [2020-07-23T13:32:54.219Z] [INFO] Eclipse EGit Feature ............................... SUCCESS [  1.092 s]
09:32:54 [2020-07-23T13:32:54.219Z] [INFO] EGit Mylyn Feature ................................. SUCCESS [  1.088 s]
09:32:54 [2020-07-23T13:32:54.219Z] [INFO] Git Flow ........................................... SUCCESS [  6.348 s]
09:32:54 [2020-07-23T13:32:54.219Z] [INFO] Git Flow UI ........................................ SUCCESS [  8.464 s]
09:32:54 [2020-07-23T13:32:54.219Z] [INFO] Eclipse EGit Gitflow Feature ....................... SUCCESS [  1.089 s]
09:32:54 [2020-07-23T13:32:54.219Z] [INFO] EGit JUnit Support ................................. SUCCESS [  7.255 s]
09:32:54 [2020-07-23T13:32:54.219Z] [INFO] GitFlow Test Plug-in ............................... SUCCESS [ 25.951 s]
09:32:54 [2020-07-23T13:32:54.219Z] [INFO] Eclipse EGit Source Feature ........................ SUCCESS [  1.112 s]
09:32:54 [2020-07-23T13:32:54.219Z] [INFO] EGit P2 Repository ................................. SUCCESS [ 14.404 s]
09:32:54 [2020-07-23T13:32:54.219Z] [INFO] EGit Core Test Plug-in ............................. SUCCESS [02:07 min]
09:32:54 [2020-07-23T13:32:54.219Z] [INFO] EGit UI Test Plug-in ............................... FAILURE [13:06 min]
09:32:54 [2020-07-23T13:32:54.219Z] [INFO] EGit Mylyn UI Test Plug-in ......................... SKIPPED
09:32:54 [2020-07-23T13:32:54.219Z] [INFO] ------------------------------------------------------------------------
09:32:54 [2020-07-23T13:32:54.219Z] [INFO] BUILD FAILURE
09:32:54 [2020-07-23T13:32:54.219Z] [INFO] ------------------------------------------------------------------------
09:32:54 [2020-07-23T13:32:54.219Z] [INFO] Total time:  20:51 min
09:32:54 [2020-07-23T13:32:54.219Z] [INFO] Finished at: 2020-07-23T13:32:53Z
09:32:54 [2020-07-23T13:32:54.219Z] [INFO] ------------------------------------------------------------------------
09:32:54 [2020-07-23T13:32:54.219Z] [ERROR] Failed to execute goal org.eclipse.tycho:tycho-surefire-plugin:1.7.0:test (default-test) on project org.eclipse.egit.ui.test: There are test failures.
09:32:54 [2020-07-23T13:32:54.219Z] [ERROR] 
09:32:54 [2020-07-23T13:32:54.219Z] [ERROR] Please refer to /home/jenkins/agent/workspace/egit/repo/org.eclipse.egit.ui.test/target/surefire-reports for the individual test results.
09:32:54 [2020-07-23T13:32:54.219Z] [ERROR] -> [Help 1]
09:32:54 [2020-07-23T13:32:54.219Z] org.apache.maven.lifecycle.LifecycleExecutionException: Failed to execute goal org.eclipse.tycho:tycho-surefire-plugin:1.7.0:test (default-test) on project org.eclipse.egit.ui.test: There are test failures.
09:32:54 [2020-07-23T13:32:54.219Z] 
09:32:54 [2020-07-23T13:32:54.219Z] Please refer to /home/jenkins/agent/workspace/egit/repo/org.eclipse.egit.ui.test/target/surefire-reports for the individual test results.
09:32:54 [2020-07-23T13:32:54.219Z]     at org.apache.maven.lifecycle.internal.MojoExecutor.execute (MojoExecutor.java:215)
09:32:54 [2020-07-23T13:32:54.219Z]     at org.apache.maven.lifecycle.internal.MojoExecutor.execute (MojoExecutor.java:156)
09:32:54 [2020-07-23T13:32:54.219Z]     at org.apache.maven.lifecycle.internal.MojoExecutor.execute (MojoExecutor.java:148)
09:32:54 [2020-07-23T13:32:54.219Z]     at org.apache.maven.lifecycle.internal.LifecycleModuleBuilder.buildProject (LifecycleModuleBuilder.java:117)
09:32:54 [2020-07-23T13:32:54.219Z]     at org.apache.maven.lifecycle.internal.LifecycleModuleBuilder.buildProject (LifecycleModuleBuilder.java:81)
09:32:54 [2020-07-23T13:32:54.219Z]     at org.apache.maven.lifecycle.internal.builder.singlethreaded.SingleThreadedBuilder.build (SingleThreadedBuilder.java:56)
09:32:54 [2020-07-23T13:32:54.219Z]     at org.apache.maven.lifecycle.internal.LifecycleStarter.execute (LifecycleStarter.java:128)
09:32:54 [2020-07-23T13:32:54.219Z]     at org.apache.maven.DefaultMaven.doExecute (DefaultMaven.java:305)
09:32:54 [2020-07-23T13:32:54.219Z]     at org.apache.maven.DefaultMaven.doExecute (DefaultMaven.java:192)
09:32:54 [2020-07-23T13:32:54.219Z]     at org.apache.maven.DefaultMaven.execute (DefaultMaven.java:105)
09:32:54 [2020-07-23T13:32:54.219Z]     at org.apache.maven.cli.MavenCli.execute (MavenCli.java:957)
09:32:54 [2020-07-23T13:32:54.219Z]     at org.apache.maven.cli.MavenCli.doMain (MavenCli.java:289)
09:32:54 [2020-07-23T13:32:54.219Z]     at org.apache.maven.cli.MavenCli.main (MavenCli.java:193)
09:32:54 [2020-07-23T13:32:54.219Z]     at sun.reflect.NativeMethodAccessorImpl.invoke0 (Native Method)
09:32:54 [2020-07-23T13:32:54.219Z]     at sun.reflect.NativeMethodAccessorImpl.invoke (NativeMethodAccessorImpl.java:62)
09:32:54 [2020-07-23T13:32:54.219Z]     at sun.reflect.DelegatingMethodAccessorImpl.invoke (DelegatingMethodAccessorImpl.java:43)
09:32:54 [2020-07-23T13:32:54.219Z]     at java.lang.reflect.Method.invoke (Method.java:498)
09:32:54 [2020-07-23T13:32:54.219Z]     at org.codehaus.plexus.classworlds.launcher.Launcher.launchEnhanced (Launcher.java:282)
09:32:54 [2020-07-23T13:32:54.219Z]     at org.codehaus.plexus.classworlds.launcher.Launcher.launch (Launcher.java:225)
09:32:54 [2020-07-23T13:32:54.219Z]     at org.codehaus.plexus.classworlds.launcher.Launcher.mainWithExitCode (Launcher.java:406)
09:32:54 [2020-07-23T13:32:54.219Z]     at org.codehaus.plexus.classworlds.launcher.Launcher.main (Launcher.java:347)
09:32:54 [2020-07-23T13:32:54.219Z] Caused by: org.apache.maven.plugin.MojoFailureException: There are test failures.
09:32:54 [2020-07-23T13:32:54.219Z] 
09:32:54 [2020-07-23T13:32:54.219Z] Please refer to /home/jenkins/agent/workspace/egit/repo/org.eclipse.egit.ui.test/target/surefire-reports for the individual test results.
09:32:54 [2020-07-23T13:32:54.219Z]     at org.eclipse.tycho.surefire.TestMojo.runTest (TestMojo.java:1063)
09:32:54 [2020-07-23T13:32:54.219Z]     at org.eclipse.tycho.surefire.TestMojo.execute (TestMojo.java:712)
09:32:54 [2020-07-23T13:32:54.219Z]     at org.apache.maven.plugin.DefaultBuildPluginManager.executeMojo (DefaultBuildPluginManager.java:137)
09:32:54 [2020-07-23T13:32:54.219Z]     at org.apache.maven.lifecycle.internal.MojoExecutor.execute (MojoExecutor.java:210)
09:32:54 [2020-07-23T13:32:54.219Z]     at org.apache.maven.lifecycle.internal.MojoExecutor.execute (MojoExecutor.java:156)
09:32:54 [2020-07-23T13:32:54.219Z]     at org.apache.maven.lifecycle.internal.MojoExecutor.execute (MojoExecutor.java:148)
09:32:54 [2020-07-23T13:32:54.219Z]     at org.apache.maven.lifecycle.internal.LifecycleModuleBuilder.buildProject (LifecycleModuleBuilder.java:117)
09:32:54 [2020-07-23T13:32:54.219Z]     at org.apache.maven.lifecycle.internal.LifecycleModuleBuilder.buildProject (LifecycleModuleBuilder.java:81)
09:32:54 [2020-07-23T13:32:54.219Z]     at org.apache.maven.lifecycle.internal.builder.singlethreaded.SingleThreadedBuilder.build (SingleThreadedBuilder.java:56)
09:32:54 [2020-07-23T13:32:54.219Z]     at org.apache.maven.lifecycle.internal.LifecycleStarter.execute (LifecycleStarter.java:128)
09:32:54 [2020-07-23T13:32:54.219Z]     at org.apache.maven.DefaultMaven.doExecute (DefaultMaven.java:305)
09:32:54 [2020-07-23T13:32:54.219Z]     at org.apache.maven.DefaultMaven.doExecute (DefaultMaven.java:192)
09:32:54 [2020-07-23T13:32:54.219Z]     at org.apache.maven.DefaultMaven.execute (DefaultMaven.java:105)
09:32:54 [2020-07-23T13:32:54.219Z]     at org.apache.maven.cli.MavenCli.execute (MavenCli.java:957)
09:32:54 [2020-07-23T13:32:54.219Z]     at org.apache.maven.cli.MavenCli.doMain (MavenCli.java:289)
09:32:54 [2020-07-23T13:32:54.219Z]     at org.apache.maven.cli.MavenCli.main (MavenCli.java:193)
09:32:54 [2020-07-23T13:32:54.219Z]     at sun.reflect.NativeMethodAccessorImpl.invoke0 (Native Method)
09:32:54 [2020-07-23T13:32:54.219Z]     at sun.reflect.NativeMethodAccessorImpl.invoke (NativeMethodAccessorImpl.java:62)
09:32:54 [2020-07-23T13:32:54.219Z]     at sun.reflect.DelegatingMethodAccessorImpl.invoke (DelegatingMethodAccessorImpl.java:43)
09:32:54 [2020-07-23T13:32:54.219Z]     at java.lang.reflect.Method.invoke (Method.java:498)
09:32:54 [2020-07-23T13:32:54.219Z]     at org.codehaus.plexus.classworlds.launcher.Launcher.launchEnhanced (Launcher.java:282)
09:32:54 [2020-07-23T13:32:54.219Z]     at org.codehaus.plexus.classworlds.launcher.Launcher.launch (Launcher.java:225)
09:32:54 [2020-07-23T13:32:54.219Z]     at org.codehaus.plexus.classworlds.launcher.Launcher.mainWithExitCode (Launcher.java:406)
09:32:54 [2020-07-23T13:32:54.219Z]     at org.codehaus.plexus.classworlds.launcher.Launcher.main (Launcher.java:347)
09:32:54 [2020-07-23T13:32:54.219Z] [ERROR] 
09:32:54 [2020-07-23T13:32:54.219Z] [ERROR] Re-run Maven using the -X switch to enable full debug logging.
09:32:54 [2020-07-23T13:32:54.219Z] [ERROR] 
09:32:54 [2020-07-23T13:32:54.219Z] [ERROR] For more information about the errors and possible solutions, please read the following articles:
09:32:54 [2020-07-23T13:32:54.219Z] [ERROR] [Help 1] http://cwiki.apache.org/confluence/display/MAVEN/MojoFailureException
09:32:54 [2020-07-23T13:32:54.219Z] [ERROR] 
09:32:54 [2020-07-23T13:32:54.219Z] [ERROR] After correcting the problems, you can resume the build with the command
09:32:54 [2020-07-23T13:32:54.219Z] [ERROR]   mvn <args> -rf :org.eclipse.egit.ui.test
[Pipeline] }
[Pipeline] // stage
[Pipeline] stage
[Pipeline] { (Results)
[Pipeline] junit
09:32:56 [2020-07-23T13:32:56.151Z] Recording test results
[Pipeline] archiveArtifacts
09:32:57 [2020-07-23T13:32:57.021Z] Archiving artifacts
[Pipeline] findbugs
09:32:59 [2020-07-23T13:32:59.956Z] [FINDBUGS] Collecting findbugs analysis files...
09:33:03 [2020-07-23T13:33:03.592Z] [FINDBUGS] Searching for all files in /home/jenkins/agent/workspace/egit/repo that match the pattern */target/*bugsXml.xml
09:33:03 [2020-07-23T13:33:03.592Z] [FINDBUGS] Parsing 8 files in /home/jenkins/agent/workspace/egit/repo
09:33:03 [2020-07-23T13:33:03.592Z] [FINDBUGS] Successfully parsed file /home/jenkins/agent/workspace/egit/repo/org.eclipse.egit.core.junit/target/spotbugsXml.xml with 4 unique warnings and 0 duplicates.
09:33:03 [2020-07-23T13:33:03.592Z] [FINDBUGS] Successfully parsed file /home/jenkins/agent/workspace/egit/repo/org.eclipse.egit.core.test/target/spotbugsXml.xml with 9 unique warnings and 0 duplicates.
09:33:03 [2020-07-23T13:33:03.592Z] [FINDBUGS] Successfully parsed file /home/jenkins/agent/workspace/egit/repo/org.eclipse.egit.core/target/spotbugsXml.xml with 20 unique warnings and 0 duplicates.
09:33:03 [2020-07-23T13:33:03.592Z] [FINDBUGS] Successfully parsed file /home/jenkins/agent/workspace/egit/repo/org.eclipse.egit.gitflow.test/target/spotbugsXml.xml with 20 unique warnings and 0 duplicates.
09:33:03 [2020-07-23T13:33:03.592Z] [FINDBUGS] Successfully parsed file /home/jenkins/agent/workspace/egit/repo/org.eclipse.egit.gitflow.ui/target/spotbugsXml.xml with 20 unique warnings and 0 duplicates.
09:33:03 [2020-07-23T13:33:03.592Z] [FINDBUGS] Successfully parsed file /home/jenkins/agent/workspace/egit/repo/org.eclipse.egit.gitflow/target/spotbugsXml.xml with 22 unique warnings and 0 duplicates.
09:33:03 [2020-07-23T13:33:03.592Z] [FINDBUGS] Successfully parsed file /home/jenkins/agent/workspace/egit/repo/org.eclipse.egit.mylyn.ui/target/spotbugsXml.xml with 22 unique warnings and 0 duplicates.
09:33:03 [2020-07-23T13:33:03.592Z] [FINDBUGS] Successfully parsed file /home/jenkins/agent/workspace/egit/repo/org.eclipse.egit.ui/target/spotbugsXml.xml with 59 unique warnings and 0 duplicates.
09:33:03 [2020-07-23T13:33:03.592Z] Skipping warnings blame since pipelines do not have an SCM link.%n
09:33:03 [2020-07-23T13:33:03.657Z] [FINDBUGS] Computing warning deltas based on reference build #456
[Pipeline] dry
09:33:03 [2020-07-23T13:33:03.854Z] [DRY] Collecting duplicate code analysis files...
09:33:04 [2020-07-23T13:33:04.087Z] [DRY] Searching for all files in /home/jenkins/agent/workspace/egit/repo that match the pattern **/cpd.xml
09:33:04 [2020-07-23T13:33:04.087Z] [DRY] Parsing 15 files in /home/jenkins/agent/workspace/egit/repo
09:33:04 [2020-07-23T13:33:04.087Z] [DRY] Successfully parsed file /home/jenkins/agent/workspace/egit/repo/org.eclipse.egit-feature/target/cpd.xml with 0 unique warnings and 0 duplicates.
09:33:04 [2020-07-23T13:33:04.087Z] [DRY] Successfully parsed file /home/jenkins/agent/workspace/egit/repo/org.eclipse.egit.core.junit/target/cpd.xml with 0 unique warnings and 0 duplicates.
09:33:04 [2020-07-23T13:33:04.087Z] [DRY] Successfully parsed file /home/jenkins/agent/workspace/egit/repo/org.eclipse.egit.core.test/target/cpd.xml with 0 unique warnings and 0 duplicates.
09:33:04 [2020-07-23T13:33:04.087Z] [DRY] Successfully parsed file /home/jenkins/agent/workspace/egit/repo/org.eclipse.egit.core/target/cpd.xml with 4 unique warnings and 0 duplicates.
09:33:04 [2020-07-23T13:33:04.087Z] [DRY] Successfully parsed file /home/jenkins/agent/workspace/egit/repo/org.eclipse.egit.doc/target/cpd.xml with 4 unique warnings and 0 duplicates.
09:33:04 [2020-07-23T13:33:04.087Z] [DRY] Successfully parsed file /home/jenkins/agent/workspace/egit/repo/org.eclipse.egit.gitflow-feature/target/cpd.xml with 4 unique warnings and 0 duplicates.
09:33:04 [2020-07-23T13:33:04.087Z] [DRY] Successfully parsed file /home/jenkins/agent/workspace/egit/repo/org.eclipse.egit.gitflow.test/target/cpd.xml with 4 unique warnings and 0 duplicates.
09:33:04 [2020-07-23T13:33:04.087Z] [DRY] Successfully parsed file /home/jenkins/agent/workspace/egit/repo/org.eclipse.egit.gitflow.ui/target/cpd.xml with 4 unique warnings and 0 duplicates.
09:33:04 [2020-07-23T13:33:04.087Z] [DRY] Successfully parsed file /home/jenkins/agent/workspace/egit/repo/org.eclipse.egit.gitflow/target/cpd.xml with 4 unique warnings and 0 duplicates.
09:33:04 [2020-07-23T13:33:04.087Z] [DRY] Successfully parsed file /home/jenkins/agent/workspace/egit/repo/org.eclipse.egit.mylyn-feature/target/cpd.xml with 4 unique warnings and 0 duplicates.
09:33:04 [2020-07-23T13:33:04.087Z] [DRY] Successfully parsed file /home/jenkins/agent/workspace/egit/repo/org.eclipse.egit.mylyn.ui/target/cpd.xml with 4 unique warnings and 0 duplicates.
09:33:04 [2020-07-23T13:33:04.087Z] [DRY] Successfully parsed file /home/jenkins/agent/workspace/egit/repo/org.eclipse.egit.repository/target/cpd.xml with 4 unique warnings and 0 duplicates.
09:33:04 [2020-07-23T13:33:04.087Z] [DRY] Successfully parsed file /home/jenkins/agent/workspace/egit/repo/org.eclipse.egit.source-feature/target/cpd.xml with 4 unique warnings and 0 duplicates.
09:33:04 [2020-07-23T13:33:04.087Z] [DRY] Successfully parsed file /home/jenkins/agent/workspace/egit/repo/org.eclipse.egit.ui/target/cpd.xml with 37 unique warnings and 0 duplicates.
09:33:04 [2020-07-23T13:33:04.087Z] [DRY] Successfully parsed file /home/jenkins/agent/workspace/egit/repo/org.eclipse.egit/target/cpd.xml with 37 unique warnings and 0 duplicates.
09:33:04 [2020-07-23T13:33:04.087Z] Skipping warnings blame since pipelines do not have an SCM link.%n
09:33:04 [2020-07-23T13:33:04.128Z] [DRY] Computing warning deltas based on reference build #456
[Pipeline] }
[Pipeline] // stage
[Pipeline] step
09:33:04 [2020-07-23T13:33:04.312Z] Sending e-mails to: egit-build@eclipse.org
[Pipeline] }
[Pipeline] // dir
[Pipeline] }
09:33:04 [2020-07-23T13:33:04.401Z] Terminating xvnc.
[Pipeline] // wrap
[Pipeline] }
[Pipeline] // timeout
[Pipeline] }
[Pipeline] // node
[Pipeline] }
[Pipeline] // timestamps
[Pipeline] End of Pipeline
ERROR: script returned exit code 1
Finished: FAILURE