FailedConsole Output

Skipping 656 KB.. Full Log
Factory.waitUntil(SWTBotFactory.java:498)
	at org.eclipse.swtbot.swt.finder.SWTBot.waitUntil(SWTBot.java:1)
	at org.eclipse.swtbot.eclipse.finder.SWTWorkbenchBot.waitUntil(SWTWorkbenchBot.java:1)
	at org.eclipse.swtbot.swt.finder.SWTBotFactory.waitUntil(SWTBotFactory.java:486)
	at org.eclipse.swtbot.swt.finder.SWTBot.waitUntil(SWTBot.java:1)
	at org.eclipse.swtbot.eclipse.finder.SWTWorkbenchBot.waitUntil(SWTWorkbenchBot.java:1)
	at org.eclipse.egit.ui.test.history.HistoryViewTest.assertNoCommit(HistoryViewTest.java:599)
	at org.eclipse.egit.ui.test.history.HistoryViewTest.testSelectShownRefs(HistoryViewTest.java:689)
	at sun.reflect.NativeMethodAccessorImpl.invoke0(Native Method)
	at sun.reflect.NativeMethodAccessorImpl.invoke(NativeMethodAccessorImpl.java:62)
	at sun.reflect.DelegatingMethodAccessorImpl.invoke(DelegatingMethodAccessorImpl.java:43)
	at java.lang.reflect.Method.invoke(Method.java:498)
	at org.junit.runners.model.FrameworkMethod$1.runReflectiveCall(FrameworkMethod.java:50)
	at org.junit.internal.runners.model.ReflectiveCallable.run(ReflectiveCallable.java:12)
	at org.junit.runners.model.FrameworkMethod.invokeExplosively(FrameworkMethod.java:47)
	at org.eclipse.swtbot.swt.finder.junit.internal.CapturingFrameworkMethod.invokeExplosively(CapturingFrameworkMethod.java:47)
	at org.junit.internal.runners.statements.InvokeMethod.evaluate(InvokeMethod.java:17)
	at org.junit.internal.runners.statements.RunBefores.evaluate(RunBefores.java:26)
	at org.junit.internal.runners.statements.RunAfters.evaluate(RunAfters.java:27)
	at org.junit.rules.TestWatcher$1.evaluate(TestWatcher.java:55)
	at org.junit.rules.RunRules.evaluate(RunRules.java:20)
	at org.junit.runners.ParentRunner.runLeaf(ParentRunner.java:325)
	at org.eclipse.swtbot.swt.finder.junit.SWTBotJunit4ClassRunner.runChild(SWTBotJunit4ClassRunner.java:75)
	at org.junit.runners.BlockJUnit4ClassRunner.runChild(BlockJUnit4ClassRunner.java:57)
	at org.junit.runners.ParentRunner$3.run(ParentRunner.java:290)
	at org.junit.runners.ParentRunner$1.schedule(ParentRunner.java:71)
	at org.junit.runners.ParentRunner.runChildren(ParentRunner.java:288)
	at org.junit.runners.ParentRunner.access$000(ParentRunner.java:58)
	at org.junit.runners.ParentRunner$2.evaluate(ParentRunner.java:268)
	at org.junit.internal.runners.statements.RunBefores.evaluate(RunBefores.java:26)
	at org.junit.internal.runners.statements.RunAfters.evaluate(RunAfters.java:27)
	at org.junit.runners.ParentRunner.run(ParentRunner.java:363)
	at org.eclipse.swtbot.swt.finder.junit.SWTBotJunit4ClassRunner.run(SWTBotJunit4ClassRunner.java:60)
	at org.apache.maven.surefire.junit4.JUnit4Provider.execute(JUnit4Provider.java:365)
	at org.apache.maven.surefire.junit4.JUnit4Provider.executeWithRerun(JUnit4Provider.java:273)
	at org.apache.maven.surefire.junit4.JUnit4Provider.executeTestSet(JUnit4Provider.java:238)
	at org.apache.maven.surefire.junit4.JUnit4Provider.invoke(JUnit4Provider.java:159)
	at sun.reflect.NativeMethodAccessorImpl.invoke0(Native Method)
	at sun.reflect.NativeMethodAccessorImpl.invoke(NativeMethodAccessorImpl.java:62)
	at sun.reflect.DelegatingMethodAccessorImpl.invoke(DelegatingMethodAccessorImpl.java:43)
	at java.lang.reflect.Method.invoke(Method.java:498)
	at org.apache.maven.surefire.util.ReflectionUtils.invokeMethodWithArray2(ReflectionUtils.java:206)
	at org.apache.maven.surefire.booter.ProviderFactory$ProviderProxy.invoke(ProviderFactory.java:161)
	at org.apache.maven.surefire.booter.ProviderFactory.invokeProvider(ProviderFactory.java:84)
	at org.eclipse.tycho.surefire.osgibooter.OsgiSurefireBooter.run(OsgiSurefireBooter.java:113)
	at org.eclipse.tycho.surefire.osgibooter.AbstractUITestApplication.runTests(AbstractUITestApplication.java:44)
	at org.eclipse.e4.ui.internal.workbench.swt.E4Testable$1.run(E4Testable.java:73)
	at java.lang.Thread.run(Thread.java:748)

testOpenOfDeletedFile(org.eclipse.egit.ui.test.history.HistoryViewTest)  Time elapsed: 3.081 s
Running org.eclipse.egit.ui.test.history.GitHistoryRefFilterConfigurationDialogTest
Tests run: 23, Failures: 0, Errors: 0, Skipped: 0, Time elapsed: 16.217 s - in org.eclipse.egit.ui.test.history.GitHistoryRefFilterConfigurationDialogTest
testCheckOne(org.eclipse.egit.ui.test.history.GitHistoryRefFilterConfigurationDialogTest)  Time elapsed: 0.727 s
testCheckTwo(org.eclipse.egit.ui.test.history.GitHistoryRefFilterConfigurationDialogTest)  Time elapsed: 0.647 s
testButtonCurrentBranch(org.eclipse.egit.ui.test.history.GitHistoryRefFilterConfigurationDialogTest)  Time elapsed: 0.886 s
testUncheckOne(org.eclipse.egit.ui.test.history.GitHistoryRefFilterConfigurationDialogTest)  Time elapsed: 0.717 s
testUncheckTwo(org.eclipse.egit.ui.test.history.GitHistoryRefFilterConfigurationDialogTest)  Time elapsed: 0.739 s
testCancelAfterUncheck(org.eclipse.egit.ui.test.history.GitHistoryRefFilterConfigurationDialogTest)  Time elapsed: 0.812 s
testButtonAllBranches(org.eclipse.egit.ui.test.history.GitHistoryRefFilterConfigurationDialogTest)  Time elapsed: 0.653 s
testAdd(org.eclipse.egit.ui.test.history.GitHistoryRefFilterConfigurationDialogTest)  Time elapsed: 0.674 s
testEdit(org.eclipse.egit.ui.test.history.GitHistoryRefFilterConfigurationDialogTest)  Time elapsed: 0.646 s
testCancelAfterButtonHead(org.eclipse.egit.ui.test.history.GitHistoryRefFilterConfigurationDialogTest)  Time elapsed: 0.643 s
testButtonHead(org.eclipse.egit.ui.test.history.GitHistoryRefFilterConfigurationDialogTest)  Time elapsed: 0.637 s
testButtonRestoreDefaultsAndOk(org.eclipse.egit.ui.test.history.GitHistoryRefFilterConfigurationDialogTest)  Time elapsed: 0.638 s
testCancelAfterCheck(org.eclipse.egit.ui.test.history.GitHistoryRefFilterConfigurationDialogTest)  Time elapsed: 0.901 s
testButtonRestoreDefaultsAndCancel(org.eclipse.egit.ui.test.history.GitHistoryRefFilterConfigurationDialogTest)  Time elapsed: 0.637 s
testCancelAfterEdit(org.eclipse.egit.ui.test.history.GitHistoryRefFilterConfigurationDialogTest)  Time elapsed: 0.64 s
testAddRef(org.eclipse.egit.ui.test.history.GitHistoryRefFilterConfigurationDialogTest)  Time elapsed: 0.794 s
testCancel(org.eclipse.egit.ui.test.history.GitHistoryRefFilterConfigurationDialogTest)  Time elapsed: 0.617 s
testInitialTableContent(org.eclipse.egit.ui.test.history.GitHistoryRefFilterConfigurationDialogTest)  Time elapsed: 0.63 s
testRemove(org.eclipse.egit.ui.test.history.GitHistoryRefFilterConfigurationDialogTest)  Time elapsed: 0.633 s
testButtonRestoreDefaults(org.eclipse.egit.ui.test.history.GitHistoryRefFilterConfigurationDialogTest)  Time elapsed: 0.728 s
testUncheckAndCheck(org.eclipse.egit.ui.test.history.GitHistoryRefFilterConfigurationDialogTest)  Time elapsed: 0.729 s
testDoubleClick(org.eclipse.egit.ui.test.history.GitHistoryRefFilterConfigurationDialogTest)  Time elapsed: 0.666 s
testCancelAfterAdd(org.eclipse.egit.ui.test.history.GitHistoryRefFilterConfigurationDialogTest)  Time elapsed: 0.743 s
Running org.eclipse.egit.ui.test.history.RefFilterHelperTest
Tests run: 23, Failures: 0, Errors: 0, Skipped: 0, Time elapsed: 16.3 s - in org.eclipse.egit.ui.test.history.RefFilterHelperTest
testSetConfiguredFiltersNoSave(org.eclipse.egit.ui.test.history.RefFilterHelperTest)  Time elapsed: 0.859 s
testSetLastSelectedFiltersWithSave(org.eclipse.egit.ui.test.history.RefFilterHelperTest)  Time elapsed: 0.642 s
testGetConfiguredFilters(org.eclipse.egit.ui.test.history.RefFilterHelperTest)  Time elapsed: 1.396 s
testIsOnlyCurrentBranchSelected(org.eclipse.egit.ui.test.history.RefFilterHelperTest)  Time elapsed: 0.639 s
testSelectExactlyAllBranchesAndTags(org.eclipse.egit.ui.test.history.RefFilterHelperTest)  Time elapsed: 0.664 s
testIsOnlyHEADSelected(org.eclipse.egit.ui.test.history.RefFilterHelperTest)  Time elapsed: 0.645 s
testIsExactlyAllBranchesAndTagsSelected(org.eclipse.egit.ui.test.history.RefFilterHelperTest)  Time elapsed: 0.663 s
testSelectOnlyCurrentBranch(org.eclipse.egit.ui.test.history.RefFilterHelperTest)  Time elapsed: 0.594 s
testGetFilters(org.eclipse.egit.ui.test.history.RefFilterHelperTest)  Time elapsed: 0.638 s
testSetConfiguredFiltersWithSave(org.eclipse.egit.ui.test.history.RefFilterHelperTest)  Time elapsed: 0.621 s
testResetLastSelectionStateToDefault(org.eclipse.egit.ui.test.history.RefFilterHelperTest)  Time elapsed: 0.686 s
testGetSelectedFilters(org.eclipse.egit.ui.test.history.RefFilterHelperTest)  Time elapsed: 0.697 s
testSetSelectedFiltersNoSave(org.eclipse.egit.ui.test.history.RefFilterHelperTest)  Time elapsed: 0.637 s
testSaveSelectionStateAsLastSelectionState(org.eclipse.egit.ui.test.history.RefFilterHelperTest)  Time elapsed: 0.761 s
testSetSelectedFiltersWithSave(org.eclipse.egit.ui.test.history.RefFilterHelperTest)  Time elapsed: 0.618 s
testSetFilters(org.eclipse.egit.ui.test.history.RefFilterHelperTest)  Time elapsed: 0.747 s
testSetLastSelectedFiltersNoSave(org.eclipse.egit.ui.test.history.RefFilterHelperTest)  Time elapsed: 0.722 s
testRestoreLastSelectionState(org.eclipse.egit.ui.test.history.RefFilterHelperTest)  Time elapsed: 0.645 s
testGetMatchingRefsForSelectedRefFilters(org.eclipse.egit.ui.test.history.RefFilterHelperTest)  Time elapsed: 0.665 s
testSelectOnlyHEAD(org.eclipse.egit.ui.test.history.RefFilterHelperTest)  Time elapsed: 0.731 s
testGetLastSelectedFilters(org.eclipse.egit.ui.test.history.RefFilterHelperTest)  Time elapsed: 0.656 s
testConstructor(org.eclipse.egit.ui.test.history.RefFilterHelperTest)  Time elapsed: 0.644 s
testGetDefaults(org.eclipse.egit.ui.test.history.RefFilterHelperTest)  Time elapsed: 0.618 s
Running org.eclipse.egit.ui.test.commit.CommitEditorInputFactoryTest
Tests run: 2, Failures: 0, Errors: 0, Skipped: 0, Time elapsed: 1.187 s - in org.eclipse.egit.ui.test.commit.CommitEditorInputFactoryTest
shouldPersistAndRestoreStashCommit(org.eclipse.egit.ui.test.commit.CommitEditorInputFactoryTest)  Time elapsed: 0.634 s
shouldPersistAndRestoreCommit(org.eclipse.egit.ui.test.commit.CommitEditorInputFactoryTest)  Time elapsed: 0.545 s
Running org.eclipse.egit.ui.test.commit.CommitEditorTest

(SWT:1708): Gtk-WARNING **: 23:05:21.472: Negative content width -6 (allocation 1, extents 4x3) while allocating gadget (node toolbar, owner GtkToolbar)

(SWT:1708): Gtk-WARNING **: 23:05:21.472: Negative content height -3 (allocation 1, extents 2x2) while allocating gadget (node toolbar, owner GtkToolbar)

(SWT:1708): Gtk-WARNING **: 23:05:21.472: Negative content width -6 (allocation 1, extents 4x3) while allocating gadget (node toolbar, owner GtkToolbar)

(SWT:1708): Gtk-WARNING **: 23:05:21.472: Negative content height -3 (allocation 1, extents 2x2) while allocating gadget (node toolbar, owner GtkToolbar)

(SWT:1708): Gtk-WARNING **: 23:05:21.580: Negative content width -6 (allocation 1, extents 4x3) while allocating gadget (node toolbar, owner GtkToolbar)

(SWT:1708): Gtk-WARNING **: 23:05:21.620: Negative content width -6 (allocation 1, extents 4x3) while allocating gadget (node toolbar, owner GtkToolbar)

(SWT:1708): Gtk-CRITICAL **: 23:05:21.648: gtk_box_gadget_distribute: assertion 'size >= 0' failed in GtkScrollbar

(SWT:1708): Gtk-CRITICAL **: 23:05:21.648: gtk_box_gadget_distribute: assertion 'size >= 0' failed in GtkScrollbar

(SWT:1708): Gtk-CRITICAL **: 23:05:21.674: gtk_box_gadget_distribute: assertion 'size >= 0' failed in GtkScrollbar

(SWT:1708): Gtk-CRITICAL **: 23:05:21.674: gtk_box_gadget_distribute: assertion 'size >= 0' failed in GtkScrollbar

(SWT:1708): Gtk-CRITICAL **: 23:05:21.692: gtk_box_gadget_distribute: assertion 'size >= 0' failed in GtkScrollbar

(SWT:1708): Gtk-CRITICAL **: 23:05:21.692: gtk_box_gadget_distribute: assertion 'size >= 0' failed in GtkScrollbar

(SWT:1708): Gtk-WARNING **: 23:05:21.707: Negative content width -6 (allocation 1, extents 4x3) while allocating gadget (node toolbar, owner GtkToolbar)

(SWT:1708): Gtk-WARNING **: 23:05:21.707: Negative content height -3 (allocation 1, extents 2x2) while allocating gadget (node toolbar, owner GtkToolbar)

(SWT:1708): Gtk-WARNING **: 23:05:21.707: Negative content width -6 (allocation 1, extents 4x3) while allocating gadget (node toolbar, owner GtkToolbar)

(SWT:1708): Gtk-WARNING **: 23:05:21.707: Negative content height -3 (allocation 1, extents 2x2) while allocating gadget (node toolbar, owner GtkToolbar)

(SWT:1708): Gtk-WARNING **: 23:05:22.558: Negative content width -6 (allocation 1, extents 4x3) while allocating gadget (node toolbar, owner GtkToolbar)

(SWT:1708): Gtk-WARNING **: 23:05:22.558: Negative content height -3 (allocation 1, extents 2x2) while allocating gadget (node toolbar, owner GtkToolbar)

(SWT:1708): Gtk-WARNING **: 23:05:22.558: Negative content width -6 (allocation 1, extents 4x3) while allocating gadget (node toolbar, owner GtkToolbar)

(SWT:1708): Gtk-WARNING **: 23:05:22.558: Negative content height -3 (allocation 1, extents 2x2) while allocating gadget (node toolbar, owner GtkToolbar)

(SWT:1708): Gtk-WARNING **: 23:05:22.647: Negative content width -6 (allocation 1, extents 4x3) while allocating gadget (node toolbar, owner GtkToolbar)

(SWT:1708): Gtk-WARNING **: 23:05:22.670: Negative content width -6 (allocation 1, extents 4x3) while allocating gadget (node toolbar, owner GtkToolbar)

(SWT:1708): Gtk-CRITICAL **: 23:05:22.705: gtk_box_gadget_distribute: assertion 'size >= 0' failed in GtkScrollbar

(SWT:1708): Gtk-CRITICAL **: 23:05:22.705: gtk_box_gadget_distribute: assertion 'size >= 0' failed in GtkScrollbar

(SWT:1708): Gtk-CRITICAL **: 23:05:22.731: gtk_box_gadget_distribute: assertion 'size >= 0' failed in GtkScrollbar

(SWT:1708): Gtk-CRITICAL **: 23:05:22.731: gtk_box_gadget_distribute: assertion 'size >= 0' failed in GtkScrollbar
Tests run: 2, Failures: 0, Errors: 0, Skipped: 0, Time elapsed: 1.941 s - in org.eclipse.egit.ui.test.commit.CommitEditorTest
showAnnotations(org.eclipse.egit.ui.test.commit.CommitEditorTest)  Time elapsed: 1.042 s
openAllEditorPagesOnValidCommit(org.eclipse.egit.ui.test.commit.CommitEditorTest)  Time elapsed: 0.89 s
Running org.eclipse.egit.ui.test.commit.DiffRegionFormatterTest
Tests run: 1, Failures: 0, Errors: 0, Skipped: 0, Time elapsed: 0.547 s - in org.eclipse.egit.ui.test.commit.DiffRegionFormatterTest
testRanges(org.eclipse.egit.ui.test.commit.DiffRegionFormatterTest)  Time elapsed: 0.541 s
Running org.eclipse.egit.ui.test.commit.CommitEditorInputTest
Tests run: 3, Failures: 0, Errors: 0, Skipped: 0, Time elapsed: 1.619 s - in org.eclipse.egit.ui.test.commit.CommitEditorInputTest
testInput(org.eclipse.egit.ui.test.commit.CommitEditorInputTest)  Time elapsed: 0.536 s
testAdapters(org.eclipse.egit.ui.test.commit.CommitEditorInputTest)  Time elapsed: 0.536 s
testConstructorAsserts(org.eclipse.egit.ui.test.commit.CommitEditorInputTest)  Time elapsed: 0.535 s
Running org.eclipse.egit.ui.test.commit.RepositoryCommitTest
Tests run: 4, Failures: 0, Errors: 0, Skipped: 0, Time elapsed: 2.208 s - in org.eclipse.egit.ui.test.commit.RepositoryCommitTest
testDiffs(org.eclipse.egit.ui.test.commit.RepositoryCommitTest)  Time elapsed: 0.562 s
testAdapters(org.eclipse.egit.ui.test.commit.RepositoryCommitTest)  Time elapsed: 0.54 s
testGetters(org.eclipse.egit.ui.test.commit.RepositoryCommitTest)  Time elapsed: 0.557 s
testConstructorAsserts(org.eclipse.egit.ui.test.commit.RepositoryCommitTest)  Time elapsed: 0.535 s
Running org.eclipse.egit.ui.test.stagview.StagingViewTest

(SWT:1708): Gtk-WARNING **: 23:05:27.874: Negative content width -6 (allocation 1, extents 4x3) while allocating gadget (node toolbar, owner GtkToolbar)

(SWT:1708): Gtk-CRITICAL **: 23:05:28.357: gtk_box_gadget_distribute: assertion 'size >= 0' failed in GtkScrollbar

(SWT:1708): Gtk-CRITICAL **: 23:05:28.368: gtk_box_gadget_distribute: assertion 'size >= 0' failed in GtkScrollbar

(SWT:1708): Gtk-WARNING **: 23:05:28.375: Negative content width -6 (allocation 1, extents 4x3) while allocating gadget (node toolbar, owner GtkToolbar)

(SWT:1708): Gtk-CRITICAL **: 23:05:28.385: gtk_box_gadget_distribute: assertion 'size >= 0' failed in GtkScrollbar

(SWT:1708): Gtk-CRITICAL **: 23:05:28.392: gtk_box_gadget_distribute: assertion 'size >= 0' failed in GtkScrollbar

(SWT:1708): Gtk-CRITICAL **: 23:05:28.398: gtk_box_gadget_distribute: assertion 'size >= 0' failed in GtkScrollbar

(SWT:1708): Gtk-CRITICAL **: 23:05:28.400: gtk_box_gadget_distribute: assertion 'size >= 0' failed in GtkScrollbar

(SWT:1708): Gtk-CRITICAL **: 23:05:28.401: gtk_box_gadget_distribute: assertion 'size >= 0' failed in GtkScrollbar

(SWT:1708): Gtk-CRITICAL **: 23:05:28.406: gtk_box_gadget_distribute: assertion 'size >= 0' failed in GtkScrollbar

(SWT:1708): Gtk-CRITICAL **: 23:05:28.406: gtk_box_gadget_distribute: assertion 'size >= 0' failed in GtkScrollbar

(SWT:1708): Gtk-CRITICAL **: 23:05:28.417: gtk_box_gadget_distribute: assertion 'size >= 0' failed in GtkScrollbar

(SWT:1708): Gtk-CRITICAL **: 23:05:28.435: gtk_box_gadget_distribute: assertion 'size >= 0' failed in GtkScrollbar

(SWT:1708): Gtk-CRITICAL **: 23:05:28.435: gtk_box_gadget_distribute: assertion 'size >= 0' failed in GtkScrollbar

(SWT:1708): Gtk-CRITICAL **: 23:05:28.450: gtk_box_gadget_distribute: assertion 'size >= 0' failed in GtkScrollbar

(SWT:1708): Gtk-CRITICAL **: 23:05:28.450: gtk_box_gadget_distribute: assertion 'size >= 0' failed in GtkScrollbar

(SWT:1708): Gtk-CRITICAL **: 23:05:28.467: gtk_box_gadget_distribute: assertion 'size >= 0' failed in GtkScrollbar

(SWT:1708): Gtk-CRITICAL **: 23:05:28.467: gtk_box_gadget_distribute: assertion 'size >= 0' failed in GtkScrollbar

(SWT:1708): Gtk-CRITICAL **: 23:05:28.483: gtk_box_gadget_distribute: assertion 'size >= 0' failed in GtkScrollbar

(SWT:1708): Gtk-CRITICAL **: 23:05:28.483: gtk_box_gadget_distribute: assertion 'size >= 0' failed in GtkScrollbar

(SWT:1708): Gtk-CRITICAL **: 23:05:28.499: gtk_box_gadget_distribute: assertion 'size >= 0' failed in GtkScrollbar

(SWT:1708): Gtk-CRITICAL **: 23:05:28.500: gtk_box_gadget_distribute: assertion 'size >= 0' failed in GtkScrollbar

(SWT:1708): Gtk-CRITICAL **: 23:05:28.516: gtk_box_gadget_distribute: assertion 'size >= 0' failed in GtkScrollbar

(SWT:1708): Gtk-CRITICAL **: 23:05:28.517: gtk_box_gadget_distribute: assertion 'size >= 0' failed in GtkScrollbar

(SWT:1708): Gtk-CRITICAL **: 23:05:28.543: gtk_box_gadget_distribute: assertion 'size >= 0' failed in GtkScrollbar

(SWT:1708): Gtk-CRITICAL **: 23:05:28.543: gtk_box_gadget_distribute: assertion 'size >= 0' failed in GtkScrollbar

(SWT:1708): Gtk-CRITICAL **: 23:05:28.551: gtk_box_gadget_distribute: assertion 'size >= 0' failed in GtkScrollbar

(SWT:1708): Gtk-CRITICAL **: 23:05:28.551: gtk_box_gadget_distribute: assertion 'size >= 0' failed in GtkScrollbar

(SWT:1708): Gtk-CRITICAL **: 23:05:28.580: gtk_box_gadget_distribute: assertion 'size >= 0' failed in GtkScrollbar

(SWT:1708): Gtk-CRITICAL **: 23:05:28.580: gtk_box_gadget_distribute: assertion 'size >= 0' failed in GtkScrollbar

(SWT:1708): Gtk-CRITICAL **: 23:05:28.586: gtk_box_gadget_distribute: assertion 'size >= 0' failed in GtkScrollbar

(SWT:1708): Gtk-CRITICAL **: 23:05:28.586: gtk_box_gadget_distribute: assertion 'size >= 0' failed in GtkScrollbar

(SWT:1708): Gtk-CRITICAL **: 23:05:28.602: gtk_box_gadget_distribute: assertion 'size >= 0' failed in GtkScrollbar

(SWT:1708): Gtk-CRITICAL **: 23:05:28.602: gtk_box_gadget_distribute: assertion 'size >= 0' failed in GtkScrollbar

(SWT:1708): Gtk-CRITICAL **: 23:05:28.604: gtk_box_gadget_distribute: assertion 'size >= 0' failed in GtkScrollbar

(SWT:1708): Gtk-CRITICAL **: 23:05:28.605: gtk_box_gadget_distribute: assertion 'size >= 0' failed in GtkScrollbar

(SWT:1708): Gtk-CRITICAL **: 23:05:28.608: gtk_box_gadget_distribute: assertion 'size >= 0' failed in GtkScrollbar

(SWT:1708): Gtk-CRITICAL **: 23:05:28.609: gtk_box_gadget_distribute: assertion 'size >= 0' failed in GtkScrollbar

(SWT:1708): Gtk-CRITICAL **: 23:05:28.624: gtk_box_gadget_distribute: assertion 'size >= 0' failed in GtkScrollbar

(SWT:1708): Gtk-CRITICAL **: 23:05:28.664: gtk_box_gadget_distribute: assertion 'size >= 0' failed in GtkScrollbar

(SWT:1708): Gtk-CRITICAL **: 23:05:28.665: gtk_box_gadget_distribute: assertion 'size >= 0' failed in GtkScrollbar

(SWT:1708): Gtk-CRITICAL **: 23:05:28.672: gtk_box_gadget_distribute: assertion 'size >= 0' failed in GtkScrollbar

(SWT:1708): Gtk-CRITICAL **: 23:05:28.673: gtk_box_gadget_distribute: assertion 'size >= 0' failed in GtkScrollbar

(SWT:1708): Gtk-CRITICAL **: 23:05:28.673: gtk_box_gadget_distribute: assertion 'size >= 0' failed in GtkScrollbar

(SWT:1708): Gtk-CRITICAL **: 23:05:28.674: gtk_box_gadget_distribute: assertion 'size >= 0' failed in GtkScrollbar

(SWT:1708): Gtk-CRITICAL **: 23:05:28.676: gtk_box_gadget_distribute: assertion 'size >= 0' failed in GtkScrollbar

(SWT:1708): Gtk-CRITICAL **: 23:05:28.676: gtk_box_gadget_distribute: assertion 'size >= 0' failed in GtkScrollbar

(SWT:1708): Gtk-CRITICAL **: 23:05:28.677: gtk_box_gadget_distribute: assertion 'size >= 0' failed in GtkScrollbar

(SWT:1708): Gtk-CRITICAL **: 23:05:28.687: gtk_box_gadget_distribute: assertion 'size >= 0' failed in GtkScrollbar

(SWT:1708): Gtk-CRITICAL **: 23:05:28.687: gtk_box_gadget_distribute: assertion 'size >= 0' failed in GtkScrollbar

(SWT:1708): Gtk-CRITICAL **: 23:05:28.744: gtk_box_gadget_distribute: assertion 'size >= 0' failed in GtkScrollbar

(SWT:1708): Gtk-CRITICAL **: 23:05:28.749: gtk_box_gadget_distribute: assertion 'size >= 0' failed in GtkScrollbar

(SWT:1708): Gtk-CRITICAL **: 23:05:28.751: gtk_box_gadget_distribute: assertion 'size >= 0' failed in GtkScrollbar

(SWT:1708): Gtk-CRITICAL **: 23:05:28.751: gtk_box_gadget_distribute: assertion 'size >= 0' failed in GtkScrollbar

(SWT:1708): Gtk-CRITICAL **: 23:05:28.754: gtk_box_gadget_distribute: assertion 'size >= 0' failed in GtkScrollbar

(SWT:1708): Gtk-CRITICAL **: 23:05:28.762: gtk_box_gadget_distribute: assertion 'size >= 0' failed in GtkScrollbar

(SWT:1708): Gtk-CRITICAL **: 23:05:28.840: gtk_box_gadget_distribute: assertion 'size >= 0' failed in GtkScrollbar

(SWT:1708): Gtk-CRITICAL **: 23:05:28.842: gtk_box_gadget_distribute: assertion 'size >= 0' failed in GtkScrollbar

(SWT:1708): Gtk-CRITICAL **: 23:05:28.842: gtk_box_gadget_distribute: assertion 'size >= 0' failed in GtkScrollbar

(SWT:1708): Gtk-CRITICAL **: 23:05:28.853: gtk_box_gadget_distribute: assertion 'size >= 0' failed in GtkScrollbar

(SWT:1708): Gtk-CRITICAL **: 23:05:29.391: gtk_box_gadget_distribute: assertion 'size >= 0' failed in GtkScrollbar

(SWT:1708): Gtk-CRITICAL **: 23:05:29.408: gtk_box_gadget_distribute: assertion 'size >= 0' failed in GtkScrollbar

(SWT:1708): Gtk-CRITICAL **: 23:05:29.415: gtk_box_gadget_distribute: assertion 'size >= 0' failed in GtkScrollbar

(SWT:1708): Gtk-CRITICAL **: 23:05:29.432: gtk_box_gadget_distribute: assertion 'size >= 0' failed in GtkScrollbar

(SWT:1708): Gtk-CRITICAL **: 23:05:29.447: gtk_box_gadget_distribute: assertion 'size >= 0' failed in GtkScrollbar

(SWT:1708): Gtk-CRITICAL **: 23:05:29.447: gtk_box_gadget_distribute: assertion 'size >= 0' failed in GtkScrollbar

(SWT:1708): Gtk-CRITICAL **: 23:05:29.448: gtk_box_gadget_distribute: assertion 'size >= 0' failed in GtkScrollbar

(SWT:1708): Gtk-CRITICAL **: 23:05:29.449: gtk_box_gadget_distribute: assertion 'size >= 0' failed in GtkScrollbar

(SWT:1708): Gtk-CRITICAL **: 23:05:29.451: gtk_box_gadget_distribute: assertion 'size >= 0' failed in GtkScrollbar

(SWT:1708): Gtk-CRITICAL **: 23:05:29.459: gtk_box_gadget_distribute: assertion 'size >= 0' failed in GtkScrollbar

(SWT:1708): Gtk-CRITICAL **: 23:05:29.480: gtk_box_gadget_distribute: assertion 'size >= 0' failed in GtkScrollbar

(SWT:1708): Gtk-CRITICAL **: 23:05:29.480: gtk_box_gadget_distribute: assertion 'size >= 0' failed in GtkScrollbar

(SWT:1708): Gtk-CRITICAL **: 23:05:29.481: gtk_box_gadget_distribute: assertion 'size >= 0' failed in GtkScrollbar

(SWT:1708): Gtk-CRITICAL **: 23:05:29.501: gtk_box_gadget_distribute: assertion 'size >= 0' failed in GtkScrollbar

(SWT:1708): Gtk-CRITICAL **: 23:05:29.501: gtk_box_gadget_distribute: assertion 'size >= 0' failed in GtkScrollbar

(SWT:1708): Gtk-CRITICAL **: 23:05:29.578: gtk_box_gadget_distribute: assertion 'size >= 0' failed in GtkScrollbar

(SWT:1708): Gtk-CRITICAL **: 23:05:29.583: gtk_box_gadget_distribute: assertion 'size >= 0' failed in GtkScrollbar

(SWT:1708): Gtk-CRITICAL **: 23:05:29.584: gtk_box_gadget_distribute: assertion 'size >= 0' failed in GtkScrollbar

(SWT:1708): Gtk-CRITICAL **: 23:05:29.585: gtk_box_gadget_distribute: assertion 'size >= 0' failed in GtkScrollbar

(SWT:1708): Gtk-CRITICAL **: 23:05:29.588: gtk_box_gadget_distribute: assertion 'size >= 0' failed in GtkScrollbar

(SWT:1708): Gtk-CRITICAL **: 23:05:29.597: gtk_box_gadget_distribute: assertion 'size >= 0' failed in GtkScrollbar

(SWT:1708): Gtk-WARNING **: 23:05:29.645: Negative content width -6 (allocation 1, extents 4x3) while allocating gadget (node toolbar, owner GtkToolbar)

(SWT:1708): Gtk-WARNING **: 23:05:30.048: Negative content width -6 (allocation 1, extents 4x3) while allocating gadget (node toolbar, owner GtkToolbar)

(SWT:1708): Gtk-WARNING **: 23:05:30.077: Negative content width -6 (allocation 1, extents 4x3) while allocating gadget (node toolbar, owner GtkToolbar)

(SWT:1708): Gtk-WARNING **: 23:05:30.671: Negative content width -6 (allocation 1, extents 4x3) while allocating gadget (node toolbar, owner GtkToolbar)

(SWT:1708): Gtk-CRITICAL **: 23:05:31.019: gtk_box_gadget_distribute: assertion 'size >= 0' failed in GtkScrollbar

(SWT:1708): Gtk-CRITICAL **: 23:05:31.028: gtk_box_gadget_distribute: assertion 'size >= 0' failed in GtkScrollbar

(SWT:1708): Gtk-WARNING **: 23:05:31.033: Negative content width -6 (allocation 1, extents 4x3) while allocating gadget (node toolbar, owner GtkToolbar)

(SWT:1708): Gtk-CRITICAL **: 23:05:31.042: gtk_box_gadget_distribute: assertion 'size >= 0' failed in GtkScrollbar

(SWT:1708): Gtk-CRITICAL **: 23:05:31.047: gtk_box_gadget_distribute: assertion 'size >= 0' failed in GtkScrollbar

(SWT:1708): Gtk-CRITICAL **: 23:05:31.049: gtk_box_gadget_distribute: assertion 'size >= 0' failed in GtkScrollbar

(SWT:1708): Gtk-CRITICAL **: 23:05:31.049: gtk_box_gadget_distribute: assertion 'size >= 0' failed in GtkScrollbar

(SWT:1708): Gtk-CRITICAL **: 23:05:31.054: gtk_box_gadget_distribute: assertion 'size >= 0' failed in GtkScrollbar

(SWT:1708): Gtk-CRITICAL **: 23:05:31.054: gtk_box_gadget_distribute: assertion 'size >= 0' failed in GtkScrollbar

(SWT:1708): Gtk-CRITICAL **: 23:05:31.065: gtk_box_gadget_distribute: assertion 'size >= 0' failed in GtkScrollbar

(SWT:1708): Gtk-CRITICAL **: 23:05:31.082: gtk_box_gadget_distribute: assertion 'size >= 0' failed in GtkScrollbar

(SWT:1708): Gtk-CRITICAL **: 23:05:31.082: gtk_box_gadget_distribute: assertion 'size >= 0' failed in GtkScrollbar

(SWT:1708): Gtk-CRITICAL **: 23:05:31.098: gtk_box_gadget_distribute: assertion 'size >= 0' failed in GtkScrollbar

(SWT:1708): Gtk-CRITICAL **: 23:05:31.099: gtk_box_gadget_distribute: assertion 'size >= 0' failed in GtkScrollbar

(SWT:1708): Gtk-CRITICAL **: 23:05:31.115: gtk_box_gadget_distribute: assertion 'size >= 0' failed in GtkScrollbar

(SWT:1708): Gtk-CRITICAL **: 23:05:31.115: gtk_box_gadget_distribute: assertion 'size >= 0' failed in GtkScrollbar

(SWT:1708): Gtk-CRITICAL **: 23:05:31.132: gtk_box_gadget_distribute: assertion 'size >= 0' failed in GtkScrollbar

(SWT:1708): Gtk-CRITICAL **: 23:05:31.132: gtk_box_gadget_distribute: assertion 'size >= 0' failed in GtkScrollbar

(SWT:1708): Gtk-CRITICAL **: 23:05:31.148: gtk_box_gadget_distribute: assertion 'size >= 0' failed in GtkScrollbar

(SWT:1708): Gtk-CRITICAL **: 23:05:31.148: gtk_box_gadget_distribute: assertion 'size >= 0' failed in GtkScrollbar

(SWT:1708): Gtk-CRITICAL **: 23:05:31.166: gtk_box_gadget_distribute: assertion 'size >= 0' failed in GtkScrollbar

(SWT:1708): Gtk-CRITICAL **: 23:05:31.166: gtk_box_gadget_distribute: assertion 'size >= 0' failed in GtkScrollbar

(SWT:1708): Gtk-CRITICAL **: 23:05:31.199: gtk_box_gadget_distribute: assertion 'size >= 0' failed in GtkScrollbar

(SWT:1708): Gtk-CRITICAL **: 23:05:31.200: gtk_box_gadget_distribute: assertion 'size >= 0' failed in GtkScrollbar

(SWT:1708): Gtk-CRITICAL **: 23:05:31.209: gtk_box_gadget_distribute: assertion 'size >= 0' failed in GtkScrollbar

(SWT:1708): Gtk-CRITICAL **: 23:05:31.209: gtk_box_gadget_distribute: assertion 'size >= 0' failed in GtkScrollbar

(SWT:1708): Gtk-CRITICAL **: 23:05:31.216: gtk_box_gadget_distribute: assertion 'size >= 0' failed in GtkScrollbar

(SWT:1708): Gtk-CRITICAL **: 23:05:31.216: gtk_box_gadget_distribute: assertion 'size >= 0' failed in GtkScrollbar

(SWT:1708): Gtk-CRITICAL **: 23:05:31.233: gtk_box_gadget_distribute: assertion 'size >= 0' failed in GtkScrollbar

(SWT:1708): Gtk-CRITICAL **: 23:05:31.233: gtk_box_gadget_distribute: assertion 'size >= 0' failed in GtkScrollbar

(SWT:1708): Gtk-CRITICAL **: 23:05:31.237: gtk_box_gadget_distribute: assertion 'size >= 0' failed in GtkScrollbar

(SWT:1708): Gtk-CRITICAL **: 23:05:31.237: gtk_box_gadget_distribute: assertion 'size >= 0' failed in GtkScrollbar

(SWT:1708): Gtk-CRITICAL **: 23:05:31.242: gtk_box_gadget_distribute: assertion 'size >= 0' failed in GtkScrollbar

(SWT:1708): Gtk-CRITICAL **: 23:05:31.242: gtk_box_gadget_distribute: assertion 'size >= 0' failed in GtkScrollbar

(SWT:1708): Gtk-CRITICAL **: 23:05:31.242: gtk_box_gadget_distribute: assertion 'size >= 0' failed in GtkScrollbar

(SWT:1708): Gtk-CRITICAL **: 23:05:31.251: gtk_box_gadget_distribute: assertion 'size >= 0' failed in GtkScrollbar

(SWT:1708): Gtk-CRITICAL **: 23:05:31.267: gtk_box_gadget_distribute: assertion 'size >= 0' failed in GtkScrollbar

(SWT:1708): Gtk-CRITICAL **: 23:05:31.291: gtk_box_gadget_distribute: assertion 'size >= 0' failed in GtkScrollbar

(SWT:1708): Gtk-CRITICAL **: 23:05:31.292: gtk_box_gadget_distribute: assertion 'size >= 0' failed in GtkScrollbar

(SWT:1708): Gtk-CRITICAL **: 23:05:31.294: gtk_box_gadget_distribute: assertion 'size >= 0' failed in GtkScrollbar

(SWT:1708): Gtk-CRITICAL **: 23:05:31.319: gtk_box_gadget_distribute: assertion 'size >= 0' failed in GtkScrollbar

(SWT:1708): Gtk-CRITICAL **: 23:05:31.319: gtk_box_gadget_distribute: assertion 'size >= 0' failed in GtkScrollbar

(SWT:1708): Gtk-CRITICAL **: 23:05:31.358: gtk_box_gadget_distribute: assertion 'size >= 0' failed in GtkScrollbar

(SWT:1708): Gtk-CRITICAL **: 23:05:31.363: gtk_box_gadget_distribute: assertion 'size >= 0' failed in GtkScrollbar

(SWT:1708): Gtk-CRITICAL **: 23:05:31.365: gtk_box_gadget_distribute: assertion 'size >= 0' failed in GtkScrollbar

(SWT:1708): Gtk-CRITICAL **: 23:05:31.365: gtk_box_gadget_distribute: assertion 'size >= 0' failed in GtkScrollbar

(SWT:1708): Gtk-CRITICAL **: 23:05:31.368: gtk_box_gadget_distribute: assertion 'size >= 0' failed in GtkScrollbar

(SWT:1708): Gtk-CRITICAL **: 23:05:31.377: gtk_box_gadget_distribute: assertion 'size >= 0' failed in GtkScrollbar

(SWT:1708): Gtk-WARNING **: 23:05:31.474: Negative content width -6 (allocation 1, extents 4x3) while allocating gadget (node toolbar, owner GtkToolbar)

(SWT:1708): Gtk-WARNING **: 23:05:31.833: Negative content width -6 (allocation 1, extents 4x3) while allocating gadget (node toolbar, owner GtkToolbar)

(SWT:1708): Gtk-WARNING **: 23:05:31.860: Negative content width -6 (allocation 1, extents 4x3) while allocating gadget (node toolbar, owner GtkToolbar)

(SWT:1708): Gtk-WARNING **: 23:05:32.472: Negative content width -6 (allocation 1, extents 4x3) while allocating gadget (node toolbar, owner GtkToolbar)

(SWT:1708): Gtk-CRITICAL **: 23:05:32.933: gtk_box_gadget_distribute: assertion 'size >= 0' failed in GtkScrollbar

(SWT:1708): Gtk-CRITICAL **: 23:05:32.942: gtk_box_gadget_distribute: assertion 'size >= 0' failed in GtkScrollbar

(SWT:1708): Gtk-WARNING **: 23:05:32.947: Negative content width -6 (allocation 1, extents 4x3) while allocating gadget (node toolbar, owner GtkToolbar)

(SWT:1708): Gtk-CRITICAL **: 23:05:32.956: gtk_box_gadget_distribute: assertion 'size >= 0' failed in GtkScrollbar

(SWT:1708): Gtk-CRITICAL **: 23:05:32.962: gtk_box_gadget_distribute: assertion 'size >= 0' failed in GtkScrollbar

(SWT:1708): Gtk-CRITICAL **: 23:05:32.964: gtk_box_gadget_distribute: assertion 'size >= 0' failed in GtkScrollbar

(SWT:1708): Gtk-CRITICAL **: 23:05:32.964: gtk_box_gadget_distribute: assertion 'size >= 0' failed in GtkScrollbar

(SWT:1708): Gtk-CRITICAL **: 23:05:32.969: gtk_box_gadget_distribute: assertion 'size >= 0' failed in GtkScrollbar

(SWT:1708): Gtk-CRITICAL **: 23:05:32.969: gtk_box_gadget_distribute: assertion 'size >= 0' failed in GtkScrollbar

(SWT:1708): Gtk-CRITICAL **: 23:05:32.985: gtk_box_gadget_distribute: assertion 'size >= 0' failed in GtkScrollbar

(SWT:1708): Gtk-CRITICAL **: 23:05:32.985: gtk_box_gadget_distribute: assertion 'size >= 0' failed in GtkScrollbar

(SWT:1708): Gtk-CRITICAL **: 23:05:32.996: gtk_box_gadget_distribute: assertion 'size >= 0' failed in GtkScrollbar

(SWT:1708): Gtk-CRITICAL **: 23:05:33.014: gtk_box_gadget_distribute: assertion 'size >= 0' failed in GtkScrollbar

(SWT:1708): Gtk-CRITICAL **: 23:05:33.014: gtk_box_gadget_distribute: assertion 'size >= 0' failed in GtkScrollbar

(SWT:1708): Gtk-CRITICAL **: 23:05:33.030: gtk_box_gadget_distribute: assertion 'size >= 0' failed in GtkScrollbar

(SWT:1708): Gtk-CRITICAL **: 23:05:33.030: gtk_box_gadget_distribute: assertion 'size >= 0' failed in GtkScrollbar

(SWT:1708): Gtk-CRITICAL **: 23:05:33.046: gtk_box_gadget_distribute: assertion 'size >= 0' failed in GtkScrollbar

(SWT:1708): Gtk-CRITICAL **: 23:05:33.046: gtk_box_gadget_distribute: assertion 'size >= 0' failed in GtkScrollbar

(SWT:1708): Gtk-CRITICAL **: 23:05:33.063: gtk_box_gadget_distribute: assertion 'size >= 0' failed in GtkScrollbar

(SWT:1708): Gtk-CRITICAL **: 23:05:33.063: gtk_box_gadget_distribute: assertion 'size >= 0' failed in GtkScrollbar

(SWT:1708): Gtk-CRITICAL **: 23:05:33.080: gtk_box_gadget_distribute: assertion 'size >= 0' failed in GtkScrollbar

(SWT:1708): Gtk-CRITICAL **: 23:05:33.080: gtk_box_gadget_distribute: assertion 'size >= 0' failed in GtkScrollbar

(SWT:1708): Gtk-CRITICAL **: 23:05:33.096: gtk_box_gadget_distribute: assertion 'size >= 0' failed in GtkScrollbar

(SWT:1708): Gtk-CRITICAL **: 23:05:33.096: gtk_box_gadget_distribute: assertion 'size >= 0' failed in GtkScrollbar

(SWT:1708): Gtk-CRITICAL **: 23:05:33.114: gtk_box_gadget_distribute: assertion 'size >= 0' failed in GtkScrollbar

(SWT:1708): Gtk-CRITICAL **: 23:05:33.114: gtk_box_gadget_distribute: assertion 'size >= 0' failed in GtkScrollbar

(SWT:1708): Gtk-CRITICAL **: 23:05:33.130: gtk_box_gadget_distribute: assertion 'size >= 0' failed in GtkScrollbar

(SWT:1708): Gtk-CRITICAL **: 23:05:33.130: gtk_box_gadget_distribute: assertion 'size >= 0' failed in GtkScrollbar

(SWT:1708): Gtk-CRITICAL **: 23:05:33.147: gtk_box_gadget_distribute: assertion 'size >= 0' failed in GtkScrollbar

(SWT:1708): Gtk-CRITICAL **: 23:05:33.147: gtk_box_gadget_distribute: assertion 'size >= 0' failed in GtkScrollbar

(SWT:1708): Gtk-CRITICAL **: 23:05:33.163: gtk_box_gadget_distribute: assertion 'size >= 0' failed in GtkScrollbar

(SWT:1708): Gtk-CRITICAL **: 23:05:33.255: gtk_box_gadget_distribute: assertion 'size >= 0' failed in GtkScrollbar

(SWT:1708): Gtk-CRITICAL **: 23:05:33.262: gtk_box_gadget_distribute: assertion 'size >= 0' failed in GtkScrollbar

(SWT:1708): Gtk-CRITICAL **: 23:05:33.273: gtk_box_gadget_distribute: assertion 'size >= 0' failed in GtkScrollbar

(SWT:1708): Gtk-CRITICAL **: 23:05:33.273: gtk_box_gadget_distribute: assertion 'size >= 0' failed in GtkScrollbar

(SWT:1708): Gtk-CRITICAL **: 23:05:33.275: gtk_box_gadget_distribute: assertion 'size >= 0' failed in GtkScrollbar

(SWT:1708): Gtk-CRITICAL **: 23:05:33.276: gtk_box_gadget_distribute: assertion 'size >= 0' failed in GtkScrollbar

(SWT:1708): Gtk-CRITICAL **: 23:05:33.279: gtk_box_gadget_distribute: assertion 'size >= 0' failed in GtkScrollbar

(SWT:1708): Gtk-CRITICAL **: 23:05:33.280: gtk_box_gadget_distribute: assertion 'size >= 0' failed in GtkScrollbar

(SWT:1708): Gtk-CRITICAL **: 23:05:33.354: gtk_box_gadget_distribute: assertion 'size >= 0' failed in GtkScrollbar

(SWT:1708): Gtk-CRITICAL **: 23:05:33.355: gtk_box_gadget_distribute: assertion 'size >= 0' failed in GtkScrollbar

(SWT:1708): Gtk-CRITICAL **: 23:05:33.356: gtk_box_gadget_distribute: assertion 'size >= 0' failed in GtkScrollbar

(SWT:1708): Gtk-CRITICAL **: 23:05:33.357: gtk_box_gadget_distribute: assertion 'size >= 0' failed in GtkScrollbar

(SWT:1708): Gtk-CRITICAL **: 23:05:33.358: gtk_box_gadget_distribute: assertion 'size >= 0' failed in GtkScrollbar

(SWT:1708): Gtk-CRITICAL **: 23:05:33.359: gtk_box_gadget_distribute: assertion 'size >= 0' failed in GtkScrollbar

(SWT:1708): Gtk-CRITICAL **: 23:05:33.361: gtk_box_gadget_distribute: assertion 'size >= 0' failed in GtkScrollbar

(SWT:1708): Gtk-CRITICAL **: 23:05:33.361: gtk_box_gadget_distribute: assertion 'size >= 0' failed in GtkScrollbar

(SWT:1708): Gtk-CRITICAL **: 23:05:33.362: gtk_box_gadget_distribute: assertion 'size >= 0' failed in GtkScrollbar

(SWT:1708): Gtk-CRITICAL **: 23:05:33.382: gtk_box_gadget_distribute: assertion 'size >= 0' failed in GtkScrollbar

(SWT:1708): Gtk-CRITICAL **: 23:05:33.382: gtk_box_gadget_distribute: assertion 'size >= 0' failed in GtkScrollbar

(SWT:1708): Gtk-CRITICAL **: 23:05:33.423: gtk_box_gadget_distribute: assertion 'size >= 0' failed in GtkScrollbar

(SWT:1708): Gtk-CRITICAL **: 23:05:33.428: gtk_box_gadget_distribute: assertion 'size >= 0' failed in GtkScrollbar

(SWT:1708): Gtk-CRITICAL **: 23:05:33.430: gtk_box_gadget_distribute: assertion 'size >= 0' failed in GtkScrollbar

(SWT:1708): Gtk-CRITICAL **: 23:05:33.430: gtk_box_gadget_distribute: assertion 'size >= 0' failed in GtkScrollbar

(SWT:1708): Gtk-CRITICAL **: 23:05:33.433: gtk_box_gadget_distribute: assertion 'size >= 0' failed in GtkScrollbar

(SWT:1708): Gtk-CRITICAL **: 23:05:33.443: gtk_box_gadget_distribute: assertion 'size >= 0' failed in GtkScrollbar

(SWT:1708): Gtk-CRITICAL **: 23:05:33.508: gtk_box_gadget_distribute: assertion 'size >= 0' failed in GtkScrollbar

(SWT:1708): Gtk-CRITICAL **: 23:05:33.510: gtk_box_gadget_distribute: assertion 'size >= 0' failed in GtkScrollbar

(SWT:1708): Gtk-CRITICAL **: 23:05:33.510: gtk_box_gadget_distribute: assertion 'size >= 0' failed in GtkScrollbar

(SWT:1708): Gtk-CRITICAL **: 23:05:33.521: gtk_box_gadget_distribute: assertion 'size >= 0' failed in GtkScrollbar

(SWT:1708): Gtk-CRITICAL **: 23:05:33.569: gtk_box_gadget_distribute: assertion 'size >= 0' failed in GtkScrollbar

(SWT:1708): Gtk-CRITICAL **: 23:05:33.571: gtk_box_gadget_distribute: assertion 'size >= 0' failed in GtkScrollbar

(SWT:1708): Gtk-CRITICAL **: 23:05:33.571: gtk_box_gadget_distribute: assertion 'size >= 0' failed in GtkScrollbar

(SWT:1708): Gtk-CRITICAL **: 23:05:33.574: gtk_box_gadget_distribute: assertion 'size >= 0' failed in GtkScrollbar

(SWT:1708): Gtk-CRITICAL **: 23:05:33.718: gtk_box_gadget_distribute: assertion 'size >= 0' failed in GtkScrollbar

(SWT:1708): Gtk-CRITICAL **: 23:05:33.728: gtk_box_gadget_distribute: assertion 'size >= 0' failed in GtkScrollbar

(SWT:1708): Gtk-CRITICAL **: 23:05:33.743: gtk_box_gadget_distribute: assertion 'size >= 0' failed in GtkScrollbar

(SWT:1708): Gtk-CRITICAL **: 23:05:33.760: gtk_box_gadget_distribute: assertion 'size >= 0' failed in GtkScrollbar

(SWT:1708): Gtk-CRITICAL **: 23:05:33.776: gtk_box_gadget_distribute: assertion 'size >= 0' failed in GtkScrollbar

(SWT:1708): Gtk-CRITICAL **: 23:05:33.792: gtk_box_gadget_distribute: assertion 'size >= 0' failed in GtkScrollbar

(SWT:1708): Gtk-CRITICAL **: 23:05:33.809: gtk_box_gadget_distribute: assertion 'size >= 0' failed in GtkScrollbar

(SWT:1708): Gtk-CRITICAL **: 23:05:33.810: gtk_box_gadget_distribute: assertion 'size >= 0' failed in GtkScrollbar

(SWT:1708): Gtk-CRITICAL **: 23:05:33.811: gtk_box_gadget_distribute: assertion 'size >= 0' failed in GtkScrollbar

(SWT:1708): Gtk-CRITICAL **: 23:05:33.812: gtk_box_gadget_distribute: assertion 'size >= 0' failed in GtkScrollbar

(SWT:1708): Gtk-CRITICAL **: 23:05:33.815: gtk_box_gadget_distribute: assertion 'size >= 0' failed in GtkScrollbar

(SWT:1708): Gtk-CRITICAL **: 23:05:33.824: gtk_box_gadget_distribute: assertion 'size >= 0' failed in GtkScrollbar

(SWT:1708): Gtk-CRITICAL **: 23:05:33.850: gtk_box_gadget_distribute: assertion 'size >= 0' failed in GtkScrollbar

(SWT:1708): Gtk-CRITICAL **: 23:05:33.851: gtk_box_gadget_distribute: assertion 'size >= 0' failed in GtkScrollbar

(SWT:1708): Gtk-CRITICAL **: 23:05:33.852: gtk_box_gadget_distribute: assertion 'size >= 0' failed in GtkScrollbar

(SWT:1708): Gtk-CRITICAL **: 23:05:33.853: gtk_box_gadget_distribute: assertion 'size >= 0' failed in GtkScrollbar

(SWT:1708): Gtk-CRITICAL **: 23:05:33.853: gtk_box_gadget_distribute: assertion 'size >= 0' failed in GtkScrollbar

(SWT:1708): Gtk-CRITICAL **: 23:05:33.854: gtk_box_gadget_distribute: assertion 'size >= 0' failed in GtkScrollbar

(SWT:1708): Gtk-CRITICAL **: 23:05:33.856: gtk_box_gadget_distribute: assertion 'size >= 0' failed in GtkScrollbar

(SWT:1708): Gtk-CRITICAL **: 23:05:33.856: gtk_box_gadget_distribute: assertion 'size >= 0' failed in GtkScrollbar

(SWT:1708): Gtk-CRITICAL **: 23:05:33.863: gtk_box_gadget_distribute: assertion 'size >= 0' failed in GtkScrollbar

(SWT:1708): Gtk-CRITICAL **: 23:05:33.876: gtk_box_gadget_distribute: assertion 'size >= 0' failed in GtkScrollbar

(SWT:1708): Gtk-CRITICAL **: 23:05:33.876: gtk_box_gadget_distribute: assertion 'size >= 0' failed in GtkScrollbar

(SWT:1708): Gtk-CRITICAL **: 23:05:33.901: gtk_box_gadget_distribute: assertion 'size >= 0' failed in GtkScrollbar

(SWT:1708): Gtk-CRITICAL **: 23:05:33.907: gtk_box_gadget_distribute: assertion 'size >= 0' failed in GtkScrollbar

(SWT:1708): Gtk-CRITICAL **: 23:05:33.908: gtk_box_gadget_distribute: assertion 'size >= 0' failed in GtkScrollbar

(SWT:1708): Gtk-CRITICAL **: 23:05:33.909: gtk_box_gadget_distribute: assertion 'size >= 0' failed in GtkScrollbar

(SWT:1708): Gtk-CRITICAL **: 23:05:33.912: gtk_box_gadget_distribute: assertion 'size >= 0' failed in GtkScrollbar

(SWT:1708): Gtk-CRITICAL **: 23:05:33.922: gtk_box_gadget_distribute: assertion 'size >= 0' failed in GtkScrollbar

(SWT:1708): Gtk-CRITICAL **: 23:05:33.992: gtk_box_gadget_distribute: assertion 'size >= 0' failed in GtkScrollbar

(SWT:1708): Gtk-CRITICAL **: 23:05:33.994: gtk_box_gadget_distribute: assertion 'size >= 0' failed in GtkScrollbar

(SWT:1708): Gtk-CRITICAL **: 23:05:33.994: gtk_box_gadget_distribute: assertion 'size >= 0' failed in GtkScrollbar

(SWT:1708): Gtk-CRITICAL **: 23:05:34.012: gtk_box_gadget_distribute: assertion 'size >= 0' failed in GtkScrollbar

(SWT:1708): Gtk-CRITICAL **: 23:05:34.109: gtk_box_gadget_distribute: assertion 'size >= 0' failed in GtkScrollbar

(SWT:1708): Gtk-CRITICAL **: 23:05:34.110: gtk_box_gadget_distribute: assertion 'size >= 0' failed in GtkScrollbar

(SWT:1708): Gtk-CRITICAL **: 23:05:34.110: gtk_box_gadget_distribute: assertion 'size >= 0' failed in GtkScrollbar

(SWT:1708): Gtk-CRITICAL **: 23:05:34.116: gtk_box_gadget_distribute: assertion 'size >= 0' failed in GtkScrollbar

(SWT:1708): Gtk-CRITICAL **: 23:05:34.210: gtk_box_gadget_distribute: assertion 'size >= 0' failed in GtkScrollbar

(SWT:1708): Gtk-CRITICAL **: 23:05:34.219: gtk_box_gadget_distribute: assertion 'size >= 0' failed in GtkScrollbar

(SWT:1708): Gtk-CRITICAL **: 23:05:34.237: gtk_box_gadget_distribute: assertion 'size >= 0' failed in GtkScrollbar

(SWT:1708): Gtk-CRITICAL **: 23:05:34.237: gtk_box_gadget_distribute: assertion 'size >= 0' failed in GtkScrollbar

(SWT:1708): Gtk-CRITICAL **: 23:05:34.239: gtk_box_gadget_distribute: assertion 'size >= 0' failed in GtkScrollbar

(SWT:1708): Gtk-CRITICAL **: 23:05:34.240: gtk_box_gadget_distribute: assertion 'size >= 0' failed in GtkScrollbar

(SWT:1708): Gtk-CRITICAL **: 23:05:34.241: gtk_box_gadget_distribute: assertion 'size >= 0' failed in GtkScrollbar

(SWT:1708): Gtk-CRITICAL **: 23:05:34.241: gtk_box_gadget_distribute: assertion 'size >= 0' failed in GtkScrollbar

(SWT:1708): Gtk-CRITICAL **: 23:05:34.247: gtk_box_gadget_distribute: assertion 'size >= 0' failed in GtkScrollbar

(SWT:1708): Gtk-CRITICAL **: 23:05:34.258: gtk_box_gadget_distribute: assertion 'size >= 0' failed in GtkScrollbar

(SWT:1708): Gtk-CRITICAL **: 23:05:34.323: gtk_box_gadget_distribute: assertion 'size >= 0' failed in GtkScrollbar

(SWT:1708): Gtk-CRITICAL **: 23:05:34.323: gtk_box_gadget_distribute: assertion 'size >= 0' failed in GtkScrollbar

(SWT:1708): Gtk-CRITICAL **: 23:05:34.379: gtk_box_gadget_distribute: assertion 'size >= 0' failed in GtkScrollbar

(SWT:1708): Gtk-CRITICAL **: 23:05:34.385: gtk_box_gadget_distribute: assertion 'size >= 0' failed in GtkScrollbar

(SWT:1708): Gtk-CRITICAL **: 23:05:34.387: gtk_box_gadget_distribute: assertion 'size >= 0' failed in GtkScrollbar

(SWT:1708): Gtk-CRITICAL **: 23:05:34.387: gtk_box_gadget_distribute: assertion 'size >= 0' failed in GtkScrollbar

(SWT:1708): Gtk-CRITICAL **: 23:05:34.391: gtk_box_gadget_distribute: assertion 'size >= 0' failed in GtkScrollbar

(SWT:1708): Gtk-CRITICAL **: 23:05:34.400: gtk_box_gadget_distribute: assertion 'size >= 0' failed in GtkScrollbar

(SWT:1708): Gtk-WARNING **: 23:05:34.457: Negative content width -6 (allocation 1, extents 4x3) while allocating gadget (node toolbar, owner GtkToolbar)

(SWT:1708): Gtk-WARNING **: 23:05:34.788: Negative content width -6 (allocation 1, extents 4x3) while allocating gadget (node toolbar, owner GtkToolbar)

(SWT:1708): Gtk-WARNING **: 23:05:34.816: Negative content width -6 (allocation 1, extents 4x3) while allocating gadget (node toolbar, owner GtkToolbar)

(SWT:1708): Gtk-WARNING **: 23:05:35.445: Negative content width -6 (allocation 1, extents 4x3) while allocating gadget (node toolbar, owner GtkToolbar)

(SWT:1708): Gtk-CRITICAL **: 23:05:36.026: gtk_box_gadget_distribute: assertion 'size >= 0' failed in GtkScrollbar

(SWT:1708): Gtk-CRITICAL **: 23:05:36.036: gtk_box_gadget_distribute: assertion 'size >= 0' failed in GtkScrollbar

(SWT:1708): Gtk-WARNING **: 23:05:36.041: Negative content width -6 (allocation 1, extents 4x3) while allocating gadget (node toolbar, owner GtkToolbar)

(SWT:1708): Gtk-CRITICAL **: 23:05:36.049: gtk_box_gadget_distribute: assertion 'size >= 0' failed in GtkScrollbar

(SWT:1708): Gtk-CRITICAL **: 23:05:36.054: gtk_box_gadget_distribute: assertion 'size >= 0' failed in GtkScrollbar

(SWT:1708): Gtk-CRITICAL **: 23:05:36.056: gtk_box_gadget_distribute: assertion 'size >= 0' failed in GtkScrollbar

(SWT:1708): Gtk-CRITICAL **: 23:05:36.056: gtk_box_gadget_distribute: assertion 'size >= 0' failed in GtkScrollbar

(SWT:1708): Gtk-CRITICAL **: 23:05:36.061: gtk_box_gadget_distribute: assertion 'size >= 0' failed in GtkScrollbar

(SWT:1708): Gtk-CRITICAL **: 23:05:36.061: gtk_box_gadget_distribute: assertion 'size >= 0' failed in GtkScrollbar

(SWT:1708): Gtk-CRITICAL **: 23:05:36.076: gtk_box_gadget_distribute: assertion 'size >= 0' failed in GtkScrollbar

(SWT:1708): Gtk-CRITICAL **: 23:05:36.088: gtk_box_gadget_distribute: assertion 'size >= 0' failed in GtkScrollbar

(SWT:1708): Gtk-CRITICAL **: 23:05:36.088: gtk_box_gadget_distribute: assertion 'size >= 0' failed in GtkScrollbar

(SWT:1708): Gtk-CRITICAL **: 23:05:36.105: gtk_box_gadget_distribute: assertion 'size >= 0' failed in GtkScrollbar

(SWT:1708): Gtk-CRITICAL **: 23:05:36.105: gtk_box_gadget_distribute: assertion 'size >= 0' failed in GtkScrollbar

(SWT:1708): Gtk-CRITICAL **: 23:05:36.121: gtk_box_gadget_distribute: assertion 'size >= 0' failed in GtkScrollbar

(SWT:1708): Gtk-CRITICAL **: 23:05:36.121: gtk_box_gadget_distribute: assertion 'size >= 0' failed in GtkScrollbar

(SWT:1708): Gtk-CRITICAL **: 23:05:36.138: gtk_box_gadget_distribute: assertion 'size >= 0' failed in GtkScrollbar

(SWT:1708): Gtk-CRITICAL **: 23:05:36.138: gtk_box_gadget_distribute: assertion 'size >= 0' failed in GtkScrollbar

(SWT:1708): Gtk-CRITICAL **: 23:05:36.154: gtk_box_gadget_distribute: assertion 'size >= 0' failed in GtkScrollbar

(SWT:1708): Gtk-CRITICAL **: 23:05:36.155: gtk_box_gadget_distribute: assertion 'size >= 0' failed in GtkScrollbar

(SWT:1708): Gtk-CRITICAL **: 23:05:36.172: gtk_box_gadget_distribute: assertion 'size >= 0' failed in GtkScrollbar

(SWT:1708): Gtk-CRITICAL **: 23:05:36.172: gtk_box_gadget_distribute: assertion 'size >= 0' failed in GtkScrollbar

(SWT:1708): Gtk-CRITICAL **: 23:05:36.180: gtk_box_gadget_distribute: assertion 'size >= 0' failed in GtkScrollbar

(SWT:1708): Gtk-CRITICAL **: 23:05:36.180: gtk_box_gadget_distribute: assertion 'size >= 0' failed in GtkScrollbar

(SWT:1708): Gtk-CRITICAL **: 23:05:36.181: gtk_box_gadget_distribute: assertion 'size >= 0' failed in GtkScrollbar

(SWT:1708): Gtk-CRITICAL **: 23:05:36.183: gtk_box_gadget_distribute: assertion 'size >= 0' failed in GtkScrollbar

(SWT:1708): Gtk-CRITICAL **: 23:05:36.183: gtk_box_gadget_distribute: assertion 'size >= 0' failed in GtkScrollbar

(SWT:1708): Gtk-CRITICAL **: 23:05:36.184: gtk_box_gadget_distribute: assertion 'size >= 0' failed in GtkScrollbar

(SWT:1708): Gtk-CRITICAL **: 23:05:36.188: gtk_box_gadget_distribute: assertion 'size >= 0' failed in GtkScrollbar

(SWT:1708): Gtk-CRITICAL **: 23:05:36.188: gtk_box_gadget_distribute: assertion 'size >= 0' failed in GtkScrollbar

(SWT:1708): Gtk-CRITICAL **: 23:05:36.194: gtk_box_gadget_distribute: assertion 'size >= 0' failed in GtkScrollbar

(SWT:1708): Gtk-CRITICAL **: 23:05:36.195: gtk_box_gadget_distribute: assertion 'size >= 0' failed in GtkScrollbar

(SWT:1708): Gtk-CRITICAL **: 23:05:36.196: gtk_box_gadget_distribute: assertion 'size >= 0' failed in GtkScrollbar

(SWT:1708): Gtk-CRITICAL **: 23:05:36.207: gtk_box_gadget_distribute: assertion 'size >= 0' failed in GtkScrollbar

(SWT:1708): Gtk-CRITICAL **: 23:05:36.207: gtk_box_gadget_distribute: assertion 'size >= 0' failed in GtkScrollbar

(SWT:1708): Gtk-CRITICAL **: 23:05:36.226: gtk_box_gadget_distribute: assertion 'size >= 0' failed in GtkScrollbar

(SWT:1708): Gtk-WARNING **: 23:05:36.255: Negative content width -6 (allocation 1, extents 4x3) while allocating gadget (node toolbar, owner GtkToolbar)

(SWT:1708): Gtk-WARNING **: 23:05:36.586: Negative content width -6 (allocation 1, extents 4x3) while allocating gadget (node toolbar, owner GtkToolbar)

(SWT:1708): Gtk-WARNING **: 23:05:36.612: Negative content width -6 (allocation 1, extents 4x3) while allocating gadget (node toolbar, owner GtkToolbar)

(SWT:1708): Gtk-WARNING **: 23:05:37.227: Negative content width -6 (allocation 1, extents 4x3) while allocating gadget (node toolbar, owner GtkToolbar)

(SWT:1708): Gtk-CRITICAL **: 23:05:37.743: gtk_box_gadget_distribute: assertion 'size >= 0' failed in GtkScrollbar

(SWT:1708): Gtk-CRITICAL **: 23:05:37.752: gtk_box_gadget_distribute: assertion 'size >= 0' failed in GtkScrollbar

(SWT:1708): Gtk-WARNING **: 23:05:37.757: Negative content width -6 (allocation 1, extents 4x3) while allocating gadget (node toolbar, owner GtkToolbar)

(SWT:1708): Gtk-CRITICAL **: 23:05:37.765: gtk_box_gadget_distribute: assertion 'size >= 0' failed in GtkScrollbar

(SWT:1708): Gtk-CRITICAL **: 23:05:37.771: gtk_box_gadget_distribute: assertion 'size >= 0' failed in GtkScrollbar

(SWT:1708): Gtk-CRITICAL **: 23:05:37.773: gtk_box_gadget_distribute: assertion 'size >= 0' failed in GtkScrollbar

(SWT:1708): Gtk-CRITICAL **: 23:05:37.773: gtk_box_gadget_distribute: assertion 'size >= 0' failed in GtkScrollbar

(SWT:1708): Gtk-CRITICAL **: 23:05:37.778: gtk_box_gadget_distribute: assertion 'size >= 0' failed in GtkScrollbar

(SWT:1708): Gtk-CRITICAL **: 23:05:37.778: gtk_box_gadget_distribute: assertion 'size >= 0' failed in GtkScrollbar

(SWT:1708): Gtk-CRITICAL **: 23:05:37.790: gtk_box_gadget_distribute: assertion 'size >= 0' failed in GtkScrollbar

(SWT:1708): Gtk-CRITICAL **: 23:05:37.805: gtk_box_gadget_distribute: assertion 'size >= 0' failed in GtkScrollbar

(SWT:1708): Gtk-CRITICAL **: 23:05:37.805: gtk_box_gadget_distribute: assertion 'size >= 0' failed in GtkScrollbar

(SWT:1708): Gtk-CRITICAL **: 23:05:37.822: gtk_box_gadget_distribute: assertion 'size >= 0' failed in GtkScrollbar

(SWT:1708): Gtk-CRITICAL **: 23:05:37.822: gtk_box_gadget_distribute: assertion 'size >= 0' failed in GtkScrollbar

(SWT:1708): Gtk-CRITICAL **: 23:05:37.838: gtk_box_gadget_distribute: assertion 'size >= 0' failed in GtkScrollbar

(SWT:1708): Gtk-CRITICAL **: 23:05:37.838: gtk_box_gadget_distribute: assertion 'size >= 0' failed in GtkScrollbar

(SWT:1708): Gtk-CRITICAL **: 23:05:37.855: gtk_box_gadget_distribute: assertion 'size >= 0' failed in GtkScrollbar

(SWT:1708): Gtk-CRITICAL **: 23:05:37.855: gtk_box_gadget_distribute: assertion 'size >= 0' failed in GtkScrollbar

(SWT:1708): Gtk-CRITICAL **: 23:05:37.872: gtk_box_gadget_distribute: assertion 'size >= 0' failed in GtkScrollbar

(SWT:1708): Gtk-CRITICAL **: 23:05:37.872: gtk_box_gadget_distribute: assertion 'size >= 0' failed in GtkScrollbar

(SWT:1708): Gtk-CRITICAL **: 23:05:37.889: gtk_box_gadget_distribute: assertion 'size >= 0' failed in GtkScrollbar

(SWT:1708): Gtk-CRITICAL **: 23:05:37.889: gtk_box_gadget_distribute: assertion 'size >= 0' failed in GtkScrollbar

(SWT:1708): Gtk-CRITICAL **: 23:05:37.899: gtk_box_gadget_distribute: assertion 'size >= 0' failed in GtkScrollbar

(SWT:1708): Gtk-CRITICAL **: 23:05:37.899: gtk_box_gadget_distribute: assertion 'size >= 0' failed in GtkScrollbar

(SWT:1708): Gtk-CRITICAL **: 23:05:37.901: gtk_box_gadget_distribute: assertion 'size >= 0' failed in GtkScrollbar

(SWT:1708): Gtk-CRITICAL **: 23:05:37.902: gtk_box_gadget_distribute: assertion 'size >= 0' failed in GtkScrollbar

(SWT:1708): Gtk-CRITICAL **: 23:05:37.902: gtk_box_gadget_distribute: assertion 'size >= 0' failed in GtkScrollbar

(SWT:1708): Gtk-CRITICAL **: 23:05:37.903: gtk_box_gadget_distribute: assertion 'size >= 0' failed in GtkScrollbar

(SWT:1708): Gtk-CRITICAL **: 23:05:37.906: gtk_box_gadget_distribute: assertion 'size >= 0' failed in GtkScrollbar

(SWT:1708): Gtk-CRITICAL **: 23:05:37.906: gtk_box_gadget_distribute: assertion 'size >= 0' failed in GtkScrollbar

(SWT:1708): Gtk-CRITICAL **: 23:05:37.917: gtk_box_gadget_distribute: assertion 'size >= 0' failed in GtkScrollbar

(SWT:1708): Gtk-CRITICAL **: 23:05:37.917: gtk_box_gadget_distribute: assertion 'size >= 0' failed in GtkScrollbar

(SWT:1708): Gtk-CRITICAL **: 23:05:37.918: gtk_box_gadget_distribute: assertion 'size >= 0' failed in GtkScrollbar

(SWT:1708): Gtk-CRITICAL **: 23:05:37.922: gtk_box_gadget_distribute: assertion 'size >= 0' failed in GtkScrollbar

(SWT:1708): Gtk-CRITICAL **: 23:05:37.922: gtk_box_gadget_distribute: assertion 'size >= 0' failed in GtkScrollbar

(SWT:1708): Gtk-CRITICAL **: 23:05:37.939: gtk_box_gadget_distribute: assertion 'size >= 0' failed in GtkScrollbar

(SWT:1708): Gtk-CRITICAL **: 23:05:37.940: gtk_box_gadget_distribute: assertion 'size >= 0' failed in GtkScrollbar

(SWT:1708): Gtk-CRITICAL **: 23:05:37.956: gtk_box_gadget_distribute: assertion 'size >= 0' failed in GtkScrollbar

(SWT:1708): Gtk-WARNING **: 23:05:37.981: Negative content width -6 (allocation 1, extents 4x3) while allocating gadget (node toolbar, owner GtkToolbar)

(SWT:1708): Gtk-WARNING **: 23:05:38.313: Negative content width -6 (allocation 1, extents 4x3) while allocating gadget (node toolbar, owner GtkToolbar)

(SWT:1708): Gtk-WARNING **: 23:05:38.339: Negative content width -6 (allocation 1, extents 4x3) while allocating gadget (node toolbar, owner GtkToolbar)

(SWT:1708): Gtk-WARNING **: 23:05:38.959: Negative content width -6 (allocation 1, extents 4x3) while allocating gadget (node toolbar, owner GtkToolbar)

(SWT:1708): Gtk-CRITICAL **: 23:05:39.273: gtk_box_gadget_distribute: assertion 'size >= 0' failed in GtkScrollbar

(SWT:1708): Gtk-CRITICAL **: 23:05:39.282: gtk_box_gadget_distribute: assertion 'size >= 0' failed in GtkScrollbar

(SWT:1708): Gtk-WARNING **: 23:05:39.288: Negative content width -6 (allocation 1, extents 4x3) while allocating gadget (node toolbar, owner GtkToolbar)

(SWT:1708): Gtk-CRITICAL **: 23:05:39.302: gtk_box_gadget_distribute: assertion 'size >= 0' failed in GtkScrollbar

(SWT:1708): Gtk-CRITICAL **: 23:05:39.309: gtk_box_gadget_distribute: assertion 'size >= 0' failed in GtkScrollbar

(SWT:1708): Gtk-CRITICAL **: 23:05:39.315: gtk_box_gadget_distribute: assertion 'size >= 0' failed in GtkScrollbar

(SWT:1708): Gtk-CRITICAL **: 23:05:39.317: gtk_box_gadget_distribute: assertion 'size >= 0' failed in GtkScrollbar

(SWT:1708): Gtk-CRITICAL **: 23:05:39.317: gtk_box_gadget_distribute: assertion 'size >= 0' failed in GtkScrollbar

(SWT:1708): Gtk-CRITICAL **: 23:05:39.322: gtk_box_gadget_distribute: assertion 'size >= 0' failed in GtkScrollbar

(SWT:1708): Gtk-CRITICAL **: 23:05:39.323: gtk_box_gadget_distribute: assertion 'size >= 0' failed in GtkScrollbar

(SWT:1708): Gtk-CRITICAL **: 23:05:39.334: gtk_box_gadget_distribute: assertion 'size >= 0' failed in GtkScrollbar

(SWT:1708): Gtk-CRITICAL **: 23:05:39.351: gtk_box_gadget_distribute: assertion 'size >= 0' failed in GtkScrollbar

(SWT:1708): Gtk-CRITICAL **: 23:05:39.351: gtk_box_gadget_distribute: assertion 'size >= 0' failed in GtkScrollbar

(SWT:1708): Gtk-CRITICAL **: 23:05:39.367: gtk_box_gadget_distribute: assertion 'size >= 0' failed in GtkScrollbar

(SWT:1708): Gtk-CRITICAL **: 23:05:39.367: gtk_box_gadget_distribute: assertion 'size >= 0' failed in GtkScrollbar

(SWT:1708): Gtk-CRITICAL **: 23:05:39.384: gtk_box_gadget_distribute: assertion 'size >= 0' failed in GtkScrollbar

(SWT:1708): Gtk-CRITICAL **: 23:05:39.384: gtk_box_gadget_distribute: assertion 'size >= 0' failed in GtkScrollbar

(SWT:1708): Gtk-CRITICAL **: 23:05:39.400: gtk_box_gadget_distribute: assertion 'size >= 0' failed in GtkScrollbar

(SWT:1708): Gtk-CRITICAL **: 23:05:39.400: gtk_box_gadget_distribute: assertion 'size >= 0' failed in GtkScrollbar

(SWT:1708): Gtk-CRITICAL **: 23:05:39.417: gtk_box_gadget_distribute: assertion 'size >= 0' failed in GtkScrollbar

(SWT:1708): Gtk-CRITICAL **: 23:05:39.417: gtk_box_gadget_distribute: assertion 'size >= 0' failed in GtkScrollbar

(SWT:1708): Gtk-CRITICAL **: 23:05:39.433: gtk_box_gadget_distribute: assertion 'size >= 0' failed in GtkScrollbar

(SWT:1708): Gtk-CRITICAL **: 23:05:39.433: gtk_box_gadget_distribute: assertion 'size >= 0' failed in GtkScrollbar

(SWT:1708): Gtk-CRITICAL **: 23:05:39.443: gtk_box_gadget_distribute: assertion 'size >= 0' failed in GtkScrollbar

(SWT:1708): Gtk-CRITICAL **: 23:05:39.444: gtk_box_gadget_distribute: assertion 'size >= 0' failed in GtkScrollbar

(SWT:1708): Gtk-CRITICAL **: 23:05:39.445: gtk_box_gadget_distribute: assertion 'size >= 0' failed in GtkScrollbar

(SWT:1708): Gtk-CRITICAL **: 23:05:39.446: gtk_box_gadget_distribute: assertion 'size >= 0' failed in GtkScrollbar

(SWT:1708): Gtk-CRITICAL **: 23:05:39.447: gtk_box_gadget_distribute: assertion 'size >= 0' failed in GtkScrollbar

(SWT:1708): Gtk-CRITICAL **: 23:05:39.447: gtk_box_gadget_distribute: assertion 'size >= 0' failed in GtkScrollbar

(SWT:1708): Gtk-CRITICAL **: 23:05:39.455: gtk_box_gadget_distribute: assertion 'size >= 0' failed in GtkScrollbar

(SWT:1708): Gtk-CRITICAL **: 23:05:39.455: gtk_box_gadget_distribute: assertion 'size >= 0' failed in GtkScrollbar

(SWT:1708): Gtk-CRITICAL **: 23:05:39.461: gtk_box_gadget_distribute: assertion 'size >= 0' failed in GtkScrollbar

(SWT:1708): Gtk-CRITICAL **: 23:05:39.461: gtk_box_gadget_distribute: assertion 'size >= 0' failed in GtkScrollbar

(SWT:1708): Gtk-CRITICAL **: 23:05:39.462: gtk_box_gadget_distribute: assertion 'size >= 0' failed in GtkScrollbar

(SWT:1708): Gtk-CRITICAL **: 23:05:39.468: gtk_box_gadget_distribute: assertion 'size >= 0' failed in GtkScrollbar

(SWT:1708): Gtk-CRITICAL **: 23:05:39.468: gtk_box_gadget_distribute: assertion 'size >= 0' failed in GtkScrollbar

(SWT:1708): Gtk-CRITICAL **: 23:05:39.491: gtk_box_gadget_distribute: assertion 'size >= 0' failed in GtkScrollbar

(SWT:1708): Gtk-WARNING **: 23:05:39.514: Negative content width -6 (allocation 1, extents 4x3) while allocating gadget (node toolbar, owner GtkToolbar)

(SWT:1708): Gtk-WARNING **: 23:05:39.945: Negative content width -6 (allocation 1, extents 4x3) while allocating gadget (node toolbar, owner GtkToolbar)

(SWT:1708): Gtk-WARNING **: 23:05:39.971: Negative content width -6 (allocation 1, extents 4x3) while allocating gadget (node toolbar, owner GtkToolbar)

(SWT:1708): Gtk-WARNING **: 23:05:40.565: Negative content width -6 (allocation 1, extents 4x3) while allocating gadget (node toolbar, owner GtkToolbar)

(SWT:1708): Gtk-CRITICAL **: 23:05:41.070: gtk_box_gadget_distribute: assertion 'size >= 0' failed in GtkScrollbar

(SWT:1708): Gtk-CRITICAL **: 23:05:41.079: gtk_box_gadget_distribute: assertion 'size >= 0' failed in GtkScrollbar

(SWT:1708): Gtk-WARNING **: 23:05:41.084: Negative content width -6 (allocation 1, extents 4x3) while allocating gadget (node toolbar, owner GtkToolbar)

(SWT:1708): Gtk-CRITICAL **: 23:05:41.093: gtk_box_gadget_distribute: assertion 'size >= 0' failed in GtkScrollbar

(SWT:1708): Gtk-CRITICAL **: 23:05:41.098: gtk_box_gadget_distribute: assertion 'size >= 0' failed in GtkScrollbar

(SWT:1708): Gtk-CRITICAL **: 23:05:41.100: gtk_box_gadget_distribute: assertion 'size >= 0' failed in GtkScrollbar

(SWT:1708): Gtk-CRITICAL **: 23:05:41.100: gtk_box_gadget_distribute: assertion 'size >= 0' failed in GtkScrollbar

(SWT:1708): Gtk-CRITICAL **: 23:05:41.105: gtk_box_gadget_distribute: assertion 'size >= 0' failed in GtkScrollbar

(SWT:1708): Gtk-CRITICAL **: 23:05:41.105: gtk_box_gadget_distribute: assertion 'size >= 0' failed in GtkScrollbar

(SWT:1708): Gtk-CRITICAL **: 23:05:41.117: gtk_box_gadget_distribute: assertion 'size >= 0' failed in GtkScrollbar

(SWT:1708): Gtk-CRITICAL **: 23:05:41.119: gtk_box_gadget_distribute: assertion 'size >= 0' failed in GtkScrollbar

(SWT:1708): Gtk-CRITICAL **: 23:05:41.120: gtk_box_gadget_distribute: assertion 'size >= 0' failed in GtkScrollbar

(SWT:1708): Gtk-CRITICAL **: 23:05:41.136: gtk_box_gadget_distribute: assertion 'size >= 0' failed in GtkScrollbar

(SWT:1708): Gtk-CRITICAL **: 23:05:41.136: gtk_box_gadget_distribute: assertion 'size >= 0' failed in GtkScrollbar

(SWT:1708): Gtk-CRITICAL **: 23:05:41.152: gtk_box_gadget_distribute: assertion 'size >= 0' failed in GtkScrollbar

(SWT:1708): Gtk-CRITICAL **: 23:05:41.152: gtk_box_gadget_distribute: assertion 'size >= 0' failed in GtkScrollbar

(SWT:1708): Gtk-CRITICAL **: 23:05:41.169: gtk_box_gadget_distribute: assertion 'size >= 0' failed in GtkScrollbar

(SWT:1708): Gtk-CRITICAL **: 23:05:41.169: gtk_box_gadget_distribute: assertion 'size >= 0' failed in GtkScrollbar

(SWT:1708): Gtk-CRITICAL **: 23:05:41.185: gtk_box_gadget_distribute: assertion 'size >= 0' failed in GtkScrollbar

(SWT:1708): Gtk-CRITICAL **: 23:05:41.186: gtk_box_gadget_distribute: assertion 'size >= 0' failed in GtkScrollbar

(SWT:1708): Gtk-CRITICAL **: 23:05:41.203: gtk_box_gadget_distribute: assertion 'size >= 0' failed in GtkScrollbar

(SWT:1708): Gtk-CRITICAL **: 23:05:41.203: gtk_box_gadget_distribute: assertion 'size >= 0' failed in GtkScrollbar

(SWT:1708): Gtk-CRITICAL **: 23:05:41.219: gtk_box_gadget_distribute: assertion 'size >= 0' failed in GtkScrollbar

(SWT:1708): Gtk-CRITICAL **: 23:05:41.219: gtk_box_gadget_distribute: assertion 'size >= 0' failed in GtkScrollbar

(SWT:1708): Gtk-CRITICAL **: 23:05:41.227: gtk_box_gadget_distribute: assertion 'size >= 0' failed in GtkScrollbar

(SWT:1708): Gtk-CRITICAL **: 23:05:41.228: gtk_box_gadget_distribute: assertion 'size >= 0' failed in GtkScrollbar

(SWT:1708): Gtk-CRITICAL **: 23:05:41.229: gtk_box_gadget_distribute: assertion 'size >= 0' failed in GtkScrollbar

(SWT:1708): Gtk-CRITICAL **: 23:05:41.230: gtk_box_gadget_distribute: assertion 'size >= 0' failed in GtkScrollbar

(SWT:1708): Gtk-CRITICAL **: 23:05:41.230: gtk_box_gadget_distribute: assertion 'size >= 0' failed in GtkScrollbar

(SWT:1708): Gtk-CRITICAL **: 23:05:41.231: gtk_box_gadget_distribute: assertion 'size >= 0' failed in GtkScrollbar

(SWT:1708): Gtk-CRITICAL **: 23:05:41.236: gtk_box_gadget_distribute: assertion 'size >= 0' failed in GtkScrollbar

(SWT:1708): Gtk-CRITICAL **: 23:05:41.236: gtk_box_gadget_distribute: assertion 'size >= 0' failed in GtkScrollbar

(SWT:1708): Gtk-CRITICAL **: 23:05:41.252: gtk_box_gadget_distribute: assertion 'size >= 0' failed in GtkScrollbar

(SWT:1708): Gtk-CRITICAL **: 23:05:41.252: gtk_box_gadget_distribute: assertion 'size >= 0' failed in GtkScrollbar

(SWT:1708): Gtk-CRITICAL **: 23:05:41.267: gtk_box_gadget_distribute: assertion 'size >= 0' failed in GtkScrollbar

(SWT:1708): Gtk-CRITICAL **: 23:05:41.272: gtk_box_gadget_distribute: assertion 'size >= 0' failed in GtkScrollbar

(SWT:1708): Gtk-CRITICAL **: 23:05:41.272: gtk_box_gadget_distribute: assertion 'size >= 0' failed in GtkScrollbar

(SWT:1708): Gtk-CRITICAL **: 23:05:41.285: gtk_box_gadget_distribute: assertion 'size >= 0' failed in GtkScrollbar

(SWT:1708): Gtk-CRITICAL **: 23:05:41.285: gtk_box_gadget_distribute: assertion 'size >= 0' failed in GtkScrollbar

(SWT:1708): Gtk-CRITICAL **: 23:05:41.303: gtk_box_gadget_distribute: assertion 'size >= 0' failed in GtkScrollbar

(SWT:1708): Gtk-WARNING **: 23:05:41.402: Negative content width -6 (allocation 1, extents 4x3) while allocating gadget (node toolbar, owner GtkToolbar)

(SWT:1708): Gtk-WARNING **: 23:05:41.811: Negative content width -6 (allocation 1, extents 4x3) while allocating gadget (node toolbar, owner GtkToolbar)

(SWT:1708): Gtk-WARNING **: 23:05:41.838: Negative content width -6 (allocation 1, extents 4x3) while allocating gadget (node toolbar, owner GtkToolbar)

(SWT:1708): Gtk-WARNING **: 23:05:42.445: Negative content width -6 (allocation 1, extents 4x3) while allocating gadget (node toolbar, owner GtkToolbar)

(SWT:1708): Gtk-CRITICAL **: 23:05:42.764: gtk_box_gadget_distribute: assertion 'size >= 0' failed in GtkScrollbar

(SWT:1708): Gtk-CRITICAL **: 23:05:42.773: gtk_box_gadget_distribute: assertion 'size >= 0' failed in GtkScrollbar

(SWT:1708): Gtk-WARNING **: 23:05:42.778: Negative content width -6 (allocation 1, extents 4x3) while allocating gadget (node toolbar, owner GtkToolbar)

(SWT:1708): Gtk-CRITICAL **: 23:05:42.786: gtk_box_gadget_distribute: assertion 'size >= 0' failed in GtkScrollbar

(SWT:1708): Gtk-CRITICAL **: 23:05:42.792: gtk_box_gadget_distribute: assertion 'size >= 0' failed in GtkScrollbar

(SWT:1708): Gtk-CRITICAL **: 23:05:42.793: gtk_box_gadget_distribute: assertion 'size >= 0' failed in GtkScrollbar

(SWT:1708): Gtk-CRITICAL **: 23:05:42.794: gtk_box_gadget_distribute: assertion 'size >= 0' failed in GtkScrollbar

(SWT:1708): Gtk-CRITICAL **: 23:05:42.802: gtk_box_gadget_distribute: assertion 'size >= 0' failed in GtkScrollbar

(SWT:1708): Gtk-CRITICAL **: 23:05:42.802: gtk_box_gadget_distribute: assertion 'size >= 0' failed in GtkScrollbar

(SWT:1708): Gtk-CRITICAL **: 23:05:42.816: gtk_box_gadget_distribute: assertion 'size >= 0' failed in GtkScrollbar

(SWT:1708): Gtk-CRITICAL **: 23:05:42.831: gtk_box_gadget_distribute: assertion 'size >= 0' failed in GtkScrollbar

(SWT:1708): Gtk-CRITICAL **: 23:05:42.831: gtk_box_gadget_distribute: assertion 'size >= 0' failed in GtkScrollbar

(SWT:1708): Gtk-CRITICAL **: 23:05:42.847: gtk_box_gadget_distribute: assertion 'size >= 0' failed in GtkScrollbar

(SWT:1708): Gtk-CRITICAL **: 23:05:42.847: gtk_box_gadget_distribute: assertion 'size >= 0' failed in GtkScrollbar

(SWT:1708): Gtk-CRITICAL **: 23:05:42.863: gtk_box_gadget_distribute: assertion 'size >= 0' failed in GtkScrollbar

(SWT:1708): Gtk-CRITICAL **: 23:05:42.863: gtk_box_gadget_distribute: assertion 'size >= 0' failed in GtkScrollbar

(SWT:1708): Gtk-CRITICAL **: 23:05:42.880: gtk_box_gadget_distribute: assertion 'size >= 0' failed in GtkScrollbar

(SWT:1708): Gtk-CRITICAL **: 23:05:42.880: gtk_box_gadget_distribute: assertion 'size >= 0' failed in GtkScrollbar

(SWT:1708): Gtk-CRITICAL **: 23:05:42.896: gtk_box_gadget_distribute: assertion 'size >= 0' failed in GtkScrollbar

(SWT:1708): Gtk-CRITICAL **: 23:05:42.896: gtk_box_gadget_distribute: assertion 'size >= 0' failed in GtkScrollbar

(SWT:1708): Gtk-CRITICAL **: 23:05:42.914: gtk_box_gadget_distribute: assertion 'size >= 0' failed in GtkScrollbar

(SWT:1708): Gtk-CRITICAL **: 23:05:42.914: gtk_box_gadget_distribute: assertion 'size >= 0' failed in GtkScrollbar

(SWT:1708): Gtk-CRITICAL **: 23:05:42.924: gtk_box_gadget_distribute: assertion 'size >= 0' failed in GtkScrollbar

(SWT:1708): Gtk-CRITICAL **: 23:05:42.924: gtk_box_gadget_distribute: assertion 'size >= 0' failed in GtkScrollbar

(SWT:1708): Gtk-CRITICAL **: 23:05:42.926: gtk_box_gadget_distribute: assertion 'size >= 0' failed in GtkScrollbar

(SWT:1708): Gtk-CRITICAL **: 23:05:42.927: gtk_box_gadget_distribute: assertion 'size >= 0' failed in GtkScrollbar

(SWT:1708): Gtk-CRITICAL **: 23:05:42.927: gtk_box_gadget_distribute: assertion 'size >= 0' failed in GtkScrollbar

(SWT:1708): Gtk-CRITICAL **: 23:05:42.928: gtk_box_gadget_distribute: assertion 'size >= 0' failed in GtkScrollbar

(SWT:1708): Gtk-CRITICAL **: 23:05:42.931: gtk_box_gadget_distribute: assertion 'size >= 0' failed in GtkScrollbar

(SWT:1708): Gtk-CRITICAL **: 23:05:42.931: gtk_box_gadget_distribute: assertion 'size >= 0' failed in GtkScrollbar

(SWT:1708): Gtk-CRITICAL **: 23:05:42.947: gtk_box_gadget_distribute: assertion 'size >= 0' failed in GtkScrollbar

(SWT:1708): Gtk-CRITICAL **: 23:05:42.948: gtk_box_gadget_distribute: assertion 'size >= 0' failed in GtkScrollbar

(SWT:1708): Gtk-CRITICAL **: 23:05:42.956: gtk_box_gadget_distribute: assertion 'size >= 0' failed in GtkScrollbar

(SWT:1708): Gtk-CRITICAL **: 23:05:42.957: gtk_box_gadget_distribute: assertion 'size >= 0' failed in GtkScrollbar

(SWT:1708): Gtk-CRITICAL **: 23:05:42.958: gtk_box_gadget_distribute: assertion 'size >= 0' failed in GtkScrollbar

(SWT:1708): Gtk-CRITICAL **: 23:05:42.968: gtk_box_gadget_distribute: assertion 'size >= 0' failed in GtkScrollbar

(SWT:1708): Gtk-CRITICAL **: 23:05:42.968: gtk_box_gadget_distribute: assertion 'size >= 0' failed in GtkScrollbar

(SWT:1708): Gtk-CRITICAL **: 23:05:42.982: gtk_box_gadget_distribute: assertion 'size >= 0' failed in GtkScrollbar

(SWT:1708): Gtk-CRITICAL **: 23:05:42.982: gtk_box_gadget_distribute: assertion 'size >= 0' failed in GtkScrollbar

(SWT:1708): Gtk-WARNING **: 23:05:43.019: Negative content width -6 (allocation 1, extents 4x3) while allocating gadget (node toolbar, owner GtkToolbar)

(SWT:1708): Gtk-WARNING **: 23:05:43.353: Negative content width -6 (allocation 1, extents 4x3) while allocating gadget (node toolbar, owner GtkToolbar)

(SWT:1708): Gtk-WARNING **: 23:05:43.379: Negative content width -6 (allocation 1, extents 4x3) while allocating gadget (node toolbar, owner GtkToolbar)

(SWT:1708): Gtk-WARNING **: 23:05:43.988: Negative content width -6 (allocation 1, extents 4x3) while allocating gadget (node toolbar, owner GtkToolbar)

(SWT:1708): Gtk-CRITICAL **: 23:05:44.459: gtk_box_gadget_distribute: assertion 'size >= 0' failed in GtkScrollbar

(SWT:1708): Gtk-CRITICAL **: 23:05:44.468: gtk_box_gadget_distribute: assertion 'size >= 0' failed in GtkScrollbar

(SWT:1708): Gtk-WARNING **: 23:05:44.473: Negative content width -6 (allocation 1, extents 4x3) while allocating gadget (node toolbar, owner GtkToolbar)

(SWT:1708): Gtk-CRITICAL **: 23:05:44.482: gtk_box_gadget_distribute: assertion 'size >= 0' failed in GtkScrollbar

(SWT:1708): Gtk-CRITICAL **: 23:05:44.487: gtk_box_gadget_distribute: assertion 'size >= 0' failed in GtkScrollbar

(SWT:1708): Gtk-CRITICAL **: 23:05:44.489: gtk_box_gadget_distribute: assertion 'size >= 0' failed in GtkScrollbar

(SWT:1708): Gtk-CRITICAL **: 23:05:44.490: gtk_box_gadget_distribute: assertion 'size >= 0' failed in GtkScrollbar

(SWT:1708): Gtk-CRITICAL **: 23:05:44.494: gtk_box_gadget_distribute: assertion 'size >= 0' failed in GtkScrollbar

(SWT:1708): Gtk-CRITICAL **: 23:05:44.495: gtk_box_gadget_distribute: assertion 'size >= 0' failed in GtkScrollbar

(SWT:1708): Gtk-CRITICAL **: 23:05:44.509: gtk_box_gadget_distribute: assertion 'size >= 0' failed in GtkScrollbar

(SWT:1708): Gtk-CRITICAL **: 23:05:44.522: gtk_box_gadget_distribute: assertion 'size >= 0' failed in GtkScrollbar

(SWT:1708): Gtk-CRITICAL **: 23:05:44.522: gtk_box_gadget_distribute: assertion 'size >= 0' failed in GtkScrollbar

(SWT:1708): Gtk-CRITICAL **: 23:05:44.538: gtk_box_gadget_distribute: assertion 'size >= 0' failed in GtkScrollbar

(SWT:1708): Gtk-CRITICAL **: 23:05:44.538: gtk_box_gadget_distribute: assertion 'size >= 0' failed in GtkScrollbar

(SWT:1708): Gtk-CRITICAL **: 23:05:44.554: gtk_box_gadget_distribute: assertion 'size >= 0' failed in GtkScrollbar

(SWT:1708): Gtk-CRITICAL **: 23:05:44.554: gtk_box_gadget_distribute: assertion 'size >= 0' failed in GtkScrollbar

(SWT:1708): Gtk-CRITICAL **: 23:05:44.571: gtk_box_gadget_distribute: assertion 'size >= 0' failed in GtkScrollbar

(SWT:1708): Gtk-CRITICAL **: 23:05:44.572: gtk_box_gadget_distribute: assertion 'size >= 0' failed in GtkScrollbar

(SWT:1708): Gtk-CRITICAL **: 23:05:44.588: gtk_box_gadget_distribute: assertion 'size >= 0' failed in GtkScrollbar

(SWT:1708): Gtk-CRITICAL **: 23:05:44.589: gtk_box_gadget_distribute: assertion 'size >= 0' failed in GtkScrollbar

(SWT:1708): Gtk-CRITICAL **: 23:05:44.605: gtk_box_gadget_distribute: assertion 'size >= 0' failed in GtkScrollbar

(SWT:1708): Gtk-CRITICAL **: 23:05:44.605: gtk_box_gadget_distribute: assertion 'size >= 0' failed in GtkScrollbar

(SWT:1708): Gtk-CRITICAL **: 23:05:44.615: gtk_box_gadget_distribute: assertion 'size >= 0' failed in GtkScrollbar

(SWT:1708): Gtk-CRITICAL **: 23:05:44.616: gtk_box_gadget_distribute: assertion 'size >= 0' failed in GtkScrollbar

(SWT:1708): Gtk-CRITICAL **: 23:05:44.617: gtk_box_gadget_distribute: assertion 'size >= 0' failed in GtkScrollbar

(SWT:1708): Gtk-CRITICAL **: 23:05:44.618: gtk_box_gadget_distribute: assertion 'size >= 0' failed in GtkScrollbar

(SWT:1708): Gtk-CRITICAL **: 23:05:44.618: gtk_box_gadget_distribute: assertion 'size >= 0' failed in GtkScrollbar

(SWT:1708): Gtk-CRITICAL **: 23:05:44.619: gtk_box_gadget_distribute: assertion 'size >= 0' failed in GtkScrollbar

(SWT:1708): Gtk-CRITICAL **: 23:05:44.622: gtk_box_gadget_distribute: assertion 'size >= 0' failed in GtkScrollbar

(SWT:1708): Gtk-CRITICAL **: 23:05:44.622: gtk_box_gadget_distribute: assertion 'size >= 0' failed in GtkScrollbar

(SWT:1708): Gtk-CRITICAL **: 23:05:44.629: gtk_box_gadget_distribute: assertion 'size >= 0' failed in GtkScrollbar

(SWT:1708): Gtk-CRITICAL **: 23:05:44.630: gtk_box_gadget_distribute: assertion 'size >= 0' failed in GtkScrollbar

(SWT:1708): Gtk-CRITICAL **: 23:05:44.630: gtk_box_gadget_distribute: assertion 'size >= 0' failed in GtkScrollbar

(SWT:1708): Gtk-CRITICAL **: 23:05:44.651: gtk_box_gadget_distribute: assertion 'size >= 0' failed in GtkScrollbar

(SWT:1708): Gtk-CRITICAL **: 23:05:44.651: gtk_box_gadget_distribute: assertion 'size >= 0' failed in GtkScrollbar

(SWT:1708): Gtk-CRITICAL **: 23:05:44.657: gtk_box_gadget_distribute: assertion 'size >= 0' failed in GtkScrollbar

(SWT:1708): Gtk-CRITICAL **: 23:05:44.657: gtk_box_gadget_distribute: assertion 'size >= 0' failed in GtkScrollbar

(SWT:1708): Gtk-CRITICAL **: 23:05:44.674: gtk_box_gadget_distribute: assertion 'size >= 0' failed in GtkScrollbar

(SWT:1708): Gtk-CRITICAL **: 23:05:44.674: gtk_box_gadget_distribute: assertion 'size >= 0' failed in GtkScrollbar

(SWT:1708): Gtk-CRITICAL **: 23:05:44.694: gtk_box_gadget_distribute: assertion 'size >= 0' failed in GtkScrollbar

(SWT:1708): Gtk-WARNING **: 23:05:44.722: Negative content width -6 (allocation 1, extents 4x3) while allocating gadget (node toolbar, owner GtkToolbar)

(SWT:1708): Gtk-WARNING **: 23:05:45.054: Negative content width -6 (allocation 1, extents 4x3) while allocating gadget (node toolbar, owner GtkToolbar)

(SWT:1708): Gtk-WARNING **: 23:05:45.081: Negative content width -6 (allocation 1, extents 4x3) while allocating gadget (node toolbar, owner GtkToolbar)

(SWT:1708): Gtk-WARNING **: 23:05:45.695: Negative content width -6 (allocation 1, extents 4x3) while allocating gadget (node toolbar, owner GtkToolbar)

(SWT:1708): Gtk-CRITICAL **: 23:05:46.394: gtk_box_gadget_distribute: assertion 'size >= 0' failed in GtkScrollbar

(SWT:1708): Gtk-CRITICAL **: 23:05:46.403: gtk_box_gadget_distribute: assertion 'size >= 0' failed in GtkScrollbar

(SWT:1708): Gtk-WARNING **: 23:05:46.408: Negative content width -6 (allocation 1, extents 4x3) while allocating gadget (node toolbar, owner GtkToolbar)

(SWT:1708): Gtk-CRITICAL **: 23:05:46.417: gtk_box_gadget_distribute: assertion 'size >= 0' failed in GtkScrollbar

(SWT:1708): Gtk-CRITICAL **: 23:05:46.424: gtk_box_gadget_distribute: assertion 'size >= 0' failed in GtkScrollbar

(SWT:1708): Gtk-CRITICAL **: 23:05:46.426: gtk_box_gadget_distribute: assertion 'size >= 0' failed in GtkScrollbar

(SWT:1708): Gtk-CRITICAL **: 23:05:46.426: gtk_box_gadget_distribute: assertion 'size >= 0' failed in GtkScrollbar

(SWT:1708): Gtk-CRITICAL **: 23:05:46.431: gtk_box_gadget_distribute: assertion 'size >= 0' failed in GtkScrollbar

(SWT:1708): Gtk-CRITICAL **: 23:05:46.431: gtk_box_gadget_distribute: assertion 'size >= 0' failed in GtkScrollbar

(SWT:1708): Gtk-CRITICAL **: 23:05:46.443: gtk_box_gadget_distribute: assertion 'size >= 0' failed in GtkScrollbar

(SWT:1708): Gtk-CRITICAL **: 23:05:46.454: gtk_box_gadget_distribute: assertion 'size >= 0' failed in GtkScrollbar

(SWT:1708): Gtk-CRITICAL **: 23:05:46.454: gtk_box_gadget_distribute: assertion 'size >= 0' failed in GtkScrollbar

(SWT:1708): Gtk-CRITICAL **: 23:05:46.471: gtk_box_gadget_distribute: assertion 'size >= 0' failed in GtkScrollbar

(SWT:1708): Gtk-CRITICAL **: 23:05:46.471: gtk_box_gadget_distribute: assertion 'size >= 0' failed in GtkScrollbar

(SWT:1708): Gtk-CRITICAL **: 23:05:46.488: gtk_box_gadget_distribute: assertion 'size >= 0' failed in GtkScrollbar

(SWT:1708): Gtk-CRITICAL **: 23:05:46.488: gtk_box_gadget_distribute: assertion 'size >= 0' failed in GtkScrollbar

(SWT:1708): Gtk-CRITICAL **: 23:05:46.505: gtk_box_gadget_distribute: assertion 'size >= 0' failed in GtkScrollbar

(SWT:1708): Gtk-CRITICAL **: 23:05:46.505: gtk_box_gadget_distribute: assertion 'size >= 0' failed in GtkScrollbar

(SWT:1708): Gtk-CRITICAL **: 23:05:46.521: gtk_box_gadget_distribute: assertion 'size >= 0' failed in GtkScrollbar

(SWT:1708): Gtk-CRITICAL **: 23:05:46.521: gtk_box_gadget_distribute: assertion 'size >= 0' failed in GtkScrollbar

(SWT:1708): Gtk-CRITICAL **: 23:05:46.537: gtk_box_gadget_distribute: assertion 'size >= 0' failed in GtkScrollbar

(SWT:1708): Gtk-CRITICAL **: 23:05:46.537: gtk_box_gadget_distribute: assertion 'size >= 0' failed in GtkScrollbar

(SWT:1708): Gtk-CRITICAL **: 23:05:46.564: gtk_box_gadget_distribute: assertion 'size >= 0' failed in GtkScrollbar

(SWT:1708): Gtk-CRITICAL **: 23:05:46.564: gtk_box_gadget_distribute: assertion 'size >= 0' failed in GtkScrollbar

(SWT:1708): Gtk-CRITICAL **: 23:05:46.572: gtk_box_gadget_distribute: assertion 'size >= 0' failed in GtkScrollbar

(SWT:1708): Gtk-CRITICAL **: 23:05:46.572: gtk_box_gadget_distribute: assertion 'size >= 0' failed in GtkScrollbar

(SWT:1708): Gtk-CRITICAL **: 23:05:46.587: gtk_box_gadget_distribute: assertion 'size >= 0' failed in GtkScrollbar

(SWT:1708): Gtk-CRITICAL **: 23:05:46.588: gtk_box_gadget_distribute: assertion 'size >= 0' failed in GtkScrollbar

(SWT:1708): Gtk-CRITICAL **: 23:05:46.604: gtk_box_gadget_distribute: assertion 'size >= 0' failed in GtkScrollbar

(SWT:1708): Gtk-CRITICAL **: 23:05:46.604: gtk_box_gadget_distribute: assertion 'size >= 0' failed in GtkScrollbar

(SWT:1708): Gtk-CRITICAL **: 23:05:46.622: gtk_box_gadget_distribute: assertion 'size >= 0' failed in GtkScrollbar

(SWT:1708): Gtk-CRITICAL **: 23:05:46.622: gtk_box_gadget_distribute: assertion 'size >= 0' failed in GtkScrollbar

(SWT:1708): Gtk-CRITICAL **: 23:05:46.624: gtk_box_gadget_distribute: assertion 'size >= 0' failed in GtkScrollbar

(SWT:1708): Gtk-CRITICAL **: 23:05:46.624: gtk_box_gadget_distribute: assertion 'size >= 0' failed in GtkScrollbar

(SWT:1708): Gtk-CRITICAL **: 23:05:46.628: gtk_box_gadget_distribute: assertion 'size >= 0' failed in GtkScrollbar

(SWT:1708): Gtk-CRITICAL **: 23:05:46.628: gtk_box_gadget_distribute: assertion 'size >= 0' failed in GtkScrollbar

(SWT:1708): Gtk-CRITICAL **: 23:05:46.628: gtk_box_gadget_distribute: assertion 'size >= 0' failed in GtkScrollbar

(SWT:1708): Gtk-CRITICAL **: 23:05:46.637: gtk_box_gadget_distribute: assertion 'size >= 0' failed in GtkScrollbar

(SWT:1708): Gtk-CRITICAL **: 23:05:46.660: gtk_box_gadget_distribute: assertion 'size >= 0' failed in GtkScrollbar

(SWT:1708): Gtk-CRITICAL **: 23:05:46.661: gtk_box_gadget_distribute: assertion 'size >= 0' failed in GtkScrollbar

(SWT:1708): Gtk-CRITICAL **: 23:05:46.662: gtk_box_gadget_distribute: assertion 'size >= 0' failed in GtkScrollbar

(SWT:1708): Gtk-CRITICAL **: 23:05:46.663: gtk_box_gadget_distribute: assertion 'size >= 0' failed in GtkScrollbar

(SWT:1708): Gtk-CRITICAL **: 23:05:46.664: gtk_box_gadget_distribute: assertion 'size >= 0' failed in GtkScrollbar

(SWT:1708): Gtk-CRITICAL **: 23:05:46.664: gtk_box_gadget_distribute: assertion 'size >= 0' failed in GtkScrollbar

(SWT:1708): Gtk-CRITICAL **: 23:05:46.666: gtk_box_gadget_distribute: assertion 'size >= 0' failed in GtkScrollbar

(SWT:1708): Gtk-CRITICAL **: 23:05:46.667: gtk_box_gadget_distribute: assertion 'size >= 0' failed in GtkScrollbar

(SWT:1708): Gtk-CRITICAL **: 23:05:46.667: gtk_box_gadget_distribute: assertion 'size >= 0' failed in GtkScrollbar

(SWT:1708): Gtk-CRITICAL **: 23:05:46.688: gtk_box_gadget_distribute: assertion 'size >= 0' failed in GtkScrollbar

(SWT:1708): Gtk-CRITICAL **: 23:05:46.688: gtk_box_gadget_distribute: assertion 'size >= 0' failed in GtkScrollbar

(SWT:1708): Gtk-CRITICAL **: 23:05:46.715: gtk_box_gadget_distribute: assertion 'size >= 0' failed in GtkScrollbar

(SWT:1708): Gtk-CRITICAL **: 23:05:46.721: gtk_box_gadget_distribute: assertion 'size >= 0' failed in GtkScrollbar

(SWT:1708): Gtk-CRITICAL **: 23:05:46.723: gtk_box_gadget_distribute: assertion 'size >= 0' failed in GtkScrollbar

(SWT:1708): Gtk-CRITICAL **: 23:05:46.723: gtk_box_gadget_distribute: assertion 'size >= 0' failed in GtkScrollbar

(SWT:1708): Gtk-CRITICAL **: 23:05:46.726: gtk_box_gadget_distribute: assertion 'size >= 0' failed in GtkScrollbar

(SWT:1708): Gtk-CRITICAL **: 23:05:46.735: gtk_box_gadget_distribute: assertion 'size >= 0' failed in GtkScrollbar

(SWT:1708): Gtk-CRITICAL **: 23:05:46.801: gtk_box_gadget_distribute: assertion 'size >= 0' failed in GtkScrollbar

(SWT:1708): Gtk-CRITICAL **: 23:05:46.802: gtk_box_gadget_distribute: assertion 'size >= 0' failed in GtkScrollbar

(SWT:1708): Gtk-CRITICAL **: 23:05:46.802: gtk_box_gadget_distribute: assertion 'size >= 0' failed in GtkScrollbar

(SWT:1708): Gtk-CRITICAL **: 23:05:46.820: gtk_box_gadget_distribute: assertion 'size >= 0' failed in GtkScrollbar

(SWT:1708): Gtk-CRITICAL **: 23:05:46.921: gtk_box_gadget_distribute: assertion 'size >= 0' failed in GtkScrollbar

(SWT:1708): Gtk-CRITICAL **: 23:05:46.922: gtk_box_gadget_distribute: assertion 'size >= 0' failed in GtkScrollbar

(SWT:1708): Gtk-CRITICAL **: 23:05:46.922: gtk_box_gadget_distribute: assertion 'size >= 0' failed in GtkScrollbar

(SWT:1708): Gtk-CRITICAL **: 23:05:46.939: gtk_box_gadget_distribute: assertion 'size >= 0' failed in GtkScrollbar

(SWT:1708): Gtk-CRITICAL **: 23:05:47.031: gtk_box_gadget_distribute: assertion 'size >= 0' failed in GtkScrollbar

(SWT:1708): Gtk-CRITICAL **: 23:05:47.037: gtk_box_gadget_distribute: assertion 'size >= 0' failed in GtkScrollbar

(SWT:1708): Gtk-CRITICAL **: 23:05:47.054: gtk_box_gadget_distribute: assertion 'size >= 0' failed in GtkScrollbar

(SWT:1708): Gtk-CRITICAL **: 23:05:47.070: gtk_box_gadget_distribute: assertion 'size >= 0' failed in GtkScrollbar

(SWT:1708): Gtk-CRITICAL **: 23:05:47.091: gtk_box_gadget_distribute: assertion 'size >= 0' failed in GtkScrollbar

(SWT:1708): Gtk-CRITICAL **: 23:05:47.092: gtk_box_gadget_distribute: assertion 'size >= 0' failed in GtkScrollbar

(SWT:1708): Gtk-CRITICAL **: 23:05:47.093: gtk_box_gadget_distribute: assertion 'size >= 0' failed in GtkScrollbar

(SWT:1708): Gtk-CRITICAL **: 23:05:47.094: gtk_box_gadget_distribute: assertion 'size >= 0' failed in GtkScrollbar

(SWT:1708): Gtk-CRITICAL **: 23:05:47.095: gtk_box_gadget_distribute: assertion 'size >= 0' failed in GtkScrollbar

(SWT:1708): Gtk-CRITICAL **: 23:05:47.095: gtk_box_gadget_distribute: assertion 'size >= 0' failed in GtkScrollbar

(SWT:1708): Gtk-CRITICAL **: 23:05:47.101: gtk_box_gadget_distribute: assertion 'size >= 0' failed in GtkScrollbar

(SWT:1708): Gtk-CRITICAL **: 23:05:47.109: gtk_box_gadget_distribute: assertion 'size >= 0' failed in GtkScrollbar

(SWT:1708): Gtk-CRITICAL **: 23:05:47.156: gtk_box_gadget_distribute: assertion 'size >= 0' failed in GtkScrollbar

(SWT:1708): Gtk-CRITICAL **: 23:05:47.156: gtk_box_gadget_distribute: assertion 'size >= 0' failed in GtkScrollbar

(SWT:1708): Gtk-CRITICAL **: 23:05:47.229: gtk_box_gadget_distribute: assertion 'size >= 0' failed in GtkScrollbar

(SWT:1708): Gtk-CRITICAL **: 23:05:47.234: gtk_box_gadget_distribute: assertion 'size >= 0' failed in GtkScrollbar

(SWT:1708): Gtk-CRITICAL **: 23:05:47.235: gtk_box_gadget_distribute: assertion 'size >= 0' failed in GtkScrollbar

(SWT:1708): Gtk-CRITICAL **: 23:05:47.236: gtk_box_gadget_distribute: assertion 'size >= 0' failed in GtkScrollbar

(SWT:1708): Gtk-CRITICAL **: 23:05:47.239: gtk_box_gadget_distribute: assertion 'size >= 0' failed in GtkScrollbar

(SWT:1708): Gtk-CRITICAL **: 23:05:47.248: gtk_box_gadget_distribute: assertion 'size >= 0' failed in GtkScrollbar

(SWT:1708): Gtk-WARNING **: 23:05:47.305: Negative content width -6 (allocation 1, extents 4x3) while allocating gadget (node toolbar, owner GtkToolbar)

(SWT:1708): Gtk-WARNING **: 23:05:47.633: Negative content width -6 (allocation 1, extents 4x3) while allocating gadget (node toolbar, owner GtkToolbar)

(SWT:1708): Gtk-WARNING **: 23:05:47.660: Negative content width -6 (allocation 1, extents 4x3) while allocating gadget (node toolbar, owner GtkToolbar)
Tests run: 10, Failures: 0, Errors: 0, Skipped: 0, Time elapsed: 20.444 s - in org.eclipse.egit.ui.test.stagview.StagingViewTest
testAmend(org.eclipse.egit.ui.test.stagview.StagingViewTest)  Time elapsed: 2.82 s
testCommitSingleFile(org.eclipse.egit.ui.test.stagview.StagingViewTest)  Time elapsed: 1.784 s
testMergeConflict(org.eclipse.egit.ui.test.stagview.StagingViewTest)  Time elapsed: 2.96 s
testCommitMessageConfigChangeAmending(org.eclipse.egit.ui.test.stagview.StagingViewTest)  Time elapsed: 1.792 s
testCommitMessageConfigChangeWithAuthor(org.eclipse.egit.ui.test.stagview.StagingViewTest)  Time elapsed: 1.723 s
testCommitMessageConfigChange(org.eclipse.egit.ui.test.stagview.StagingViewTest)  Time elapsed: 1.632 s
testCommitMessageConfigChangeBranchSwitchToNew(org.eclipse.egit.ui.test.stagview.StagingViewTest)  Time elapsed: 1.878 s
testCommitMessageCommitterChangeSignOff(org.eclipse.egit.ui.test.stagview.StagingViewTest)  Time elapsed: 1.529 s
testCommitMessageConfigChangeNoSignOff(org.eclipse.egit.ui.test.stagview.StagingViewTest)  Time elapsed: 1.718 s
testDeleteModifyConflict(org.eclipse.egit.ui.test.stagview.StagingViewTest)  Time elapsed: 2.562 s
Running org.eclipse.egit.ui.test.stagview.CommitMessageProvidersTest

(SWT:1708): Gtk-WARNING **: 23:05:48.327: Negative content width -6 (allocation 1, extents 4x3) while allocating gadget (node toolbar, owner GtkToolbar)

(SWT:1708): Gtk-CRITICAL **: 23:05:48.822: gtk_box_gadget_distribute: assertion 'size >= 0' failed in GtkScrollbar

(SWT:1708): Gtk-CRITICAL **: 23:05:48.831: gtk_box_gadget_distribute: assertion 'size >= 0' failed in GtkScrollbar

(SWT:1708): Gtk-WARNING **: 23:05:48.837: Negative content width -6 (allocation 1, extents 4x3) while allocating gadget (node toolbar, owner GtkToolbar)

(SWT:1708): Gtk-CRITICAL **: 23:05:48.846: gtk_box_gadget_distribute: assertion 'size >= 0' failed in GtkScrollbar

(SWT:1708): Gtk-CRITICAL **: 23:05:48.852: gtk_box_gadget_distribute: assertion 'size >= 0' failed in GtkScrollbar

(SWT:1708): Gtk-CRITICAL **: 23:05:48.854: gtk_box_gadget_distribute: assertion 'size >= 0' failed in GtkScrollbar

(SWT:1708): Gtk-CRITICAL **: 23:05:48.854: gtk_box_gadget_distribute: assertion 'size >= 0' failed in GtkScrollbar

(SWT:1708): Gtk-CRITICAL **: 23:05:48.855: gtk_box_gadget_distribute: assertion 'size >= 0' failed in GtkScrollbar

(SWT:1708): Gtk-CRITICAL **: 23:05:48.855: gtk_box_gadget_distribute: assertion 'size >= 0' failed in GtkScrollbar

(SWT:1708): Gtk-CRITICAL **: 23:05:48.861: gtk_box_gadget_distribute: assertion 'size >= 0' failed in GtkScrollbar

(SWT:1708): Gtk-CRITICAL **: 23:05:48.861: gtk_box_gadget_distribute: assertion 'size >= 0' failed in GtkScrollbar

(SWT:1708): Gtk-CRITICAL **: 23:05:48.873: gtk_box_gadget_distribute: assertion 'size >= 0' failed in GtkScrollbar

(SWT:1708): Gtk-CRITICAL **: 23:05:48.890: gtk_box_gadget_distribute: assertion 'size >= 0' failed in GtkScrollbar

(SWT:1708): Gtk-CRITICAL **: 23:05:48.890: gtk_box_gadget_distribute: assertion 'size >= 0' failed in GtkScrollbar

(SWT:1708): Gtk-CRITICAL **: 23:05:48.907: gtk_box_gadget_distribute: assertion 'size >= 0' failed in GtkScrollbar

(SWT:1708): Gtk-CRITICAL **: 23:05:48.907: gtk_box_gadget_distribute: assertion 'size >= 0' failed in GtkScrollbar

(SWT:1708): Gtk-CRITICAL **: 23:05:48.922: gtk_box_gadget_distribute: assertion 'size >= 0' failed in GtkScrollbar

(SWT:1708): Gtk-CRITICAL **: 23:05:48.922: gtk_box_gadget_distribute: assertion 'size >= 0' failed in GtkScrollbar

(SWT:1708): Gtk-CRITICAL **: 23:05:48.940: gtk_box_gadget_distribute: assertion 'size >= 0' failed in GtkScrollbar

(SWT:1708): Gtk-CRITICAL **: 23:05:48.940: gtk_box_gadget_distribute: assertion 'size >= 0' failed in GtkScrollbar

(SWT:1708): Gtk-CRITICAL **: 23:05:48.956: gtk_box_gadget_distribute: assertion 'size >= 0' failed in GtkScrollbar

(SWT:1708): Gtk-CRITICAL **: 23:05:48.957: gtk_box_gadget_distribute: assertion 'size >= 0' failed in GtkScrollbar

(SWT:1708): Gtk-CRITICAL **: 23:05:48.973: gtk_box_gadget_distribute: assertion 'size >= 0' failed in GtkScrollbar

(SWT:1708): Gtk-CRITICAL **: 23:05:48.973: gtk_box_gadget_distribute: assertion 'size >= 0' failed in GtkScrollbar

(SWT:1708): Gtk-CRITICAL **: 23:05:49.002: gtk_box_gadget_distribute: assertion 'size >= 0' failed in GtkScrollbar

(SWT:1708): Gtk-CRITICAL **: 23:05:49.003: gtk_box_gadget_distribute: assertion 'size >= 0' failed in GtkScrollbar

(SWT:1708): Gtk-CRITICAL **: 23:05:49.011: gtk_box_gadget_distribute: assertion 'size >= 0' failed in GtkScrollbar

(SWT:1708): Gtk-CRITICAL **: 23:05:49.011: gtk_box_gadget_distribute: assertion 'size >= 0' failed in GtkScrollbar

(SWT:1708): Gtk-CRITICAL **: 23:05:49.023: gtk_box_gadget_distribute: assertion 'size >= 0' failed in GtkScrollbar

(SWT:1708): Gtk-CRITICAL **: 23:05:49.023: gtk_box_gadget_distribute: assertion 'size >= 0' failed in GtkScrollbar

(SWT:1708): Gtk-CRITICAL **: 23:05:49.040: gtk_box_gadget_distribute: assertion 'size >= 0' failed in GtkScrollbar

(SWT:1708): Gtk-CRITICAL **: 23:05:49.040: gtk_box_gadget_distribute: assertion 'size >= 0' failed in GtkScrollbar

(SWT:1708): Gtk-CRITICAL **: 23:05:49.057: gtk_box_gadget_distribute: assertion 'size >= 0' failed in GtkScrollbar

(SWT:1708): Gtk-CRITICAL **: 23:05:49.057: gtk_box_gadget_distribute: assertion 'size >= 0' failed in GtkScrollbar

(SWT:1708): Gtk-CRITICAL **: 23:05:49.062: gtk_box_gadget_distribute: assertion 'size >= 0' failed in GtkScrollbar

(SWT:1708): Gtk-CRITICAL **: 23:05:49.062: gtk_box_gadget_distribute: assertion 'size >= 0' failed in GtkScrollbar

(SWT:1708): Gtk-CRITICAL **: 23:05:49.062: gtk_box_gadget_distribute: assertion 'size >= 0' failed in GtkScrollbar

(SWT:1708): Gtk-WARNING **: 23:05:49.148: Negative content width -6 (allocation 1, extents 4x3) while allocating gadget (node toolbar, owner GtkToolbar)

(SWT:1708): Gtk-WARNING **: 23:05:49.581: Negative content width -6 (allocation 1, extents 4x3) while allocating gadget (node toolbar, owner GtkToolbar)

(SWT:1708): Gtk-WARNING **: 23:05:49.606: Negative content width -6 (allocation 1, extents 4x3) while allocating gadget (node toolbar, owner GtkToolbar)

(SWT:1708): Gtk-WARNING **: 23:05:50.203: Negative content width -6 (allocation 1, extents 4x3) while allocating gadget (node toolbar, owner GtkToolbar)

(SWT:1708): Gtk-CRITICAL **: 23:05:50.686: gtk_box_gadget_distribute: assertion 'size >= 0' failed in GtkScrollbar

(SWT:1708): Gtk-CRITICAL **: 23:05:50.696: gtk_box_gadget_distribute: assertion 'size >= 0' failed in GtkScrollbar

(SWT:1708): Gtk-WARNING **: 23:05:50.701: Negative content width -6 (allocation 1, extents 4x3) while allocating gadget (node toolbar, owner GtkToolbar)

(SWT:1708): Gtk-CRITICAL **: 23:05:50.710: gtk_box_gadget_distribute: assertion 'size >= 0' failed in GtkScrollbar

(SWT:1708): Gtk-CRITICAL **: 23:05:50.715: gtk_box_gadget_distribute: assertion 'size >= 0' failed in GtkScrollbar

!ENTRY org.eclipse.egit.ui 2 0 2019-12-05 23:05:50.720
!MESSAGE Found multiple implementations of ICommitMessageProvider2. Ignoring caret positioning for org.eclipse.egit.ui.test.stagview.CommitMessageProvidersTest$TestCommitMessageProvider.

(SWT:1708): Gtk-CRITICAL **: 23:05:50.721: gtk_box_gadget_distribute: assertion 'size >= 0' failed in GtkScrollbar

(SWT:1708): Gtk-CRITICAL **: 23:05:50.721: gtk_box_gadget_distribute: assertion 'size >= 0' failed in GtkScrollbar

(SWT:1708): Gtk-CRITICAL **: 23:05:50.723: gtk_box_gadget_distribute: assertion 'size >= 0' failed in GtkScrollbar

(SWT:1708): Gtk-CRITICAL **: 23:05:50.723: gtk_box_gadget_distribute: assertion 'size >= 0' failed in GtkScrollbar

(SWT:1708): Gtk-CRITICAL **: 23:05:50.728: gtk_box_gadget_distribute: assertion 'size >= 0' failed in GtkScrollbar

(SWT:1708): Gtk-CRITICAL **: 23:05:50.729: gtk_box_gadget_distribute: assertion 'size >= 0' failed in GtkScrollbar

(SWT:1708): Gtk-CRITICAL **: 23:05:50.745: gtk_box_gadget_distribute: assertion 'size >= 0' failed in GtkScrollbar

(SWT:1708): Gtk-CRITICAL **: 23:05:50.746: gtk_box_gadget_distribute: assertion 'size >= 0' failed in GtkScrollbar

(SWT:1708): Gtk-CRITICAL **: 23:05:50.746: gtk_box_gadget_distribute: assertion 'size >= 0' failed in GtkScrollbar

(SWT:1708): Gtk-CRITICAL **: 23:05:50.762: gtk_box_gadget_distribute: assertion 'size >= 0' failed in GtkScrollbar

(SWT:1708): Gtk-CRITICAL **: 23:05:50.763: gtk_box_gadget_distribute: assertion 'size >= 0' failed in GtkScrollbar

(SWT:1708): Gtk-CRITICAL **: 23:05:50.780: gtk_box_gadget_distribute: assertion 'size >= 0' failed in GtkScrollbar

(SWT:1708): Gtk-CRITICAL **: 23:05:50.780: gtk_box_gadget_distribute: assertion 'size >= 0' failed in GtkScrollbar

(SWT:1708): Gtk-CRITICAL **: 23:05:50.796: gtk_box_gadget_distribute: assertion 'size >= 0' failed in GtkScrollbar

(SWT:1708): Gtk-CRITICAL **: 23:05:50.796: gtk_box_gadget_distribute: assertion 'size >= 0' failed in GtkScrollbar

(SWT:1708): Gtk-CRITICAL **: 23:05:50.813: gtk_box_gadget_distribute: assertion 'size >= 0' failed in GtkScrollbar

(SWT:1708): Gtk-CRITICAL **: 23:05:50.813: gtk_box_gadget_distribute: assertion 'size >= 0' failed in GtkScrollbar

(SWT:1708): Gtk-CRITICAL **: 23:05:50.830: gtk_box_gadget_distribute: assertion 'size >= 0' failed in GtkScrollbar

(SWT:1708): Gtk-CRITICAL **: 23:05:50.830: gtk_box_gadget_distribute: assertion 'size >= 0' failed in GtkScrollbar

(SWT:1708): Gtk-CRITICAL **: 23:05:50.846: gtk_box_gadget_distribute: assertion 'size >= 0' failed in GtkScrollbar

(SWT:1708): Gtk-CRITICAL **: 23:05:50.846: gtk_box_gadget_distribute: assertion 'size >= 0' failed in GtkScrollbar

(SWT:1708): Gtk-CRITICAL **: 23:05:50.871: gtk_box_gadget_distribute: assertion 'size >= 0' failed in GtkScrollbar

(SWT:1708): Gtk-CRITICAL **: 23:05:50.872: gtk_box_gadget_distribute: assertion 'size >= 0' failed in GtkScrollbar

(SWT:1708): Gtk-CRITICAL **: 23:05:50.879: gtk_box_gadget_distribute: assertion 'size >= 0' failed in GtkScrollbar

(SWT:1708): Gtk-CRITICAL **: 23:05:50.879: gtk_box_gadget_distribute: assertion 'size >= 0' failed in GtkScrollbar

(SWT:1708): Gtk-CRITICAL **: 23:05:50.897: gtk_box_gadget_distribute: assertion 'size >= 0' failed in GtkScrollbar

(SWT:1708): Gtk-CRITICAL **: 23:05:50.897: gtk_box_gadget_distribute: assertion 'size >= 0' failed in GtkScrollbar

(SWT:1708): Gtk-CRITICAL **: 23:05:50.920: gtk_box_gadget_distribute: assertion 'size >= 0' failed in GtkScrollbar

(SWT:1708): Gtk-CRITICAL **: 23:05:50.920: gtk_box_gadget_distribute: assertion 'size >= 0' failed in GtkScrollbar

(SWT:1708): Gtk-CRITICAL **: 23:05:50.936: gtk_box_gadget_distribute: assertion 'size >= 0' failed in GtkScrollbar

(SWT:1708): Gtk-CRITICAL **: 23:05:50.936: gtk_box_gadget_distribute: assertion 'size >= 0' failed in GtkScrollbar

(SWT:1708): Gtk-CRITICAL **: 23:05:50.947: gtk_box_gadget_distribute: assertion 'size >= 0' failed in GtkScrollbar

(SWT:1708): Gtk-WARNING **: 23:05:51.030: Negative content width -6 (allocation 1, extents 4x3) while allocating gadget (node toolbar, owner GtkToolbar)

(SWT:1708): Gtk-WARNING **: 23:05:51.472: Negative content width -6 (allocation 1, extents 4x3) while allocating gadget (node toolbar, owner GtkToolbar)

(SWT:1708): Gtk-WARNING **: 23:05:51.501: Negative content width -6 (allocation 1, extents 4x3) while allocating gadget (node toolbar, owner GtkToolbar)

(SWT:1708): Gtk-WARNING **: 23:05:52.182: Negative content width -6 (allocation 1, extents 4x3) while allocating gadget (node toolbar, owner GtkToolbar)

(SWT:1708): Gtk-CRITICAL **: 23:05:52.574: gtk_box_gadget_distribute: assertion 'size >= 0' failed in GtkScrollbar

(SWT:1708): Gtk-CRITICAL **: 23:05:52.584: gtk_box_gadget_distribute: assertion 'size >= 0' failed in GtkScrollbar

(SWT:1708): Gtk-WARNING **: 23:05:52.589: Negative content width -6 (allocation 1, extents 4x3) while allocating gadget (node toolbar, owner GtkToolbar)

(SWT:1708): Gtk-CRITICAL **: 23:05:52.598: gtk_box_gadget_distribute: assertion 'size >= 0' failed in GtkScrollbar

(SWT:1708): Gtk-CRITICAL **: 23:05:52.608: gtk_box_gadget_distribute: assertion 'size >= 0' failed in GtkScrollbar

(SWT:1708): Gtk-CRITICAL **: 23:05:52.610: gtk_box_gadget_distribute: assertion 'size >= 0' failed in GtkScrollbar

(SWT:1708): Gtk-CRITICAL **: 23:05:52.610: gtk_box_gadget_distribute: assertion 'size >= 0' failed in GtkScrollbar

(SWT:1708): Gtk-CRITICAL **: 23:05:52.611: gtk_box_gadget_distribute: assertion 'size >= 0' failed in GtkScrollbar

(SWT:1708): Gtk-CRITICAL **: 23:05:52.611: gtk_box_gadget_distribute: assertion 'size >= 0' failed in GtkScrollbar

(SWT:1708): Gtk-CRITICAL **: 23:05:52.617: gtk_box_gadget_distribute: assertion 'size >= 0' failed in GtkScrollbar

(SWT:1708): Gtk-CRITICAL **: 23:05:52.617: gtk_box_gadget_distribute: assertion 'size >= 0' failed in GtkScrollbar

(SWT:1708): Gtk-CRITICAL **: 23:05:52.636: gtk_box_gadget_distribute: assertion 'size >= 0' failed in GtkScrollbar

(SWT:1708): Gtk-CRITICAL **: 23:05:52.642: gtk_box_gadget_distribute: assertion 'size >= 0' failed in GtkScrollbar

(SWT:1708): Gtk-CRITICAL **: 23:05:52.642: gtk_box_gadget_distribute: assertion 'size >= 0' failed in GtkScrollbar

(SWT:1708): Gtk-CRITICAL **: 23:05:52.658: gtk_box_gadget_distribute: assertion 'size >= 0' failed in GtkScrollbar

(SWT:1708): Gtk-CRITICAL **: 23:05:52.658: gtk_box_gadget_distribute: assertion 'size >= 0' failed in GtkScrollbar

(SWT:1708): Gtk-CRITICAL **: 23:05:52.675: gtk_box_gadget_distribute: assertion 'size >= 0' failed in GtkScrollbar

(SWT:1708): Gtk-CRITICAL **: 23:05:52.675: gtk_box_gadget_distribute: assertion 'size >= 0' failed in GtkScrollbar

(SWT:1708): Gtk-CRITICAL **: 23:05:52.692: gtk_box_gadget_distribute: assertion 'size >= 0' failed in GtkScrollbar

(SWT:1708): Gtk-CRITICAL **: 23:05:52.692: gtk_box_gadget_distribute: assertion 'size >= 0' failed in GtkScrollbar

(SWT:1708): Gtk-CRITICAL **: 23:05:52.710: gtk_box_gadget_distribute: assertion 'size >= 0' failed in GtkScrollbar

(SWT:1708): Gtk-CRITICAL **: 23:05:52.711: gtk_box_gadget_distribute: assertion 'size >= 0' failed in GtkScrollbar

(SWT:1708): Gtk-CRITICAL **: 23:05:52.726: gtk_box_gadget_distribute: assertion 'size >= 0' failed in GtkScrollbar

(SWT:1708): Gtk-CRITICAL **: 23:05:52.726: gtk_box_gadget_distribute: assertion 'size >= 0' failed in GtkScrollbar

(SWT:1708): Gtk-CRITICAL **: 23:05:52.753: gtk_box_gadget_distribute: assertion 'size >= 0' failed in GtkScrollbar

(SWT:1708): Gtk-CRITICAL **: 23:05:52.753: gtk_box_gadget_distribute: assertion 'size >= 0' failed in GtkScrollbar

(SWT:1708): Gtk-CRITICAL **: 23:05:52.779: gtk_box_gadget_distribute: assertion 'size >= 0' failed in GtkScrollbar

(SWT:1708): Gtk-CRITICAL **: 23:05:52.779: gtk_box_gadget_distribute: assertion 'size >= 0' failed in GtkScrollbar

(SWT:1708): Gtk-CRITICAL **: 23:05:52.792: gtk_box_gadget_distribute: assertion 'size >= 0' failed in GtkScrollbar

(SWT:1708): Gtk-CRITICAL **: 23:05:52.793: gtk_box_gadget_distribute: assertion 'size >= 0' failed in GtkScrollbar

(SWT:1708): Gtk-CRITICAL **: 23:05:52.810: gtk_box_gadget_distribute: assertion 'size >= 0' failed in GtkScrollbar

(SWT:1708): Gtk-CRITICAL **: 23:05:52.810: gtk_box_gadget_distribute: assertion 'size >= 0' failed in GtkScrollbar

(SWT:1708): Gtk-CRITICAL **: 23:05:52.826: gtk_box_gadget_distribute: assertion 'size >= 0' failed in GtkScrollbar

(SWT:1708): Gtk-CRITICAL **: 23:05:52.842: gtk_box_gadget_distribute: assertion 'size >= 0' failed in GtkScrollbar

(SWT:1708): Gtk-CRITICAL **: 23:05:52.842: gtk_box_gadget_distribute: assertion 'size >= 0' failed in GtkScrollbar

(SWT:1708): Gtk-CRITICAL **: 23:05:52.846: gtk_box_gadget_distribute: assertion 'size >= 0' failed in GtkScrollbar

(SWT:1708): Gtk-WARNING **: 23:05:52.941: Negative content width -6 (allocation 1, extents 4x3) while allocating gadget (node toolbar, owner GtkToolbar)

(SWT:1708): Gtk-WARNING **: 23:05:53.381: Negative content width -6 (allocation 1, extents 4x3) while allocating gadget (node toolbar, owner GtkToolbar)

(SWT:1708): Gtk-WARNING **: 23:05:53.410: Negative content width -6 (allocation 1, extents 4x3) while allocating gadget (node toolbar, owner GtkToolbar)
Tests run: 3, Failures: 0, Errors: 0, Skipped: 0, Time elapsed: 5.72 s - in org.eclipse.egit.ui.test.stagview.CommitMessageProvidersTest
testCaretPosition(org.eclipse.egit.ui.test.stagview.CommitMessageProvidersTest)  Time elapsed: 1.9 s
testTwoProvidersFromSameExtension(org.eclipse.egit.ui.test.stagview.CommitMessageProvidersTest)  Time elapsed: 1.896 s
testCaretPositionUndefined(org.eclipse.egit.ui.test.stagview.CommitMessageProvidersTest)  Time elapsed: 1.91 s
Running org.eclipse.egit.ui.variables.DynamicVariablesTest
Tests run: 4, Failures: 0, Errors: 0, Skipped: 0, Time elapsed: 4.292 s - in org.eclipse.egit.ui.variables.DynamicVariablesTest
testGitBranch(org.eclipse.egit.ui.variables.DynamicVariablesTest)  Time elapsed: 1.094 s
testGitPath(org.eclipse.egit.ui.variables.DynamicVariablesTest)  Time elapsed: 1.064 s
testGitWorkTree(org.eclipse.egit.ui.variables.DynamicVariablesTest)  Time elapsed: 1.053 s
testGitDir(org.eclipse.egit.ui.variables.DynamicVariablesTest)  Time elapsed: 1.079 s
Running org.eclipse.egit.ui.gitflow.FeatureFinishSquashHandlerTest

(SWT:1708): Gtk-CRITICAL **: 23:05:58.566: gtk_box_gadget_distribute: assertion 'size >= 0' failed in GtkScrollbar

(SWT:1708): Gtk-CRITICAL **: 23:05:58.584: gtk_box_gadget_distribute: assertion 'size >= 0' failed in GtkScrollbar

(SWT:1708): Gtk-CRITICAL **: 23:05:58.601: gtk_box_gadget_distribute: assertion 'size >= 0' failed in GtkScrollbar

(SWT:1708): Gtk-CRITICAL **: 23:05:58.617: gtk_box_gadget_distribute: assertion 'size >= 0' failed in GtkScrollbar

(SWT:1708): Gtk-CRITICAL **: 23:05:58.639: gtk_box_gadget_distribute: assertion 'size >= 0' failed in GtkScrollbar

(SWT:1708): Gtk-CRITICAL **: 23:05:58.650: gtk_box_gadget_distribute: assertion 'size >= 0' failed in GtkScrollbar

(SWT:1708): Gtk-CRITICAL **: 23:05:58.667: gtk_box_gadget_distribute: assertion 'size >= 0' failed in GtkScrollbar

(SWT:1708): Gtk-CRITICAL **: 23:05:58.684: gtk_box_gadget_distribute: assertion 'size >= 0' failed in GtkScrollbar

(SWT:1708): Gtk-CRITICAL **: 23:05:58.700: gtk_box_gadget_distribute: assertion 'size >= 0' failed in GtkScrollbar

(SWT:1708): Gtk-CRITICAL **: 23:05:58.717: gtk_box_gadget_distribute: assertion 'size >= 0' failed in GtkScrollbar

(SWT:1708): Gtk-CRITICAL **: 23:05:58.734: gtk_box_gadget_distribute: assertion 'size >= 0' failed in GtkScrollbar

(SWT:1708): Gtk-CRITICAL **: 23:05:58.750: gtk_box_gadget_distribute: assertion 'size >= 0' failed in GtkScrollbar

(SWT:1708): Gtk-CRITICAL **: 23:05:58.767: gtk_box_gadget_distribute: assertion 'size >= 0' failed in GtkScrollbar

(SWT:1708): Gtk-CRITICAL **: 23:05:59.337: gtk_box_gadget_distribute: assertion 'size >= 0' failed in GtkScrollbar
Tests run: 1, Failures: 0, Errors: 0, Skipped: 0, Time elapsed: 2.408 s - in org.eclipse.egit.ui.gitflow.FeatureFinishSquashHandlerTest
testFeatureFinishSquash(org.eclipse.egit.ui.gitflow.FeatureFinishSquashHandlerTest)  Time elapsed: 2.399 s
Running org.eclipse.egit.ui.gitflow.FeatureStartFinishHandlerTest

(SWT:1708): Gtk-CRITICAL **: 23:06:00.925: gtk_box_gadget_distribute: assertion 'size >= 0' failed in GtkScrollbar

(SWT:1708): Gtk-CRITICAL **: 23:06:00.945: gtk_box_gadget_distribute: assertion 'size >= 0' failed in GtkScrollbar

(SWT:1708): Gtk-CRITICAL **: 23:06:00.961: gtk_box_gadget_distribute: assertion 'size >= 0' failed in GtkScrollbar

(SWT:1708): Gtk-CRITICAL **: 23:06:00.977: gtk_box_gadget_distribute: assertion 'size >= 0' failed in GtkScrollbar

(SWT:1708): Gtk-CRITICAL **: 23:06:00.994: gtk_box_gadget_distribute: assertion 'size >= 0' failed in GtkScrollbar

(SWT:1708): Gtk-CRITICAL **: 23:06:01.011: gtk_box_gadget_distribute: assertion 'size >= 0' failed in GtkScrollbar

(SWT:1708): Gtk-CRITICAL **: 23:06:01.028: gtk_box_gadget_distribute: assertion 'size >= 0' failed in GtkScrollbar

(SWT:1708): Gtk-CRITICAL **: 23:06:01.044: gtk_box_gadget_distribute: assertion 'size >= 0' failed in GtkScrollbar

(SWT:1708): Gtk-CRITICAL **: 23:06:01.060: gtk_box_gadget_distribute: assertion 'size >= 0' failed in GtkScrollbar

(SWT:1708): Gtk-CRITICAL **: 23:06:01.077: gtk_box_gadget_distribute: assertion 'size >= 0' failed in GtkScrollbar

(SWT:1708): Gtk-CRITICAL **: 23:06:01.094: gtk_box_gadget_distribute: assertion 'size >= 0' failed in GtkScrollbar

(SWT:1708): Gtk-CRITICAL **: 23:06:01.110: gtk_box_gadget_distribute: assertion 'size >= 0' failed in GtkScrollbar

(SWT:1708): Gtk-CRITICAL **: 23:06:01.127: gtk_box_gadget_distribute: assertion 'size >= 0' failed in GtkScrollbar

(SWT:1708): Gtk-CRITICAL **: 23:06:01.144: gtk_box_gadget_distribute: assertion 'size >= 0' failed in GtkScrollbar

(SWT:1708): Gtk-CRITICAL **: 23:06:01.160: gtk_box_gadget_distribute: assertion 'size >= 0' failed in GtkScrollbar

(SWT:1708): Gtk-CRITICAL **: 23:06:01.177: gtk_box_gadget_distribute: assertion 'size >= 0' failed in GtkScrollbar

(SWT:1708): Gtk-CRITICAL **: 23:06:01.691: gtk_box_gadget_distribute: assertion 'size >= 0' failed in GtkScrollbar
Tests run: 1, Failures: 0, Errors: 0, Skipped: 0, Time elapsed: 2.08 s - in org.eclipse.egit.ui.gitflow.FeatureStartFinishHandlerTest
testFeatureStart(org.eclipse.egit.ui.gitflow.FeatureStartFinishHandlerTest)  Time elapsed: 2.074 s
Running org.eclipse.egit.ui.gitflow.InitHandlerTest
Tests run: 3, Failures: 0, Errors: 0, Skipped: 0, Time elapsed: 3.189 s - in org.eclipse.egit.ui.gitflow.InitHandlerTest
testInit(org.eclipse.egit.ui.gitflow.InitHandlerTest)  Time elapsed: 0.81 s
testInitEmptyRepoMissingMaster(org.eclipse.egit.ui.gitflow.InitHandlerTest)  Time elapsed: 1.586 s
testInitMissingMaster(org.eclipse.egit.ui.gitflow.InitHandlerTest)  Time elapsed: 0.78 s
Running org.eclipse.egit.ui.gitflow.FeatureRebaseHandlerTest

(SWT:1708): Gtk-WARNING **: 23:06:06.825: Negative content width -6 (allocation 1, extents 4x3) while allocating gadget (node toolbar, owner GtkToolbar)

(SWT:1708): Gtk-WARNING **: 23:06:06.832: Negative content width -6 (allocation 1, extents 4x3) while allocating gadget (node toolbar, owner GtkToolbar)

(SWT:1708): Gtk-WARNING **: 23:06:06.838: Negative content width -6 (allocation 1, extents 4x3) while allocating gadget (node toolbar, owner GtkToolbar)

(SWT:1708): Gtk-WARNING **: 23:06:06.840: Negative content width -6 (allocation 1, extents 4x3) while allocating gadget (node toolbar, owner GtkToolbar)

(SWT:1708): Gtk-WARNING **: 23:06:06.841: Negative content width -6 (allocation 1, extents 4x3) while allocating gadget (node toolbar, owner GtkToolbar)

(SWT:1708): Gtk-WARNING **: 23:06:06.887: Negative content width -6 (allocation 1, extents 4x3) while allocating gadget (node toolbar, owner GtkToolbar)

(SWT:1708): Gtk-WARNING **: 23:06:07.291: Negative content height -1 (allocation 1, extents 1x1) while allocating gadget (node scrolledwindow, owner GtkScrolledWindow)

(SWT:1708): Gtk-CRITICAL **: 23:06:07.291: gtk_box_gadget_distribute: assertion 'size >= 0' failed in GtkScrollbar

(SWT:1708): Gtk-WARNING **: 23:06:07.363: Negative content width -6 (allocation 1, extents 4x3) while allocating gadget (node toolbar, owner GtkToolbar)

(SWT:1708): Gtk-WARNING **: 23:06:08.709: Negative content height -1 (allocation 1, extents 1x1) while allocating gadget (node scrolledwindow, owner GtkScrolledWindow)

(SWT:1708): Gtk-CRITICAL **: 23:06:08.709: gtk_box_gadget_distribute: assertion 'size >= 0' failed in GtkScrollbar
Tests run: 2, Failures: 0, Errors: 0, Skipped: 0, Time elapsed: 3.332 s - in org.eclipse.egit.ui.gitflow.FeatureRebaseHandlerTest
testRebaseFailOnConflict(org.eclipse.egit.ui.gitflow.FeatureRebaseHandlerTest)  Time elapsed: 1.936 s
testRebaseFailOnDirtyWorkingDirectory(org.eclipse.egit.ui.gitflow.FeatureRebaseHandlerTest)  Time elapsed: 1.381 s
Running org.eclipse.egit.ui.gitflow.FeatureStartCheckoutConflictTest

(SWT:1708): Gtk-CRITICAL **: 23:06:09.523: gtk_box_gadget_distribute: assertion 'size >= 0' failed in GtkScrollbar

(SWT:1708): Gtk-CRITICAL **: 23:06:09.538: gtk_box_gadget_distribute: assertion 'size >= 0' failed in GtkScrollbar

(SWT:1708): Gtk-CRITICAL **: 23:06:09.543: gtk_box_gadget_distribute: assertion 'size >= 0' failed in GtkScrollbar
Tests run: 1, Failures: 0, Errors: 0, Skipped: 0, Time elapsed: 0.828 s - in org.eclipse.egit.ui.gitflow.FeatureStartCheckoutConflictTest
testFeatureStart(org.eclipse.egit.ui.gitflow.FeatureStartCheckoutConflictTest)  Time elapsed: 0.822 s
Running org.eclipse.egit.ui.gitflow.CommandEnablementTest

(SWT:1708): Gtk-WARNING **: 23:06:10.920: Negative content width -6 (allocation 1, extents 4x3) while allocating gadget (node toolbar, owner GtkToolbar)

(SWT:1708): Gtk-WARNING **: 23:06:11.144: Negative content width -6 (allocation 1, extents 4x3) while allocating gadget (node toolbar, owner GtkToolbar)
Tests run: 2, Failures: 0, Errors: 0, Skipped: 0, Time elapsed: 1.636 s - in org.eclipse.egit.ui.gitflow.CommandEnablementTest
testPackageExplorerStartFinishEnablement(org.eclipse.egit.ui.gitflow.CommandEnablementTest)  Time elapsed: 0.732 s
testRepositoryViewStartFinishEnablement(org.eclipse.egit.ui.gitflow.CommandEnablementTest)  Time elapsed: 0.895 s
Running org.eclipse.egit.ui.gitflow.FeatureFinishKeepBranchHandlerTest

(SWT:1708): Gtk-CRITICAL **: 23:06:12.089: gtk_box_gadget_distribute: assertion 'size >= 0' failed in GtkScrollbar

(SWT:1708): Gtk-CRITICAL **: 23:06:12.109: gtk_box_gadget_distribute: assertion 'size >= 0' failed in GtkScrollbar

(SWT:1708): Gtk-CRITICAL **: 23:06:12.125: gtk_box_gadget_distribute: assertion 'size >= 0' failed in GtkScrollbar

(SWT:1708): Gtk-CRITICAL **: 23:06:12.142: gtk_box_gadget_distribute: assertion 'size >= 0' failed in GtkScrollbar

(SWT:1708): Gtk-CRITICAL **: 23:06:12.159: gtk_box_gadget_distribute: assertion 'size >= 0' failed in GtkScrollbar

(SWT:1708): Gtk-CRITICAL **: 23:06:12.175: gtk_box_gadget_distribute: assertion 'size >= 0' failed in GtkScrollbar

(SWT:1708): Gtk-CRITICAL **: 23:06:12.192: gtk_box_gadget_distribute: assertion 'size >= 0' failed in GtkScrollbar

(SWT:1708): Gtk-CRITICAL **: 23:06:12.209: gtk_box_gadget_distribute: assertion 'size >= 0' failed in GtkScrollbar

(SWT:1708): Gtk-CRITICAL **: 23:06:12.226: gtk_box_gadget_distribute: assertion 'size >= 0' failed in GtkScrollbar

(SWT:1708): Gtk-CRITICAL **: 23:06:12.242: gtk_box_gadget_distribute: assertion 'size >= 0' failed in GtkScrollbar

(SWT:1708): Gtk-CRITICAL **: 23:06:12.259: gtk_box_gadget_distribute: assertion 'size >= 0' failed in GtkScrollbar

(SWT:1708): Gtk-CRITICAL **: 23:06:12.275: gtk_box_gadget_distribute: assertion 'size >= 0' failed in GtkScrollbar

(SWT:1708): Gtk-CRITICAL **: 23:06:12.292: gtk_box_gadget_distribute: assertion 'size >= 0' failed in GtkScrollbar

(SWT:1708): Gtk-CRITICAL **: 23:06:12.858: gtk_box_gadget_distribute: assertion 'size >= 0' failed in GtkScrollbar
Tests run: 1, Failures: 0, Errors: 0, Skipped: 0, Time elapsed: 2.169 s - in org.eclipse.egit.ui.gitflow.FeatureFinishKeepBranchHandlerTest
testFeatureFinishKeepBranch(org.eclipse.egit.ui.gitflow.FeatureFinishKeepBranchHandlerTest)  Time elapsed: 2.163 s
Running org.eclipse.egit.ui.wizards.share.SharingWizardTest

(SWT:1708): Gtk-CRITICAL **: 23:06:13.560: gtk_box_gadget_distribute: assertion 'size >= 0' failed in GtkScrollbar

(SWT:1708): Gtk-WARNING **: 23:06:13.561: Negative content width -13 (allocation 5, extents 9x9) while allocating gadget (node entry, owner GtkEntry)

(SWT:1708): Gtk-WARNING **: 23:06:13.561: Negative content height -1 (allocation 1, extents 1x1) while allocating gadget (node scrolledwindow, owner GtkScrolledWindow)

(SWT:1708): Gtk-CRITICAL **: 23:06:13.561: gtk_box_gadget_distribute: assertion 'size >= 0' failed in GtkScrollbar

(SWT:1708): Gtk-CRITICAL **: 23:06:13.561: gtk_box_gadget_distribute: assertion 'size >= 0' failed in GtkScrollbar

(SWT:1708): Gtk-CRITICAL **: 23:06:14.176: gtk_box_gadget_distribute: assertion 'size >= 0' failed in GtkScrollbar

(SWT:1708): Gtk-WARNING **: 23:06:14.177: Negative content width -13 (allocation 5, extents 9x9) while allocating gadget (node entry, owner GtkEntry)

(SWT:1708): Gtk-WARNING **: 23:06:14.177: Negative content height -1 (allocation 1, extents 1x1) while allocating gadget (node scrolledwindow, owner GtkScrolledWindow)

(SWT:1708): Gtk-CRITICAL **: 23:06:14.177: gtk_box_gadget_distribute: assertion 'size >= 0' failed in GtkScrollbar

(SWT:1708): Gtk-CRITICAL **: 23:06:14.177: gtk_box_gadget_distribute: assertion 'size >= 0' failed in GtkScrollbar

(SWT:1708): Gtk-CRITICAL **: 23:06:14.793: gtk_box_gadget_distribute: assertion 'size >= 0' failed in GtkScrollbar

(SWT:1708): Gtk-WARNING **: 23:06:14.794: Negative content width -13 (allocation 5, extents 9x9) while allocating gadget (node entry, owner GtkEntry)

(SWT:1708): Gtk-WARNING **: 23:06:14.794: Negative content height -1 (allocation 1, extents 1x1) while allocating gadget (node scrolledwindow, owner GtkScrolledWindow)

(SWT:1708): Gtk-CRITICAL **: 23:06:14.794: gtk_box_gadget_distribute: assertion 'size >= 0' failed in GtkScrollbar

(SWT:1708): Gtk-CRITICAL **: 23:06:14.794: gtk_box_gadget_distribute: assertion 'size >= 0' failed in GtkScrollbar

(SWT:1708): Gtk-CRITICAL **: 23:06:15.406: gtk_box_gadget_distribute: assertion 'size >= 0' failed in GtkScrollbar

(SWT:1708): Gtk-WARNING **: 23:06:15.407: Negative content width -13 (allocation 5, extents 9x9) while allocating gadget (node entry, owner GtkEntry)

(SWT:1708): Gtk-WARNING **: 23:06:15.407: Negative content height -1 (allocation 1, extents 1x1) while allocating gadget (node scrolledwindow, owner GtkScrolledWindow)

(SWT:1708): Gtk-CRITICAL **: 23:06:15.407: gtk_box_gadget_distribute: assertion 'size >= 0' failed in GtkScrollbar

(SWT:1708): Gtk-CRITICAL **: 23:06:15.407: gtk_box_gadget_distribute: assertion 'size >= 0' failed in GtkScrollbar

(SWT:1708): Gtk-CRITICAL **: 23:06:16.964: gtk_box_gadget_distribute: assertion 'size >= 0' failed in GtkScrollbar

(SWT:1708): Gtk-WARNING **: 23:06:16.964: Negative content width -13 (allocation 5, extents 9x9) while allocating gadget (node entry, owner GtkEntry)

(SWT:1708): Gtk-WARNING **: 23:06:16.965: Negative content height -1 (allocation 1, extents 1x1) while allocating gadget (node scrolledwindow, owner GtkScrolledWindow)

(SWT:1708): Gtk-CRITICAL **: 23:06:16.965: gtk_box_gadget_distribute: assertion 'size >= 0' failed in GtkScrollbar

(SWT:1708): Gtk-CRITICAL **: 23:06:16.965: gtk_box_gadget_distribute: assertion 'size >= 0' failed in GtkScrollbar

(SWT:1708): Gtk-CRITICAL **: 23:06:17.109: gtk_box_gadget_distribute: assertion 'size >= 0' failed in GtkScrollbar

(SWT:1708): Gtk-WARNING **: 23:06:17.110: Negative content width -13 (allocation 5, extents 9x9) while allocating gadget (node entry, owner GtkEntry)

(SWT:1708): Gtk-WARNING **: 23:06:17.110: Negative content height -1 (allocation 1, extents 1x1) while allocating gadget (node scrolledwindow, owner GtkScrolledWindow)

(SWT:1708): Gtk-CRITICAL **: 23:06:17.110: gtk_box_gadget_distribute: assertion 'size >= 0' failed in GtkScrollbar

(SWT:1708): Gtk-CRITICAL **: 23:06:17.110: gtk_box_gadget_distribute: assertion 'size >= 0' failed in GtkScrollbar

(SWT:1708): Gtk-CRITICAL **: 23:06:17.275: gtk_box_gadget_distribute: assertion 'size >= 0' failed in GtkScrollbar

(SWT:1708): Gtk-WARNING **: 23:06:17.275: Negative content width -13 (allocation 5, extents 9x9) while allocating gadget (node entry, owner GtkEntry)

(SWT:1708): Gtk-WARNING **: 23:06:17.276: Negative content height -1 (allocation 1, extents 1x1) while allocating gadget (node scrolledwindow, owner GtkScrolledWindow)

(SWT:1708): Gtk-CRITICAL **: 23:06:17.276: gtk_box_gadget_distribute: assertion 'size >= 0' failed in GtkScrollbar

(SWT:1708): Gtk-CRITICAL **: 23:06:17.276: gtk_box_gadget_distribute: assertion 'size >= 0' failed in GtkScrollbar

(SWT:1708): Gtk-CRITICAL **: 23:06:18.354: gtk_box_gadget_distribute: assertion 'size >= 0' failed in GtkScrollbar

(SWT:1708): Gtk-WARNING **: 23:06:18.355: Negative content width -13 (allocation 5, extents 9x9) while allocating gadget (node entry, owner GtkEntry)

(SWT:1708): Gtk-WARNING **: 23:06:18.355: Negative content height -1 (allocation 1, extents 1x1) while allocating gadget (node scrolledwindow, owner GtkScrolledWindow)

(SWT:1708): Gtk-CRITICAL **: 23:06:18.355: gtk_box_gadget_distribute: assertion 'size >= 0' failed in GtkScrollbar

(SWT:1708): Gtk-CRITICAL **: 23:06:18.356: gtk_box_gadget_distribute: assertion 'size >= 0' failed in GtkScrollbar
Tests run: 3, Failures: 0, Errors: 0, Skipped: 0, Time elapsed: 5.785 s - in org.eclipse.egit.ui.wizards.share.SharingWizardTest
shareProjectWithExternalRepo(org.eclipse.egit.ui.wizards.share.SharingWizardTest)  Time elapsed: 3.41 s
shareProjectWithAlreadyCreatedRepos(org.eclipse.egit.ui.wizards.share.SharingWizardTest)  Time elapsed: 1.391 s
shareProjectAndCreateRepo(org.eclipse.egit.ui.wizards.share.SharingWizardTest)  Time elapsed: 0.979 s
Running org.eclipse.egit.ui.wizards.clone.GitCloneSourceProviderExtensionTest
Tests run: 1, Failures: 0, Errors: 0, Skipped: 0, Time elapsed: 0.001 s - in org.eclipse.egit.ui.wizards.clone.GitCloneSourceProviderExtensionTest
testGetRepositoryImports(org.eclipse.egit.ui.wizards.clone.GitCloneSourceProviderExtensionTest)  Time elapsed: 0.001 s
Running org.eclipse.egit.ui.wizards.clone.GitCloneWizardHttpTest
2019-12-05 23:06:19.612:INFO::WorkbenchTestable: Logging initialized @803639ms to org.eclipse.jetty.util.log.StdErrLog
2019-12-05 23:06:19.741:INFO:oejs.Server:WorkbenchTestable: jetty-9.4.22.v20191022; built: 2019-10-29T10:22:32.053Z; git: b1e6b55512e008f7fbdf1cbea4ff8a6446d1073b; jvm 1.8.0_212-b04
2019-12-05 23:06:19.805:INFO:oejsh.ContextHandler:WorkbenchTestable: Started o.e.j.s.ServletContextHandler@24429533{/sbasic,null,AVAILABLE}
2019-12-05 23:06:19.862:INFO:oejs.AbstractConnector:WorkbenchTestable: Started ServerConnector@248f8b9c{HTTP/1.1,[http/1.1]}{127.0.0.1:39312}
2019-12-05 23:06:19.862:INFO:oejs.Server:WorkbenchTestable: Started @803889ms
2019-12-05 23:06:20.644:INFO:oeju.TypeUtil:qtp766636655-990: JVM Runtime does not support Modules
2019-12-05 23:06:22.414:INFO:oejs.AbstractConnector:WorkbenchTestable: Stopped ServerConnector@248f8b9c{HTTP/1.1,[http/1.1]}{127.0.0.1:0}
2019-12-05 23:06:22.420:INFO:oejsh.ContextHandler:WorkbenchTestable: Stopped o.e.j.s.ServletContextHandler@24429533{/sbasic,null,UNAVAILABLE}
Tests run: 1, Failures: 0, Errors: 0, Skipped: 0, Time elapsed: 3.137 s - in org.eclipse.egit.ui.wizards.clone.GitCloneWizardHttpTest
canCloneARemoteRepo(org.eclipse.egit.ui.wizards.clone.GitCloneWizardHttpTest)  Time elapsed: 2.546 s
Running org.eclipse.egit.ui.wizards.clone.GitCloneWizardHttpsTest
2019-12-05 23:06:23.536:INFO:oejs.Server:WorkbenchTestable: jetty-9.4.22.v20191022; built: 2019-10-29T10:22:32.053Z; git: b1e6b55512e008f7fbdf1cbea4ff8a6446d1073b; jvm 1.8.0_212-b04
2019-12-05 23:06:23.538:INFO:oejsh.ContextHandler:WorkbenchTestable: Started o.e.j.s.ServletContextHandler@6dc8dbf{/sbasic,null,AVAILABLE}
2019-12-05 23:06:23.542:INFO:oejs.AbstractConnector:WorkbenchTestable: Started ServerConnector@70ee835b{HTTP/1.1,[http/1.1]}{127.0.0.1:35520}
2019-12-05 23:06:23.547:INFO:oejus.SslContextFactory:WorkbenchTestable: x509=X509@6a00fb93(migration-agent-kmdlw,h=[],w=[]) for Client@436a6460[provider=null,keyStore=file:///tmp/jks5670888735279659926/keystore.jks,trustStore=file:///tmp/jks5670888735279659926/keystore.jks]
2019-12-05 23:06:23.571:WARN:oejusS.config:WorkbenchTestable: Trusting all certificates configured for Client@436a6460[provider=null,keyStore=file:///tmp/jks5670888735279659926/keystore.jks,trustStore=file:///tmp/jks5670888735279659926/keystore.jks]
2019-12-05 23:06:23.571:WARN:oejusS.config:WorkbenchTestable: No Client EndPointIdentificationAlgorithm configured for Client@436a6460[provider=null,keyStore=file:///tmp/jks5670888735279659926/keystore.jks,trustStore=file:///tmp/jks5670888735279659926/keystore.jks]
2019-12-05 23:06:23.578:INFO:oejs.AbstractConnector:WorkbenchTestable: Started ServerConnector@3934bb16{SSL,[ssl, http/1.1]}{127.0.0.1:46436}
2019-12-05 23:06:23.578:INFO:oejs.Server:WorkbenchTestable: Started @807605ms
2019-12-05 23:06:26.119:INFO:oejs.AbstractConnector:WorkbenchTestable: Stopped ServerConnector@70ee835b{HTTP/1.1,[http/1.1]}{127.0.0.1:0}
2019-12-05 23:06:26.120:INFO:oejs.AbstractConnector:WorkbenchTestable: Stopped ServerConnector@3934bb16{SSL,[ssl, http/1.1]}{127.0.0.1:0}
2019-12-05 23:06:26.120:INFO:oejsh.ContextHandler:WorkbenchTestable: Stopped o.e.j.s.ServletContextHandler@6dc8dbf{/sbasic,null,UNAVAILABLE}
Tests run: 1, Failures: 0, Errors: 0, Skipped: 0, Time elapsed: 3.687 s - in org.eclipse.egit.ui.wizards.clone.GitCloneWizardHttpsTest
canCloneARemoteRepo(org.eclipse.egit.ui.wizards.clone.GitCloneWizardHttpsTest)  Time elapsed: 2.54 s
Running org.eclipse.egit.ui.wizards.clone.GitCloneWizardTest
Tests run: 9, Failures: 0, Errors: 0, Skipped: 2, Time elapsed: 6.172 s - in org.eclipse.egit.ui.wizards.clone.GitCloneWizardTest
canCloneARemoteRepo(org.eclipse.egit.ui.wizards.clone.GitCloneWizardTest)  Time elapsed: 0.976 s
invalidPortFreezesDialog(org.eclipse.egit.ui.wizards.clone.GitCloneWizardTest) skipped
updatesParameterFieldsInImportDialogWhenURIIsUpdated(org.eclipse.egit.ui.wizards.clone.GitCloneWizardTest)  Time elapsed: 0.891 s
clonedRepositoryShouldExistOnFileSystem(org.eclipse.egit.ui.wizards.clone.GitCloneWizardTest)  Time elapsed: 1.461 s
alteringSomeParametersDuringClone(org.eclipse.egit.ui.wizards.clone.GitCloneWizardTest)  Time elapsed: 1.446 s
gitStyleUriSelectsSshProtocol(org.eclipse.egit.ui.wizards.clone.GitCloneWizardTest)  Time elapsed: 0.311 s
invalidHostnameFreezesDialog(org.eclipse.egit.ui.wizards.clone.GitCloneWizardTest) skipped
acceptCloneCommandAsURI(org.eclipse.egit.ui.wizards.clone.GitCloneWizardTest)  Time elapsed: 0.352 s
testFileURIWithSpace(org.eclipse.egit.ui.wizards.clone.GitCloneWizardTest)  Time elapsed: 0.351 s
Running org.eclipse.egit.ui.wizards.pull.PullWizardTest

(SWT:1708): Gtk-WARNING **: 23:06:33.108: Negative content width -6 (allocation 1, extents 4x3) while allocating gadget (node toolbar, owner GtkToolbar)

(SWT:1708): Gtk-WARNING **: 23:06:34.520: Negative content width -6 (allocation 1, extents 4x3) while allocating gadget (node toolbar, owner GtkToolbar)
Tests run: 1, Failures: 0, Errors: 0, Skipped: 0, Time elapsed: 2.314 s - in org.eclipse.egit.ui.wizards.pull.PullWizardTest
pullFromProjectRepo(org.eclipse.egit.ui.wizards.pull.PullWizardTest)  Time elapsed: 2.306 s
Running org.eclipse.egit.ui.search.CommitSearchQueryTest
Tests run: 7, Failures: 0, Errors: 0, Skipped: 0, Time elapsed: 4.215 s - in org.eclipse.egit.ui.search.CommitSearchQueryTest
testQuery(org.eclipse.egit.ui.search.CommitSearchQueryTest)  Time elapsed: 0.562 s
testMatchMessage(org.eclipse.egit.ui.search.CommitSearchQueryTest)  Time elapsed: 0.553 s
testCaseInsensitive(org.eclipse.egit.ui.search.CommitSearchQueryTest)  Time elapsed: 0.843 s
testMatchCommit(org.eclipse.egit.ui.search.CommitSearchQueryTest)  Time elapsed: 0.541 s
testMatchParent(org.eclipse.egit.ui.search.CommitSearchQueryTest)  Time elapsed: 0.539 s
testMatchTree(org.eclipse.egit.ui.search.CommitSearchQueryTest)  Time elapsed: 0.565 s
testEmptyMatches(org.eclipse.egit.ui.search.CommitSearchQueryTest)  Time elapsed: 0.564 s
Running org.eclipse.egit.ui.search.CommitSearchDialogTest

(SWT:1708): Gtk-WARNING **: 23:06:39.587: Negative content width -6 (allocation 1, extents 4x3) while allocating gadget (node toolbar, owner GtkToolbar)

(SWT:1708): Gtk-WARNING **: 23:06:39.605: Negative content width -6 (allocation 1, extents 4x3) while allocating gadget (node toolbar, owner GtkToolbar)

(SWT:1708): Gtk-WARNING **: 23:06:39.693: Negative content width -6 (allocation 1, extents 4x3) while allocating gadget (node toolbar, owner GtkToolbar)

(SWT:1708): Gtk-WARNING **: 23:06:39.740: Negative content width -6 (allocation 1, extents 4x3) while allocating gadget (node toolbar, owner GtkToolbar)

(SWT:1708): Gtk-WARNING **: 23:06:40.412: Negative content width -6 (allocation 1, extents 4x3) while allocating gadget (node toolbar, owner GtkToolbar)
Tests run: 1, Failures: 0, Errors: 0, Skipped: 0, Time elapsed: 1.668 s - in org.eclipse.egit.ui.search.CommitSearchDialogTest
openCommitTabOnSearchDialog(org.eclipse.egit.ui.search.CommitSearchDialogTest)  Time elapsed: 1.659 s
Running org.eclipse.egit.ui.prefpages.configuration.GlobalConfigurationPageTest

!ENTRY org.eclipse.ui 2 2 2019-12-05 23:06:40.548
!MESSAGE Invalid preference category path: org.eclipse.ui.net.NetPreferences (bundle: org.eclipse.jsch.ui, page: org.eclipse.jsch.ui.SSHPreferences)

(SWT:1708): Gtk-WARNING **: 23:06:40.563: Negative content width -13 (allocation 5, extents 9x9) while allocating gadget (node entry, owner GtkEntry)

(SWT:1708): Gtk-WARNING **: 23:06:40.795: Negative content width -13 (allocation 5, extents 9x9) while allocating gadget (node entry, owner GtkEntry)

(SWT:1708): Gtk-WARNING **: 23:06:40.977: Negative content width -13 (allocation 5, extents 9x9) while allocating gadget (node entry, owner GtkEntry)

(SWT:1708): Gtk-WARNING **: 23:06:41.146: Negative content width -13 (allocation 5, extents 9x9) while allocating gadget (node entry, owner GtkEntry)

(SWT:1708): Gtk-WARNING **: 23:06:41.252: Negative content width -13 (allocation 5, extents 9x9) while allocating gadget (node entry, owner GtkEntry)

(SWT:1708): Gtk-WARNING **: 23:06:41.373: Negative content width -13 (allocation 5, extents 9x9) while allocating gadget (node entry, owner GtkEntry)

(SWT:1708): Gtk-WARNING **: 23:06:41.569: Negative content width -13 (allocation 5, extents 9x9) while allocating gadget (node entry, owner GtkEntry)

(SWT:1708): Gtk-WARNING **: 23:06:41.644: Negative content width -6 (allocation 1, extents 4x3) while allocating gadget (node toolbar, owner GtkToolbar)

(SWT:1708): Gtk-WARNING **: 23:06:41.645: Negative content height -3 (allocation 1, extents 2x2) while allocating gadget (node toolbar, owner GtkToolbar)

(SWT:1708): Gtk-WARNING **: 23:06:41.645: Negative content width -6 (allocation 1, extents 4x3) while allocating gadget (node toolbar, owner GtkToolbar)

(SWT:1708): Gtk-WARNING **: 23:06:41.645: Negative content height -3 (allocation 1, extents 2x2) while allocating gadget (node toolbar, owner GtkToolbar)

(SWT:1708): Gtk-WARNING **: 23:06:41.834: Negative content width -13 (allocation 5, extents 9x9) while allocating gadget (node entry, owner GtkEntry)

(SWT:1708): Gtk-WARNING **: 23:06:41.997: Negative content width -13 (allocation 5, extents 9x9) while allocating gadget (node entry, owner GtkEntry)

(SWT:1708): Gtk-WARNING **: 23:06:42.194: Negative content width -13 (allocation 5, extents 9x9) while allocating gadget (node entry, owner GtkEntry)

(SWT:1708): Gtk-WARNING **: 23:06:42.384: Negative content width -13 (allocation 5, extents 9x9) while allocating gadget (node entry, owner GtkEntry)

(SWT:1708): Gtk-WARNING **: 23:06:42.550: Negative content width -13 (allocation 5, extents 9x9) while allocating gadget (node entry, owner GtkEntry)
Tests run: 11, Failures: 0, Errors: 0, Skipped: 0, Time elapsed: 2.155 s - in org.eclipse.egit.ui.prefpages.configuration.GlobalConfigurationPageTest
testAddSubSectionEntry(org.eclipse.egit.ui.prefpages.configuration.GlobalConfigurationPageTest)  Time elapsed: 0.255 s
testAddSectionEntry(org.eclipse.egit.ui.prefpages.configuration.GlobalConfigurationPageTest)  Time elapsed: 0.181 s
testCanCreateSameEntryValue(org.eclipse.egit.ui.prefpages.configuration.GlobalConfigurationPageTest)  Time elapsed: 0.169 s
testNodes(org.eclipse.egit.ui.prefpages.configuration.GlobalConfigurationPageTest)  Time elapsed: 0.106 s
testRemoveValue(org.eclipse.egit.ui.prefpages.configuration.GlobalConfigurationPageTest)  Time elapsed: 0.121 s
testAddSubSectionEntryWithSuggestion(org.eclipse.egit.ui.prefpages.configuration.GlobalConfigurationPageTest)  Time elapsed: 0.197 s
testOpenEditor(org.eclipse.egit.ui.prefpages.configuration.GlobalConfigurationPageTest)  Time elapsed: 0.264 s
testSubsectionWithDot(org.eclipse.egit.ui.prefpages.configuration.GlobalConfigurationPageTest)  Time elapsed: 0.163 s
testChecksForKey(org.eclipse.egit.ui.prefpages.configuration.GlobalConfigurationPageTest)  Time elapsed: 0.196 s
testRemoveSubSection(org.eclipse.egit.ui.prefpages.configuration.GlobalConfigurationPageTest)  Time elapsed: 0.189 s
testRemoveSection(org.eclipse.egit.ui.prefpages.configuration.GlobalConfigurationPageTest)  Time elapsed: 0.167 s
Running org.eclipse.egit.ui.submodule.SubmoduleUpdateTest

(SWT:1708): Gtk-WARNING **: 23:06:43.413: Negative content width -6 (allocation 1, extents 4x3) while allocating gadget (node toolbar, owner GtkToolbar)

(SWT:1708): Gtk-WARNING **: 23:06:46.235: Negative content width -6 (allocation 1, extents 4x3) while allocating gadget (node toolbar, owner GtkToolbar)
Tests run: 1, Failures: 0, Errors: 0, Skipped: 0, Time elapsed: 3.656 s - in org.eclipse.egit.ui.submodule.SubmoduleUpdateTest
updateSubmodule(org.eclipse.egit.ui.submodule.SubmoduleUpdateTest)  Time elapsed: 3.648 s
Running org.eclipse.egit.ui.submodule.SubmoduleSyncTest

(SWT:1708): Gtk-WARNING **: 23:06:47.254: Negative content width -6 (allocation 1, extents 4x3) while allocating gadget (node toolbar, owner GtkToolbar)

(SWT:1708): Gtk-WARNING **: 23:06:49.777: Negative content width -6 (allocation 1, extents 4x3) while allocating gadget (node toolbar, owner GtkToolbar)
Tests run: 1, Failures: 0, Errors: 0, Skipped: 0, Time elapsed: 3.486 s - in org.eclipse.egit.ui.submodule.SubmoduleSyncTest
syncSubmodule(org.eclipse.egit.ui.submodule.SubmoduleSyncTest)  Time elapsed: 3.479 s
Running org.eclipse.egit.ui.submodule.SubmoduleAddTest

(SWT:1708): Gtk-WARNING **: 23:06:50.639: Negative content width -6 (allocation 1, extents 4x3) while allocating gadget (node toolbar, owner GtkToolbar)

(SWT:1708): Gtk-WARNING **: 23:06:53.098: Negative content width -6 (allocation 1, extents 4x3) while allocating gadget (node toolbar, owner GtkToolbar)
Tests run: 1, Failures: 0, Errors: 0, Skipped: 0, Time elapsed: 3.312 s - in org.eclipse.egit.ui.submodule.SubmoduleAddTest
addAtRoot(org.eclipse.egit.ui.submodule.SubmoduleAddTest)  Time elapsed: 3.305 s
Running org.eclipse.egit.ui.httpauth.PushTest
2019-12-05 23:06:53.300:INFO:oejs.Server:WorkbenchTestable: jetty-9.4.22.v20191022; built: 2019-10-29T10:22:32.053Z; git: b1e6b55512e008f7fbdf1cbea4ff8a6446d1073b; jvm 1.8.0_212-b04
2019-12-05 23:06:53.302:INFO:oejsh.ContextHandler:WorkbenchTestable: Started o.e.j.s.ServletContextHandler@102928db{/sbasic,null,AVAILABLE}
2019-12-05 23:06:53.308:INFO:oejs.AbstractConnector:WorkbenchTestable: Started ServerConnector@5e988edb{HTTP/1.1,[http/1.1]}{127.0.0.1:35930}
2019-12-05 23:06:53.309:INFO:oejs.Server:WorkbenchTestable: Started @837335ms

(SWT:1708): Gtk-CRITICAL **: 23:06:54.191: gtk_box_gadget_distribute: assertion 'size >= 0' failed in GtkCheckButton
2019-12-05 23:06:55.137:INFO:oejs.AbstractConnector:WorkbenchTestable: Stopped ServerConnector@5e988edb{HTTP/1.1,[http/1.1]}{127.0.0.1:0}
2019-12-05 23:06:55.138:INFO:oejsh.ContextHandler:WorkbenchTestable: Stopped o.e.j.s.ServletContextHandler@102928db{/sbasic,null,UNAVAILABLE}
Tests run: 1, Failures: 0, Errors: 0, Skipped: 0, Time elapsed: 1.929 s - in org.eclipse.egit.ui.httpauth.PushTest
testPush(org.eclipse.egit.ui.httpauth.PushTest)  Time elapsed: 1.928 s
Running org.eclipse.egit.ui.operations.GitScopeUtilTest
Tests run: 5, Failures: 0, Errors: 0, Skipped: 0, Time elapsed: 4.121 s - in org.eclipse.egit.ui.operations.GitScopeUtilTest
relatedChangesWithPrompt(org.eclipse.egit.ui.operations.GitScopeUtilTest)  Time elapsed: 1.819 s
modelProviderWithExtensionFiles(org.eclipse.egit.ui.operations.GitScopeUtilTest)  Time elapsed: 0.602 s
relatedChangesWithInvalidParams(org.eclipse.egit.ui.operations.GitScopeUtilTest)  Time elapsed: 0.56 s
relatedChangesWithNullResources(org.eclipse.egit.ui.operations.GitScopeUtilTest)  Time elapsed: 0.542 s
relatedChangesWithEmptyResources(org.eclipse.egit.ui.operations.GitScopeUtilTest)  Time elapsed: 0.594 s

Results:

Errors: 
  HistoryViewTest.testSelectShownRefs:689->assertNoCommit:599 » Timeout Timeout ...

Tests run: 536, Failures: 0, Errors: 1, Skipped: 12


!ENTRY org.eclipse.core.resources 2 10035 2019-12-05 23:07:00.510
!MESSAGE The workspace will exit with unsaved changes in this session.
[INFO] ------------------------------------------------------------------------
[INFO] Reactor Summary for EGit Parent 5.7.0-SNAPSHOT:
[INFO] 
[INFO] EGit Parent ........................................ SUCCESS [ 44.229 s]
[INFO] EGit Target Platform Definition .................... SUCCESS [  3.465 s]
[INFO] Eclipse EGit ....................................... SUCCESS [ 13.463 s]
[INFO] Git Team Provider (Core) ........................... SUCCESS [ 24.532 s]
[INFO] Git Team Provider (UI) ............................. SUCCESS [01:03 min]
[INFO] EGit Mylyn UI ...................................... SUCCESS [  8.894 s]
[INFO] Git Team Provider (Documentation) .................. SUCCESS [  6.114 s]
[INFO] Eclipse EGit Feature ............................... SUCCESS [  1.506 s]
[INFO] EGit Mylyn Feature ................................. SUCCESS [  1.463 s]
[INFO] Git Flow ........................................... SUCCESS [ 13.229 s]
[INFO] Git Flow UI ........................................ SUCCESS [ 12.046 s]
[INFO] Eclipse EGit Gitflow Feature ....................... SUCCESS [  1.983 s]
[INFO] EGit JUnit Support ................................. SUCCESS [  9.073 s]
[INFO] GitFlow Test Plug-in ............................... SUCCESS [ 36.274 s]
[INFO] Eclipse EGit Source Feature ........................ SUCCESS [  1.301 s]
[INFO] EGit P2 Repository ................................. SUCCESS [ 18.555 s]
[INFO] EGit Core Test Plug-in ............................. SUCCESS [02:36 min]
[INFO] EGit UI Test Plug-in ............................... FAILURE [14:07 min]
[INFO] EGit Mylyn UI Test Plug-in ......................... SKIPPED
[INFO] ------------------------------------------------------------------------
[INFO] BUILD FAILURE
[INFO] ------------------------------------------------------------------------
[INFO] Total time:  24:52 min
[INFO] Finished at: 2019-12-05T23:07:01Z
[INFO] ------------------------------------------------------------------------
[ERROR] Failed to execute goal org.eclipse.tycho:tycho-surefire-plugin:1.5.1:test (default-test) on project org.eclipse.egit.ui.test: There are test failures.
[ERROR] 
[ERROR] Please refer to /home/jenkins/agent/workspace/egit.gerrit/repo/org.eclipse.egit.ui.test/target/surefire-reports for the individual test results.
[ERROR] -> [Help 1]
org.apache.maven.lifecycle.LifecycleExecutionException: Failed to execute goal org.eclipse.tycho:tycho-surefire-plugin:1.5.1:test (default-test) on project org.eclipse.egit.ui.test: There are test failures.

Please refer to /home/jenkins/agent/workspace/egit.gerrit/repo/org.eclipse.egit.ui.test/target/surefire-reports for the individual test results.
    at org.apache.maven.lifecycle.internal.MojoExecutor.execute (MojoExecutor.java:215)
    at org.apache.maven.lifecycle.internal.MojoExecutor.execute (MojoExecutor.java:156)
    at org.apache.maven.lifecycle.internal.MojoExecutor.execute (MojoExecutor.java:148)
    at org.apache.maven.lifecycle.internal.LifecycleModuleBuilder.buildProject (LifecycleModuleBuilder.java:117)
    at org.apache.maven.lifecycle.internal.LifecycleModuleBuilder.buildProject (LifecycleModuleBuilder.java:81)
    at org.apache.maven.lifecycle.internal.builder.singlethreaded.SingleThreadedBuilder.build (SingleThreadedBuilder.java:56)
    at org.apache.maven.lifecycle.internal.LifecycleStarter.execute (LifecycleStarter.java:128)
    at org.apache.maven.DefaultMaven.doExecute (DefaultMaven.java:305)
    at org.apache.maven.DefaultMaven.doExecute (DefaultMaven.java:192)
    at org.apache.maven.DefaultMaven.execute (DefaultMaven.java:105)
    at org.apache.maven.cli.MavenCli.execute (MavenCli.java:956)
    at org.apache.maven.cli.MavenCli.doMain (MavenCli.java:288)
    at org.apache.maven.cli.MavenCli.main (MavenCli.java:192)
    at sun.reflect.NativeMethodAccessorImpl.invoke0 (Native Method)
    at sun.reflect.NativeMethodAccessorImpl.invoke (NativeMethodAccessorImpl.java:62)
    at sun.reflect.DelegatingMethodAccessorImpl.invoke (DelegatingMethodAccessorImpl.java:43)
    at java.lang.reflect.Method.invoke (Method.java:498)
    at org.codehaus.plexus.classworlds.launcher.Launcher.launchEnhanced (Launcher.java:282)
    at org.codehaus.plexus.classworlds.launcher.Launcher.launch (Launcher.java:225)
    at org.codehaus.plexus.classworlds.launcher.Launcher.mainWithExitCode (Launcher.java:406)
    at org.codehaus.plexus.classworlds.launcher.Launcher.main (Launcher.java:347)
Caused by: org.apache.maven.plugin.MojoFailureException: There are test failures.

Please refer to /home/jenkins/agent/workspace/egit.gerrit/repo/org.eclipse.egit.ui.test/target/surefire-reports for the individual test results.
    at org.eclipse.tycho.surefire.TestMojo.runTest (TestMojo.java:1050)
    at org.eclipse.tycho.surefire.TestMojo.execute (TestMojo.java:702)
    at org.apache.maven.plugin.DefaultBuildPluginManager.executeMojo (DefaultBuildPluginManager.java:137)
    at org.apache.maven.lifecycle.internal.MojoExecutor.execute (MojoExecutor.java:210)
    at org.apache.maven.lifecycle.internal.MojoExecutor.execute (MojoExecutor.java:156)
    at org.apache.maven.lifecycle.internal.MojoExecutor.execute (MojoExecutor.java:148)
    at org.apache.maven.lifecycle.internal.LifecycleModuleBuilder.buildProject (LifecycleModuleBuilder.java:117)
    at org.apache.maven.lifecycle.internal.LifecycleModuleBuilder.buildProject (LifecycleModuleBuilder.java:81)
    at org.apache.maven.lifecycle.internal.builder.singlethreaded.SingleThreadedBuilder.build (SingleThreadedBuilder.java:56)
    at org.apache.maven.lifecycle.internal.LifecycleStarter.execute (LifecycleStarter.java:128)
    at org.apache.maven.DefaultMaven.doExecute (DefaultMaven.java:305)
    at org.apache.maven.DefaultMaven.doExecute (DefaultMaven.java:192)
    at org.apache.maven.DefaultMaven.execute (DefaultMaven.java:105)
    at org.apache.maven.cli.MavenCli.execute (MavenCli.java:956)
    at org.apache.maven.cli.MavenCli.doMain (MavenCli.java:288)
    at org.apache.maven.cli.MavenCli.main (MavenCli.java:192)
    at sun.reflect.NativeMethodAccessorImpl.invoke0 (Native Method)
    at sun.reflect.NativeMethodAccessorImpl.invoke (NativeMethodAccessorImpl.java:62)
    at sun.reflect.DelegatingMethodAccessorImpl.invoke (DelegatingMethodAccessorImpl.java:43)
    at java.lang.reflect.Method.invoke (Method.java:498)
    at org.codehaus.plexus.classworlds.launcher.Launcher.launchEnhanced (Launcher.java:282)
    at org.codehaus.plexus.classworlds.launcher.Launcher.launch (Launcher.java:225)
    at org.codehaus.plexus.classworlds.launcher.Launcher.mainWithExitCode (Launcher.java:406)
    at org.codehaus.plexus.classworlds.launcher.Launcher.main (Launcher.java:347)
[ERROR] 
[ERROR] Re-run Maven using the -X switch to enable full debug logging.
[ERROR] 
[ERROR] For more information about the errors and possible solutions, please read the following articles:
[ERROR] [Help 1] http://cwiki.apache.org/confluence/display/MAVEN/MojoFailureException
[ERROR] 
[ERROR] After correcting the problems, you can resume the build with the command
[ERROR]   mvn <args> -rf :org.eclipse.egit.ui.test
[Pipeline] }
[Pipeline] // stage
[Pipeline] stage
[Pipeline] { (Results)
[Pipeline] junit
Recording test results
[Pipeline] archiveArtifacts
Archiving artifacts
[Pipeline] findbugs
[FINDBUGS] Collecting findbugs analysis files...
[FINDBUGS] Searching for all files in /home/jenkins/agent/workspace/egit.gerrit/repo that match the pattern */target/*bugsXml.xml
[FINDBUGS] Parsing 8 files in /home/jenkins/agent/workspace/egit.gerrit/repo
[FINDBUGS] Successfully parsed file /home/jenkins/agent/workspace/egit.gerrit/repo/org.eclipse.egit.core.junit/target/spotbugsXml.xml with 4 unique warnings and 0 duplicates.
[FINDBUGS] Successfully parsed file /home/jenkins/agent/workspace/egit.gerrit/repo/org.eclipse.egit.core.test/target/spotbugsXml.xml with 9 unique warnings and 0 duplicates.
[FINDBUGS] Successfully parsed file /home/jenkins/agent/workspace/egit.gerrit/repo/org.eclipse.egit.core/target/spotbugsXml.xml with 20 unique warnings and 0 duplicates.
[FINDBUGS] Successfully parsed file /home/jenkins/agent/workspace/egit.gerrit/repo/org.eclipse.egit.gitflow.test/target/spotbugsXml.xml with 20 unique warnings and 0 duplicates.
[FINDBUGS] Successfully parsed file /home/jenkins/agent/workspace/egit.gerrit/repo/org.eclipse.egit.gitflow.ui/target/spotbugsXml.xml with 20 unique warnings and 0 duplicates.
[FINDBUGS] Successfully parsed file /home/jenkins/agent/workspace/egit.gerrit/repo/org.eclipse.egit.gitflow/target/spotbugsXml.xml with 22 unique warnings and 0 duplicates.
[FINDBUGS] Successfully parsed file /home/jenkins/agent/workspace/egit.gerrit/repo/org.eclipse.egit.mylyn.ui/target/spotbugsXml.xml with 22 unique warnings and 0 duplicates.
[FINDBUGS] Successfully parsed file /home/jenkins/agent/workspace/egit.gerrit/repo/org.eclipse.egit.ui/target/spotbugsXml.xml with 59 unique warnings and 0 duplicates.
Skipping warnings blame since pipelines do not have an SCM link.%n
[FINDBUGS] Computing warning deltas based on reference build #1026
[Pipeline] dry
[DRY] Collecting duplicate code analysis files...
[DRY] Searching for all files in /home/jenkins/agent/workspace/egit.gerrit/repo that match the pattern **/cpd.xml
[DRY] Parsing 15 files in /home/jenkins/agent/workspace/egit.gerrit/repo
[DRY] Successfully parsed file /home/jenkins/agent/workspace/egit.gerrit/repo/org.eclipse.egit-feature/target/cpd.xml with 0 unique warnings and 0 duplicates.
[DRY] Successfully parsed file /home/jenkins/agent/workspace/egit.gerrit/repo/org.eclipse.egit.core.junit/target/cpd.xml with 0 unique warnings and 0 duplicates.
[DRY] Successfully parsed file /home/jenkins/agent/workspace/egit.gerrit/repo/org.eclipse.egit.core.test/target/cpd.xml with 0 unique warnings and 0 duplicates.
[DRY] Successfully parsed file /home/jenkins/agent/workspace/egit.gerrit/repo/org.eclipse.egit.core/target/cpd.xml with 4 unique warnings and 0 duplicates.
[DRY] Successfully parsed file /home/jenkins/agent/workspace/egit.gerrit/repo/org.eclipse.egit.doc/target/cpd.xml with 4 unique warnings and 0 duplicates.
[DRY] Successfully parsed file /home/jenkins/agent/workspace/egit.gerrit/repo/org.eclipse.egit.gitflow-feature/target/cpd.xml with 4 unique warnings and 0 duplicates.
[DRY] Successfully parsed file /home/jenkins/agent/workspace/egit.gerrit/repo/org.eclipse.egit.gitflow.test/target/cpd.xml with 4 unique warnings and 0 duplicates.
[DRY] Successfully parsed file /home/jenkins/agent/workspace/egit.gerrit/repo/org.eclipse.egit.gitflow.ui/target/cpd.xml with 4 unique warnings and 0 duplicates.
[DRY] Successfully parsed file /home/jenkins/agent/workspace/egit.gerrit/repo/org.eclipse.egit.gitflow/target/cpd.xml with 4 unique warnings and 0 duplicates.
[DRY] Successfully parsed file /home/jenkins/agent/workspace/egit.gerrit/repo/org.eclipse.egit.mylyn-feature/target/cpd.xml with 4 unique warnings and 0 duplicates.
[DRY] Successfully parsed file /home/jenkins/agent/workspace/egit.gerrit/repo/org.eclipse.egit.mylyn.ui/target/cpd.xml with 4 unique warnings and 0 duplicates.
[DRY] Successfully parsed file /home/jenkins/agent/workspace/egit.gerrit/repo/org.eclipse.egit.repository/target/cpd.xml with 4 unique warnings and 0 duplicates.
[DRY] Successfully parsed file /home/jenkins/agent/workspace/egit.gerrit/repo/org.eclipse.egit.source-feature/target/cpd.xml with 4 unique warnings and 0 duplicates.
[DRY] Successfully parsed file /home/jenkins/agent/workspace/egit.gerrit/repo/org.eclipse.egit.ui/target/cpd.xml with 37 unique warnings and 0 duplicates.
[DRY] Successfully parsed file /home/jenkins/agent/workspace/egit.gerrit/repo/org.eclipse.egit/target/cpd.xml with 37 unique warnings and 0 duplicates.
Skipping warnings blame since pipelines do not have an SCM link.%n
[DRY] Computing warning deltas based on reference build #1026
[Pipeline] }
[Pipeline] // stage
[Pipeline] }
[Pipeline] // dir
[Pipeline] }
Terminating xvnc.
[Pipeline] // wrap
[Pipeline] }
[Pipeline] // timeout
[Pipeline] }
[Pipeline] // node
[Pipeline] }
[Pipeline] // timestamps
[Pipeline] End of Pipeline
ERROR: script returned exit code 1
Finished: FAILURE