FailedConsole Output

Skipping 693 KB.. Full Log
-CRITICAL **: 17:52:34.943: gtk_box_gadget_distribute: assertion 'size >= 0' failed in GtkScrollbar

(SWT:1751): Gtk-CRITICAL **: 17:52:34.960: gtk_box_gadget_distribute: assertion 'size >= 0' failed in GtkScrollbar

(SWT:1751): Gtk-CRITICAL **: 17:52:34.978: gtk_box_gadget_distribute: assertion 'size >= 0' failed in GtkScrollbar

(SWT:1751): Gtk-CRITICAL **: 17:52:34.996: gtk_box_gadget_distribute: assertion 'size >= 0' failed in GtkScrollbar

(SWT:1751): Gtk-CRITICAL **: 17:52:35.013: gtk_box_gadget_distribute: assertion 'size >= 0' failed in GtkScrollbar

(SWT:1751): Gtk-CRITICAL **: 17:52:35.031: gtk_box_gadget_distribute: assertion 'size >= 0' failed in GtkScrollbar

(SWT:1751): Gtk-CRITICAL **: 17:52:35.048: gtk_box_gadget_distribute: assertion 'size >= 0' failed in GtkScrollbar

(SWT:1751): Gtk-CRITICAL **: 17:52:35.065: gtk_box_gadget_distribute: assertion 'size >= 0' failed in GtkScrollbar

(SWT:1751): Gtk-CRITICAL **: 17:52:35.105: gtk_box_gadget_distribute: assertion 'size >= 0' failed in GtkScrollbar

(SWT:1751): Gtk-CRITICAL **: 17:52:35.125: gtk_box_gadget_distribute: assertion 'size >= 0' failed in GtkScrollbar

(SWT:1751): Gtk-CRITICAL **: 17:52:35.146: gtk_box_gadget_distribute: assertion 'size >= 0' failed in GtkScrollbar

(SWT:1751): Gtk-CRITICAL **: 17:52:35.165: gtk_box_gadget_distribute: assertion 'size >= 0' failed in GtkScrollbar

(SWT:1751): Gtk-CRITICAL **: 17:52:35.182: gtk_box_gadget_distribute: assertion 'size >= 0' failed in GtkScrollbar

(SWT:1751): Gtk-CRITICAL **: 17:52:35.202: gtk_box_gadget_distribute: assertion 'size >= 0' failed in GtkScrollbar

(SWT:1751): Gtk-CRITICAL **: 17:52:35.219: gtk_box_gadget_distribute: assertion 'size >= 0' failed in GtkScrollbar

(SWT:1751): Gtk-CRITICAL **: 17:52:35.237: gtk_box_gadget_distribute: assertion 'size >= 0' failed in GtkScrollbar

(SWT:1751): Gtk-CRITICAL **: 17:52:35.255: gtk_box_gadget_distribute: assertion 'size >= 0' failed in GtkScrollbar

(SWT:1751): Gtk-CRITICAL **: 17:52:35.274: gtk_box_gadget_distribute: assertion 'size >= 0' failed in GtkScrollbar

(SWT:1751): Gtk-CRITICAL **: 17:52:35.291: gtk_box_gadget_distribute: assertion 'size >= 0' failed in GtkScrollbar

(SWT:1751): Gtk-WARNING **: 17:53:05.775: Negative content width -6 (allocation 1, extents 4x3) while allocating gadget (node toolbar, owner GtkToolbar)

(SWT:1751): Gtk-WARNING **: 17:53:06.144: Negative content width -6 (allocation 1, extents 4x3) while allocating gadget (node toolbar, owner GtkToolbar)

(SWT:1751): Gtk-WARNING **: 17:53:06.186: Negative content width -6 (allocation 1, extents 4x3) while allocating gadget (node toolbar, owner GtkToolbar)

(SWT:1751): Gtk-WARNING **: 17:53:08.622: Negative content width -6 (allocation 1, extents 4x3) while allocating gadget (node toolbar, owner GtkToolbar)

(SWT:1751): Gtk-WARNING **: 17:53:08.624: Negative content width -6 (allocation 1, extents 4x3) while allocating gadget (node toolbar, owner GtkToolbar)

(SWT:1751): Gtk-WARNING **: 17:53:08.643: Negative content width -6 (allocation 1, extents 4x3) while allocating gadget (node toolbar, owner GtkToolbar)

(SWT:1751): Gtk-CRITICAL **: 17:53:08.667: gtk_box_gadget_distribute: assertion 'size >= 0' failed in GtkScrollbar

(SWT:1751): Gtk-CRITICAL **: 17:53:08.697: gtk_box_gadget_distribute: assertion 'size >= 0' failed in GtkScrollbar

(SWT:1751): Gtk-CRITICAL **: 17:53:08.719: gtk_box_gadget_distribute: assertion 'size >= 0' failed in GtkScrollbar

(SWT:1751): Gtk-CRITICAL **: 17:53:08.737: gtk_box_gadget_distribute: assertion 'size >= 0' failed in GtkScrollbar

(SWT:1751): Gtk-CRITICAL **: 17:53:08.760: gtk_box_gadget_distribute: assertion 'size >= 0' failed in GtkScrollbar

(SWT:1751): Gtk-CRITICAL **: 17:53:08.785: gtk_box_gadget_distribute: assertion 'size >= 0' failed in GtkScrollbar

(SWT:1751): Gtk-CRITICAL **: 17:53:08.801: gtk_box_gadget_distribute: assertion 'size >= 0' failed in GtkScrollbar

(SWT:1751): Gtk-CRITICAL **: 17:53:08.817: gtk_box_gadget_distribute: assertion 'size >= 0' failed in GtkScrollbar

(SWT:1751): Gtk-CRITICAL **: 17:53:08.835: gtk_box_gadget_distribute: assertion 'size >= 0' failed in GtkScrollbar

(SWT:1751): Gtk-CRITICAL **: 17:53:08.851: gtk_box_gadget_distribute: assertion 'size >= 0' failed in GtkScrollbar

(SWT:1751): Gtk-CRITICAL **: 17:53:08.868: gtk_box_gadget_distribute: assertion 'size >= 0' failed in GtkScrollbar

(SWT:1751): Gtk-WARNING **: 17:53:08.936: Negative content width -6 (allocation 1, extents 4x3) while allocating gadget (node toolbar, owner GtkToolbar)

(SWT:1751): Gtk-WARNING **: 17:53:08.936: Negative content height -3 (allocation 1, extents 2x2) while allocating gadget (node toolbar, owner GtkToolbar)

(SWT:1751): Gtk-WARNING **: 17:53:08.937: Negative content width -6 (allocation 1, extents 4x3) while allocating gadget (node toolbar, owner GtkToolbar)

(SWT:1751): Gtk-WARNING **: 17:53:08.937: Negative content height -3 (allocation 1, extents 2x2) while allocating gadget (node toolbar, owner GtkToolbar)

(SWT:1751): Gtk-WARNING **: 17:53:09.192: Negative content width -6 (allocation 1, extents 4x3) while allocating gadget (node toolbar, owner GtkToolbar)

(SWT:1751): Gtk-WARNING **: 17:53:09.544: Negative content width -6 (allocation 1, extents 4x3) while allocating gadget (node toolbar, owner GtkToolbar)

(SWT:1751): Gtk-WARNING **: 17:53:09.586: Negative content width -6 (allocation 1, extents 4x3) while allocating gadget (node toolbar, owner GtkToolbar)
Tests run: 18, Failures: 0, Errors: 1, Skipped: 1, Time elapsed: 103.633 s <<< FAILURE! - in org.eclipse.egit.ui.test.history.HistoryViewTest
testOpenHistoryOnFileFolderFilter(org.eclipse.egit.ui.test.history.HistoryViewTest)  Time elapsed: 4.549 s
testCheckOut(org.eclipse.egit.ui.test.history.HistoryViewTest)  Time elapsed: 3.458 s
testSelectBranch(org.eclipse.egit.ui.test.history.HistoryViewTest)  Time elapsed: 5.515 s
testToggleShownRefs(org.eclipse.egit.ui.test.history.HistoryViewTest)  Time elapsed: 7.673 s
testOpenHistoryOnProject(org.eclipse.egit.ui.test.history.HistoryViewTest)  Time elapsed: 3.163 s
testRevertFailure(org.eclipse.egit.ui.test.history.HistoryViewTest)  Time elapsed: 3.527 s
testStartGitflowReleaseEnabled(org.eclipse.egit.ui.test.history.HistoryViewTest)  Time elapsed: 3.177 s
testOpenRefFilterDialogFromDropdown(org.eclipse.egit.ui.test.history.HistoryViewTest)  Time elapsed: 3.585 s
testRebaseAlreadyUpToDate(org.eclipse.egit.ui.test.history.HistoryViewTest) skipped
testAddBranch(org.eclipse.egit.ui.test.history.HistoryViewTest)  Time elapsed: 3.134 s
testAddCommit(org.eclipse.egit.ui.test.history.HistoryViewTest)  Time elapsed: 3.275 s
testOpenHistoryOnFileProjectFilter(org.eclipse.egit.ui.test.history.HistoryViewTest)  Time elapsed: 4.429 s
testOpenRefFilterDialogFromMenu(org.eclipse.egit.ui.test.history.HistoryViewTest)  Time elapsed: 3.262 s
testOpenHistoryOnFileRepoFilter(org.eclipse.egit.ui.test.history.HistoryViewTest)  Time elapsed: 4.71 s
testAddTag(org.eclipse.egit.ui.test.history.HistoryViewTest)  Time elapsed: 3.519 s
testOpenHistoryOnFileNoFilter(org.eclipse.egit.ui.test.history.HistoryViewTest)  Time elapsed: 5.233 s
testSelectShownRefs(org.eclipse.egit.ui.test.history.HistoryViewTest)  Time elapsed: 37.771 s  <<< ERROR!
org.eclipse.swtbot.swt.finder.widgets.TimeoutException: Timeout after: 30000 ms.: CommitGraphTable did not become empty
	at org.eclipse.swtbot.swt.finder.SWTBotFactory.waitUntil(SWTBotFactory.java:524)
	at org.eclipse.swtbot.swt.finder.SWTBot.waitUntil(SWTBot.java:1)
	at org.eclipse.swtbot.eclipse.finder.SWTWorkbenchBot.waitUntil(SWTWorkbenchBot.java:1)
	at org.eclipse.swtbot.swt.finder.SWTBotFactory.waitUntil(SWTBotFactory.java:498)
	at org.eclipse.swtbot.swt.finder.SWTBot.waitUntil(SWTBot.java:1)
	at org.eclipse.swtbot.eclipse.finder.SWTWorkbenchBot.waitUntil(SWTWorkbenchBot.java:1)
	at org.eclipse.swtbot.swt.finder.SWTBotFactory.waitUntil(SWTBotFactory.java:486)
	at org.eclipse.swtbot.swt.finder.SWTBot.waitUntil(SWTBot.java:1)
	at org.eclipse.swtbot.eclipse.finder.SWTWorkbenchBot.waitUntil(SWTWorkbenchBot.java:1)
	at org.eclipse.egit.ui.test.history.HistoryViewTest.assertNoCommit(HistoryViewTest.java:599)
	at org.eclipse.egit.ui.test.history.HistoryViewTest.testSelectShownRefs(HistoryViewTest.java:689)
	at sun.reflect.NativeMethodAccessorImpl.invoke0(Native Method)
	at sun.reflect.NativeMethodAccessorImpl.invoke(NativeMethodAccessorImpl.java:62)
	at sun.reflect.DelegatingMethodAccessorImpl.invoke(DelegatingMethodAccessorImpl.java:43)
	at java.lang.reflect.Method.invoke(Method.java:498)
	at org.junit.runners.model.FrameworkMethod$1.runReflectiveCall(FrameworkMethod.java:50)
	at org.junit.internal.runners.model.ReflectiveCallable.run(ReflectiveCallable.java:12)
	at org.junit.runners.model.FrameworkMethod.invokeExplosively(FrameworkMethod.java:47)
	at org.eclipse.swtbot.swt.finder.junit.internal.CapturingFrameworkMethod.invokeExplosively(CapturingFrameworkMethod.java:47)
	at org.junit.internal.runners.statements.InvokeMethod.evaluate(InvokeMethod.java:17)
	at org.junit.internal.runners.statements.RunBefores.evaluate(RunBefores.java:26)
	at org.junit.internal.runners.statements.RunAfters.evaluate(RunAfters.java:27)
	at org.junit.rules.TestWatcher$1.evaluate(TestWatcher.java:55)
	at org.junit.rules.RunRules.evaluate(RunRules.java:20)
	at org.junit.runners.ParentRunner.runLeaf(ParentRunner.java:325)
	at org.eclipse.swtbot.swt.finder.junit.SWTBotJunit4ClassRunner.runChild(SWTBotJunit4ClassRunner.java:75)
	at org.junit.runners.BlockJUnit4ClassRunner.runChild(BlockJUnit4ClassRunner.java:57)
	at org.junit.runners.ParentRunner$3.run(ParentRunner.java:290)
	at org.junit.runners.ParentRunner$1.schedule(ParentRunner.java:71)
	at org.junit.runners.ParentRunner.runChildren(ParentRunner.java:288)
	at org.junit.runners.ParentRunner.access$000(ParentRunner.java:58)
	at org.junit.runners.ParentRunner$2.evaluate(ParentRunner.java:268)
	at org.junit.internal.runners.statements.RunBefores.evaluate(RunBefores.java:26)
	at org.junit.internal.runners.statements.RunAfters.evaluate(RunAfters.java:27)
	at org.junit.runners.ParentRunner.run(ParentRunner.java:363)
	at org.eclipse.swtbot.swt.finder.junit.SWTBotJunit4ClassRunner.run(SWTBotJunit4ClassRunner.java:60)
	at org.apache.maven.surefire.junit4.JUnit4Provider.execute(JUnit4Provider.java:365)
	at org.apache.maven.surefire.junit4.JUnit4Provider.executeWithRerun(JUnit4Provider.java:273)
	at org.apache.maven.surefire.junit4.JUnit4Provider.executeTestSet(JUnit4Provider.java:238)
	at org.apache.maven.surefire.junit4.JUnit4Provider.invoke(JUnit4Provider.java:159)
	at sun.reflect.NativeMethodAccessorImpl.invoke0(Native Method)
	at sun.reflect.NativeMethodAccessorImpl.invoke(NativeMethodAccessorImpl.java:62)
	at sun.reflect.DelegatingMethodAccessorImpl.invoke(DelegatingMethodAccessorImpl.java:43)
	at java.lang.reflect.Method.invoke(Method.java:498)
	at org.apache.maven.surefire.util.ReflectionUtils.invokeMethodWithArray2(ReflectionUtils.java:206)
	at org.apache.maven.surefire.booter.ProviderFactory$ProviderProxy.invoke(ProviderFactory.java:161)
	at org.apache.maven.surefire.booter.ProviderFactory.invokeProvider(ProviderFactory.java:84)
	at org.eclipse.tycho.surefire.osgibooter.OsgiSurefireBooter.run(OsgiSurefireBooter.java:113)
	at org.eclipse.tycho.surefire.osgibooter.AbstractUITestApplication.runTests(AbstractUITestApplication.java:44)
	at org.eclipse.e4.ui.internal.workbench.swt.E4Testable$1.run(E4Testable.java:73)
	at java.lang.Thread.run(Thread.java:748)

testOpenOfDeletedFile(org.eclipse.egit.ui.test.history.HistoryViewTest)  Time elapsed: 3.392 s
Running org.eclipse.egit.ui.test.history.GitHistoryRefFilterConfigurationDialogTest
Tests run: 23, Failures: 0, Errors: 0, Skipped: 0, Time elapsed: 18.429 s - in org.eclipse.egit.ui.test.history.GitHistoryRefFilterConfigurationDialogTest
testCheckOne(org.eclipse.egit.ui.test.history.GitHistoryRefFilterConfigurationDialogTest)  Time elapsed: 0.84 s
testCheckTwo(org.eclipse.egit.ui.test.history.GitHistoryRefFilterConfigurationDialogTest)  Time elapsed: 0.72 s
testButtonCurrentBranch(org.eclipse.egit.ui.test.history.GitHistoryRefFilterConfigurationDialogTest)  Time elapsed: 0.739 s
testUncheckOne(org.eclipse.egit.ui.test.history.GitHistoryRefFilterConfigurationDialogTest)  Time elapsed: 0.75 s
testUncheckTwo(org.eclipse.egit.ui.test.history.GitHistoryRefFilterConfigurationDialogTest)  Time elapsed: 0.738 s
testCancelAfterUncheck(org.eclipse.egit.ui.test.history.GitHistoryRefFilterConfigurationDialogTest)  Time elapsed: 1.115 s
testButtonAllBranches(org.eclipse.egit.ui.test.history.GitHistoryRefFilterConfigurationDialogTest)  Time elapsed: 0.726 s
testAdd(org.eclipse.egit.ui.test.history.GitHistoryRefFilterConfigurationDialogTest)  Time elapsed: 0.74 s
testEdit(org.eclipse.egit.ui.test.history.GitHistoryRefFilterConfigurationDialogTest)  Time elapsed: 0.842 s
testCancelAfterButtonHead(org.eclipse.egit.ui.test.history.GitHistoryRefFilterConfigurationDialogTest)  Time elapsed: 0.814 s
testButtonHead(org.eclipse.egit.ui.test.history.GitHistoryRefFilterConfigurationDialogTest)  Time elapsed: 0.792 s
testButtonRestoreDefaultsAndOk(org.eclipse.egit.ui.test.history.GitHistoryRefFilterConfigurationDialogTest)  Time elapsed: 0.699 s
testCancelAfterCheck(org.eclipse.egit.ui.test.history.GitHistoryRefFilterConfigurationDialogTest)  Time elapsed: 0.713 s
testButtonRestoreDefaultsAndCancel(org.eclipse.egit.ui.test.history.GitHistoryRefFilterConfigurationDialogTest)  Time elapsed: 1.225 s
testCancelAfterEdit(org.eclipse.egit.ui.test.history.GitHistoryRefFilterConfigurationDialogTest)  Time elapsed: 0.769 s
testAddRef(org.eclipse.egit.ui.test.history.GitHistoryRefFilterConfigurationDialogTest)  Time elapsed: 0.845 s
testCancel(org.eclipse.egit.ui.test.history.GitHistoryRefFilterConfigurationDialogTest)  Time elapsed: 0.721 s
testInitialTableContent(org.eclipse.egit.ui.test.history.GitHistoryRefFilterConfigurationDialogTest)  Time elapsed: 0.721 s
testRemove(org.eclipse.egit.ui.test.history.GitHistoryRefFilterConfigurationDialogTest)  Time elapsed: 0.751 s
testButtonRestoreDefaults(org.eclipse.egit.ui.test.history.GitHistoryRefFilterConfigurationDialogTest)  Time elapsed: 0.747 s
testUncheckAndCheck(org.eclipse.egit.ui.test.history.GitHistoryRefFilterConfigurationDialogTest)  Time elapsed: 0.725 s
testDoubleClick(org.eclipse.egit.ui.test.history.GitHistoryRefFilterConfigurationDialogTest)  Time elapsed: 0.815 s
testCancelAfterAdd(org.eclipse.egit.ui.test.history.GitHistoryRefFilterConfigurationDialogTest)  Time elapsed: 0.737 s
Running org.eclipse.egit.ui.test.history.RefFilterHelperTest
Tests run: 23, Failures: 0, Errors: 0, Skipped: 0, Time elapsed: 18.974 s - in org.eclipse.egit.ui.test.history.RefFilterHelperTest
testSetConfiguredFiltersNoSave(org.eclipse.egit.ui.test.history.RefFilterHelperTest)  Time elapsed: 0.818 s
testSetLastSelectedFiltersWithSave(org.eclipse.egit.ui.test.history.RefFilterHelperTest)  Time elapsed: 0.807 s
testGetConfiguredFilters(org.eclipse.egit.ui.test.history.RefFilterHelperTest)  Time elapsed: 0.636 s
testIsOnlyCurrentBranchSelected(org.eclipse.egit.ui.test.history.RefFilterHelperTest)  Time elapsed: 0.746 s
testSelectExactlyAllBranchesAndTags(org.eclipse.egit.ui.test.history.RefFilterHelperTest)  Time elapsed: 0.673 s
testIsOnlyHEADSelected(org.eclipse.egit.ui.test.history.RefFilterHelperTest)  Time elapsed: 0.658 s
testIsExactlyAllBranchesAndTagsSelected(org.eclipse.egit.ui.test.history.RefFilterHelperTest)  Time elapsed: 0.676 s
testSelectOnlyCurrentBranch(org.eclipse.egit.ui.test.history.RefFilterHelperTest)  Time elapsed: 0.654 s
testGetFilters(org.eclipse.egit.ui.test.history.RefFilterHelperTest)  Time elapsed: 0.663 s
testSetConfiguredFiltersWithSave(org.eclipse.egit.ui.test.history.RefFilterHelperTest)  Time elapsed: 0.66 s
testResetLastSelectionStateToDefault(org.eclipse.egit.ui.test.history.RefFilterHelperTest)  Time elapsed: 0.765 s
testGetSelectedFilters(org.eclipse.egit.ui.test.history.RefFilterHelperTest)  Time elapsed: 0.659 s
testSetSelectedFiltersNoSave(org.eclipse.egit.ui.test.history.RefFilterHelperTest)  Time elapsed: 1.362 s
testSaveSelectionStateAsLastSelectionState(org.eclipse.egit.ui.test.history.RefFilterHelperTest)  Time elapsed: 0.684 s
testSetSelectedFiltersWithSave(org.eclipse.egit.ui.test.history.RefFilterHelperTest)  Time elapsed: 0.667 s
testSetFilters(org.eclipse.egit.ui.test.history.RefFilterHelperTest)  Time elapsed: 0.685 s
testSetLastSelectedFiltersNoSave(org.eclipse.egit.ui.test.history.RefFilterHelperTest)  Time elapsed: 3.096 s
testRestoreLastSelectionState(org.eclipse.egit.ui.test.history.RefFilterHelperTest)  Time elapsed: 0.655 s
testGetMatchingRefsForSelectedRefFilters(org.eclipse.egit.ui.test.history.RefFilterHelperTest)  Time elapsed: 0.669 s
testSelectOnlyHEAD(org.eclipse.egit.ui.test.history.RefFilterHelperTest)  Time elapsed: 0.651 s
testGetLastSelectedFilters(org.eclipse.egit.ui.test.history.RefFilterHelperTest)  Time elapsed: 0.647 s
testConstructor(org.eclipse.egit.ui.test.history.RefFilterHelperTest)  Time elapsed: 0.63 s
testGetDefaults(org.eclipse.egit.ui.test.history.RefFilterHelperTest)  Time elapsed: 0.635 s
Running org.eclipse.egit.ui.test.commit.CommitEditorInputFactoryTest
Tests run: 2, Failures: 0, Errors: 0, Skipped: 0, Time elapsed: 1.136 s - in org.eclipse.egit.ui.test.commit.CommitEditorInputFactoryTest
shouldPersistAndRestoreStashCommit(org.eclipse.egit.ui.test.commit.CommitEditorInputFactoryTest)  Time elapsed: 0.557 s
shouldPersistAndRestoreCommit(org.eclipse.egit.ui.test.commit.CommitEditorInputFactoryTest)  Time elapsed: 0.566 s
Running org.eclipse.egit.ui.test.commit.CommitEditorTest

(SWT:1751): Gtk-WARNING **: 17:53:49.138: Negative content width -6 (allocation 1, extents 4x3) while allocating gadget (node toolbar, owner GtkToolbar)

(SWT:1751): Gtk-WARNING **: 17:53:49.138: Negative content height -3 (allocation 1, extents 2x2) while allocating gadget (node toolbar, owner GtkToolbar)

(SWT:1751): Gtk-WARNING **: 17:53:49.138: Negative content width -6 (allocation 1, extents 4x3) while allocating gadget (node toolbar, owner GtkToolbar)

(SWT:1751): Gtk-WARNING **: 17:53:49.138: Negative content height -3 (allocation 1, extents 2x2) while allocating gadget (node toolbar, owner GtkToolbar)

(SWT:1751): Gtk-WARNING **: 17:53:49.328: Negative content width -6 (allocation 1, extents 4x3) while allocating gadget (node toolbar, owner GtkToolbar)

(SWT:1751): Gtk-WARNING **: 17:53:49.370: Negative content width -6 (allocation 1, extents 4x3) while allocating gadget (node toolbar, owner GtkToolbar)

(SWT:1751): Gtk-CRITICAL **: 17:53:49.441: gtk_box_gadget_distribute: assertion 'size >= 0' failed in GtkScrollbar

(SWT:1751): Gtk-CRITICAL **: 17:53:49.441: gtk_box_gadget_distribute: assertion 'size >= 0' failed in GtkScrollbar

(SWT:1751): Gtk-CRITICAL **: 17:53:49.477: gtk_box_gadget_distribute: assertion 'size >= 0' failed in GtkScrollbar

(SWT:1751): Gtk-CRITICAL **: 17:53:49.477: gtk_box_gadget_distribute: assertion 'size >= 0' failed in GtkScrollbar

(SWT:1751): Gtk-CRITICAL **: 17:53:49.495: gtk_box_gadget_distribute: assertion 'size >= 0' failed in GtkScrollbar

(SWT:1751): Gtk-CRITICAL **: 17:53:49.495: gtk_box_gadget_distribute: assertion 'size >= 0' failed in GtkScrollbar

(SWT:1751): Gtk-CRITICAL **: 17:53:49.498: gtk_box_gadget_distribute: assertion 'size >= 0' failed in GtkScrollbar

(SWT:1751): Gtk-CRITICAL **: 17:53:49.498: gtk_box_gadget_distribute: assertion 'size >= 0' failed in GtkScrollbar

(SWT:1751): Gtk-CRITICAL **: 17:53:49.530: gtk_box_gadget_distribute: assertion 'size >= 0' failed in GtkScrollbar

(SWT:1751): Gtk-CRITICAL **: 17:53:49.530: gtk_box_gadget_distribute: assertion 'size >= 0' failed in GtkScrollbar

(SWT:1751): Gtk-CRITICAL **: 17:53:49.535: gtk_box_gadget_distribute: assertion 'size >= 0' failed in GtkScrollbar

(SWT:1751): Gtk-CRITICAL **: 17:53:49.535: gtk_box_gadget_distribute: assertion 'size >= 0' failed in GtkScrollbar

(SWT:1751): Gtk-WARNING **: 17:53:49.542: Negative content width -6 (allocation 1, extents 4x3) while allocating gadget (node toolbar, owner GtkToolbar)

(SWT:1751): Gtk-WARNING **: 17:53:49.542: Negative content height -3 (allocation 1, extents 2x2) while allocating gadget (node toolbar, owner GtkToolbar)

(SWT:1751): Gtk-WARNING **: 17:53:49.542: Negative content width -6 (allocation 1, extents 4x3) while allocating gadget (node toolbar, owner GtkToolbar)

(SWT:1751): Gtk-WARNING **: 17:53:49.542: Negative content height -3 (allocation 1, extents 2x2) while allocating gadget (node toolbar, owner GtkToolbar)

(SWT:1751): Gtk-WARNING **: 17:53:50.386: Negative content width -6 (allocation 1, extents 4x3) while allocating gadget (node toolbar, owner GtkToolbar)

(SWT:1751): Gtk-WARNING **: 17:53:50.386: Negative content height -3 (allocation 1, extents 2x2) while allocating gadget (node toolbar, owner GtkToolbar)

(SWT:1751): Gtk-WARNING **: 17:53:50.386: Negative content width -6 (allocation 1, extents 4x3) while allocating gadget (node toolbar, owner GtkToolbar)

(SWT:1751): Gtk-WARNING **: 17:53:50.386: Negative content height -3 (allocation 1, extents 2x2) while allocating gadget (node toolbar, owner GtkToolbar)

(SWT:1751): Gtk-WARNING **: 17:53:50.525: Negative content width -6 (allocation 1, extents 4x3) while allocating gadget (node toolbar, owner GtkToolbar)

(SWT:1751): Gtk-WARNING **: 17:53:50.562: Negative content width -6 (allocation 1, extents 4x3) while allocating gadget (node toolbar, owner GtkToolbar)

(SWT:1751): Gtk-CRITICAL **: 17:53:50.637: gtk_box_gadget_distribute: assertion 'size >= 0' failed in GtkScrollbar

(SWT:1751): Gtk-CRITICAL **: 17:53:50.637: gtk_box_gadget_distribute: assertion 'size >= 0' failed in GtkScrollbar

(SWT:1751): Gtk-CRITICAL **: 17:53:50.661: gtk_box_gadget_distribute: assertion 'size >= 0' failed in GtkScrollbar

(SWT:1751): Gtk-CRITICAL **: 17:53:50.661: gtk_box_gadget_distribute: assertion 'size >= 0' failed in GtkScrollbar

(SWT:1751): Gtk-CRITICAL **: 17:53:50.689: gtk_box_gadget_distribute: assertion 'size >= 0' failed in GtkScrollbar

(SWT:1751): Gtk-CRITICAL **: 17:53:50.689: gtk_box_gadget_distribute: assertion 'size >= 0' failed in GtkScrollbar

(SWT:1751): Gtk-CRITICAL **: 17:53:50.705: gtk_box_gadget_distribute: assertion 'size >= 0' failed in GtkScrollbar

(SWT:1751): Gtk-CRITICAL **: 17:53:50.705: gtk_box_gadget_distribute: assertion 'size >= 0' failed in GtkScrollbar
Tests run: 2, Failures: 0, Errors: 0, Skipped: 0, Time elapsed: 3.961 s - in org.eclipse.egit.ui.test.commit.CommitEditorTest
showAnnotations(org.eclipse.egit.ui.test.commit.CommitEditorTest)  Time elapsed: 1.387 s
openAllEditorPagesOnValidCommit(org.eclipse.egit.ui.test.commit.CommitEditorTest)  Time elapsed: 2.561 s
Running org.eclipse.egit.ui.test.commit.DiffRegionFormatterTest
Tests run: 1, Failures: 0, Errors: 0, Skipped: 0, Time elapsed: 0.593 s - in org.eclipse.egit.ui.test.commit.DiffRegionFormatterTest
testRanges(org.eclipse.egit.ui.test.commit.DiffRegionFormatterTest)  Time elapsed: 0.585 s
Running org.eclipse.egit.ui.test.commit.CommitEditorInputTest
Tests run: 3, Failures: 0, Errors: 0, Skipped: 0, Time elapsed: 8.962 s - in org.eclipse.egit.ui.test.commit.CommitEditorInputTest
testInput(org.eclipse.egit.ui.test.commit.CommitEditorInputTest)  Time elapsed: 0.931 s
testAdapters(org.eclipse.egit.ui.test.commit.CommitEditorInputTest)  Time elapsed: 4.707 s
testConstructorAsserts(org.eclipse.egit.ui.test.commit.CommitEditorInputTest)  Time elapsed: 3.303 s
Running org.eclipse.egit.ui.test.commit.RepositoryCommitTest
Tests run: 4, Failures: 0, Errors: 0, Skipped: 0, Time elapsed: 2.635 s - in org.eclipse.egit.ui.test.commit.RepositoryCommitTest
testDiffs(org.eclipse.egit.ui.test.commit.RepositoryCommitTest)  Time elapsed: 0.803 s
testAdapters(org.eclipse.egit.ui.test.commit.RepositoryCommitTest)  Time elapsed: 0.553 s
testGetters(org.eclipse.egit.ui.test.commit.RepositoryCommitTest)  Time elapsed: 0.575 s
testConstructorAsserts(org.eclipse.egit.ui.test.commit.RepositoryCommitTest)  Time elapsed: 0.681 s
Running org.eclipse.egit.ui.test.stagview.StagingViewTest

(SWT:1751): Gtk-WARNING **: 17:54:05.345: Negative content width -6 (allocation 1, extents 4x3) while allocating gadget (node toolbar, owner GtkToolbar)

(SWT:1751): Gtk-CRITICAL **: 17:54:05.883: gtk_box_gadget_distribute: assertion 'size >= 0' failed in GtkScrollbar

(SWT:1751): Gtk-CRITICAL **: 17:54:05.898: gtk_box_gadget_distribute: assertion 'size >= 0' failed in GtkScrollbar

(SWT:1751): Gtk-WARNING **: 17:54:05.906: Negative content width -6 (allocation 1, extents 4x3) while allocating gadget (node toolbar, owner GtkToolbar)

(SWT:1751): Gtk-CRITICAL **: 17:54:05.921: gtk_box_gadget_distribute: assertion 'size >= 0' failed in GtkScrollbar

(SWT:1751): Gtk-CRITICAL **: 17:54:05.931: gtk_box_gadget_distribute: assertion 'size >= 0' failed in GtkScrollbar

(SWT:1751): Gtk-CRITICAL **: 17:54:05.943: gtk_box_gadget_distribute: assertion 'size >= 0' failed in GtkScrollbar

(SWT:1751): Gtk-CRITICAL **: 17:54:05.946: gtk_box_gadget_distribute: assertion 'size >= 0' failed in GtkScrollbar

(SWT:1751): Gtk-CRITICAL **: 17:54:05.947: gtk_box_gadget_distribute: assertion 'size >= 0' failed in GtkScrollbar

(SWT:1751): Gtk-CRITICAL **: 17:54:05.954: gtk_box_gadget_distribute: assertion 'size >= 0' failed in GtkScrollbar

(SWT:1751): Gtk-CRITICAL **: 17:54:05.955: gtk_box_gadget_distribute: assertion 'size >= 0' failed in GtkScrollbar

(SWT:1751): Gtk-CRITICAL **: 17:54:05.971: gtk_box_gadget_distribute: assertion 'size >= 0' failed in GtkScrollbar

(SWT:1751): Gtk-CRITICAL **: 17:54:05.978: gtk_box_gadget_distribute: assertion 'size >= 0' failed in GtkScrollbar

(SWT:1751): Gtk-CRITICAL **: 17:54:05.978: gtk_box_gadget_distribute: assertion 'size >= 0' failed in GtkScrollbar

(SWT:1751): Gtk-CRITICAL **: 17:54:05.995: gtk_box_gadget_distribute: assertion 'size >= 0' failed in GtkScrollbar

(SWT:1751): Gtk-CRITICAL **: 17:54:05.995: gtk_box_gadget_distribute: assertion 'size >= 0' failed in GtkScrollbar

(SWT:1751): Gtk-CRITICAL **: 17:54:06.011: gtk_box_gadget_distribute: assertion 'size >= 0' failed in GtkScrollbar

(SWT:1751): Gtk-CRITICAL **: 17:54:06.011: gtk_box_gadget_distribute: assertion 'size >= 0' failed in GtkScrollbar

(SWT:1751): Gtk-CRITICAL **: 17:54:06.028: gtk_box_gadget_distribute: assertion 'size >= 0' failed in GtkScrollbar

(SWT:1751): Gtk-CRITICAL **: 17:54:06.028: gtk_box_gadget_distribute: assertion 'size >= 0' failed in GtkScrollbar

(SWT:1751): Gtk-CRITICAL **: 17:54:06.044: gtk_box_gadget_distribute: assertion 'size >= 0' failed in GtkScrollbar

(SWT:1751): Gtk-CRITICAL **: 17:54:06.045: gtk_box_gadget_distribute: assertion 'size >= 0' failed in GtkScrollbar

(SWT:1751): Gtk-CRITICAL **: 17:54:06.061: gtk_box_gadget_distribute: assertion 'size >= 0' failed in GtkScrollbar

(SWT:1751): Gtk-CRITICAL **: 17:54:06.061: gtk_box_gadget_distribute: assertion 'size >= 0' failed in GtkScrollbar

(SWT:1751): Gtk-CRITICAL **: 17:54:06.088: gtk_box_gadget_distribute: assertion 'size >= 0' failed in GtkScrollbar

(SWT:1751): Gtk-CRITICAL **: 17:54:06.100: gtk_box_gadget_distribute: assertion 'size >= 0' failed in GtkScrollbar

(SWT:1751): Gtk-CRITICAL **: 17:54:06.111: gtk_box_gadget_distribute: assertion 'size >= 0' failed in GtkScrollbar

(SWT:1751): Gtk-CRITICAL **: 17:54:06.128: gtk_box_gadget_distribute: assertion 'size >= 0' failed in GtkScrollbar

(SWT:1751): Gtk-CRITICAL **: 17:54:06.144: gtk_box_gadget_distribute: assertion 'size >= 0' failed in GtkScrollbar

(SWT:1751): Gtk-CRITICAL **: 17:54:06.160: gtk_box_gadget_distribute: assertion 'size >= 0' failed in GtkScrollbar

(SWT:1751): Gtk-CRITICAL **: 17:54:06.176: gtk_box_gadget_distribute: assertion 'size >= 0' failed in GtkScrollbar

(SWT:1751): Gtk-CRITICAL **: 17:54:06.198: gtk_box_gadget_distribute: assertion 'size >= 0' failed in GtkScrollbar

(SWT:1751): Gtk-CRITICAL **: 17:54:06.214: gtk_box_gadget_distribute: assertion 'size >= 0' failed in GtkScrollbar

(SWT:1751): Gtk-CRITICAL **: 17:54:06.230: gtk_box_gadget_distribute: assertion 'size >= 0' failed in GtkScrollbar

(SWT:1751): Gtk-CRITICAL **: 17:54:06.231: gtk_box_gadget_distribute: assertion 'size >= 0' failed in GtkScrollbar

(SWT:1751): Gtk-CRITICAL **: 17:54:06.233: gtk_box_gadget_distribute: assertion 'size >= 0' failed in GtkScrollbar

(SWT:1751): Gtk-CRITICAL **: 17:54:06.234: gtk_box_gadget_distribute: assertion 'size >= 0' failed in GtkScrollbar

(SWT:1751): Gtk-CRITICAL **: 17:54:06.238: gtk_box_gadget_distribute: assertion 'size >= 0' failed in GtkScrollbar

(SWT:1751): Gtk-CRITICAL **: 17:54:06.253: gtk_box_gadget_distribute: assertion 'size >= 0' failed in GtkScrollbar

(SWT:1751): Gtk-CRITICAL **: 17:54:06.261: gtk_box_gadget_distribute: assertion 'size >= 0' failed in GtkScrollbar

(SWT:1751): Gtk-CRITICAL **: 17:54:06.261: gtk_box_gadget_distribute: assertion 'size >= 0' failed in GtkScrollbar

(SWT:1751): Gtk-CRITICAL **: 17:54:06.264: gtk_box_gadget_distribute: assertion 'size >= 0' failed in GtkScrollbar

(SWT:1751): Gtk-CRITICAL **: 17:54:06.274: gtk_box_gadget_distribute: assertion 'size >= 0' failed in GtkScrollbar

(SWT:1751): Gtk-CRITICAL **: 17:54:06.274: gtk_box_gadget_distribute: assertion 'size >= 0' failed in GtkScrollbar

(SWT:1751): Gtk-CRITICAL **: 17:54:06.275: gtk_box_gadget_distribute: assertion 'size >= 0' failed in GtkScrollbar

(SWT:1751): Gtk-CRITICAL **: 17:54:06.279: gtk_box_gadget_distribute: assertion 'size >= 0' failed in GtkScrollbar

(SWT:1751): Gtk-CRITICAL **: 17:54:06.279: gtk_box_gadget_distribute: assertion 'size >= 0' failed in GtkScrollbar

(SWT:1751): Gtk-CRITICAL **: 17:54:06.280: gtk_box_gadget_distribute: assertion 'size >= 0' failed in GtkScrollbar

(SWT:1751): Gtk-CRITICAL **: 17:54:06.334: gtk_box_gadget_distribute: assertion 'size >= 0' failed in GtkScrollbar

(SWT:1751): Gtk-CRITICAL **: 17:54:06.334: gtk_box_gadget_distribute: assertion 'size >= 0' failed in GtkScrollbar

(SWT:1751): Gtk-CRITICAL **: 17:54:06.379: gtk_box_gadget_distribute: assertion 'size >= 0' failed in GtkScrollbar

(SWT:1751): Gtk-CRITICAL **: 17:54:06.388: gtk_box_gadget_distribute: assertion 'size >= 0' failed in GtkScrollbar

(SWT:1751): Gtk-CRITICAL **: 17:54:06.390: gtk_box_gadget_distribute: assertion 'size >= 0' failed in GtkScrollbar

(SWT:1751): Gtk-CRITICAL **: 17:54:06.391: gtk_box_gadget_distribute: assertion 'size >= 0' failed in GtkScrollbar

(SWT:1751): Gtk-CRITICAL **: 17:54:06.396: gtk_box_gadget_distribute: assertion 'size >= 0' failed in GtkScrollbar

(SWT:1751): Gtk-CRITICAL **: 17:54:06.408: gtk_box_gadget_distribute: assertion 'size >= 0' failed in GtkScrollbar

(SWT:1751): Gtk-CRITICAL **: 17:54:06.458: gtk_box_gadget_distribute: assertion 'size >= 0' failed in GtkScrollbar

(SWT:1751): Gtk-CRITICAL **: 17:54:06.460: gtk_box_gadget_distribute: assertion 'size >= 0' failed in GtkScrollbar

(SWT:1751): Gtk-CRITICAL **: 17:54:06.460: gtk_box_gadget_distribute: assertion 'size >= 0' failed in GtkScrollbar

(SWT:1751): Gtk-CRITICAL **: 17:54:06.465: gtk_box_gadget_distribute: assertion 'size >= 0' failed in GtkScrollbar

(SWT:1751): Gtk-CRITICAL **: 17:54:06.924: gtk_box_gadget_distribute: assertion 'size >= 0' failed in GtkScrollbar

(SWT:1751): Gtk-CRITICAL **: 17:54:06.937: gtk_box_gadget_distribute: assertion 'size >= 0' failed in GtkScrollbar

(SWT:1751): Gtk-CRITICAL **: 17:54:06.957: gtk_box_gadget_distribute: assertion 'size >= 0' failed in GtkScrollbar

(SWT:1751): Gtk-CRITICAL **: 17:54:06.957: gtk_box_gadget_distribute: assertion 'size >= 0' failed in GtkScrollbar

(SWT:1751): Gtk-CRITICAL **: 17:54:06.960: gtk_box_gadget_distribute: assertion 'size >= 0' failed in GtkScrollbar

(SWT:1751): Gtk-CRITICAL **: 17:54:06.960: gtk_box_gadget_distribute: assertion 'size >= 0' failed in GtkScrollbar

(SWT:1751): Gtk-CRITICAL **: 17:54:06.965: gtk_box_gadget_distribute: assertion 'size >= 0' failed in GtkScrollbar

(SWT:1751): Gtk-CRITICAL **: 17:54:06.979: gtk_box_gadget_distribute: assertion 'size >= 0' failed in GtkScrollbar

(SWT:1751): Gtk-CRITICAL **: 17:54:07.036: gtk_box_gadget_distribute: assertion 'size >= 0' failed in GtkScrollbar

(SWT:1751): Gtk-CRITICAL **: 17:54:07.037: gtk_box_gadget_distribute: assertion 'size >= 0' failed in GtkScrollbar

(SWT:1751): Gtk-CRITICAL **: 17:54:07.039: gtk_box_gadget_distribute: assertion 'size >= 0' failed in GtkScrollbar

(SWT:1751): Gtk-CRITICAL **: 17:54:07.081: gtk_box_gadget_distribute: assertion 'size >= 0' failed in GtkScrollbar

(SWT:1751): Gtk-CRITICAL **: 17:54:07.081: gtk_box_gadget_distribute: assertion 'size >= 0' failed in GtkScrollbar

(SWT:1751): Gtk-CRITICAL **: 17:54:07.187: gtk_box_gadget_distribute: assertion 'size >= 0' failed in GtkScrollbar

(SWT:1751): Gtk-CRITICAL **: 17:54:07.196: gtk_box_gadget_distribute: assertion 'size >= 0' failed in GtkScrollbar

(SWT:1751): Gtk-CRITICAL **: 17:54:07.199: gtk_box_gadget_distribute: assertion 'size >= 0' failed in GtkScrollbar

(SWT:1751): Gtk-CRITICAL **: 17:54:07.199: gtk_box_gadget_distribute: assertion 'size >= 0' failed in GtkScrollbar

(SWT:1751): Gtk-CRITICAL **: 17:54:07.213: gtk_box_gadget_distribute: assertion 'size >= 0' failed in GtkScrollbar

(SWT:1751): Gtk-CRITICAL **: 17:54:07.241: gtk_box_gadget_distribute: assertion 'size >= 0' failed in GtkScrollbar

(SWT:1751): Gtk-WARNING **: 17:54:07.302: Negative content width -6 (allocation 1, extents 4x3) while allocating gadget (node toolbar, owner GtkToolbar)

(SWT:1751): Gtk-WARNING **: 17:54:08.576: Negative content width -6 (allocation 1, extents 4x3) while allocating gadget (node toolbar, owner GtkToolbar)

(SWT:1751): Gtk-WARNING **: 17:54:08.596: Negative content width -6 (allocation 1, extents 4x3) while allocating gadget (node toolbar, owner GtkToolbar)

(SWT:1751): Gtk-WARNING **: 17:54:09.244: Negative content width -6 (allocation 1, extents 4x3) while allocating gadget (node toolbar, owner GtkToolbar)

(SWT:1751): Gtk-CRITICAL **: 17:54:09.813: gtk_box_gadget_distribute: assertion 'size >= 0' failed in GtkScrollbar

(SWT:1751): Gtk-CRITICAL **: 17:54:09.830: gtk_box_gadget_distribute: assertion 'size >= 0' failed in GtkScrollbar

(SWT:1751): Gtk-WARNING **: 17:54:09.837: Negative content width -6 (allocation 1, extents 4x3) while allocating gadget (node toolbar, owner GtkToolbar)

(SWT:1751): Gtk-CRITICAL **: 17:54:09.853: gtk_box_gadget_distribute: assertion 'size >= 0' failed in GtkScrollbar

(SWT:1751): Gtk-CRITICAL **: 17:54:09.865: gtk_box_gadget_distribute: assertion 'size >= 0' failed in GtkScrollbar

(SWT:1751): Gtk-CRITICAL **: 17:54:09.872: gtk_box_gadget_distribute: assertion 'size >= 0' failed in GtkScrollbar

(SWT:1751): Gtk-CRITICAL **: 17:54:09.876: gtk_box_gadget_distribute: assertion 'size >= 0' failed in GtkScrollbar

(SWT:1751): Gtk-CRITICAL **: 17:54:09.894: gtk_box_gadget_distribute: assertion 'size >= 0' failed in GtkScrollbar

(SWT:1751): Gtk-CRITICAL **: 17:54:09.896: gtk_box_gadget_distribute: assertion 'size >= 0' failed in GtkScrollbar

(SWT:1751): Gtk-CRITICAL **: 17:54:09.897: gtk_box_gadget_distribute: assertion 'size >= 0' failed in GtkScrollbar

(SWT:1751): Gtk-CRITICAL **: 17:54:09.906: gtk_box_gadget_distribute: assertion 'size >= 0' failed in GtkScrollbar

(SWT:1751): Gtk-CRITICAL **: 17:54:09.907: gtk_box_gadget_distribute: assertion 'size >= 0' failed in GtkScrollbar

(SWT:1751): Gtk-CRITICAL **: 17:54:09.921: gtk_box_gadget_distribute: assertion 'size >= 0' failed in GtkScrollbar

(SWT:1751): Gtk-CRITICAL **: 17:54:09.937: gtk_box_gadget_distribute: assertion 'size >= 0' failed in GtkScrollbar

(SWT:1751): Gtk-CRITICAL **: 17:54:09.937: gtk_box_gadget_distribute: assertion 'size >= 0' failed in GtkScrollbar

(SWT:1751): Gtk-CRITICAL **: 17:54:09.954: gtk_box_gadget_distribute: assertion 'size >= 0' failed in GtkScrollbar

(SWT:1751): Gtk-CRITICAL **: 17:54:09.954: gtk_box_gadget_distribute: assertion 'size >= 0' failed in GtkScrollbar

(SWT:1751): Gtk-CRITICAL **: 17:54:09.969: gtk_box_gadget_distribute: assertion 'size >= 0' failed in GtkScrollbar

(SWT:1751): Gtk-CRITICAL **: 17:54:09.970: gtk_box_gadget_distribute: assertion 'size >= 0' failed in GtkScrollbar

(SWT:1751): Gtk-CRITICAL **: 17:54:09.986: gtk_box_gadget_distribute: assertion 'size >= 0' failed in GtkScrollbar

(SWT:1751): Gtk-CRITICAL **: 17:54:09.987: gtk_box_gadget_distribute: assertion 'size >= 0' failed in GtkScrollbar

(SWT:1751): Gtk-CRITICAL **: 17:54:10.003: gtk_box_gadget_distribute: assertion 'size >= 0' failed in GtkScrollbar

(SWT:1751): Gtk-CRITICAL **: 17:54:10.021: gtk_box_gadget_distribute: assertion 'size >= 0' failed in GtkScrollbar

(SWT:1751): Gtk-CRITICAL **: 17:54:10.072: gtk_box_gadget_distribute: assertion 'size >= 0' failed in GtkScrollbar

(SWT:1751): Gtk-CRITICAL **: 17:54:10.091: gtk_box_gadget_distribute: assertion 'size >= 0' failed in GtkScrollbar

(SWT:1751): Gtk-CRITICAL **: 17:54:10.115: gtk_box_gadget_distribute: assertion 'size >= 0' failed in GtkScrollbar

(SWT:1751): Gtk-CRITICAL **: 17:54:10.116: gtk_box_gadget_distribute: assertion 'size >= 0' failed in GtkScrollbar

(SWT:1751): Gtk-CRITICAL **: 17:54:10.118: gtk_box_gadget_distribute: assertion 'size >= 0' failed in GtkScrollbar

(SWT:1751): Gtk-CRITICAL **: 17:54:10.119: gtk_box_gadget_distribute: assertion 'size >= 0' failed in GtkScrollbar

(SWT:1751): Gtk-CRITICAL **: 17:54:10.124: gtk_box_gadget_distribute: assertion 'size >= 0' failed in GtkScrollbar

(SWT:1751): Gtk-CRITICAL **: 17:54:10.138: gtk_box_gadget_distribute: assertion 'size >= 0' failed in GtkScrollbar

(SWT:1751): Gtk-CRITICAL **: 17:54:10.191: gtk_box_gadget_distribute: assertion 'size >= 0' failed in GtkScrollbar

(SWT:1751): Gtk-CRITICAL **: 17:54:10.192: gtk_box_gadget_distribute: assertion 'size >= 0' failed in GtkScrollbar

(SWT:1751): Gtk-CRITICAL **: 17:54:10.202: gtk_box_gadget_distribute: assertion 'size >= 0' failed in GtkScrollbar

(SWT:1751): Gtk-CRITICAL **: 17:54:10.221: gtk_box_gadget_distribute: assertion 'size >= 0' failed in GtkScrollbar

(SWT:1751): Gtk-CRITICAL **: 17:54:10.221: gtk_box_gadget_distribute: assertion 'size >= 0' failed in GtkScrollbar

(SWT:1751): Gtk-CRITICAL **: 17:54:10.358: gtk_box_gadget_distribute: assertion 'size >= 0' failed in GtkScrollbar

(SWT:1751): Gtk-CRITICAL **: 17:54:10.368: gtk_box_gadget_distribute: assertion 'size >= 0' failed in GtkScrollbar

(SWT:1751): Gtk-CRITICAL **: 17:54:10.370: gtk_box_gadget_distribute: assertion 'size >= 0' failed in GtkScrollbar

(SWT:1751): Gtk-CRITICAL **: 17:54:10.371: gtk_box_gadget_distribute: assertion 'size >= 0' failed in GtkScrollbar

(SWT:1751): Gtk-CRITICAL **: 17:54:10.377: gtk_box_gadget_distribute: assertion 'size >= 0' failed in GtkScrollbar

(SWT:1751): Gtk-CRITICAL **: 17:54:10.390: gtk_box_gadget_distribute: assertion 'size >= 0' failed in GtkScrollbar

(SWT:1751): Gtk-WARNING **: 17:54:10.549: Negative content width -6 (allocation 1, extents 4x3) while allocating gadget (node toolbar, owner GtkToolbar)

(SWT:1751): Gtk-WARNING **: 17:54:11.421: Negative content width -6 (allocation 1, extents 4x3) while allocating gadget (node toolbar, owner GtkToolbar)

(SWT:1751): Gtk-WARNING **: 17:54:11.444: Negative content width -6 (allocation 1, extents 4x3) while allocating gadget (node toolbar, owner GtkToolbar)

(SWT:1751): Gtk-WARNING **: 17:54:12.169: Negative content width -6 (allocation 1, extents 4x3) while allocating gadget (node toolbar, owner GtkToolbar)

(SWT:1751): Gtk-CRITICAL **: 17:54:12.743: gtk_box_gadget_distribute: assertion 'size >= 0' failed in GtkScrollbar

(SWT:1751): Gtk-CRITICAL **: 17:54:12.762: gtk_box_gadget_distribute: assertion 'size >= 0' failed in GtkScrollbar

(SWT:1751): Gtk-WARNING **: 17:54:12.770: Negative content width -6 (allocation 1, extents 4x3) while allocating gadget (node toolbar, owner GtkToolbar)

(SWT:1751): Gtk-CRITICAL **: 17:54:12.789: gtk_box_gadget_distribute: assertion 'size >= 0' failed in GtkScrollbar

(SWT:1751): Gtk-CRITICAL **: 17:54:12.803: gtk_box_gadget_distribute: assertion 'size >= 0' failed in GtkScrollbar

(SWT:1751): Gtk-CRITICAL **: 17:54:12.812: gtk_box_gadget_distribute: assertion 'size >= 0' failed in GtkScrollbar

(SWT:1751): Gtk-CRITICAL **: 17:54:12.821: gtk_box_gadget_distribute: assertion 'size >= 0' failed in GtkScrollbar

(SWT:1751): Gtk-CRITICAL **: 17:54:12.827: gtk_box_gadget_distribute: assertion 'size >= 0' failed in GtkScrollbar

(SWT:1751): Gtk-CRITICAL **: 17:54:12.849: gtk_box_gadget_distribute: assertion 'size >= 0' failed in GtkScrollbar

(SWT:1751): Gtk-CRITICAL **: 17:54:12.852: gtk_box_gadget_distribute: assertion 'size >= 0' failed in GtkScrollbar

(SWT:1751): Gtk-CRITICAL **: 17:54:12.853: gtk_box_gadget_distribute: assertion 'size >= 0' failed in GtkScrollbar

(SWT:1751): Gtk-CRITICAL **: 17:54:12.861: gtk_box_gadget_distribute: assertion 'size >= 0' failed in GtkScrollbar

(SWT:1751): Gtk-CRITICAL **: 17:54:12.862: gtk_box_gadget_distribute: assertion 'size >= 0' failed in GtkScrollbar

(SWT:1751): Gtk-CRITICAL **: 17:54:12.881: gtk_box_gadget_distribute: assertion 'size >= 0' failed in GtkScrollbar

(SWT:1751): Gtk-CRITICAL **: 17:54:12.884: gtk_box_gadget_distribute: assertion 'size >= 0' failed in GtkScrollbar

(SWT:1751): Gtk-CRITICAL **: 17:54:12.885: gtk_box_gadget_distribute: assertion 'size >= 0' failed in GtkScrollbar

(SWT:1751): Gtk-CRITICAL **: 17:54:12.902: gtk_box_gadget_distribute: assertion 'size >= 0' failed in GtkScrollbar

(SWT:1751): Gtk-CRITICAL **: 17:54:12.902: gtk_box_gadget_distribute: assertion 'size >= 0' failed in GtkScrollbar

(SWT:1751): Gtk-CRITICAL **: 17:54:12.917: gtk_box_gadget_distribute: assertion 'size >= 0' failed in GtkScrollbar

(SWT:1751): Gtk-CRITICAL **: 17:54:13.054: gtk_box_gadget_distribute: assertion 'size >= 0' failed in GtkScrollbar

(SWT:1751): Gtk-CRITICAL **: 17:54:13.067: gtk_box_gadget_distribute: assertion 'size >= 0' failed in GtkScrollbar

(SWT:1751): Gtk-CRITICAL **: 17:54:13.083: gtk_box_gadget_distribute: assertion 'size >= 0' failed in GtkScrollbar

(SWT:1751): Gtk-CRITICAL **: 17:54:13.099: gtk_box_gadget_distribute: assertion 'size >= 0' failed in GtkScrollbar

(SWT:1751): Gtk-CRITICAL **: 17:54:13.116: gtk_box_gadget_distribute: assertion 'size >= 0' failed in GtkScrollbar

(SWT:1751): Gtk-CRITICAL **: 17:54:13.144: gtk_box_gadget_distribute: assertion 'size >= 0' failed in GtkScrollbar

(SWT:1751): Gtk-CRITICAL **: 17:54:13.175: gtk_box_gadget_distribute: assertion 'size >= 0' failed in GtkScrollbar

(SWT:1751): Gtk-CRITICAL **: 17:54:13.175: gtk_box_gadget_distribute: assertion 'size >= 0' failed in GtkScrollbar

(SWT:1751): Gtk-CRITICAL **: 17:54:13.178: gtk_box_gadget_distribute: assertion 'size >= 0' failed in GtkScrollbar

(SWT:1751): Gtk-CRITICAL **: 17:54:13.179: gtk_box_gadget_distribute: assertion 'size >= 0' failed in GtkScrollbar

(SWT:1751): Gtk-CRITICAL **: 17:54:13.184: gtk_box_gadget_distribute: assertion 'size >= 0' failed in GtkScrollbar

(SWT:1751): Gtk-CRITICAL **: 17:54:13.201: gtk_box_gadget_distribute: assertion 'size >= 0' failed in GtkScrollbar

(SWT:1751): Gtk-CRITICAL **: 17:54:13.207: gtk_box_gadget_distribute: assertion 'size >= 0' failed in GtkScrollbar

(SWT:1751): Gtk-CRITICAL **: 17:54:13.208: gtk_box_gadget_distribute: assertion 'size >= 0' failed in GtkScrollbar

(SWT:1751): Gtk-CRITICAL **: 17:54:13.219: gtk_box_gadget_distribute: assertion 'size >= 0' failed in GtkScrollbar

(SWT:1751): Gtk-CRITICAL **: 17:54:13.220: gtk_box_gadget_distribute: assertion 'size >= 0' failed in GtkScrollbar

(SWT:1751): Gtk-CRITICAL **: 17:54:13.221: gtk_box_gadget_distribute: assertion 'size >= 0' failed in GtkScrollbar

(SWT:1751): Gtk-CRITICAL **: 17:54:13.222: gtk_box_gadget_distribute: assertion 'size >= 0' failed in GtkScrollbar

(SWT:1751): Gtk-CRITICAL **: 17:54:13.272: gtk_box_gadget_distribute: assertion 'size >= 0' failed in GtkScrollbar

(SWT:1751): Gtk-CRITICAL **: 17:54:13.272: gtk_box_gadget_distribute: assertion 'size >= 0' failed in GtkScrollbar

(SWT:1751): Gtk-CRITICAL **: 17:54:13.274: gtk_box_gadget_distribute: assertion 'size >= 0' failed in GtkScrollbar

(SWT:1751): Gtk-CRITICAL **: 17:54:13.298: gtk_box_gadget_distribute: assertion 'size >= 0' failed in GtkScrollbar

(SWT:1751): Gtk-CRITICAL **: 17:54:13.298: gtk_box_gadget_distribute: assertion 'size >= 0' failed in GtkScrollbar

(SWT:1751): Gtk-CRITICAL **: 17:54:13.374: gtk_box_gadget_distribute: assertion 'size >= 0' failed in GtkScrollbar

(SWT:1751): Gtk-CRITICAL **: 17:54:13.377: gtk_box_gadget_distribute: assertion 'size >= 0' failed in GtkScrollbar

(SWT:1751): Gtk-CRITICAL **: 17:54:13.377: gtk_box_gadget_distribute: assertion 'size >= 0' failed in GtkScrollbar

(SWT:1751): Gtk-CRITICAL **: 17:54:13.396: gtk_box_gadget_distribute: assertion 'size >= 0' failed in GtkScrollbar

(SWT:1751): Gtk-CRITICAL **: 17:54:13.399: gtk_box_gadget_distribute: assertion 'size >= 0' failed in GtkScrollbar

(SWT:1751): Gtk-CRITICAL **: 17:54:13.399: gtk_box_gadget_distribute: assertion 'size >= 0' failed in GtkScrollbar

(SWT:1751): Gtk-CRITICAL **: 17:54:13.417: gtk_box_gadget_distribute: assertion 'size >= 0' failed in GtkScrollbar

(SWT:1751): Gtk-CRITICAL **: 17:54:13.503: gtk_box_gadget_distribute: assertion 'size >= 0' failed in GtkScrollbar

(SWT:1751): Gtk-CRITICAL **: 17:54:13.505: gtk_box_gadget_distribute: assertion 'size >= 0' failed in GtkScrollbar

(SWT:1751): Gtk-CRITICAL **: 17:54:13.506: gtk_box_gadget_distribute: assertion 'size >= 0' failed in GtkScrollbar

(SWT:1751): Gtk-CRITICAL **: 17:54:13.534: gtk_box_gadget_distribute: assertion 'size >= 0' failed in GtkScrollbar

(SWT:1751): Gtk-CRITICAL **: 17:54:13.536: gtk_box_gadget_distribute: assertion 'size >= 0' failed in GtkScrollbar

(SWT:1751): Gtk-CRITICAL **: 17:54:13.537: gtk_box_gadget_distribute: assertion 'size >= 0' failed in GtkScrollbar

(SWT:1751): Gtk-CRITICAL **: 17:54:13.566: gtk_box_gadget_distribute: assertion 'size >= 0' failed in GtkScrollbar

(SWT:1751): Gtk-CRITICAL **: 17:54:13.755: gtk_box_gadget_distribute: assertion 'size >= 0' failed in GtkScrollbar

(SWT:1751): Gtk-CRITICAL **: 17:54:13.777: gtk_box_gadget_distribute: assertion 'size >= 0' failed in GtkScrollbar

(SWT:1751): Gtk-CRITICAL **: 17:54:13.796: gtk_box_gadget_distribute: assertion 'size >= 0' failed in GtkScrollbar

(SWT:1751): Gtk-CRITICAL **: 17:54:13.815: gtk_box_gadget_distribute: assertion 'size >= 0' failed in GtkScrollbar

(SWT:1751): Gtk-CRITICAL **: 17:54:13.815: gtk_box_gadget_distribute: assertion 'size >= 0' failed in GtkScrollbar

(SWT:1751): Gtk-CRITICAL **: 17:54:13.819: gtk_box_gadget_distribute: assertion 'size >= 0' failed in GtkScrollbar

(SWT:1751): Gtk-CRITICAL **: 17:54:13.819: gtk_box_gadget_distribute: assertion 'size >= 0' failed in GtkScrollbar

(SWT:1751): Gtk-CRITICAL **: 17:54:13.824: gtk_box_gadget_distribute: assertion 'size >= 0' failed in GtkScrollbar

(SWT:1751): Gtk-CRITICAL **: 17:54:13.848: gtk_box_gadget_distribute: assertion 'size >= 0' failed in GtkScrollbar

(SWT:1751): Gtk-CRITICAL **: 17:54:13.887: gtk_box_gadget_distribute: assertion 'size >= 0' failed in GtkScrollbar

(SWT:1751): Gtk-CRITICAL **: 17:54:13.888: gtk_box_gadget_distribute: assertion 'size >= 0' failed in GtkScrollbar

(SWT:1751): Gtk-CRITICAL **: 17:54:13.901: gtk_box_gadget_distribute: assertion 'size >= 0' failed in GtkScrollbar

(SWT:1751): Gtk-CRITICAL **: 17:54:13.903: gtk_box_gadget_distribute: assertion 'size >= 0' failed in GtkScrollbar

(SWT:1751): Gtk-CRITICAL **: 17:54:13.904: gtk_box_gadget_distribute: assertion 'size >= 0' failed in GtkScrollbar

(SWT:1751): Gtk-CRITICAL **: 17:54:13.905: gtk_box_gadget_distribute: assertion 'size >= 0' failed in GtkScrollbar

(SWT:1751): Gtk-CRITICAL **: 17:54:13.956: gtk_box_gadget_distribute: assertion 'size >= 0' failed in GtkScrollbar

(SWT:1751): Gtk-CRITICAL **: 17:54:13.957: gtk_box_gadget_distribute: assertion 'size >= 0' failed in GtkScrollbar

(SWT:1751): Gtk-CRITICAL **: 17:54:13.958: gtk_box_gadget_distribute: assertion 'size >= 0' failed in GtkScrollbar

(SWT:1751): Gtk-CRITICAL **: 17:54:13.997: gtk_box_gadget_distribute: assertion 'size >= 0' failed in GtkScrollbar

(SWT:1751): Gtk-CRITICAL **: 17:54:13.997: gtk_box_gadget_distribute: assertion 'size >= 0' failed in GtkScrollbar

(SWT:1751): Gtk-CRITICAL **: 17:54:14.123: gtk_box_gadget_distribute: assertion 'size >= 0' failed in GtkScrollbar

(SWT:1751): Gtk-CRITICAL **: 17:54:14.134: gtk_box_gadget_distribute: assertion 'size >= 0' failed in GtkScrollbar

(SWT:1751): Gtk-CRITICAL **: 17:54:14.136: gtk_box_gadget_distribute: assertion 'size >= 0' failed in GtkScrollbar

(SWT:1751): Gtk-CRITICAL **: 17:54:14.136: gtk_box_gadget_distribute: assertion 'size >= 0' failed in GtkScrollbar

(SWT:1751): Gtk-CRITICAL **: 17:54:14.152: gtk_box_gadget_distribute: assertion 'size >= 0' failed in GtkScrollbar

(SWT:1751): Gtk-CRITICAL **: 17:54:14.167: gtk_box_gadget_distribute: assertion 'size >= 0' failed in GtkScrollbar

(SWT:1751): Gtk-CRITICAL **: 17:54:14.185: gtk_box_gadget_distribute: assertion 'size >= 0' failed in GtkScrollbar

(SWT:1751): Gtk-CRITICAL **: 17:54:14.187: gtk_box_gadget_distribute: assertion 'size >= 0' failed in GtkScrollbar

(SWT:1751): Gtk-CRITICAL **: 17:54:14.187: gtk_box_gadget_distribute: assertion 'size >= 0' failed in GtkScrollbar

(SWT:1751): Gtk-CRITICAL **: 17:54:14.224: gtk_box_gadget_distribute: assertion 'size >= 0' failed in GtkScrollbar

(SWT:1751): Gtk-CRITICAL **: 17:54:14.779: gtk_box_gadget_distribute: assertion 'size >= 0' failed in GtkScrollbar

(SWT:1751): Gtk-CRITICAL **: 17:54:14.780: gtk_box_gadget_distribute: assertion 'size >= 0' failed in GtkScrollbar

(SWT:1751): Gtk-CRITICAL **: 17:54:14.781: gtk_box_gadget_distribute: assertion 'size >= 0' failed in GtkScrollbar

(SWT:1751): Gtk-CRITICAL **: 17:54:14.806: gtk_box_gadget_distribute: assertion 'size >= 0' failed in GtkScrollbar

(SWT:1751): Gtk-CRITICAL **: 17:54:14.847: gtk_box_gadget_distribute: assertion 'size >= 0' failed in GtkScrollbar

(SWT:1751): Gtk-CRITICAL **: 17:54:14.857: gtk_box_gadget_distribute: assertion 'size >= 0' failed in GtkScrollbar

(SWT:1751): Gtk-CRITICAL **: 17:54:14.866: gtk_box_gadget_distribute: assertion 'size >= 0' failed in GtkScrollbar

(SWT:1751): Gtk-CRITICAL **: 17:54:14.886: gtk_box_gadget_distribute: assertion 'size >= 0' failed in GtkScrollbar

(SWT:1751): Gtk-CRITICAL **: 17:54:14.920: gtk_box_gadget_distribute: assertion 'size >= 0' failed in GtkScrollbar

(SWT:1751): Gtk-CRITICAL **: 17:54:14.921: gtk_box_gadget_distribute: assertion 'size >= 0' failed in GtkScrollbar

(SWT:1751): Gtk-CRITICAL **: 17:54:14.924: gtk_box_gadget_distribute: assertion 'size >= 0' failed in GtkScrollbar

(SWT:1751): Gtk-CRITICAL **: 17:54:14.925: gtk_box_gadget_distribute: assertion 'size >= 0' failed in GtkScrollbar

(SWT:1751): Gtk-CRITICAL **: 17:54:14.927: gtk_box_gadget_distribute: assertion 'size >= 0' failed in GtkScrollbar

(SWT:1751): Gtk-CRITICAL **: 17:54:14.928: gtk_box_gadget_distribute: assertion 'size >= 0' failed in GtkScrollbar

(SWT:1751): Gtk-CRITICAL **: 17:54:14.939: gtk_box_gadget_distribute: assertion 'size >= 0' failed in GtkScrollbar

(SWT:1751): Gtk-CRITICAL **: 17:54:14.966: gtk_box_gadget_distribute: assertion 'size >= 0' failed in GtkScrollbar

(SWT:1751): Gtk-CRITICAL **: 17:54:14.990: gtk_box_gadget_distribute: assertion 'size >= 0' failed in GtkScrollbar

(SWT:1751): Gtk-CRITICAL **: 17:54:14.990: gtk_box_gadget_distribute: assertion 'size >= 0' failed in GtkScrollbar

(SWT:1751): Gtk-CRITICAL **: 17:54:15.154: gtk_box_gadget_distribute: assertion 'size >= 0' failed in GtkScrollbar

(SWT:1751): Gtk-CRITICAL **: 17:54:15.156: gtk_box_gadget_distribute: assertion 'size >= 0' failed in GtkScrollbar

(SWT:1751): Gtk-CRITICAL **: 17:54:15.157: gtk_box_gadget_distribute: assertion 'size >= 0' failed in GtkScrollbar

(SWT:1751): Gtk-CRITICAL **: 17:54:15.178: gtk_box_gadget_distribute: assertion 'size >= 0' failed in GtkScrollbar

(SWT:1751): Gtk-CRITICAL **: 17:54:15.181: gtk_box_gadget_distribute: assertion 'size >= 0' failed in GtkScrollbar

(SWT:1751): Gtk-CRITICAL **: 17:54:15.181: gtk_box_gadget_distribute: assertion 'size >= 0' failed in GtkScrollbar

(SWT:1751): Gtk-CRITICAL **: 17:54:15.242: gtk_box_gadget_distribute: assertion 'size >= 0' failed in GtkScrollbar

(SWT:1751): Gtk-WARNING **: 17:54:15.287: Negative content width -6 (allocation 1, extents 4x3) while allocating gadget (node toolbar, owner GtkToolbar)

(SWT:1751): Gtk-WARNING **: 17:54:16.268: Negative content width -6 (allocation 1, extents 4x3) while allocating gadget (node toolbar, owner GtkToolbar)

(SWT:1751): Gtk-WARNING **: 17:54:16.291: Negative content width -6 (allocation 1, extents 4x3) while allocating gadget (node toolbar, owner GtkToolbar)

(SWT:1751): Gtk-WARNING **: 17:54:16.980: Negative content width -6 (allocation 1, extents 4x3) while allocating gadget (node toolbar, owner GtkToolbar)

(SWT:1751): Gtk-CRITICAL **: 17:54:17.613: gtk_box_gadget_distribute: assertion 'size >= 0' failed in GtkScrollbar

(SWT:1751): Gtk-CRITICAL **: 17:54:17.632: gtk_box_gadget_distribute: assertion 'size >= 0' failed in GtkScrollbar

(SWT:1751): Gtk-WARNING **: 17:54:17.641: Negative content width -6 (allocation 1, extents 4x3) while allocating gadget (node toolbar, owner GtkToolbar)

(SWT:1751): Gtk-CRITICAL **: 17:54:17.658: gtk_box_gadget_distribute: assertion 'size >= 0' failed in GtkScrollbar

(SWT:1751): Gtk-CRITICAL **: 17:54:17.670: gtk_box_gadget_distribute: assertion 'size >= 0' failed in GtkScrollbar

(SWT:1751): Gtk-CRITICAL **: 17:54:17.679: gtk_box_gadget_distribute: assertion 'size >= 0' failed in GtkScrollbar

(SWT:1751): Gtk-CRITICAL **: 17:54:17.687: gtk_box_gadget_distribute: assertion 'size >= 0' failed in GtkScrollbar

(SWT:1751): Gtk-CRITICAL **: 17:54:17.692: gtk_box_gadget_distribute: assertion 'size >= 0' failed in GtkScrollbar

(SWT:1751): Gtk-CRITICAL **: 17:54:17.713: gtk_box_gadget_distribute: assertion 'size >= 0' failed in GtkScrollbar

(SWT:1751): Gtk-CRITICAL **: 17:54:17.716: gtk_box_gadget_distribute: assertion 'size >= 0' failed in GtkScrollbar

(SWT:1751): Gtk-CRITICAL **: 17:54:17.716: gtk_box_gadget_distribute: assertion 'size >= 0' failed in GtkScrollbar

(SWT:1751): Gtk-CRITICAL **: 17:54:17.724: gtk_box_gadget_distribute: assertion 'size >= 0' failed in GtkScrollbar

(SWT:1751): Gtk-CRITICAL **: 17:54:17.725: gtk_box_gadget_distribute: assertion 'size >= 0' failed in GtkScrollbar

(SWT:1751): Gtk-CRITICAL **: 17:54:17.742: gtk_box_gadget_distribute: assertion 'size >= 0' failed in GtkScrollbar

(SWT:1751): Gtk-CRITICAL **: 17:54:17.742: gtk_box_gadget_distribute: assertion 'size >= 0' failed in GtkScrollbar

(SWT:1751): Gtk-CRITICAL **: 17:54:17.755: gtk_box_gadget_distribute: assertion 'size >= 0' failed in GtkScrollbar

(SWT:1751): Gtk-CRITICAL **: 17:54:17.755: gtk_box_gadget_distribute: assertion 'size >= 0' failed in GtkScrollbar

(SWT:1751): Gtk-CRITICAL **: 17:54:17.765: gtk_box_gadget_distribute: assertion 'size >= 0' failed in GtkScrollbar

(SWT:1751): Gtk-CRITICAL **: 17:54:17.771: gtk_box_gadget_distribute: assertion 'size >= 0' failed in GtkScrollbar

(SWT:1751): Gtk-CRITICAL **: 17:54:17.771: gtk_box_gadget_distribute: assertion 'size >= 0' failed in GtkScrollbar

(SWT:1751): Gtk-CRITICAL **: 17:54:17.788: gtk_box_gadget_distribute: assertion 'size >= 0' failed in GtkScrollbar

(SWT:1751): Gtk-CRITICAL **: 17:54:17.788: gtk_box_gadget_distribute: assertion 'size >= 0' failed in GtkScrollbar

(SWT:1751): Gtk-CRITICAL **: 17:54:17.804: gtk_box_gadget_distribute: assertion 'size >= 0' failed in GtkScrollbar

(SWT:1751): Gtk-CRITICAL **: 17:54:17.871: gtk_box_gadget_distribute: assertion 'size >= 0' failed in GtkScrollbar

(SWT:1751): Gtk-CRITICAL **: 17:54:17.872: gtk_box_gadget_distribute: assertion 'size >= 0' failed in GtkScrollbar

(SWT:1751): Gtk-CRITICAL **: 17:54:17.882: gtk_box_gadget_distribute: assertion 'size >= 0' failed in GtkScrollbar

(SWT:1751): Gtk-CRITICAL **: 17:54:17.885: gtk_box_gadget_distribute: assertion 'size >= 0' failed in GtkScrollbar

(SWT:1751): Gtk-CRITICAL **: 17:54:17.886: gtk_box_gadget_distribute: assertion 'size >= 0' failed in GtkScrollbar

(SWT:1751): Gtk-CRITICAL **: 17:54:17.896: gtk_box_gadget_distribute: assertion 'size >= 0' failed in GtkScrollbar

(SWT:1751): Gtk-CRITICAL **: 17:54:17.912: gtk_box_gadget_distribute: assertion 'size >= 0' failed in GtkScrollbar

(SWT:1751): Gtk-CRITICAL **: 17:54:17.913: gtk_box_gadget_distribute: assertion 'size >= 0' failed in GtkScrollbar

(SWT:1751): Gtk-CRITICAL **: 17:54:17.914: gtk_box_gadget_distribute: assertion 'size >= 0' failed in GtkScrollbar

(SWT:1751): Gtk-WARNING **: 17:54:17.999: Negative content width -6 (allocation 1, extents 4x3) while allocating gadget (node toolbar, owner GtkToolbar)

(SWT:1751): Gtk-WARNING **: 17:54:18.777: Negative content width -6 (allocation 1, extents 4x3) while allocating gadget (node toolbar, owner GtkToolbar)

(SWT:1751): Gtk-WARNING **: 17:54:18.798: Negative content width -6 (allocation 1, extents 4x3) while allocating gadget (node toolbar, owner GtkToolbar)

(SWT:1751): Gtk-WARNING **: 17:54:19.506: Negative content width -6 (allocation 1, extents 4x3) while allocating gadget (node toolbar, owner GtkToolbar)

(SWT:1751): Gtk-CRITICAL **: 17:54:20.214: gtk_box_gadget_distribute: assertion 'size >= 0' failed in GtkScrollbar

(SWT:1751): Gtk-CRITICAL **: 17:54:20.230: gtk_box_gadget_distribute: assertion 'size >= 0' failed in GtkScrollbar

(SWT:1751): Gtk-WARNING **: 17:54:20.238: Negative content width -6 (allocation 1, extents 4x3) while allocating gadget (node toolbar, owner GtkToolbar)

(SWT:1751): Gtk-CRITICAL **: 17:54:20.254: gtk_box_gadget_distribute: assertion 'size >= 0' failed in GtkScrollbar

(SWT:1751): Gtk-CRITICAL **: 17:54:20.264: gtk_box_gadget_distribute: assertion 'size >= 0' failed in GtkScrollbar

(SWT:1751): Gtk-CRITICAL **: 17:54:20.268: gtk_box_gadget_distribute: assertion 'size >= 0' failed in GtkScrollbar

(SWT:1751): Gtk-CRITICAL **: 17:54:20.288: gtk_box_gadget_distribute: assertion 'size >= 0' failed in GtkScrollbar

(SWT:1751): Gtk-CRITICAL **: 17:54:20.291: gtk_box_gadget_distribute: assertion 'size >= 0' failed in GtkScrollbar

(SWT:1751): Gtk-CRITICAL **: 17:54:20.291: gtk_box_gadget_distribute: assertion 'size >= 0' failed in GtkScrollbar

(SWT:1751): Gtk-CRITICAL **: 17:54:20.299: gtk_box_gadget_distribute: assertion 'size >= 0' failed in GtkScrollbar

(SWT:1751): Gtk-CRITICAL **: 17:54:20.300: gtk_box_gadget_distribute: assertion 'size >= 0' failed in GtkScrollbar

(SWT:1751): Gtk-CRITICAL **: 17:54:20.317: gtk_box_gadget_distribute: assertion 'size >= 0' failed in GtkScrollbar

(SWT:1751): Gtk-CRITICAL **: 17:54:20.322: gtk_box_gadget_distribute: assertion 'size >= 0' failed in GtkScrollbar

(SWT:1751): Gtk-CRITICAL **: 17:54:20.322: gtk_box_gadget_distribute: assertion 'size >= 0' failed in GtkScrollbar

(SWT:1751): Gtk-CRITICAL **: 17:54:20.339: gtk_box_gadget_distribute: assertion 'size >= 0' failed in GtkScrollbar

(SWT:1751): Gtk-CRITICAL **: 17:54:20.339: gtk_box_gadget_distribute: assertion 'size >= 0' failed in GtkScrollbar

(SWT:1751): Gtk-CRITICAL **: 17:54:20.356: gtk_box_gadget_distribute: assertion 'size >= 0' failed in GtkScrollbar

(SWT:1751): Gtk-CRITICAL **: 17:54:20.356: gtk_box_gadget_distribute: assertion 'size >= 0' failed in GtkScrollbar

(SWT:1751): Gtk-CRITICAL **: 17:54:20.372: gtk_box_gadget_distribute: assertion 'size >= 0' failed in GtkScrollbar

(SWT:1751): Gtk-CRITICAL **: 17:54:20.372: gtk_box_gadget_distribute: assertion 'size >= 0' failed in GtkScrollbar

(SWT:1751): Gtk-CRITICAL **: 17:54:20.389: gtk_box_gadget_distribute: assertion 'size >= 0' failed in GtkScrollbar

(SWT:1751): Gtk-CRITICAL **: 17:54:20.389: gtk_box_gadget_distribute: assertion 'size >= 0' failed in GtkScrollbar

(SWT:1751): Gtk-CRITICAL **: 17:54:20.406: gtk_box_gadget_distribute: assertion 'size >= 0' failed in GtkScrollbar

(SWT:1751): Gtk-CRITICAL **: 17:54:20.423: gtk_box_gadget_distribute: assertion 'size >= 0' failed in GtkScrollbar

(SWT:1751): Gtk-CRITICAL **: 17:54:20.434: gtk_box_gadget_distribute: assertion 'size >= 0' failed in GtkScrollbar

(SWT:1751): Gtk-CRITICAL **: 17:54:20.434: gtk_box_gadget_distribute: assertion 'size >= 0' failed in GtkScrollbar

(SWT:1751): Gtk-CRITICAL **: 17:54:20.437: gtk_box_gadget_distribute: assertion 'size >= 0' failed in GtkScrollbar

(SWT:1751): Gtk-CRITICAL **: 17:54:20.448: gtk_box_gadget_distribute: assertion 'size >= 0' failed in GtkScrollbar

(SWT:1751): Gtk-CRITICAL **: 17:54:20.449: gtk_box_gadget_distribute: assertion 'size >= 0' failed in GtkScrollbar

(SWT:1751): Gtk-CRITICAL **: 17:54:20.450: gtk_box_gadget_distribute: assertion 'size >= 0' failed in GtkScrollbar

(SWT:1751): Gtk-CRITICAL **: 17:54:20.497: gtk_box_gadget_distribute: assertion 'size >= 0' failed in GtkScrollbar

(SWT:1751): Gtk-CRITICAL **: 17:54:20.498: gtk_box_gadget_distribute: assertion 'size >= 0' failed in GtkScrollbar

(SWT:1751): Gtk-CRITICAL **: 17:54:20.499: gtk_box_gadget_distribute: assertion 'size >= 0' failed in GtkScrollbar

(SWT:1751): Gtk-WARNING **: 17:54:20.580: Negative content width -6 (allocation 1, extents 4x3) while allocating gadget (node toolbar, owner GtkToolbar)

(SWT:1751): Gtk-CRITICAL **: 17:54:21.635: gtk_box_gadget_distribute: assertion 'size >= 0' failed in GtkScrollbar

(SWT:1751): Gtk-CRITICAL **: 17:54:21.637: gtk_box_gadget_distribute: assertion 'size >= 0' failed in GtkScrollbar

(SWT:1751): Gtk-WARNING **: 17:54:21.856: Negative content width -6 (allocation 1, extents 4x3) while allocating gadget (node toolbar, owner GtkToolbar)

(SWT:1751): Gtk-WARNING **: 17:54:21.876: Negative content width -6 (allocation 1, extents 4x3) while allocating gadget (node toolbar, owner GtkToolbar)

(SWT:1751): Gtk-WARNING **: 17:54:24.475: Negative content width -6 (allocation 1, extents 4x3) while allocating gadget (node toolbar, owner GtkToolbar)

(SWT:1751): Gtk-CRITICAL **: 17:54:25.003: gtk_box_gadget_distribute: assertion 'size >= 0' failed in GtkScrollbar

(SWT:1751): Gtk-CRITICAL **: 17:54:25.020: gtk_box_gadget_distribute: assertion 'size >= 0' failed in GtkScrollbar

(SWT:1751): Gtk-WARNING **: 17:54:25.028: Negative content width -6 (allocation 1, extents 4x3) while allocating gadget (node toolbar, owner GtkToolbar)

(SWT:1751): Gtk-CRITICAL **: 17:54:25.045: gtk_box_gadget_distribute: assertion 'size >= 0' failed in GtkScrollbar

(SWT:1751): Gtk-CRITICAL **: 17:54:25.057: gtk_box_gadget_distribute: assertion 'size >= 0' failed in GtkScrollbar

(SWT:1751): Gtk-CRITICAL **: 17:54:25.069: gtk_box_gadget_distribute: assertion 'size >= 0' failed in GtkScrollbar

(SWT:1751): Gtk-CRITICAL **: 17:54:25.079: gtk_box_gadget_distribute: assertion 'size >= 0' failed in GtkScrollbar

(SWT:1751): Gtk-CRITICAL **: 17:54:25.081: gtk_box_gadget_distribute: assertion 'size >= 0' failed in GtkScrollbar

(SWT:1751): Gtk-CRITICAL **: 17:54:25.082: gtk_box_gadget_distribute: assertion 'size >= 0' failed in GtkScrollbar

(SWT:1751): Gtk-CRITICAL **: 17:54:25.093: gtk_box_gadget_distribute: assertion 'size >= 0' failed in GtkScrollbar

(SWT:1751): Gtk-CRITICAL **: 17:54:25.093: gtk_box_gadget_distribute: assertion 'size >= 0' failed in GtkScrollbar

(SWT:1751): Gtk-CRITICAL **: 17:54:25.114: gtk_box_gadget_distribute: assertion 'size >= 0' failed in GtkScrollbar

(SWT:1751): Gtk-CRITICAL **: 17:54:25.114: gtk_box_gadget_distribute: assertion 'size >= 0' failed in GtkScrollbar

(SWT:1751): Gtk-CRITICAL **: 17:54:25.124: gtk_box_gadget_distribute: assertion 'size >= 0' failed in GtkScrollbar

(SWT:1751): Gtk-CRITICAL **: 17:54:25.130: gtk_box_gadget_distribute: assertion 'size >= 0' failed in GtkScrollbar

(SWT:1751): Gtk-CRITICAL **: 17:54:25.130: gtk_box_gadget_distribute: assertion 'size >= 0' failed in GtkScrollbar

(SWT:1751): Gtk-CRITICAL **: 17:54:25.147: gtk_box_gadget_distribute: assertion 'size >= 0' failed in GtkScrollbar

(SWT:1751): Gtk-CRITICAL **: 17:54:25.147: gtk_box_gadget_distribute: assertion 'size >= 0' failed in GtkScrollbar

(SWT:1751): Gtk-CRITICAL **: 17:54:25.163: gtk_box_gadget_distribute: assertion 'size >= 0' failed in GtkScrollbar

(SWT:1751): Gtk-CRITICAL **: 17:54:25.164: gtk_box_gadget_distribute: assertion 'size >= 0' failed in GtkScrollbar

(SWT:1751): Gtk-CRITICAL **: 17:54:25.179: gtk_box_gadget_distribute: assertion 'size >= 0' failed in GtkScrollbar

(SWT:1751): Gtk-CRITICAL **: 17:54:25.196: gtk_box_gadget_distribute: assertion 'size >= 0' failed in GtkScrollbar

(SWT:1751): Gtk-CRITICAL **: 17:54:25.244: gtk_box_gadget_distribute: assertion 'size >= 0' failed in GtkScrollbar

(SWT:1751): Gtk-CRITICAL **: 17:54:25.245: gtk_box_gadget_distribute: assertion 'size >= 0' failed in GtkScrollbar

(SWT:1751): Gtk-CRITICAL **: 17:54:25.257: gtk_box_gadget_distribute: assertion 'size >= 0' failed in GtkScrollbar

(SWT:1751): Gtk-CRITICAL **: 17:54:25.258: gtk_box_gadget_distribute: assertion 'size >= 0' failed in GtkScrollbar

(SWT:1751): Gtk-CRITICAL **: 17:54:25.259: gtk_box_gadget_distribute: assertion 'size >= 0' failed in GtkScrollbar

(SWT:1751): Gtk-CRITICAL **: 17:54:25.260: gtk_box_gadget_distribute: assertion 'size >= 0' failed in GtkScrollbar

(SWT:1751): Gtk-CRITICAL **: 17:54:25.279: gtk_box_gadget_distribute: assertion 'size >= 0' failed in GtkScrollbar

(SWT:1751): Gtk-CRITICAL **: 17:54:25.280: gtk_box_gadget_distribute: assertion 'size >= 0' failed in GtkScrollbar

(SWT:1751): Gtk-CRITICAL **: 17:54:25.291: gtk_box_gadget_distribute: assertion 'size >= 0' failed in GtkScrollbar

(SWT:1751): Gtk-WARNING **: 17:54:25.390: Negative content width -6 (allocation 1, extents 4x3) while allocating gadget (node toolbar, owner GtkToolbar)

(SWT:1751): Gtk-CRITICAL **: 17:54:26.411: gtk_box_gadget_distribute: assertion 'size >= 0' failed in GtkScrollbar

(SWT:1751): Gtk-CRITICAL **: 17:54:26.412: gtk_box_gadget_distribute: assertion 'size >= 0' failed in GtkScrollbar

(SWT:1751): Gtk-WARNING **: 17:54:26.673: Negative content width -6 (allocation 1, extents 4x3) while allocating gadget (node toolbar, owner GtkToolbar)

(SWT:1751): Gtk-WARNING **: 17:54:26.694: Negative content width -6 (allocation 1, extents 4x3) while allocating gadget (node toolbar, owner GtkToolbar)

(SWT:1751): Gtk-WARNING **: 17:54:27.346: Negative content width -6 (allocation 1, extents 4x3) while allocating gadget (node toolbar, owner GtkToolbar)

(SWT:1751): Gtk-CRITICAL **: 17:54:28.060: gtk_box_gadget_distribute: assertion 'size >= 0' failed in GtkScrollbar

(SWT:1751): Gtk-CRITICAL **: 17:54:28.077: gtk_box_gadget_distribute: assertion 'size >= 0' failed in GtkScrollbar

(SWT:1751): Gtk-WARNING **: 17:54:28.085: Negative content width -6 (allocation 1, extents 4x3) while allocating gadget (node toolbar, owner GtkToolbar)

(SWT:1751): Gtk-CRITICAL **: 17:54:28.104: gtk_box_gadget_distribute: assertion 'size >= 0' failed in GtkScrollbar

(SWT:1751): Gtk-CRITICAL **: 17:54:28.117: gtk_box_gadget_distribute: assertion 'size >= 0' failed in GtkScrollbar

(SWT:1751): Gtk-CRITICAL **: 17:54:28.127: gtk_box_gadget_distribute: assertion 'size >= 0' failed in GtkScrollbar

(SWT:1751): Gtk-CRITICAL **: 17:54:28.135: gtk_box_gadget_distribute: assertion 'size >= 0' failed in GtkScrollbar

(SWT:1751): Gtk-CRITICAL **: 17:54:28.151: gtk_box_gadget_distribute: assertion 'size >= 0' failed in GtkScrollbar

(SWT:1751): Gtk-CRITICAL **: 17:54:28.154: gtk_box_gadget_distribute: assertion 'size >= 0' failed in GtkScrollbar

(SWT:1751): Gtk-CRITICAL **: 17:54:28.155: gtk_box_gadget_distribute: assertion 'size >= 0' failed in GtkScrollbar

(SWT:1751): Gtk-CRITICAL **: 17:54:28.162: gtk_box_gadget_distribute: assertion 'size >= 0' failed in GtkScrollbar

(SWT:1751): Gtk-CRITICAL **: 17:54:28.163: gtk_box_gadget_distribute: assertion 'size >= 0' failed in GtkScrollbar

(SWT:1751): Gtk-CRITICAL **: 17:54:28.181: gtk_box_gadget_distribute: assertion 'size >= 0' failed in GtkScrollbar

(SWT:1751): Gtk-CRITICAL **: 17:54:28.185: gtk_box_gadget_distribute: assertion 'size >= 0' failed in GtkScrollbar

(SWT:1751): Gtk-CRITICAL **: 17:54:28.185: gtk_box_gadget_distribute: assertion 'size >= 0' failed in GtkScrollbar

(SWT:1751): Gtk-CRITICAL **: 17:54:28.202: gtk_box_gadget_distribute: assertion 'size >= 0' failed in GtkScrollbar

(SWT:1751): Gtk-CRITICAL **: 17:54:28.202: gtk_box_gadget_distribute: assertion 'size >= 0' failed in GtkScrollbar

(SWT:1751): Gtk-CRITICAL **: 17:54:28.218: gtk_box_gadget_distribute: assertion 'size >= 0' failed in GtkScrollbar

(SWT:1751): Gtk-CRITICAL **: 17:54:28.218: gtk_box_gadget_distribute: assertion 'size >= 0' failed in GtkScrollbar

(SWT:1751): Gtk-CRITICAL **: 17:54:28.235: gtk_box_gadget_distribute: assertion 'size >= 0' failed in GtkScrollbar

(SWT:1751): Gtk-CRITICAL **: 17:54:28.253: gtk_box_gadget_distribute: assertion 'size >= 0' failed in GtkScrollbar

(SWT:1751): Gtk-CRITICAL **: 17:54:28.299: gtk_box_gadget_distribute: assertion 'size >= 0' failed in GtkScrollbar

(SWT:1751): Gtk-CRITICAL **: 17:54:28.300: gtk_box_gadget_distribute: assertion 'size >= 0' failed in GtkScrollbar

(SWT:1751): Gtk-CRITICAL **: 17:54:28.311: gtk_box_gadget_distribute: assertion 'size >= 0' failed in GtkScrollbar

(SWT:1751): Gtk-CRITICAL **: 17:54:28.312: gtk_box_gadget_distribute: assertion 'size >= 0' failed in GtkScrollbar

(SWT:1751): Gtk-CRITICAL **: 17:54:28.312: gtk_box_gadget_distribute: assertion 'size >= 0' failed in GtkScrollbar

(SWT:1751): Gtk-CRITICAL **: 17:54:28.313: gtk_box_gadget_distribute: assertion 'size >= 0' failed in GtkScrollbar

(SWT:1751): Gtk-CRITICAL **: 17:54:28.387: gtk_box_gadget_distribute: assertion 'size >= 0' failed in GtkScrollbar

(SWT:1751): Gtk-WARNING **: 17:54:28.591: Negative content width -6 (allocation 1, extents 4x3) while allocating gadget (node toolbar, owner GtkToolbar)

(SWT:1751): Gtk-CRITICAL **: 17:54:29.468: gtk_box_gadget_distribute: assertion 'size >= 0' failed in GtkScrollbar

(SWT:1751): Gtk-CRITICAL **: 17:54:29.471: gtk_box_gadget_distribute: assertion 'size >= 0' failed in GtkScrollbar

(SWT:1751): Gtk-WARNING **: 17:54:29.648: Negative content width -6 (allocation 1, extents 4x3) while allocating gadget (node toolbar, owner GtkToolbar)

(SWT:1751): Gtk-WARNING **: 17:54:29.668: Negative content width -6 (allocation 1, extents 4x3) while allocating gadget (node toolbar, owner GtkToolbar)

(SWT:1751): Gtk-WARNING **: 17:54:30.359: Negative content width -6 (allocation 1, extents 4x3) while allocating gadget (node toolbar, owner GtkToolbar)

(SWT:1751): Gtk-CRITICAL **: 17:54:30.870: gtk_box_gadget_distribute: assertion 'size >= 0' failed in GtkScrollbar

(SWT:1751): Gtk-CRITICAL **: 17:54:30.893: gtk_box_gadget_distribute: assertion 'size >= 0' failed in GtkScrollbar

(SWT:1751): Gtk-WARNING **: 17:54:30.901: Negative content width -6 (allocation 1, extents 4x3) while allocating gadget (node toolbar, owner GtkToolbar)

(SWT:1751): Gtk-CRITICAL **: 17:54:30.925: gtk_box_gadget_distribute: assertion 'size >= 0' failed in GtkScrollbar

(SWT:1751): Gtk-CRITICAL **: 17:54:30.938: gtk_box_gadget_distribute: assertion 'size >= 0' failed in GtkScrollbar

(SWT:1751): Gtk-CRITICAL **: 17:54:30.952: gtk_box_gadget_distribute: assertion 'size >= 0' failed in GtkScrollbar

(SWT:1751): Gtk-CRITICAL **: 17:54:30.961: gtk_box_gadget_distribute: assertion 'size >= 0' failed in GtkScrollbar

(SWT:1751): Gtk-CRITICAL **: 17:54:30.971: gtk_box_gadget_distribute: assertion 'size >= 0' failed in GtkScrollbar

(SWT:1751): Gtk-CRITICAL **: 17:54:30.973: gtk_box_gadget_distribute: assertion 'size >= 0' failed in GtkScrollbar

(SWT:1751): Gtk-CRITICAL **: 17:54:30.974: gtk_box_gadget_distribute: assertion 'size >= 0' failed in GtkScrollbar

(SWT:1751): Gtk-CRITICAL **: 17:54:30.982: gtk_box_gadget_distribute: assertion 'size >= 0' failed in GtkScrollbar

(SWT:1751): Gtk-CRITICAL **: 17:54:30.983: gtk_box_gadget_distribute: assertion 'size >= 0' failed in GtkScrollbar

(SWT:1751): Gtk-CRITICAL **: 17:54:30.999: gtk_box_gadget_distribute: assertion 'size >= 0' failed in GtkScrollbar

(SWT:1751): Gtk-CRITICAL **: 17:54:30.999: gtk_box_gadget_distribute: assertion 'size >= 0' failed in GtkScrollbar

(SWT:1751): Gtk-CRITICAL **: 17:54:31.020: gtk_box_gadget_distribute: assertion 'size >= 0' failed in GtkScrollbar

(SWT:1751): Gtk-CRITICAL **: 17:54:31.020: gtk_box_gadget_distribute: assertion 'size >= 0' failed in GtkScrollbar

(SWT:1751): Gtk-CRITICAL **: 17:54:31.031: gtk_box_gadget_distribute: assertion 'size >= 0' failed in GtkScrollbar

(SWT:1751): Gtk-CRITICAL **: 17:54:31.031: gtk_box_gadget_distribute: assertion 'size >= 0' failed in GtkScrollbar

(SWT:1751): Gtk-CRITICAL **: 17:54:31.043: gtk_box_gadget_distribute: assertion 'size >= 0' failed in GtkScrollbar

(SWT:1751): Gtk-CRITICAL **: 17:54:31.046: gtk_box_gadget_distribute: assertion 'size >= 0' failed in GtkScrollbar

(SWT:1751): Gtk-CRITICAL **: 17:54:31.064: gtk_box_gadget_distribute: assertion 'size >= 0' failed in GtkScrollbar

(SWT:1751): Gtk-CRITICAL **: 17:54:31.160: gtk_box_gadget_distribute: assertion 'size >= 0' failed in GtkScrollbar

(SWT:1751): Gtk-CRITICAL **: 17:54:31.161: gtk_box_gadget_distribute: assertion 'size >= 0' failed in GtkScrollbar

(SWT:1751): Gtk-CRITICAL **: 17:54:31.173: gtk_box_gadget_distribute: assertion 'size >= 0' failed in GtkScrollbar

(SWT:1751): Gtk-CRITICAL **: 17:54:31.174: gtk_box_gadget_distribute: assertion 'size >= 0' failed in GtkScrollbar

(SWT:1751): Gtk-CRITICAL **: 17:54:31.174: gtk_box_gadget_distribute: assertion 'size >= 0' failed in GtkScrollbar

(SWT:1751): Gtk-CRITICAL **: 17:54:31.175: gtk_box_gadget_distribute: assertion 'size >= 0' failed in GtkScrollbar

(SWT:1751): Gtk-CRITICAL **: 17:54:31.232: gtk_box_gadget_distribute: assertion 'size >= 0' failed in GtkScrollbar

(SWT:1751): Gtk-CRITICAL **: 17:54:31.233: gtk_box_gadget_distribute: assertion 'size >= 0' failed in GtkScrollbar

(SWT:1751): Gtk-CRITICAL **: 17:54:31.236: gtk_box_gadget_distribute: assertion 'size >= 0' failed in GtkScrollbar

(SWT:1751): Gtk-WARNING **: 17:54:31.371: Negative content width -6 (allocation 1, extents 4x3) while allocating gadget (node toolbar, owner GtkToolbar)

(SWT:1751): Gtk-CRITICAL **: 17:54:32.284: gtk_box_gadget_distribute: assertion 'size >= 0' failed in GtkScrollbar

(SWT:1751): Gtk-CRITICAL **: 17:54:32.285: gtk_box_gadget_distribute: assertion 'size >= 0' failed in GtkScrollbar

(SWT:1751): Gtk-WARNING **: 17:54:32.573: Negative content width -6 (allocation 1, extents 4x3) while allocating gadget (node toolbar, owner GtkToolbar)

(SWT:1751): Gtk-WARNING **: 17:54:32.593: Negative content width -6 (allocation 1, extents 4x3) while allocating gadget (node toolbar, owner GtkToolbar)

(SWT:1751): Gtk-WARNING **: 17:54:33.271: Negative content width -6 (allocation 1, extents 4x3) while allocating gadget (node toolbar, owner GtkToolbar)

(SWT:1751): Gtk-CRITICAL **: 17:54:33.915: gtk_box_gadget_distribute: assertion 'size >= 0' failed in GtkScrollbar

(SWT:1751): Gtk-CRITICAL **: 17:54:33.931: gtk_box_gadget_distribute: assertion 'size >= 0' failed in GtkScrollbar

(SWT:1751): Gtk-WARNING **: 17:54:33.938: Negative content width -6 (allocation 1, extents 4x3) while allocating gadget (node toolbar, owner GtkToolbar)

(SWT:1751): Gtk-CRITICAL **: 17:54:33.953: gtk_box_gadget_distribute: assertion 'size >= 0' failed in GtkScrollbar

(SWT:1751): Gtk-CRITICAL **: 17:54:33.964: gtk_box_gadget_distribute: assertion 'size >= 0' failed in GtkScrollbar

(SWT:1751): Gtk-CRITICAL **: 17:54:33.972: gtk_box_gadget_distribute: assertion 'size >= 0' failed in GtkScrollbar

(SWT:1751): Gtk-CRITICAL **: 17:54:33.978: gtk_box_gadget_distribute: assertion 'size >= 0' failed in GtkScrollbar

(SWT:1751): Gtk-CRITICAL **: 17:54:33.997: gtk_box_gadget_distribute: assertion 'size >= 0' failed in GtkScrollbar

(SWT:1751): Gtk-CRITICAL **: 17:54:34.000: gtk_box_gadget_distribute: assertion 'size >= 0' failed in GtkScrollbar

(SWT:1751): Gtk-CRITICAL **: 17:54:34.001: gtk_box_gadget_distribute: assertion 'size >= 0' failed in GtkScrollbar

(SWT:1751): Gtk-CRITICAL **: 17:54:34.009: gtk_box_gadget_distribute: assertion 'size >= 0' failed in GtkScrollbar

(SWT:1751): Gtk-CRITICAL **: 17:54:34.010: gtk_box_gadget_distribute: assertion 'size >= 0' failed in GtkScrollbar

(SWT:1751): Gtk-CRITICAL **: 17:54:34.027: gtk_box_gadget_distribute: assertion 'size >= 0' failed in GtkScrollbar

(SWT:1751): Gtk-CRITICAL **: 17:54:34.028: gtk_box_gadget_distribute: assertion 'size >= 0' failed in GtkScrollbar

(SWT:1751): Gtk-CRITICAL **: 17:54:34.039: gtk_box_gadget_distribute: assertion 'size >= 0' failed in GtkScrollbar

(SWT:1751): Gtk-CRITICAL **: 17:54:34.040: gtk_box_gadget_distribute: assertion 'size >= 0' failed in GtkScrollbar

(SWT:1751): Gtk-CRITICAL **: 17:54:34.052: gtk_box_gadget_distribute: assertion 'size >= 0' failed in GtkScrollbar

(SWT:1751): Gtk-CRITICAL **: 17:54:34.056: gtk_box_gadget_distribute: assertion 'size >= 0' failed in GtkScrollbar

(SWT:1751): Gtk-CRITICAL **: 17:54:34.057: gtk_box_gadget_distribute: assertion 'size >= 0' failed in GtkScrollbar

(SWT:1751): Gtk-CRITICAL **: 17:54:34.073: gtk_box_gadget_distribute: assertion 'size >= 0' failed in GtkScrollbar

(SWT:1751): Gtk-CRITICAL **: 17:54:34.073: gtk_box_gadget_distribute: assertion 'size >= 0' failed in GtkScrollbar

(SWT:1751): Gtk-CRITICAL **: 17:54:34.089: gtk_box_gadget_distribute: assertion 'size >= 0' failed in GtkScrollbar

(SWT:1751): Gtk-CRITICAL **: 17:54:34.171: gtk_box_gadget_distribute: assertion 'size >= 0' failed in GtkScrollbar

(SWT:1751): Gtk-CRITICAL **: 17:54:34.172: gtk_box_gadget_distribute: assertion 'size >= 0' failed in GtkScrollbar

(SWT:1751): Gtk-CRITICAL **: 17:54:34.184: gtk_box_gadget_distribute: assertion 'size >= 0' failed in GtkScrollbar

(SWT:1751): Gtk-CRITICAL **: 17:54:34.185: gtk_box_gadget_distribute: assertion 'size >= 0' failed in GtkScrollbar

(SWT:1751): Gtk-CRITICAL **: 17:54:34.186: gtk_box_gadget_distribute: assertion 'size >= 0' failed in GtkScrollbar

(SWT:1751): Gtk-CRITICAL **: 17:54:34.187: gtk_box_gadget_distribute: assertion 'size >= 0' failed in GtkScrollbar

(SWT:1751): Gtk-CRITICAL **: 17:54:34.202: gtk_box_gadget_distribute: assertion 'size >= 0' failed in GtkScrollbar

(SWT:1751): Gtk-CRITICAL **: 17:54:34.203: gtk_box_gadget_distribute: assertion 'size >= 0' failed in GtkScrollbar

(SWT:1751): Gtk-CRITICAL **: 17:54:34.204: gtk_box_gadget_distribute: assertion 'size >= 0' failed in GtkScrollbar

(SWT:1751): Gtk-WARNING **: 17:54:34.311: Negative content width -6 (allocation 1, extents 4x3) while allocating gadget (node toolbar, owner GtkToolbar)

(SWT:1751): Gtk-WARNING **: 17:54:35.575: Negative content width -6 (allocation 1, extents 4x3) while allocating gadget (node toolbar, owner GtkToolbar)

(SWT:1751): Gtk-WARNING **: 17:54:35.595: Negative content width -6 (allocation 1, extents 4x3) while allocating gadget (node toolbar, owner GtkToolbar)

(SWT:1751): Gtk-WARNING **: 17:54:36.305: Negative content width -6 (allocation 1, extents 4x3) while allocating gadget (node toolbar, owner GtkToolbar)

(SWT:1751): Gtk-CRITICAL **: 17:54:37.050: gtk_box_gadget_distribute: assertion 'size >= 0' failed in GtkScrollbar

(SWT:1751): Gtk-CRITICAL **: 17:54:37.067: gtk_box_gadget_distribute: assertion 'size >= 0' failed in GtkScrollbar

(SWT:1751): Gtk-WARNING **: 17:54:37.077: Negative content width -6 (allocation 1, extents 4x3) while allocating gadget (node toolbar, owner GtkToolbar)

(SWT:1751): Gtk-CRITICAL **: 17:54:37.094: gtk_box_gadget_distribute: assertion 'size >= 0' failed in GtkScrollbar

(SWT:1751): Gtk-CRITICAL **: 17:54:37.110: gtk_box_gadget_distribute: assertion 'size >= 0' failed in GtkScrollbar

(SWT:1751): Gtk-CRITICAL **: 17:54:37.121: gtk_box_gadget_distribute: assertion 'size >= 0' failed in GtkScrollbar

(SWT:1751): Gtk-CRITICAL **: 17:54:37.130: gtk_box_gadget_distribute: assertion 'size >= 0' failed in GtkScrollbar

(SWT:1751): Gtk-CRITICAL **: 17:54:37.132: gtk_box_gadget_distribute: assertion 'size >= 0' failed in GtkScrollbar

(SWT:1751): Gtk-CRITICAL **: 17:54:37.133: gtk_box_gadget_distribute: assertion 'size >= 0' failed in GtkScrollbar

(SWT:1751): Gtk-CRITICAL **: 17:54:37.141: gtk_box_gadget_distribute: assertion 'size >= 0' failed in GtkScrollbar

(SWT:1751): Gtk-CRITICAL **: 17:54:37.142: gtk_box_gadget_distribute: assertion 'size >= 0' failed in GtkScrollbar

(SWT:1751): Gtk-CRITICAL **: 17:54:37.165: gtk_box_gadget_distribute: assertion 'size >= 0' failed in GtkScrollbar

(SWT:1751): Gtk-CRITICAL **: 17:54:37.165: gtk_box_gadget_distribute: assertion 'size >= 0' failed in GtkScrollbar

(SWT:1751): Gtk-CRITICAL **: 17:54:37.182: gtk_box_gadget_distribute: assertion 'size >= 0' failed in GtkScrollbar

(SWT:1751): Gtk-CRITICAL **: 17:54:37.182: gtk_box_gadget_distribute: assertion 'size >= 0' failed in GtkScrollbar

(SWT:1751): Gtk-CRITICAL **: 17:54:37.190: gtk_box_gadget_distribute: assertion 'size >= 0' failed in GtkScrollbar

(SWT:1751): Gtk-CRITICAL **: 17:54:37.198: gtk_box_gadget_distribute: assertion 'size >= 0' failed in GtkScrollbar

(SWT:1751): Gtk-CRITICAL **: 17:54:37.198: gtk_box_gadget_distribute: assertion 'size >= 0' failed in GtkScrollbar

(SWT:1751): Gtk-CRITICAL **: 17:54:37.215: gtk_box_gadget_distribute: assertion 'size >= 0' failed in GtkScrollbar

(SWT:1751): Gtk-CRITICAL **: 17:54:37.215: gtk_box_gadget_distribute: assertion 'size >= 0' failed in GtkScrollbar

(SWT:1751): Gtk-CRITICAL **: 17:54:37.231: gtk_box_gadget_distribute: assertion 'size >= 0' failed in GtkScrollbar

(SWT:1751): Gtk-CRITICAL **: 17:54:37.332: gtk_box_gadget_distribute: assertion 'size >= 0' failed in GtkScrollbar

(SWT:1751): Gtk-CRITICAL **: 17:54:37.351: gtk_box_gadget_distribute: assertion 'size >= 0' failed in GtkScrollbar

(SWT:1751): Gtk-CRITICAL **: 17:54:37.363: gtk_box_gadget_distribute: assertion 'size >= 0' failed in GtkScrollbar

(SWT:1751): Gtk-CRITICAL **: 17:54:37.380: gtk_box_gadget_distribute: assertion 'size >= 0' failed in GtkScrollbar

(SWT:1751): Gtk-CRITICAL **: 17:54:37.397: gtk_box_gadget_distribute: assertion 'size >= 0' failed in GtkScrollbar

(SWT:1751): Gtk-CRITICAL **: 17:54:37.419: gtk_box_gadget_distribute: assertion 'size >= 0' failed in GtkScrollbar

(SWT:1751): Gtk-CRITICAL **: 17:54:37.420: gtk_box_gadget_distribute: assertion 'size >= 0' failed in GtkScrollbar

(SWT:1751): Gtk-CRITICAL **: 17:54:37.422: gtk_box_gadget_distribute: assertion 'size >= 0' failed in GtkScrollbar

(SWT:1751): Gtk-CRITICAL **: 17:54:37.423: gtk_box_gadget_distribute: assertion 'size >= 0' failed in GtkScrollbar

(SWT:1751): Gtk-CRITICAL **: 17:54:37.427: gtk_box_gadget_distribute: assertion 'size >= 0' failed in GtkScrollbar

(SWT:1751): Gtk-CRITICAL **: 17:54:37.466: gtk_box_gadget_distribute: assertion 'size >= 0' failed in GtkScrollbar

(SWT:1751): Gtk-CRITICAL **: 17:54:37.481: gtk_box_gadget_distribute: assertion 'size >= 0' failed in GtkScrollbar

(SWT:1751): Gtk-CRITICAL **: 17:54:37.481: gtk_box_gadget_distribute: assertion 'size >= 0' failed in GtkScrollbar

(SWT:1751): Gtk-CRITICAL **: 17:54:37.485: gtk_box_gadget_distribute: assertion 'size >= 0' failed in GtkScrollbar

(SWT:1751): Gtk-CRITICAL **: 17:54:37.494: gtk_box_gadget_distribute: assertion 'size >= 0' failed in GtkScrollbar

(SWT:1751): Gtk-CRITICAL **: 17:54:37.494: gtk_box_gadget_distribute: assertion 'size >= 0' failed in GtkScrollbar

(SWT:1751): Gtk-CRITICAL **: 17:54:37.495: gtk_box_gadget_distribute: assertion 'size >= 0' failed in GtkScrollbar

(SWT:1751): Gtk-CRITICAL **: 17:54:37.498: gtk_box_gadget_distribute: assertion 'size >= 0' failed in GtkScrollbar

(SWT:1751): Gtk-CRITICAL **: 17:54:37.499: gtk_box_gadget_distribute: assertion 'size >= 0' failed in GtkScrollbar

(SWT:1751): Gtk-CRITICAL **: 17:54:37.500: gtk_box_gadget_distribute: assertion 'size >= 0' failed in GtkScrollbar

(SWT:1751): Gtk-CRITICAL **: 17:54:37.561: gtk_box_gadget_distribute: assertion 'size >= 0' failed in GtkScrollbar

(SWT:1751): Gtk-CRITICAL **: 17:54:37.561: gtk_box_gadget_distribute: assertion 'size >= 0' failed in GtkScrollbar

(SWT:1751): Gtk-CRITICAL **: 17:54:37.619: gtk_box_gadget_distribute: assertion 'size >= 0' failed in GtkScrollbar

(SWT:1751): Gtk-CRITICAL **: 17:54:37.621: gtk_box_gadget_distribute: assertion 'size >= 0' failed in GtkScrollbar

(SWT:1751): Gtk-CRITICAL **: 17:54:37.621: gtk_box_gadget_distribute: assertion 'size >= 0' failed in GtkScrollbar

(SWT:1751): Gtk-CRITICAL **: 17:54:37.639: gtk_box_gadget_distribute: assertion 'size >= 0' failed in GtkScrollbar

(SWT:1751): Gtk-CRITICAL **: 17:54:37.643: gtk_box_gadget_distribute: assertion 'size >= 0' failed in GtkScrollbar

(SWT:1751): Gtk-CRITICAL **: 17:54:37.643: gtk_box_gadget_distribute: assertion 'size >= 0' failed in GtkScrollbar

(SWT:1751): Gtk-CRITICAL **: 17:54:37.662: gtk_box_gadget_distribute: assertion 'size >= 0' failed in GtkScrollbar

(SWT:1751): Gtk-CRITICAL **: 17:54:37.741: gtk_box_gadget_distribute: assertion 'size >= 0' failed in GtkScrollbar

(SWT:1751): Gtk-CRITICAL **: 17:54:37.747: gtk_box_gadget_distribute: assertion 'size >= 0' failed in GtkScrollbar

(SWT:1751): Gtk-CRITICAL **: 17:54:37.748: gtk_box_gadget_distribute: assertion 'size >= 0' failed in GtkScrollbar

(SWT:1751): Gtk-CRITICAL **: 17:54:37.783: gtk_box_gadget_distribute: assertion 'size >= 0' failed in GtkScrollbar

(SWT:1751): Gtk-CRITICAL **: 17:54:37.873: gtk_box_gadget_distribute: assertion 'size >= 0' failed in GtkScrollbar

(SWT:1751): Gtk-CRITICAL **: 17:54:37.875: gtk_box_gadget_distribute: assertion 'size >= 0' failed in GtkScrollbar

(SWT:1751): Gtk-CRITICAL **: 17:54:37.875: gtk_box_gadget_distribute: assertion 'size >= 0' failed in GtkScrollbar

(SWT:1751): Gtk-CRITICAL **: 17:54:37.908: gtk_box_gadget_distribute: assertion 'size >= 0' failed in GtkScrollbar

(SWT:1751): Gtk-CRITICAL **: 17:54:38.374: gtk_box_gadget_distribute: assertion 'size >= 0' failed in GtkScrollbar

(SWT:1751): Gtk-CRITICAL **: 17:54:38.381: gtk_box_gadget_distribute: assertion 'size >= 0' failed in GtkScrollbar

(SWT:1751): Gtk-CRITICAL **: 17:54:38.389: gtk_box_gadget_distribute: assertion 'size >= 0' failed in GtkScrollbar

(SWT:1751): Gtk-CRITICAL **: 17:54:38.413: gtk_box_gadget_distribute: assertion 'size >= 0' failed in GtkScrollbar

(SWT:1751): Gtk-CRITICAL **: 17:54:38.413: gtk_box_gadget_distribute: assertion 'size >= 0' failed in GtkScrollbar

(SWT:1751): Gtk-CRITICAL **: 17:54:38.416: gtk_box_gadget_distribute: assertion 'size >= 0' failed in GtkScrollbar

(SWT:1751): Gtk-CRITICAL **: 17:54:38.416: gtk_box_gadget_distribute: assertion 'size >= 0' failed in GtkScrollbar

(SWT:1751): Gtk-CRITICAL **: 17:54:38.418: gtk_box_gadget_distribute: assertion 'size >= 0' failed in GtkScrollbar

(SWT:1751): Gtk-CRITICAL **: 17:54:38.418: gtk_box_gadget_distribute: assertion 'size >= 0' failed in GtkScrollbar

(SWT:1751): Gtk-CRITICAL **: 17:54:38.428: gtk_box_gadget_distribute: assertion 'size >= 0' failed in GtkScrollbar

(SWT:1751): Gtk-CRITICAL **: 17:54:38.452: gtk_box_gadget_distribute: assertion 'size >= 0' failed in GtkScrollbar

(SWT:1751): Gtk-CRITICAL **: 17:54:38.518: gtk_box_gadget_distribute: assertion 'size >= 0' failed in GtkScrollbar

(SWT:1751): Gtk-CRITICAL **: 17:54:38.518: gtk_box_gadget_distribute: assertion 'size >= 0' failed in GtkScrollbar

(SWT:1751): Gtk-CRITICAL **: 17:54:38.574: gtk_box_gadget_distribute: assertion 'size >= 0' failed in GtkScrollbar

(SWT:1751): Gtk-CRITICAL **: 17:54:38.583: gtk_box_gadget_distribute: assertion 'size >= 0' failed in GtkScrollbar

(SWT:1751): Gtk-CRITICAL **: 17:54:38.585: gtk_box_gadget_distribute: assertion 'size >= 0' failed in GtkScrollbar

(SWT:1751): Gtk-CRITICAL **: 17:54:38.586: gtk_box_gadget_distribute: assertion 'size >= 0' failed in GtkScrollbar

(SWT:1751): Gtk-CRITICAL **: 17:54:38.591: gtk_box_gadget_distribute: assertion 'size >= 0' failed in GtkScrollbar

(SWT:1751): Gtk-CRITICAL **: 17:54:38.604: gtk_box_gadget_distribute: assertion 'size >= 0' failed in GtkScrollbar

(SWT:1751): Gtk-WARNING **: 17:54:38.703: Negative content width -6 (allocation 1, extents 4x3) while allocating gadget (node toolbar, owner GtkToolbar)

(SWT:1751): Gtk-WARNING **: 17:54:39.055: Negative content width -6 (allocation 1, extents 4x3) while allocating gadget (node toolbar, owner GtkToolbar)

(SWT:1751): Gtk-WARNING **: 17:54:39.094: Negative content width -6 (allocation 1, extents 4x3) while allocating gadget (node toolbar, owner GtkToolbar)
Tests run: 10, Failures: 0, Errors: 0, Skipped: 0, Time elapsed: 34.476 s - in org.eclipse.egit.ui.test.stagview.StagingViewTest
testAmend(org.eclipse.egit.ui.test.stagview.StagingViewTest)  Time elapsed: 3.918 s
testCommitSingleFile(org.eclipse.egit.ui.test.stagview.StagingViewTest)  Time elapsed: 2.848 s
testMergeConflict(org.eclipse.egit.ui.test.stagview.StagingViewTest)  Time elapsed: 4.846 s
testCommitMessageConfigChangeAmending(org.eclipse.egit.ui.test.stagview.StagingViewTest)  Time elapsed: 2.515 s
testCommitMessageConfigChangeWithAuthor(org.eclipse.egit.ui.test.stagview.StagingViewTest)  Time elapsed: 5.017 s
testCommitMessageConfigChange(org.eclipse.egit.ui.test.stagview.StagingViewTest)  Time elapsed: 2.869 s
testCommitMessageConfigChangeBranchSwitchToNew(org.eclipse.egit.ui.test.stagview.StagingViewTest)  Time elapsed: 2.974 s
testCommitMessageCommitterChangeSignOff(org.eclipse.egit.ui.test.stagview.StagingViewTest)  Time elapsed: 2.923 s
testCommitMessageConfigChangeNoSignOff(org.eclipse.egit.ui.test.stagview.StagingViewTest)  Time elapsed: 3.028 s
testDeleteModifyConflict(org.eclipse.egit.ui.test.stagview.StagingViewTest)  Time elapsed: 3.473 s
Running org.eclipse.egit.ui.test.stagview.CommitMessageProvidersTest

(SWT:1751): Gtk-WARNING **: 17:54:39.854: Negative content width -6 (allocation 1, extents 4x3) while allocating gadget (node toolbar, owner GtkToolbar)

(SWT:1751): Gtk-CRITICAL **: 17:54:40.495: gtk_box_gadget_distribute: assertion 'size >= 0' failed in GtkScrollbar

(SWT:1751): Gtk-CRITICAL **: 17:54:40.516: gtk_box_gadget_distribute: assertion 'size >= 0' failed in GtkScrollbar

(SWT:1751): Gtk-WARNING **: 17:54:40.526: Negative content width -6 (allocation 1, extents 4x3) while allocating gadget (node toolbar, owner GtkToolbar)

(SWT:1751): Gtk-CRITICAL **: 17:54:40.543: gtk_box_gadget_distribute: assertion 'size >= 0' failed in GtkScrollbar

(SWT:1751): Gtk-CRITICAL **: 17:54:40.561: gtk_box_gadget_distribute: assertion 'size >= 0' failed in GtkScrollbar

(SWT:1751): Gtk-CRITICAL **: 17:54:40.571: gtk_box_gadget_distribute: assertion 'size >= 0' failed in GtkScrollbar

(SWT:1751): Gtk-CRITICAL **: 17:54:40.583: gtk_box_gadget_distribute: assertion 'size >= 0' failed in GtkScrollbar

(SWT:1751): Gtk-CRITICAL **: 17:54:40.586: gtk_box_gadget_distribute: assertion 'size >= 0' failed in GtkScrollbar

(SWT:1751): Gtk-CRITICAL **: 17:54:40.587: gtk_box_gadget_distribute: assertion 'size >= 0' failed in GtkScrollbar

(SWT:1751): Gtk-CRITICAL **: 17:54:40.589: gtk_box_gadget_distribute: assertion 'size >= 0' failed in GtkScrollbar

(SWT:1751): Gtk-CRITICAL **: 17:54:40.589: gtk_box_gadget_distribute: assertion 'size >= 0' failed in GtkScrollbar

(SWT:1751): Gtk-CRITICAL **: 17:54:40.598: gtk_box_gadget_distribute: assertion 'size >= 0' failed in GtkScrollbar

(SWT:1751): Gtk-CRITICAL **: 17:54:40.599: gtk_box_gadget_distribute: assertion 'size >= 0' failed in GtkScrollbar

(SWT:1751): Gtk-CRITICAL **: 17:54:40.626: gtk_box_gadget_distribute: assertion 'size >= 0' failed in GtkScrollbar

(SWT:1751): Gtk-CRITICAL **: 17:54:40.626: gtk_box_gadget_distribute: assertion 'size >= 0' failed in GtkScrollbar

(SWT:1751): Gtk-CRITICAL **: 17:54:40.638: gtk_box_gadget_distribute: assertion 'size >= 0' failed in GtkScrollbar

(SWT:1751): Gtk-CRITICAL **: 17:54:40.638: gtk_box_gadget_distribute: assertion 'size >= 0' failed in GtkScrollbar

(SWT:1751): Gtk-CRITICAL **: 17:54:40.651: gtk_box_gadget_distribute: assertion 'size >= 0' failed in GtkScrollbar

(SWT:1751): Gtk-CRITICAL **: 17:54:40.662: gtk_box_gadget_distribute: assertion 'size >= 0' failed in GtkScrollbar

(SWT:1751): Gtk-CRITICAL **: 17:54:40.667: gtk_box_gadget_distribute: assertion 'size >= 0' failed in GtkScrollbar

(SWT:1751): Gtk-CRITICAL **: 17:54:40.684: gtk_box_gadget_distribute: assertion 'size >= 0' failed in GtkScrollbar

(SWT:1751): Gtk-CRITICAL **: 17:54:40.802: gtk_box_gadget_distribute: assertion 'size >= 0' failed in GtkScrollbar

(SWT:1751): Gtk-CRITICAL **: 17:54:40.818: gtk_box_gadget_distribute: assertion 'size >= 0' failed in GtkScrollbar

(SWT:1751): Gtk-CRITICAL **: 17:54:40.835: gtk_box_gadget_distribute: assertion 'size >= 0' failed in GtkScrollbar

(SWT:1751): Gtk-CRITICAL **: 17:54:40.851: gtk_box_gadget_distribute: assertion 'size >= 0' failed in GtkScrollbar

(SWT:1751): Gtk-CRITICAL **: 17:54:40.872: gtk_box_gadget_distribute: assertion 'size >= 0' failed in GtkScrollbar

(SWT:1751): Gtk-CRITICAL **: 17:54:40.873: gtk_box_gadget_distribute: assertion 'size >= 0' failed in GtkScrollbar

(SWT:1751): Gtk-CRITICAL **: 17:54:40.879: gtk_box_gadget_distribute: assertion 'size >= 0' failed in GtkScrollbar

(SWT:1751): Gtk-WARNING **: 17:54:40.980: Negative content width -6 (allocation 1, extents 4x3) while allocating gadget (node toolbar, owner GtkToolbar)

(SWT:1751): Gtk-WARNING **: 17:54:42.154: Negative content width -6 (allocation 1, extents 4x3) while allocating gadget (node toolbar, owner GtkToolbar)

(SWT:1751): Gtk-WARNING **: 17:54:42.174: Negative content width -6 (allocation 1, extents 4x3) while allocating gadget (node toolbar, owner GtkToolbar)

(SWT:1751): Gtk-WARNING **: 17:54:42.863: Negative content width -6 (allocation 1, extents 4x3) while allocating gadget (node toolbar, owner GtkToolbar)

(SWT:1751): Gtk-CRITICAL **: 17:54:43.613: gtk_box_gadget_distribute: assertion 'size >= 0' failed in GtkScrollbar

(SWT:1751): Gtk-CRITICAL **: 17:54:43.629: gtk_box_gadget_distribute: assertion 'size >= 0' failed in GtkScrollbar

(SWT:1751): Gtk-WARNING **: 17:54:43.637: Negative content width -6 (allocation 1, extents 4x3) while allocating gadget (node toolbar, owner GtkToolbar)

(SWT:1751): Gtk-CRITICAL **: 17:54:43.655: gtk_box_gadget_distribute: assertion 'size >= 0' failed in GtkScrollbar

(SWT:1751): Gtk-CRITICAL **: 17:54:43.670: gtk_box_gadget_distribute: assertion 'size >= 0' failed in GtkScrollbar

(SWT:1751): Gtk-CRITICAL **: 17:54:43.681: gtk_box_gadget_distribute: assertion 'size >= 0' failed in GtkScrollbar

(SWT:1751): Gtk-CRITICAL **: 17:54:43.690: gtk_box_gadget_distribute: assertion 'size >= 0' failed in GtkScrollbar

!ENTRY org.eclipse.egit.ui 2 0 2019-12-08 17:54:43.697
!MESSAGE Found multiple implementations of ICommitMessageProvider2. Ignoring caret positioning for org.eclipse.egit.ui.test.stagview.CommitMessageProvidersTest$TestCommitMessageProvider.

(SWT:1751): Gtk-CRITICAL **: 17:54:43.699: gtk_box_gadget_distribute: assertion 'size >= 0' failed in GtkScrollbar

(SWT:1751): Gtk-CRITICAL **: 17:54:43.699: gtk_box_gadget_distribute: assertion 'size >= 0' failed in GtkScrollbar

(SWT:1751): Gtk-CRITICAL **: 17:54:43.702: gtk_box_gadget_distribute: assertion 'size >= 0' failed in GtkScrollbar

(SWT:1751): Gtk-CRITICAL **: 17:54:43.702: gtk_box_gadget_distribute: assertion 'size >= 0' failed in GtkScrollbar

(SWT:1751): Gtk-CRITICAL **: 17:54:43.711: gtk_box_gadget_distribute: assertion 'size >= 0' failed in GtkScrollbar

(SWT:1751): Gtk-CRITICAL **: 17:54:43.712: gtk_box_gadget_distribute: assertion 'size >= 0' failed in GtkScrollbar

(SWT:1751): Gtk-CRITICAL **: 17:54:43.729: gtk_box_gadget_distribute: assertion 'size >= 0' failed in GtkScrollbar

(SWT:1751): Gtk-CRITICAL **: 17:54:43.729: gtk_box_gadget_distribute: assertion 'size >= 0' failed in GtkScrollbar

(SWT:1751): Gtk-CRITICAL **: 17:54:43.742: gtk_box_gadget_distribute: assertion 'size >= 0' failed in GtkScrollbar

(SWT:1751): Gtk-CRITICAL **: 17:54:43.742: gtk_box_gadget_distribute: assertion 'size >= 0' failed in GtkScrollbar

(SWT:1751): Gtk-CRITICAL **: 17:54:43.751: gtk_box_gadget_distribute: assertion 'size >= 0' failed in GtkScrollbar

(SWT:1751): Gtk-CRITICAL **: 17:54:43.758: gtk_box_gadget_distribute: assertion 'size >= 0' failed in GtkScrollbar

(SWT:1751): Gtk-CRITICAL **: 17:54:43.758: gtk_box_gadget_distribute: assertion 'size >= 0' failed in GtkScrollbar

(SWT:1751): Gtk-CRITICAL **: 17:54:43.774: gtk_box_gadget_distribute: assertion 'size >= 0' failed in GtkScrollbar

(SWT:1751): Gtk-CRITICAL **: 17:54:43.892: gtk_box_gadget_distribute: assertion 'size >= 0' failed in GtkScrollbar

(SWT:1751): Gtk-CRITICAL **: 17:54:43.907: gtk_box_gadget_distribute: assertion 'size >= 0' failed in GtkScrollbar

(SWT:1751): Gtk-CRITICAL **: 17:54:43.932: gtk_box_gadget_distribute: assertion 'size >= 0' failed in GtkScrollbar

(SWT:1751): Gtk-CRITICAL **: 17:54:43.959: gtk_box_gadget_distribute: assertion 'size >= 0' failed in GtkScrollbar

(SWT:1751): Gtk-CRITICAL **: 17:54:43.960: gtk_box_gadget_distribute: assertion 'size >= 0' failed in GtkScrollbar

(SWT:1751): Gtk-CRITICAL **: 17:54:43.966: gtk_box_gadget_distribute: assertion 'size >= 0' failed in GtkScrollbar

(SWT:1751): Gtk-WARNING **: 17:54:44.073: Negative content width -6 (allocation 1, extents 4x3) while allocating gadget (node toolbar, owner GtkToolbar)

(SWT:1751): Gtk-WARNING **: 17:54:45.252: Negative content width -6 (allocation 1, extents 4x3) while allocating gadget (node toolbar, owner GtkToolbar)

(SWT:1751): Gtk-WARNING **: 17:54:45.324: Negative content width -6 (allocation 1, extents 4x3) while allocating gadget (node toolbar, owner GtkToolbar)

(SWT:1751): Gtk-WARNING **: 17:54:45.993: Negative content width -6 (allocation 1, extents 4x3) while allocating gadget (node toolbar, owner GtkToolbar)

(SWT:1751): Gtk-CRITICAL **: 17:54:46.576: gtk_box_gadget_distribute: assertion 'size >= 0' failed in GtkScrollbar

(SWT:1751): Gtk-CRITICAL **: 17:54:46.594: gtk_box_gadget_distribute: assertion 'size >= 0' failed in GtkScrollbar

(SWT:1751): Gtk-WARNING **: 17:54:46.603: Negative content width -6 (allocation 1, extents 4x3) while allocating gadget (node toolbar, owner GtkToolbar)

(SWT:1751): Gtk-CRITICAL **: 17:54:46.620: gtk_box_gadget_distribute: assertion 'size >= 0' failed in GtkScrollbar

(SWT:1751): Gtk-CRITICAL **: 17:54:46.632: gtk_box_gadget_distribute: assertion 'size >= 0' failed in GtkScrollbar

(SWT:1751): Gtk-CRITICAL **: 17:54:46.644: gtk_box_gadget_distribute: assertion 'size >= 0' failed in GtkScrollbar

(SWT:1751): Gtk-CRITICAL **: 17:54:46.646: gtk_box_gadget_distribute: assertion 'size >= 0' failed in GtkScrollbar

(SWT:1751): Gtk-CRITICAL **: 17:54:46.665: gtk_box_gadget_distribute: assertion 'size >= 0' failed in GtkScrollbar

(SWT:1751): Gtk-CRITICAL **: 17:54:46.668: gtk_box_gadget_distribute: assertion 'size >= 0' failed in GtkScrollbar

(SWT:1751): Gtk-CRITICAL **: 17:54:46.668: gtk_box_gadget_distribute: assertion 'size >= 0' failed in GtkScrollbar

(SWT:1751): Gtk-CRITICAL **: 17:54:46.669: gtk_box_gadget_distribute: assertion 'size >= 0' failed in GtkScrollbar

(SWT:1751): Gtk-CRITICAL **: 17:54:46.670: gtk_box_gadget_distribute: assertion 'size >= 0' failed in GtkScrollbar

(SWT:1751): Gtk-CRITICAL **: 17:54:46.679: gtk_box_gadget_distribute: assertion 'size >= 0' failed in GtkScrollbar

(SWT:1751): Gtk-CRITICAL **: 17:54:46.680: gtk_box_gadget_distribute: assertion 'size >= 0' failed in GtkScrollbar

(SWT:1751): Gtk-CRITICAL **: 17:54:46.696: gtk_box_gadget_distribute: assertion 'size >= 0' failed in GtkScrollbar

(SWT:1751): Gtk-CRITICAL **: 17:54:46.699: gtk_box_gadget_distribute: assertion 'size >= 0' failed in GtkScrollbar

(SWT:1751): Gtk-CRITICAL **: 17:54:46.699: gtk_box_gadget_distribute: assertion 'size >= 0' failed in GtkScrollbar

(SWT:1751): Gtk-CRITICAL **: 17:54:46.716: gtk_box_gadget_distribute: assertion 'size >= 0' failed in GtkScrollbar

(SWT:1751): Gtk-CRITICAL **: 17:54:46.716: gtk_box_gadget_distribute: assertion 'size >= 0' failed in GtkScrollbar

(SWT:1751): Gtk-CRITICAL **: 17:54:46.732: gtk_box_gadget_distribute: assertion 'size >= 0' failed in GtkScrollbar

(SWT:1751): Gtk-CRITICAL **: 17:54:46.732: gtk_box_gadget_distribute: assertion 'size >= 0' failed in GtkScrollbar

(SWT:1751): Gtk-CRITICAL **: 17:54:46.750: gtk_box_gadget_distribute: assertion 'size >= 0' failed in GtkScrollbar

(SWT:1751): Gtk-CRITICAL **: 17:54:46.750: gtk_box_gadget_distribute: assertion 'size >= 0' failed in GtkScrollbar

(SWT:1751): Gtk-CRITICAL **: 17:54:46.766: gtk_box_gadget_distribute: assertion 'size >= 0' failed in GtkScrollbar

(SWT:1751): Gtk-CRITICAL **: 17:54:46.827: gtk_box_gadget_distribute: assertion 'size >= 0' failed in GtkScrollbar

(SWT:1751): Gtk-CRITICAL **: 17:54:46.843: gtk_box_gadget_distribute: assertion 'size >= 0' failed in GtkScrollbar

(SWT:1751): Gtk-CRITICAL **: 17:54:46.853: gtk_box_gadget_distribute: assertion 'size >= 0' failed in GtkScrollbar

(SWT:1751): Gtk-CRITICAL **: 17:54:46.867: gtk_box_gadget_distribute: assertion 'size >= 0' failed in GtkScrollbar

(SWT:1751): Gtk-CRITICAL **: 17:54:46.898: gtk_box_gadget_distribute: assertion 'size >= 0' failed in GtkScrollbar

(SWT:1751): Gtk-CRITICAL **: 17:54:46.931: gtk_box_gadget_distribute: assertion 'size >= 0' failed in GtkScrollbar

(SWT:1751): Gtk-CRITICAL **: 17:54:46.932: gtk_box_gadget_distribute: assertion 'size >= 0' failed in GtkScrollbar

(SWT:1751): Gtk-CRITICAL **: 17:54:46.938: gtk_box_gadget_distribute: assertion 'size >= 0' failed in GtkScrollbar

(SWT:1751): Gtk-WARNING **: 17:54:47.060: Negative content width -6 (allocation 1, extents 4x3) while allocating gadget (node toolbar, owner GtkToolbar)

(SWT:1751): Gtk-CRITICAL **: 17:54:47.986: gtk_box_gadget_distribute: assertion 'size >= 0' failed in GtkScrollbar

(SWT:1751): Gtk-CRITICAL **: 17:54:47.986: gtk_box_gadget_distribute: assertion 'size >= 0' failed in GtkScrollbar

(SWT:1751): Gtk-WARNING **: 17:54:48.189: Negative content width -6 (allocation 1, extents 4x3) while allocating gadget (node toolbar, owner GtkToolbar)

(SWT:1751): Gtk-WARNING **: 17:54:48.211: Negative content width -6 (allocation 1, extents 4x3) while allocating gadget (node toolbar, owner GtkToolbar)
Tests run: 3, Failures: 0, Errors: 0, Skipped: 0, Time elapsed: 9.07 s - in org.eclipse.egit.ui.test.stagview.CommitMessageProvidersTest
testCaretPosition(org.eclipse.egit.ui.test.stagview.CommitMessageProvidersTest)  Time elapsed: 3.014 s
testTwoProvidersFromSameExtension(org.eclipse.egit.ui.test.stagview.CommitMessageProvidersTest)  Time elapsed: 3.148 s
testCaretPositionUndefined(org.eclipse.egit.ui.test.stagview.CommitMessageProvidersTest)  Time elapsed: 2.889 s
Running org.eclipse.egit.ui.variables.DynamicVariablesTest
Tests run: 4, Failures: 0, Errors: 0, Skipped: 0, Time elapsed: 5.961 s - in org.eclipse.egit.ui.variables.DynamicVariablesTest
testGitBranch(org.eclipse.egit.ui.variables.DynamicVariablesTest)  Time elapsed: 1.154 s
testGitPath(org.eclipse.egit.ui.variables.DynamicVariablesTest)  Time elapsed: 1.166 s
testGitWorkTree(org.eclipse.egit.ui.variables.DynamicVariablesTest)  Time elapsed: 2.46 s
testGitDir(org.eclipse.egit.ui.variables.DynamicVariablesTest)  Time elapsed: 1.179 s
Running org.eclipse.egit.ui.gitflow.FeatureFinishSquashHandlerTest

(SWT:1751): Gtk-CRITICAL **: 17:54:55.204: gtk_box_gadget_distribute: assertion 'size >= 0' failed in GtkScrollbar

(SWT:1751): Gtk-CRITICAL **: 17:54:55.227: gtk_box_gadget_distribute: assertion 'size >= 0' failed in GtkScrollbar

(SWT:1751): Gtk-CRITICAL **: 17:54:55.247: gtk_box_gadget_distribute: assertion 'size >= 0' failed in GtkScrollbar

(SWT:1751): Gtk-CRITICAL **: 17:54:55.263: gtk_box_gadget_distribute: assertion 'size >= 0' failed in GtkScrollbar

(SWT:1751): Gtk-CRITICAL **: 17:54:55.280: gtk_box_gadget_distribute: assertion 'size >= 0' failed in GtkScrollbar

(SWT:1751): Gtk-CRITICAL **: 17:54:55.297: gtk_box_gadget_distribute: assertion 'size >= 0' failed in GtkScrollbar

(SWT:1751): Gtk-CRITICAL **: 17:54:55.320: gtk_box_gadget_distribute: assertion 'size >= 0' failed in GtkScrollbar

(SWT:1751): Gtk-CRITICAL **: 17:54:55.330: gtk_box_gadget_distribute: assertion 'size >= 0' failed in GtkScrollbar

(SWT:1751): Gtk-CRITICAL **: 17:54:55.347: gtk_box_gadget_distribute: assertion 'size >= 0' failed in GtkScrollbar

(SWT:1751): Gtk-CRITICAL **: 17:54:55.364: gtk_box_gadget_distribute: assertion 'size >= 0' failed in GtkScrollbar

(SWT:1751): Gtk-CRITICAL **: 17:54:55.385: gtk_box_gadget_distribute: assertion 'size >= 0' failed in GtkScrollbar

(SWT:1751): Gtk-CRITICAL **: 17:54:55.396: gtk_box_gadget_distribute: assertion 'size >= 0' failed in GtkScrollbar

(SWT:1751): Gtk-CRITICAL **: 17:54:55.413: gtk_box_gadget_distribute: assertion 'size >= 0' failed in GtkScrollbar

(SWT:1751): Gtk-CRITICAL **: 17:54:55.430: gtk_box_gadget_distribute: assertion 'size >= 0' failed in GtkScrollbar

(SWT:1751): Gtk-CRITICAL **: 17:54:55.446: gtk_box_gadget_distribute: assertion 'size >= 0' failed in GtkScrollbar

(SWT:1751): Gtk-CRITICAL **: 17:54:55.978: gtk_box_gadget_distribute: assertion 'size >= 0' failed in GtkScrollbar
Tests run: 1, Failures: 0, Errors: 0, Skipped: 0, Time elapsed: 3.564 s - in org.eclipse.egit.ui.gitflow.FeatureFinishSquashHandlerTest
testFeatureFinishSquash(org.eclipse.egit.ui.gitflow.FeatureFinishSquashHandlerTest)  Time elapsed: 3.551 s
Running org.eclipse.egit.ui.gitflow.FeatureStartFinishHandlerTest

(SWT:1751): Gtk-CRITICAL **: 17:54:58.865: gtk_box_gadget_distribute: assertion 'size >= 0' failed in GtkScrollbar

(SWT:1751): Gtk-CRITICAL **: 17:54:58.888: gtk_box_gadget_distribute: assertion 'size >= 0' failed in GtkScrollbar

(SWT:1751): Gtk-CRITICAL **: 17:54:58.904: gtk_box_gadget_distribute: assertion 'size >= 0' failed in GtkScrollbar

(SWT:1751): Gtk-CRITICAL **: 17:54:58.920: gtk_box_gadget_distribute: assertion 'size >= 0' failed in GtkScrollbar

(SWT:1751): Gtk-CRITICAL **: 17:54:58.937: gtk_box_gadget_distribute: assertion 'size >= 0' failed in GtkScrollbar

(SWT:1751): Gtk-CRITICAL **: 17:54:58.954: gtk_box_gadget_distribute: assertion 'size >= 0' failed in GtkScrollbar

(SWT:1751): Gtk-CRITICAL **: 17:54:58.970: gtk_box_gadget_distribute: assertion 'size >= 0' failed in GtkScrollbar

(SWT:1751): Gtk-CRITICAL **: 17:54:58.986: gtk_box_gadget_distribute: assertion 'size >= 0' failed in GtkScrollbar

(SWT:1751): Gtk-CRITICAL **: 17:54:59.003: gtk_box_gadget_distribute: assertion 'size >= 0' failed in GtkScrollbar

(SWT:1751): Gtk-CRITICAL **: 17:54:59.020: gtk_box_gadget_distribute: assertion 'size >= 0' failed in GtkScrollbar

(SWT:1751): Gtk-CRITICAL **: 17:54:59.037: gtk_box_gadget_distribute: assertion 'size >= 0' failed in GtkScrollbar

(SWT:1751): Gtk-CRITICAL **: 17:54:59.053: gtk_box_gadget_distribute: assertion 'size >= 0' failed in GtkScrollbar

(SWT:1751): Gtk-CRITICAL **: 17:54:59.070: gtk_box_gadget_distribute: assertion 'size >= 0' failed in GtkScrollbar

(SWT:1751): Gtk-CRITICAL **: 17:54:59.086: gtk_box_gadget_distribute: assertion 'size >= 0' failed in GtkScrollbar

(SWT:1751): Gtk-CRITICAL **: 17:54:59.102: gtk_box_gadget_distribute: assertion 'size >= 0' failed in GtkScrollbar

(SWT:1751): Gtk-CRITICAL **: 17:54:59.642: gtk_box_gadget_distribute: assertion 'size >= 0' failed in GtkScrollbar
Tests run: 1, Failures: 0, Errors: 0, Skipped: 0, Time elapsed: 2.481 s - in org.eclipse.egit.ui.gitflow.FeatureStartFinishHandlerTest
testFeatureStart(org.eclipse.egit.ui.gitflow.FeatureStartFinishHandlerTest)  Time elapsed: 2.472 s
Running org.eclipse.egit.ui.gitflow.InitHandlerTest
Tests run: 3, Failures: 0, Errors: 0, Skipped: 0, Time elapsed: 4.165 s - in org.eclipse.egit.ui.gitflow.InitHandlerTest
testInit(org.eclipse.egit.ui.gitflow.InitHandlerTest)  Time elapsed: 1.03 s
testInitEmptyRepoMissingMaster(org.eclipse.egit.ui.gitflow.InitHandlerTest)  Time elapsed: 1.705 s
testInitMissingMaster(org.eclipse.egit.ui.gitflow.InitHandlerTest)  Time elapsed: 1.414 s
Running org.eclipse.egit.ui.gitflow.FeatureRebaseHandlerTest

(SWT:1751): Gtk-WARNING **: 17:55:05.555: Negative content width -6 (allocation 1, extents 4x3) while allocating gadget (node toolbar, owner GtkToolbar)

(SWT:1751): Gtk-WARNING **: 17:55:05.565: Negative content width -6 (allocation 1, extents 4x3) while allocating gadget (node toolbar, owner GtkToolbar)

(SWT:1751): Gtk-WARNING **: 17:55:05.574: Negative content width -6 (allocation 1, extents 4x3) while allocating gadget (node toolbar, owner GtkToolbar)

(SWT:1751): Gtk-WARNING **: 17:55:05.577: Negative content width -6 (allocation 1, extents 4x3) while allocating gadget (node toolbar, owner GtkToolbar)

(SWT:1751): Gtk-WARNING **: 17:55:05.577: Negative content width -6 (allocation 1, extents 4x3) while allocating gadget (node toolbar, owner GtkToolbar)

(SWT:1751): Gtk-WARNING **: 17:55:05.640: Negative content width -6 (allocation 1, extents 4x3) while allocating gadget (node toolbar, owner GtkToolbar)

(SWT:1751): Gtk-WARNING **: 17:55:05.985: Negative content height -1 (allocation 1, extents 1x1) while allocating gadget (node scrolledwindow, owner GtkScrolledWindow)

(SWT:1751): Gtk-CRITICAL **: 17:55:05.985: gtk_box_gadget_distribute: assertion 'size >= 0' failed in GtkScrollbar

(SWT:1751): Gtk-WARNING **: 17:55:06.084: Negative content width -6 (allocation 1, extents 4x3) while allocating gadget (node toolbar, owner GtkToolbar)

(SWT:1751): Gtk-WARNING **: 17:55:07.549: Negative content height -1 (allocation 1, extents 1x1) while allocating gadget (node scrolledwindow, owner GtkScrolledWindow)

(SWT:1751): Gtk-CRITICAL **: 17:55:07.549: gtk_box_gadget_distribute: assertion 'size >= 0' failed in GtkScrollbar
Tests run: 2, Failures: 0, Errors: 0, Skipped: 0, Time elapsed: 3.164 s - in org.eclipse.egit.ui.gitflow.FeatureRebaseHandlerTest
testRebaseFailOnConflict(org.eclipse.egit.ui.gitflow.FeatureRebaseHandlerTest)  Time elapsed: 1.645 s
testRebaseFailOnDirtyWorkingDirectory(org.eclipse.egit.ui.gitflow.FeatureRebaseHandlerTest)  Time elapsed: 1.501 s
Running org.eclipse.egit.ui.gitflow.FeatureStartCheckoutConflictTest

(SWT:1751): Gtk-CRITICAL **: 17:55:08.529: gtk_box_gadget_distribute: assertion 'size >= 0' failed in GtkScrollbar

(SWT:1751): Gtk-CRITICAL **: 17:55:08.555: gtk_box_gadget_distribute: assertion 'size >= 0' failed in GtkScrollbar

(SWT:1751): Gtk-CRITICAL **: 17:55:08.564: gtk_box_gadget_distribute: assertion 'size >= 0' failed in GtkScrollbar
Tests run: 1, Failures: 0, Errors: 0, Skipped: 0, Time elapsed: 1.041 s - in org.eclipse.egit.ui.gitflow.FeatureStartCheckoutConflictTest
testFeatureStart(org.eclipse.egit.ui.gitflow.FeatureStartCheckoutConflictTest)  Time elapsed: 1.032 s
Running org.eclipse.egit.ui.gitflow.CommandEnablementTest

(SWT:1751): Gtk-WARNING **: 17:55:10.348: Negative content width -6 (allocation 1, extents 4x3) while allocating gadget (node toolbar, owner GtkToolbar)

(SWT:1751): Gtk-WARNING **: 17:55:10.717: Negative content width -6 (allocation 1, extents 4x3) while allocating gadget (node toolbar, owner GtkToolbar)
Tests run: 2, Failures: 0, Errors: 0, Skipped: 0, Time elapsed: 2.055 s - in org.eclipse.egit.ui.gitflow.CommandEnablementTest
testPackageExplorerStartFinishEnablement(org.eclipse.egit.ui.gitflow.CommandEnablementTest)  Time elapsed: 0.957 s
testRepositoryViewStartFinishEnablement(org.eclipse.egit.ui.gitflow.CommandEnablementTest)  Time elapsed: 1.085 s
Running org.eclipse.egit.ui.gitflow.FeatureFinishKeepBranchHandlerTest

(SWT:1751): Gtk-CRITICAL **: 17:55:11.659: gtk_box_gadget_distribute: assertion 'size >= 0' failed in GtkScrollbar

(SWT:1751): Gtk-CRITICAL **: 17:55:11.680: gtk_box_gadget_distribute: assertion 'size >= 0' failed in GtkScrollbar

(SWT:1751): Gtk-CRITICAL **: 17:55:11.696: gtk_box_gadget_distribute: assertion 'size >= 0' failed in GtkScrollbar

(SWT:1751): Gtk-CRITICAL **: 17:55:11.713: gtk_box_gadget_distribute: assertion 'size >= 0' failed in GtkScrollbar

(SWT:1751): Gtk-CRITICAL **: 17:55:11.730: gtk_box_gadget_distribute: assertion 'size >= 0' failed in GtkScrollbar

(SWT:1751): Gtk-CRITICAL **: 17:55:11.747: gtk_box_gadget_distribute: assertion 'size >= 0' failed in GtkScrollbar

(SWT:1751): Gtk-CRITICAL **: 17:55:11.763: gtk_box_gadget_distribute: assertion 'size >= 0' failed in GtkScrollbar

(SWT:1751): Gtk-CRITICAL **: 17:55:11.780: gtk_box_gadget_distribute: assertion 'size >= 0' failed in GtkScrollbar

(SWT:1751): Gtk-CRITICAL **: 17:55:11.796: gtk_box_gadget_distribute: assertion 'size >= 0' failed in GtkScrollbar

(SWT:1751): Gtk-CRITICAL **: 17:55:11.813: gtk_box_gadget_distribute: assertion 'size >= 0' failed in GtkScrollbar

(SWT:1751): Gtk-CRITICAL **: 17:55:11.830: gtk_box_gadget_distribute: assertion 'size >= 0' failed in GtkScrollbar

(SWT:1751): Gtk-CRITICAL **: 17:55:11.846: gtk_box_gadget_distribute: assertion 'size >= 0' failed in GtkScrollbar

(SWT:1751): Gtk-CRITICAL **: 17:55:11.862: gtk_box_gadget_distribute: assertion 'size >= 0' failed in GtkScrollbar

(SWT:1751): Gtk-CRITICAL **: 17:55:11.879: gtk_box_gadget_distribute: assertion 'size >= 0' failed in GtkScrollbar

(SWT:1751): Gtk-CRITICAL **: 17:55:11.896: gtk_box_gadget_distribute: assertion 'size >= 0' failed in GtkScrollbar

(SWT:1751): Gtk-CRITICAL **: 17:55:11.912: gtk_box_gadget_distribute: assertion 'size >= 0' failed in GtkScrollbar

(SWT:1751): Gtk-CRITICAL **: 17:55:12.445: gtk_box_gadget_distribute: assertion 'size >= 0' failed in GtkScrollbar
Tests run: 1, Failures: 0, Errors: 0, Skipped: 0, Time elapsed: 2.34 s - in org.eclipse.egit.ui.gitflow.FeatureFinishKeepBranchHandlerTest
testFeatureFinishKeepBranch(org.eclipse.egit.ui.gitflow.FeatureFinishKeepBranchHandlerTest)  Time elapsed: 2.33 s
Running org.eclipse.egit.ui.wizards.share.SharingWizardTest

(SWT:1751): Gtk-CRITICAL **: 17:55:13.256: gtk_box_gadget_distribute: assertion 'size >= 0' failed in GtkScrollbar

(SWT:1751): Gtk-WARNING **: 17:55:13.257: Negative content width -13 (allocation 5, extents 9x9) while allocating gadget (node entry, owner GtkEntry)

(SWT:1751): Gtk-WARNING **: 17:55:13.257: Negative content height -1 (allocation 1, extents 1x1) while allocating gadget (node scrolledwindow, owner GtkScrolledWindow)

(SWT:1751): Gtk-CRITICAL **: 17:55:13.258: gtk_box_gadget_distribute: assertion 'size >= 0' failed in GtkScrollbar

(SWT:1751): Gtk-CRITICAL **: 17:55:13.258: gtk_box_gadget_distribute: assertion 'size >= 0' failed in GtkScrollbar

(SWT:1751): Gtk-CRITICAL **: 17:55:13.523: gtk_box_gadget_distribute: assertion 'size >= 0' failed in GtkScrollbar

(SWT:1751): Gtk-WARNING **: 17:55:13.524: Negative content width -13 (allocation 5, extents 9x9) while allocating gadget (node entry, owner GtkEntry)

(SWT:1751): Gtk-WARNING **: 17:55:13.525: Negative content height -1 (allocation 1, extents 1x1) while allocating gadget (node scrolledwindow, owner GtkScrolledWindow)

(SWT:1751): Gtk-CRITICAL **: 17:55:13.525: gtk_box_gadget_distribute: assertion 'size >= 0' failed in GtkScrollbar

(SWT:1751): Gtk-CRITICAL **: 17:55:13.525: gtk_box_gadget_distribute: assertion 'size >= 0' failed in GtkScrollbar

(SWT:1751): Gtk-CRITICAL **: 17:55:13.793: gtk_box_gadget_distribute: assertion 'size >= 0' failed in GtkScrollbar

(SWT:1751): Gtk-WARNING **: 17:55:13.795: Negative content width -13 (allocation 5, extents 9x9) while allocating gadget (node entry, owner GtkEntry)

(SWT:1751): Gtk-WARNING **: 17:55:13.795: Negative content height -1 (allocation 1, extents 1x1) while allocating gadget (node scrolledwindow, owner GtkScrolledWindow)

(SWT:1751): Gtk-CRITICAL **: 17:55:13.795: gtk_box_gadget_distribute: assertion 'size >= 0' failed in GtkScrollbar

(SWT:1751): Gtk-CRITICAL **: 17:55:13.795: gtk_box_gadget_distribute: assertion 'size >= 0' failed in GtkScrollbar

(SWT:1751): Gtk-CRITICAL **: 17:55:14.036: gtk_box_gadget_distribute: assertion 'size >= 0' failed in GtkScrollbar

(SWT:1751): Gtk-WARNING **: 17:55:14.038: Negative content width -13 (allocation 5, extents 9x9) while allocating gadget (node entry, owner GtkEntry)

(SWT:1751): Gtk-WARNING **: 17:55:14.038: Negative content height -1 (allocation 1, extents 1x1) while allocating gadget (node scrolledwindow, owner GtkScrolledWindow)

(SWT:1751): Gtk-CRITICAL **: 17:55:14.038: gtk_box_gadget_distribute: assertion 'size >= 0' failed in GtkScrollbar

(SWT:1751): Gtk-CRITICAL **: 17:55:14.038: gtk_box_gadget_distribute: assertion 'size >= 0' failed in GtkScrollbar

(SWT:1751): Gtk-CRITICAL **: 17:55:14.980: gtk_box_gadget_distribute: assertion 'size >= 0' failed in GtkScrollbar

(SWT:1751): Gtk-WARNING **: 17:55:14.981: Negative content width -13 (allocation 5, extents 9x9) while allocating gadget (node entry, owner GtkEntry)

(SWT:1751): Gtk-WARNING **: 17:55:14.981: Negative content height -1 (allocation 1, extents 1x1) while allocating gadget (node scrolledwindow, owner GtkScrolledWindow)

(SWT:1751): Gtk-CRITICAL **: 17:55:14.981: gtk_box_gadget_distribute: assertion 'size >= 0' failed in GtkScrollbar

(SWT:1751): Gtk-CRITICAL **: 17:55:14.981: gtk_box_gadget_distribute: assertion 'size >= 0' failed in GtkScrollbar

(SWT:1751): Gtk-CRITICAL **: 17:55:15.271: gtk_box_gadget_distribute: assertion 'size >= 0' failed in GtkScrollbar

(SWT:1751): Gtk-WARNING **: 17:55:15.273: Negative content width -13 (allocation 5, extents 9x9) while allocating gadget (node entry, owner GtkEntry)

(SWT:1751): Gtk-WARNING **: 17:55:15.273: Negative content height -1 (allocation 1, extents 1x1) while allocating gadget (node scrolledwindow, owner GtkScrolledWindow)

(SWT:1751): Gtk-CRITICAL **: 17:55:15.273: gtk_box_gadget_distribute: assertion 'size >= 0' failed in GtkScrollbar

(SWT:1751): Gtk-CRITICAL **: 17:55:15.273: gtk_box_gadget_distribute: assertion 'size >= 0' failed in GtkScrollbar

(SWT:1751): Gtk-CRITICAL **: 17:55:15.620: gtk_box_gadget_distribute: assertion 'size >= 0' failed in GtkScrollbar

(SWT:1751): Gtk-WARNING **: 17:55:15.622: Negative content width -13 (allocation 5, extents 9x9) while allocating gadget (node entry, owner GtkEntry)

(SWT:1751): Gtk-WARNING **: 17:55:15.622: Negative content height -1 (allocation 1, extents 1x1) while allocating gadget (node scrolledwindow, owner GtkScrolledWindow)

(SWT:1751): Gtk-CRITICAL **: 17:55:15.622: gtk_box_gadget_distribute: assertion 'size >= 0' failed in GtkScrollbar

(SWT:1751): Gtk-CRITICAL **: 17:55:15.623: gtk_box_gadget_distribute: assertion 'size >= 0' failed in GtkScrollbar

(SWT:1751): Gtk-CRITICAL **: 17:55:16.497: gtk_box_gadget_distribute: assertion 'size >= 0' failed in GtkScrollbar

(SWT:1751): Gtk-WARNING **: 17:55:16.499: Negative content width -13 (allocation 5, extents 9x9) while allocating gadget (node entry, owner GtkEntry)

(SWT:1751): Gtk-WARNING **: 17:55:16.499: Negative content height -1 (allocation 1, extents 1x1) while allocating gadget (node scrolledwindow, owner GtkScrolledWindow)

(SWT:1751): Gtk-CRITICAL **: 17:55:16.499: gtk_box_gadget_distribute: assertion 'size >= 0' failed in GtkScrollbar

(SWT:1751): Gtk-CRITICAL **: 17:55:16.499: gtk_box_gadget_distribute: assertion 'size >= 0' failed in GtkScrollbar
Tests run: 3, Failures: 0, Errors: 0, Skipped: 0, Time elapsed: 4.908 s - in org.eclipse.egit.ui.wizards.share.SharingWizardTest
shareProjectWithExternalRepo(org.eclipse.egit.ui.wizards.share.SharingWizardTest)  Time elapsed: 1.735 s
shareProjectWithAlreadyCreatedRepos(org.eclipse.egit.ui.wizards.share.SharingWizardTest)  Time elapsed: 1.52 s
shareProjectAndCreateRepo(org.eclipse.egit.ui.wizards.share.SharingWizardTest)  Time elapsed: 1.647 s
Running org.eclipse.egit.ui.wizards.clone.GitCloneSourceProviderExtensionTest
Tests run: 1, Failures: 0, Errors: 0, Skipped: 0, Time elapsed: 0.002 s - in org.eclipse.egit.ui.wizards.clone.GitCloneSourceProviderExtensionTest
testGetRepositoryImports(org.eclipse.egit.ui.wizards.clone.GitCloneSourceProviderExtensionTest)  Time elapsed: 0.002 s
Running org.eclipse.egit.ui.wizards.clone.GitCloneWizardHttpTest
2019-12-08 17:55:18.770:INFO::WorkbenchTestable: Logging initialized @997532ms to org.eclipse.jetty.util.log.StdErrLog
2019-12-08 17:55:18.941:INFO:oejs.Server:WorkbenchTestable: jetty-9.4.22.v20191022; built: 2019-10-29T10:22:32.053Z; git: b1e6b55512e008f7fbdf1cbea4ff8a6446d1073b; jvm 1.8.0_212-b04
2019-12-08 17:55:19.020:INFO:oejsh.ContextHandler:WorkbenchTestable: Started o.e.j.s.ServletContextHandler@7c7bc5d1{/sbasic,null,AVAILABLE}
2019-12-08 17:55:19.083:INFO:oejs.AbstractConnector:WorkbenchTestable: Started ServerConnector@539744cc{HTTP/1.1,[http/1.1]}{127.0.0.1:40058}
2019-12-08 17:55:19.084:INFO:oejs.Server:WorkbenchTestable: Started @997846ms
2019-12-08 17:55:20.234:INFO:oeju.TypeUtil:qtp1503422498-989: JVM Runtime does not support Modules
2019-12-08 17:55:27.419:INFO:oejs.AbstractConnector:WorkbenchTestable: Stopped ServerConnector@539744cc{HTTP/1.1,[http/1.1]}{127.0.0.1:0}
2019-12-08 17:55:27.430:INFO:oejsh.ContextHandler:WorkbenchTestable: Stopped o.e.j.s.ServletContextHandler@7c7bc5d1{/sbasic,null,UNAVAILABLE}
Tests run: 1, Failures: 0, Errors: 0, Skipped: 0, Time elapsed: 9.322 s - in org.eclipse.egit.ui.wizards.clone.GitCloneWizardHttpTest
canCloneARemoteRepo(org.eclipse.egit.ui.wizards.clone.GitCloneWizardHttpTest)  Time elapsed: 8.328 s
Running org.eclipse.egit.ui.wizards.clone.GitCloneWizardHttpsTest
2019-12-08 17:55:29.000:INFO:oejs.Server:WorkbenchTestable: jetty-9.4.22.v20191022; built: 2019-10-29T10:22:32.053Z; git: b1e6b55512e008f7fbdf1cbea4ff8a6446d1073b; jvm 1.8.0_212-b04
2019-12-08 17:55:29.007:INFO:oejsh.ContextHandler:WorkbenchTestable: Started o.e.j.s.ServletContextHandler@73f11392{/sbasic,null,AVAILABLE}
2019-12-08 17:55:29.012:INFO:oejs.AbstractConnector:WorkbenchTestable: Started ServerConnector@77e8ef8b{HTTP/1.1,[http/1.1]}{127.0.0.1:33268}
2019-12-08 17:55:29.020:INFO:oejus.SslContextFactory:WorkbenchTestable: x509=X509@32743878(migration-agent-7w4jw,h=[],w=[]) for Client@7a3117a[provider=null,keyStore=file:///tmp/jks1038833153180226256/keystore.jks,trustStore=file:///tmp/jks1038833153180226256/keystore.jks]
2019-12-08 17:55:29.059:WARN:oejusS.config:WorkbenchTestable: Trusting all certificates configured for Client@7a3117a[provider=null,keyStore=file:///tmp/jks1038833153180226256/keystore.jks,trustStore=file:///tmp/jks1038833153180226256/keystore.jks]
2019-12-08 17:55:29.059:WARN:oejusS.config:WorkbenchTestable: No Client EndPointIdentificationAlgorithm configured for Client@7a3117a[provider=null,keyStore=file:///tmp/jks1038833153180226256/keystore.jks,trustStore=file:///tmp/jks1038833153180226256/keystore.jks]
2019-12-08 17:55:29.067:INFO:oejs.AbstractConnector:WorkbenchTestable: Started ServerConnector@276cfa73{SSL,[ssl, http/1.1]}{127.0.0.1:41658}
2019-12-08 17:55:29.067:INFO:oejs.Server:WorkbenchTestable: Started @1007829ms
2019-12-08 17:55:32.370:INFO:oejs.AbstractConnector:WorkbenchTestable: Stopped ServerConnector@77e8ef8b{HTTP/1.1,[http/1.1]}{127.0.0.1:0}
2019-12-08 17:55:32.372:INFO:oejs.AbstractConnector:WorkbenchTestable: Stopped ServerConnector@276cfa73{SSL,[ssl, http/1.1]}{127.0.0.1:0}
2019-12-08 17:55:32.377:INFO:oejsh.ContextHandler:WorkbenchTestable: Stopped o.e.j.s.ServletContextHandler@73f11392{/sbasic,null,UNAVAILABLE}
Tests run: 1, Failures: 0, Errors: 0, Skipped: 0, Time elapsed: 4.918 s - in org.eclipse.egit.ui.wizards.clone.GitCloneWizardHttpsTest
canCloneARemoteRepo(org.eclipse.egit.ui.wizards.clone.GitCloneWizardHttpsTest)  Time elapsed: 3.301 s
Running org.eclipse.egit.ui.wizards.clone.GitCloneWizardTest
Tests run: 9, Failures: 0, Errors: 0, Skipped: 2, Time elapsed: 8.552 s - in org.eclipse.egit.ui.wizards.clone.GitCloneWizardTest
canCloneARemoteRepo(org.eclipse.egit.ui.wizards.clone.GitCloneWizardTest)  Time elapsed: 1.669 s
invalidPortFreezesDialog(org.eclipse.egit.ui.wizards.clone.GitCloneWizardTest) skipped
updatesParameterFieldsInImportDialogWhenURIIsUpdated(org.eclipse.egit.ui.wizards.clone.GitCloneWizardTest)  Time elapsed: 1.669 s
clonedRepositoryShouldExistOnFileSystem(org.eclipse.egit.ui.wizards.clone.GitCloneWizardTest)  Time elapsed: 1.63 s
alteringSomeParametersDuringClone(org.eclipse.egit.ui.wizards.clone.GitCloneWizardTest)  Time elapsed: 1.391 s
gitStyleUriSelectsSshProtocol(org.eclipse.egit.ui.wizards.clone.GitCloneWizardTest)  Time elapsed: 0.536 s
invalidHostnameFreezesDialog(org.eclipse.egit.ui.wizards.clone.GitCloneWizardTest) skipped
acceptCloneCommandAsURI(org.eclipse.egit.ui.wizards.clone.GitCloneWizardTest)  Time elapsed: 0.639 s
testFileURIWithSpace(org.eclipse.egit.ui.wizards.clone.GitCloneWizardTest)  Time elapsed: 0.576 s
Running org.eclipse.egit.ui.wizards.pull.PullWizardTest

(SWT:1751): Gtk-WARNING **: 17:55:41.860: Negative content width -6 (allocation 1, extents 4x3) while allocating gadget (node toolbar, owner GtkToolbar)

(SWT:1751): Gtk-WARNING **: 17:55:44.537: Negative content width -6 (allocation 1, extents 4x3) while allocating gadget (node toolbar, owner GtkToolbar)
Tests run: 1, Failures: 0, Errors: 0, Skipped: 0, Time elapsed: 3.649 s - in org.eclipse.egit.ui.wizards.pull.PullWizardTest
pullFromProjectRepo(org.eclipse.egit.ui.wizards.pull.PullWizardTest)  Time elapsed: 3.641 s
Running org.eclipse.egit.ui.search.CommitSearchQueryTest
Tests run: 7, Failures: 0, Errors: 0, Skipped: 0, Time elapsed: 7.691 s - in org.eclipse.egit.ui.search.CommitSearchQueryTest
testQuery(org.eclipse.egit.ui.search.CommitSearchQueryTest)  Time elapsed: 0.583 s
testMatchMessage(org.eclipse.egit.ui.search.CommitSearchQueryTest)  Time elapsed: 0.643 s
testCaseInsensitive(org.eclipse.egit.ui.search.CommitSearchQueryTest)  Time elapsed: 2.865 s
testMatchCommit(org.eclipse.egit.ui.search.CommitSearchQueryTest)  Time elapsed: 0.603 s
testMatchParent(org.eclipse.egit.ui.search.CommitSearchQueryTest)  Time elapsed: 0.587 s
testMatchTree(org.eclipse.egit.ui.search.CommitSearchQueryTest)  Time elapsed: 0.625 s
testEmptyMatches(org.eclipse.egit.ui.search.CommitSearchQueryTest)  Time elapsed: 1.723 s
Running org.eclipse.egit.ui.search.CommitSearchDialogTest

(SWT:1751): Gtk-WARNING **: 17:55:53.221: Negative content width -6 (allocation 1, extents 4x3) while allocating gadget (node toolbar, owner GtkToolbar)

(SWT:1751): Gtk-WARNING **: 17:55:53.245: Negative content width -6 (allocation 1, extents 4x3) while allocating gadget (node toolbar, owner GtkToolbar)

(SWT:1751): Gtk-WARNING **: 17:55:53.333: Negative content width -6 (allocation 1, extents 4x3) while allocating gadget (node toolbar, owner GtkToolbar)

(SWT:1751): Gtk-WARNING **: 17:55:53.400: Negative content width -6 (allocation 1, extents 4x3) while allocating gadget (node toolbar, owner GtkToolbar)

(SWT:1751): Gtk-WARNING **: 17:55:54.134: Negative content width -6 (allocation 1, extents 4x3) while allocating gadget (node toolbar, owner GtkToolbar)
Tests run: 1, Failures: 0, Errors: 0, Skipped: 0, Time elapsed: 1.892 s - in org.eclipse.egit.ui.search.CommitSearchDialogTest
openCommitTabOnSearchDialog(org.eclipse.egit.ui.search.CommitSearchDialogTest)  Time elapsed: 1.884 s
Running org.eclipse.egit.ui.prefpages.configuration.GlobalConfigurationPageTest

!ENTRY org.eclipse.ui 2 2 2019-12-08 17:55:54.276
!MESSAGE Invalid preference category path: org.eclipse.ui.net.NetPreferences (bundle: org.eclipse.jsch.ui, page: org.eclipse.jsch.ui.SSHPreferences)

(SWT:1751): Gtk-WARNING **: 17:55:54.297: Negative content width -13 (allocation 5, extents 9x9) while allocating gadget (node entry, owner GtkEntry)

(SWT:1751): Gtk-WARNING **: 17:55:54.654: Negative content width -13 (allocation 5, extents 9x9) while allocating gadget (node entry, owner GtkEntry)

(SWT:1751): Gtk-WARNING **: 17:55:54.962: Negative content width -13 (allocation 5, extents 9x9) while allocating gadget (node entry, owner GtkEntry)

(SWT:1751): Gtk-WARNING **: 17:55:55.260: Negative content width -13 (allocation 5, extents 9x9) while allocating gadget (node entry, owner GtkEntry)

(SWT:1751): Gtk-WARNING **: 17:55:55.447: Negative content width -13 (allocation 5, extents 9x9) while allocating gadget (node entry, owner GtkEntry)

(SWT:1751): Gtk-WARNING **: 17:55:55.638: Negative content width -13 (allocation 5, extents 9x9) while allocating gadget (node entry, owner GtkEntry)

(SWT:1751): Gtk-WARNING **: 17:55:55.890: Negative content width -13 (allocation 5, extents 9x9) while allocating gadget (node entry, owner GtkEntry)

(SWT:1751): Gtk-WARNING **: 17:55:55.999: Negative content width -6 (allocation 1, extents 4x3) while allocating gadget (node toolbar, owner GtkToolbar)

(SWT:1751): Gtk-WARNING **: 17:55:55.999: Negative content height -3 (allocation 1, extents 2x2) while allocating gadget (node toolbar, owner GtkToolbar)

(SWT:1751): Gtk-WARNING **: 17:55:55.999: Negative content width -6 (allocation 1, extents 4x3) while allocating gadget (node toolbar, owner GtkToolbar)

(SWT:1751): Gtk-WARNING **: 17:55:55.999: Negative content height -3 (allocation 1, extents 2x2) while allocating gadget (node toolbar, owner GtkToolbar)

(SWT:1751): Gtk-WARNING **: 17:55:56.285: Negative content width -13 (allocation 5, extents 9x9) while allocating gadget (node entry, owner GtkEntry)

(SWT:1751): Gtk-WARNING **: 17:55:56.582: Negative content width -13 (allocation 5, extents 9x9) while allocating gadget (node entry, owner GtkEntry)

(SWT:1751): Gtk-WARNING **: 17:55:56.985: Negative content width -13 (allocation 5, extents 9x9) while allocating gadget (node entry, owner GtkEntry)

(SWT:1751): Gtk-WARNING **: 17:55:57.302: Negative content width -13 (allocation 5, extents 9x9) while allocating gadget (node entry, owner GtkEntry)

(SWT:1751): Gtk-WARNING **: 17:55:57.595: Negative content width -13 (allocation 5, extents 9x9) while allocating gadget (node entry, owner GtkEntry)
Tests run: 11, Failures: 0, Errors: 0, Skipped: 0, Time elapsed: 3.615 s - in org.eclipse.egit.ui.prefpages.configuration.GlobalConfigurationPageTest
testAddSubSectionEntry(org.eclipse.egit.ui.prefpages.configuration.GlobalConfigurationPageTest)  Time elapsed: 0.383 s
testAddSectionEntry(org.eclipse.egit.ui.prefpages.configuration.GlobalConfigurationPageTest)  Time elapsed: 0.306 s
testCanCreateSameEntryValue(org.eclipse.egit.ui.prefpages.configuration.GlobalConfigurationPageTest)  Time elapsed: 0.3 s
testNodes(org.eclipse.egit.ui.prefpages.configuration.GlobalConfigurationPageTest)  Time elapsed: 0.186 s
testRemoveValue(org.eclipse.egit.ui.prefpages.configuration.GlobalConfigurationPageTest)  Time elapsed: 0.192 s
testAddSubSectionEntryWithSuggestion(org.eclipse.egit.ui.prefpages.configuration.GlobalConfigurationPageTest)  Time elapsed: 0.252 s
testOpenEditor(org.eclipse.egit.ui.prefpages.configuration.GlobalConfigurationPageTest)  Time elapsed: 0.393 s
testSubsectionWithDot(org.eclipse.egit.ui.prefpages.configuration.GlobalConfigurationPageTest)  Time elapsed: 0.298 s
testChecksForKey(org.eclipse.egit.ui.prefpages.configuration.GlobalConfigurationPageTest)  Time elapsed: 0.402 s
testRemoveSubSection(org.eclipse.egit.ui.prefpages.configuration.GlobalConfigurationPageTest)  Time elapsed: 0.316 s
testRemoveSection(org.eclipse.egit.ui.prefpages.configuration.GlobalConfigurationPageTest)  Time elapsed: 0.292 s
Running org.eclipse.egit.ui.submodule.SubmoduleUpdateTest

(SWT:1751): Gtk-WARNING **: 17:55:58.701: Negative content width -6 (allocation 1, extents 4x3) while allocating gadget (node toolbar, owner GtkToolbar)

(SWT:1751): Gtk-WARNING **: 17:56:03.571: Negative content width -6 (allocation 1, extents 4x3) while allocating gadget (node toolbar, owner GtkToolbar)
Tests run: 1, Failures: 0, Errors: 0, Skipped: 0, Time elapsed: 5.807 s - in org.eclipse.egit.ui.submodule.SubmoduleUpdateTest
updateSubmodule(org.eclipse.egit.ui.submodule.SubmoduleUpdateTest)  Time elapsed: 5.795 s
Running org.eclipse.egit.ui.submodule.SubmoduleSyncTest

(SWT:1751): Gtk-WARNING **: 17:56:04.495: Negative content width -6 (allocation 1, extents 4x3) while allocating gadget (node toolbar, owner GtkToolbar)

(SWT:1751): Gtk-WARNING **: 17:56:09.169: Negative content width -6 (allocation 1, extents 4x3) while allocating gadget (node toolbar, owner GtkToolbar)
Tests run: 1, Failures: 0, Errors: 0, Skipped: 0, Time elapsed: 5.592 s - in org.eclipse.egit.ui.submodule.SubmoduleSyncTest
syncSubmodule(org.eclipse.egit.ui.submodule.SubmoduleSyncTest)  Time elapsed: 5.582 s
Running org.eclipse.egit.ui.submodule.SubmoduleAddTest

(SWT:1751): Gtk-WARNING **: 17:56:10.115: Negative content width -6 (allocation 1, extents 4x3) while allocating gadget (node toolbar, owner GtkToolbar)

(SWT:1751): Gtk-WARNING **: 17:56:14.702: Negative content width -6 (allocation 1, extents 4x3) while allocating gadget (node toolbar, owner GtkToolbar)
Tests run: 1, Failures: 0, Errors: 0, Skipped: 0, Time elapsed: 5.529 s - in org.eclipse.egit.ui.submodule.SubmoduleAddTest
addAtRoot(org.eclipse.egit.ui.submodule.SubmoduleAddTest)  Time elapsed: 5.519 s
Running org.eclipse.egit.ui.httpauth.PushTest
2019-12-08 17:56:14.934:INFO:oejs.Server:WorkbenchTestable: jetty-9.4.22.v20191022; built: 2019-10-29T10:22:32.053Z; git: b1e6b55512e008f7fbdf1cbea4ff8a6446d1073b; jvm 1.8.0_212-b04
2019-12-08 17:56:14.937:INFO:oejsh.ContextHandler:WorkbenchTestable: Started o.e.j.s.ServletContextHandler@52bce779{/sbasic,null,AVAILABLE}
2019-12-08 17:56:14.942:INFO:oejs.AbstractConnector:WorkbenchTestable: Started ServerConnector@7c50b16f{HTTP/1.1,[http/1.1]}{127.0.0.1:43211}
2019-12-08 17:56:14.942:INFO:oejs.Server:WorkbenchTestable: Started @1053704ms

(SWT:1751): Gtk-CRITICAL **: 17:56:15.863: gtk_box_gadget_distribute: assertion 'size >= 0' failed in GtkCheckButton
2019-12-08 17:56:17.126:INFO:oejs.AbstractConnector:WorkbenchTestable: Stopped ServerConnector@7c50b16f{HTTP/1.1,[http/1.1]}{127.0.0.1:0}
2019-12-08 17:56:17.131:INFO:oejsh.ContextHandler:WorkbenchTestable: Stopped o.e.j.s.ServletContextHandler@52bce779{/sbasic,null,UNAVAILABLE}
Tests run: 1, Failures: 0, Errors: 0, Skipped: 0, Time elapsed: 2.31 s - in org.eclipse.egit.ui.httpauth.PushTest
testPush(org.eclipse.egit.ui.httpauth.PushTest)  Time elapsed: 2.309 s
Running org.eclipse.egit.ui.operations.GitScopeUtilTest
Tests run: 5, Failures: 0, Errors: 0, Skipped: 0, Time elapsed: 4.679 s - in org.eclipse.egit.ui.operations.GitScopeUtilTest
relatedChangesWithPrompt(org.eclipse.egit.ui.operations.GitScopeUtilTest)  Time elapsed: 1.721 s
modelProviderWithExtensionFiles(org.eclipse.egit.ui.operations.GitScopeUtilTest)  Time elapsed: 0.621 s
relatedChangesWithInvalidParams(org.eclipse.egit.ui.operations.GitScopeUtilTest)  Time elapsed: 0.566 s
relatedChangesWithNullResources(org.eclipse.egit.ui.operations.GitScopeUtilTest)  Time elapsed: 0.557 s
relatedChangesWithEmptyResources(org.eclipse.egit.ui.operations.GitScopeUtilTest)  Time elapsed: 1.212 s

Results:

Errors: 
  HistoryViewTest.testSelectShownRefs:689->assertNoCommit:599 » Timeout Timeout ...

Tests run: 536, Failures: 0, Errors: 1, Skipped: 12


!ENTRY org.eclipse.core.resources 2 10035 2019-12-08 17:56:22.981
!MESSAGE The workspace will exit with unsaved changes in this session.
[INFO] ------------------------------------------------------------------------
[INFO] Reactor Summary for EGit Parent 5.7.0-SNAPSHOT:
[INFO] 
[INFO] EGit Parent ........................................ SUCCESS [ 34.330 s]
[INFO] EGit Target Platform Definition .................... SUCCESS [  1.160 s]
[INFO] Eclipse EGit ....................................... SUCCESS [  9.378 s]
[INFO] Git Team Provider (Core) ........................... SUCCESS [ 35.155 s]
[INFO] Git Team Provider (UI) ............................. SUCCESS [01:33 min]
[INFO] EGit Mylyn UI ...................................... SUCCESS [ 12.330 s]
[INFO] Git Team Provider (Documentation) .................. SUCCESS [  6.961 s]
[INFO] Eclipse EGit Feature ............................... SUCCESS [  1.478 s]
[INFO] EGit Mylyn Feature ................................. SUCCESS [  1.505 s]
[INFO] Git Flow ........................................... SUCCESS [ 12.608 s]
[INFO] Git Flow UI ........................................ SUCCESS [ 15.393 s]
[INFO] Eclipse EGit Gitflow Feature ....................... SUCCESS [  1.406 s]
[INFO] EGit JUnit Support ................................. SUCCESS [ 11.896 s]
[INFO] GitFlow Test Plug-in ............................... SUCCESS [ 38.221 s]
[INFO] Eclipse EGit Source Feature ........................ SUCCESS [  1.312 s]
[INFO] EGit P2 Repository ................................. SUCCESS [ 27.362 s]
[INFO] EGit Core Test Plug-in ............................. SUCCESS [02:45 min]
[INFO] EGit UI Test Plug-in ............................... FAILURE [17:45 min]
[INFO] EGit Mylyn UI Test Plug-in ......................... SKIPPED
[INFO] ------------------------------------------------------------------------
[INFO] BUILD FAILURE
[INFO] ------------------------------------------------------------------------
[INFO] Total time:  29:13 min
[INFO] Finished at: 2019-12-08T17:56:24Z
[INFO] ------------------------------------------------------------------------
[ERROR] Failed to execute goal org.eclipse.tycho:tycho-surefire-plugin:1.5.1:test (default-test) on project org.eclipse.egit.ui.test: There are test failures.
[ERROR] 
[ERROR] Please refer to /home/jenkins/agent/workspace/egit.gerrit/repo/org.eclipse.egit.ui.test/target/surefire-reports for the individual test results.
[ERROR] -> [Help 1]
org.apache.maven.lifecycle.LifecycleExecutionException: Failed to execute goal org.eclipse.tycho:tycho-surefire-plugin:1.5.1:test (default-test) on project org.eclipse.egit.ui.test: There are test failures.

Please refer to /home/jenkins/agent/workspace/egit.gerrit/repo/org.eclipse.egit.ui.test/target/surefire-reports for the individual test results.
    at org.apache.maven.lifecycle.internal.MojoExecutor.execute (MojoExecutor.java:215)
    at org.apache.maven.lifecycle.internal.MojoExecutor.execute (MojoExecutor.java:156)
    at org.apache.maven.lifecycle.internal.MojoExecutor.execute (MojoExecutor.java:148)
    at org.apache.maven.lifecycle.internal.LifecycleModuleBuilder.buildProject (LifecycleModuleBuilder.java:117)
    at org.apache.maven.lifecycle.internal.LifecycleModuleBuilder.buildProject (LifecycleModuleBuilder.java:81)
    at org.apache.maven.lifecycle.internal.builder.singlethreaded.SingleThreadedBuilder.build (SingleThreadedBuilder.java:56)
    at org.apache.maven.lifecycle.internal.LifecycleStarter.execute (LifecycleStarter.java:128)
    at org.apache.maven.DefaultMaven.doExecute (DefaultMaven.java:305)
    at org.apache.maven.DefaultMaven.doExecute (DefaultMaven.java:192)
    at org.apache.maven.DefaultMaven.execute (DefaultMaven.java:105)
    at org.apache.maven.cli.MavenCli.execute (MavenCli.java:956)
    at org.apache.maven.cli.MavenCli.doMain (MavenCli.java:288)
    at org.apache.maven.cli.MavenCli.main (MavenCli.java:192)
    at sun.reflect.NativeMethodAccessorImpl.invoke0 (Native Method)
    at sun.reflect.NativeMethodAccessorImpl.invoke (NativeMethodAccessorImpl.java:62)
    at sun.reflect.DelegatingMethodAccessorImpl.invoke (DelegatingMethodAccessorImpl.java:43)
    at java.lang.reflect.Method.invoke (Method.java:498)
    at org.codehaus.plexus.classworlds.launcher.Launcher.launchEnhanced (Launcher.java:282)
    at org.codehaus.plexus.classworlds.launcher.Launcher.launch (Launcher.java:225)
    at org.codehaus.plexus.classworlds.launcher.Launcher.mainWithExitCode (Launcher.java:406)
    at org.codehaus.plexus.classworlds.launcher.Launcher.main (Launcher.java:347)
Caused by: org.apache.maven.plugin.MojoFailureException: There are test failures.

Please refer to /home/jenkins/agent/workspace/egit.gerrit/repo/org.eclipse.egit.ui.test/target/surefire-reports for the individual test results.
    at org.eclipse.tycho.surefire.TestMojo.runTest (TestMojo.java:1050)
    at org.eclipse.tycho.surefire.TestMojo.execute (TestMojo.java:702)
    at org.apache.maven.plugin.DefaultBuildPluginManager.executeMojo (DefaultBuildPluginManager.java:137)
    at org.apache.maven.lifecycle.internal.MojoExecutor.execute (MojoExecutor.java:210)
    at org.apache.maven.lifecycle.internal.MojoExecutor.execute (MojoExecutor.java:156)
    at org.apache.maven.lifecycle.internal.MojoExecutor.execute (MojoExecutor.java:148)
    at org.apache.maven.lifecycle.internal.LifecycleModuleBuilder.buildProject (LifecycleModuleBuilder.java:117)
    at org.apache.maven.lifecycle.internal.LifecycleModuleBuilder.buildProject (LifecycleModuleBuilder.java:81)
    at org.apache.maven.lifecycle.internal.builder.singlethreaded.SingleThreadedBuilder.build (SingleThreadedBuilder.java:56)
    at org.apache.maven.lifecycle.internal.LifecycleStarter.execute (LifecycleStarter.java:128)
    at org.apache.maven.DefaultMaven.doExecute (DefaultMaven.java:305)
    at org.apache.maven.DefaultMaven.doExecute (DefaultMaven.java:192)
    at org.apache.maven.DefaultMaven.execute (DefaultMaven.java:105)
    at org.apache.maven.cli.MavenCli.execute (MavenCli.java:956)
    at org.apache.maven.cli.MavenCli.doMain (MavenCli.java:288)
    at org.apache.maven.cli.MavenCli.main (MavenCli.java:192)
    at sun.reflect.NativeMethodAccessorImpl.invoke0 (Native Method)
    at sun.reflect.NativeMethodAccessorImpl.invoke (NativeMethodAccessorImpl.java:62)
    at sun.reflect.DelegatingMethodAccessorImpl.invoke (DelegatingMethodAccessorImpl.java:43)
    at java.lang.reflect.Method.invoke (Method.java:498)
    at org.codehaus.plexus.classworlds.launcher.Launcher.launchEnhanced (Launcher.java:282)
    at org.codehaus.plexus.classworlds.launcher.Launcher.launch (Launcher.java:225)
    at org.codehaus.plexus.classworlds.launcher.Launcher.mainWithExitCode (Launcher.java:406)
    at org.codehaus.plexus.classworlds.launcher.Launcher.main (Launcher.java:347)
[ERROR] 
[ERROR] Re-run Maven using the -X switch to enable full debug logging.
[ERROR] 
[ERROR] For more information about the errors and possible solutions, please read the following articles:
[ERROR] [Help 1] http://cwiki.apache.org/confluence/display/MAVEN/MojoFailureException
[ERROR] 
[ERROR] After correcting the problems, you can resume the build with the command
[ERROR]   mvn <args> -rf :org.eclipse.egit.ui.test
[Pipeline] }
[Pipeline] // stage
[Pipeline] stage
[Pipeline] { (Results)
[Pipeline] junit
Recording test results
[Pipeline] archiveArtifacts
Archiving artifacts
[Pipeline] findbugs
[FINDBUGS] Collecting findbugs analysis files...
[FINDBUGS] Searching for all files in /home/jenkins/agent/workspace/egit.gerrit/repo that match the pattern */target/*bugsXml.xml
[FINDBUGS] Parsing 8 files in /home/jenkins/agent/workspace/egit.gerrit/repo
[FINDBUGS] Successfully parsed file /home/jenkins/agent/workspace/egit.gerrit/repo/org.eclipse.egit.core.junit/target/spotbugsXml.xml with 4 unique warnings and 0 duplicates.
[FINDBUGS] Successfully parsed file /home/jenkins/agent/workspace/egit.gerrit/repo/org.eclipse.egit.core.test/target/spotbugsXml.xml with 9 unique warnings and 0 duplicates.
[FINDBUGS] Successfully parsed file /home/jenkins/agent/workspace/egit.gerrit/repo/org.eclipse.egit.core/target/spotbugsXml.xml with 20 unique warnings and 0 duplicates.
[FINDBUGS] Successfully parsed file /home/jenkins/agent/workspace/egit.gerrit/repo/org.eclipse.egit.gitflow.test/target/spotbugsXml.xml with 20 unique warnings and 0 duplicates.
[FINDBUGS] Successfully parsed file /home/jenkins/agent/workspace/egit.gerrit/repo/org.eclipse.egit.gitflow.ui/target/spotbugsXml.xml with 20 unique warnings and 0 duplicates.
[FINDBUGS] Successfully parsed file /home/jenkins/agent/workspace/egit.gerrit/repo/org.eclipse.egit.gitflow/target/spotbugsXml.xml with 22 unique warnings and 0 duplicates.
[FINDBUGS] Successfully parsed file /home/jenkins/agent/workspace/egit.gerrit/repo/org.eclipse.egit.mylyn.ui/target/spotbugsXml.xml with 22 unique warnings and 0 duplicates.
[FINDBUGS] Successfully parsed file /home/jenkins/agent/workspace/egit.gerrit/repo/org.eclipse.egit.ui/target/spotbugsXml.xml with 59 unique warnings and 0 duplicates.
Skipping warnings blame since pipelines do not have an SCM link.%n
[FINDBUGS] Computing warning deltas based on reference build #1031
[Pipeline] dry
[DRY] Collecting duplicate code analysis files...
[DRY] Searching for all files in /home/jenkins/agent/workspace/egit.gerrit/repo that match the pattern **/cpd.xml
[DRY] Parsing 15 files in /home/jenkins/agent/workspace/egit.gerrit/repo
[DRY] Successfully parsed file /home/jenkins/agent/workspace/egit.gerrit/repo/org.eclipse.egit-feature/target/cpd.xml with 0 unique warnings and 0 duplicates.
[DRY] Successfully parsed file /home/jenkins/agent/workspace/egit.gerrit/repo/org.eclipse.egit.core.junit/target/cpd.xml with 0 unique warnings and 0 duplicates.
[DRY] Successfully parsed file /home/jenkins/agent/workspace/egit.gerrit/repo/org.eclipse.egit.core.test/target/cpd.xml with 0 unique warnings and 0 duplicates.
[DRY] Successfully parsed file /home/jenkins/agent/workspace/egit.gerrit/repo/org.eclipse.egit.core/target/cpd.xml with 4 unique warnings and 0 duplicates.
[DRY] Successfully parsed file /home/jenkins/agent/workspace/egit.gerrit/repo/org.eclipse.egit.doc/target/cpd.xml with 4 unique warnings and 0 duplicates.
[DRY] Successfully parsed file /home/jenkins/agent/workspace/egit.gerrit/repo/org.eclipse.egit.gitflow-feature/target/cpd.xml with 4 unique warnings and 0 duplicates.
[DRY] Successfully parsed file /home/jenkins/agent/workspace/egit.gerrit/repo/org.eclipse.egit.gitflow.test/target/cpd.xml with 4 unique warnings and 0 duplicates.
[DRY] Successfully parsed file /home/jenkins/agent/workspace/egit.gerrit/repo/org.eclipse.egit.gitflow.ui/target/cpd.xml with 4 unique warnings and 0 duplicates.
[DRY] Successfully parsed file /home/jenkins/agent/workspace/egit.gerrit/repo/org.eclipse.egit.gitflow/target/cpd.xml with 4 unique warnings and 0 duplicates.
[DRY] Successfully parsed file /home/jenkins/agent/workspace/egit.gerrit/repo/org.eclipse.egit.mylyn-feature/target/cpd.xml with 4 unique warnings and 0 duplicates.
[DRY] Successfully parsed file /home/jenkins/agent/workspace/egit.gerrit/repo/org.eclipse.egit.mylyn.ui/target/cpd.xml with 4 unique warnings and 0 duplicates.
[DRY] Successfully parsed file /home/jenkins/agent/workspace/egit.gerrit/repo/org.eclipse.egit.repository/target/cpd.xml with 4 unique warnings and 0 duplicates.
[DRY] Successfully parsed file /home/jenkins/agent/workspace/egit.gerrit/repo/org.eclipse.egit.source-feature/target/cpd.xml with 4 unique warnings and 0 duplicates.
[DRY] Successfully parsed file /home/jenkins/agent/workspace/egit.gerrit/repo/org.eclipse.egit.ui/target/cpd.xml with 37 unique warnings and 0 duplicates.
[DRY] Successfully parsed file /home/jenkins/agent/workspace/egit.gerrit/repo/org.eclipse.egit/target/cpd.xml with 37 unique warnings and 0 duplicates.
Skipping warnings blame since pipelines do not have an SCM link.%n
[DRY] Computing warning deltas based on reference build #1031
[Pipeline] }
[Pipeline] // stage
[Pipeline] }
[Pipeline] // dir
[Pipeline] }
Terminating xvnc.
[Pipeline] // wrap
[Pipeline] }
[Pipeline] // timeout
[Pipeline] }
[Pipeline] // node
[Pipeline] }
[Pipeline] // timestamps
[Pipeline] End of Pipeline
ERROR: script returned exit code 1
Finished: FAILURE