FailedConsole Output

Skipping 670 KB.. Full Log
est)  Time elapsed: 0.941 s
testGetSelectedFilters(org.eclipse.egit.ui.test.history.RefFilterHelperTest)  Time elapsed: 1.347 s
testSetSelectedFiltersNoSave(org.eclipse.egit.ui.test.history.RefFilterHelperTest)  Time elapsed: 0.699 s
testSaveSelectionStateAsLastSelectionState(org.eclipse.egit.ui.test.history.RefFilterHelperTest)  Time elapsed: 1.447 s
testSetSelectedFiltersWithSave(org.eclipse.egit.ui.test.history.RefFilterHelperTest)  Time elapsed: 5.172 s
testSetFilters(org.eclipse.egit.ui.test.history.RefFilterHelperTest)  Time elapsed: 4.346 s
testSetLastSelectedFiltersNoSave(org.eclipse.egit.ui.test.history.RefFilterHelperTest)  Time elapsed: 0.986 s
testRestoreLastSelectionState(org.eclipse.egit.ui.test.history.RefFilterHelperTest)  Time elapsed: 0.704 s
testGetMatchingRefsForSelectedRefFilters(org.eclipse.egit.ui.test.history.RefFilterHelperTest)  Time elapsed: 0.922 s
testSelectOnlyHEAD(org.eclipse.egit.ui.test.history.RefFilterHelperTest)  Time elapsed: 0.928 s
testGetLastSelectedFilters(org.eclipse.egit.ui.test.history.RefFilterHelperTest)  Time elapsed: 1.054 s
testConstructor(org.eclipse.egit.ui.test.history.RefFilterHelperTest)  Time elapsed: 1.207 s
testGetDefaults(org.eclipse.egit.ui.test.history.RefFilterHelperTest)  Time elapsed: 0.814 s
Running org.eclipse.egit.ui.test.commit.CommitEditorInputFactoryTest
Tests run: 2, Failures: 0, Errors: 0, Skipped: 0, Time elapsed: 1.234 s - in org.eclipse.egit.ui.test.commit.CommitEditorInputFactoryTest
shouldPersistAndRestoreStashCommit(org.eclipse.egit.ui.test.commit.CommitEditorInputFactoryTest)  Time elapsed: 0.669 s
shouldPersistAndRestoreCommit(org.eclipse.egit.ui.test.commit.CommitEditorInputFactoryTest)  Time elapsed: 0.557 s
Running org.eclipse.egit.ui.test.commit.CommitEditorTest

(SWT:1687): Gtk-WARNING **: 22:30:11.004: Negative content width -6 (allocation 1, extents 4x3) while allocating gadget (node toolbar, owner GtkToolbar)

(SWT:1687): Gtk-WARNING **: 22:30:11.004: Negative content height -3 (allocation 1, extents 2x2) while allocating gadget (node toolbar, owner GtkToolbar)

(SWT:1687): Gtk-WARNING **: 22:30:11.004: Negative content width -6 (allocation 1, extents 4x3) while allocating gadget (node toolbar, owner GtkToolbar)

(SWT:1687): Gtk-WARNING **: 22:30:11.004: Negative content height -3 (allocation 1, extents 2x2) while allocating gadget (node toolbar, owner GtkToolbar)

(SWT:1687): Gtk-WARNING **: 22:30:11.113: Negative content width -6 (allocation 1, extents 4x3) while allocating gadget (node toolbar, owner GtkToolbar)

(SWT:1687): Gtk-WARNING **: 22:30:11.138: Negative content width -6 (allocation 1, extents 4x3) while allocating gadget (node toolbar, owner GtkToolbar)

(SWT:1687): Gtk-CRITICAL **: 22:30:11.178: gtk_box_gadget_distribute: assertion 'size >= 0' failed in GtkScrollbar

(SWT:1687): Gtk-CRITICAL **: 22:30:11.178: gtk_box_gadget_distribute: assertion 'size >= 0' failed in GtkScrollbar

(SWT:1687): Gtk-CRITICAL **: 22:30:11.185: gtk_box_gadget_distribute: assertion 'size >= 0' failed in GtkScrollbar

(SWT:1687): Gtk-CRITICAL **: 22:30:11.185: gtk_box_gadget_distribute: assertion 'size >= 0' failed in GtkScrollbar

(SWT:1687): Gtk-CRITICAL **: 22:30:11.197: gtk_box_gadget_distribute: assertion 'size >= 0' failed in GtkScrollbar

(SWT:1687): Gtk-CRITICAL **: 22:30:11.197: gtk_box_gadget_distribute: assertion 'size >= 0' failed in GtkScrollbar

(SWT:1687): Gtk-CRITICAL **: 22:30:11.216: gtk_box_gadget_distribute: assertion 'size >= 0' failed in GtkScrollbar

(SWT:1687): Gtk-CRITICAL **: 22:30:11.216: gtk_box_gadget_distribute: assertion 'size >= 0' failed in GtkScrollbar

(SWT:1687): Gtk-CRITICAL **: 22:30:11.233: gtk_box_gadget_distribute: assertion 'size >= 0' failed in GtkScrollbar

(SWT:1687): Gtk-CRITICAL **: 22:30:11.233: gtk_box_gadget_distribute: assertion 'size >= 0' failed in GtkScrollbar

(SWT:1687): Gtk-WARNING **: 22:30:11.240: Negative content width -6 (allocation 1, extents 4x3) while allocating gadget (node toolbar, owner GtkToolbar)

(SWT:1687): Gtk-WARNING **: 22:30:11.240: Negative content height -3 (allocation 1, extents 2x2) while allocating gadget (node toolbar, owner GtkToolbar)

(SWT:1687): Gtk-WARNING **: 22:30:11.240: Negative content width -6 (allocation 1, extents 4x3) while allocating gadget (node toolbar, owner GtkToolbar)

(SWT:1687): Gtk-WARNING **: 22:30:11.240: Negative content height -3 (allocation 1, extents 2x2) while allocating gadget (node toolbar, owner GtkToolbar)

(SWT:1687): Gtk-WARNING **: 22:30:11.992: Negative content width -6 (allocation 1, extents 4x3) while allocating gadget (node toolbar, owner GtkToolbar)

(SWT:1687): Gtk-WARNING **: 22:30:11.992: Negative content height -3 (allocation 1, extents 2x2) while allocating gadget (node toolbar, owner GtkToolbar)

(SWT:1687): Gtk-WARNING **: 22:30:11.992: Negative content width -6 (allocation 1, extents 4x3) while allocating gadget (node toolbar, owner GtkToolbar)

(SWT:1687): Gtk-WARNING **: 22:30:11.992: Negative content height -3 (allocation 1, extents 2x2) while allocating gadget (node toolbar, owner GtkToolbar)

(SWT:1687): Gtk-WARNING **: 22:30:12.081: Negative content width -6 (allocation 1, extents 4x3) while allocating gadget (node toolbar, owner GtkToolbar)

(SWT:1687): Gtk-WARNING **: 22:30:12.104: Negative content width -6 (allocation 1, extents 4x3) while allocating gadget (node toolbar, owner GtkToolbar)

(SWT:1687): Gtk-CRITICAL **: 22:30:12.146: gtk_box_gadget_distribute: assertion 'size >= 0' failed in GtkScrollbar

(SWT:1687): Gtk-CRITICAL **: 22:30:12.146: gtk_box_gadget_distribute: assertion 'size >= 0' failed in GtkScrollbar

(SWT:1687): Gtk-CRITICAL **: 22:30:12.153: gtk_box_gadget_distribute: assertion 'size >= 0' failed in GtkScrollbar

(SWT:1687): Gtk-CRITICAL **: 22:30:12.153: gtk_box_gadget_distribute: assertion 'size >= 0' failed in GtkScrollbar

(SWT:1687): Gtk-CRITICAL **: 22:30:12.163: gtk_box_gadget_distribute: assertion 'size >= 0' failed in GtkScrollbar

(SWT:1687): Gtk-CRITICAL **: 22:30:12.164: gtk_box_gadget_distribute: assertion 'size >= 0' failed in GtkScrollbar
Tests run: 2, Failures: 0, Errors: 0, Skipped: 0, Time elapsed: 1.892 s - in org.eclipse.egit.ui.test.commit.CommitEditorTest
showAnnotations(org.eclipse.egit.ui.test.commit.CommitEditorTest)  Time elapsed: 1.008 s
openAllEditorPagesOnValidCommit(org.eclipse.egit.ui.test.commit.CommitEditorTest)  Time elapsed: 0.875 s
Running org.eclipse.egit.ui.test.commit.DiffRegionFormatterTest
Tests run: 1, Failures: 0, Errors: 0, Skipped: 0, Time elapsed: 0.551 s - in org.eclipse.egit.ui.test.commit.DiffRegionFormatterTest
testRanges(org.eclipse.egit.ui.test.commit.DiffRegionFormatterTest)  Time elapsed: 0.545 s
Running org.eclipse.egit.ui.test.commit.CommitEditorInputTest
Tests run: 3, Failures: 0, Errors: 0, Skipped: 0, Time elapsed: 2.21 s - in org.eclipse.egit.ui.test.commit.CommitEditorInputTest
testInput(org.eclipse.egit.ui.test.commit.CommitEditorInputTest)  Time elapsed: 0.665 s
testAdapters(org.eclipse.egit.ui.test.commit.CommitEditorInputTest)  Time elapsed: 0.756 s
testConstructorAsserts(org.eclipse.egit.ui.test.commit.CommitEditorInputTest)  Time elapsed: 0.578 s
Running org.eclipse.egit.ui.test.commit.RepositoryCommitTest
Tests run: 4, Failures: 0, Errors: 0, Skipped: 0, Time elapsed: 3.049 s - in org.eclipse.egit.ui.test.commit.RepositoryCommitTest
testDiffs(org.eclipse.egit.ui.test.commit.RepositoryCommitTest)  Time elapsed: 1.188 s
testAdapters(org.eclipse.egit.ui.test.commit.RepositoryCommitTest)  Time elapsed: 0.694 s
testGetters(org.eclipse.egit.ui.test.commit.RepositoryCommitTest)  Time elapsed: 0.552 s
testConstructorAsserts(org.eclipse.egit.ui.test.commit.RepositoryCommitTest)  Time elapsed: 0.597 s
Running org.eclipse.egit.ui.test.stagview.StagingViewTest

(SWT:1687): Gtk-WARNING **: 22:30:18.812: Negative content width -6 (allocation 1, extents 4x3) while allocating gadget (node toolbar, owner GtkToolbar)

(SWT:1687): Gtk-CRITICAL **: 22:30:19.144: gtk_box_gadget_distribute: assertion 'size >= 0' failed in GtkScrollbar

(SWT:1687): Gtk-CRITICAL **: 22:30:19.154: gtk_box_gadget_distribute: assertion 'size >= 0' failed in GtkScrollbar

(SWT:1687): Gtk-WARNING **: 22:30:19.159: Negative content width -6 (allocation 1, extents 4x3) while allocating gadget (node toolbar, owner GtkToolbar)

(SWT:1687): Gtk-CRITICAL **: 22:30:19.169: gtk_box_gadget_distribute: assertion 'size >= 0' failed in GtkScrollbar

(SWT:1687): Gtk-CRITICAL **: 22:30:19.176: gtk_box_gadget_distribute: assertion 'size >= 0' failed in GtkScrollbar

(SWT:1687): Gtk-CRITICAL **: 22:30:19.178: gtk_box_gadget_distribute: assertion 'size >= 0' failed in GtkScrollbar

(SWT:1687): Gtk-CRITICAL **: 22:30:19.178: gtk_box_gadget_distribute: assertion 'size >= 0' failed in GtkScrollbar

(SWT:1687): Gtk-CRITICAL **: 22:30:19.183: gtk_box_gadget_distribute: assertion 'size >= 0' failed in GtkScrollbar

(SWT:1687): Gtk-CRITICAL **: 22:30:19.183: gtk_box_gadget_distribute: assertion 'size >= 0' failed in GtkScrollbar

(SWT:1687): Gtk-CRITICAL **: 22:30:19.203: gtk_box_gadget_distribute: assertion 'size >= 0' failed in GtkScrollbar

(SWT:1687): Gtk-CRITICAL **: 22:30:19.211: gtk_box_gadget_distribute: assertion 'size >= 0' failed in GtkScrollbar

(SWT:1687): Gtk-CRITICAL **: 22:30:19.211: gtk_box_gadget_distribute: assertion 'size >= 0' failed in GtkScrollbar

(SWT:1687): Gtk-CRITICAL **: 22:30:19.227: gtk_box_gadget_distribute: assertion 'size >= 0' failed in GtkScrollbar

(SWT:1687): Gtk-CRITICAL **: 22:30:19.227: gtk_box_gadget_distribute: assertion 'size >= 0' failed in GtkScrollbar

(SWT:1687): Gtk-CRITICAL **: 22:30:19.251: gtk_box_gadget_distribute: assertion 'size >= 0' failed in GtkScrollbar

(SWT:1687): Gtk-CRITICAL **: 22:30:19.251: gtk_box_gadget_distribute: assertion 'size >= 0' failed in GtkScrollbar

(SWT:1687): Gtk-CRITICAL **: 22:30:19.260: gtk_box_gadget_distribute: assertion 'size >= 0' failed in GtkScrollbar

(SWT:1687): Gtk-CRITICAL **: 22:30:19.260: gtk_box_gadget_distribute: assertion 'size >= 0' failed in GtkScrollbar

(SWT:1687): Gtk-CRITICAL **: 22:30:19.277: gtk_box_gadget_distribute: assertion 'size >= 0' failed in GtkScrollbar

(SWT:1687): Gtk-CRITICAL **: 22:30:19.277: gtk_box_gadget_distribute: assertion 'size >= 0' failed in GtkScrollbar

(SWT:1687): Gtk-CRITICAL **: 22:30:19.294: gtk_box_gadget_distribute: assertion 'size >= 0' failed in GtkScrollbar

(SWT:1687): Gtk-CRITICAL **: 22:30:19.294: gtk_box_gadget_distribute: assertion 'size >= 0' failed in GtkScrollbar

(SWT:1687): Gtk-CRITICAL **: 22:30:19.319: gtk_box_gadget_distribute: assertion 'size >= 0' failed in GtkScrollbar

(SWT:1687): Gtk-CRITICAL **: 22:30:19.319: gtk_box_gadget_distribute: assertion 'size >= 0' failed in GtkScrollbar

(SWT:1687): Gtk-CRITICAL **: 22:30:19.327: gtk_box_gadget_distribute: assertion 'size >= 0' failed in GtkScrollbar

(SWT:1687): Gtk-CRITICAL **: 22:30:19.327: gtk_box_gadget_distribute: assertion 'size >= 0' failed in GtkScrollbar

(SWT:1687): Gtk-CRITICAL **: 22:30:19.344: gtk_box_gadget_distribute: assertion 'size >= 0' failed in GtkScrollbar

(SWT:1687): Gtk-CRITICAL **: 22:30:19.344: gtk_box_gadget_distribute: assertion 'size >= 0' failed in GtkScrollbar

(SWT:1687): Gtk-CRITICAL **: 22:30:19.360: gtk_box_gadget_distribute: assertion 'size >= 0' failed in GtkScrollbar

(SWT:1687): Gtk-CRITICAL **: 22:30:19.360: gtk_box_gadget_distribute: assertion 'size >= 0' failed in GtkScrollbar

(SWT:1687): Gtk-CRITICAL **: 22:30:19.377: gtk_box_gadget_distribute: assertion 'size >= 0' failed in GtkScrollbar

(SWT:1687): Gtk-CRITICAL **: 22:30:19.377: gtk_box_gadget_distribute: assertion 'size >= 0' failed in GtkScrollbar

(SWT:1687): Gtk-CRITICAL **: 22:30:19.393: gtk_box_gadget_distribute: assertion 'size >= 0' failed in GtkScrollbar

(SWT:1687): Gtk-CRITICAL **: 22:30:19.412: gtk_box_gadget_distribute: assertion 'size >= 0' failed in GtkScrollbar

(SWT:1687): Gtk-CRITICAL **: 22:30:19.412: gtk_box_gadget_distribute: assertion 'size >= 0' failed in GtkScrollbar

(SWT:1687): Gtk-CRITICAL **: 22:30:19.413: gtk_box_gadget_distribute: assertion 'size >= 0' failed in GtkScrollbar

(SWT:1687): Gtk-CRITICAL **: 22:30:19.414: gtk_box_gadget_distribute: assertion 'size >= 0' failed in GtkScrollbar

(SWT:1687): Gtk-CRITICAL **: 22:30:19.417: gtk_box_gadget_distribute: assertion 'size >= 0' failed in GtkScrollbar

(SWT:1687): Gtk-CRITICAL **: 22:30:19.427: gtk_box_gadget_distribute: assertion 'size >= 0' failed in GtkScrollbar

(SWT:1687): Gtk-CRITICAL **: 22:30:19.441: gtk_box_gadget_distribute: assertion 'size >= 0' failed in GtkScrollbar

(SWT:1687): Gtk-CRITICAL **: 22:30:19.441: gtk_box_gadget_distribute: assertion 'size >= 0' failed in GtkScrollbar

(SWT:1687): Gtk-CRITICAL **: 22:30:19.443: gtk_box_gadget_distribute: assertion 'size >= 0' failed in GtkScrollbar

(SWT:1687): Gtk-CRITICAL **: 22:30:19.444: gtk_box_gadget_distribute: assertion 'size >= 0' failed in GtkScrollbar

(SWT:1687): Gtk-CRITICAL **: 22:30:19.444: gtk_box_gadget_distribute: assertion 'size >= 0' failed in GtkScrollbar

(SWT:1687): Gtk-CRITICAL **: 22:30:19.450: gtk_box_gadget_distribute: assertion 'size >= 0' failed in GtkScrollbar

(SWT:1687): Gtk-CRITICAL **: 22:30:19.452: gtk_box_gadget_distribute: assertion 'size >= 0' failed in GtkScrollbar

(SWT:1687): Gtk-CRITICAL **: 22:30:19.452: gtk_box_gadget_distribute: assertion 'size >= 0' failed in GtkScrollbar

(SWT:1687): Gtk-CRITICAL **: 22:30:19.453: gtk_box_gadget_distribute: assertion 'size >= 0' failed in GtkScrollbar

(SWT:1687): Gtk-CRITICAL **: 22:30:19.462: gtk_box_gadget_distribute: assertion 'size >= 0' failed in GtkScrollbar

(SWT:1687): Gtk-CRITICAL **: 22:30:19.462: gtk_box_gadget_distribute: assertion 'size >= 0' failed in GtkScrollbar

(SWT:1687): Gtk-CRITICAL **: 22:30:19.488: gtk_box_gadget_distribute: assertion 'size >= 0' failed in GtkScrollbar

(SWT:1687): Gtk-CRITICAL **: 22:30:19.494: gtk_box_gadget_distribute: assertion 'size >= 0' failed in GtkScrollbar

(SWT:1687): Gtk-CRITICAL **: 22:30:19.495: gtk_box_gadget_distribute: assertion 'size >= 0' failed in GtkScrollbar

(SWT:1687): Gtk-CRITICAL **: 22:30:19.496: gtk_box_gadget_distribute: assertion 'size >= 0' failed in GtkScrollbar

(SWT:1687): Gtk-CRITICAL **: 22:30:19.499: gtk_box_gadget_distribute: assertion 'size >= 0' failed in GtkScrollbar

(SWT:1687): Gtk-CRITICAL **: 22:30:19.511: gtk_box_gadget_distribute: assertion 'size >= 0' failed in GtkScrollbar

(SWT:1687): Gtk-CRITICAL **: 22:30:19.532: gtk_box_gadget_distribute: assertion 'size >= 0' failed in GtkScrollbar

(SWT:1687): Gtk-CRITICAL **: 22:30:19.533: gtk_box_gadget_distribute: assertion 'size >= 0' failed in GtkScrollbar

(SWT:1687): Gtk-CRITICAL **: 22:30:19.533: gtk_box_gadget_distribute: assertion 'size >= 0' failed in GtkScrollbar

(SWT:1687): Gtk-CRITICAL **: 22:30:19.544: gtk_box_gadget_distribute: assertion 'size >= 0' failed in GtkScrollbar

(SWT:1687): Gtk-CRITICAL **: 22:30:20.086: gtk_box_gadget_distribute: assertion 'size >= 0' failed in GtkScrollbar

(SWT:1687): Gtk-CRITICAL **: 22:30:20.096: gtk_box_gadget_distribute: assertion 'size >= 0' failed in GtkScrollbar

(SWT:1687): Gtk-CRITICAL **: 22:30:20.106: gtk_box_gadget_distribute: assertion 'size >= 0' failed in GtkScrollbar

(SWT:1687): Gtk-CRITICAL **: 22:30:20.106: gtk_box_gadget_distribute: assertion 'size >= 0' failed in GtkScrollbar

(SWT:1687): Gtk-CRITICAL **: 22:30:20.108: gtk_box_gadget_distribute: assertion 'size >= 0' failed in GtkScrollbar

(SWT:1687): Gtk-CRITICAL **: 22:30:20.108: gtk_box_gadget_distribute: assertion 'size >= 0' failed in GtkScrollbar

(SWT:1687): Gtk-CRITICAL **: 22:30:20.111: gtk_box_gadget_distribute: assertion 'size >= 0' failed in GtkScrollbar

(SWT:1687): Gtk-CRITICAL **: 22:30:20.120: gtk_box_gadget_distribute: assertion 'size >= 0' failed in GtkScrollbar

(SWT:1687): Gtk-CRITICAL **: 22:30:20.182: gtk_box_gadget_distribute: assertion 'size >= 0' failed in GtkScrollbar

(SWT:1687): Gtk-CRITICAL **: 22:30:20.183: gtk_box_gadget_distribute: assertion 'size >= 0' failed in GtkScrollbar

(SWT:1687): Gtk-CRITICAL **: 22:30:20.184: gtk_box_gadget_distribute: assertion 'size >= 0' failed in GtkScrollbar

(SWT:1687): Gtk-WARNING **: 22:30:20.201: Negative content width -1 (allocation 1, extents 1x1) while allocating gadget (node trough, owner GtkProgressBar)

(SWT:1687): Gtk-WARNING **: 22:30:20.203: Negative content width -1 (allocation 1, extents 1x1) while allocating gadget (node trough, owner GtkProgressBar)

(SWT:1687): Gtk-WARNING **: 22:30:20.208: Negative content width -1 (allocation 1, extents 1x1) while allocating gadget (node trough, owner GtkProgressBar)

(SWT:1687): Gtk-WARNING **: 22:30:20.211: Negative content width -1 (allocation 1, extents 1x1) while allocating gadget (node trough, owner GtkProgressBar)

(SWT:1687): Gtk-WARNING **: 22:30:20.216: Negative content width -1 (allocation 1, extents 1x1) while allocating gadget (node trough, owner GtkProgressBar)

(SWT:1687): Gtk-WARNING **: 22:30:20.219: Negative content width -1 (allocation 1, extents 1x1) while allocating gadget (node trough, owner GtkProgressBar)

(SWT:1687): Gtk-CRITICAL **: 22:30:20.222: gtk_box_gadget_distribute: assertion 'size >= 0' failed in GtkScrollbar

(SWT:1687): Gtk-CRITICAL **: 22:30:20.222: gtk_box_gadget_distribute: assertion 'size >= 0' failed in GtkScrollbar

(SWT:1687): Gtk-CRITICAL **: 22:30:20.283: gtk_box_gadget_distribute: assertion 'size >= 0' failed in GtkScrollbar

(SWT:1687): Gtk-CRITICAL **: 22:30:20.289: gtk_box_gadget_distribute: assertion 'size >= 0' failed in GtkScrollbar

(SWT:1687): Gtk-CRITICAL **: 22:30:20.290: gtk_box_gadget_distribute: assertion 'size >= 0' failed in GtkScrollbar

(SWT:1687): Gtk-CRITICAL **: 22:30:20.290: gtk_box_gadget_distribute: assertion 'size >= 0' failed in GtkScrollbar

(SWT:1687): Gtk-CRITICAL **: 22:30:20.294: gtk_box_gadget_distribute: assertion 'size >= 0' failed in GtkScrollbar

(SWT:1687): Gtk-CRITICAL **: 22:30:20.304: gtk_box_gadget_distribute: assertion 'size >= 0' failed in GtkScrollbar

(SWT:1687): Gtk-WARNING **: 22:30:20.386: Negative content width -6 (allocation 1, extents 4x3) while allocating gadget (node toolbar, owner GtkToolbar)

(SWT:1687): Gtk-WARNING **: 22:30:20.770: Negative content width -6 (allocation 1, extents 4x3) while allocating gadget (node toolbar, owner GtkToolbar)

(SWT:1687): Gtk-WARNING **: 22:30:20.797: Negative content width -6 (allocation 1, extents 4x3) while allocating gadget (node toolbar, owner GtkToolbar)

(SWT:1687): Gtk-WARNING **: 22:30:21.443: Negative content width -6 (allocation 1, extents 4x3) while allocating gadget (node toolbar, owner GtkToolbar)

(SWT:1687): Gtk-CRITICAL **: 22:30:21.876: gtk_box_gadget_distribute: assertion 'size >= 0' failed in GtkScrollbar

(SWT:1687): Gtk-CRITICAL **: 22:30:21.886: gtk_box_gadget_distribute: assertion 'size >= 0' failed in GtkScrollbar

(SWT:1687): Gtk-WARNING **: 22:30:21.891: Negative content width -6 (allocation 1, extents 4x3) while allocating gadget (node toolbar, owner GtkToolbar)

(SWT:1687): Gtk-CRITICAL **: 22:30:21.901: gtk_box_gadget_distribute: assertion 'size >= 0' failed in GtkScrollbar

(SWT:1687): Gtk-CRITICAL **: 22:30:21.908: gtk_box_gadget_distribute: assertion 'size >= 0' failed in GtkScrollbar

(SWT:1687): Gtk-CRITICAL **: 22:30:21.910: gtk_box_gadget_distribute: assertion 'size >= 0' failed in GtkScrollbar

(SWT:1687): Gtk-CRITICAL **: 22:30:21.910: gtk_box_gadget_distribute: assertion 'size >= 0' failed in GtkScrollbar

(SWT:1687): Gtk-CRITICAL **: 22:30:21.915: gtk_box_gadget_distribute: assertion 'size >= 0' failed in GtkScrollbar

(SWT:1687): Gtk-CRITICAL **: 22:30:21.915: gtk_box_gadget_distribute: assertion 'size >= 0' failed in GtkScrollbar

(SWT:1687): Gtk-CRITICAL **: 22:30:21.927: gtk_box_gadget_distribute: assertion 'size >= 0' failed in GtkScrollbar

(SWT:1687): Gtk-CRITICAL **: 22:30:21.943: gtk_box_gadget_distribute: assertion 'size >= 0' failed in GtkScrollbar

(SWT:1687): Gtk-CRITICAL **: 22:30:21.943: gtk_box_gadget_distribute: assertion 'size >= 0' failed in GtkScrollbar

(SWT:1687): Gtk-CRITICAL **: 22:30:21.958: gtk_box_gadget_distribute: assertion 'size >= 0' failed in GtkScrollbar

(SWT:1687): Gtk-CRITICAL **: 22:30:21.959: gtk_box_gadget_distribute: assertion 'size >= 0' failed in GtkScrollbar

(SWT:1687): Gtk-CRITICAL **: 22:30:21.975: gtk_box_gadget_distribute: assertion 'size >= 0' failed in GtkScrollbar

(SWT:1687): Gtk-CRITICAL **: 22:30:21.975: gtk_box_gadget_distribute: assertion 'size >= 0' failed in GtkScrollbar

(SWT:1687): Gtk-CRITICAL **: 22:30:21.992: gtk_box_gadget_distribute: assertion 'size >= 0' failed in GtkScrollbar

(SWT:1687): Gtk-CRITICAL **: 22:30:21.992: gtk_box_gadget_distribute: assertion 'size >= 0' failed in GtkScrollbar

(SWT:1687): Gtk-CRITICAL **: 22:30:22.008: gtk_box_gadget_distribute: assertion 'size >= 0' failed in GtkScrollbar

(SWT:1687): Gtk-CRITICAL **: 22:30:22.009: gtk_box_gadget_distribute: assertion 'size >= 0' failed in GtkScrollbar

(SWT:1687): Gtk-CRITICAL **: 22:30:22.026: gtk_box_gadget_distribute: assertion 'size >= 0' failed in GtkScrollbar

(SWT:1687): Gtk-CRITICAL **: 22:30:22.026: gtk_box_gadget_distribute: assertion 'size >= 0' failed in GtkScrollbar

(SWT:1687): Gtk-CRITICAL **: 22:30:22.056: gtk_box_gadget_distribute: assertion 'size >= 0' failed in GtkScrollbar

(SWT:1687): Gtk-CRITICAL **: 22:30:22.056: gtk_box_gadget_distribute: assertion 'size >= 0' failed in GtkScrollbar

(SWT:1687): Gtk-CRITICAL **: 22:30:22.064: gtk_box_gadget_distribute: assertion 'size >= 0' failed in GtkScrollbar

(SWT:1687): Gtk-CRITICAL **: 22:30:22.064: gtk_box_gadget_distribute: assertion 'size >= 0' failed in GtkScrollbar

(SWT:1687): Gtk-CRITICAL **: 22:30:22.076: gtk_box_gadget_distribute: assertion 'size >= 0' failed in GtkScrollbar

(SWT:1687): Gtk-CRITICAL **: 22:30:22.076: gtk_box_gadget_distribute: assertion 'size >= 0' failed in GtkScrollbar

(SWT:1687): Gtk-CRITICAL **: 22:30:22.078: gtk_box_gadget_distribute: assertion 'size >= 0' failed in GtkScrollbar

(SWT:1687): Gtk-CRITICAL **: 22:30:22.078: gtk_box_gadget_distribute: assertion 'size >= 0' failed in GtkScrollbar

(SWT:1687): Gtk-CRITICAL **: 22:30:22.082: gtk_box_gadget_distribute: assertion 'size >= 0' failed in GtkScrollbar

(SWT:1687): Gtk-CRITICAL **: 22:30:22.082: gtk_box_gadget_distribute: assertion 'size >= 0' failed in GtkScrollbar

(SWT:1687): Gtk-CRITICAL **: 22:30:22.082: gtk_box_gadget_distribute: assertion 'size >= 0' failed in GtkScrollbar

(SWT:1687): Gtk-CRITICAL **: 22:30:22.090: gtk_box_gadget_distribute: assertion 'size >= 0' failed in GtkScrollbar

(SWT:1687): Gtk-CRITICAL **: 22:30:22.108: gtk_box_gadget_distribute: assertion 'size >= 0' failed in GtkScrollbar

(SWT:1687): Gtk-CRITICAL **: 22:30:22.108: gtk_box_gadget_distribute: assertion 'size >= 0' failed in GtkScrollbar

(SWT:1687): Gtk-CRITICAL **: 22:30:22.124: gtk_box_gadget_distribute: assertion 'size >= 0' failed in GtkScrollbar

(SWT:1687): Gtk-CRITICAL **: 22:30:22.148: gtk_box_gadget_distribute: assertion 'size >= 0' failed in GtkScrollbar

(SWT:1687): Gtk-CRITICAL **: 22:30:22.148: gtk_box_gadget_distribute: assertion 'size >= 0' failed in GtkScrollbar

(SWT:1687): Gtk-CRITICAL **: 22:30:22.150: gtk_box_gadget_distribute: assertion 'size >= 0' failed in GtkScrollbar

(SWT:1687): Gtk-CRITICAL **: 22:30:22.160: gtk_box_gadget_distribute: assertion 'size >= 0' failed in GtkScrollbar

(SWT:1687): Gtk-CRITICAL **: 22:30:22.160: gtk_box_gadget_distribute: assertion 'size >= 0' failed in GtkScrollbar

(SWT:1687): Gtk-CRITICAL **: 22:30:22.175: gtk_box_gadget_distribute: assertion 'size >= 0' failed in GtkScrollbar

(SWT:1687): Gtk-CRITICAL **: 22:30:22.180: gtk_box_gadget_distribute: assertion 'size >= 0' failed in GtkScrollbar

(SWT:1687): Gtk-CRITICAL **: 22:30:22.182: gtk_box_gadget_distribute: assertion 'size >= 0' failed in GtkScrollbar

(SWT:1687): Gtk-CRITICAL **: 22:30:22.182: gtk_box_gadget_distribute: assertion 'size >= 0' failed in GtkScrollbar

(SWT:1687): Gtk-CRITICAL **: 22:30:22.184: gtk_box_gadget_distribute: assertion 'size >= 0' failed in GtkScrollbar

(SWT:1687): Gtk-CRITICAL **: 22:30:22.188: gtk_box_gadget_distribute: assertion 'size >= 0' failed in GtkScrollbar

(SWT:1687): Gtk-WARNING **: 22:30:22.333: Negative content width -6 (allocation 1, extents 4x3) while allocating gadget (node toolbar, owner GtkToolbar)

(SWT:1687): Gtk-WARNING **: 22:30:22.666: Negative content width -6 (allocation 1, extents 4x3) while allocating gadget (node toolbar, owner GtkToolbar)

(SWT:1687): Gtk-WARNING **: 22:30:22.691: Negative content width -6 (allocation 1, extents 4x3) while allocating gadget (node toolbar, owner GtkToolbar)

(SWT:1687): Gtk-WARNING **: 22:30:23.467: Negative content width -6 (allocation 1, extents 4x3) while allocating gadget (node toolbar, owner GtkToolbar)

(SWT:1687): Gtk-CRITICAL **: 22:30:23.798: gtk_box_gadget_distribute: assertion 'size >= 0' failed in GtkScrollbar

(SWT:1687): Gtk-CRITICAL **: 22:30:23.814: gtk_box_gadget_distribute: assertion 'size >= 0' failed in GtkScrollbar

(SWT:1687): Gtk-WARNING **: 22:30:23.819: Negative content width -6 (allocation 1, extents 4x3) while allocating gadget (node toolbar, owner GtkToolbar)

(SWT:1687): Gtk-CRITICAL **: 22:30:23.830: gtk_box_gadget_distribute: assertion 'size >= 0' failed in GtkScrollbar

(SWT:1687): Gtk-CRITICAL **: 22:30:23.835: gtk_box_gadget_distribute: assertion 'size >= 0' failed in GtkScrollbar

(SWT:1687): Gtk-CRITICAL **: 22:30:23.837: gtk_box_gadget_distribute: assertion 'size >= 0' failed in GtkScrollbar

(SWT:1687): Gtk-CRITICAL **: 22:30:23.838: gtk_box_gadget_distribute: assertion 'size >= 0' failed in GtkScrollbar

(SWT:1687): Gtk-CRITICAL **: 22:30:23.845: gtk_box_gadget_distribute: assertion 'size >= 0' failed in GtkScrollbar

(SWT:1687): Gtk-CRITICAL **: 22:30:23.845: gtk_box_gadget_distribute: assertion 'size >= 0' failed in GtkScrollbar

(SWT:1687): Gtk-CRITICAL **: 22:30:23.859: gtk_box_gadget_distribute: assertion 'size >= 0' failed in GtkScrollbar

(SWT:1687): Gtk-CRITICAL **: 22:30:23.873: gtk_box_gadget_distribute: assertion 'size >= 0' failed in GtkScrollbar

(SWT:1687): Gtk-CRITICAL **: 22:30:23.873: gtk_box_gadget_distribute: assertion 'size >= 0' failed in GtkScrollbar

(SWT:1687): Gtk-CRITICAL **: 22:30:23.890: gtk_box_gadget_distribute: assertion 'size >= 0' failed in GtkScrollbar

(SWT:1687): Gtk-CRITICAL **: 22:30:23.890: gtk_box_gadget_distribute: assertion 'size >= 0' failed in GtkScrollbar

(SWT:1687): Gtk-CRITICAL **: 22:30:23.906: gtk_box_gadget_distribute: assertion 'size >= 0' failed in GtkScrollbar

(SWT:1687): Gtk-CRITICAL **: 22:30:23.906: gtk_box_gadget_distribute: assertion 'size >= 0' failed in GtkScrollbar

(SWT:1687): Gtk-CRITICAL **: 22:30:23.922: gtk_box_gadget_distribute: assertion 'size >= 0' failed in GtkScrollbar

(SWT:1687): Gtk-CRITICAL **: 22:30:23.922: gtk_box_gadget_distribute: assertion 'size >= 0' failed in GtkScrollbar

(SWT:1687): Gtk-CRITICAL **: 22:30:23.940: gtk_box_gadget_distribute: assertion 'size >= 0' failed in GtkScrollbar

(SWT:1687): Gtk-CRITICAL **: 22:30:23.940: gtk_box_gadget_distribute: assertion 'size >= 0' failed in GtkScrollbar

(SWT:1687): Gtk-CRITICAL **: 22:30:23.956: gtk_box_gadget_distribute: assertion 'size >= 0' failed in GtkScrollbar

(SWT:1687): Gtk-CRITICAL **: 22:30:23.956: gtk_box_gadget_distribute: assertion 'size >= 0' failed in GtkScrollbar

(SWT:1687): Gtk-CRITICAL **: 22:30:23.982: gtk_box_gadget_distribute: assertion 'size >= 0' failed in GtkScrollbar

(SWT:1687): Gtk-CRITICAL **: 22:30:23.982: gtk_box_gadget_distribute: assertion 'size >= 0' failed in GtkScrollbar

(SWT:1687): Gtk-CRITICAL **: 22:30:23.990: gtk_box_gadget_distribute: assertion 'size >= 0' failed in GtkScrollbar

(SWT:1687): Gtk-CRITICAL **: 22:30:23.990: gtk_box_gadget_distribute: assertion 'size >= 0' failed in GtkScrollbar

(SWT:1687): Gtk-CRITICAL **: 22:30:24.005: gtk_box_gadget_distribute: assertion 'size >= 0' failed in GtkScrollbar

(SWT:1687): Gtk-CRITICAL **: 22:30:24.006: gtk_box_gadget_distribute: assertion 'size >= 0' failed in GtkScrollbar

(SWT:1687): Gtk-CRITICAL **: 22:30:24.007: gtk_box_gadget_distribute: assertion 'size >= 0' failed in GtkScrollbar

(SWT:1687): Gtk-CRITICAL **: 22:30:24.007: gtk_box_gadget_distribute: assertion 'size >= 0' failed in GtkScrollbar

(SWT:1687): Gtk-CRITICAL **: 22:30:24.011: gtk_box_gadget_distribute: assertion 'size >= 0' failed in GtkScrollbar

(SWT:1687): Gtk-CRITICAL **: 22:30:24.012: gtk_box_gadget_distribute: assertion 'size >= 0' failed in GtkScrollbar

(SWT:1687): Gtk-CRITICAL **: 22:30:24.012: gtk_box_gadget_distribute: assertion 'size >= 0' failed in GtkScrollbar

(SWT:1687): Gtk-CRITICAL **: 22:30:24.020: gtk_box_gadget_distribute: assertion 'size >= 0' failed in GtkScrollbar

(SWT:1687): Gtk-CRITICAL **: 22:30:24.037: gtk_box_gadget_distribute: assertion 'size >= 0' failed in GtkScrollbar

(SWT:1687): Gtk-CRITICAL **: 22:30:24.077: gtk_box_gadget_distribute: assertion 'size >= 0' failed in GtkScrollbar

(SWT:1687): Gtk-CRITICAL **: 22:30:24.077: gtk_box_gadget_distribute: assertion 'size >= 0' failed in GtkScrollbar

(SWT:1687): Gtk-CRITICAL **: 22:30:24.079: gtk_box_gadget_distribute: assertion 'size >= 0' failed in GtkScrollbar

(SWT:1687): Gtk-CRITICAL **: 22:30:24.080: gtk_box_gadget_distribute: assertion 'size >= 0' failed in GtkScrollbar

(SWT:1687): Gtk-CRITICAL **: 22:30:24.080: gtk_box_gadget_distribute: assertion 'size >= 0' failed in GtkScrollbar

(SWT:1687): Gtk-CRITICAL **: 22:30:24.081: gtk_box_gadget_distribute: assertion 'size >= 0' failed in GtkScrollbar

(SWT:1687): Gtk-CRITICAL **: 22:30:24.082: gtk_box_gadget_distribute: assertion 'size >= 0' failed in GtkScrollbar

(SWT:1687): Gtk-CRITICAL **: 22:30:24.083: gtk_box_gadget_distribute: assertion 'size >= 0' failed in GtkScrollbar

(SWT:1687): Gtk-CRITICAL **: 22:30:24.083: gtk_box_gadget_distribute: assertion 'size >= 0' failed in GtkScrollbar

(SWT:1687): Gtk-CRITICAL **: 22:30:24.090: gtk_box_gadget_distribute: assertion 'size >= 0' failed in GtkScrollbar

(SWT:1687): Gtk-CRITICAL **: 22:30:24.090: gtk_box_gadget_distribute: assertion 'size >= 0' failed in GtkScrollbar

(SWT:1687): Gtk-WARNING **: 22:30:24.117: Negative content width -1 (allocation 1, extents 1x1) while allocating gadget (node trough, owner GtkProgressBar)

(SWT:1687): Gtk-WARNING **: 22:30:24.120: Negative content width -1 (allocation 1, extents 1x1) while allocating gadget (node trough, owner GtkProgressBar)

(SWT:1687): Gtk-WARNING **: 22:30:24.131: Negative content width -1 (allocation 1, extents 1x1) while allocating gadget (node trough, owner GtkProgressBar)

(SWT:1687): Gtk-WARNING **: 22:30:24.133: Negative content width -1 (allocation 1, extents 1x1) while allocating gadget (node trough, owner GtkProgressBar)

(SWT:1687): Gtk-WARNING **: 22:30:24.144: Negative content width -1 (allocation 1, extents 1x1) while allocating gadget (node trough, owner GtkProgressBar)

(SWT:1687): Gtk-WARNING **: 22:30:24.147: Negative content width -1 (allocation 1, extents 1x1) while allocating gadget (node trough, owner GtkProgressBar)

(SWT:1687): Gtk-CRITICAL **: 22:30:24.164: gtk_box_gadget_distribute: assertion 'size >= 0' failed in GtkScrollbar

(SWT:1687): Gtk-CRITICAL **: 22:30:24.169: gtk_box_gadget_distribute: assertion 'size >= 0' failed in GtkScrollbar

(SWT:1687): Gtk-CRITICAL **: 22:30:24.170: gtk_box_gadget_distribute: assertion 'size >= 0' failed in GtkScrollbar

(SWT:1687): Gtk-CRITICAL **: 22:30:24.171: gtk_box_gadget_distribute: assertion 'size >= 0' failed in GtkScrollbar

(SWT:1687): Gtk-CRITICAL **: 22:30:24.174: gtk_box_gadget_distribute: assertion 'size >= 0' failed in GtkScrollbar

(SWT:1687): Gtk-CRITICAL **: 22:30:24.183: gtk_box_gadget_distribute: assertion 'size >= 0' failed in GtkScrollbar

(SWT:1687): Gtk-CRITICAL **: 22:30:24.196: gtk_box_gadget_distribute: assertion 'size >= 0' failed in GtkScrollbar

(SWT:1687): Gtk-CRITICAL **: 22:30:24.197: gtk_box_gadget_distribute: assertion 'size >= 0' failed in GtkScrollbar

(SWT:1687): Gtk-CRITICAL **: 22:30:24.197: gtk_box_gadget_distribute: assertion 'size >= 0' failed in GtkScrollbar

(SWT:1687): Gtk-CRITICAL **: 22:30:24.208: gtk_box_gadget_distribute: assertion 'size >= 0' failed in GtkScrollbar

(SWT:1687): Gtk-CRITICAL **: 22:30:24.260: gtk_box_gadget_distribute: assertion 'size >= 0' failed in GtkScrollbar

(SWT:1687): Gtk-CRITICAL **: 22:30:24.261: gtk_box_gadget_distribute: assertion 'size >= 0' failed in GtkScrollbar

(SWT:1687): Gtk-CRITICAL **: 22:30:24.261: gtk_box_gadget_distribute: assertion 'size >= 0' failed in GtkScrollbar

(SWT:1687): Gtk-CRITICAL **: 22:30:24.264: gtk_box_gadget_distribute: assertion 'size >= 0' failed in GtkScrollbar

(SWT:1687): Gtk-CRITICAL **: 22:30:24.739: gtk_box_gadget_distribute: assertion 'size >= 0' failed in GtkScrollbar

(SWT:1687): Gtk-CRITICAL **: 22:30:24.748: gtk_box_gadget_distribute: assertion 'size >= 0' failed in GtkScrollbar

(SWT:1687): Gtk-CRITICAL **: 22:30:24.764: gtk_box_gadget_distribute: assertion 'size >= 0' failed in GtkScrollbar

(SWT:1687): Gtk-CRITICAL **: 22:30:24.781: gtk_box_gadget_distribute: assertion 'size >= 0' failed in GtkScrollbar

(SWT:1687): Gtk-CRITICAL **: 22:30:24.796: gtk_box_gadget_distribute: assertion 'size >= 0' failed in GtkScrollbar

(SWT:1687): Gtk-CRITICAL **: 22:30:24.796: gtk_box_gadget_distribute: assertion 'size >= 0' failed in GtkScrollbar

(SWT:1687): Gtk-CRITICAL **: 22:30:24.798: gtk_box_gadget_distribute: assertion 'size >= 0' failed in GtkScrollbar

(SWT:1687): Gtk-CRITICAL **: 22:30:24.798: gtk_box_gadget_distribute: assertion 'size >= 0' failed in GtkScrollbar

(SWT:1687): Gtk-CRITICAL **: 22:30:24.801: gtk_box_gadget_distribute: assertion 'size >= 0' failed in GtkScrollbar

(SWT:1687): Gtk-CRITICAL **: 22:30:24.810: gtk_box_gadget_distribute: assertion 'size >= 0' failed in GtkScrollbar

(SWT:1687): Gtk-CRITICAL **: 22:30:24.836: gtk_box_gadget_distribute: assertion 'size >= 0' failed in GtkScrollbar

(SWT:1687): Gtk-CRITICAL **: 22:30:24.836: gtk_box_gadget_distribute: assertion 'size >= 0' failed in GtkScrollbar

(SWT:1687): Gtk-CRITICAL **: 22:30:24.838: gtk_box_gadget_distribute: assertion 'size >= 0' failed in GtkScrollbar

(SWT:1687): Gtk-CRITICAL **: 22:30:24.839: gtk_box_gadget_distribute: assertion 'size >= 0' failed in GtkScrollbar

(SWT:1687): Gtk-CRITICAL **: 22:30:24.839: gtk_box_gadget_distribute: assertion 'size >= 0' failed in GtkScrollbar

(SWT:1687): Gtk-CRITICAL **: 22:30:24.840: gtk_box_gadget_distribute: assertion 'size >= 0' failed in GtkScrollbar

(SWT:1687): Gtk-CRITICAL **: 22:30:24.842: gtk_box_gadget_distribute: assertion 'size >= 0' failed in GtkScrollbar

(SWT:1687): Gtk-CRITICAL **: 22:30:24.842: gtk_box_gadget_distribute: assertion 'size >= 0' failed in GtkScrollbar

(SWT:1687): Gtk-CRITICAL **: 22:30:24.843: gtk_box_gadget_distribute: assertion 'size >= 0' failed in GtkScrollbar

(SWT:1687): Gtk-CRITICAL **: 22:30:24.850: gtk_box_gadget_distribute: assertion 'size >= 0' failed in GtkScrollbar

(SWT:1687): Gtk-CRITICAL **: 22:30:24.850: gtk_box_gadget_distribute: assertion 'size >= 0' failed in GtkScrollbar

(SWT:1687): Gtk-WARNING **: 22:30:24.871: Negative content width -1 (allocation 1, extents 1x1) while allocating gadget (node trough, owner GtkProgressBar)

(SWT:1687): Gtk-WARNING **: 22:30:24.874: Negative content width -1 (allocation 1, extents 1x1) while allocating gadget (node trough, owner GtkProgressBar)

(SWT:1687): Gtk-WARNING **: 22:30:24.885: Negative content width -1 (allocation 1, extents 1x1) while allocating gadget (node trough, owner GtkProgressBar)

(SWT:1687): Gtk-WARNING **: 22:30:24.888: Negative content width -1 (allocation 1, extents 1x1) while allocating gadget (node trough, owner GtkProgressBar)

(SWT:1687): Gtk-WARNING **: 22:30:24.900: Negative content width -1 (allocation 1, extents 1x1) while allocating gadget (node trough, owner GtkProgressBar)

(SWT:1687): Gtk-WARNING **: 22:30:24.903: Negative content width -1 (allocation 1, extents 1x1) while allocating gadget (node trough, owner GtkProgressBar)

(SWT:1687): Gtk-CRITICAL **: 22:30:25.033: gtk_box_gadget_distribute: assertion 'size >= 0' failed in GtkScrollbar

(SWT:1687): Gtk-CRITICAL **: 22:30:25.039: gtk_box_gadget_distribute: assertion 'size >= 0' failed in GtkScrollbar

(SWT:1687): Gtk-CRITICAL **: 22:30:25.040: gtk_box_gadget_distribute: assertion 'size >= 0' failed in GtkScrollbar

(SWT:1687): Gtk-CRITICAL **: 22:30:25.041: gtk_box_gadget_distribute: assertion 'size >= 0' failed in GtkScrollbar

(SWT:1687): Gtk-CRITICAL **: 22:30:25.044: gtk_box_gadget_distribute: assertion 'size >= 0' failed in GtkScrollbar

(SWT:1687): Gtk-CRITICAL **: 22:30:25.053: gtk_box_gadget_distribute: assertion 'size >= 0' failed in GtkScrollbar

(SWT:1687): Gtk-CRITICAL **: 22:30:25.184: gtk_box_gadget_distribute: assertion 'size >= 0' failed in GtkScrollbar

(SWT:1687): Gtk-CRITICAL **: 22:30:25.185: gtk_box_gadget_distribute: assertion 'size >= 0' failed in GtkScrollbar

(SWT:1687): Gtk-CRITICAL **: 22:30:25.186: gtk_box_gadget_distribute: assertion 'size >= 0' failed in GtkScrollbar

(SWT:1687): Gtk-CRITICAL **: 22:30:25.202: gtk_box_gadget_distribute: assertion 'size >= 0' failed in GtkScrollbar

(SWT:1687): Gtk-CRITICAL **: 22:30:25.282: gtk_box_gadget_distribute: assertion 'size >= 0' failed in GtkScrollbar

(SWT:1687): Gtk-CRITICAL **: 22:30:25.283: gtk_box_gadget_distribute: assertion 'size >= 0' failed in GtkScrollbar

(SWT:1687): Gtk-CRITICAL **: 22:30:25.284: gtk_box_gadget_distribute: assertion 'size >= 0' failed in GtkScrollbar

(SWT:1687): Gtk-CRITICAL **: 22:30:25.296: gtk_box_gadget_distribute: assertion 'size >= 0' failed in GtkScrollbar

(SWT:1687): Gtk-CRITICAL **: 22:30:25.413: gtk_box_gadget_distribute: assertion 'size >= 0' failed in GtkScrollbar

(SWT:1687): Gtk-CRITICAL **: 22:30:25.431: gtk_box_gadget_distribute: assertion 'size >= 0' failed in GtkScrollbar

(SWT:1687): Gtk-CRITICAL **: 22:30:25.431: gtk_box_gadget_distribute: assertion 'size >= 0' failed in GtkScrollbar

(SWT:1687): Gtk-CRITICAL **: 22:30:25.432: gtk_box_gadget_distribute: assertion 'size >= 0' failed in GtkScrollbar

(SWT:1687): Gtk-CRITICAL **: 22:30:25.433: gtk_box_gadget_distribute: assertion 'size >= 0' failed in GtkScrollbar

(SWT:1687): Gtk-CRITICAL **: 22:30:25.434: gtk_box_gadget_distribute: assertion 'size >= 0' failed in GtkScrollbar

(SWT:1687): Gtk-CRITICAL **: 22:30:25.434: gtk_box_gadget_distribute: assertion 'size >= 0' failed in GtkScrollbar

(SWT:1687): Gtk-CRITICAL **: 22:30:25.440: gtk_box_gadget_distribute: assertion 'size >= 0' failed in GtkScrollbar

(SWT:1687): Gtk-CRITICAL **: 22:30:25.450: gtk_box_gadget_distribute: assertion 'size >= 0' failed in GtkScrollbar

(SWT:1687): Gtk-WARNING **: 22:30:25.525: Negative content width -1 (allocation 1, extents 1x1) while allocating gadget (node trough, owner GtkProgressBar)

(SWT:1687): Gtk-WARNING **: 22:30:25.528: Negative content width -1 (allocation 1, extents 1x1) while allocating gadget (node trough, owner GtkProgressBar)

(SWT:1687): Gtk-WARNING **: 22:30:25.540: Negative content width -1 (allocation 1, extents 1x1) while allocating gadget (node trough, owner GtkProgressBar)

(SWT:1687): Gtk-WARNING **: 22:30:25.543: Negative content width -1 (allocation 1, extents 1x1) while allocating gadget (node trough, owner GtkProgressBar)

(SWT:1687): Gtk-WARNING **: 22:30:25.554: Negative content width -1 (allocation 1, extents 1x1) while allocating gadget (node trough, owner GtkProgressBar)

(SWT:1687): Gtk-WARNING **: 22:30:25.556: Negative content width -1 (allocation 1, extents 1x1) while allocating gadget (node trough, owner GtkProgressBar)

(SWT:1687): Gtk-CRITICAL **: 22:30:25.560: gtk_box_gadget_distribute: assertion 'size >= 0' failed in GtkScrollbar

(SWT:1687): Gtk-CRITICAL **: 22:30:25.560: gtk_box_gadget_distribute: assertion 'size >= 0' failed in GtkScrollbar

(SWT:1687): Gtk-CRITICAL **: 22:30:29.872: gtk_box_gadget_distribute: assertion 'size >= 0' failed in GtkScrollbar

(SWT:1687): Gtk-CRITICAL **: 22:30:29.877: gtk_box_gadget_distribute: assertion 'size >= 0' failed in GtkScrollbar

(SWT:1687): Gtk-CRITICAL **: 22:30:29.882: gtk_box_gadget_distribute: assertion 'size >= 0' failed in GtkScrollbar

(SWT:1687): Gtk-CRITICAL **: 22:30:29.882: gtk_box_gadget_distribute: assertion 'size >= 0' failed in GtkScrollbar

(SWT:1687): Gtk-CRITICAL **: 22:30:29.886: gtk_box_gadget_distribute: assertion 'size >= 0' failed in GtkScrollbar

(SWT:1687): Gtk-CRITICAL **: 22:30:29.895: gtk_box_gadget_distribute: assertion 'size >= 0' failed in GtkScrollbar

(SWT:1687): Gtk-WARNING **: 22:30:29.940: Negative content width -6 (allocation 1, extents 4x3) while allocating gadget (node toolbar, owner GtkToolbar)

(SWT:1687): Gtk-WARNING **: 22:30:30.348: Negative content width -6 (allocation 1, extents 4x3) while allocating gadget (node toolbar, owner GtkToolbar)

(SWT:1687): Gtk-WARNING **: 22:30:30.374: Negative content width -6 (allocation 1, extents 4x3) while allocating gadget (node toolbar, owner GtkToolbar)

(SWT:1687): Gtk-WARNING **: 22:30:30.978: Negative content width -6 (allocation 1, extents 4x3) while allocating gadget (node toolbar, owner GtkToolbar)

(SWT:1687): Gtk-CRITICAL **: 22:30:31.445: gtk_box_gadget_distribute: assertion 'size >= 0' failed in GtkScrollbar

(SWT:1687): Gtk-CRITICAL **: 22:30:31.454: gtk_box_gadget_distribute: assertion 'size >= 0' failed in GtkScrollbar

(SWT:1687): Gtk-WARNING **: 22:30:31.459: Negative content width -6 (allocation 1, extents 4x3) while allocating gadget (node toolbar, owner GtkToolbar)

(SWT:1687): Gtk-CRITICAL **: 22:30:31.468: gtk_box_gadget_distribute: assertion 'size >= 0' failed in GtkScrollbar

(SWT:1687): Gtk-CRITICAL **: 22:30:31.473: gtk_box_gadget_distribute: assertion 'size >= 0' failed in GtkScrollbar

(SWT:1687): Gtk-CRITICAL **: 22:30:31.475: gtk_box_gadget_distribute: assertion 'size >= 0' failed in GtkScrollbar

(SWT:1687): Gtk-CRITICAL **: 22:30:31.475: gtk_box_gadget_distribute: assertion 'size >= 0' failed in GtkScrollbar

(SWT:1687): Gtk-CRITICAL **: 22:30:31.480: gtk_box_gadget_distribute: assertion 'size >= 0' failed in GtkScrollbar

(SWT:1687): Gtk-CRITICAL **: 22:30:31.480: gtk_box_gadget_distribute: assertion 'size >= 0' failed in GtkScrollbar

(SWT:1687): Gtk-CRITICAL **: 22:30:31.495: gtk_box_gadget_distribute: assertion 'size >= 0' failed in GtkScrollbar

(SWT:1687): Gtk-CRITICAL **: 22:30:31.508: gtk_box_gadget_distribute: assertion 'size >= 0' failed in GtkScrollbar

(SWT:1687): Gtk-CRITICAL **: 22:30:31.508: gtk_box_gadget_distribute: assertion 'size >= 0' failed in GtkScrollbar

(SWT:1687): Gtk-CRITICAL **: 22:30:31.524: gtk_box_gadget_distribute: assertion 'size >= 0' failed in GtkScrollbar

(SWT:1687): Gtk-CRITICAL **: 22:30:31.524: gtk_box_gadget_distribute: assertion 'size >= 0' failed in GtkScrollbar

(SWT:1687): Gtk-CRITICAL **: 22:30:31.540: gtk_box_gadget_distribute: assertion 'size >= 0' failed in GtkScrollbar

(SWT:1687): Gtk-CRITICAL **: 22:30:31.540: gtk_box_gadget_distribute: assertion 'size >= 0' failed in GtkScrollbar

(SWT:1687): Gtk-CRITICAL **: 22:30:31.558: gtk_box_gadget_distribute: assertion 'size >= 0' failed in GtkScrollbar

(SWT:1687): Gtk-CRITICAL **: 22:30:31.558: gtk_box_gadget_distribute: assertion 'size >= 0' failed in GtkScrollbar

(SWT:1687): Gtk-CRITICAL **: 22:30:31.574: gtk_box_gadget_distribute: assertion 'size >= 0' failed in GtkScrollbar

(SWT:1687): Gtk-CRITICAL **: 22:30:31.574: gtk_box_gadget_distribute: assertion 'size >= 0' failed in GtkScrollbar

(SWT:1687): Gtk-CRITICAL **: 22:30:31.590: gtk_box_gadget_distribute: assertion 'size >= 0' failed in GtkScrollbar

(SWT:1687): Gtk-CRITICAL **: 22:30:31.590: gtk_box_gadget_distribute: assertion 'size >= 0' failed in GtkScrollbar

(SWT:1687): Gtk-CRITICAL **: 22:30:31.598: gtk_box_gadget_distribute: assertion 'size >= 0' failed in GtkScrollbar

(SWT:1687): Gtk-CRITICAL **: 22:30:31.599: gtk_box_gadget_distribute: assertion 'size >= 0' failed in GtkScrollbar

(SWT:1687): Gtk-CRITICAL **: 22:30:31.600: gtk_box_gadget_distribute: assertion 'size >= 0' failed in GtkScrollbar

(SWT:1687): Gtk-CRITICAL **: 22:30:31.601: gtk_box_gadget_distribute: assertion 'size >= 0' failed in GtkScrollbar

(SWT:1687): Gtk-CRITICAL **: 22:30:31.602: gtk_box_gadget_distribute: assertion 'size >= 0' failed in GtkScrollbar

(SWT:1687): Gtk-CRITICAL **: 22:30:31.603: gtk_box_gadget_distribute: assertion 'size >= 0' failed in GtkScrollbar

(SWT:1687): Gtk-CRITICAL **: 22:30:31.606: gtk_box_gadget_distribute: assertion 'size >= 0' failed in GtkScrollbar

(SWT:1687): Gtk-CRITICAL **: 22:30:31.607: gtk_box_gadget_distribute: assertion 'size >= 0' failed in GtkScrollbar

(SWT:1687): Gtk-CRITICAL **: 22:30:31.609: gtk_box_gadget_distribute: assertion 'size >= 0' failed in GtkScrollbar

(SWT:1687): Gtk-CRITICAL **: 22:30:31.609: gtk_box_gadget_distribute: assertion 'size >= 0' failed in GtkScrollbar

(SWT:1687): Gtk-CRITICAL **: 22:30:31.615: gtk_box_gadget_distribute: assertion 'size >= 0' failed in GtkScrollbar

(SWT:1687): Gtk-CRITICAL **: 22:30:31.626: gtk_box_gadget_distribute: assertion 'size >= 0' failed in GtkScrollbar

(SWT:1687): Gtk-CRITICAL **: 22:30:31.626: gtk_box_gadget_distribute: assertion 'size >= 0' failed in GtkScrollbar

(SWT:1687): Gtk-CRITICAL **: 22:30:31.647: gtk_box_gadget_distribute: assertion 'size >= 0' failed in GtkScrollbar

(SWT:1687): Gtk-CRITICAL **: 22:30:31.657: gtk_box_gadget_distribute: assertion 'size >= 0' failed in GtkScrollbar

(SWT:1687): Gtk-WARNING **: 22:30:31.680: Negative content width -6 (allocation 1, extents 4x3) while allocating gadget (node toolbar, owner GtkToolbar)

(SWT:1687): Gtk-WARNING **: 22:30:32.012: Negative content width -6 (allocation 1, extents 4x3) while allocating gadget (node toolbar, owner GtkToolbar)

(SWT:1687): Gtk-WARNING **: 22:30:32.036: Negative content width -6 (allocation 1, extents 4x3) while allocating gadget (node toolbar, owner GtkToolbar)

(SWT:1687): Gtk-WARNING **: 22:30:32.696: Negative content width -6 (allocation 1, extents 4x3) while allocating gadget (node toolbar, owner GtkToolbar)

(SWT:1687): Gtk-CRITICAL **: 22:30:33.205: gtk_box_gadget_distribute: assertion 'size >= 0' failed in GtkScrollbar

(SWT:1687): Gtk-CRITICAL **: 22:30:33.215: gtk_box_gadget_distribute: assertion 'size >= 0' failed in GtkScrollbar

(SWT:1687): Gtk-WARNING **: 22:30:33.219: Negative content width -6 (allocation 1, extents 4x3) while allocating gadget (node toolbar, owner GtkToolbar)

(SWT:1687): Gtk-CRITICAL **: 22:30:33.229: gtk_box_gadget_distribute: assertion 'size >= 0' failed in GtkScrollbar

(SWT:1687): Gtk-CRITICAL **: 22:30:33.234: gtk_box_gadget_distribute: assertion 'size >= 0' failed in GtkScrollbar

(SWT:1687): Gtk-CRITICAL **: 22:30:33.236: gtk_box_gadget_distribute: assertion 'size >= 0' failed in GtkScrollbar

(SWT:1687): Gtk-CRITICAL **: 22:30:33.236: gtk_box_gadget_distribute: assertion 'size >= 0' failed in GtkScrollbar

(SWT:1687): Gtk-CRITICAL **: 22:30:33.241: gtk_box_gadget_distribute: assertion 'size >= 0' failed in GtkScrollbar

(SWT:1687): Gtk-CRITICAL **: 22:30:33.241: gtk_box_gadget_distribute: assertion 'size >= 0' failed in GtkScrollbar

(SWT:1687): Gtk-CRITICAL **: 22:30:33.252: gtk_box_gadget_distribute: assertion 'size >= 0' failed in GtkScrollbar

(SWT:1687): Gtk-CRITICAL **: 22:30:33.265: gtk_box_gadget_distribute: assertion 'size >= 0' failed in GtkScrollbar

(SWT:1687): Gtk-CRITICAL **: 22:30:33.265: gtk_box_gadget_distribute: assertion 'size >= 0' failed in GtkScrollbar

(SWT:1687): Gtk-CRITICAL **: 22:30:33.282: gtk_box_gadget_distribute: assertion 'size >= 0' failed in GtkScrollbar

(SWT:1687): Gtk-CRITICAL **: 22:30:33.282: gtk_box_gadget_distribute: assertion 'size >= 0' failed in GtkScrollbar

(SWT:1687): Gtk-CRITICAL **: 22:30:33.298: gtk_box_gadget_distribute: assertion 'size >= 0' failed in GtkScrollbar

(SWT:1687): Gtk-CRITICAL **: 22:30:33.298: gtk_box_gadget_distribute: assertion 'size >= 0' failed in GtkScrollbar

(SWT:1687): Gtk-CRITICAL **: 22:30:33.316: gtk_box_gadget_distribute: assertion 'size >= 0' failed in GtkScrollbar

(SWT:1687): Gtk-CRITICAL **: 22:30:33.316: gtk_box_gadget_distribute: assertion 'size >= 0' failed in GtkScrollbar

(SWT:1687): Gtk-CRITICAL **: 22:30:33.332: gtk_box_gadget_distribute: assertion 'size >= 0' failed in GtkScrollbar

(SWT:1687): Gtk-CRITICAL **: 22:30:33.332: gtk_box_gadget_distribute: assertion 'size >= 0' failed in GtkScrollbar

(SWT:1687): Gtk-CRITICAL **: 22:30:33.349: gtk_box_gadget_distribute: assertion 'size >= 0' failed in GtkScrollbar

(SWT:1687): Gtk-CRITICAL **: 22:30:33.349: gtk_box_gadget_distribute: assertion 'size >= 0' failed in GtkScrollbar

(SWT:1687): Gtk-CRITICAL **: 22:30:33.359: gtk_box_gadget_distribute: assertion 'size >= 0' failed in GtkScrollbar

(SWT:1687): Gtk-CRITICAL **: 22:30:33.359: gtk_box_gadget_distribute: assertion 'size >= 0' failed in GtkScrollbar

(SWT:1687): Gtk-CRITICAL **: 22:30:33.361: gtk_box_gadget_distribute: assertion 'size >= 0' failed in GtkScrollbar

(SWT:1687): Gtk-CRITICAL **: 22:30:33.362: gtk_box_gadget_distribute: assertion 'size >= 0' failed in GtkScrollbar

(SWT:1687): Gtk-CRITICAL **: 22:30:33.362: gtk_box_gadget_distribute: assertion 'size >= 0' failed in GtkScrollbar

(SWT:1687): Gtk-CRITICAL **: 22:30:33.363: gtk_box_gadget_distribute: assertion 'size >= 0' failed in GtkScrollbar

(SWT:1687): Gtk-CRITICAL **: 22:30:33.366: gtk_box_gadget_distribute: assertion 'size >= 0' failed in GtkScrollbar

(SWT:1687): Gtk-CRITICAL **: 22:30:33.366: gtk_box_gadget_distribute: assertion 'size >= 0' failed in GtkScrollbar

(SWT:1687): Gtk-CRITICAL **: 22:30:33.377: gtk_box_gadget_distribute: assertion 'size >= 0' failed in GtkScrollbar

(SWT:1687): Gtk-CRITICAL **: 22:30:33.377: gtk_box_gadget_distribute: assertion 'size >= 0' failed in GtkScrollbar

(SWT:1687): Gtk-CRITICAL **: 22:30:33.378: gtk_box_gadget_distribute: assertion 'size >= 0' failed in GtkScrollbar

(SWT:1687): Gtk-CRITICAL **: 22:30:33.382: gtk_box_gadget_distribute: assertion 'size >= 0' failed in GtkScrollbar

(SWT:1687): Gtk-CRITICAL **: 22:30:33.382: gtk_box_gadget_distribute: assertion 'size >= 0' failed in GtkScrollbar

(SWT:1687): Gtk-CRITICAL **: 22:30:33.400: gtk_box_gadget_distribute: assertion 'size >= 0' failed in GtkScrollbar

(SWT:1687): Gtk-CRITICAL **: 22:30:33.400: gtk_box_gadget_distribute: assertion 'size >= 0' failed in GtkScrollbar

(SWT:1687): Gtk-WARNING **: 22:30:33.432: Negative content width -6 (allocation 1, extents 4x3) while allocating gadget (node toolbar, owner GtkToolbar)

(SWT:1687): Gtk-WARNING **: 22:30:33.765: Negative content width -6 (allocation 1, extents 4x3) while allocating gadget (node toolbar, owner GtkToolbar)

(SWT:1687): Gtk-WARNING **: 22:30:33.796: Negative content width -6 (allocation 1, extents 4x3) while allocating gadget (node toolbar, owner GtkToolbar)

(SWT:1687): Gtk-WARNING **: 22:30:34.401: Negative content width -6 (allocation 1, extents 4x3) while allocating gadget (node toolbar, owner GtkToolbar)

(SWT:1687): Gtk-CRITICAL **: 22:30:34.760: gtk_box_gadget_distribute: assertion 'size >= 0' failed in GtkScrollbar

(SWT:1687): Gtk-CRITICAL **: 22:30:34.770: gtk_box_gadget_distribute: assertion 'size >= 0' failed in GtkScrollbar

(SWT:1687): Gtk-WARNING **: 22:30:34.776: Negative content width -6 (allocation 1, extents 4x3) while allocating gadget (node toolbar, owner GtkToolbar)

(SWT:1687): Gtk-CRITICAL **: 22:30:34.804: gtk_box_gadget_distribute: assertion 'size >= 0' failed in GtkScrollbar

(SWT:1687): Gtk-CRITICAL **: 22:30:34.814: gtk_box_gadget_distribute: assertion 'size >= 0' failed in GtkScrollbar

(SWT:1687): Gtk-CRITICAL **: 22:30:34.819: gtk_box_gadget_distribute: assertion 'size >= 0' failed in GtkScrollbar

(SWT:1687): Gtk-CRITICAL **: 22:30:34.825: gtk_box_gadget_distribute: assertion 'size >= 0' failed in GtkScrollbar

(SWT:1687): Gtk-CRITICAL **: 22:30:34.826: gtk_box_gadget_distribute: assertion 'size >= 0' failed in GtkScrollbar

(SWT:1687): Gtk-CRITICAL **: 22:30:34.827: gtk_box_gadget_distribute: assertion 'size >= 0' failed in GtkScrollbar

(SWT:1687): Gtk-CRITICAL **: 22:30:34.832: gtk_box_gadget_distribute: assertion 'size >= 0' failed in GtkScrollbar

(SWT:1687): Gtk-CRITICAL **: 22:30:34.833: gtk_box_gadget_distribute: assertion 'size >= 0' failed in GtkScrollbar

(SWT:1687): Gtk-CRITICAL **: 22:30:34.847: gtk_box_gadget_distribute: assertion 'size >= 0' failed in GtkScrollbar

(SWT:1687): Gtk-CRITICAL **: 22:30:34.859: gtk_box_gadget_distribute: assertion 'size >= 0' failed in GtkScrollbar

(SWT:1687): Gtk-CRITICAL **: 22:30:34.859: gtk_box_gadget_distribute: assertion 'size >= 0' failed in GtkScrollbar

(SWT:1687): Gtk-CRITICAL **: 22:30:34.875: gtk_box_gadget_distribute: assertion 'size >= 0' failed in GtkScrollbar

(SWT:1687): Gtk-CRITICAL **: 22:30:34.875: gtk_box_gadget_distribute: assertion 'size >= 0' failed in GtkScrollbar

(SWT:1687): Gtk-CRITICAL **: 22:30:34.892: gtk_box_gadget_distribute: assertion 'size >= 0' failed in GtkScrollbar

(SWT:1687): Gtk-CRITICAL **: 22:30:34.892: gtk_box_gadget_distribute: assertion 'size >= 0' failed in GtkScrollbar

(SWT:1687): Gtk-CRITICAL **: 22:30:34.909: gtk_box_gadget_distribute: assertion 'size >= 0' failed in GtkScrollbar

(SWT:1687): Gtk-CRITICAL **: 22:30:34.909: gtk_box_gadget_distribute: assertion 'size >= 0' failed in GtkScrollbar

(SWT:1687): Gtk-CRITICAL **: 22:30:34.925: gtk_box_gadget_distribute: assertion 'size >= 0' failed in GtkScrollbar

(SWT:1687): Gtk-CRITICAL **: 22:30:34.925: gtk_box_gadget_distribute: assertion 'size >= 0' failed in GtkScrollbar

(SWT:1687): Gtk-CRITICAL **: 22:30:34.941: gtk_box_gadget_distribute: assertion 'size >= 0' failed in GtkScrollbar

(SWT:1687): Gtk-CRITICAL **: 22:30:34.941: gtk_box_gadget_distribute: assertion 'size >= 0' failed in GtkScrollbar

(SWT:1687): Gtk-CRITICAL **: 22:30:34.955: gtk_box_gadget_distribute: assertion 'size >= 0' failed in GtkScrollbar

(SWT:1687): Gtk-CRITICAL **: 22:30:34.956: gtk_box_gadget_distribute: assertion 'size >= 0' failed in GtkScrollbar

(SWT:1687): Gtk-CRITICAL **: 22:30:34.959: gtk_box_gadget_distribute: assertion 'size >= 0' failed in GtkScrollbar

(SWT:1687): Gtk-CRITICAL **: 22:30:34.959: gtk_box_gadget_distribute: assertion 'size >= 0' failed in GtkScrollbar

(SWT:1687): Gtk-CRITICAL **: 22:30:34.964: gtk_box_gadget_distribute: assertion 'size >= 0' failed in GtkScrollbar

(SWT:1687): Gtk-CRITICAL **: 22:30:34.965: gtk_box_gadget_distribute: assertion 'size >= 0' failed in GtkScrollbar

(SWT:1687): Gtk-CRITICAL **: 22:30:34.965: gtk_box_gadget_distribute: assertion 'size >= 0' failed in GtkScrollbar

(SWT:1687): Gtk-CRITICAL **: 22:30:34.966: gtk_box_gadget_distribute: assertion 'size >= 0' failed in GtkScrollbar

(SWT:1687): Gtk-CRITICAL **: 22:30:34.988: gtk_box_gadget_distribute: assertion 'size >= 0' failed in GtkScrollbar

(SWT:1687): Gtk-CRITICAL **: 22:30:34.988: gtk_box_gadget_distribute: assertion 'size >= 0' failed in GtkScrollbar

(SWT:1687): Gtk-CRITICAL **: 22:30:34.994: gtk_box_gadget_distribute: assertion 'size >= 0' failed in GtkScrollbar

(SWT:1687): Gtk-CRITICAL **: 22:30:35.000: gtk_box_gadget_distribute: assertion 'size >= 0' failed in GtkScrollbar

(SWT:1687): Gtk-CRITICAL **: 22:30:35.001: gtk_box_gadget_distribute: assertion 'size >= 0' failed in GtkScrollbar

(SWT:1687): Gtk-CRITICAL **: 22:30:35.002: gtk_box_gadget_distribute: assertion 'size >= 0' failed in GtkScrollbar

(SWT:1687): Gtk-WARNING **: 22:30:35.059: Negative content width -6 (allocation 1, extents 4x3) while allocating gadget (node toolbar, owner GtkToolbar)

(SWT:1687): Gtk-WARNING **: 22:30:35.398: Negative content width -6 (allocation 1, extents 4x3) while allocating gadget (node toolbar, owner GtkToolbar)

(SWT:1687): Gtk-WARNING **: 22:30:35.425: Negative content width -6 (allocation 1, extents 4x3) while allocating gadget (node toolbar, owner GtkToolbar)

(SWT:1687): Gtk-WARNING **: 22:30:36.062: Negative content width -6 (allocation 1, extents 4x3) while allocating gadget (node toolbar, owner GtkToolbar)

(SWT:1687): Gtk-CRITICAL **: 22:30:36.509: gtk_box_gadget_distribute: assertion 'size >= 0' failed in GtkScrollbar

(SWT:1687): Gtk-CRITICAL **: 22:30:36.518: gtk_box_gadget_distribute: assertion 'size >= 0' failed in GtkScrollbar

(SWT:1687): Gtk-WARNING **: 22:30:36.523: Negative content width -6 (allocation 1, extents 4x3) while allocating gadget (node toolbar, owner GtkToolbar)

(SWT:1687): Gtk-CRITICAL **: 22:30:36.531: gtk_box_gadget_distribute: assertion 'size >= 0' failed in GtkScrollbar

(SWT:1687): Gtk-CRITICAL **: 22:30:36.537: gtk_box_gadget_distribute: assertion 'size >= 0' failed in GtkScrollbar

(SWT:1687): Gtk-CRITICAL **: 22:30:36.538: gtk_box_gadget_distribute: assertion 'size >= 0' failed in GtkScrollbar

(SWT:1687): Gtk-CRITICAL **: 22:30:36.539: gtk_box_gadget_distribute: assertion 'size >= 0' failed in GtkScrollbar

(SWT:1687): Gtk-CRITICAL **: 22:30:36.544: gtk_box_gadget_distribute: assertion 'size >= 0' failed in GtkScrollbar

(SWT:1687): Gtk-CRITICAL **: 22:30:36.544: gtk_box_gadget_distribute: assertion 'size >= 0' failed in GtkScrollbar

(SWT:1687): Gtk-CRITICAL **: 22:30:36.554: gtk_box_gadget_distribute: assertion 'size >= 0' failed in GtkScrollbar

(SWT:1687): Gtk-CRITICAL **: 22:30:36.560: gtk_box_gadget_distribute: assertion 'size >= 0' failed in GtkScrollbar

(SWT:1687): Gtk-CRITICAL **: 22:30:36.560: gtk_box_gadget_distribute: assertion 'size >= 0' failed in GtkScrollbar

(SWT:1687): Gtk-CRITICAL **: 22:30:36.576: gtk_box_gadget_distribute: assertion 'size >= 0' failed in GtkScrollbar

(SWT:1687): Gtk-CRITICAL **: 22:30:36.576: gtk_box_gadget_distribute: assertion 'size >= 0' failed in GtkScrollbar

(SWT:1687): Gtk-CRITICAL **: 22:30:36.593: gtk_box_gadget_distribute: assertion 'size >= 0' failed in GtkScrollbar

(SWT:1687): Gtk-CRITICAL **: 22:30:36.593: gtk_box_gadget_distribute: assertion 'size >= 0' failed in GtkScrollbar

(SWT:1687): Gtk-CRITICAL **: 22:30:36.609: gtk_box_gadget_distribute: assertion 'size >= 0' failed in GtkScrollbar

(SWT:1687): Gtk-CRITICAL **: 22:30:36.609: gtk_box_gadget_distribute: assertion 'size >= 0' failed in GtkScrollbar

(SWT:1687): Gtk-CRITICAL **: 22:30:36.627: gtk_box_gadget_distribute: assertion 'size >= 0' failed in GtkScrollbar

(SWT:1687): Gtk-CRITICAL **: 22:30:36.627: gtk_box_gadget_distribute: assertion 'size >= 0' failed in GtkScrollbar

(SWT:1687): Gtk-CRITICAL **: 22:30:36.642: gtk_box_gadget_distribute: assertion 'size >= 0' failed in GtkScrollbar

(SWT:1687): Gtk-CRITICAL **: 22:30:36.642: gtk_box_gadget_distribute: assertion 'size >= 0' failed in GtkScrollbar

(SWT:1687): Gtk-CRITICAL **: 22:30:36.660: gtk_box_gadget_distribute: assertion 'size >= 0' failed in GtkScrollbar

(SWT:1687): Gtk-CRITICAL **: 22:30:36.660: gtk_box_gadget_distribute: assertion 'size >= 0' failed in GtkScrollbar

(SWT:1687): Gtk-CRITICAL **: 22:30:36.670: gtk_box_gadget_distribute: assertion 'size >= 0' failed in GtkScrollbar

(SWT:1687): Gtk-CRITICAL **: 22:30:36.670: gtk_box_gadget_distribute: assertion 'size >= 0' failed in GtkScrollbar

(SWT:1687): Gtk-CRITICAL **: 22:30:36.672: gtk_box_gadget_distribute: assertion 'size >= 0' failed in GtkScrollbar

(SWT:1687): Gtk-CRITICAL **: 22:30:36.673: gtk_box_gadget_distribute: assertion 'size >= 0' failed in GtkScrollbar

(SWT:1687): Gtk-CRITICAL **: 22:30:36.673: gtk_box_gadget_distribute: assertion 'size >= 0' failed in GtkScrollbar

(SWT:1687): Gtk-CRITICAL **: 22:30:36.674: gtk_box_gadget_distribute: assertion 'size >= 0' failed in GtkScrollbar

(SWT:1687): Gtk-CRITICAL **: 22:30:36.676: gtk_box_gadget_distribute: assertion 'size >= 0' failed in GtkScrollbar

(SWT:1687): Gtk-CRITICAL **: 22:30:36.676: gtk_box_gadget_distribute: assertion 'size >= 0' failed in GtkScrollbar

(SWT:1687): Gtk-CRITICAL **: 22:30:36.693: gtk_box_gadget_distribute: assertion 'size >= 0' failed in GtkScrollbar

(SWT:1687): Gtk-CRITICAL **: 22:30:36.693: gtk_box_gadget_distribute: assertion 'size >= 0' failed in GtkScrollbar

(SWT:1687): Gtk-CRITICAL **: 22:30:36.709: gtk_box_gadget_distribute: assertion 'size >= 0' failed in GtkScrollbar

(SWT:1687): Gtk-CRITICAL **: 22:30:36.709: gtk_box_gadget_distribute: assertion 'size >= 0' failed in GtkScrollbar

(SWT:1687): Gtk-CRITICAL **: 22:30:36.726: gtk_box_gadget_distribute: assertion 'size >= 0' failed in GtkScrollbar

(SWT:1687): Gtk-CRITICAL **: 22:30:36.726: gtk_box_gadget_distribute: assertion 'size >= 0' failed in GtkScrollbar

(SWT:1687): Gtk-CRITICAL **: 22:30:36.763: gtk_box_gadget_distribute: assertion 'size >= 0' failed in GtkScrollbar

(SWT:1687): Gtk-WARNING **: 22:30:36.857: Negative content width -6 (allocation 1, extents 4x3) while allocating gadget (node toolbar, owner GtkToolbar)

(SWT:1687): Gtk-WARNING **: 22:30:37.198: Negative content width -6 (allocation 1, extents 4x3) while allocating gadget (node toolbar, owner GtkToolbar)

(SWT:1687): Gtk-WARNING **: 22:30:37.231: Negative content width -6 (allocation 1, extents 4x3) while allocating gadget (node toolbar, owner GtkToolbar)

(SWT:1687): Gtk-WARNING **: 22:30:37.832: Negative content width -6 (allocation 1, extents 4x3) while allocating gadget (node toolbar, owner GtkToolbar)

(SWT:1687): Gtk-CRITICAL **: 22:30:38.357: gtk_box_gadget_distribute: assertion 'size >= 0' failed in GtkScrollbar

(SWT:1687): Gtk-CRITICAL **: 22:30:38.366: gtk_box_gadget_distribute: assertion 'size >= 0' failed in GtkScrollbar

(SWT:1687): Gtk-WARNING **: 22:30:38.371: Negative content width -6 (allocation 1, extents 4x3) while allocating gadget (node toolbar, owner GtkToolbar)

(SWT:1687): Gtk-CRITICAL **: 22:30:38.380: gtk_box_gadget_distribute: assertion 'size >= 0' failed in GtkScrollbar

(SWT:1687): Gtk-CRITICAL **: 22:30:38.394: gtk_box_gadget_distribute: assertion 'size >= 0' failed in GtkScrollbar

(SWT:1687): Gtk-CRITICAL **: 22:30:38.402: gtk_box_gadget_distribute: assertion 'size >= 0' failed in GtkScrollbar

(SWT:1687): Gtk-CRITICAL **: 22:30:38.412: gtk_box_gadget_distribute: assertion 'size >= 0' failed in GtkScrollbar

(SWT:1687): Gtk-CRITICAL **: 22:30:38.413: gtk_box_gadget_distribute: assertion 'size >= 0' failed in GtkScrollbar

(SWT:1687): Gtk-CRITICAL **: 22:30:38.414: gtk_box_gadget_distribute: assertion 'size >= 0' failed in GtkScrollbar

(SWT:1687): Gtk-CRITICAL **: 22:30:38.418: gtk_box_gadget_distribute: assertion 'size >= 0' failed in GtkScrollbar

(SWT:1687): Gtk-CRITICAL **: 22:30:38.419: gtk_box_gadget_distribute: assertion 'size >= 0' failed in GtkScrollbar

(SWT:1687): Gtk-CRITICAL **: 22:30:38.433: gtk_box_gadget_distribute: assertion 'size >= 0' failed in GtkScrollbar

(SWT:1687): Gtk-CRITICAL **: 22:30:38.433: gtk_box_gadget_distribute: assertion 'size >= 0' failed in GtkScrollbar

(SWT:1687): Gtk-CRITICAL **: 22:30:38.443: gtk_box_gadget_distribute: assertion 'size >= 0' failed in GtkScrollbar

(SWT:1687): Gtk-CRITICAL **: 22:30:38.450: gtk_box_gadget_distribute: assertion 'size >= 0' failed in GtkScrollbar

(SWT:1687): Gtk-CRITICAL **: 22:30:38.450: gtk_box_gadget_distribute: assertion 'size >= 0' failed in GtkScrollbar

(SWT:1687): Gtk-CRITICAL **: 22:30:38.466: gtk_box_gadget_distribute: assertion 'size >= 0' failed in GtkScrollbar

(SWT:1687): Gtk-CRITICAL **: 22:30:38.466: gtk_box_gadget_distribute: assertion 'size >= 0' failed in GtkScrollbar

(SWT:1687): Gtk-CRITICAL **: 22:30:38.483: gtk_box_gadget_distribute: assertion 'size >= 0' failed in GtkScrollbar

(SWT:1687): Gtk-CRITICAL **: 22:30:38.483: gtk_box_gadget_distribute: assertion 'size >= 0' failed in GtkScrollbar

(SWT:1687): Gtk-CRITICAL **: 22:30:38.500: gtk_box_gadget_distribute: assertion 'size >= 0' failed in GtkScrollbar

(SWT:1687): Gtk-CRITICAL **: 22:30:38.500: gtk_box_gadget_distribute: assertion 'size >= 0' failed in GtkScrollbar

(SWT:1687): Gtk-CRITICAL **: 22:30:38.516: gtk_box_gadget_distribute: assertion 'size >= 0' failed in GtkScrollbar

(SWT:1687): Gtk-CRITICAL **: 22:30:38.516: gtk_box_gadget_distribute: assertion 'size >= 0' failed in GtkScrollbar

(SWT:1687): Gtk-CRITICAL **: 22:30:38.533: gtk_box_gadget_distribute: assertion 'size >= 0' failed in GtkScrollbar

(SWT:1687): Gtk-CRITICAL **: 22:30:38.533: gtk_box_gadget_distribute: assertion 'size >= 0' failed in GtkScrollbar

(SWT:1687): Gtk-CRITICAL **: 22:30:38.548: gtk_box_gadget_distribute: assertion 'size >= 0' failed in GtkScrollbar

(SWT:1687): Gtk-CRITICAL **: 22:30:38.548: gtk_box_gadget_distribute: assertion 'size >= 0' failed in GtkScrollbar

(SWT:1687): Gtk-CRITICAL **: 22:30:38.551: gtk_box_gadget_distribute: assertion 'size >= 0' failed in GtkScrollbar

(SWT:1687): Gtk-CRITICAL **: 22:30:38.551: gtk_box_gadget_distribute: assertion 'size >= 0' failed in GtkScrollbar

(SWT:1687): Gtk-CRITICAL **: 22:30:38.558: gtk_box_gadget_distribute: assertion 'size >= 0' failed in GtkScrollbar

(SWT:1687): Gtk-CRITICAL **: 22:30:38.559: gtk_box_gadget_distribute: assertion 'size >= 0' failed in GtkScrollbar

(SWT:1687): Gtk-CRITICAL **: 22:30:38.560: gtk_box_gadget_distribute: assertion 'size >= 0' failed in GtkScrollbar

(SWT:1687): Gtk-CRITICAL **: 22:30:38.561: gtk_box_gadget_distribute: assertion 'size >= 0' failed in GtkScrollbar

(SWT:1687): Gtk-CRITICAL **: 22:30:38.573: gtk_box_gadget_distribute: assertion 'size >= 0' failed in GtkScrollbar

(SWT:1687): Gtk-CRITICAL **: 22:30:38.584: gtk_box_gadget_distribute: assertion 'size >= 0' failed in GtkScrollbar

(SWT:1687): Gtk-CRITICAL **: 22:30:38.589: gtk_box_gadget_distribute: assertion 'size >= 0' failed in GtkScrollbar

(SWT:1687): Gtk-CRITICAL **: 22:30:38.589: gtk_box_gadget_distribute: assertion 'size >= 0' failed in GtkScrollbar

(SWT:1687): Gtk-CRITICAL **: 22:30:38.591: gtk_box_gadget_distribute: assertion 'size >= 0' failed in GtkScrollbar

(SWT:1687): Gtk-WARNING **: 22:30:38.666: Negative content width -6 (allocation 1, extents 4x3) while allocating gadget (node toolbar, owner GtkToolbar)

(SWT:1687): Gtk-WARNING **: 22:30:39.003: Negative content width -6 (allocation 1, extents 4x3) while allocating gadget (node toolbar, owner GtkToolbar)

(SWT:1687): Gtk-WARNING **: 22:30:39.030: Negative content width -6 (allocation 1, extents 4x3) while allocating gadget (node toolbar, owner GtkToolbar)

(SWT:1687): Gtk-WARNING **: 22:30:39.670: Negative content width -6 (allocation 1, extents 4x3) while allocating gadget (node toolbar, owner GtkToolbar)

(SWT:1687): Gtk-CRITICAL **: 22:30:40.174: gtk_box_gadget_distribute: assertion 'size >= 0' failed in GtkScrollbar

(SWT:1687): Gtk-CRITICAL **: 22:30:40.184: gtk_box_gadget_distribute: assertion 'size >= 0' failed in GtkScrollbar

(SWT:1687): Gtk-WARNING **: 22:30:40.189: Negative content width -6 (allocation 1, extents 4x3) while allocating gadget (node toolbar, owner GtkToolbar)

(SWT:1687): Gtk-CRITICAL **: 22:30:40.199: gtk_box_gadget_distribute: assertion 'size >= 0' failed in GtkScrollbar

(SWT:1687): Gtk-CRITICAL **: 22:30:40.207: gtk_box_gadget_distribute: assertion 'size >= 0' failed in GtkScrollbar

(SWT:1687): Gtk-CRITICAL **: 22:30:40.208: gtk_box_gadget_distribute: assertion 'size >= 0' failed in GtkScrollbar

(SWT:1687): Gtk-CRITICAL **: 22:30:40.209: gtk_box_gadget_distribute: assertion 'size >= 0' failed in GtkScrollbar

(SWT:1687): Gtk-CRITICAL **: 22:30:40.214: gtk_box_gadget_distribute: assertion 'size >= 0' failed in GtkScrollbar

(SWT:1687): Gtk-CRITICAL **: 22:30:40.214: gtk_box_gadget_distribute: assertion 'size >= 0' failed in GtkScrollbar

(SWT:1687): Gtk-CRITICAL **: 22:30:40.225: gtk_box_gadget_distribute: assertion 'size >= 0' failed in GtkScrollbar

(SWT:1687): Gtk-CRITICAL **: 22:30:40.238: gtk_box_gadget_distribute: assertion 'size >= 0' failed in GtkScrollbar

(SWT:1687): Gtk-CRITICAL **: 22:30:40.238: gtk_box_gadget_distribute: assertion 'size >= 0' failed in GtkScrollbar

(SWT:1687): Gtk-CRITICAL **: 22:30:40.255: gtk_box_gadget_distribute: assertion 'size >= 0' failed in GtkScrollbar

(SWT:1687): Gtk-CRITICAL **: 22:30:40.255: gtk_box_gadget_distribute: assertion 'size >= 0' failed in GtkScrollbar

(SWT:1687): Gtk-CRITICAL **: 22:30:40.271: gtk_box_gadget_distribute: assertion 'size >= 0' failed in GtkScrollbar

(SWT:1687): Gtk-CRITICAL **: 22:30:40.271: gtk_box_gadget_distribute: assertion 'size >= 0' failed in GtkScrollbar

(SWT:1687): Gtk-CRITICAL **: 22:30:40.288: gtk_box_gadget_distribute: assertion 'size >= 0' failed in GtkScrollbar

(SWT:1687): Gtk-CRITICAL **: 22:30:40.288: gtk_box_gadget_distribute: assertion 'size >= 0' failed in GtkScrollbar

(SWT:1687): Gtk-CRITICAL **: 22:30:40.304: gtk_box_gadget_distribute: assertion 'size >= 0' failed in GtkScrollbar

(SWT:1687): Gtk-CRITICAL **: 22:30:40.304: gtk_box_gadget_distribute: assertion 'size >= 0' failed in GtkScrollbar

(SWT:1687): Gtk-CRITICAL **: 22:30:40.320: gtk_box_gadget_distribute: assertion 'size >= 0' failed in GtkScrollbar

(SWT:1687): Gtk-CRITICAL **: 22:30:40.320: gtk_box_gadget_distribute: assertion 'size >= 0' failed in GtkScrollbar

(SWT:1687): Gtk-CRITICAL **: 22:30:40.335: gtk_box_gadget_distribute: assertion 'size >= 0' failed in GtkScrollbar

(SWT:1687): Gtk-CRITICAL **: 22:30:40.335: gtk_box_gadget_distribute: assertion 'size >= 0' failed in GtkScrollbar

(SWT:1687): Gtk-CRITICAL **: 22:30:40.339: gtk_box_gadget_distribute: assertion 'size >= 0' failed in GtkScrollbar

(SWT:1687): Gtk-CRITICAL **: 22:30:40.339: gtk_box_gadget_distribute: assertion 'size >= 0' failed in GtkScrollbar

(SWT:1687): Gtk-CRITICAL **: 22:30:40.346: gtk_box_gadget_distribute: assertion 'size >= 0' failed in GtkScrollbar

(SWT:1687): Gtk-CRITICAL **: 22:30:40.347: gtk_box_gadget_distribute: assertion 'size >= 0' failed in GtkScrollbar

(SWT:1687): Gtk-CRITICAL **: 22:30:40.348: gtk_box_gadget_distribute: assertion 'size >= 0' failed in GtkScrollbar

(SWT:1687): Gtk-CRITICAL **: 22:30:40.349: gtk_box_gadget_distribute: assertion 'size >= 0' failed in GtkScrollbar

(SWT:1687): Gtk-CRITICAL **: 22:30:40.353: gtk_box_gadget_distribute: assertion 'size >= 0' failed in GtkScrollbar

(SWT:1687): Gtk-CRITICAL **: 22:30:40.354: gtk_box_gadget_distribute: assertion 'size >= 0' failed in GtkScrollbar

(SWT:1687): Gtk-CRITICAL **: 22:30:40.356: gtk_box_gadget_distribute: assertion 'size >= 0' failed in GtkScrollbar

(SWT:1687): Gtk-CRITICAL **: 22:30:40.356: gtk_box_gadget_distribute: assertion 'size >= 0' failed in GtkScrollbar

(SWT:1687): Gtk-CRITICAL **: 22:30:40.363: gtk_box_gadget_distribute: assertion 'size >= 0' failed in GtkScrollbar

(SWT:1687): Gtk-CRITICAL **: 22:30:40.372: gtk_box_gadget_distribute: assertion 'size >= 0' failed in GtkScrollbar

(SWT:1687): Gtk-CRITICAL **: 22:30:40.372: gtk_box_gadget_distribute: assertion 'size >= 0' failed in GtkScrollbar

(SWT:1687): Gtk-CRITICAL **: 22:30:40.388: gtk_box_gadget_distribute: assertion 'size >= 0' failed in GtkScrollbar

(SWT:1687): Gtk-CRITICAL **: 22:30:40.388: gtk_box_gadget_distribute: assertion 'size >= 0' failed in GtkScrollbar

(SWT:1687): Gtk-CRITICAL **: 22:30:40.408: gtk_box_gadget_distribute: assertion 'size >= 0' failed in GtkScrollbar

(SWT:1687): Gtk-WARNING **: 22:30:40.437: Negative content width -6 (allocation 1, extents 4x3) while allocating gadget (node toolbar, owner GtkToolbar)

(SWT:1687): Gtk-WARNING **: 22:30:40.770: Negative content width -6 (allocation 1, extents 4x3) while allocating gadget (node toolbar, owner GtkToolbar)

(SWT:1687): Gtk-WARNING **: 22:30:40.796: Negative content width -6 (allocation 1, extents 4x3) while allocating gadget (node toolbar, owner GtkToolbar)

(SWT:1687): Gtk-WARNING **: 22:30:41.410: Negative content width -6 (allocation 1, extents 4x3) while allocating gadget (node toolbar, owner GtkToolbar)

(SWT:1687): Gtk-CRITICAL **: 22:30:42.193: gtk_box_gadget_distribute: assertion 'size >= 0' failed in GtkScrollbar

(SWT:1687): Gtk-CRITICAL **: 22:30:42.203: gtk_box_gadget_distribute: assertion 'size >= 0' failed in GtkScrollbar

(SWT:1687): Gtk-WARNING **: 22:30:42.209: Negative content width -6 (allocation 1, extents 4x3) while allocating gadget (node toolbar, owner GtkToolbar)

(SWT:1687): Gtk-CRITICAL **: 22:30:42.220: gtk_box_gadget_distribute: assertion 'size >= 0' failed in GtkScrollbar

(SWT:1687): Gtk-CRITICAL **: 22:30:42.227: gtk_box_gadget_distribute: assertion 'size >= 0' failed in GtkScrollbar

(SWT:1687): Gtk-CRITICAL **: 22:30:42.233: gtk_box_gadget_distribute: assertion 'size >= 0' failed in GtkScrollbar

(SWT:1687): Gtk-CRITICAL **: 22:30:42.235: gtk_box_gadget_distribute: assertion 'size >= 0' failed in GtkScrollbar

(SWT:1687): Gtk-CRITICAL **: 22:30:42.235: gtk_box_gadget_distribute: assertion 'size >= 0' failed in GtkScrollbar

(SWT:1687): Gtk-CRITICAL **: 22:30:42.241: gtk_box_gadget_distribute: assertion 'size >= 0' failed in GtkScrollbar

(SWT:1687): Gtk-CRITICAL **: 22:30:42.241: gtk_box_gadget_distribute: assertion 'size >= 0' failed in GtkScrollbar

(SWT:1687): Gtk-CRITICAL **: 22:30:42.252: gtk_box_gadget_distribute: assertion 'size >= 0' failed in GtkScrollbar

(SWT:1687): Gtk-CRITICAL **: 22:30:42.269: gtk_box_gadget_distribute: assertion 'size >= 0' failed in GtkScrollbar

(SWT:1687): Gtk-CRITICAL **: 22:30:42.269: gtk_box_gadget_distribute: assertion 'size >= 0' failed in GtkScrollbar

(SWT:1687): Gtk-CRITICAL **: 22:30:42.285: gtk_box_gadget_distribute: assertion 'size >= 0' failed in GtkScrollbar

(SWT:1687): Gtk-CRITICAL **: 22:30:42.285: gtk_box_gadget_distribute: assertion 'size >= 0' failed in GtkScrollbar

(SWT:1687): Gtk-CRITICAL **: 22:30:42.302: gtk_box_gadget_distribute: assertion 'size >= 0' failed in GtkScrollbar

(SWT:1687): Gtk-CRITICAL **: 22:30:42.302: gtk_box_gadget_distribute: assertion 'size >= 0' failed in GtkScrollbar

(SWT:1687): Gtk-CRITICAL **: 22:30:42.319: gtk_box_gadget_distribute: assertion 'size >= 0' failed in GtkScrollbar

(SWT:1687): Gtk-CRITICAL **: 22:30:42.319: gtk_box_gadget_distribute: assertion 'size >= 0' failed in GtkScrollbar

(SWT:1687): Gtk-CRITICAL **: 22:30:42.335: gtk_box_gadget_distribute: assertion 'size >= 0' failed in GtkScrollbar

(SWT:1687): Gtk-CRITICAL **: 22:30:42.335: gtk_box_gadget_distribute: assertion 'size >= 0' failed in GtkScrollbar

(SWT:1687): Gtk-CRITICAL **: 22:30:42.351: gtk_box_gadget_distribute: assertion 'size >= 0' failed in GtkScrollbar

(SWT:1687): Gtk-CRITICAL **: 22:30:42.352: gtk_box_gadget_distribute: assertion 'size >= 0' failed in GtkScrollbar

(SWT:1687): Gtk-CRITICAL **: 22:30:42.378: gtk_box_gadget_distribute: assertion 'size >= 0' failed in GtkScrollbar

(SWT:1687): Gtk-CRITICAL **: 22:30:42.378: gtk_box_gadget_distribute: assertion 'size >= 0' failed in GtkScrollbar

(SWT:1687): Gtk-CRITICAL **: 22:30:42.386: gtk_box_gadget_distribute: assertion 'size >= 0' failed in GtkScrollbar

(SWT:1687): Gtk-CRITICAL **: 22:30:42.386: gtk_box_gadget_distribute: assertion 'size >= 0' failed in GtkScrollbar

(SWT:1687): Gtk-CRITICAL **: 22:30:42.402: gtk_box_gadget_distribute: assertion 'size >= 0' failed in GtkScrollbar

(SWT:1687): Gtk-CRITICAL **: 22:30:42.402: gtk_box_gadget_distribute: assertion 'size >= 0' failed in GtkScrollbar

(SWT:1687): Gtk-CRITICAL **: 22:30:42.419: gtk_box_gadget_distribute: assertion 'size >= 0' failed in GtkScrollbar

(SWT:1687): Gtk-CRITICAL **: 22:30:42.419: gtk_box_gadget_distribute: assertion 'size >= 0' failed in GtkScrollbar

(SWT:1687): Gtk-CRITICAL **: 22:30:42.438: gtk_box_gadget_distribute: assertion 'size >= 0' failed in GtkScrollbar

(SWT:1687): Gtk-CRITICAL **: 22:30:42.439: gtk_box_gadget_distribute: assertion 'size >= 0' failed in GtkScrollbar

(SWT:1687): Gtk-CRITICAL **: 22:30:42.440: gtk_box_gadget_distribute: assertion 'size >= 0' failed in GtkScrollbar

(SWT:1687): Gtk-CRITICAL **: 22:30:42.441: gtk_box_gadget_distribute: assertion 'size >= 0' failed in GtkScrollbar

(SWT:1687): Gtk-CRITICAL **: 22:30:42.444: gtk_box_gadget_distribute: assertion 'size >= 0' failed in GtkScrollbar

(SWT:1687): Gtk-CRITICAL **: 22:30:42.445: gtk_box_gadget_distribute: assertion 'size >= 0' failed in GtkScrollbar

(SWT:1687): Gtk-CRITICAL **: 22:30:42.454: gtk_box_gadget_distribute: assertion 'size >= 0' failed in GtkScrollbar

(SWT:1687): Gtk-CRITICAL **: 22:30:42.476: gtk_box_gadget_distribute: assertion 'size >= 0' failed in GtkScrollbar

(SWT:1687): Gtk-CRITICAL **: 22:30:42.477: gtk_box_gadget_distribute: assertion 'size >= 0' failed in GtkScrollbar

(SWT:1687): Gtk-CRITICAL **: 22:30:42.478: gtk_box_gadget_distribute: assertion 'size >= 0' failed in GtkScrollbar

(SWT:1687): Gtk-CRITICAL **: 22:30:42.479: gtk_box_gadget_distribute: assertion 'size >= 0' failed in GtkScrollbar

(SWT:1687): Gtk-CRITICAL **: 22:30:42.480: gtk_box_gadget_distribute: assertion 'size >= 0' failed in GtkScrollbar

(SWT:1687): Gtk-CRITICAL **: 22:30:42.480: gtk_box_gadget_distribute: assertion 'size >= 0' failed in GtkScrollbar

(SWT:1687): Gtk-CRITICAL **: 22:30:42.482: gtk_box_gadget_distribute: assertion 'size >= 0' failed in GtkScrollbar

(SWT:1687): Gtk-CRITICAL **: 22:30:42.483: gtk_box_gadget_distribute: assertion 'size >= 0' failed in GtkScrollbar

(SWT:1687): Gtk-CRITICAL **: 22:30:42.499: gtk_box_gadget_distribute: assertion 'size >= 0' failed in GtkScrollbar

(SWT:1687): Gtk-CRITICAL **: 22:30:42.518: gtk_box_gadget_distribute: assertion 'size >= 0' failed in GtkScrollbar

(SWT:1687): Gtk-CRITICAL **: 22:30:42.518: gtk_box_gadget_distribute: assertion 'size >= 0' failed in GtkScrollbar

(SWT:1687): Gtk-WARNING **: 22:30:42.607: Negative content width -1 (allocation 1, extents 1x1) while allocating gadget (node trough, owner GtkProgressBar)

(SWT:1687): Gtk-WARNING **: 22:30:42.611: Negative content width -1 (allocation 1, extents 1x1) while allocating gadget (node trough, owner GtkProgressBar)

(SWT:1687): Gtk-CRITICAL **: 22:30:42.656: gtk_box_gadget_distribute: assertion 'size >= 0' failed in GtkScrollbar

(SWT:1687): Gtk-CRITICAL **: 22:30:42.662: gtk_box_gadget_distribute: assertion 'size >= 0' failed in GtkScrollbar

(SWT:1687): Gtk-CRITICAL **: 22:30:42.664: gtk_box_gadget_distribute: assertion 'size >= 0' failed in GtkScrollbar

(SWT:1687): Gtk-CRITICAL **: 22:30:42.664: gtk_box_gadget_distribute: assertion 'size >= 0' failed in GtkScrollbar

(SWT:1687): Gtk-CRITICAL **: 22:30:42.668: gtk_box_gadget_distribute: assertion 'size >= 0' failed in GtkScrollbar

(SWT:1687): Gtk-CRITICAL **: 22:30:42.678: gtk_box_gadget_distribute: assertion 'size >= 0' failed in GtkScrollbar

(SWT:1687): Gtk-CRITICAL **: 22:30:42.731: gtk_box_gadget_distribute: assertion 'size >= 0' failed in GtkScrollbar

(SWT:1687): Gtk-CRITICAL **: 22:30:42.732: gtk_box_gadget_distribute: assertion 'size >= 0' failed in GtkScrollbar

(SWT:1687): Gtk-CRITICAL **: 22:30:42.732: gtk_box_gadget_distribute: assertion 'size >= 0' failed in GtkScrollbar

(SWT:1687): Gtk-CRITICAL **: 22:30:42.740: gtk_box_gadget_distribute: assertion 'size >= 0' failed in GtkScrollbar

(SWT:1687): Gtk-CRITICAL **: 22:30:42.914: gtk_box_gadget_distribute: assertion 'size >= 0' failed in GtkScrollbar

(SWT:1687): Gtk-CRITICAL **: 22:30:42.915: gtk_box_gadget_distribute: assertion 'size >= 0' failed in GtkScrollbar

(SWT:1687): Gtk-CRITICAL **: 22:30:42.916: gtk_box_gadget_distribute: assertion 'size >= 0' failed in GtkScrollbar

(SWT:1687): Gtk-CRITICAL **: 22:30:42.930: gtk_box_gadget_distribute: assertion 'size >= 0' failed in GtkScrollbar

(SWT:1687): Gtk-CRITICAL **: 22:30:42.963: gtk_box_gadget_distribute: assertion 'size >= 0' failed in GtkScrollbar

(SWT:1687): Gtk-CRITICAL **: 22:30:42.968: gtk_box_gadget_distribute: assertion 'size >= 0' failed in GtkScrollbar

(SWT:1687): Gtk-CRITICAL **: 22:30:43.038: gtk_box_gadget_distribute: assertion 'size >= 0' failed in GtkScrollbar

(SWT:1687): Gtk-CRITICAL **: 22:30:43.050: gtk_box_gadget_distribute: assertion 'size >= 0' failed in GtkScrollbar

(SWT:1687): Gtk-CRITICAL **: 22:30:43.051: gtk_box_gadget_distribute: assertion 'size >= 0' failed in GtkScrollbar

(SWT:1687): Gtk-CRITICAL **: 22:30:43.053: gtk_box_gadget_distribute: assertion 'size >= 0' failed in GtkScrollbar

(SWT:1687): Gtk-CRITICAL **: 22:30:43.053: gtk_box_gadget_distribute: assertion 'size >= 0' failed in GtkScrollbar

(SWT:1687): Gtk-CRITICAL **: 22:30:43.054: gtk_box_gadget_distribute: assertion 'size >= 0' failed in GtkScrollbar

(SWT:1687): Gtk-CRITICAL **: 22:30:43.054: gtk_box_gadget_distribute: assertion 'size >= 0' failed in GtkScrollbar

(SWT:1687): Gtk-CRITICAL **: 22:30:43.061: gtk_box_gadget_distribute: assertion 'size >= 0' failed in GtkScrollbar

(SWT:1687): Gtk-CRITICAL **: 22:30:43.071: gtk_box_gadget_distribute: assertion 'size >= 0' failed in GtkScrollbar

(SWT:1687): Gtk-CRITICAL **: 22:30:43.090: gtk_box_gadget_distribute: assertion 'size >= 0' failed in GtkScrollbar

(SWT:1687): Gtk-CRITICAL **: 22:30:43.090: gtk_box_gadget_distribute: assertion 'size >= 0' failed in GtkScrollbar

(SWT:1687): Gtk-CRITICAL **: 22:30:43.118: gtk_box_gadget_distribute: assertion 'size >= 0' failed in GtkScrollbar

(SWT:1687): Gtk-CRITICAL **: 22:30:43.124: gtk_box_gadget_distribute: assertion 'size >= 0' failed in GtkScrollbar

(SWT:1687): Gtk-CRITICAL **: 22:30:43.126: gtk_box_gadget_distribute: assertion 'size >= 0' failed in GtkScrollbar

(SWT:1687): Gtk-CRITICAL **: 22:30:43.127: gtk_box_gadget_distribute: assertion 'size >= 0' failed in GtkScrollbar

(SWT:1687): Gtk-CRITICAL **: 22:30:43.130: gtk_box_gadget_distribute: assertion 'size >= 0' failed in GtkScrollbar

(SWT:1687): Gtk-CRITICAL **: 22:30:43.148: gtk_box_gadget_distribute: assertion 'size >= 0' failed in GtkScrollbar

(SWT:1687): Gtk-WARNING **: 22:30:43.249: Negative content width -6 (allocation 1, extents 4x3) while allocating gadget (node toolbar, owner GtkToolbar)

(SWT:1687): Gtk-WARNING **: 22:30:43.596: Negative content width -6 (allocation 1, extents 4x3) while allocating gadget (node toolbar, owner GtkToolbar)

(SWT:1687): Gtk-WARNING **: 22:30:43.633: Negative content width -6 (allocation 1, extents 4x3) while allocating gadget (node toolbar, owner GtkToolbar)
Tests run: 10, Failures: 0, Errors: 0, Skipped: 0, Time elapsed: 25.511 s - in org.eclipse.egit.ui.test.stagview.StagingViewTest
testAmend(org.eclipse.egit.ui.test.stagview.StagingViewTest)  Time elapsed: 2.636 s
testCommitSingleFile(org.eclipse.egit.ui.test.stagview.StagingViewTest)  Time elapsed: 1.874 s
testMergeConflict(org.eclipse.egit.ui.test.stagview.StagingViewTest)  Time elapsed: 7.682 s
testCommitMessageConfigChangeAmending(org.eclipse.egit.ui.test.stagview.StagingViewTest)  Time elapsed: 1.666 s
testCommitMessageConfigChangeWithAuthor(org.eclipse.egit.ui.test.stagview.StagingViewTest)  Time elapsed: 1.757 s
testCommitMessageConfigChange(org.eclipse.egit.ui.test.stagview.StagingViewTest)  Time elapsed: 1.629 s
testCommitMessageConfigChangeBranchSwitchToNew(org.eclipse.egit.ui.test.stagview.StagingViewTest)  Time elapsed: 1.807 s
testCommitMessageCommitterChangeSignOff(org.eclipse.egit.ui.test.stagview.StagingViewTest)  Time elapsed: 1.798 s
testCommitMessageConfigChangeNoSignOff(org.eclipse.egit.ui.test.stagview.StagingViewTest)  Time elapsed: 1.779 s
testDeleteModifyConflict(org.eclipse.egit.ui.test.stagview.StagingViewTest)  Time elapsed: 2.843 s
Running org.eclipse.egit.ui.test.stagview.CommitMessageProvidersTest

(SWT:1687): Gtk-WARNING **: 22:30:44.331: Negative content width -6 (allocation 1, extents 4x3) while allocating gadget (node toolbar, owner GtkToolbar)

(SWT:1687): Gtk-CRITICAL **: 22:30:45.008: gtk_box_gadget_distribute: assertion 'size >= 0' failed in GtkScrollbar

(SWT:1687): Gtk-CRITICAL **: 22:30:45.018: gtk_box_gadget_distribute: assertion 'size >= 0' failed in GtkScrollbar

(SWT:1687): Gtk-WARNING **: 22:30:45.023: Negative content width -6 (allocation 1, extents 4x3) while allocating gadget (node toolbar, owner GtkToolbar)

(SWT:1687): Gtk-CRITICAL **: 22:30:45.034: gtk_box_gadget_distribute: assertion 'size >= 0' failed in GtkScrollbar

(SWT:1687): Gtk-CRITICAL **: 22:30:45.042: gtk_box_gadget_distribute: assertion 'size >= 0' failed in GtkScrollbar

(SWT:1687): Gtk-CRITICAL **: 22:30:45.048: gtk_box_gadget_distribute: assertion 'size >= 0' failed in GtkScrollbar

(SWT:1687): Gtk-CRITICAL **: 22:30:45.050: gtk_box_gadget_distribute: assertion 'size >= 0' failed in GtkScrollbar

(SWT:1687): Gtk-CRITICAL **: 22:30:45.051: gtk_box_gadget_distribute: assertion 'size >= 0' failed in GtkScrollbar

(SWT:1687): Gtk-CRITICAL **: 22:30:45.052: gtk_box_gadget_distribute: assertion 'size >= 0' failed in GtkScrollbar

(SWT:1687): Gtk-CRITICAL **: 22:30:45.052: gtk_box_gadget_distribute: assertion 'size >= 0' failed in GtkScrollbar

(SWT:1687): Gtk-CRITICAL **: 22:30:45.058: gtk_box_gadget_distribute: assertion 'size >= 0' failed in GtkScrollbar

(SWT:1687): Gtk-CRITICAL **: 22:30:45.058: gtk_box_gadget_distribute: assertion 'size >= 0' failed in GtkScrollbar

(SWT:1687): Gtk-CRITICAL **: 22:30:45.074: gtk_box_gadget_distribute: assertion 'size >= 0' failed in GtkScrollbar

(SWT:1687): Gtk-CRITICAL **: 22:30:45.085: gtk_box_gadget_distribute: assertion 'size >= 0' failed in GtkScrollbar

(SWT:1687): Gtk-CRITICAL **: 22:30:45.085: gtk_box_gadget_distribute: assertion 'size >= 0' failed in GtkScrollbar

(SWT:1687): Gtk-CRITICAL **: 22:30:45.102: gtk_box_gadget_distribute: assertion 'size >= 0' failed in GtkScrollbar

(SWT:1687): Gtk-CRITICAL **: 22:30:45.102: gtk_box_gadget_distribute: assertion 'size >= 0' failed in GtkScrollbar

(SWT:1687): Gtk-CRITICAL **: 22:30:45.118: gtk_box_gadget_distribute: assertion 'size >= 0' failed in GtkScrollbar

(SWT:1687): Gtk-CRITICAL **: 22:30:45.118: gtk_box_gadget_distribute: assertion 'size >= 0' failed in GtkScrollbar

(SWT:1687): Gtk-CRITICAL **: 22:30:45.135: gtk_box_gadget_distribute: assertion 'size >= 0' failed in GtkScrollbar

(SWT:1687): Gtk-CRITICAL **: 22:30:45.135: gtk_box_gadget_distribute: assertion 'size >= 0' failed in GtkScrollbar

(SWT:1687): Gtk-CRITICAL **: 22:30:45.152: gtk_box_gadget_distribute: assertion 'size >= 0' failed in GtkScrollbar

(SWT:1687): Gtk-CRITICAL **: 22:30:45.152: gtk_box_gadget_distribute: assertion 'size >= 0' failed in GtkScrollbar

(SWT:1687): Gtk-CRITICAL **: 22:30:45.168: gtk_box_gadget_distribute: assertion 'size >= 0' failed in GtkScrollbar

(SWT:1687): Gtk-CRITICAL **: 22:30:45.168: gtk_box_gadget_distribute: assertion 'size >= 0' failed in GtkScrollbar

(SWT:1687): Gtk-CRITICAL **: 22:30:45.195: gtk_box_gadget_distribute: assertion 'size >= 0' failed in GtkScrollbar

(SWT:1687): Gtk-CRITICAL **: 22:30:45.195: gtk_box_gadget_distribute: assertion 'size >= 0' failed in GtkScrollbar

(SWT:1687): Gtk-CRITICAL **: 22:30:45.203: gtk_box_gadget_distribute: assertion 'size >= 0' failed in GtkScrollbar

(SWT:1687): Gtk-CRITICAL **: 22:30:45.203: gtk_box_gadget_distribute: assertion 'size >= 0' failed in GtkScrollbar

(SWT:1687): Gtk-CRITICAL **: 22:30:45.218: gtk_box_gadget_distribute: assertion 'size >= 0' failed in GtkScrollbar

(SWT:1687): Gtk-CRITICAL **: 22:30:45.218: gtk_box_gadget_distribute: assertion 'size >= 0' failed in GtkScrollbar

(SWT:1687): Gtk-CRITICAL **: 22:30:45.235: gtk_box_gadget_distribute: assertion 'size >= 0' failed in GtkScrollbar

(SWT:1687): Gtk-CRITICAL **: 22:30:45.235: gtk_box_gadget_distribute: assertion 'size >= 0' failed in GtkScrollbar

(SWT:1687): Gtk-CRITICAL **: 22:30:45.256: gtk_box_gadget_distribute: assertion 'size >= 0' failed in GtkScrollbar

(SWT:1687): Gtk-CRITICAL **: 22:30:45.256: gtk_box_gadget_distribute: assertion 'size >= 0' failed in GtkScrollbar

(SWT:1687): Gtk-CRITICAL **: 22:30:45.261: gtk_box_gadget_distribute: assertion 'size >= 0' failed in GtkScrollbar

(SWT:1687): Gtk-CRITICAL **: 22:30:45.261: gtk_box_gadget_distribute: assertion 'size >= 0' failed in GtkScrollbar

(SWT:1687): Gtk-WARNING **: 22:30:45.365: Negative content width -6 (allocation 1, extents 4x3) while allocating gadget (node toolbar, owner GtkToolbar)

(SWT:1687): Gtk-WARNING **: 22:30:45.804: Negative content width -6 (allocation 1, extents 4x3) while allocating gadget (node toolbar, owner GtkToolbar)

(SWT:1687): Gtk-WARNING **: 22:30:45.834: Negative content width -6 (allocation 1, extents 4x3) while allocating gadget (node toolbar, owner GtkToolbar)

(SWT:1687): Gtk-WARNING **: 22:30:46.437: Negative content width -6 (allocation 1, extents 4x3) while allocating gadget (node toolbar, owner GtkToolbar)

(SWT:1687): Gtk-CRITICAL **: 22:30:46.940: gtk_box_gadget_distribute: assertion 'size >= 0' failed in GtkScrollbar

(SWT:1687): Gtk-CRITICAL **: 22:30:46.950: gtk_box_gadget_distribute: assertion 'size >= 0' failed in GtkScrollbar

(SWT:1687): Gtk-WARNING **: 22:30:46.955: Negative content width -6 (allocation 1, extents 4x3) while allocating gadget (node toolbar, owner GtkToolbar)

(SWT:1687): Gtk-CRITICAL **: 22:30:46.964: gtk_box_gadget_distribute: assertion 'size >= 0' failed in GtkScrollbar

(SWT:1687): Gtk-CRITICAL **: 22:30:46.979: gtk_box_gadget_distribute: assertion 'size >= 0' failed in GtkScrollbar

(SWT:1687): Gtk-CRITICAL **: 22:30:46.986: gtk_box_gadget_distribute: assertion 'size >= 0' failed in GtkScrollbar

(SWT:1687): Gtk-CRITICAL **: 22:30:46.996: gtk_box_gadget_distribute: assertion 'size >= 0' failed in GtkScrollbar

!ENTRY org.eclipse.egit.ui 2 0 2019-12-05 22:30:47.002
!MESSAGE Found multiple implementations of ICommitMessageProvider2. Ignoring caret positioning for org.eclipse.egit.ui.test.stagview.CommitMessageProvidersTest$TestCommitMessageProvider.

(SWT:1687): Gtk-CRITICAL **: 22:30:47.003: gtk_box_gadget_distribute: assertion 'size >= 0' failed in GtkScrollbar

(SWT:1687): Gtk-CRITICAL **: 22:30:47.003: gtk_box_gadget_distribute: assertion 'size >= 0' failed in GtkScrollbar

(SWT:1687): Gtk-CRITICAL **: 22:30:47.005: gtk_box_gadget_distribute: assertion 'size >= 0' failed in GtkScrollbar

(SWT:1687): Gtk-CRITICAL **: 22:30:47.005: gtk_box_gadget_distribute: assertion 'size >= 0' failed in GtkScrollbar

(SWT:1687): Gtk-CRITICAL **: 22:30:47.010: gtk_box_gadget_distribute: assertion 'size >= 0' failed in GtkScrollbar

(SWT:1687): Gtk-CRITICAL **: 22:30:47.011: gtk_box_gadget_distribute: assertion 'size >= 0' failed in GtkScrollbar

(SWT:1687): Gtk-CRITICAL **: 22:30:47.028: gtk_box_gadget_distribute: assertion 'size >= 0' failed in GtkScrollbar

(SWT:1687): Gtk-CRITICAL **: 22:30:47.038: gtk_box_gadget_distribute: assertion 'size >= 0' failed in GtkScrollbar

(SWT:1687): Gtk-CRITICAL **: 22:30:47.038: gtk_box_gadget_distribute: assertion 'size >= 0' failed in GtkScrollbar

(SWT:1687): Gtk-CRITICAL **: 22:30:47.054: gtk_box_gadget_distribute: assertion 'size >= 0' failed in GtkScrollbar

(SWT:1687): Gtk-CRITICAL **: 22:30:47.054: gtk_box_gadget_distribute: assertion 'size >= 0' failed in GtkScrollbar

(SWT:1687): Gtk-CRITICAL **: 22:30:47.070: gtk_box_gadget_distribute: assertion 'size >= 0' failed in GtkScrollbar

(SWT:1687): Gtk-CRITICAL **: 22:30:47.070: gtk_box_gadget_distribute: assertion 'size >= 0' failed in GtkScrollbar

(SWT:1687): Gtk-CRITICAL **: 22:30:47.087: gtk_box_gadget_distribute: assertion 'size >= 0' failed in GtkScrollbar

(SWT:1687): Gtk-CRITICAL **: 22:30:47.087: gtk_box_gadget_distribute: assertion 'size >= 0' failed in GtkScrollbar

(SWT:1687): Gtk-CRITICAL **: 22:30:47.104: gtk_box_gadget_distribute: assertion 'size >= 0' failed in GtkScrollbar

(SWT:1687): Gtk-CRITICAL **: 22:30:47.104: gtk_box_gadget_distribute: assertion 'size >= 0' failed in GtkScrollbar

(SWT:1687): Gtk-CRITICAL **: 22:30:47.120: gtk_box_gadget_distribute: assertion 'size >= 0' failed in GtkScrollbar

(SWT:1687): Gtk-CRITICAL **: 22:30:47.120: gtk_box_gadget_distribute: assertion 'size >= 0' failed in GtkScrollbar

(SWT:1687): Gtk-CRITICAL **: 22:30:47.147: gtk_box_gadget_distribute: assertion 'size >= 0' failed in GtkScrollbar

(SWT:1687): Gtk-CRITICAL **: 22:30:47.147: gtk_box_gadget_distribute: assertion 'size >= 0' failed in GtkScrollbar

(SWT:1687): Gtk-CRITICAL **: 22:30:47.154: gtk_box_gadget_distribute: assertion 'size >= 0' failed in GtkScrollbar

(SWT:1687): Gtk-CRITICAL **: 22:30:47.170: gtk_box_gadget_distribute: assertion 'size >= 0' failed in GtkScrollbar

(SWT:1687): Gtk-CRITICAL **: 22:30:47.186: gtk_box_gadget_distribute: assertion 'size >= 0' failed in GtkScrollbar

(SWT:1687): Gtk-CRITICAL **: 22:30:47.186: gtk_box_gadget_distribute: assertion 'size >= 0' failed in GtkScrollbar

(SWT:1687): Gtk-CRITICAL **: 22:30:47.191: gtk_box_gadget_distribute: assertion 'size >= 0' failed in GtkScrollbar

(SWT:1687): Gtk-WARNING **: 22:30:47.339: Negative content width -6 (allocation 1, extents 4x3) while allocating gadget (node toolbar, owner GtkToolbar)

(SWT:1687): Gtk-WARNING **: 22:30:47.781: Negative content width -6 (allocation 1, extents 4x3) while allocating gadget (node toolbar, owner GtkToolbar)

(SWT:1687): Gtk-WARNING **: 22:30:47.812: Negative content width -6 (allocation 1, extents 4x3) while allocating gadget (node toolbar, owner GtkToolbar)

(SWT:1687): Gtk-WARNING **: 22:30:48.412: Negative content width -6 (allocation 1, extents 4x3) while allocating gadget (node toolbar, owner GtkToolbar)

(SWT:1687): Gtk-CRITICAL **: 22:30:48.932: gtk_box_gadget_distribute: assertion 'size >= 0' failed in GtkScrollbar

(SWT:1687): Gtk-CRITICAL **: 22:30:48.943: gtk_box_gadget_distribute: assertion 'size >= 0' failed in GtkScrollbar

(SWT:1687): Gtk-WARNING **: 22:30:48.949: Negative content width -6 (allocation 1, extents 4x3) while allocating gadget (node toolbar, owner GtkToolbar)

(SWT:1687): Gtk-CRITICAL **: 22:30:48.961: gtk_box_gadget_distribute: assertion 'size >= 0' failed in GtkScrollbar

(SWT:1687): Gtk-CRITICAL **: 22:30:48.983: gtk_box_gadget_distribute: assertion 'size >= 0' failed in GtkScrollbar

(SWT:1687): Gtk-CRITICAL **: 22:30:48.990: gtk_box_gadget_distribute: assertion 'size >= 0' failed in GtkScrollbar

(SWT:1687): Gtk-CRITICAL **: 22:30:48.995: gtk_box_gadget_distribute: assertion 'size >= 0' failed in GtkScrollbar

(SWT:1687): Gtk-CRITICAL **: 22:30:49.002: gtk_box_gadget_distribute: assertion 'size >= 0' failed in GtkScrollbar

(SWT:1687): Gtk-CRITICAL **: 22:30:49.004: gtk_box_gadget_distribute: assertion 'size >= 0' failed in GtkScrollbar

(SWT:1687): Gtk-CRITICAL **: 22:30:49.004: gtk_box_gadget_distribute: assertion 'size >= 0' failed in GtkScrollbar

(SWT:1687): Gtk-CRITICAL **: 22:30:49.005: gtk_box_gadget_distribute: assertion 'size >= 0' failed in GtkScrollbar

(SWT:1687): Gtk-CRITICAL **: 22:30:49.006: gtk_box_gadget_distribute: assertion 'size >= 0' failed in GtkScrollbar

(SWT:1687): Gtk-CRITICAL **: 22:30:49.011: gtk_box_gadget_distribute: assertion 'size >= 0' failed in GtkScrollbar

(SWT:1687): Gtk-CRITICAL **: 22:30:49.012: gtk_box_gadget_distribute: assertion 'size >= 0' failed in GtkScrollbar

(SWT:1687): Gtk-CRITICAL **: 22:30:49.024: gtk_box_gadget_distribute: assertion 'size >= 0' failed in GtkScrollbar

(SWT:1687): Gtk-CRITICAL **: 22:30:49.041: gtk_box_gadget_distribute: assertion 'size >= 0' failed in GtkScrollbar

(SWT:1687): Gtk-CRITICAL **: 22:30:49.041: gtk_box_gadget_distribute: assertion 'size >= 0' failed in GtkScrollbar

(SWT:1687): Gtk-CRITICAL **: 22:30:49.057: gtk_box_gadget_distribute: assertion 'size >= 0' failed in GtkScrollbar

(SWT:1687): Gtk-CRITICAL **: 22:30:49.057: gtk_box_gadget_distribute: assertion 'size >= 0' failed in GtkScrollbar

(SWT:1687): Gtk-CRITICAL **: 22:30:49.073: gtk_box_gadget_distribute: assertion 'size >= 0' failed in GtkScrollbar

(SWT:1687): Gtk-CRITICAL **: 22:30:49.073: gtk_box_gadget_distribute: assertion 'size >= 0' failed in GtkScrollbar

(SWT:1687): Gtk-CRITICAL **: 22:30:49.090: gtk_box_gadget_distribute: assertion 'size >= 0' failed in GtkScrollbar

(SWT:1687): Gtk-CRITICAL **: 22:30:49.090: gtk_box_gadget_distribute: assertion 'size >= 0' failed in GtkScrollbar

(SWT:1687): Gtk-CRITICAL **: 22:30:49.107: gtk_box_gadget_distribute: assertion 'size >= 0' failed in GtkScrollbar

(SWT:1687): Gtk-CRITICAL **: 22:30:49.107: gtk_box_gadget_distribute: assertion 'size >= 0' failed in GtkScrollbar

(SWT:1687): Gtk-CRITICAL **: 22:30:49.124: gtk_box_gadget_distribute: assertion 'size >= 0' failed in GtkScrollbar

(SWT:1687): Gtk-CRITICAL **: 22:30:49.124: gtk_box_gadget_distribute: assertion 'size >= 0' failed in GtkScrollbar

(SWT:1687): Gtk-CRITICAL **: 22:30:49.151: gtk_box_gadget_distribute: assertion 'size >= 0' failed in GtkScrollbar

(SWT:1687): Gtk-CRITICAL **: 22:30:49.151: gtk_box_gadget_distribute: assertion 'size >= 0' failed in GtkScrollbar

(SWT:1687): Gtk-CRITICAL **: 22:30:49.160: gtk_box_gadget_distribute: assertion 'size >= 0' failed in GtkScrollbar

(SWT:1687): Gtk-CRITICAL **: 22:30:49.160: gtk_box_gadget_distribute: assertion 'size >= 0' failed in GtkScrollbar

(SWT:1687): Gtk-CRITICAL **: 22:30:49.175: gtk_box_gadget_distribute: assertion 'size >= 0' failed in GtkScrollbar

(SWT:1687): Gtk-CRITICAL **: 22:30:49.190: gtk_box_gadget_distribute: assertion 'size >= 0' failed in GtkScrollbar

(SWT:1687): Gtk-CRITICAL **: 22:30:49.204: gtk_box_gadget_distribute: assertion 'size >= 0' failed in GtkScrollbar

(SWT:1687): Gtk-CRITICAL **: 22:30:49.204: gtk_box_gadget_distribute: assertion 'size >= 0' failed in GtkScrollbar

(SWT:1687): Gtk-CRITICAL **: 22:30:49.208: gtk_box_gadget_distribute: assertion 'size >= 0' failed in GtkScrollbar

(SWT:1687): Gtk-WARNING **: 22:30:49.343: Negative content width -6 (allocation 1, extents 4x3) while allocating gadget (node toolbar, owner GtkToolbar)

(SWT:1687): Gtk-WARNING **: 22:30:49.686: Negative content width -6 (allocation 1, extents 4x3) while allocating gadget (node toolbar, owner GtkToolbar)

(SWT:1687): Gtk-WARNING **: 22:30:49.715: Negative content width -6 (allocation 1, extents 4x3) while allocating gadget (node toolbar, owner GtkToolbar)
Tests run: 3, Failures: 0, Errors: 0, Skipped: 0, Time elapsed: 6.032 s - in org.eclipse.egit.ui.test.stagview.CommitMessageProvidersTest
testCaretPosition(org.eclipse.egit.ui.test.stagview.CommitMessageProvidersTest)  Time elapsed: 2.138 s
testTwoProvidersFromSameExtension(org.eclipse.egit.ui.test.stagview.CommitMessageProvidersTest)  Time elapsed: 1.978 s
testCaretPositionUndefined(org.eclipse.egit.ui.test.stagview.CommitMessageProvidersTest)  Time elapsed: 1.903 s
Running org.eclipse.egit.ui.variables.DynamicVariablesTest
Tests run: 4, Failures: 0, Errors: 0, Skipped: 0, Time elapsed: 4.364 s - in org.eclipse.egit.ui.variables.DynamicVariablesTest
testGitBranch(org.eclipse.egit.ui.variables.DynamicVariablesTest)  Time elapsed: 1.096 s
testGitPath(org.eclipse.egit.ui.variables.DynamicVariablesTest)  Time elapsed: 1.089 s
testGitWorkTree(org.eclipse.egit.ui.variables.DynamicVariablesTest)  Time elapsed: 1.107 s
testGitDir(org.eclipse.egit.ui.variables.DynamicVariablesTest)  Time elapsed: 1.07 s
Running org.eclipse.egit.ui.gitflow.FeatureFinishSquashHandlerTest

(SWT:1687): Gtk-CRITICAL **: 22:30:55.186: gtk_box_gadget_distribute: assertion 'size >= 0' failed in GtkScrollbar

(SWT:1687): Gtk-CRITICAL **: 22:30:55.199: gtk_box_gadget_distribute: assertion 'size >= 0' failed in GtkScrollbar

(SWT:1687): Gtk-CRITICAL **: 22:30:55.215: gtk_box_gadget_distribute: assertion 'size >= 0' failed in GtkScrollbar

(SWT:1687): Gtk-CRITICAL **: 22:30:55.232: gtk_box_gadget_distribute: assertion 'size >= 0' failed in GtkScrollbar

(SWT:1687): Gtk-CRITICAL **: 22:30:55.249: gtk_box_gadget_distribute: assertion 'size >= 0' failed in GtkScrollbar

(SWT:1687): Gtk-CRITICAL **: 22:30:55.266: gtk_box_gadget_distribute: assertion 'size >= 0' failed in GtkScrollbar

(SWT:1687): Gtk-CRITICAL **: 22:30:55.282: gtk_box_gadget_distribute: assertion 'size >= 0' failed in GtkScrollbar

(SWT:1687): Gtk-CRITICAL **: 22:30:55.299: gtk_box_gadget_distribute: assertion 'size >= 0' failed in GtkScrollbar

(SWT:1687): Gtk-CRITICAL **: 22:30:55.316: gtk_box_gadget_distribute: assertion 'size >= 0' failed in GtkScrollbar

(SWT:1687): Gtk-CRITICAL **: 22:30:55.332: gtk_box_gadget_distribute: assertion 'size >= 0' failed in GtkScrollbar

(SWT:1687): Gtk-CRITICAL **: 22:30:55.349: gtk_box_gadget_distribute: assertion 'size >= 0' failed in GtkScrollbar

(SWT:1687): Gtk-CRITICAL **: 22:30:55.365: gtk_box_gadget_distribute: assertion 'size >= 0' failed in GtkScrollbar

(SWT:1687): Gtk-CRITICAL **: 22:30:55.382: gtk_box_gadget_distribute: assertion 'size >= 0' failed in GtkScrollbar

(SWT:1687): Gtk-CRITICAL **: 22:30:55.398: gtk_box_gadget_distribute: assertion 'size >= 0' failed in GtkScrollbar

(SWT:1687): Gtk-CRITICAL **: 22:30:55.415: gtk_box_gadget_distribute: assertion 'size >= 0' failed in GtkScrollbar

(SWT:1687): Gtk-CRITICAL **: 22:30:55.432: gtk_box_gadget_distribute: assertion 'size >= 0' failed in GtkScrollbar

(SWT:1687): Gtk-CRITICAL **: 22:30:55.956: gtk_box_gadget_distribute: assertion 'size >= 0' failed in GtkScrollbar
Tests run: 1, Failures: 0, Errors: 0, Skipped: 0, Time elapsed: 2.617 s - in org.eclipse.egit.ui.gitflow.FeatureFinishSquashHandlerTest
testFeatureFinishSquash(org.eclipse.egit.ui.gitflow.FeatureFinishSquashHandlerTest)  Time elapsed: 2.61 s
Running org.eclipse.egit.ui.gitflow.FeatureStartFinishHandlerTest

(SWT:1687): Gtk-CRITICAL **: 22:30:57.893: gtk_box_gadget_distribute: assertion 'size >= 0' failed in GtkScrollbar

(SWT:1687): Gtk-CRITICAL **: 22:30:57.912: gtk_box_gadget_distribute: assertion 'size >= 0' failed in GtkScrollbar

(SWT:1687): Gtk-CRITICAL **: 22:30:57.928: gtk_box_gadget_distribute: assertion 'size >= 0' failed in GtkScrollbar

(SWT:1687): Gtk-CRITICAL **: 22:30:57.945: gtk_box_gadget_distribute: assertion 'size >= 0' failed in GtkScrollbar

(SWT:1687): Gtk-CRITICAL **: 22:30:57.962: gtk_box_gadget_distribute: assertion 'size >= 0' failed in GtkScrollbar

(SWT:1687): Gtk-CRITICAL **: 22:30:57.980: gtk_box_gadget_distribute: assertion 'size >= 0' failed in GtkScrollbar

(SWT:1687): Gtk-CRITICAL **: 22:30:57.995: gtk_box_gadget_distribute: assertion 'size >= 0' failed in GtkScrollbar

(SWT:1687): Gtk-CRITICAL **: 22:30:58.011: gtk_box_gadget_distribute: assertion 'size >= 0' failed in GtkScrollbar

(SWT:1687): Gtk-CRITICAL **: 22:30:58.028: gtk_box_gadget_distribute: assertion 'size >= 0' failed in GtkScrollbar

(SWT:1687): Gtk-CRITICAL **: 22:30:58.045: gtk_box_gadget_distribute: assertion 'size >= 0' failed in GtkScrollbar

(SWT:1687): Gtk-CRITICAL **: 22:30:58.062: gtk_box_gadget_distribute: assertion 'size >= 0' failed in GtkScrollbar

(SWT:1687): Gtk-CRITICAL **: 22:30:58.078: gtk_box_gadget_distribute: assertion 'size >= 0' failed in GtkScrollbar

(SWT:1687): Gtk-CRITICAL **: 22:30:58.094: gtk_box_gadget_distribute: assertion 'size >= 0' failed in GtkScrollbar

(SWT:1687): Gtk-CRITICAL **: 22:30:58.663: gtk_box_gadget_distribute: assertion 'size >= 0' failed in GtkScrollbar

(SWT:1687): Gtk-WARNING **: 22:30:59.411: Negative content width -1 (allocation 1, extents 1x1) while allocating gadget (node trough, owner GtkProgressBar)

(SWT:1687): Gtk-WARNING **: 22:30:59.418: Negative content width -1 (allocation 1, extents 1x1) while allocating gadget (node trough, owner GtkProgressBar)

(SWT:1687): Gtk-WARNING **: 22:30:59.424: Negative content width -1 (allocation 1, extents 1x1) while allocating gadget (node trough, owner GtkProgressBar)
Tests run: 1, Failures: 0, Errors: 0, Skipped: 0, Time elapsed: 3.018 s - in org.eclipse.egit.ui.gitflow.FeatureStartFinishHandlerTest
testFeatureStart(org.eclipse.egit.ui.gitflow.FeatureStartFinishHandlerTest)  Time elapsed: 3.012 s
Running org.eclipse.egit.ui.gitflow.InitHandlerTest
Tests run: 3, Failures: 0, Errors: 0, Skipped: 0, Time elapsed: 4.121 s - in org.eclipse.egit.ui.gitflow.InitHandlerTest
testInit(org.eclipse.egit.ui.gitflow.InitHandlerTest)  Time elapsed: 0.864 s
testInitEmptyRepoMissingMaster(org.eclipse.egit.ui.gitflow.InitHandlerTest)  Time elapsed: 1.957 s
testInitMissingMaster(org.eclipse.egit.ui.gitflow.InitHandlerTest)  Time elapsed: 1.289 s
Running org.eclipse.egit.ui.gitflow.FeatureRebaseHandlerTest

(SWT:1687): Gtk-WARNING **: 22:31:04.876: Negative content width -6 (allocation 1, extents 4x3) while allocating gadget (node toolbar, owner GtkToolbar)

(SWT:1687): Gtk-WARNING **: 22:31:04.883: Negative content width -6 (allocation 1, extents 4x3) while allocating gadget (node toolbar, owner GtkToolbar)

(SWT:1687): Gtk-WARNING **: 22:31:04.889: Negative content width -6 (allocation 1, extents 4x3) while allocating gadget (node toolbar, owner GtkToolbar)

(SWT:1687): Gtk-WARNING **: 22:31:04.891: Negative content width -6 (allocation 1, extents 4x3) while allocating gadget (node toolbar, owner GtkToolbar)

(SWT:1687): Gtk-WARNING **: 22:31:04.892: Negative content width -6 (allocation 1, extents 4x3) while allocating gadget (node toolbar, owner GtkToolbar)

(SWT:1687): Gtk-WARNING **: 22:31:04.938: Negative content width -6 (allocation 1, extents 4x3) while allocating gadget (node toolbar, owner GtkToolbar)

(SWT:1687): Gtk-WARNING **: 22:31:05.334: Negative content height -1 (allocation 1, extents 1x1) while allocating gadget (node scrolledwindow, owner GtkScrolledWindow)

(SWT:1687): Gtk-CRITICAL **: 22:31:05.334: gtk_box_gadget_distribute: assertion 'size >= 0' failed in GtkScrollbar

(SWT:1687): Gtk-WARNING **: 22:31:05.414: Negative content width -6 (allocation 1, extents 4x3) while allocating gadget (node toolbar, owner GtkToolbar)

(SWT:1687): Gtk-WARNING **: 22:31:07.036: Negative content height -1 (allocation 1, extents 1x1) while allocating gadget (node scrolledwindow, owner GtkScrolledWindow)

(SWT:1687): Gtk-CRITICAL **: 22:31:07.036: gtk_box_gadget_distribute: assertion 'size >= 0' failed in GtkScrollbar
Tests run: 2, Failures: 0, Errors: 0, Skipped: 0, Time elapsed: 3.188 s - in org.eclipse.egit.ui.gitflow.FeatureRebaseHandlerTest
testRebaseFailOnConflict(org.eclipse.egit.ui.gitflow.FeatureRebaseHandlerTest)  Time elapsed: 1.508 s
testRebaseFailOnDirtyWorkingDirectory(org.eclipse.egit.ui.gitflow.FeatureRebaseHandlerTest)  Time elapsed: 1.666 s
Running org.eclipse.egit.ui.gitflow.FeatureStartCheckoutConflictTest

(SWT:1687): Gtk-CRITICAL **: 22:31:07.960: gtk_box_gadget_distribute: assertion 'size >= 0' failed in GtkScrollbar

(SWT:1687): Gtk-CRITICAL **: 22:31:07.977: gtk_box_gadget_distribute: assertion 'size >= 0' failed in GtkScrollbar
Tests run: 1, Failures: 0, Errors: 0, Skipped: 0, Time elapsed: 0.942 s - in org.eclipse.egit.ui.gitflow.FeatureStartCheckoutConflictTest
testFeatureStart(org.eclipse.egit.ui.gitflow.FeatureStartCheckoutConflictTest)  Time elapsed: 0.934 s
Running org.eclipse.egit.ui.gitflow.CommandEnablementTest

(SWT:1687): Gtk-WARNING **: 22:31:09.512: Negative content width -6 (allocation 1, extents 4x3) while allocating gadget (node toolbar, owner GtkToolbar)

(SWT:1687): Gtk-WARNING **: 22:31:09.863: Negative content width -6 (allocation 1, extents 4x3) while allocating gadget (node toolbar, owner GtkToolbar)
Tests run: 2, Failures: 1, Errors: 0, Skipped: 0, Time elapsed: 1.824 s <<< FAILURE! - in org.eclipse.egit.ui.gitflow.CommandEnablementTest
testPackageExplorerStartFinishEnablement(org.eclipse.egit.ui.gitflow.CommandEnablementTest)  Time elapsed: 0.808 s
testRepositoryViewStartFinishEnablement(org.eclipse.egit.ui.gitflow.CommandEnablementTest)  Time elapsed: 1.005 s  <<< FAILURE!
java.lang.AssertionError
	at org.junit.Assert.fail(Assert.java:86)
	at org.junit.Assert.assertTrue(Assert.java:41)
	at org.junit.Assert.assertTrue(Assert.java:52)
	at org.eclipse.egit.ui.gitflow.CommandEnablementTest.assertCommandEnablement(CommandEnablementTest.java:137)
	at org.eclipse.egit.ui.gitflow.CommandEnablementTest.assertAllCommandsDisabled(CommandEnablementTest.java:85)
	at org.eclipse.egit.ui.gitflow.CommandEnablementTest.testRepositoryViewStartFinishEnablement(CommandEnablementTest.java:62)
	at sun.reflect.NativeMethodAccessorImpl.invoke0(Native Method)
	at sun.reflect.NativeMethodAccessorImpl.invoke(NativeMethodAccessorImpl.java:62)
	at sun.reflect.DelegatingMethodAccessorImpl.invoke(DelegatingMethodAccessorImpl.java:43)
	at java.lang.reflect.Method.invoke(Method.java:498)
	at org.junit.runners.model.FrameworkMethod$1.runReflectiveCall(FrameworkMethod.java:50)
	at org.junit.internal.runners.model.ReflectiveCallable.run(ReflectiveCallable.java:12)
	at org.junit.runners.model.FrameworkMethod.invokeExplosively(FrameworkMethod.java:47)
	at org.eclipse.swtbot.swt.finder.junit.internal.CapturingFrameworkMethod.invokeExplosively(CapturingFrameworkMethod.java:47)
	at org.junit.internal.runners.statements.InvokeMethod.evaluate(InvokeMethod.java:17)
	at org.junit.internal.runners.statements.RunBefores.evaluate(RunBefores.java:26)
	at org.junit.internal.runners.statements.RunAfters.evaluate(RunAfters.java:27)
	at org.junit.rules.TestWatcher$1.evaluate(TestWatcher.java:55)
	at org.junit.rules.RunRules.evaluate(RunRules.java:20)
	at org.junit.runners.ParentRunner.runLeaf(ParentRunner.java:325)
	at org.eclipse.swtbot.swt.finder.junit.SWTBotJunit4ClassRunner.runChild(SWTBotJunit4ClassRunner.java:75)
	at org.junit.runners.BlockJUnit4ClassRunner.runChild(BlockJUnit4ClassRunner.java:57)
	at org.junit.runners.ParentRunner$3.run(ParentRunner.java:290)
	at org.junit.runners.ParentRunner$1.schedule(ParentRunner.java:71)
	at org.junit.runners.ParentRunner.runChildren(ParentRunner.java:288)
	at org.junit.runners.ParentRunner.access$000(ParentRunner.java:58)
	at org.junit.runners.ParentRunner$2.evaluate(ParentRunner.java:268)
	at org.junit.internal.runners.statements.RunBefores.evaluate(RunBefores.java:26)
	at org.junit.internal.runners.statements.RunAfters.evaluate(RunAfters.java:27)
	at org.junit.runners.ParentRunner.run(ParentRunner.java:363)
	at org.eclipse.swtbot.swt.finder.junit.SWTBotJunit4ClassRunner.run(SWTBotJunit4ClassRunner.java:60)
	at org.apache.maven.surefire.junit4.JUnit4Provider.execute(JUnit4Provider.java:365)
	at org.apache.maven.surefire.junit4.JUnit4Provider.executeWithRerun(JUnit4Provider.java:273)
	at org.apache.maven.surefire.junit4.JUnit4Provider.executeTestSet(JUnit4Provider.java:238)
	at org.apache.maven.surefire.junit4.JUnit4Provider.invoke(JUnit4Provider.java:159)
	at sun.reflect.NativeMethodAccessorImpl.invoke0(Native Method)
	at sun.reflect.NativeMethodAccessorImpl.invoke(NativeMethodAccessorImpl.java:62)
	at sun.reflect.DelegatingMethodAccessorImpl.invoke(DelegatingMethodAccessorImpl.java:43)
	at java.lang.reflect.Method.invoke(Method.java:498)
	at org.apache.maven.surefire.util.ReflectionUtils.invokeMethodWithArray2(ReflectionUtils.java:206)
	at org.apache.maven.surefire.booter.ProviderFactory$ProviderProxy.invoke(ProviderFactory.java:161)
	at org.apache.maven.surefire.booter.ProviderFactory.invokeProvider(ProviderFactory.java:84)
	at org.eclipse.tycho.surefire.osgibooter.OsgiSurefireBooter.run(OsgiSurefireBooter.java:113)
	at org.eclipse.tycho.surefire.osgibooter.AbstractUITestApplication.runTests(AbstractUITestApplication.java:44)
	at org.eclipse.e4.ui.internal.workbench.swt.E4Testable$1.run(E4Testable.java:73)
	at java.lang.Thread.run(Thread.java:748)

Running org.eclipse.egit.ui.gitflow.FeatureFinishKeepBranchHandlerTest

(SWT:1687): Gtk-CRITICAL **: 22:31:10.807: gtk_box_gadget_distribute: assertion 'size >= 0' failed in GtkScrollbar

(SWT:1687): Gtk-CRITICAL **: 22:31:10.829: gtk_box_gadget_distribute: assertion 'size >= 0' failed in GtkScrollbar

(SWT:1687): Gtk-CRITICAL **: 22:31:10.843: gtk_box_gadget_distribute: assertion 'size >= 0' failed in GtkScrollbar

(SWT:1687): Gtk-CRITICAL **: 22:31:10.859: gtk_box_gadget_distribute: assertion 'size >= 0' failed in GtkScrollbar

(SWT:1687): Gtk-CRITICAL **: 22:31:10.875: gtk_box_gadget_distribute: assertion 'size >= 0' failed in GtkScrollbar

(SWT:1687): Gtk-CRITICAL **: 22:31:10.892: gtk_box_gadget_distribute: assertion 'size >= 0' failed in GtkScrollbar

(SWT:1687): Gtk-CRITICAL **: 22:31:10.909: gtk_box_gadget_distribute: assertion 'size >= 0' failed in GtkScrollbar

(SWT:1687): Gtk-CRITICAL **: 22:31:10.927: gtk_box_gadget_distribute: assertion 'size >= 0' failed in GtkScrollbar

(SWT:1687): Gtk-CRITICAL **: 22:31:10.943: gtk_box_gadget_distribute: assertion 'size >= 0' failed in GtkScrollbar

(SWT:1687): Gtk-CRITICAL **: 22:31:10.959: gtk_box_gadget_distribute: assertion 'size >= 0' failed in GtkScrollbar

(SWT:1687): Gtk-CRITICAL **: 22:31:10.975: gtk_box_gadget_distribute: assertion 'size >= 0' failed in GtkScrollbar

(SWT:1687): Gtk-CRITICAL **: 22:31:10.992: gtk_box_gadget_distribute: assertion 'size >= 0' failed in GtkScrollbar

(SWT:1687): Gtk-CRITICAL **: 22:31:11.009: gtk_box_gadget_distribute: assertion 'size >= 0' failed in GtkScrollbar

(SWT:1687): Gtk-CRITICAL **: 22:31:11.026: gtk_box_gadget_distribute: assertion 'size >= 0' failed in GtkScrollbar

(SWT:1687): Gtk-CRITICAL **: 22:31:11.042: gtk_box_gadget_distribute: assertion 'size >= 0' failed in GtkScrollbar

(SWT:1687): Gtk-CRITICAL **: 22:31:11.059: gtk_box_gadget_distribute: assertion 'size >= 0' failed in GtkScrollbar

(SWT:1687): Gtk-CRITICAL **: 22:31:11.583: gtk_box_gadget_distribute: assertion 'size >= 0' failed in GtkScrollbar
Tests run: 1, Failures: 0, Errors: 0, Skipped: 0, Time elapsed: 2.289 s - in org.eclipse.egit.ui.gitflow.FeatureFinishKeepBranchHandlerTest
testFeatureFinishKeepBranch(org.eclipse.egit.ui.gitflow.FeatureFinishKeepBranchHandlerTest)  Time elapsed: 2.281 s
Running org.eclipse.egit.ui.wizards.share.SharingWizardTest

(SWT:1687): Gtk-CRITICAL **: 22:31:12.344: gtk_box_gadget_distribute: assertion 'size >= 0' failed in GtkScrollbar

(SWT:1687): Gtk-WARNING **: 22:31:12.345: Negative content width -13 (allocation 5, extents 9x9) while allocating gadget (node entry, owner GtkEntry)

(SWT:1687): Gtk-WARNING **: 22:31:12.345: Negative content height -1 (allocation 1, extents 1x1) while allocating gadget (node scrolledwindow, owner GtkScrolledWindow)

(SWT:1687): Gtk-CRITICAL **: 22:31:12.345: gtk_box_gadget_distribute: assertion 'size >= 0' failed in GtkScrollbar

(SWT:1687): Gtk-CRITICAL **: 22:31:12.345: gtk_box_gadget_distribute: assertion 'size >= 0' failed in GtkScrollbar

(SWT:1687): Gtk-CRITICAL **: 22:31:12.974: gtk_box_gadget_distribute: assertion 'size >= 0' failed in GtkScrollbar

(SWT:1687): Gtk-WARNING **: 22:31:12.977: Negative content width -13 (allocation 5, extents 9x9) while allocating gadget (node entry, owner GtkEntry)

(SWT:1687): Gtk-WARNING **: 22:31:12.977: Negative content height -1 (allocation 1, extents 1x1) while allocating gadget (node scrolledwindow, owner GtkScrolledWindow)

(SWT:1687): Gtk-CRITICAL **: 22:31:12.978: gtk_box_gadget_distribute: assertion 'size >= 0' failed in GtkScrollbar

(SWT:1687): Gtk-CRITICAL **: 22:31:12.978: gtk_box_gadget_distribute: assertion 'size >= 0' failed in GtkScrollbar

(SWT:1687): Gtk-CRITICAL **: 22:31:13.651: gtk_box_gadget_distribute: assertion 'size >= 0' failed in GtkScrollbar

(SWT:1687): Gtk-WARNING **: 22:31:13.651: Negative content width -13 (allocation 5, extents 9x9) while allocating gadget (node entry, owner GtkEntry)

(SWT:1687): Gtk-WARNING **: 22:31:13.652: Negative content height -1 (allocation 1, extents 1x1) while allocating gadget (node scrolledwindow, owner GtkScrolledWindow)

(SWT:1687): Gtk-CRITICAL **: 22:31:13.652: gtk_box_gadget_distribute: assertion 'size >= 0' failed in GtkScrollbar

(SWT:1687): Gtk-CRITICAL **: 22:31:13.652: gtk_box_gadget_distribute: assertion 'size >= 0' failed in GtkScrollbar

(SWT:1687): Gtk-CRITICAL **: 22:31:14.260: gtk_box_gadget_distribute: assertion 'size >= 0' failed in GtkScrollbar

(SWT:1687): Gtk-WARNING **: 22:31:14.261: Negative content width -13 (allocation 5, extents 9x9) while allocating gadget (node entry, owner GtkEntry)

(SWT:1687): Gtk-WARNING **: 22:31:14.261: Negative content height -1 (allocation 1, extents 1x1) while allocating gadget (node scrolledwindow, owner GtkScrolledWindow)

(SWT:1687): Gtk-CRITICAL **: 22:31:14.262: gtk_box_gadget_distribute: assertion 'size >= 0' failed in GtkScrollbar

(SWT:1687): Gtk-CRITICAL **: 22:31:14.262: gtk_box_gadget_distribute: assertion 'size >= 0' failed in GtkScrollbar

(SWT:1687): Gtk-CRITICAL **: 22:31:15.860: gtk_box_gadget_distribute: assertion 'size >= 0' failed in GtkScrollbar

(SWT:1687): Gtk-WARNING **: 22:31:15.861: Negative content width -13 (allocation 5, extents 9x9) while allocating gadget (node entry, owner GtkEntry)

(SWT:1687): Gtk-WARNING **: 22:31:15.861: Negative content height -1 (allocation 1, extents 1x1) while allocating gadget (node scrolledwindow, owner GtkScrolledWindow)

(SWT:1687): Gtk-CRITICAL **: 22:31:15.861: gtk_box_gadget_distribute: assertion 'size >= 0' failed in GtkScrollbar

(SWT:1687): Gtk-CRITICAL **: 22:31:15.861: gtk_box_gadget_distribute: assertion 'size >= 0' failed in GtkScrollbar

(SWT:1687): Gtk-CRITICAL **: 22:31:16.470: gtk_box_gadget_distribute: assertion 'size >= 0' failed in GtkScrollbar

(SWT:1687): Gtk-WARNING **: 22:31:16.471: Negative content width -13 (allocation 5, extents 9x9) while allocating gadget (node entry, owner GtkEntry)

(SWT:1687): Gtk-WARNING **: 22:31:16.471: Negative content height -1 (allocation 1, extents 1x1) while allocating gadget (node scrolledwindow, owner GtkScrolledWindow)

(SWT:1687): Gtk-CRITICAL **: 22:31:16.472: gtk_box_gadget_distribute: assertion 'size >= 0' failed in GtkScrollbar

(SWT:1687): Gtk-CRITICAL **: 22:31:16.472: gtk_box_gadget_distribute: assertion 'size >= 0' failed in GtkScrollbar

(SWT:1687): Gtk-CRITICAL **: 22:31:17.102: gtk_box_gadget_distribute: assertion 'size >= 0' failed in GtkScrollbar

(SWT:1687): Gtk-WARNING **: 22:31:17.103: Negative content width -13 (allocation 5, extents 9x9) while allocating gadget (node entry, owner GtkEntry)

(SWT:1687): Gtk-WARNING **: 22:31:17.103: Negative content height -1 (allocation 1, extents 1x1) while allocating gadget (node scrolledwindow, owner GtkScrolledWindow)

(SWT:1687): Gtk-CRITICAL **: 22:31:17.103: gtk_box_gadget_distribute: assertion 'size >= 0' failed in GtkScrollbar

(SWT:1687): Gtk-CRITICAL **: 22:31:17.103: gtk_box_gadget_distribute: assertion 'size >= 0' failed in GtkScrollbar

(SWT:1687): Gtk-CRITICAL **: 22:31:18.669: gtk_box_gadget_distribute: assertion 'size >= 0' failed in GtkScrollbar

(SWT:1687): Gtk-WARNING **: 22:31:18.670: Negative content width -13 (allocation 5, extents 9x9) while allocating gadget (node entry, owner GtkEntry)

(SWT:1687): Gtk-WARNING **: 22:31:18.671: Negative content height -1 (allocation 1, extents 1x1) while allocating gadget (node scrolledwindow, owner GtkScrolledWindow)

(SWT:1687): Gtk-CRITICAL **: 22:31:18.671: gtk_box_gadget_distribute: assertion 'size >= 0' failed in GtkScrollbar

(SWT:1687): Gtk-CRITICAL **: 22:31:18.671: gtk_box_gadget_distribute: assertion 'size >= 0' failed in GtkScrollbar
Tests run: 3, Failures: 0, Errors: 0, Skipped: 0, Time elapsed: 7.894 s - in org.eclipse.egit.ui.wizards.share.SharingWizardTest
shareProjectWithExternalRepo(org.eclipse.egit.ui.wizards.share.SharingWizardTest)  Time elapsed: 3.533 s
shareProjectWithAlreadyCreatedRepos(org.eclipse.egit.ui.wizards.share.SharingWizardTest)  Time elapsed: 2.809 s
shareProjectAndCreateRepo(org.eclipse.egit.ui.wizards.share.SharingWizardTest)  Time elapsed: 1.544 s
Running org.eclipse.egit.ui.wizards.clone.GitCloneSourceProviderExtensionTest
Tests run: 1, Failures: 0, Errors: 0, Skipped: 0, Time elapsed: 0.003 s - in org.eclipse.egit.ui.wizards.clone.GitCloneSourceProviderExtensionTest
testGetRepositoryImports(org.eclipse.egit.ui.wizards.clone.GitCloneSourceProviderExtensionTest)  Time elapsed: 0.002 s
Running org.eclipse.egit.ui.wizards.clone.GitCloneWizardHttpTest
2019-12-05 22:31:20.495:INFO::WorkbenchTestable: Logging initialized @890215ms to org.eclipse.jetty.util.log.StdErrLog
2019-12-05 22:31:20.610:INFO:oejs.Server:WorkbenchTestable: jetty-9.4.22.v20191022; built: 2019-10-29T10:22:32.053Z; git: b1e6b55512e008f7fbdf1cbea4ff8a6446d1073b; jvm 1.8.0_212-b04
2019-12-05 22:31:20.672:INFO:oejsh.ContextHandler:WorkbenchTestable: Started o.e.j.s.ServletContextHandler@5acc89bc{/sbasic,null,AVAILABLE}
2019-12-05 22:31:20.739:INFO:oejs.AbstractConnector:WorkbenchTestable: Started ServerConnector@6a36f120{HTTP/1.1,[http/1.1]}{127.0.0.1:35275}
2019-12-05 22:31:20.740:INFO:oejs.Server:WorkbenchTestable: Started @890460ms
2019-12-05 22:31:21.556:INFO:oeju.TypeUtil:qtp760694701-987: JVM Runtime does not support Modules
2019-12-05 22:31:23.223:INFO:oejs.AbstractConnector:WorkbenchTestable: Stopped ServerConnector@6a36f120{HTTP/1.1,[http/1.1]}{127.0.0.1:0}
2019-12-05 22:31:23.233:INFO:oejsh.ContextHandler:WorkbenchTestable: Stopped o.e.j.s.ServletContextHandler@5acc89bc{/sbasic,null,UNAVAILABLE}
Tests run: 1, Failures: 0, Errors: 0, Skipped: 0, Time elapsed: 3.069 s - in org.eclipse.egit.ui.wizards.clone.GitCloneWizardHttpTest
canCloneARemoteRepo(org.eclipse.egit.ui.wizards.clone.GitCloneWizardHttpTest)  Time elapsed: 2.478 s
Running org.eclipse.egit.ui.wizards.clone.GitCloneWizardHttpsTest
2019-12-05 22:31:24.417:INFO:oejs.Server:WorkbenchTestable: jetty-9.4.22.v20191022; built: 2019-10-29T10:22:32.053Z; git: b1e6b55512e008f7fbdf1cbea4ff8a6446d1073b; jvm 1.8.0_212-b04
2019-12-05 22:31:24.422:INFO:oejsh.ContextHandler:WorkbenchTestable: Started o.e.j.s.ServletContextHandler@6175fa5a{/sbasic,null,AVAILABLE}
2019-12-05 22:31:24.427:INFO:oejs.AbstractConnector:WorkbenchTestable: Started ServerConnector@3a96df63{HTTP/1.1,[http/1.1]}{127.0.0.1:42708}
2019-12-05 22:31:24.432:INFO:oejus.SslContextFactory:WorkbenchTestable: x509=X509@3815d27a(migration-agent-vvcqt,h=[],w=[]) for Client@6e0ba839[provider=null,keyStore=file:///tmp/jks4121139580586712371/keystore.jks,trustStore=file:///tmp/jks4121139580586712371/keystore.jks]
2019-12-05 22:31:24.455:WARN:oejusS.config:WorkbenchTestable: Trusting all certificates configured for Client@6e0ba839[provider=null,keyStore=file:///tmp/jks4121139580586712371/keystore.jks,trustStore=file:///tmp/jks4121139580586712371/keystore.jks]
2019-12-05 22:31:24.455:WARN:oejusS.config:WorkbenchTestable: No Client EndPointIdentificationAlgorithm configured for Client@6e0ba839[provider=null,keyStore=file:///tmp/jks4121139580586712371/keystore.jks,trustStore=file:///tmp/jks4121139580586712371/keystore.jks]
2019-12-05 22:31:24.461:INFO:oejs.AbstractConnector:WorkbenchTestable: Started ServerConnector@67d0414f{SSL,[ssl, http/1.1]}{127.0.0.1:39128}
2019-12-05 22:31:24.462:INFO:oejs.Server:WorkbenchTestable: Started @894181ms
2019-12-05 22:31:26.983:INFO:oejs.AbstractConnector:WorkbenchTestable: Stopped ServerConnector@3a96df63{HTTP/1.1,[http/1.1]}{127.0.0.1:0}
2019-12-05 22:31:26.984:INFO:oejs.AbstractConnector:WorkbenchTestable: Stopped ServerConnector@67d0414f{SSL,[ssl, http/1.1]}{127.0.0.1:0}
2019-12-05 22:31:26.991:INFO:oejsh.ContextHandler:WorkbenchTestable: Stopped o.e.j.s.ServletContextHandler@6175fa5a{/sbasic,null,UNAVAILABLE}
Tests run: 1, Failures: 0, Errors: 0, Skipped: 0, Time elapsed: 3.738 s - in org.eclipse.egit.ui.wizards.clone.GitCloneWizardHttpsTest
canCloneARemoteRepo(org.eclipse.egit.ui.wizards.clone.GitCloneWizardHttpsTest)  Time elapsed: 2.52 s
Running org.eclipse.egit.ui.wizards.clone.GitCloneWizardTest
Tests run: 9, Failures: 0, Errors: 0, Skipped: 2, Time elapsed: 6.74 s - in org.eclipse.egit.ui.wizards.clone.GitCloneWizardTest
canCloneARemoteRepo(org.eclipse.egit.ui.wizards.clone.GitCloneWizardTest)  Time elapsed: 1.891 s
invalidPortFreezesDialog(org.eclipse.egit.ui.wizards.clone.GitCloneWizardTest) skipped
updatesParameterFieldsInImportDialogWhenURIIsUpdated(org.eclipse.egit.ui.wizards.clone.GitCloneWizardTest)  Time elapsed: 0.941 s
clonedRepositoryShouldExistOnFileSystem(org.eclipse.egit.ui.wizards.clone.GitCloneWizardTest)  Time elapsed: 1.108 s
alteringSomeParametersDuringClone(org.eclipse.egit.ui.wizards.clone.GitCloneWizardTest)  Time elapsed: 1.308 s
gitStyleUriSelectsSshProtocol(org.eclipse.egit.ui.wizards.clone.GitCloneWizardTest)  Time elapsed: 0.356 s
invalidHostnameFreezesDialog(org.eclipse.egit.ui.wizards.clone.GitCloneWizardTest) skipped
acceptCloneCommandAsURI(org.eclipse.egit.ui.wizards.clone.GitCloneWizardTest)  Time elapsed: 0.43 s
testFileURIWithSpace(org.eclipse.egit.ui.wizards.clone.GitCloneWizardTest)  Time elapsed: 0.362 s
Running org.eclipse.egit.ui.wizards.pull.PullWizardTest

(SWT:1687): Gtk-WARNING **: 22:31:34.611: Negative content width -6 (allocation 1, extents 4x3) while allocating gadget (node toolbar, owner GtkToolbar)

(SWT:1687): Gtk-WARNING **: 22:31:36.237: Negative content width -6 (allocation 1, extents 4x3) while allocating gadget (node toolbar, owner GtkToolbar)
Tests run: 1, Failures: 0, Errors: 0, Skipped: 0, Time elapsed: 2.601 s - in org.eclipse.egit.ui.wizards.pull.PullWizardTest
pullFromProjectRepo(org.eclipse.egit.ui.wizards.pull.PullWizardTest)  Time elapsed: 2.594 s
Running org.eclipse.egit.ui.search.CommitSearchQueryTest
Tests run: 7, Failures: 0, Errors: 0, Skipped: 0, Time elapsed: 4.155 s - in org.eclipse.egit.ui.search.CommitSearchQueryTest
testQuery(org.eclipse.egit.ui.search.CommitSearchQueryTest)  Time elapsed: 0.596 s
testMatchMessage(org.eclipse.egit.ui.search.CommitSearchQueryTest)  Time elapsed: 0.561 s
testCaseInsensitive(org.eclipse.egit.ui.search.CommitSearchQueryTest)  Time elapsed: 0.599 s
testMatchCommit(org.eclipse.egit.ui.search.CommitSearchQueryTest)  Time elapsed: 0.574 s
testMatchParent(org.eclipse.egit.ui.search.CommitSearchQueryTest)  Time elapsed: 0.567 s
testMatchTree(org.eclipse.egit.ui.search.CommitSearchQueryTest)  Time elapsed: 0.582 s
testEmptyMatches(org.eclipse.egit.ui.search.CommitSearchQueryTest)  Time elapsed: 0.579 s
Running org.eclipse.egit.ui.search.CommitSearchDialogTest

(SWT:1687): Gtk-WARNING **: 22:31:41.345: Negative content width -6 (allocation 1, extents 4x3) while allocating gadget (node toolbar, owner GtkToolbar)

(SWT:1687): Gtk-WARNING **: 22:31:41.365: Negative content width -6 (allocation 1, extents 4x3) while allocating gadget (node toolbar, owner GtkToolbar)

(SWT:1687): Gtk-WARNING **: 22:31:41.455: Negative content width -6 (allocation 1, extents 4x3) while allocating gadget (node toolbar, owner GtkToolbar)

(SWT:1687): Gtk-WARNING **: 22:31:41.506: Negative content width -6 (allocation 1, extents 4x3) while allocating gadget (node toolbar, owner GtkToolbar)

(SWT:1687): Gtk-WARNING **: 22:31:42.194: Negative content width -6 (allocation 1, extents 4x3) while allocating gadget (node toolbar, owner GtkToolbar)
Tests run: 1, Failures: 0, Errors: 0, Skipped: 0, Time elapsed: 1.776 s - in org.eclipse.egit.ui.search.CommitSearchDialogTest
openCommitTabOnSearchDialog(org.eclipse.egit.ui.search.CommitSearchDialogTest)  Time elapsed: 1.771 s
Running org.eclipse.egit.ui.prefpages.configuration.GlobalConfigurationPageTest

!ENTRY org.eclipse.ui 2 2 2019-12-05 22:31:42.346
!MESSAGE Invalid preference category path: org.eclipse.ui.net.NetPreferences (bundle: org.eclipse.jsch.ui, page: org.eclipse.jsch.ui.SSHPreferences)

(SWT:1687): Gtk-WARNING **: 22:31:42.361: Negative content width -13 (allocation 5, extents 9x9) while allocating gadget (node entry, owner GtkEntry)

(SWT:1687): Gtk-WARNING **: 22:31:42.553: Negative content width -13 (allocation 5, extents 9x9) while allocating gadget (node entry, owner GtkEntry)

(SWT:1687): Gtk-WARNING **: 22:31:42.747: Negative content width -13 (allocation 5, extents 9x9) while allocating gadget (node entry, owner GtkEntry)

(SWT:1687): Gtk-WARNING **: 22:31:42.923: Negative content width -13 (allocation 5, extents 9x9) while allocating gadget (node entry, owner GtkEntry)

(SWT:1687): Gtk-WARNING **: 22:31:43.038: Negative content width -13 (allocation 5, extents 9x9) while allocating gadget (node entry, owner GtkEntry)

(SWT:1687): Gtk-WARNING **: 22:31:43.162: Negative content width -13 (allocation 5, extents 9x9) while allocating gadget (node entry, owner GtkEntry)

(SWT:1687): Gtk-WARNING **: 22:31:43.320: Negative content width -13 (allocation 5, extents 9x9) while allocating gadget (node entry, owner GtkEntry)

(SWT:1687): Gtk-WARNING **: 22:31:43.392: Negative content width -6 (allocation 1, extents 4x3) while allocating gadget (node toolbar, owner GtkToolbar)

(SWT:1687): Gtk-WARNING **: 22:31:43.392: Negative content height -3 (allocation 1, extents 2x2) while allocating gadget (node toolbar, owner GtkToolbar)

(SWT:1687): Gtk-WARNING **: 22:31:43.392: Negative content width -6 (allocation 1, extents 4x3) while allocating gadget (node toolbar, owner GtkToolbar)

(SWT:1687): Gtk-WARNING **: 22:31:43.393: Negative content height -3 (allocation 1, extents 2x2) while allocating gadget (node toolbar, owner GtkToolbar)

(SWT:1687): Gtk-WARNING **: 22:31:43.624: Negative content width -13 (allocation 5, extents 9x9) while allocating gadget (node entry, owner GtkEntry)

(SWT:1687): Gtk-WARNING **: 22:31:43.819: Negative content width -13 (allocation 5, extents 9x9) while allocating gadget (node entry, owner GtkEntry)

(SWT:1687): Gtk-WARNING **: 22:31:44.029: Negative content width -13 (allocation 5, extents 9x9) while allocating gadget (node entry, owner GtkEntry)

(SWT:1687): Gtk-WARNING **: 22:31:44.185: Negative content width -13 (allocation 5, extents 9x9) while allocating gadget (node entry, owner GtkEntry)

(SWT:1687): Gtk-WARNING **: 22:31:44.368: Negative content width -13 (allocation 5, extents 9x9) while allocating gadget (node entry, owner GtkEntry)
Tests run: 11, Failures: 0, Errors: 0, Skipped: 0, Time elapsed: 2.22 s - in org.eclipse.egit.ui.prefpages.configuration.GlobalConfigurationPageTest
testAddSubSectionEntry(org.eclipse.egit.ui.prefpages.configuration.GlobalConfigurationPageTest)  Time elapsed: 0.23 s
testAddSectionEntry(org.eclipse.egit.ui.prefpages.configuration.GlobalConfigurationPageTest)  Time elapsed: 0.192 s
testCanCreateSameEntryValue(org.eclipse.egit.ui.prefpages.configuration.GlobalConfigurationPageTest)  Time elapsed: 0.178 s
testNodes(org.eclipse.egit.ui.prefpages.configuration.GlobalConfigurationPageTest)  Time elapsed: 0.113 s
testRemoveValue(org.eclipse.egit.ui.prefpages.configuration.GlobalConfigurationPageTest)  Time elapsed: 0.126 s
testAddSubSectionEntryWithSuggestion(org.eclipse.egit.ui.prefpages.configuration.GlobalConfigurationPageTest)  Time elapsed: 0.158 s
testOpenEditor(org.eclipse.egit.ui.prefpages.configuration.GlobalConfigurationPageTest)  Time elapsed: 0.301 s
testSubsectionWithDot(org.eclipse.egit.ui.prefpages.configuration.GlobalConfigurationPageTest)  Time elapsed: 0.198 s
testChecksForKey(org.eclipse.egit.ui.prefpages.configuration.GlobalConfigurationPageTest)  Time elapsed: 0.21 s
testRemoveSubSection(org.eclipse.egit.ui.prefpages.configuration.GlobalConfigurationPageTest)  Time elapsed: 0.156 s
testRemoveSection(org.eclipse.egit.ui.prefpages.configuration.GlobalConfigurationPageTest)  Time elapsed: 0.182 s
Running org.eclipse.egit.ui.submodule.SubmoduleUpdateTest

(SWT:1687): Gtk-WARNING **: 22:31:45.291: Negative content width -6 (allocation 1, extents 4x3) while allocating gadget (node toolbar, owner GtkToolbar)

(SWT:1687): Gtk-WARNING **: 22:31:48.212: Negative content width -6 (allocation 1, extents 4x3) while allocating gadget (node toolbar, owner GtkToolbar)
Tests run: 1, Failures: 0, Errors: 0, Skipped: 0, Time elapsed: 3.782 s - in org.eclipse.egit.ui.submodule.SubmoduleUpdateTest
updateSubmodule(org.eclipse.egit.ui.submodule.SubmoduleUpdateTest)  Time elapsed: 3.774 s
Running org.eclipse.egit.ui.submodule.SubmoduleSyncTest

(SWT:1687): Gtk-WARNING **: 22:31:49.067: Negative content width -6 (allocation 1, extents 4x3) while allocating gadget (node toolbar, owner GtkToolbar)

(SWT:1687): Gtk-WARNING **: 22:31:51.570: Negative content width -6 (allocation 1, extents 4x3) while allocating gadget (node toolbar, owner GtkToolbar)
Tests run: 1, Failures: 0, Errors: 0, Skipped: 0, Time elapsed: 3.351 s - in org.eclipse.egit.ui.submodule.SubmoduleSyncTest
syncSubmodule(org.eclipse.egit.ui.submodule.SubmoduleSyncTest)  Time elapsed: 3.344 s
Running org.eclipse.egit.ui.submodule.SubmoduleAddTest

(SWT:1687): Gtk-WARNING **: 22:31:52.427: Negative content width -6 (allocation 1, extents 4x3) while allocating gadget (node toolbar, owner GtkToolbar)

(SWT:1687): Gtk-WARNING **: 22:31:55.023: Negative content width -6 (allocation 1, extents 4x3) while allocating gadget (node toolbar, owner GtkToolbar)
Tests run: 1, Failures: 0, Errors: 0, Skipped: 0, Time elapsed: 3.471 s - in org.eclipse.egit.ui.submodule.SubmoduleAddTest
addAtRoot(org.eclipse.egit.ui.submodule.SubmoduleAddTest)  Time elapsed: 3.464 s
Running org.eclipse.egit.ui.httpauth.PushTest
2019-12-05 22:31:55.248:INFO:oejs.Server:WorkbenchTestable: jetty-9.4.22.v20191022; built: 2019-10-29T10:22:32.053Z; git: b1e6b55512e008f7fbdf1cbea4ff8a6446d1073b; jvm 1.8.0_212-b04
2019-12-05 22:31:55.250:INFO:oejsh.ContextHandler:WorkbenchTestable: Started o.e.j.s.ServletContextHandler@3a21b236{/sbasic,null,AVAILABLE}
2019-12-05 22:31:55.256:INFO:oejs.AbstractConnector:WorkbenchTestable: Started ServerConnector@6d5526c3{HTTP/1.1,[http/1.1]}{127.0.0.1:40354}
2019-12-05 22:31:55.256:INFO:oejs.Server:WorkbenchTestable: Started @924975ms

(SWT:1687): Gtk-CRITICAL **: 22:31:56.179: gtk_box_gadget_distribute: assertion 'size >= 0' failed in GtkCheckButton

(SWT:1687): Gtk-WARNING **: 22:31:56.575: Negative content width -1 (allocation 1, extents 1x1) while allocating gadget (node trough, owner GtkProgressBar)

(SWT:1687): Gtk-WARNING **: 22:31:56.582: Negative content width -1 (allocation 1, extents 1x1) while allocating gadget (node trough, owner GtkProgressBar)

(SWT:1687): Gtk-WARNING **: 22:31:56.588: Negative content width -1 (allocation 1, extents 1x1) while allocating gadget (node trough, owner GtkProgressBar)
2019-12-05 22:31:57.143:INFO:oejs.AbstractConnector:WorkbenchTestable: Stopped ServerConnector@6d5526c3{HTTP/1.1,[http/1.1]}{127.0.0.1:0}
2019-12-05 22:31:57.148:INFO:oejsh.ContextHandler:WorkbenchTestable: Stopped o.e.j.s.ServletContextHandler@3a21b236{/sbasic,null,UNAVAILABLE}
Tests run: 1, Failures: 0, Errors: 0, Skipped: 0, Time elapsed: 1.996 s - in org.eclipse.egit.ui.httpauth.PushTest
testPush(org.eclipse.egit.ui.httpauth.PushTest)  Time elapsed: 1.995 s
Running org.eclipse.egit.ui.operations.GitScopeUtilTest
Tests run: 5, Failures: 0, Errors: 0, Skipped: 0, Time elapsed: 4.745 s - in org.eclipse.egit.ui.operations.GitScopeUtilTest
relatedChangesWithPrompt(org.eclipse.egit.ui.operations.GitScopeUtilTest)  Time elapsed: 2.343 s
modelProviderWithExtensionFiles(org.eclipse.egit.ui.operations.GitScopeUtilTest)  Time elapsed: 0.581 s
relatedChangesWithInvalidParams(org.eclipse.egit.ui.operations.GitScopeUtilTest)  Time elapsed: 0.602 s
relatedChangesWithNullResources(org.eclipse.egit.ui.operations.GitScopeUtilTest)  Time elapsed: 0.549 s
relatedChangesWithEmptyResources(org.eclipse.egit.ui.operations.GitScopeUtilTest)  Time elapsed: 0.665 s

Results:

Failures: 
  CommandEnablementTest.testRepositoryViewStartFinishEnablement:62->assertAllCommandsDisabled:85->assertCommandEnablement:137

Tests run: 536, Failures: 1, Errors: 0, Skipped: 12


!ENTRY org.eclipse.core.resources 2 10035 2019-12-05 22:32:02.955
!MESSAGE The workspace will exit with unsaved changes in this session.
[INFO] ------------------------------------------------------------------------
[INFO] Reactor Summary for EGit Parent 5.7.0-SNAPSHOT:
[INFO] 
[INFO] EGit Parent ........................................ SUCCESS [ 27.704 s]
[INFO] EGit Target Platform Definition .................... SUCCESS [  1.264 s]
[INFO] Eclipse EGit ....................................... SUCCESS [  9.435 s]
[INFO] Git Team Provider (Core) ........................... SUCCESS [ 24.456 s]
[INFO] Git Team Provider (UI) ............................. SUCCESS [01:08 min]
[INFO] EGit Mylyn UI ...................................... SUCCESS [  8.735 s]
[INFO] Git Team Provider (Documentation) .................. SUCCESS [  6.259 s]
[INFO] Eclipse EGit Feature ............................... SUCCESS [  1.429 s]
[INFO] EGit Mylyn Feature ................................. SUCCESS [  1.313 s]
[INFO] Git Flow ........................................... SUCCESS [  9.180 s]
[INFO] Git Flow UI ........................................ SUCCESS [ 11.101 s]
[INFO] Eclipse EGit Gitflow Feature ....................... SUCCESS [  1.291 s]
[INFO] EGit JUnit Support ................................. SUCCESS [  8.497 s]
[INFO] GitFlow Test Plug-in ............................... SUCCESS [ 34.727 s]
[INFO] Eclipse EGit Source Feature ........................ SUCCESS [  1.382 s]
[INFO] EGit P2 Repository ................................. SUCCESS [ 18.250 s]
[INFO] EGit Core Test Plug-in ............................. SUCCESS [02:50 min]
[INFO] EGit UI Test Plug-in ............................... FAILURE [15:35 min]
[INFO] EGit Mylyn UI Test Plug-in ......................... SKIPPED
[INFO] ------------------------------------------------------------------------
[INFO] BUILD FAILURE
[INFO] ------------------------------------------------------------------------
[INFO] Total time:  25:50 min
[INFO] Finished at: 2019-12-05T22:32:04Z
[INFO] ------------------------------------------------------------------------
[ERROR] Failed to execute goal org.eclipse.tycho:tycho-surefire-plugin:1.5.1:test (default-test) on project org.eclipse.egit.ui.test: There are test failures.
[ERROR] 
[ERROR] Please refer to /home/jenkins/agent/workspace/egit.gerrit/repo/org.eclipse.egit.ui.test/target/surefire-reports for the individual test results.
[ERROR] -> [Help 1]
org.apache.maven.lifecycle.LifecycleExecutionException: Failed to execute goal org.eclipse.tycho:tycho-surefire-plugin:1.5.1:test (default-test) on project org.eclipse.egit.ui.test: There are test failures.

Please refer to /home/jenkins/agent/workspace/egit.gerrit/repo/org.eclipse.egit.ui.test/target/surefire-reports for the individual test results.
    at org.apache.maven.lifecycle.internal.MojoExecutor.execute (MojoExecutor.java:215)
    at org.apache.maven.lifecycle.internal.MojoExecutor.execute (MojoExecutor.java:156)
    at org.apache.maven.lifecycle.internal.MojoExecutor.execute (MojoExecutor.java:148)
    at org.apache.maven.lifecycle.internal.LifecycleModuleBuilder.buildProject (LifecycleModuleBuilder.java:117)
    at org.apache.maven.lifecycle.internal.LifecycleModuleBuilder.buildProject (LifecycleModuleBuilder.java:81)
    at org.apache.maven.lifecycle.internal.builder.singlethreaded.SingleThreadedBuilder.build (SingleThreadedBuilder.java:56)
    at org.apache.maven.lifecycle.internal.LifecycleStarter.execute (LifecycleStarter.java:128)
    at org.apache.maven.DefaultMaven.doExecute (DefaultMaven.java:305)
    at org.apache.maven.DefaultMaven.doExecute (DefaultMaven.java:192)
    at org.apache.maven.DefaultMaven.execute (DefaultMaven.java:105)
    at org.apache.maven.cli.MavenCli.execute (MavenCli.java:956)
    at org.apache.maven.cli.MavenCli.doMain (MavenCli.java:288)
    at org.apache.maven.cli.MavenCli.main (MavenCli.java:192)
    at sun.reflect.NativeMethodAccessorImpl.invoke0 (Native Method)
    at sun.reflect.NativeMethodAccessorImpl.invoke (NativeMethodAccessorImpl.java:62)
    at sun.reflect.DelegatingMethodAccessorImpl.invoke (DelegatingMethodAccessorImpl.java:43)
    at java.lang.reflect.Method.invoke (Method.java:498)
    at org.codehaus.plexus.classworlds.launcher.Launcher.launchEnhanced (Launcher.java:282)
    at org.codehaus.plexus.classworlds.launcher.Launcher.launch (Launcher.java:225)
    at org.codehaus.plexus.classworlds.launcher.Launcher.mainWithExitCode (Launcher.java:406)
    at org.codehaus.plexus.classworlds.launcher.Launcher.main (Launcher.java:347)
Caused by: org.apache.maven.plugin.MojoFailureException: There are test failures.

Please refer to /home/jenkins/agent/workspace/egit.gerrit/repo/org.eclipse.egit.ui.test/target/surefire-reports for the individual test results.
    at org.eclipse.tycho.surefire.TestMojo.runTest (TestMojo.java:1050)
    at org.eclipse.tycho.surefire.TestMojo.execute (TestMojo.java:702)
    at org.apache.maven.plugin.DefaultBuildPluginManager.executeMojo (DefaultBuildPluginManager.java:137)
    at org.apache.maven.lifecycle.internal.MojoExecutor.execute (MojoExecutor.java:210)
    at org.apache.maven.lifecycle.internal.MojoExecutor.execute (MojoExecutor.java:156)
    at org.apache.maven.lifecycle.internal.MojoExecutor.execute (MojoExecutor.java:148)
    at org.apache.maven.lifecycle.internal.LifecycleModuleBuilder.buildProject (LifecycleModuleBuilder.java:117)
    at org.apache.maven.lifecycle.internal.LifecycleModuleBuilder.buildProject (LifecycleModuleBuilder.java:81)
    at org.apache.maven.lifecycle.internal.builder.singlethreaded.SingleThreadedBuilder.build (SingleThreadedBuilder.java:56)
    at org.apache.maven.lifecycle.internal.LifecycleStarter.execute (LifecycleStarter.java:128)
    at org.apache.maven.DefaultMaven.doExecute (DefaultMaven.java:305)
    at org.apache.maven.DefaultMaven.doExecute (DefaultMaven.java:192)
    at org.apache.maven.DefaultMaven.execute (DefaultMaven.java:105)
    at org.apache.maven.cli.MavenCli.execute (MavenCli.java:956)
    at org.apache.maven.cli.MavenCli.doMain (MavenCli.java:288)
    at org.apache.maven.cli.MavenCli.main (MavenCli.java:192)
    at sun.reflect.NativeMethodAccessorImpl.invoke0 (Native Method)
    at sun.reflect.NativeMethodAccessorImpl.invoke (NativeMethodAccessorImpl.java:62)
    at sun.reflect.DelegatingMethodAccessorImpl.invoke (DelegatingMethodAccessorImpl.java:43)
    at java.lang.reflect.Method.invoke (Method.java:498)
    at org.codehaus.plexus.classworlds.launcher.Launcher.launchEnhanced (Launcher.java:282)
    at org.codehaus.plexus.classworlds.launcher.Launcher.launch (Launcher.java:225)
    at org.codehaus.plexus.classworlds.launcher.Launcher.mainWithExitCode (Launcher.java:406)
    at org.codehaus.plexus.classworlds.launcher.Launcher.main (Launcher.java:347)
[ERROR] 
[ERROR] Re-run Maven using the -X switch to enable full debug logging.
[ERROR] 
[ERROR] For more information about the errors and possible solutions, please read the following articles:
[ERROR] [Help 1] http://cwiki.apache.org/confluence/display/MAVEN/MojoFailureException
[ERROR] 
[ERROR] After correcting the problems, you can resume the build with the command
[ERROR]   mvn <args> -rf :org.eclipse.egit.ui.test
[Pipeline] }
[Pipeline] // stage
[Pipeline] stage
[Pipeline] { (Results)
[Pipeline] junit
Recording test results
[Pipeline] archiveArtifacts
Archiving artifacts
[Pipeline] findbugs
[FINDBUGS] Collecting findbugs analysis files...
[FINDBUGS] Searching for all files in /home/jenkins/agent/workspace/egit.gerrit/repo that match the pattern */target/*bugsXml.xml
[FINDBUGS] Parsing 8 files in /home/jenkins/agent/workspace/egit.gerrit/repo
[FINDBUGS] Successfully parsed file /home/jenkins/agent/workspace/egit.gerrit/repo/org.eclipse.egit.core.junit/target/spotbugsXml.xml with 4 unique warnings and 0 duplicates.
[FINDBUGS] Successfully parsed file /home/jenkins/agent/workspace/egit.gerrit/repo/org.eclipse.egit.core.test/target/spotbugsXml.xml with 9 unique warnings and 0 duplicates.
[FINDBUGS] Successfully parsed file /home/jenkins/agent/workspace/egit.gerrit/repo/org.eclipse.egit.core/target/spotbugsXml.xml with 20 unique warnings and 0 duplicates.
[FINDBUGS] Successfully parsed file /home/jenkins/agent/workspace/egit.gerrit/repo/org.eclipse.egit.gitflow.test/target/spotbugsXml.xml with 20 unique warnings and 0 duplicates.
[FINDBUGS] Successfully parsed file /home/jenkins/agent/workspace/egit.gerrit/repo/org.eclipse.egit.gitflow.ui/target/spotbugsXml.xml with 20 unique warnings and 0 duplicates.
[FINDBUGS] Successfully parsed file /home/jenkins/agent/workspace/egit.gerrit/repo/org.eclipse.egit.gitflow/target/spotbugsXml.xml with 22 unique warnings and 0 duplicates.
[FINDBUGS] Successfully parsed file /home/jenkins/agent/workspace/egit.gerrit/repo/org.eclipse.egit.mylyn.ui/target/spotbugsXml.xml with 22 unique warnings and 0 duplicates.
[FINDBUGS] Successfully parsed file /home/jenkins/agent/workspace/egit.gerrit/repo/org.eclipse.egit.ui/target/spotbugsXml.xml with 59 unique warnings and 0 duplicates.
Skipping warnings blame since pipelines do not have an SCM link.%n
[FINDBUGS] Computing warning deltas based on reference build #1024
[Pipeline] dry
[DRY] Collecting duplicate code analysis files...
[DRY] Searching for all files in /home/jenkins/agent/workspace/egit.gerrit/repo that match the pattern **/cpd.xml
[DRY] Parsing 15 files in /home/jenkins/agent/workspace/egit.gerrit/repo
[DRY] Successfully parsed file /home/jenkins/agent/workspace/egit.gerrit/repo/org.eclipse.egit-feature/target/cpd.xml with 0 unique warnings and 0 duplicates.
[DRY] Successfully parsed file /home/jenkins/agent/workspace/egit.gerrit/repo/org.eclipse.egit.core.junit/target/cpd.xml with 0 unique warnings and 0 duplicates.
[DRY] Successfully parsed file /home/jenkins/agent/workspace/egit.gerrit/repo/org.eclipse.egit.core.test/target/cpd.xml with 0 unique warnings and 0 duplicates.
[DRY] Successfully parsed file /home/jenkins/agent/workspace/egit.gerrit/repo/org.eclipse.egit.core/target/cpd.xml with 4 unique warnings and 0 duplicates.
[DRY] Successfully parsed file /home/jenkins/agent/workspace/egit.gerrit/repo/org.eclipse.egit.doc/target/cpd.xml with 4 unique warnings and 0 duplicates.
[DRY] Successfully parsed file /home/jenkins/agent/workspace/egit.gerrit/repo/org.eclipse.egit.gitflow-feature/target/cpd.xml with 4 unique warnings and 0 duplicates.
[DRY] Successfully parsed file /home/jenkins/agent/workspace/egit.gerrit/repo/org.eclipse.egit.gitflow.test/target/cpd.xml with 4 unique warnings and 0 duplicates.
[DRY] Successfully parsed file /home/jenkins/agent/workspace/egit.gerrit/repo/org.eclipse.egit.gitflow.ui/target/cpd.xml with 4 unique warnings and 0 duplicates.
[DRY] Successfully parsed file /home/jenkins/agent/workspace/egit.gerrit/repo/org.eclipse.egit.gitflow/target/cpd.xml with 4 unique warnings and 0 duplicates.
[DRY] Successfully parsed file /home/jenkins/agent/workspace/egit.gerrit/repo/org.eclipse.egit.mylyn-feature/target/cpd.xml with 4 unique warnings and 0 duplicates.
[DRY] Successfully parsed file /home/jenkins/agent/workspace/egit.gerrit/repo/org.eclipse.egit.mylyn.ui/target/cpd.xml with 4 unique warnings and 0 duplicates.
[DRY] Successfully parsed file /home/jenkins/agent/workspace/egit.gerrit/repo/org.eclipse.egit.repository/target/cpd.xml with 4 unique warnings and 0 duplicates.
[DRY] Successfully parsed file /home/jenkins/agent/workspace/egit.gerrit/repo/org.eclipse.egit.source-feature/target/cpd.xml with 4 unique warnings and 0 duplicates.
[DRY] Successfully parsed file /home/jenkins/agent/workspace/egit.gerrit/repo/org.eclipse.egit.ui/target/cpd.xml with 37 unique warnings and 0 duplicates.
[DRY] Successfully parsed file /home/jenkins/agent/workspace/egit.gerrit/repo/org.eclipse.egit/target/cpd.xml with 37 unique warnings and 0 duplicates.
Skipping warnings blame since pipelines do not have an SCM link.%n
[DRY] Computing warning deltas based on reference build #1024
[Pipeline] }
[Pipeline] // stage
[Pipeline] }
[Pipeline] // dir
[Pipeline] }
Terminating xvnc.
[Pipeline] // wrap
[Pipeline] }
[Pipeline] // timeout
[Pipeline] }
[Pipeline] // node
[Pipeline] }
[Pipeline] // timestamps
[Pipeline] End of Pipeline
ERROR: script returned exit code 1
Finished: FAILURE