FailedConsole Output

Skipping 612 KB.. Full Log
on 1, extents 1x1) while allocating gadget (node trough, owner GtkProgressBar)

(SWT:1612): Gtk-WARNING **: 16:47:03.167: Negative content height -1 (allocation 1, extents 1x1) while allocating gadget (node scrolledwindow, owner GtkScrolledWindow)

(SWT:1612): Gtk-WARNING **: 16:47:03.493: Negative content width -6 (allocation 1, extents 4x3) while allocating gadget (node toolbar, owner GtkToolbar)

(SWT:1612): Gtk-WARNING **: 16:47:04.777: Negative content width -6 (allocation 1, extents 4x3) while allocating gadget (node toolbar, owner GtkToolbar)

(SWT:1612): Gtk-WARNING **: 16:47:04.793: Negative content width -1 (allocation 1, extents 1x1) while allocating gadget (node trough, owner GtkProgressBar)

(SWT:1612): Gtk-WARNING **: 16:47:04.797: Negative content height -1 (allocation 1, extents 1x1) while allocating gadget (node scrolledwindow, owner GtkScrolledWindow)

(SWT:1612): Gtk-WARNING **: 16:47:04.810: Negative content height -1 (allocation 1, extents 1x1) while allocating gadget (node scrolledwindow, owner GtkScrolledWindow)

(SWT:1612): Gtk-WARNING **: 16:47:04.902: Negative content width -6 (allocation 1, extents 4x3) while allocating gadget (node toolbar, owner GtkToolbar)

(SWT:1612): Gtk-WARNING **: 16:47:05.485: Negative content width -6 (allocation 1, extents 4x3) while allocating gadget (node toolbar, owner GtkToolbar)

(SWT:1612): Gtk-WARNING **: 16:47:05.527: Negative content width -1 (allocation 1, extents 1x1) while allocating gadget (node trough, owner GtkProgressBar)

(SWT:1612): Gtk-WARNING **: 16:47:05.531: Negative content height -1 (allocation 1, extents 1x1) while allocating gadget (node scrolledwindow, owner GtkScrolledWindow)

(SWT:1612): Gtk-WARNING **: 16:47:05.796: Negative content width -6 (allocation 1, extents 4x3) while allocating gadget (node toolbar, owner GtkToolbar)

(SWT:1612): Gtk-WARNING **: 16:47:07.944: Negative content width -6 (allocation 1, extents 4x3) while allocating gadget (node toolbar, owner GtkToolbar)

(SWT:1612): Gtk-WARNING **: 16:47:08.015: Negative content width -6 (allocation 1, extents 4x3) while allocating gadget (node toolbar, owner GtkToolbar)
Tests run: 6, Failures: 0, Errors: 0, Skipped: 0, Time elapsed: 12.869 s - in org.eclipse.egit.ui.test.team.actions.CompareActionsTest
testCompareWithIndex(org.eclipse.egit.ui.test.team.actions.CompareActionsTest)  Time elapsed: 1.659 s
testCompareWithCommit(org.eclipse.egit.ui.test.team.actions.CompareActionsTest)  Time elapsed: 2.533 s
testCompareWithHead(org.eclipse.egit.ui.test.team.actions.CompareActionsTest)  Time elapsed: 4.137 s
testCompareWithRef(org.eclipse.egit.ui.test.team.actions.CompareActionsTest)  Time elapsed: 2.294 s
testCompareWithPreviousWithMerge(org.eclipse.egit.ui.test.team.actions.CompareActionsTest)  Time elapsed: 0.948 s
testCompareWithPrevious(org.eclipse.egit.ui.test.team.actions.CompareActionsTest)  Time elapsed: 1.278 s
Running org.eclipse.egit.ui.test.team.actions.DisconnectConnectTest

(SWT:1612): Gtk-WARNING **: 16:47:09.638: Negative content height -1 (allocation 1, extents 1x1) while allocating gadget (node scrolledwindow, owner GtkScrolledWindow)
*** BUG ***
In pixman_region32_init_rect: Invalid rectangle passed
Set a breakpoint on '_pixman_log_error' to debug

*** BUG ***
In pixman_region32_init_rect: Invalid rectangle passed
Set a breakpoint on '_pixman_log_error' to debug


(SWT:1612): Gtk-WARNING **: 16:47:09.638: gtk_widget_size_allocate(): attempt to allocate widget with width 6 and height -25

(SWT:1612): Gtk-CRITICAL **: 16:47:09.638: gtk_box_gadget_distribute: assertion 'size >= 0' failed in GtkScrollbar
*** BUG ***
In pixman_region32_init_rect: Invalid rectangle passed
Set a breakpoint on '_pixman_log_error' to debug


(SWT:1612): Gtk-WARNING **: 16:47:11.731: Negative content height -1 (allocation 1, extents 1x1) while allocating gadget (node scrolledwindow, owner GtkScrolledWindow)
*** BUG ***
In pixman_region32_init_rect: Invalid rectangle passed
Set a breakpoint on '_pixman_log_error' to debug

*** BUG ***
In pixman_region32_init_rect: Invalid rectangle passed
Set a breakpoint on '_pixman_log_error' to debug


(SWT:1612): Gtk-WARNING **: 16:47:11.731: gtk_widget_size_allocate(): attempt to allocate widget with width 6 and height -25

(SWT:1612): Gtk-CRITICAL **: 16:47:11.731: gtk_box_gadget_distribute: assertion 'size >= 0' failed in GtkScrollbar
*** BUG ***
In pixman_region32_init_rect: Invalid rectangle passed
Set a breakpoint on '_pixman_log_error' to debug

Tests run: 2, Failures: 0, Errors: 0, Skipped: 0, Time elapsed: 4.299 s - in org.eclipse.egit.ui.test.team.actions.DisconnectConnectTest
testDecorations(org.eclipse.egit.ui.test.team.actions.DisconnectConnectTest)  Time elapsed: 2.404 s
testDisconnectAndReconnect(org.eclipse.egit.ui.test.team.actions.DisconnectConnectTest)  Time elapsed: 1.888 s
Running org.eclipse.egit.ui.test.team.actions.CommitActionTest
Tests run: 7, Failures: 0, Errors: 0, Skipped: 0, Time elapsed: 13.238 s - in org.eclipse.egit.ui.test.team.actions.CommitActionTest
testIncludeUntracked(org.eclipse.egit.ui.test.team.actions.CommitActionTest)  Time elapsed: 1.474 s
testAmend(org.eclipse.egit.ui.test.team.actions.CommitActionTest)  Time elapsed: 2.303 s
testCommitSingleFile(org.eclipse.egit.ui.test.team.actions.CommitActionTest)  Time elapsed: 2.116 s
testSortingByName(org.eclipse.egit.ui.test.team.actions.CommitActionTest)  Time elapsed: 1.575 s
testOpenCommitWithoutChanged(org.eclipse.egit.ui.test.team.actions.CommitActionTest)  Time elapsed: 1.314 s
testAmendWithChangeIdPreferenceOff(org.eclipse.egit.ui.test.team.actions.CommitActionTest)  Time elapsed: 2.248 s
testLaunchedWithAmend(org.eclipse.egit.ui.test.team.actions.CommitActionTest)  Time elapsed: 2.187 s
Running org.eclipse.egit.ui.test.stagview.StagingViewTest

(SWT:1612): Gtk-WARNING **: 16:47:26.185: Negative content width -6 (allocation 1, extents 4x3) while allocating gadget (node toolbar, owner GtkToolbar)

(SWT:1612): Gtk-CRITICAL **: 16:47:26.677: gtk_box_gadget_distribute: assertion 'size >= 0' failed in GtkScrollbar

(SWT:1612): Gtk-CRITICAL **: 16:47:26.690: gtk_box_gadget_distribute: assertion 'size >= 0' failed in GtkScrollbar

(SWT:1612): Gtk-WARNING **: 16:47:26.697: Negative content width -6 (allocation 1, extents 4x3) while allocating gadget (node toolbar, owner GtkToolbar)

(SWT:1612): Gtk-CRITICAL **: 16:47:26.709: gtk_box_gadget_distribute: assertion 'size >= 0' failed in GtkScrollbar

(SWT:1612): Gtk-CRITICAL **: 16:47:26.716: gtk_box_gadget_distribute: assertion 'size >= 0' failed in GtkScrollbar

(SWT:1612): Gtk-CRITICAL **: 16:47:26.718: gtk_box_gadget_distribute: assertion 'size >= 0' failed in GtkScrollbar

(SWT:1612): Gtk-CRITICAL **: 16:47:26.718: gtk_box_gadget_distribute: assertion 'size >= 0' failed in GtkScrollbar

(SWT:1612): Gtk-CRITICAL **: 16:47:26.725: gtk_box_gadget_distribute: assertion 'size >= 0' failed in GtkScrollbar

(SWT:1612): Gtk-CRITICAL **: 16:47:26.726: gtk_box_gadget_distribute: assertion 'size >= 0' failed in GtkScrollbar

(SWT:1612): Gtk-CRITICAL **: 16:47:26.747: gtk_box_gadget_distribute: assertion 'size >= 0' failed in GtkScrollbar

(SWT:1612): Gtk-CRITICAL **: 16:47:26.750: gtk_box_gadget_distribute: assertion 'size >= 0' failed in GtkScrollbar

(SWT:1612): Gtk-CRITICAL **: 16:47:26.750: gtk_box_gadget_distribute: assertion 'size >= 0' failed in GtkScrollbar

(SWT:1612): Gtk-CRITICAL **: 16:47:26.766: gtk_box_gadget_distribute: assertion 'size >= 0' failed in GtkScrollbar

(SWT:1612): Gtk-CRITICAL **: 16:47:26.766: gtk_box_gadget_distribute: assertion 'size >= 0' failed in GtkScrollbar

(SWT:1612): Gtk-CRITICAL **: 16:47:26.783: gtk_box_gadget_distribute: assertion 'size >= 0' failed in GtkScrollbar

(SWT:1612): Gtk-CRITICAL **: 16:47:26.783: gtk_box_gadget_distribute: assertion 'size >= 0' failed in GtkScrollbar

(SWT:1612): Gtk-CRITICAL **: 16:47:26.801: gtk_box_gadget_distribute: assertion 'size >= 0' failed in GtkScrollbar

(SWT:1612): Gtk-CRITICAL **: 16:47:26.801: gtk_box_gadget_distribute: assertion 'size >= 0' failed in GtkScrollbar

(SWT:1612): Gtk-CRITICAL **: 16:47:26.816: gtk_box_gadget_distribute: assertion 'size >= 0' failed in GtkScrollbar

(SWT:1612): Gtk-CRITICAL **: 16:47:26.816: gtk_box_gadget_distribute: assertion 'size >= 0' failed in GtkScrollbar

(SWT:1612): Gtk-CRITICAL **: 16:47:26.833: gtk_box_gadget_distribute: assertion 'size >= 0' failed in GtkScrollbar

(SWT:1612): Gtk-CRITICAL **: 16:47:26.833: gtk_box_gadget_distribute: assertion 'size >= 0' failed in GtkScrollbar

(SWT:1612): Gtk-CRITICAL **: 16:47:26.860: gtk_box_gadget_distribute: assertion 'size >= 0' failed in GtkScrollbar

(SWT:1612): Gtk-CRITICAL **: 16:47:26.860: gtk_box_gadget_distribute: assertion 'size >= 0' failed in GtkScrollbar

(SWT:1612): Gtk-CRITICAL **: 16:47:26.885: gtk_box_gadget_distribute: assertion 'size >= 0' failed in GtkScrollbar

(SWT:1612): Gtk-CRITICAL **: 16:47:26.886: gtk_box_gadget_distribute: assertion 'size >= 0' failed in GtkScrollbar

(SWT:1612): Gtk-CRITICAL **: 16:47:26.901: gtk_box_gadget_distribute: assertion 'size >= 0' failed in GtkScrollbar

(SWT:1612): Gtk-CRITICAL **: 16:47:26.917: gtk_box_gadget_distribute: assertion 'size >= 0' failed in GtkScrollbar

(SWT:1612): Gtk-CRITICAL **: 16:47:26.934: gtk_box_gadget_distribute: assertion 'size >= 0' failed in GtkScrollbar

(SWT:1612): Gtk-CRITICAL **: 16:47:26.948: gtk_box_gadget_distribute: assertion 'size >= 0' failed in GtkScrollbar

(SWT:1612): Gtk-CRITICAL **: 16:47:26.948: gtk_box_gadget_distribute: assertion 'size >= 0' failed in GtkScrollbar

(SWT:1612): Gtk-CRITICAL **: 16:47:26.950: gtk_box_gadget_distribute: assertion 'size >= 0' failed in GtkScrollbar

(SWT:1612): Gtk-CRITICAL **: 16:47:26.950: gtk_box_gadget_distribute: assertion 'size >= 0' failed in GtkScrollbar

(SWT:1612): Gtk-CRITICAL **: 16:47:26.953: gtk_box_gadget_distribute: assertion 'size >= 0' failed in GtkScrollbar

(SWT:1612): Gtk-CRITICAL **: 16:47:26.962: gtk_box_gadget_distribute: assertion 'size >= 0' failed in GtkScrollbar

(SWT:1612): Gtk-CRITICAL **: 16:47:26.985: gtk_box_gadget_distribute: assertion 'size >= 0' failed in GtkScrollbar

(SWT:1612): Gtk-CRITICAL **: 16:47:26.986: gtk_box_gadget_distribute: assertion 'size >= 0' failed in GtkScrollbar

(SWT:1612): Gtk-CRITICAL **: 16:47:26.987: gtk_box_gadget_distribute: assertion 'size >= 0' failed in GtkScrollbar

(SWT:1612): Gtk-CRITICAL **: 16:47:26.988: gtk_box_gadget_distribute: assertion 'size >= 0' failed in GtkScrollbar

(SWT:1612): Gtk-CRITICAL **: 16:47:26.989: gtk_box_gadget_distribute: assertion 'size >= 0' failed in GtkScrollbar

(SWT:1612): Gtk-CRITICAL **: 16:47:26.990: gtk_box_gadget_distribute: assertion 'size >= 0' failed in GtkScrollbar

(SWT:1612): Gtk-CRITICAL **: 16:47:26.992: gtk_box_gadget_distribute: assertion 'size >= 0' failed in GtkScrollbar

(SWT:1612): Gtk-CRITICAL **: 16:47:26.992: gtk_box_gadget_distribute: assertion 'size >= 0' failed in GtkScrollbar

(SWT:1612): Gtk-CRITICAL **: 16:47:26.993: gtk_box_gadget_distribute: assertion 'size >= 0' failed in GtkScrollbar

(SWT:1612): Gtk-CRITICAL **: 16:47:27.016: gtk_box_gadget_distribute: assertion 'size >= 0' failed in GtkScrollbar

(SWT:1612): Gtk-CRITICAL **: 16:47:27.016: gtk_box_gadget_distribute: assertion 'size >= 0' failed in GtkScrollbar

(SWT:1612): Gtk-CRITICAL **: 16:47:27.028: gtk_box_gadget_distribute: assertion 'size >= 0' failed in GtkScrollbar

(SWT:1612): Gtk-CRITICAL **: 16:47:27.034: gtk_box_gadget_distribute: assertion 'size >= 0' failed in GtkScrollbar

(SWT:1612): Gtk-CRITICAL **: 16:47:27.036: gtk_box_gadget_distribute: assertion 'size >= 0' failed in GtkScrollbar

(SWT:1612): Gtk-CRITICAL **: 16:47:27.036: gtk_box_gadget_distribute: assertion 'size >= 0' failed in GtkScrollbar

(SWT:1612): Gtk-CRITICAL **: 16:47:27.039: gtk_box_gadget_distribute: assertion 'size >= 0' failed in GtkScrollbar

(SWT:1612): Gtk-CRITICAL **: 16:47:27.046: gtk_box_gadget_distribute: assertion 'size >= 0' failed in GtkScrollbar

(SWT:1612): Gtk-CRITICAL **: 16:47:27.183: gtk_box_gadget_distribute: assertion 'size >= 0' failed in GtkScrollbar

(SWT:1612): Gtk-CRITICAL **: 16:47:27.184: gtk_box_gadget_distribute: assertion 'size >= 0' failed in GtkScrollbar

(SWT:1612): Gtk-CRITICAL **: 16:47:27.184: gtk_box_gadget_distribute: assertion 'size >= 0' failed in GtkScrollbar

(SWT:1612): Gtk-CRITICAL **: 16:47:27.187: gtk_box_gadget_distribute: assertion 'size >= 0' failed in GtkScrollbar

(SWT:1612): Gtk-CRITICAL **: 16:47:27.351: gtk_box_gadget_distribute: assertion 'size >= 0' failed in GtkScrollbar

(SWT:1612): Gtk-CRITICAL **: 16:47:27.356: gtk_box_gadget_distribute: assertion 'size >= 0' failed in GtkScrollbar

(SWT:1612): Gtk-CRITICAL **: 16:47:27.373: gtk_box_gadget_distribute: assertion 'size >= 0' failed in GtkScrollbar

(SWT:1612): Gtk-CRITICAL **: 16:47:27.386: gtk_box_gadget_distribute: assertion 'size >= 0' failed in GtkScrollbar

(SWT:1612): Gtk-CRITICAL **: 16:47:27.386: gtk_box_gadget_distribute: assertion 'size >= 0' failed in GtkScrollbar

(SWT:1612): Gtk-CRITICAL **: 16:47:27.387: gtk_box_gadget_distribute: assertion 'size >= 0' failed in GtkScrollbar

(SWT:1612): Gtk-CRITICAL **: 16:47:27.388: gtk_box_gadget_distribute: assertion 'size >= 0' failed in GtkScrollbar

(SWT:1612): Gtk-CRITICAL **: 16:47:27.392: gtk_box_gadget_distribute: assertion 'size >= 0' failed in GtkScrollbar

(SWT:1612): Gtk-CRITICAL **: 16:47:27.402: gtk_box_gadget_distribute: assertion 'size >= 0' failed in GtkScrollbar

(SWT:1612): Gtk-CRITICAL **: 16:47:27.463: gtk_box_gadget_distribute: assertion 'size >= 0' failed in GtkScrollbar

(SWT:1612): Gtk-CRITICAL **: 16:47:27.463: gtk_box_gadget_distribute: assertion 'size >= 0' failed in GtkScrollbar

(SWT:1612): Gtk-CRITICAL **: 16:47:27.464: gtk_box_gadget_distribute: assertion 'size >= 0' failed in GtkScrollbar

(SWT:1612): Gtk-CRITICAL **: 16:47:27.482: gtk_box_gadget_distribute: assertion 'size >= 0' failed in GtkScrollbar

(SWT:1612): Gtk-CRITICAL **: 16:47:27.482: gtk_box_gadget_distribute: assertion 'size >= 0' failed in GtkScrollbar

(SWT:1612): Gtk-CRITICAL **: 16:47:27.506: gtk_box_gadget_distribute: assertion 'size >= 0' failed in GtkScrollbar

(SWT:1612): Gtk-CRITICAL **: 16:47:27.512: gtk_box_gadget_distribute: assertion 'size >= 0' failed in GtkScrollbar

(SWT:1612): Gtk-CRITICAL **: 16:47:27.513: gtk_box_gadget_distribute: assertion 'size >= 0' failed in GtkScrollbar

(SWT:1612): Gtk-CRITICAL **: 16:47:27.514: gtk_box_gadget_distribute: assertion 'size >= 0' failed in GtkScrollbar

(SWT:1612): Gtk-CRITICAL **: 16:47:27.517: gtk_box_gadget_distribute: assertion 'size >= 0' failed in GtkScrollbar

(SWT:1612): Gtk-CRITICAL **: 16:47:27.527: gtk_box_gadget_distribute: assertion 'size >= 0' failed in GtkScrollbar

(SWT:1612): Gtk-WARNING **: 16:47:27.557: Negative content width -6 (allocation 1, extents 4x3) while allocating gadget (node toolbar, owner GtkToolbar)

(SWT:1612): Gtk-WARNING **: 16:47:28.273: Negative content width -6 (allocation 1, extents 4x3) while allocating gadget (node toolbar, owner GtkToolbar)

(SWT:1612): Gtk-WARNING **: 16:47:28.291: Negative content width -6 (allocation 1, extents 4x3) while allocating gadget (node toolbar, owner GtkToolbar)

(SWT:1612): Gtk-WARNING **: 16:47:28.887: Negative content width -6 (allocation 1, extents 4x3) while allocating gadget (node toolbar, owner GtkToolbar)

(SWT:1612): Gtk-CRITICAL **: 16:47:29.468: gtk_box_gadget_distribute: assertion 'size >= 0' failed in GtkScrollbar

(SWT:1612): Gtk-CRITICAL **: 16:47:29.478: gtk_box_gadget_distribute: assertion 'size >= 0' failed in GtkScrollbar

(SWT:1612): Gtk-WARNING **: 16:47:29.483: Negative content width -6 (allocation 1, extents 4x3) while allocating gadget (node toolbar, owner GtkToolbar)

(SWT:1612): Gtk-CRITICAL **: 16:47:29.492: gtk_box_gadget_distribute: assertion 'size >= 0' failed in GtkScrollbar

(SWT:1612): Gtk-CRITICAL **: 16:47:29.495: gtk_box_gadget_distribute: assertion 'size >= 0' failed in GtkScrollbar

(SWT:1612): Gtk-CRITICAL **: 16:47:29.508: gtk_box_gadget_distribute: assertion 'size >= 0' failed in GtkScrollbar

(SWT:1612): Gtk-CRITICAL **: 16:47:29.509: gtk_box_gadget_distribute: assertion 'size >= 0' failed in GtkScrollbar

(SWT:1612): Gtk-CRITICAL **: 16:47:29.510: gtk_box_gadget_distribute: assertion 'size >= 0' failed in GtkScrollbar

(SWT:1612): Gtk-CRITICAL **: 16:47:29.514: gtk_box_gadget_distribute: assertion 'size >= 0' failed in GtkScrollbar

(SWT:1612): Gtk-CRITICAL **: 16:47:29.515: gtk_box_gadget_distribute: assertion 'size >= 0' failed in GtkScrollbar

(SWT:1612): Gtk-CRITICAL **: 16:47:29.526: gtk_box_gadget_distribute: assertion 'size >= 0' failed in GtkScrollbar

(SWT:1612): Gtk-CRITICAL **: 16:47:29.543: gtk_box_gadget_distribute: assertion 'size >= 0' failed in GtkScrollbar

(SWT:1612): Gtk-CRITICAL **: 16:47:29.543: gtk_box_gadget_distribute: assertion 'size >= 0' failed in GtkScrollbar

(SWT:1612): Gtk-CRITICAL **: 16:47:29.559: gtk_box_gadget_distribute: assertion 'size >= 0' failed in GtkScrollbar

(SWT:1612): Gtk-CRITICAL **: 16:47:29.559: gtk_box_gadget_distribute: assertion 'size >= 0' failed in GtkScrollbar

(SWT:1612): Gtk-CRITICAL **: 16:47:29.576: gtk_box_gadget_distribute: assertion 'size >= 0' failed in GtkScrollbar

(SWT:1612): Gtk-CRITICAL **: 16:47:29.576: gtk_box_gadget_distribute: assertion 'size >= 0' failed in GtkScrollbar

(SWT:1612): Gtk-CRITICAL **: 16:47:29.593: gtk_box_gadget_distribute: assertion 'size >= 0' failed in GtkScrollbar

(SWT:1612): Gtk-CRITICAL **: 16:47:29.593: gtk_box_gadget_distribute: assertion 'size >= 0' failed in GtkScrollbar

(SWT:1612): Gtk-CRITICAL **: 16:47:29.609: gtk_box_gadget_distribute: assertion 'size >= 0' failed in GtkScrollbar

(SWT:1612): Gtk-CRITICAL **: 16:47:29.609: gtk_box_gadget_distribute: assertion 'size >= 0' failed in GtkScrollbar

(SWT:1612): Gtk-CRITICAL **: 16:47:29.626: gtk_box_gadget_distribute: assertion 'size >= 0' failed in GtkScrollbar

(SWT:1612): Gtk-CRITICAL **: 16:47:29.626: gtk_box_gadget_distribute: assertion 'size >= 0' failed in GtkScrollbar

(SWT:1612): Gtk-CRITICAL **: 16:47:29.660: gtk_box_gadget_distribute: assertion 'size >= 0' failed in GtkScrollbar

(SWT:1612): Gtk-CRITICAL **: 16:47:29.660: gtk_box_gadget_distribute: assertion 'size >= 0' failed in GtkScrollbar

(SWT:1612): Gtk-CRITICAL **: 16:47:29.670: gtk_box_gadget_distribute: assertion 'size >= 0' failed in GtkScrollbar

(SWT:1612): Gtk-CRITICAL **: 16:47:29.670: gtk_box_gadget_distribute: assertion 'size >= 0' failed in GtkScrollbar

(SWT:1612): Gtk-CRITICAL **: 16:47:29.677: gtk_box_gadget_distribute: assertion 'size >= 0' failed in GtkScrollbar

(SWT:1612): Gtk-CRITICAL **: 16:47:29.677: gtk_box_gadget_distribute: assertion 'size >= 0' failed in GtkScrollbar

(SWT:1612): Gtk-CRITICAL **: 16:47:29.692: gtk_box_gadget_distribute: assertion 'size >= 0' failed in GtkScrollbar

(SWT:1612): Gtk-CRITICAL **: 16:47:29.692: gtk_box_gadget_distribute: assertion 'size >= 0' failed in GtkScrollbar

(SWT:1612): Gtk-CRITICAL **: 16:47:29.707: gtk_box_gadget_distribute: assertion 'size >= 0' failed in GtkScrollbar

(SWT:1612): Gtk-CRITICAL **: 16:47:29.707: gtk_box_gadget_distribute: assertion 'size >= 0' failed in GtkScrollbar

(SWT:1612): Gtk-CRITICAL **: 16:47:29.708: gtk_box_gadget_distribute: assertion 'size >= 0' failed in GtkScrollbar

(SWT:1612): Gtk-CRITICAL **: 16:47:29.709: gtk_box_gadget_distribute: assertion 'size >= 0' failed in GtkScrollbar

(SWT:1612): Gtk-CRITICAL **: 16:47:29.712: gtk_box_gadget_distribute: assertion 'size >= 0' failed in GtkScrollbar

(SWT:1612): Gtk-CRITICAL **: 16:47:29.713: gtk_box_gadget_distribute: assertion 'size >= 0' failed in GtkScrollbar

(SWT:1612): Gtk-CRITICAL **: 16:47:29.722: gtk_box_gadget_distribute: assertion 'size >= 0' failed in GtkScrollbar

(SWT:1612): Gtk-CRITICAL **: 16:47:29.749: gtk_box_gadget_distribute: assertion 'size >= 0' failed in GtkScrollbar

(SWT:1612): Gtk-CRITICAL **: 16:47:29.750: gtk_box_gadget_distribute: assertion 'size >= 0' failed in GtkScrollbar

(SWT:1612): Gtk-CRITICAL **: 16:47:29.751: gtk_box_gadget_distribute: assertion 'size >= 0' failed in GtkScrollbar

(SWT:1612): Gtk-CRITICAL **: 16:47:29.760: gtk_box_gadget_distribute: assertion 'size >= 0' failed in GtkScrollbar

(SWT:1612): Gtk-CRITICAL **: 16:47:29.760: gtk_box_gadget_distribute: assertion 'size >= 0' failed in GtkScrollbar

(SWT:1612): Gtk-CRITICAL **: 16:47:29.774: gtk_box_gadget_distribute: assertion 'size >= 0' failed in GtkScrollbar

(SWT:1612): Gtk-CRITICAL **: 16:47:29.780: gtk_box_gadget_distribute: assertion 'size >= 0' failed in GtkScrollbar

(SWT:1612): Gtk-CRITICAL **: 16:47:29.781: gtk_box_gadget_distribute: assertion 'size >= 0' failed in GtkScrollbar

(SWT:1612): Gtk-CRITICAL **: 16:47:29.781: gtk_box_gadget_distribute: assertion 'size >= 0' failed in GtkScrollbar

(SWT:1612): Gtk-CRITICAL **: 16:47:29.785: gtk_box_gadget_distribute: assertion 'size >= 0' failed in GtkScrollbar

(SWT:1612): Gtk-CRITICAL **: 16:47:29.796: gtk_box_gadget_distribute: assertion 'size >= 0' failed in GtkScrollbar

(SWT:1612): Gtk-WARNING **: 16:47:29.896: Negative content width -6 (allocation 1, extents 4x3) while allocating gadget (node toolbar, owner GtkToolbar)

(SWT:1612): Gtk-WARNING **: 16:47:31.109: Negative content width -6 (allocation 1, extents 4x3) while allocating gadget (node toolbar, owner GtkToolbar)

(SWT:1612): Gtk-WARNING **: 16:47:31.127: Negative content width -6 (allocation 1, extents 4x3) while allocating gadget (node toolbar, owner GtkToolbar)

(SWT:1612): Gtk-WARNING **: 16:47:31.715: Negative content width -6 (allocation 1, extents 4x3) while allocating gadget (node toolbar, owner GtkToolbar)

(SWT:1612): Gtk-CRITICAL **: 16:47:32.084: gtk_box_gadget_distribute: assertion 'size >= 0' failed in GtkScrollbar

(SWT:1612): Gtk-CRITICAL **: 16:47:32.094: gtk_box_gadget_distribute: assertion 'size >= 0' failed in GtkScrollbar

(SWT:1612): Gtk-WARNING **: 16:47:32.099: Negative content width -6 (allocation 1, extents 4x3) while allocating gadget (node toolbar, owner GtkToolbar)

(SWT:1612): Gtk-CRITICAL **: 16:47:32.111: gtk_box_gadget_distribute: assertion 'size >= 0' failed in GtkScrollbar

(SWT:1612): Gtk-CRITICAL **: 16:47:32.118: gtk_box_gadget_distribute: assertion 'size >= 0' failed in GtkScrollbar

(SWT:1612): Gtk-CRITICAL **: 16:47:32.126: gtk_box_gadget_distribute: assertion 'size >= 0' failed in GtkScrollbar

(SWT:1612): Gtk-CRITICAL **: 16:47:32.127: gtk_box_gadget_distribute: assertion 'size >= 0' failed in GtkScrollbar

(SWT:1612): Gtk-CRITICAL **: 16:47:32.128: gtk_box_gadget_distribute: assertion 'size >= 0' failed in GtkScrollbar

(SWT:1612): Gtk-CRITICAL **: 16:47:32.133: gtk_box_gadget_distribute: assertion 'size >= 0' failed in GtkScrollbar

(SWT:1612): Gtk-CRITICAL **: 16:47:32.133: gtk_box_gadget_distribute: assertion 'size >= 0' failed in GtkScrollbar

(SWT:1612): Gtk-CRITICAL **: 16:47:32.145: gtk_box_gadget_distribute: assertion 'size >= 0' failed in GtkScrollbar

(SWT:1612): Gtk-CRITICAL **: 16:47:32.161: gtk_box_gadget_distribute: assertion 'size >= 0' failed in GtkScrollbar

(SWT:1612): Gtk-CRITICAL **: 16:47:32.161: gtk_box_gadget_distribute: assertion 'size >= 0' failed in GtkScrollbar

(SWT:1612): Gtk-CRITICAL **: 16:47:32.177: gtk_box_gadget_distribute: assertion 'size >= 0' failed in GtkScrollbar

(SWT:1612): Gtk-CRITICAL **: 16:47:32.177: gtk_box_gadget_distribute: assertion 'size >= 0' failed in GtkScrollbar

(SWT:1612): Gtk-CRITICAL **: 16:47:32.194: gtk_box_gadget_distribute: assertion 'size >= 0' failed in GtkScrollbar

(SWT:1612): Gtk-CRITICAL **: 16:47:32.194: gtk_box_gadget_distribute: assertion 'size >= 0' failed in GtkScrollbar

(SWT:1612): Gtk-CRITICAL **: 16:47:32.210: gtk_box_gadget_distribute: assertion 'size >= 0' failed in GtkScrollbar

(SWT:1612): Gtk-CRITICAL **: 16:47:32.211: gtk_box_gadget_distribute: assertion 'size >= 0' failed in GtkScrollbar

(SWT:1612): Gtk-CRITICAL **: 16:47:32.227: gtk_box_gadget_distribute: assertion 'size >= 0' failed in GtkScrollbar

(SWT:1612): Gtk-CRITICAL **: 16:47:32.227: gtk_box_gadget_distribute: assertion 'size >= 0' failed in GtkScrollbar

(SWT:1612): Gtk-CRITICAL **: 16:47:32.243: gtk_box_gadget_distribute: assertion 'size >= 0' failed in GtkScrollbar

(SWT:1612): Gtk-CRITICAL **: 16:47:32.243: gtk_box_gadget_distribute: assertion 'size >= 0' failed in GtkScrollbar

(SWT:1612): Gtk-CRITICAL **: 16:47:32.270: gtk_box_gadget_distribute: assertion 'size >= 0' failed in GtkScrollbar

(SWT:1612): Gtk-CRITICAL **: 16:47:32.270: gtk_box_gadget_distribute: assertion 'size >= 0' failed in GtkScrollbar

(SWT:1612): Gtk-CRITICAL **: 16:47:32.278: gtk_box_gadget_distribute: assertion 'size >= 0' failed in GtkScrollbar

(SWT:1612): Gtk-CRITICAL **: 16:47:32.278: gtk_box_gadget_distribute: assertion 'size >= 0' failed in GtkScrollbar

(SWT:1612): Gtk-CRITICAL **: 16:47:32.294: gtk_box_gadget_distribute: assertion 'size >= 0' failed in GtkScrollbar

(SWT:1612): Gtk-CRITICAL **: 16:47:32.294: gtk_box_gadget_distribute: assertion 'size >= 0' failed in GtkScrollbar

(SWT:1612): Gtk-CRITICAL **: 16:47:32.310: gtk_box_gadget_distribute: assertion 'size >= 0' failed in GtkScrollbar

(SWT:1612): Gtk-CRITICAL **: 16:47:32.310: gtk_box_gadget_distribute: assertion 'size >= 0' failed in GtkScrollbar

(SWT:1612): Gtk-CRITICAL **: 16:47:32.328: gtk_box_gadget_distribute: assertion 'size >= 0' failed in GtkScrollbar

(SWT:1612): Gtk-CRITICAL **: 16:47:32.329: gtk_box_gadget_distribute: assertion 'size >= 0' failed in GtkScrollbar

(SWT:1612): Gtk-CRITICAL **: 16:47:32.330: gtk_box_gadget_distribute: assertion 'size >= 0' failed in GtkScrollbar

(SWT:1612): Gtk-CRITICAL **: 16:47:32.330: gtk_box_gadget_distribute: assertion 'size >= 0' failed in GtkScrollbar

(SWT:1612): Gtk-CRITICAL **: 16:47:32.334: gtk_box_gadget_distribute: assertion 'size >= 0' failed in GtkScrollbar

(SWT:1612): Gtk-CRITICAL **: 16:47:32.334: gtk_box_gadget_distribute: assertion 'size >= 0' failed in GtkScrollbar

(SWT:1612): Gtk-CRITICAL **: 16:47:32.343: gtk_box_gadget_distribute: assertion 'size >= 0' failed in GtkScrollbar

(SWT:1612): Gtk-CRITICAL **: 16:47:32.367: gtk_box_gadget_distribute: assertion 'size >= 0' failed in GtkScrollbar

(SWT:1612): Gtk-CRITICAL **: 16:47:32.368: gtk_box_gadget_distribute: assertion 'size >= 0' failed in GtkScrollbar

(SWT:1612): Gtk-CRITICAL **: 16:47:32.369: gtk_box_gadget_distribute: assertion 'size >= 0' failed in GtkScrollbar

(SWT:1612): Gtk-CRITICAL **: 16:47:32.370: gtk_box_gadget_distribute: assertion 'size >= 0' failed in GtkScrollbar

(SWT:1612): Gtk-CRITICAL **: 16:47:32.371: gtk_box_gadget_distribute: assertion 'size >= 0' failed in GtkScrollbar

(SWT:1612): Gtk-CRITICAL **: 16:47:32.371: gtk_box_gadget_distribute: assertion 'size >= 0' failed in GtkScrollbar

(SWT:1612): Gtk-CRITICAL **: 16:47:32.373: gtk_box_gadget_distribute: assertion 'size >= 0' failed in GtkScrollbar

(SWT:1612): Gtk-CRITICAL **: 16:47:32.373: gtk_box_gadget_distribute: assertion 'size >= 0' failed in GtkScrollbar

(SWT:1612): Gtk-CRITICAL **: 16:47:32.374: gtk_box_gadget_distribute: assertion 'size >= 0' failed in GtkScrollbar

(SWT:1612): Gtk-CRITICAL **: 16:47:32.394: gtk_box_gadget_distribute: assertion 'size >= 0' failed in GtkScrollbar

(SWT:1612): Gtk-CRITICAL **: 16:47:32.394: gtk_box_gadget_distribute: assertion 'size >= 0' failed in GtkScrollbar

(SWT:1612): Gtk-CRITICAL **: 16:47:32.409: gtk_box_gadget_distribute: assertion 'size >= 0' failed in GtkScrollbar

(SWT:1612): Gtk-CRITICAL **: 16:47:32.411: gtk_box_gadget_distribute: assertion 'size >= 0' failed in GtkScrollbar

(SWT:1612): Gtk-CRITICAL **: 16:47:32.411: gtk_box_gadget_distribute: assertion 'size >= 0' failed in GtkScrollbar

(SWT:1612): Gtk-CRITICAL **: 16:47:32.426: gtk_box_gadget_distribute: assertion 'size >= 0' failed in GtkScrollbar

(SWT:1612): Gtk-CRITICAL **: 16:47:32.427: gtk_box_gadget_distribute: assertion 'size >= 0' failed in GtkScrollbar

(SWT:1612): Gtk-CRITICAL **: 16:47:32.427: gtk_box_gadget_distribute: assertion 'size >= 0' failed in GtkScrollbar

(SWT:1612): Gtk-CRITICAL **: 16:47:32.430: gtk_box_gadget_distribute: assertion 'size >= 0' failed in GtkScrollbar

(SWT:1612): Gtk-CRITICAL **: 16:47:32.443: gtk_box_gadget_distribute: assertion 'size >= 0' failed in GtkScrollbar

(SWT:1612): Gtk-CRITICAL **: 16:47:32.444: gtk_box_gadget_distribute: assertion 'size >= 0' failed in GtkScrollbar

(SWT:1612): Gtk-CRITICAL **: 16:47:32.444: gtk_box_gadget_distribute: assertion 'size >= 0' failed in GtkScrollbar

(SWT:1612): Gtk-CRITICAL **: 16:47:32.456: gtk_box_gadget_distribute: assertion 'size >= 0' failed in GtkScrollbar

(SWT:1612): Gtk-CRITICAL **: 16:47:32.462: gtk_box_gadget_distribute: assertion 'size >= 0' failed in GtkScrollbar

(SWT:1612): Gtk-CRITICAL **: 16:47:32.463: gtk_box_gadget_distribute: assertion 'size >= 0' failed in GtkScrollbar

(SWT:1612): Gtk-CRITICAL **: 16:47:32.463: gtk_box_gadget_distribute: assertion 'size >= 0' failed in GtkScrollbar

(SWT:1612): Gtk-CRITICAL **: 16:47:32.466: gtk_box_gadget_distribute: assertion 'size >= 0' failed in GtkScrollbar

(SWT:1612): Gtk-CRITICAL **: 16:47:32.978: gtk_box_gadget_distribute: assertion 'size >= 0' failed in GtkScrollbar

(SWT:1612): Gtk-CRITICAL **: 16:47:32.990: gtk_box_gadget_distribute: assertion 'size >= 0' failed in GtkScrollbar

(SWT:1612): Gtk-CRITICAL **: 16:47:32.990: gtk_box_gadget_distribute: assertion 'size >= 0' failed in GtkScrollbar

(SWT:1612): Gtk-CRITICAL **: 16:47:32.991: gtk_box_gadget_distribute: assertion 'size >= 0' failed in GtkScrollbar

(SWT:1612): Gtk-CRITICAL **: 16:47:32.992: gtk_box_gadget_distribute: assertion 'size >= 0' failed in GtkScrollbar

(SWT:1612): Gtk-CRITICAL **: 16:47:32.994: gtk_box_gadget_distribute: assertion 'size >= 0' failed in GtkScrollbar

(SWT:1612): Gtk-CRITICAL **: 16:47:33.003: gtk_box_gadget_distribute: assertion 'size >= 0' failed in GtkScrollbar

(SWT:1612): Gtk-CRITICAL **: 16:47:33.076: gtk_box_gadget_distribute: assertion 'size >= 0' failed in GtkScrollbar

(SWT:1612): Gtk-CRITICAL **: 16:47:33.076: gtk_box_gadget_distribute: assertion 'size >= 0' failed in GtkScrollbar

(SWT:1612): Gtk-CRITICAL **: 16:47:33.078: gtk_box_gadget_distribute: assertion 'size >= 0' failed in GtkScrollbar

(SWT:1612): Gtk-CRITICAL **: 16:47:33.078: gtk_box_gadget_distribute: assertion 'size >= 0' failed in GtkScrollbar

(SWT:1612): Gtk-CRITICAL **: 16:47:33.079: gtk_box_gadget_distribute: assertion 'size >= 0' failed in GtkScrollbar

(SWT:1612): Gtk-CRITICAL **: 16:47:33.079: gtk_box_gadget_distribute: assertion 'size >= 0' failed in GtkScrollbar

(SWT:1612): Gtk-CRITICAL **: 16:47:33.081: gtk_box_gadget_distribute: assertion 'size >= 0' failed in GtkScrollbar

(SWT:1612): Gtk-CRITICAL **: 16:47:33.081: gtk_box_gadget_distribute: assertion 'size >= 0' failed in GtkScrollbar

(SWT:1612): Gtk-CRITICAL **: 16:47:33.082: gtk_box_gadget_distribute: assertion 'size >= 0' failed in GtkScrollbar

(SWT:1612): Gtk-CRITICAL **: 16:47:33.104: gtk_box_gadget_distribute: assertion 'size >= 0' failed in GtkScrollbar

(SWT:1612): Gtk-CRITICAL **: 16:47:33.104: gtk_box_gadget_distribute: assertion 'size >= 0' failed in GtkScrollbar

(SWT:1612): Gtk-CRITICAL **: 16:47:33.119: gtk_box_gadget_distribute: assertion 'size >= 0' failed in GtkScrollbar

(SWT:1612): Gtk-CRITICAL **: 16:47:33.121: gtk_box_gadget_distribute: assertion 'size >= 0' failed in GtkScrollbar

(SWT:1612): Gtk-CRITICAL **: 16:47:33.121: gtk_box_gadget_distribute: assertion 'size >= 0' failed in GtkScrollbar

(SWT:1612): Gtk-CRITICAL **: 16:47:33.136: gtk_box_gadget_distribute: assertion 'size >= 0' failed in GtkScrollbar

(SWT:1612): Gtk-CRITICAL **: 16:47:33.137: gtk_box_gadget_distribute: assertion 'size >= 0' failed in GtkScrollbar

(SWT:1612): Gtk-CRITICAL **: 16:47:33.138: gtk_box_gadget_distribute: assertion 'size >= 0' failed in GtkScrollbar

(SWT:1612): Gtk-CRITICAL **: 16:47:33.140: gtk_box_gadget_distribute: assertion 'size >= 0' failed in GtkScrollbar

(SWT:1612): Gtk-CRITICAL **: 16:47:33.162: gtk_box_gadget_distribute: assertion 'size >= 0' failed in GtkScrollbar

(SWT:1612): Gtk-CRITICAL **: 16:47:33.163: gtk_box_gadget_distribute: assertion 'size >= 0' failed in GtkScrollbar

(SWT:1612): Gtk-CRITICAL **: 16:47:33.164: gtk_box_gadget_distribute: assertion 'size >= 0' failed in GtkScrollbar

(SWT:1612): Gtk-CRITICAL **: 16:47:33.181: gtk_box_gadget_distribute: assertion 'size >= 0' failed in GtkScrollbar

(SWT:1612): Gtk-CRITICAL **: 16:47:33.315: gtk_box_gadget_distribute: assertion 'size >= 0' failed in GtkScrollbar

(SWT:1612): Gtk-CRITICAL **: 16:47:33.316: gtk_box_gadget_distribute: assertion 'size >= 0' failed in GtkScrollbar

(SWT:1612): Gtk-CRITICAL **: 16:47:33.317: gtk_box_gadget_distribute: assertion 'size >= 0' failed in GtkScrollbar

(SWT:1612): Gtk-CRITICAL **: 16:47:33.331: gtk_box_gadget_distribute: assertion 'size >= 0' failed in GtkScrollbar

(SWT:1612): Gtk-CRITICAL **: 16:47:33.375: gtk_box_gadget_distribute: assertion 'size >= 0' failed in GtkScrollbar

(SWT:1612): Gtk-CRITICAL **: 16:47:33.382: gtk_box_gadget_distribute: assertion 'size >= 0' failed in GtkScrollbar

(SWT:1612): Gtk-CRITICAL **: 16:47:33.397: gtk_box_gadget_distribute: assertion 'size >= 0' failed in GtkScrollbar

(SWT:1612): Gtk-CRITICAL **: 16:47:33.420: gtk_box_gadget_distribute: assertion 'size >= 0' failed in GtkScrollbar

(SWT:1612): Gtk-CRITICAL **: 16:47:33.421: gtk_box_gadget_distribute: assertion 'size >= 0' failed in GtkScrollbar

(SWT:1612): Gtk-CRITICAL **: 16:47:33.422: gtk_box_gadget_distribute: assertion 'size >= 0' failed in GtkScrollbar

(SWT:1612): Gtk-CRITICAL **: 16:47:33.423: gtk_box_gadget_distribute: assertion 'size >= 0' failed in GtkScrollbar

(SWT:1612): Gtk-CRITICAL **: 16:47:33.423: gtk_box_gadget_distribute: assertion 'size >= 0' failed in GtkScrollbar

(SWT:1612): Gtk-CRITICAL **: 16:47:33.424: gtk_box_gadget_distribute: assertion 'size >= 0' failed in GtkScrollbar

(SWT:1612): Gtk-CRITICAL **: 16:47:33.430: gtk_box_gadget_distribute: assertion 'size >= 0' failed in GtkScrollbar

(SWT:1612): Gtk-CRITICAL **: 16:47:33.440: gtk_box_gadget_distribute: assertion 'size >= 0' failed in GtkScrollbar

(SWT:1612): Gtk-CRITICAL **: 16:47:33.496: gtk_box_gadget_distribute: assertion 'size >= 0' failed in GtkScrollbar

(SWT:1612): Gtk-CRITICAL **: 16:47:33.496: gtk_box_gadget_distribute: assertion 'size >= 0' failed in GtkScrollbar

(SWT:1612): Gtk-CRITICAL **: 16:47:33.509: gtk_box_gadget_distribute: assertion 'size >= 0' failed in GtkScrollbar

(SWT:1612): Gtk-CRITICAL **: 16:47:33.514: gtk_box_gadget_distribute: assertion 'size >= 0' failed in GtkScrollbar

(SWT:1612): Gtk-CRITICAL **: 16:47:33.516: gtk_box_gadget_distribute: assertion 'size >= 0' failed in GtkScrollbar

(SWT:1612): Gtk-CRITICAL **: 16:47:33.516: gtk_box_gadget_distribute: assertion 'size >= 0' failed in GtkScrollbar

(SWT:1612): Gtk-CRITICAL **: 16:47:33.519: gtk_box_gadget_distribute: assertion 'size >= 0' failed in GtkScrollbar

(SWT:1612): Gtk-CRITICAL **: 16:47:33.530: gtk_box_gadget_distribute: assertion 'size >= 0' failed in GtkScrollbar

(SWT:1612): Gtk-WARNING **: 16:47:33.635: Negative content width -6 (allocation 1, extents 4x3) while allocating gadget (node toolbar, owner GtkToolbar)

(SWT:1612): Gtk-WARNING **: 16:47:34.291: Negative content width -6 (allocation 1, extents 4x3) while allocating gadget (node toolbar, owner GtkToolbar)

(SWT:1612): Gtk-WARNING **: 16:47:34.310: Negative content width -6 (allocation 1, extents 4x3) while allocating gadget (node toolbar, owner GtkToolbar)

(SWT:1612): Gtk-WARNING **: 16:47:34.911: Negative content width -6 (allocation 1, extents 4x3) while allocating gadget (node toolbar, owner GtkToolbar)

(SWT:1612): Gtk-CRITICAL **: 16:47:35.369: gtk_box_gadget_distribute: assertion 'size >= 0' failed in GtkScrollbar

(SWT:1612): Gtk-CRITICAL **: 16:47:35.379: gtk_box_gadget_distribute: assertion 'size >= 0' failed in GtkScrollbar

(SWT:1612): Gtk-WARNING **: 16:47:35.384: Negative content width -6 (allocation 1, extents 4x3) while allocating gadget (node toolbar, owner GtkToolbar)

(SWT:1612): Gtk-CRITICAL **: 16:47:35.394: gtk_box_gadget_distribute: assertion 'size >= 0' failed in GtkScrollbar

(SWT:1612): Gtk-CRITICAL **: 16:47:35.400: gtk_box_gadget_distribute: assertion 'size >= 0' failed in GtkScrollbar

(SWT:1612): Gtk-CRITICAL **: 16:47:35.405: gtk_box_gadget_distribute: assertion 'size >= 0' failed in GtkScrollbar

(SWT:1612): Gtk-CRITICAL **: 16:47:35.407: gtk_box_gadget_distribute: assertion 'size >= 0' failed in GtkScrollbar

(SWT:1612): Gtk-CRITICAL **: 16:47:35.407: gtk_box_gadget_distribute: assertion 'size >= 0' failed in GtkScrollbar

(SWT:1612): Gtk-CRITICAL **: 16:47:35.412: gtk_box_gadget_distribute: assertion 'size >= 0' failed in GtkScrollbar

(SWT:1612): Gtk-CRITICAL **: 16:47:35.413: gtk_box_gadget_distribute: assertion 'size >= 0' failed in GtkScrollbar

(SWT:1612): Gtk-CRITICAL **: 16:47:35.430: gtk_box_gadget_distribute: assertion 'size >= 0' failed in GtkScrollbar

(SWT:1612): Gtk-CRITICAL **: 16:47:35.430: gtk_box_gadget_distribute: assertion 'size >= 0' failed in GtkScrollbar

(SWT:1612): Gtk-CRITICAL **: 16:47:35.440: gtk_box_gadget_distribute: assertion 'size >= 0' failed in GtkScrollbar

(SWT:1612): Gtk-CRITICAL **: 16:47:35.444: gtk_box_gadget_distribute: assertion 'size >= 0' failed in GtkScrollbar

(SWT:1612): Gtk-CRITICAL **: 16:47:35.444: gtk_box_gadget_distribute: assertion 'size >= 0' failed in GtkScrollbar

(SWT:1612): Gtk-CRITICAL **: 16:47:35.461: gtk_box_gadget_distribute: assertion 'size >= 0' failed in GtkScrollbar

(SWT:1612): Gtk-CRITICAL **: 16:47:35.461: gtk_box_gadget_distribute: assertion 'size >= 0' failed in GtkScrollbar

(SWT:1612): Gtk-CRITICAL **: 16:47:35.478: gtk_box_gadget_distribute: assertion 'size >= 0' failed in GtkScrollbar

(SWT:1612): Gtk-CRITICAL **: 16:47:35.478: gtk_box_gadget_distribute: assertion 'size >= 0' failed in GtkScrollbar

(SWT:1612): Gtk-CRITICAL **: 16:47:35.495: gtk_box_gadget_distribute: assertion 'size >= 0' failed in GtkScrollbar

(SWT:1612): Gtk-CRITICAL **: 16:47:35.495: gtk_box_gadget_distribute: assertion 'size >= 0' failed in GtkScrollbar

(SWT:1612): Gtk-CRITICAL **: 16:47:35.511: gtk_box_gadget_distribute: assertion 'size >= 0' failed in GtkScrollbar

(SWT:1612): Gtk-CRITICAL **: 16:47:35.511: gtk_box_gadget_distribute: assertion 'size >= 0' failed in GtkScrollbar

(SWT:1612): Gtk-CRITICAL **: 16:47:35.528: gtk_box_gadget_distribute: assertion 'size >= 0' failed in GtkScrollbar

(SWT:1612): Gtk-CRITICAL **: 16:47:35.528: gtk_box_gadget_distribute: assertion 'size >= 0' failed in GtkScrollbar

(SWT:1612): Gtk-CRITICAL **: 16:47:35.542: gtk_box_gadget_distribute: assertion 'size >= 0' failed in GtkScrollbar

(SWT:1612): Gtk-CRITICAL **: 16:47:35.542: gtk_box_gadget_distribute: assertion 'size >= 0' failed in GtkScrollbar

(SWT:1612): Gtk-CRITICAL **: 16:47:35.543: gtk_box_gadget_distribute: assertion 'size >= 0' failed in GtkScrollbar

(SWT:1612): Gtk-CRITICAL **: 16:47:35.545: gtk_box_gadget_distribute: assertion 'size >= 0' failed in GtkScrollbar

(SWT:1612): Gtk-CRITICAL **: 16:47:35.545: gtk_box_gadget_distribute: assertion 'size >= 0' failed in GtkScrollbar

(SWT:1612): Gtk-CRITICAL **: 16:47:35.552: gtk_box_gadget_distribute: assertion 'size >= 0' failed in GtkScrollbar

(SWT:1612): Gtk-CRITICAL **: 16:47:35.553: gtk_box_gadget_distribute: assertion 'size >= 0' failed in GtkScrollbar

(SWT:1612): Gtk-CRITICAL **: 16:47:35.554: gtk_box_gadget_distribute: assertion 'size >= 0' failed in GtkScrollbar

(SWT:1612): Gtk-CRITICAL **: 16:47:35.557: gtk_box_gadget_distribute: assertion 'size >= 0' failed in GtkScrollbar

(SWT:1612): Gtk-CRITICAL **: 16:47:35.557: gtk_box_gadget_distribute: assertion 'size >= 0' failed in GtkScrollbar

(SWT:1612): Gtk-CRITICAL **: 16:47:35.558: gtk_box_gadget_distribute: assertion 'size >= 0' failed in GtkScrollbar

(SWT:1612): Gtk-CRITICAL **: 16:47:35.562: gtk_box_gadget_distribute: assertion 'size >= 0' failed in GtkScrollbar

(SWT:1612): Gtk-CRITICAL **: 16:47:35.562: gtk_box_gadget_distribute: assertion 'size >= 0' failed in GtkScrollbar

(SWT:1612): Gtk-CRITICAL **: 16:47:35.581: gtk_box_gadget_distribute: assertion 'size >= 0' failed in GtkScrollbar

(SWT:1612): Gtk-WARNING **: 16:47:35.608: Negative content width -6 (allocation 1, extents 4x3) while allocating gadget (node toolbar, owner GtkToolbar)

(SWT:1612): Gtk-WARNING **: 16:47:36.553: Negative content width -6 (allocation 1, extents 4x3) while allocating gadget (node toolbar, owner GtkToolbar)

(SWT:1612): Gtk-WARNING **: 16:47:36.571: Negative content width -6 (allocation 1, extents 4x3) while allocating gadget (node toolbar, owner GtkToolbar)

(SWT:1612): Gtk-WARNING **: 16:47:37.158: Negative content width -6 (allocation 1, extents 4x3) while allocating gadget (node toolbar, owner GtkToolbar)

(SWT:1612): Gtk-CRITICAL **: 16:47:37.824: gtk_box_gadget_distribute: assertion 'size >= 0' failed in GtkScrollbar

(SWT:1612): Gtk-CRITICAL **: 16:47:37.834: gtk_box_gadget_distribute: assertion 'size >= 0' failed in GtkScrollbar

(SWT:1612): Gtk-WARNING **: 16:47:37.839: Negative content width -6 (allocation 1, extents 4x3) while allocating gadget (node toolbar, owner GtkToolbar)

(SWT:1612): Gtk-CRITICAL **: 16:47:37.848: gtk_box_gadget_distribute: assertion 'size >= 0' failed in GtkScrollbar

(SWT:1612): Gtk-CRITICAL **: 16:47:37.854: gtk_box_gadget_distribute: assertion 'size >= 0' failed in GtkScrollbar

(SWT:1612): Gtk-CRITICAL **: 16:47:37.856: gtk_box_gadget_distribute: assertion 'size >= 0' failed in GtkScrollbar

(SWT:1612): Gtk-CRITICAL **: 16:47:37.856: gtk_box_gadget_distribute: assertion 'size >= 0' failed in GtkScrollbar

(SWT:1612): Gtk-CRITICAL **: 16:47:37.861: gtk_box_gadget_distribute: assertion 'size >= 0' failed in GtkScrollbar

(SWT:1612): Gtk-CRITICAL **: 16:47:37.861: gtk_box_gadget_distribute: assertion 'size >= 0' failed in GtkScrollbar

(SWT:1612): Gtk-CRITICAL **: 16:47:37.876: gtk_box_gadget_distribute: assertion 'size >= 0' failed in GtkScrollbar

(SWT:1612): Gtk-CRITICAL **: 16:47:37.890: gtk_box_gadget_distribute: assertion 'size >= 0' failed in GtkScrollbar

(SWT:1612): Gtk-CRITICAL **: 16:47:37.890: gtk_box_gadget_distribute: assertion 'size >= 0' failed in GtkScrollbar

(SWT:1612): Gtk-CRITICAL **: 16:47:37.907: gtk_box_gadget_distribute: assertion 'size >= 0' failed in GtkScrollbar

(SWT:1612): Gtk-CRITICAL **: 16:47:37.907: gtk_box_gadget_distribute: assertion 'size >= 0' failed in GtkScrollbar

(SWT:1612): Gtk-CRITICAL **: 16:47:37.923: gtk_box_gadget_distribute: assertion 'size >= 0' failed in GtkScrollbar

(SWT:1612): Gtk-CRITICAL **: 16:47:37.923: gtk_box_gadget_distribute: assertion 'size >= 0' failed in GtkScrollbar

(SWT:1612): Gtk-CRITICAL **: 16:47:37.940: gtk_box_gadget_distribute: assertion 'size >= 0' failed in GtkScrollbar

(SWT:1612): Gtk-CRITICAL **: 16:47:37.940: gtk_box_gadget_distribute: assertion 'size >= 0' failed in GtkScrollbar

(SWT:1612): Gtk-CRITICAL **: 16:47:37.957: gtk_box_gadget_distribute: assertion 'size >= 0' failed in GtkScrollbar

(SWT:1612): Gtk-CRITICAL **: 16:47:37.957: gtk_box_gadget_distribute: assertion 'size >= 0' failed in GtkScrollbar

(SWT:1612): Gtk-CRITICAL **: 16:47:37.973: gtk_box_gadget_distribute: assertion 'size >= 0' failed in GtkScrollbar

(SWT:1612): Gtk-CRITICAL **: 16:47:37.973: gtk_box_gadget_distribute: assertion 'size >= 0' failed in GtkScrollbar

(SWT:1612): Gtk-CRITICAL **: 16:47:37.983: gtk_box_gadget_distribute: assertion 'size >= 0' failed in GtkScrollbar

(SWT:1612): Gtk-CRITICAL **: 16:47:37.984: gtk_box_gadget_distribute: assertion 'size >= 0' failed in GtkScrollbar

(SWT:1612): Gtk-CRITICAL **: 16:47:37.985: gtk_box_gadget_distribute: assertion 'size >= 0' failed in GtkScrollbar

(SWT:1612): Gtk-CRITICAL **: 16:47:37.986: gtk_box_gadget_distribute: assertion 'size >= 0' failed in GtkScrollbar

(SWT:1612): Gtk-CRITICAL **: 16:47:37.987: gtk_box_gadget_distribute: assertion 'size >= 0' failed in GtkScrollbar

(SWT:1612): Gtk-CRITICAL **: 16:47:37.987: gtk_box_gadget_distribute: assertion 'size >= 0' failed in GtkScrollbar

(SWT:1612): Gtk-CRITICAL **: 16:47:37.990: gtk_box_gadget_distribute: assertion 'size >= 0' failed in GtkScrollbar

(SWT:1612): Gtk-CRITICAL **: 16:47:37.990: gtk_box_gadget_distribute: assertion 'size >= 0' failed in GtkScrollbar

(SWT:1612): Gtk-CRITICAL **: 16:47:38.004: gtk_box_gadget_distribute: assertion 'size >= 0' failed in GtkScrollbar

(SWT:1612): Gtk-CRITICAL **: 16:47:38.005: gtk_box_gadget_distribute: assertion 'size >= 0' failed in GtkScrollbar

(SWT:1612): Gtk-CRITICAL **: 16:47:38.006: gtk_box_gadget_distribute: assertion 'size >= 0' failed in GtkScrollbar

(SWT:1612): Gtk-CRITICAL **: 16:47:38.007: gtk_box_gadget_distribute: assertion 'size >= 0' failed in GtkScrollbar

(SWT:1612): Gtk-CRITICAL **: 16:47:38.007: gtk_box_gadget_distribute: assertion 'size >= 0' failed in GtkScrollbar

(SWT:1612): Gtk-CRITICAL **: 16:47:38.030: gtk_box_gadget_distribute: assertion 'size >= 0' failed in GtkScrollbar

(SWT:1612): Gtk-CRITICAL **: 16:47:38.039: gtk_box_gadget_distribute: assertion 'size >= 0' failed in GtkScrollbar

(SWT:1612): Gtk-WARNING **: 16:47:38.063: Negative content width -6 (allocation 1, extents 4x3) while allocating gadget (node toolbar, owner GtkToolbar)

(SWT:1612): Gtk-WARNING **: 16:47:39.311: Negative content width -6 (allocation 1, extents 4x3) while allocating gadget (node toolbar, owner GtkToolbar)

(SWT:1612): Gtk-WARNING **: 16:47:39.343: Negative content width -6 (allocation 1, extents 4x3) while allocating gadget (node toolbar, owner GtkToolbar)

(SWT:1612): Gtk-WARNING **: 16:47:39.951: Negative content width -6 (allocation 1, extents 4x3) while allocating gadget (node toolbar, owner GtkToolbar)

(SWT:1612): Gtk-CRITICAL **: 16:47:40.405: gtk_box_gadget_distribute: assertion 'size >= 0' failed in GtkScrollbar

(SWT:1612): Gtk-CRITICAL **: 16:47:40.415: gtk_box_gadget_distribute: assertion 'size >= 0' failed in GtkScrollbar

(SWT:1612): Gtk-WARNING **: 16:47:40.420: Negative content width -6 (allocation 1, extents 4x3) while allocating gadget (node toolbar, owner GtkToolbar)

(SWT:1612): Gtk-CRITICAL **: 16:47:40.430: gtk_box_gadget_distribute: assertion 'size >= 0' failed in GtkScrollbar

(SWT:1612): Gtk-CRITICAL **: 16:47:40.438: gtk_box_gadget_distribute: assertion 'size >= 0' failed in GtkScrollbar

(SWT:1612): Gtk-CRITICAL **: 16:47:40.439: gtk_box_gadget_distribute: assertion 'size >= 0' failed in GtkScrollbar

(SWT:1612): Gtk-CRITICAL **: 16:47:40.440: gtk_box_gadget_distribute: assertion 'size >= 0' failed in GtkScrollbar

(SWT:1612): Gtk-CRITICAL **: 16:47:40.445: gtk_box_gadget_distribute: assertion 'size >= 0' failed in GtkScrollbar

(SWT:1612): Gtk-CRITICAL **: 16:47:40.445: gtk_box_gadget_distribute: assertion 'size >= 0' failed in GtkScrollbar

(SWT:1612): Gtk-CRITICAL **: 16:47:40.458: gtk_box_gadget_distribute: assertion 'size >= 0' failed in GtkScrollbar

(SWT:1612): Gtk-CRITICAL **: 16:47:40.475: gtk_box_gadget_distribute: assertion 'size >= 0' failed in GtkScrollbar

(SWT:1612): Gtk-CRITICAL **: 16:47:40.475: gtk_box_gadget_distribute: assertion 'size >= 0' failed in GtkScrollbar

(SWT:1612): Gtk-CRITICAL **: 16:47:40.492: gtk_box_gadget_distribute: assertion 'size >= 0' failed in GtkScrollbar

(SWT:1612): Gtk-CRITICAL **: 16:47:40.492: gtk_box_gadget_distribute: assertion 'size >= 0' failed in GtkScrollbar

(SWT:1612): Gtk-CRITICAL **: 16:47:40.508: gtk_box_gadget_distribute: assertion 'size >= 0' failed in GtkScrollbar

(SWT:1612): Gtk-CRITICAL **: 16:47:40.508: gtk_box_gadget_distribute: assertion 'size >= 0' failed in GtkScrollbar

(SWT:1612): Gtk-CRITICAL **: 16:47:40.524: gtk_box_gadget_distribute: assertion 'size >= 0' failed in GtkScrollbar

(SWT:1612): Gtk-CRITICAL **: 16:47:40.524: gtk_box_gadget_distribute: assertion 'size >= 0' failed in GtkScrollbar

(SWT:1612): Gtk-CRITICAL **: 16:47:40.541: gtk_box_gadget_distribute: assertion 'size >= 0' failed in GtkScrollbar

(SWT:1612): Gtk-CRITICAL **: 16:47:40.541: gtk_box_gadget_distribute: assertion 'size >= 0' failed in GtkScrollbar

(SWT:1612): Gtk-CRITICAL **: 16:47:40.558: gtk_box_gadget_distribute: assertion 'size >= 0' failed in GtkScrollbar

(SWT:1612): Gtk-CRITICAL **: 16:47:40.558: gtk_box_gadget_distribute: assertion 'size >= 0' failed in GtkScrollbar

(SWT:1612): Gtk-CRITICAL **: 16:47:40.568: gtk_box_gadget_distribute: assertion 'size >= 0' failed in GtkScrollbar

(SWT:1612): Gtk-CRITICAL **: 16:47:40.569: gtk_box_gadget_distribute: assertion 'size >= 0' failed in GtkScrollbar

(SWT:1612): Gtk-CRITICAL **: 16:47:40.629: gtk_box_gadget_distribute: assertion 'size >= 0' failed in GtkScrollbar

(SWT:1612): Gtk-CRITICAL **: 16:47:40.629: gtk_box_gadget_distribute: assertion 'size >= 0' failed in GtkScrollbar

(SWT:1612): Gtk-CRITICAL **: 16:47:40.635: gtk_box_gadget_distribute: assertion 'size >= 0' failed in GtkScrollbar

(SWT:1612): Gtk-CRITICAL **: 16:47:40.636: gtk_box_gadget_distribute: assertion 'size >= 0' failed in GtkScrollbar

(SWT:1612): Gtk-CRITICAL **: 16:47:40.636: gtk_box_gadget_distribute: assertion 'size >= 0' failed in GtkScrollbar

(SWT:1612): Gtk-CRITICAL **: 16:47:40.637: gtk_box_gadget_distribute: assertion 'size >= 0' failed in GtkScrollbar

(SWT:1612): Gtk-CRITICAL **: 16:47:40.647: gtk_box_gadget_distribute: assertion 'size >= 0' failed in GtkScrollbar

(SWT:1612): Gtk-CRITICAL **: 16:47:40.659: gtk_box_gadget_distribute: assertion 'size >= 0' failed in GtkScrollbar

(SWT:1612): Gtk-CRITICAL **: 16:47:40.660: gtk_box_gadget_distribute: assertion 'size >= 0' failed in GtkScrollbar

(SWT:1612): Gtk-CRITICAL **: 16:47:40.661: gtk_box_gadget_distribute: assertion 'size >= 0' failed in GtkScrollbar

(SWT:1612): Gtk-WARNING **: 16:47:40.708: Negative content width -6 (allocation 1, extents 4x3) while allocating gadget (node toolbar, owner GtkToolbar)

(SWT:1612): Gtk-CRITICAL **: 16:47:41.863: gtk_box_gadget_distribute: assertion 'size >= 0' failed in GtkScrollbar

(SWT:1612): Gtk-CRITICAL **: 16:47:41.864: gtk_box_gadget_distribute: assertion 'size >= 0' failed in GtkScrollbar

(SWT:1612): Gtk-WARNING **: 16:47:41.951: Negative content width -6 (allocation 1, extents 4x3) while allocating gadget (node toolbar, owner GtkToolbar)

(SWT:1612): Gtk-WARNING **: 16:47:41.967: Negative content width -6 (allocation 1, extents 4x3) while allocating gadget (node toolbar, owner GtkToolbar)

(SWT:1612): Gtk-WARNING **: 16:47:42.555: Negative content width -6 (allocation 1, extents 4x3) while allocating gadget (node toolbar, owner GtkToolbar)

(SWT:1612): Gtk-CRITICAL **: 16:47:42.920: gtk_box_gadget_distribute: assertion 'size >= 0' failed in GtkScrollbar

(SWT:1612): Gtk-CRITICAL **: 16:47:42.929: gtk_box_gadget_distribute: assertion 'size >= 0' failed in GtkScrollbar

(SWT:1612): Gtk-WARNING **: 16:47:42.934: Negative content width -6 (allocation 1, extents 4x3) while allocating gadget (node toolbar, owner GtkToolbar)

(SWT:1612): Gtk-CRITICAL **: 16:47:42.944: gtk_box_gadget_distribute: assertion 'size >= 0' failed in GtkScrollbar

(SWT:1612): Gtk-CRITICAL **: 16:47:42.952: gtk_box_gadget_distribute: assertion 'size >= 0' failed in GtkScrollbar

(SWT:1612): Gtk-CRITICAL **: 16:47:42.953: gtk_box_gadget_distribute: assertion 'size >= 0' failed in GtkScrollbar

(SWT:1612): Gtk-CRITICAL **: 16:47:42.953: gtk_box_gadget_distribute: assertion 'size >= 0' failed in GtkScrollbar

(SWT:1612): Gtk-CRITICAL **: 16:47:42.958: gtk_box_gadget_distribute: assertion 'size >= 0' failed in GtkScrollbar

(SWT:1612): Gtk-CRITICAL **: 16:47:42.958: gtk_box_gadget_distribute: assertion 'size >= 0' failed in GtkScrollbar

(SWT:1612): Gtk-CRITICAL **: 16:47:42.970: gtk_box_gadget_distribute: assertion 'size >= 0' failed in GtkScrollbar

(SWT:1612): Gtk-CRITICAL **: 16:47:42.988: gtk_box_gadget_distribute: assertion 'size >= 0' failed in GtkScrollbar

(SWT:1612): Gtk-CRITICAL **: 16:47:42.988: gtk_box_gadget_distribute: assertion 'size >= 0' failed in GtkScrollbar

(SWT:1612): Gtk-CRITICAL **: 16:47:43.003: gtk_box_gadget_distribute: assertion 'size >= 0' failed in GtkScrollbar

(SWT:1612): Gtk-CRITICAL **: 16:47:43.003: gtk_box_gadget_distribute: assertion 'size >= 0' failed in GtkScrollbar

(SWT:1612): Gtk-CRITICAL **: 16:47:43.020: gtk_box_gadget_distribute: assertion 'size >= 0' failed in GtkScrollbar

(SWT:1612): Gtk-CRITICAL **: 16:47:43.020: gtk_box_gadget_distribute: assertion 'size >= 0' failed in GtkScrollbar

(SWT:1612): Gtk-CRITICAL **: 16:47:43.037: gtk_box_gadget_distribute: assertion 'size >= 0' failed in GtkScrollbar

(SWT:1612): Gtk-CRITICAL **: 16:47:43.037: gtk_box_gadget_distribute: assertion 'size >= 0' failed in GtkScrollbar

(SWT:1612): Gtk-CRITICAL **: 16:47:43.054: gtk_box_gadget_distribute: assertion 'size >= 0' failed in GtkScrollbar

(SWT:1612): Gtk-CRITICAL **: 16:47:43.054: gtk_box_gadget_distribute: assertion 'size >= 0' failed in GtkScrollbar

(SWT:1612): Gtk-CRITICAL **: 16:47:43.070: gtk_box_gadget_distribute: assertion 'size >= 0' failed in GtkScrollbar

(SWT:1612): Gtk-CRITICAL **: 16:47:43.070: gtk_box_gadget_distribute: assertion 'size >= 0' failed in GtkScrollbar

(SWT:1612): Gtk-CRITICAL **: 16:47:43.080: gtk_box_gadget_distribute: assertion 'size >= 0' failed in GtkScrollbar

(SWT:1612): Gtk-CRITICAL **: 16:47:43.080: gtk_box_gadget_distribute: assertion 'size >= 0' failed in GtkScrollbar

(SWT:1612): Gtk-CRITICAL **: 16:47:43.082: gtk_box_gadget_distribute: assertion 'size >= 0' failed in GtkScrollbar

(SWT:1612): Gtk-CRITICAL **: 16:47:43.083: gtk_box_gadget_distribute: assertion 'size >= 0' failed in GtkScrollbar

(SWT:1612): Gtk-CRITICAL **: 16:47:43.083: gtk_box_gadget_distribute: assertion 'size >= 0' failed in GtkScrollbar

(SWT:1612): Gtk-CRITICAL **: 16:47:43.084: gtk_box_gadget_distribute: assertion 'size >= 0' failed in GtkScrollbar

(SWT:1612): Gtk-CRITICAL **: 16:47:43.087: gtk_box_gadget_distribute: assertion 'size >= 0' failed in GtkScrollbar

(SWT:1612): Gtk-CRITICAL **: 16:47:43.087: gtk_box_gadget_distribute: assertion 'size >= 0' failed in GtkScrollbar

(SWT:1612): Gtk-CRITICAL **: 16:47:43.115: gtk_box_gadget_distribute: assertion 'size >= 0' failed in GtkScrollbar

(SWT:1612): Gtk-CRITICAL **: 16:47:43.115: gtk_box_gadget_distribute: assertion 'size >= 0' failed in GtkScrollbar

(SWT:1612): Gtk-CRITICAL **: 16:47:43.122: gtk_box_gadget_distribute: assertion 'size >= 0' failed in GtkScrollbar

(SWT:1612): Gtk-CRITICAL **: 16:47:43.122: gtk_box_gadget_distribute: assertion 'size >= 0' failed in GtkScrollbar

(SWT:1612): Gtk-CRITICAL **: 16:47:43.137: gtk_box_gadget_distribute: assertion 'size >= 0' failed in GtkScrollbar

(SWT:1612): Gtk-CRITICAL **: 16:47:43.137: gtk_box_gadget_distribute: assertion 'size >= 0' failed in GtkScrollbar

(SWT:1612): Gtk-CRITICAL **: 16:47:43.178: gtk_box_gadget_distribute: assertion 'size >= 0' failed in GtkScrollbar

(SWT:1612): Gtk-WARNING **: 16:47:43.267: Negative content width -6 (allocation 1, extents 4x3) while allocating gadget (node toolbar, owner GtkToolbar)

(SWT:1612): Gtk-CRITICAL **: 16:47:44.361: gtk_box_gadget_distribute: assertion 'size >= 0' failed in GtkScrollbar

(SWT:1612): Gtk-CRITICAL **: 16:47:44.362: gtk_box_gadget_distribute: assertion 'size >= 0' failed in GtkScrollbar

(SWT:1612): Gtk-WARNING **: 16:47:44.463: Negative content width -6 (allocation 1, extents 4x3) while allocating gadget (node toolbar, owner GtkToolbar)

(SWT:1612): Gtk-WARNING **: 16:47:44.480: Negative content width -6 (allocation 1, extents 4x3) while allocating gadget (node toolbar, owner GtkToolbar)

(SWT:1612): Gtk-WARNING **: 16:47:45.070: Negative content width -6 (allocation 1, extents 4x3) while allocating gadget (node toolbar, owner GtkToolbar)

(SWT:1612): Gtk-CRITICAL **: 16:47:45.533: gtk_box_gadget_distribute: assertion 'size >= 0' failed in GtkScrollbar

(SWT:1612): Gtk-CRITICAL **: 16:47:45.544: gtk_box_gadget_distribute: assertion 'size >= 0' failed in GtkScrollbar

(SWT:1612): Gtk-WARNING **: 16:47:45.549: Negative content width -6 (allocation 1, extents 4x3) while allocating gadget (node toolbar, owner GtkToolbar)

(SWT:1612): Gtk-CRITICAL **: 16:47:45.558: gtk_box_gadget_distribute: assertion 'size >= 0' failed in GtkScrollbar

(SWT:1612): Gtk-CRITICAL **: 16:47:45.561: gtk_box_gadget_distribute: assertion 'size >= 0' failed in GtkScrollbar

(SWT:1612): Gtk-CRITICAL **: 16:47:45.574: gtk_box_gadget_distribute: assertion 'size >= 0' failed in GtkScrollbar

(SWT:1612): Gtk-CRITICAL **: 16:47:45.575: gtk_box_gadget_distribute: assertion 'size >= 0' failed in GtkScrollbar

(SWT:1612): Gtk-CRITICAL **: 16:47:45.575: gtk_box_gadget_distribute: assertion 'size >= 0' failed in GtkScrollbar

(SWT:1612): Gtk-CRITICAL **: 16:47:45.580: gtk_box_gadget_distribute: assertion 'size >= 0' failed in GtkScrollbar

(SWT:1612): Gtk-CRITICAL **: 16:47:45.580: gtk_box_gadget_distribute: assertion 'size >= 0' failed in GtkScrollbar

(SWT:1612): Gtk-CRITICAL **: 16:47:45.592: gtk_box_gadget_distribute: assertion 'size >= 0' failed in GtkScrollbar

(SWT:1612): Gtk-CRITICAL **: 16:47:45.594: gtk_box_gadget_distribute: assertion 'size >= 0' failed in GtkScrollbar

(SWT:1612): Gtk-CRITICAL **: 16:47:45.595: gtk_box_gadget_distribute: assertion 'size >= 0' failed in GtkScrollbar

(SWT:1612): Gtk-CRITICAL **: 16:47:45.611: gtk_box_gadget_distribute: assertion 'size >= 0' failed in GtkScrollbar

(SWT:1612): Gtk-CRITICAL **: 16:47:45.611: gtk_box_gadget_distribute: assertion 'size >= 0' failed in GtkScrollbar

(SWT:1612): Gtk-CRITICAL **: 16:47:45.628: gtk_box_gadget_distribute: assertion 'size >= 0' failed in GtkScrollbar

(SWT:1612): Gtk-CRITICAL **: 16:47:45.628: gtk_box_gadget_distribute: assertion 'size >= 0' failed in GtkScrollbar

(SWT:1612): Gtk-CRITICAL **: 16:47:45.644: gtk_box_gadget_distribute: assertion 'size >= 0' failed in GtkScrollbar

(SWT:1612): Gtk-CRITICAL **: 16:47:45.644: gtk_box_gadget_distribute: assertion 'size >= 0' failed in GtkScrollbar

(SWT:1612): Gtk-CRITICAL **: 16:47:45.661: gtk_box_gadget_distribute: assertion 'size >= 0' failed in GtkScrollbar

(SWT:1612): Gtk-CRITICAL **: 16:47:45.661: gtk_box_gadget_distribute: assertion 'size >= 0' failed in GtkScrollbar

(SWT:1612): Gtk-CRITICAL **: 16:47:45.678: gtk_box_gadget_distribute: assertion 'size >= 0' failed in GtkScrollbar

(SWT:1612): Gtk-CRITICAL **: 16:47:45.678: gtk_box_gadget_distribute: assertion 'size >= 0' failed in GtkScrollbar

(SWT:1612): Gtk-CRITICAL **: 16:47:45.694: gtk_box_gadget_distribute: assertion 'size >= 0' failed in GtkScrollbar

(SWT:1612): Gtk-CRITICAL **: 16:47:45.694: gtk_box_gadget_distribute: assertion 'size >= 0' failed in GtkScrollbar

(SWT:1612): Gtk-CRITICAL **: 16:47:45.702: gtk_box_gadget_distribute: assertion 'size >= 0' failed in GtkScrollbar

(SWT:1612): Gtk-CRITICAL **: 16:47:45.703: gtk_box_gadget_distribute: assertion 'size >= 0' failed in GtkScrollbar

(SWT:1612): Gtk-CRITICAL **: 16:47:45.704: gtk_box_gadget_distribute: assertion 'size >= 0' failed in GtkScrollbar

(SWT:1612): Gtk-CRITICAL **: 16:47:45.705: gtk_box_gadget_distribute: assertion 'size >= 0' failed in GtkScrollbar

(SWT:1612): Gtk-CRITICAL **: 16:47:45.705: gtk_box_gadget_distribute: assertion 'size >= 0' failed in GtkScrollbar

(SWT:1612): Gtk-CRITICAL **: 16:47:45.706: gtk_box_gadget_distribute: assertion 'size >= 0' failed in GtkScrollbar

(SWT:1612): Gtk-CRITICAL **: 16:47:45.716: gtk_box_gadget_distribute: assertion 'size >= 0' failed in GtkScrollbar

(SWT:1612): Gtk-CRITICAL **: 16:47:45.718: gtk_box_gadget_distribute: assertion 'size >= 0' failed in GtkScrollbar

(SWT:1612): Gtk-CRITICAL **: 16:47:45.727: gtk_box_gadget_distribute: assertion 'size >= 0' failed in GtkScrollbar

(SWT:1612): Gtk-CRITICAL **: 16:47:45.727: gtk_box_gadget_distribute: assertion 'size >= 0' failed in GtkScrollbar

(SWT:1612): Gtk-CRITICAL **: 16:47:45.734: gtk_box_gadget_distribute: assertion 'size >= 0' failed in GtkScrollbar

(SWT:1612): Gtk-CRITICAL **: 16:47:45.734: gtk_box_gadget_distribute: assertion 'size >= 0' failed in GtkScrollbar

(SWT:1612): Gtk-CRITICAL **: 16:47:45.736: gtk_box_gadget_distribute: assertion 'size >= 0' failed in GtkScrollbar

(SWT:1612): Gtk-CRITICAL **: 16:47:45.747: gtk_box_gadget_distribute: assertion 'size >= 0' failed in GtkScrollbar

(SWT:1612): Gtk-CRITICAL **: 16:47:45.747: gtk_box_gadget_distribute: assertion 'size >= 0' failed in GtkScrollbar

(SWT:1612): Gtk-CRITICAL **: 16:47:45.765: gtk_box_gadget_distribute: assertion 'size >= 0' failed in GtkScrollbar

(SWT:1612): Gtk-WARNING **: 16:47:45.793: Negative content width -6 (allocation 1, extents 4x3) while allocating gadget (node toolbar, owner GtkToolbar)

(SWT:1612): Gtk-CRITICAL **: 16:47:46.978: gtk_box_gadget_distribute: assertion 'size >= 0' failed in GtkScrollbar

(SWT:1612): Gtk-CRITICAL **: 16:47:46.979: gtk_box_gadget_distribute: assertion 'size >= 0' failed in GtkScrollbar

(SWT:1612): Gtk-WARNING **: 16:47:47.142: Negative content width -6 (allocation 1, extents 4x3) while allocating gadget (node toolbar, owner GtkToolbar)

(SWT:1612): Gtk-WARNING **: 16:47:47.159: Negative content width -6 (allocation 1, extents 4x3) while allocating gadget (node toolbar, owner GtkToolbar)

(SWT:1612): Gtk-WARNING **: 16:47:47.757: Negative content width -6 (allocation 1, extents 4x3) while allocating gadget (node toolbar, owner GtkToolbar)

(SWT:1612): Gtk-CRITICAL **: 16:47:48.120: gtk_box_gadget_distribute: assertion 'size >= 0' failed in GtkScrollbar

(SWT:1612): Gtk-CRITICAL **: 16:47:48.132: gtk_box_gadget_distribute: assertion 'size >= 0' failed in GtkScrollbar

(SWT:1612): Gtk-WARNING **: 16:47:48.138: Negative content width -6 (allocation 1, extents 4x3) while allocating gadget (node toolbar, owner GtkToolbar)

(SWT:1612): Gtk-CRITICAL **: 16:47:48.151: gtk_box_gadget_distribute: assertion 'size >= 0' failed in GtkScrollbar

(SWT:1612): Gtk-CRITICAL **: 16:47:48.157: gtk_box_gadget_distribute: assertion 'size >= 0' failed in GtkScrollbar

(SWT:1612): Gtk-CRITICAL **: 16:47:48.163: gtk_box_gadget_distribute: assertion 'size >= 0' failed in GtkScrollbar

(SWT:1612): Gtk-CRITICAL **: 16:47:48.165: gtk_box_gadget_distribute: assertion 'size >= 0' failed in GtkScrollbar

(SWT:1612): Gtk-CRITICAL **: 16:47:48.165: gtk_box_gadget_distribute: assertion 'size >= 0' failed in GtkScrollbar

(SWT:1612): Gtk-CRITICAL **: 16:47:48.170: gtk_box_gadget_distribute: assertion 'size >= 0' failed in GtkScrollbar

(SWT:1612): Gtk-CRITICAL **: 16:47:48.170: gtk_box_gadget_distribute: assertion 'size >= 0' failed in GtkScrollbar

(SWT:1612): Gtk-CRITICAL **: 16:47:48.188: gtk_box_gadget_distribute: assertion 'size >= 0' failed in GtkScrollbar

(SWT:1612): Gtk-CRITICAL **: 16:47:48.197: gtk_box_gadget_distribute: assertion 'size >= 0' failed in GtkScrollbar

(SWT:1612): Gtk-CRITICAL **: 16:47:48.197: gtk_box_gadget_distribute: assertion 'size >= 0' failed in GtkScrollbar

(SWT:1612): Gtk-CRITICAL **: 16:47:48.213: gtk_box_gadget_distribute: assertion 'size >= 0' failed in GtkScrollbar

(SWT:1612): Gtk-CRITICAL **: 16:47:48.213: gtk_box_gadget_distribute: assertion 'size >= 0' failed in GtkScrollbar

(SWT:1612): Gtk-CRITICAL **: 16:47:48.230: gtk_box_gadget_distribute: assertion 'size >= 0' failed in GtkScrollbar

(SWT:1612): Gtk-CRITICAL **: 16:47:48.230: gtk_box_gadget_distribute: assertion 'size >= 0' failed in GtkScrollbar

(SWT:1612): Gtk-CRITICAL **: 16:47:48.246: gtk_box_gadget_distribute: assertion 'size >= 0' failed in GtkScrollbar

(SWT:1612): Gtk-CRITICAL **: 16:47:48.246: gtk_box_gadget_distribute: assertion 'size >= 0' failed in GtkScrollbar

(SWT:1612): Gtk-CRITICAL **: 16:47:48.263: gtk_box_gadget_distribute: assertion 'size >= 0' failed in GtkScrollbar

(SWT:1612): Gtk-CRITICAL **: 16:47:48.263: gtk_box_gadget_distribute: assertion 'size >= 0' failed in GtkScrollbar

(SWT:1612): Gtk-CRITICAL **: 16:47:48.280: gtk_box_gadget_distribute: assertion 'size >= 0' failed in GtkScrollbar

(SWT:1612): Gtk-CRITICAL **: 16:47:48.280: gtk_box_gadget_distribute: assertion 'size >= 0' failed in GtkScrollbar

(SWT:1612): Gtk-CRITICAL **: 16:47:48.292: gtk_box_gadget_distribute: assertion 'size >= 0' failed in GtkScrollbar

(SWT:1612): Gtk-CRITICAL **: 16:47:48.293: gtk_box_gadget_distribute: assertion 'size >= 0' failed in GtkScrollbar

(SWT:1612): Gtk-CRITICAL **: 16:47:48.294: gtk_box_gadget_distribute: assertion 'size >= 0' failed in GtkScrollbar

(SWT:1612): Gtk-CRITICAL **: 16:47:48.295: gtk_box_gadget_distribute: assertion 'size >= 0' failed in GtkScrollbar

(SWT:1612): Gtk-CRITICAL **: 16:47:48.296: gtk_box_gadget_distribute: assertion 'size >= 0' failed in GtkScrollbar

(SWT:1612): Gtk-CRITICAL **: 16:47:48.297: gtk_box_gadget_distribute: assertion 'size >= 0' failed in GtkScrollbar

(SWT:1612): Gtk-CRITICAL **: 16:47:48.297: gtk_box_gadget_distribute: assertion 'size >= 0' failed in GtkScrollbar

(SWT:1612): Gtk-CRITICAL **: 16:47:48.303: gtk_box_gadget_distribute: assertion 'size >= 0' failed in GtkScrollbar

(SWT:1612): Gtk-CRITICAL **: 16:47:48.306: gtk_box_gadget_distribute: assertion 'size >= 0' failed in GtkScrollbar

(SWT:1612): Gtk-CRITICAL **: 16:47:48.307: gtk_box_gadget_distribute: assertion 'size >= 0' failed in GtkScrollbar

(SWT:1612): Gtk-CRITICAL **: 16:47:48.307: gtk_box_gadget_distribute: assertion 'size >= 0' failed in GtkScrollbar

(SWT:1612): Gtk-CRITICAL **: 16:47:48.319: gtk_box_gadget_distribute: assertion 'size >= 0' failed in GtkScrollbar

(SWT:1612): Gtk-CRITICAL **: 16:47:48.320: gtk_box_gadget_distribute: assertion 'size >= 0' failed in GtkScrollbar

(SWT:1612): Gtk-CRITICAL **: 16:47:48.329: gtk_box_gadget_distribute: assertion 'size >= 0' failed in GtkScrollbar

(SWT:1612): Gtk-CRITICAL **: 16:47:48.330: gtk_box_gadget_distribute: assertion 'size >= 0' failed in GtkScrollbar

(SWT:1612): Gtk-CRITICAL **: 16:47:48.353: gtk_box_gadget_distribute: assertion 'size >= 0' failed in GtkScrollbar

(SWT:1612): Gtk-WARNING **: 16:47:48.395: Negative content width -6 (allocation 1, extents 4x3) while allocating gadget (node toolbar, owner GtkToolbar)

(SWT:1612): Gtk-WARNING **: 16:47:49.646: Negative content width -6 (allocation 1, extents 4x3) while allocating gadget (node toolbar, owner GtkToolbar)

(SWT:1612): Gtk-WARNING **: 16:47:49.665: Negative content width -6 (allocation 1, extents 4x3) while allocating gadget (node toolbar, owner GtkToolbar)

(SWT:1612): Gtk-WARNING **: 16:47:50.298: Negative content width -6 (allocation 1, extents 4x3) while allocating gadget (node toolbar, owner GtkToolbar)

(SWT:1612): Gtk-CRITICAL **: 16:47:50.819: gtk_box_gadget_distribute: assertion 'size >= 0' failed in GtkScrollbar

(SWT:1612): Gtk-CRITICAL **: 16:47:50.830: gtk_box_gadget_distribute: assertion 'size >= 0' failed in GtkScrollbar

(SWT:1612): Gtk-WARNING **: 16:47:50.835: Negative content width -6 (allocation 1, extents 4x3) while allocating gadget (node toolbar, owner GtkToolbar)

(SWT:1612): Gtk-CRITICAL **: 16:47:50.848: gtk_box_gadget_distribute: assertion 'size >= 0' failed in GtkScrollbar

(SWT:1612): Gtk-CRITICAL **: 16:47:50.853: gtk_box_gadget_distribute: assertion 'size >= 0' failed in GtkScrollbar

(SWT:1612): Gtk-CRITICAL **: 16:47:50.855: gtk_box_gadget_distribute: assertion 'size >= 0' failed in GtkScrollbar

(SWT:1612): Gtk-CRITICAL **: 16:47:50.855: gtk_box_gadget_distribute: assertion 'size >= 0' failed in GtkScrollbar

(SWT:1612): Gtk-CRITICAL **: 16:47:50.860: gtk_box_gadget_distribute: assertion 'size >= 0' failed in GtkScrollbar

(SWT:1612): Gtk-CRITICAL **: 16:47:50.860: gtk_box_gadget_distribute: assertion 'size >= 0' failed in GtkScrollbar

(SWT:1612): Gtk-CRITICAL **: 16:47:50.873: gtk_box_gadget_distribute: assertion 'size >= 0' failed in GtkScrollbar

(SWT:1612): Gtk-CRITICAL **: 16:47:50.887: gtk_box_gadget_distribute: assertion 'size >= 0' failed in GtkScrollbar

(SWT:1612): Gtk-CRITICAL **: 16:47:50.887: gtk_box_gadget_distribute: assertion 'size >= 0' failed in GtkScrollbar

(SWT:1612): Gtk-CRITICAL **: 16:47:50.904: gtk_box_gadget_distribute: assertion 'size >= 0' failed in GtkScrollbar

(SWT:1612): Gtk-CRITICAL **: 16:47:50.904: gtk_box_gadget_distribute: assertion 'size >= 0' failed in GtkScrollbar

(SWT:1612): Gtk-CRITICAL **: 16:47:50.921: gtk_box_gadget_distribute: assertion 'size >= 0' failed in GtkScrollbar

(SWT:1612): Gtk-CRITICAL **: 16:47:50.921: gtk_box_gadget_distribute: assertion 'size >= 0' failed in GtkScrollbar

(SWT:1612): Gtk-CRITICAL **: 16:47:50.937: gtk_box_gadget_distribute: assertion 'size >= 0' failed in GtkScrollbar

(SWT:1612): Gtk-CRITICAL **: 16:47:50.937: gtk_box_gadget_distribute: assertion 'size >= 0' failed in GtkScrollbar

(SWT:1612): Gtk-CRITICAL **: 16:47:50.954: gtk_box_gadget_distribute: assertion 'size >= 0' failed in GtkScrollbar

(SWT:1612): Gtk-CRITICAL **: 16:47:50.954: gtk_box_gadget_distribute: assertion 'size >= 0' failed in GtkScrollbar

(SWT:1612): Gtk-CRITICAL **: 16:47:50.970: gtk_box_gadget_distribute: assertion 'size >= 0' failed in GtkScrollbar

(SWT:1612): Gtk-CRITICAL **: 16:47:50.970: gtk_box_gadget_distribute: assertion 'size >= 0' failed in GtkScrollbar

(SWT:1612): Gtk-CRITICAL **: 16:47:50.997: gtk_box_gadget_distribute: assertion 'size >= 0' failed in GtkScrollbar

(SWT:1612): Gtk-CRITICAL **: 16:47:50.997: gtk_box_gadget_distribute: assertion 'size >= 0' failed in GtkScrollbar

(SWT:1612): Gtk-CRITICAL **: 16:47:51.004: gtk_box_gadget_distribute: assertion 'size >= 0' failed in GtkScrollbar

(SWT:1612): Gtk-CRITICAL **: 16:47:51.005: gtk_box_gadget_distribute: assertion 'size >= 0' failed in GtkScrollbar

(SWT:1612): Gtk-CRITICAL **: 16:47:51.021: gtk_box_gadget_distribute: assertion 'size >= 0' failed in GtkScrollbar

(SWT:1612): Gtk-CRITICAL **: 16:47:51.021: gtk_box_gadget_distribute: assertion 'size >= 0' failed in GtkScrollbar

(SWT:1612): Gtk-CRITICAL **: 16:47:51.037: gtk_box_gadget_distribute: assertion 'size >= 0' failed in GtkScrollbar

(SWT:1612): Gtk-CRITICAL **: 16:47:51.038: gtk_box_gadget_distribute: assertion 'size >= 0' failed in GtkScrollbar

(SWT:1612): Gtk-CRITICAL **: 16:47:51.055: gtk_box_gadget_distribute: assertion 'size >= 0' failed in GtkScrollbar

(SWT:1612): Gtk-CRITICAL **: 16:47:51.056: gtk_box_gadget_distribute: assertion 'size >= 0' failed in GtkScrollbar

(SWT:1612): Gtk-CRITICAL **: 16:47:51.057: gtk_box_gadget_distribute: assertion 'size >= 0' failed in GtkScrollbar

(SWT:1612): Gtk-CRITICAL **: 16:47:51.057: gtk_box_gadget_distribute: assertion 'size >= 0' failed in GtkScrollbar

(SWT:1612): Gtk-CRITICAL **: 16:47:51.061: gtk_box_gadget_distribute: assertion 'size >= 0' failed in GtkScrollbar

(SWT:1612): Gtk-CRITICAL **: 16:47:51.061: gtk_box_gadget_distribute: assertion 'size >= 0' failed in GtkScrollbar

(SWT:1612): Gtk-CRITICAL **: 16:47:51.070: gtk_box_gadget_distribute: assertion 'size >= 0' failed in GtkScrollbar

(SWT:1612): Gtk-CRITICAL **: 16:47:51.094: gtk_box_gadget_distribute: assertion 'size >= 0' failed in GtkScrollbar

(SWT:1612): Gtk-CRITICAL **: 16:47:51.094: gtk_box_gadget_distribute: assertion 'size >= 0' failed in GtkScrollbar

(SWT:1612): Gtk-CRITICAL **: 16:47:51.096: gtk_box_gadget_distribute: assertion 'size >= 0' failed in GtkScrollbar

(SWT:1612): Gtk-CRITICAL **: 16:47:51.097: gtk_box_gadget_distribute: assertion 'size >= 0' failed in GtkScrollbar

(SWT:1612): Gtk-CRITICAL **: 16:47:51.097: gtk_box_gadget_distribute: assertion 'size >= 0' failed in GtkScrollbar

(SWT:1612): Gtk-CRITICAL **: 16:47:51.098: gtk_box_gadget_distribute: assertion 'size >= 0' failed in GtkScrollbar

(SWT:1612): Gtk-CRITICAL **: 16:47:51.116: gtk_box_gadget_distribute: assertion 'size >= 0' failed in GtkScrollbar

(SWT:1612): Gtk-CRITICAL **: 16:47:51.116: gtk_box_gadget_distribute: assertion 'size >= 0' failed in GtkScrollbar

(SWT:1612): Gtk-CRITICAL **: 16:47:51.117: gtk_box_gadget_distribute: assertion 'size >= 0' failed in GtkScrollbar

(SWT:1612): Gtk-CRITICAL **: 16:47:51.132: gtk_box_gadget_distribute: assertion 'size >= 0' failed in GtkScrollbar

(SWT:1612): Gtk-CRITICAL **: 16:47:51.149: gtk_box_gadget_distribute: assertion 'size >= 0' failed in GtkScrollbar

(SWT:1612): Gtk-CRITICAL **: 16:47:51.150: gtk_box_gadget_distribute: assertion 'size >= 0' failed in GtkScrollbar

(SWT:1612): Gtk-CRITICAL **: 16:47:51.151: gtk_box_gadget_distribute: assertion 'size >= 0' failed in GtkScrollbar

(SWT:1612): Gtk-CRITICAL **: 16:47:51.153: gtk_box_gadget_distribute: assertion 'size >= 0' failed in GtkScrollbar

(SWT:1612): Gtk-CRITICAL **: 16:47:51.295: gtk_box_gadget_distribute: assertion 'size >= 0' failed in GtkScrollbar

(SWT:1612): Gtk-CRITICAL **: 16:47:51.296: gtk_box_gadget_distribute: assertion 'size >= 0' failed in GtkScrollbar

(SWT:1612): Gtk-CRITICAL **: 16:47:51.296: gtk_box_gadget_distribute: assertion 'size >= 0' failed in GtkScrollbar

(SWT:1612): Gtk-CRITICAL **: 16:47:51.314: gtk_box_gadget_distribute: assertion 'size >= 0' failed in GtkScrollbar

(SWT:1612): Gtk-CRITICAL **: 16:47:51.399: gtk_box_gadget_distribute: assertion 'size >= 0' failed in GtkScrollbar

(SWT:1612): Gtk-CRITICAL **: 16:47:51.400: gtk_box_gadget_distribute: assertion 'size >= 0' failed in GtkScrollbar

(SWT:1612): Gtk-CRITICAL **: 16:47:51.400: gtk_box_gadget_distribute: assertion 'size >= 0' failed in GtkScrollbar

(SWT:1612): Gtk-CRITICAL **: 16:47:51.415: gtk_box_gadget_distribute: assertion 'size >= 0' failed in GtkScrollbar

(SWT:1612): Gtk-CRITICAL **: 16:47:51.490: gtk_box_gadget_distribute: assertion 'size >= 0' failed in GtkScrollbar

(SWT:1612): Gtk-CRITICAL **: 16:47:51.497: gtk_box_gadget_distribute: assertion 'size >= 0' failed in GtkScrollbar

(SWT:1612): Gtk-CRITICAL **: 16:47:51.509: gtk_box_gadget_distribute: assertion 'size >= 0' failed in GtkScrollbar

(SWT:1612): Gtk-CRITICAL **: 16:47:51.509: gtk_box_gadget_distribute: assertion 'size >= 0' failed in GtkScrollbar

(SWT:1612): Gtk-CRITICAL **: 16:47:51.510: gtk_box_gadget_distribute: assertion 'size >= 0' failed in GtkScrollbar

(SWT:1612): Gtk-CRITICAL **: 16:47:51.511: gtk_box_gadget_distribute: assertion 'size >= 0' failed in GtkScrollbar

(SWT:1612): Gtk-CRITICAL **: 16:47:51.512: gtk_box_gadget_distribute: assertion 'size >= 0' failed in GtkScrollbar

(SWT:1612): Gtk-CRITICAL **: 16:47:51.512: gtk_box_gadget_distribute: assertion 'size >= 0' failed in GtkScrollbar

(SWT:1612): Gtk-CRITICAL **: 16:47:51.517: gtk_box_gadget_distribute: assertion 'size >= 0' failed in GtkScrollbar

(SWT:1612): Gtk-CRITICAL **: 16:47:51.526: gtk_box_gadget_distribute: assertion 'size >= 0' failed in GtkScrollbar

(SWT:1612): Gtk-CRITICAL **: 16:47:51.595: gtk_box_gadget_distribute: assertion 'size >= 0' failed in GtkScrollbar

(SWT:1612): Gtk-CRITICAL **: 16:47:51.595: gtk_box_gadget_distribute: assertion 'size >= 0' failed in GtkScrollbar

(SWT:1612): Gtk-CRITICAL **: 16:47:51.607: gtk_box_gadget_distribute: assertion 'size >= 0' failed in GtkScrollbar

(SWT:1612): Gtk-CRITICAL **: 16:47:51.615: gtk_box_gadget_distribute: assertion 'size >= 0' failed in GtkScrollbar

(SWT:1612): Gtk-CRITICAL **: 16:47:51.617: gtk_box_gadget_distribute: assertion 'size >= 0' failed in GtkScrollbar

(SWT:1612): Gtk-CRITICAL **: 16:47:51.617: gtk_box_gadget_distribute: assertion 'size >= 0' failed in GtkScrollbar

(SWT:1612): Gtk-CRITICAL **: 16:47:51.621: gtk_box_gadget_distribute: assertion 'size >= 0' failed in GtkScrollbar

(SWT:1612): Gtk-CRITICAL **: 16:47:51.630: gtk_box_gadget_distribute: assertion 'size >= 0' failed in GtkScrollbar

(SWT:1612): Gtk-WARNING **: 16:47:51.738: Negative content width -6 (allocation 1, extents 4x3) while allocating gadget (node toolbar, owner GtkToolbar)

(SWT:1612): Gtk-WARNING **: 16:47:52.793: Negative content width -6 (allocation 1, extents 4x3) while allocating gadget (node toolbar, owner GtkToolbar)

(SWT:1612): Gtk-WARNING **: 16:47:52.811: Negative content width -6 (allocation 1, extents 4x3) while allocating gadget (node toolbar, owner GtkToolbar)
Tests run: 10, Failures: 0, Errors: 0, Skipped: 0, Time elapsed: 27.255 s - in org.eclipse.egit.ui.test.stagview.StagingViewTest
testAmend(org.eclipse.egit.ui.test.stagview.StagingViewTest)  Time elapsed: 2.702 s
testCommitSingleFile(org.eclipse.egit.ui.test.stagview.StagingViewTest)  Time elapsed: 2.835 s
testMergeConflict(org.eclipse.egit.ui.test.stagview.StagingViewTest)  Time elapsed: 3.183 s
testCommitMessageConfigChangeAmending(org.eclipse.egit.ui.test.stagview.StagingViewTest)  Time elapsed: 2.262 s
testCommitMessageConfigChangeWithAuthor(org.eclipse.egit.ui.test.stagview.StagingViewTest)  Time elapsed: 2.772 s
testCommitMessageConfigChange(org.eclipse.egit.ui.test.stagview.StagingViewTest)  Time elapsed: 2.623 s
testCommitMessageConfigChangeBranchSwitchToNew(org.eclipse.egit.ui.test.stagview.StagingViewTest)  Time elapsed: 2.513 s
testCommitMessageCommitterChangeSignOff(org.eclipse.egit.ui.test.stagview.StagingViewTest)  Time elapsed: 2.679 s
testCommitMessageConfigChangeNoSignOff(org.eclipse.egit.ui.test.stagview.StagingViewTest)  Time elapsed: 2.506 s
testDeleteModifyConflict(org.eclipse.egit.ui.test.stagview.StagingViewTest)  Time elapsed: 3.146 s
Running org.eclipse.egit.ui.test.stagview.CommitMessageProvidersTest

(SWT:1612): Gtk-WARNING **: 16:47:53.453: Negative content width -6 (allocation 1, extents 4x3) while allocating gadget (node toolbar, owner GtkToolbar)

(SWT:1612): Gtk-CRITICAL **: 16:47:53.859: gtk_box_gadget_distribute: assertion 'size >= 0' failed in GtkScrollbar

(SWT:1612): Gtk-CRITICAL **: 16:47:53.868: gtk_box_gadget_distribute: assertion 'size >= 0' failed in GtkScrollbar

(SWT:1612): Gtk-WARNING **: 16:47:53.873: Negative content width -6 (allocation 1, extents 4x3) while allocating gadget (node toolbar, owner GtkToolbar)

(SWT:1612): Gtk-CRITICAL **: 16:47:53.884: gtk_box_gadget_distribute: assertion 'size >= 0' failed in GtkScrollbar

(SWT:1612): Gtk-CRITICAL **: 16:47:53.892: gtk_box_gadget_distribute: assertion 'size >= 0' failed in GtkScrollbar

(SWT:1612): Gtk-CRITICAL **: 16:47:53.893: gtk_box_gadget_distribute: assertion 'size >= 0' failed in GtkScrollbar

(SWT:1612): Gtk-CRITICAL **: 16:47:53.893: gtk_box_gadget_distribute: assertion 'size >= 0' failed in GtkScrollbar

(SWT:1612): Gtk-CRITICAL **: 16:47:53.894: gtk_box_gadget_distribute: assertion 'size >= 0' failed in GtkScrollbar

(SWT:1612): Gtk-CRITICAL **: 16:47:53.895: gtk_box_gadget_distribute: assertion 'size >= 0' failed in GtkScrollbar

(SWT:1612): Gtk-CRITICAL **: 16:47:53.901: gtk_box_gadget_distribute: assertion 'size >= 0' failed in GtkScrollbar

(SWT:1612): Gtk-CRITICAL **: 16:47:53.901: gtk_box_gadget_distribute: assertion 'size >= 0' failed in GtkScrollbar

(SWT:1612): Gtk-CRITICAL **: 16:47:53.915: gtk_box_gadget_distribute: assertion 'size >= 0' failed in GtkScrollbar

(SWT:1612): Gtk-CRITICAL **: 16:47:53.931: gtk_box_gadget_distribute: assertion 'size >= 0' failed in GtkScrollbar

(SWT:1612): Gtk-CRITICAL **: 16:47:53.931: gtk_box_gadget_distribute: assertion 'size >= 0' failed in GtkScrollbar

(SWT:1612): Gtk-CRITICAL **: 16:47:53.947: gtk_box_gadget_distribute: assertion 'size >= 0' failed in GtkScrollbar

(SWT:1612): Gtk-CRITICAL **: 16:47:53.947: gtk_box_gadget_distribute: assertion 'size >= 0' failed in GtkScrollbar

(SWT:1612): Gtk-CRITICAL **: 16:47:53.963: gtk_box_gadget_distribute: assertion 'size >= 0' failed in GtkScrollbar

(SWT:1612): Gtk-CRITICAL **: 16:47:53.963: gtk_box_gadget_distribute: assertion 'size >= 0' failed in GtkScrollbar

(SWT:1612): Gtk-CRITICAL **: 16:47:53.980: gtk_box_gadget_distribute: assertion 'size >= 0' failed in GtkScrollbar

(SWT:1612): Gtk-CRITICAL **: 16:47:53.980: gtk_box_gadget_distribute: assertion 'size >= 0' failed in GtkScrollbar

(SWT:1612): Gtk-CRITICAL **: 16:47:53.997: gtk_box_gadget_distribute: assertion 'size >= 0' failed in GtkScrollbar

(SWT:1612): Gtk-CRITICAL **: 16:47:53.997: gtk_box_gadget_distribute: assertion 'size >= 0' failed in GtkScrollbar

(SWT:1612): Gtk-CRITICAL **: 16:47:54.014: gtk_box_gadget_distribute: assertion 'size >= 0' failed in GtkScrollbar

(SWT:1612): Gtk-CRITICAL **: 16:47:54.014: gtk_box_gadget_distribute: assertion 'size >= 0' failed in GtkScrollbar

(SWT:1612): Gtk-CRITICAL **: 16:47:54.046: gtk_box_gadget_distribute: assertion 'size >= 0' failed in GtkScrollbar

(SWT:1612): Gtk-CRITICAL **: 16:47:54.046: gtk_box_gadget_distribute: assertion 'size >= 0' failed in GtkScrollbar

(SWT:1612): Gtk-CRITICAL **: 16:47:54.054: gtk_box_gadget_distribute: assertion 'size >= 0' failed in GtkScrollbar

(SWT:1612): Gtk-CRITICAL **: 16:47:54.054: gtk_box_gadget_distribute: assertion 'size >= 0' failed in GtkScrollbar

(SWT:1612): Gtk-CRITICAL **: 16:47:54.064: gtk_box_gadget_distribute: assertion 'size >= 0' failed in GtkScrollbar

(SWT:1612): Gtk-CRITICAL **: 16:47:54.064: gtk_box_gadget_distribute: assertion 'size >= 0' failed in GtkScrollbar

(SWT:1612): Gtk-CRITICAL **: 16:47:54.080: gtk_box_gadget_distribute: assertion 'size >= 0' failed in GtkScrollbar

(SWT:1612): Gtk-CRITICAL **: 16:47:54.080: gtk_box_gadget_distribute: assertion 'size >= 0' failed in GtkScrollbar

(SWT:1612): Gtk-CRITICAL **: 16:47:54.092: gtk_box_gadget_distribute: assertion 'size >= 0' failed in GtkScrollbar

(SWT:1612): Gtk-CRITICAL **: 16:47:54.092: gtk_box_gadget_distribute: assertion 'size >= 0' failed in GtkScrollbar

(SWT:1612): Gtk-CRITICAL **: 16:47:54.097: gtk_box_gadget_distribute: assertion 'size >= 0' failed in GtkScrollbar

(SWT:1612): Gtk-CRITICAL **: 16:47:54.097: gtk_box_gadget_distribute: assertion 'size >= 0' failed in GtkScrollbar

(SWT:1612): Gtk-CRITICAL **: 16:47:54.097: gtk_box_gadget_distribute: assertion 'size >= 0' failed in GtkScrollbar

(SWT:1612): Gtk-CRITICAL **: 16:47:54.113: gtk_box_gadget_distribute: assertion 'size >= 0' failed in GtkScrollbar

(SWT:1612): Gtk-WARNING **: 16:47:54.164: Negative content width -6 (allocation 1, extents 4x3) while allocating gadget (node toolbar, owner GtkToolbar)

(SWT:1612): Gtk-WARNING **: 16:47:55.326: Negative content width -6 (allocation 1, extents 4x3) while allocating gadget (node toolbar, owner GtkToolbar)

(SWT:1612): Gtk-WARNING **: 16:47:55.342: Negative content width -6 (allocation 1, extents 4x3) while allocating gadget (node toolbar, owner GtkToolbar)

(SWT:1612): Gtk-WARNING **: 16:47:55.960: Negative content width -6 (allocation 1, extents 4x3) while allocating gadget (node toolbar, owner GtkToolbar)

(SWT:1612): Gtk-CRITICAL **: 16:47:56.412: gtk_box_gadget_distribute: assertion 'size >= 0' failed in GtkScrollbar

(SWT:1612): Gtk-CRITICAL **: 16:47:56.421: gtk_box_gadget_distribute: assertion 'size >= 0' failed in GtkScrollbar

(SWT:1612): Gtk-WARNING **: 16:47:56.426: Negative content width -6 (allocation 1, extents 4x3) while allocating gadget (node toolbar, owner GtkToolbar)

(SWT:1612): Gtk-CRITICAL **: 16:47:56.435: gtk_box_gadget_distribute: assertion 'size >= 0' failed in GtkScrollbar

(SWT:1612): Gtk-CRITICAL **: 16:47:56.441: gtk_box_gadget_distribute: assertion 'size >= 0' failed in GtkScrollbar

!ENTRY org.eclipse.egit.ui 2 0 2019-09-20 16:47:56.449
!MESSAGE Found multiple implementations of ICommitMessageProvider2. Ignoring caret positioning for org.eclipse.egit.ui.test.stagview.CommitMessageProvidersTest$TestCommitMessageProvider.

(SWT:1612): Gtk-CRITICAL **: 16:47:56.449: gtk_box_gadget_distribute: assertion 'size >= 0' failed in GtkScrollbar

(SWT:1612): Gtk-CRITICAL **: 16:47:56.450: gtk_box_gadget_distribute: assertion 'size >= 0' failed in GtkScrollbar

(SWT:1612): Gtk-CRITICAL **: 16:47:56.452: gtk_box_gadget_distribute: assertion 'size >= 0' failed in GtkScrollbar

(SWT:1612): Gtk-CRITICAL **: 16:47:56.452: gtk_box_gadget_distribute: assertion 'size >= 0' failed in GtkScrollbar

(SWT:1612): Gtk-CRITICAL **: 16:47:56.458: gtk_box_gadget_distribute: assertion 'size >= 0' failed in GtkScrollbar

(SWT:1612): Gtk-CRITICAL **: 16:47:56.458: gtk_box_gadget_distribute: assertion 'size >= 0' failed in GtkScrollbar

(SWT:1612): Gtk-CRITICAL **: 16:47:56.474: gtk_box_gadget_distribute: assertion 'size >= 0' failed in GtkScrollbar

(SWT:1612): Gtk-CRITICAL **: 16:47:56.474: gtk_box_gadget_distribute: assertion 'size >= 0' failed in GtkScrollbar

(SWT:1612): Gtk-CRITICAL **: 16:47:56.489: gtk_box_gadget_distribute: assertion 'size >= 0' failed in GtkScrollbar

(SWT:1612): Gtk-CRITICAL **: 16:47:56.501: gtk_box_gadget_distribute: assertion 'size >= 0' failed in GtkScrollbar

(SWT:1612): Gtk-CRITICAL **: 16:47:56.501: gtk_box_gadget_distribute: assertion 'size >= 0' failed in GtkScrollbar

(SWT:1612): Gtk-CRITICAL **: 16:47:56.518: gtk_box_gadget_distribute: assertion 'size >= 0' failed in GtkScrollbar

(SWT:1612): Gtk-CRITICAL **: 16:47:56.518: gtk_box_gadget_distribute: assertion 'size >= 0' failed in GtkScrollbar

(SWT:1612): Gtk-CRITICAL **: 16:47:56.534: gtk_box_gadget_distribute: assertion 'size >= 0' failed in GtkScrollbar

(SWT:1612): Gtk-CRITICAL **: 16:47:56.534: gtk_box_gadget_distribute: assertion 'size >= 0' failed in GtkScrollbar

(SWT:1612): Gtk-CRITICAL **: 16:47:56.551: gtk_box_gadget_distribute: assertion 'size >= 0' failed in GtkScrollbar

(SWT:1612): Gtk-CRITICAL **: 16:47:56.551: gtk_box_gadget_distribute: assertion 'size >= 0' failed in GtkScrollbar

(SWT:1612): Gtk-CRITICAL **: 16:47:56.567: gtk_box_gadget_distribute: assertion 'size >= 0' failed in GtkScrollbar

(SWT:1612): Gtk-CRITICAL **: 16:47:56.567: gtk_box_gadget_distribute: assertion 'size >= 0' failed in GtkScrollbar

(SWT:1612): Gtk-CRITICAL **: 16:47:56.584: gtk_box_gadget_distribute: assertion 'size >= 0' failed in GtkScrollbar

(SWT:1612): Gtk-CRITICAL **: 16:47:56.584: gtk_box_gadget_distribute: assertion 'size >= 0' failed in GtkScrollbar

(SWT:1612): Gtk-CRITICAL **: 16:47:56.617: gtk_box_gadget_distribute: assertion 'size >= 0' failed in GtkScrollbar

(SWT:1612): Gtk-CRITICAL **: 16:47:56.617: gtk_box_gadget_distribute: assertion 'size >= 0' failed in GtkScrollbar

(SWT:1612): Gtk-CRITICAL **: 16:47:56.625: gtk_box_gadget_distribute: assertion 'size >= 0' failed in GtkScrollbar

(SWT:1612): Gtk-CRITICAL **: 16:47:56.625: gtk_box_gadget_distribute: assertion 'size >= 0' failed in GtkScrollbar

(SWT:1612): Gtk-CRITICAL **: 16:47:56.634: gtk_box_gadget_distribute: assertion 'size >= 0' failed in GtkScrollbar

(SWT:1612): Gtk-CRITICAL **: 16:47:56.634: gtk_box_gadget_distribute: assertion 'size >= 0' failed in GtkScrollbar

(SWT:1612): Gtk-CRITICAL **: 16:47:56.650: gtk_box_gadget_distribute: assertion 'size >= 0' failed in GtkScrollbar

(SWT:1612): Gtk-CRITICAL **: 16:47:56.670: gtk_box_gadget_distribute: assertion 'size >= 0' failed in GtkScrollbar

(SWT:1612): Gtk-CRITICAL **: 16:47:56.670: gtk_box_gadget_distribute: assertion 'size >= 0' failed in GtkScrollbar

(SWT:1612): Gtk-CRITICAL **: 16:47:56.674: gtk_box_gadget_distribute: assertion 'size >= 0' failed in GtkScrollbar

(SWT:1612): Gtk-WARNING **: 16:47:56.754: Negative content width -6 (allocation 1, extents 4x3) while allocating gadget (node toolbar, owner GtkToolbar)

(SWT:1612): Gtk-WARNING **: 16:47:58.007: Negative content width -6 (allocation 1, extents 4x3) while allocating gadget (node toolbar, owner GtkToolbar)

(SWT:1612): Gtk-WARNING **: 16:47:58.024: Negative content width -6 (allocation 1, extents 4x3) while allocating gadget (node toolbar, owner GtkToolbar)

(SWT:1612): Gtk-WARNING **: 16:47:58.609: Negative content width -6 (allocation 1, extents 4x3) while allocating gadget (node toolbar, owner GtkToolbar)

(SWT:1612): Gtk-CRITICAL **: 16:47:58.972: gtk_box_gadget_distribute: assertion 'size >= 0' failed in GtkScrollbar

(SWT:1612): Gtk-CRITICAL **: 16:47:58.983: gtk_box_gadget_distribute: assertion 'size >= 0' failed in GtkScrollbar

(SWT:1612): Gtk-WARNING **: 16:47:58.988: Negative content width -6 (allocation 1, extents 4x3) while allocating gadget (node toolbar, owner GtkToolbar)

(SWT:1612): Gtk-CRITICAL **: 16:47:58.999: gtk_box_gadget_distribute: assertion 'size >= 0' failed in GtkScrollbar

(SWT:1612): Gtk-CRITICAL **: 16:47:59.005: gtk_box_gadget_distribute: assertion 'size >= 0' failed in GtkScrollbar

(SWT:1612): Gtk-CRITICAL **: 16:47:59.013: gtk_box_gadget_distribute: assertion 'size >= 0' failed in GtkScrollbar

(SWT:1612): Gtk-CRITICAL **: 16:47:59.014: gtk_box_gadget_distribute: assertion 'size >= 0' failed in GtkScrollbar

(SWT:1612): Gtk-CRITICAL **: 16:47:59.015: gtk_box_gadget_distribute: assertion 'size >= 0' failed in GtkScrollbar

(SWT:1612): Gtk-CRITICAL **: 16:47:59.016: gtk_box_gadget_distribute: assertion 'size >= 0' failed in GtkScrollbar

(SWT:1612): Gtk-CRITICAL **: 16:47:59.016: gtk_box_gadget_distribute: assertion 'size >= 0' failed in GtkScrollbar

(SWT:1612): Gtk-CRITICAL **: 16:47:59.021: gtk_box_gadget_distribute: assertion 'size >= 0' failed in GtkScrollbar

(SWT:1612): Gtk-CRITICAL **: 16:47:59.022: gtk_box_gadget_distribute: assertion 'size >= 0' failed in GtkScrollbar

(SWT:1612): Gtk-CRITICAL **: 16:47:59.033: gtk_box_gadget_distribute: assertion 'size >= 0' failed in GtkScrollbar

(SWT:1612): Gtk-CRITICAL **: 16:47:59.049: gtk_box_gadget_distribute: assertion 'size >= 0' failed in GtkScrollbar

(SWT:1612): Gtk-CRITICAL **: 16:47:59.050: gtk_box_gadget_distribute: assertion 'size >= 0' failed in GtkScrollbar

(SWT:1612): Gtk-CRITICAL **: 16:47:59.066: gtk_box_gadget_distribute: assertion 'size >= 0' failed in GtkScrollbar

(SWT:1612): Gtk-CRITICAL **: 16:47:59.066: gtk_box_gadget_distribute: assertion 'size >= 0' failed in GtkScrollbar

(SWT:1612): Gtk-CRITICAL **: 16:47:59.082: gtk_box_gadget_distribute: assertion 'size >= 0' failed in GtkScrollbar

(SWT:1612): Gtk-CRITICAL **: 16:47:59.082: gtk_box_gadget_distribute: assertion 'size >= 0' failed in GtkScrollbar

(SWT:1612): Gtk-CRITICAL **: 16:47:59.099: gtk_box_gadget_distribute: assertion 'size >= 0' failed in GtkScrollbar

(SWT:1612): Gtk-CRITICAL **: 16:47:59.100: gtk_box_gadget_distribute: assertion 'size >= 0' failed in GtkScrollbar

(SWT:1612): Gtk-CRITICAL **: 16:47:59.116: gtk_box_gadget_distribute: assertion 'size >= 0' failed in GtkScrollbar

(SWT:1612): Gtk-CRITICAL **: 16:47:59.116: gtk_box_gadget_distribute: assertion 'size >= 0' failed in GtkScrollbar

(SWT:1612): Gtk-CRITICAL **: 16:47:59.133: gtk_box_gadget_distribute: assertion 'size >= 0' failed in GtkScrollbar

(SWT:1612): Gtk-CRITICAL **: 16:47:59.133: gtk_box_gadget_distribute: assertion 'size >= 0' failed in GtkScrollbar

(SWT:1612): Gtk-CRITICAL **: 16:47:59.165: gtk_box_gadget_distribute: assertion 'size >= 0' failed in GtkScrollbar

(SWT:1612): Gtk-CRITICAL **: 16:47:59.165: gtk_box_gadget_distribute: assertion 'size >= 0' failed in GtkScrollbar

(SWT:1612): Gtk-CRITICAL **: 16:47:59.173: gtk_box_gadget_distribute: assertion 'size >= 0' failed in GtkScrollbar

(SWT:1612): Gtk-CRITICAL **: 16:47:59.173: gtk_box_gadget_distribute: assertion 'size >= 0' failed in GtkScrollbar

(SWT:1612): Gtk-CRITICAL **: 16:47:59.182: gtk_box_gadget_distribute: assertion 'size >= 0' failed in GtkScrollbar

(SWT:1612): Gtk-CRITICAL **: 16:47:59.183: gtk_box_gadget_distribute: assertion 'size >= 0' failed in GtkScrollbar

(SWT:1612): Gtk-CRITICAL **: 16:47:59.199: gtk_box_gadget_distribute: assertion 'size >= 0' failed in GtkScrollbar

(SWT:1612): Gtk-CRITICAL **: 16:47:59.199: gtk_box_gadget_distribute: assertion 'size >= 0' failed in GtkScrollbar

(SWT:1612): Gtk-CRITICAL **: 16:47:59.216: gtk_box_gadget_distribute: assertion 'size >= 0' failed in GtkScrollbar

(SWT:1612): Gtk-CRITICAL **: 16:47:59.217: gtk_box_gadget_distribute: assertion 'size >= 0' failed in GtkScrollbar

(SWT:1612): Gtk-CRITICAL **: 16:47:59.234: gtk_box_gadget_distribute: assertion 'size >= 0' failed in GtkScrollbar

(SWT:1612): Gtk-CRITICAL **: 16:47:59.234: gtk_box_gadget_distribute: assertion 'size >= 0' failed in GtkScrollbar

(SWT:1612): Gtk-CRITICAL **: 16:47:59.238: gtk_box_gadget_distribute: assertion 'size >= 0' failed in GtkScrollbar

(SWT:1612): Gtk-CRITICAL **: 16:47:59.239: gtk_box_gadget_distribute: assertion 'size >= 0' failed in GtkScrollbar

(SWT:1612): Gtk-WARNING **: 16:47:59.281: Negative content width -6 (allocation 1, extents 4x3) while allocating gadget (node toolbar, owner GtkToolbar)

(SWT:1612): Gtk-CRITICAL **: 16:48:00.422: gtk_box_gadget_distribute: assertion 'size >= 0' failed in GtkScrollbar

(SWT:1612): Gtk-CRITICAL **: 16:48:00.422: gtk_box_gadget_distribute: assertion 'size >= 0' failed in GtkScrollbar

(SWT:1612): Gtk-WARNING **: 16:48:00.502: Negative content width -6 (allocation 1, extents 4x3) while allocating gadget (node toolbar, owner GtkToolbar)

(SWT:1612): Gtk-WARNING **: 16:48:00.521: Negative content width -6 (allocation 1, extents 4x3) while allocating gadget (node toolbar, owner GtkToolbar)
Tests run: 3, Failures: 0, Errors: 0, Skipped: 0, Time elapsed: 7.682 s - in org.eclipse.egit.ui.test.stagview.CommitMessageProvidersTest
testCaretPosition(org.eclipse.egit.ui.test.stagview.CommitMessageProvidersTest)  Time elapsed: 2.495 s
testTwoProvidersFromSameExtension(org.eclipse.egit.ui.test.stagview.CommitMessageProvidersTest)  Time elapsed: 2.68 s
testCaretPositionUndefined(org.eclipse.egit.ui.test.stagview.CommitMessageProvidersTest)  Time elapsed: 2.496 s
Running org.eclipse.egit.ui.test.history.HistoryViewTest

(SWT:1612): Gtk-WARNING **: 16:48:01.342: Negative content width -6 (allocation 1, extents 4x3) while allocating gadget (node toolbar, owner GtkToolbar)

(SWT:1612): Gtk-WARNING **: 16:48:01.343: Negative content width -6 (allocation 1, extents 4x3) while allocating gadget (node toolbar, owner GtkToolbar)

(SWT:1612): Gtk-WARNING **: 16:48:01.356: Negative content width -6 (allocation 1, extents 4x3) while allocating gadget (node toolbar, owner GtkToolbar)

(SWT:1612): Gtk-WARNING **: 16:48:01.446: Negative content width -6 (allocation 1, extents 4x3) while allocating gadget (node toolbar, owner GtkToolbar)

(SWT:1612): Gtk-WARNING **: 16:48:01.532: Negative content width -6 (allocation 1, extents 4x3) while allocating gadget (node toolbar, owner GtkToolbar)

(SWT:1612): Gtk-WARNING **: 16:48:01.571: Negative content width -6 (allocation 1, extents 4x3) while allocating gadget (node toolbar, owner GtkToolbar)

(SWT:1612): Gtk-WARNING **: 16:48:01.663: Negative content width -6 (allocation 1, extents 4x3) while allocating gadget (node toolbar, owner GtkToolbar)

(SWT:1612): Gtk-WARNING **: 16:48:01.911: Negative content width -6 (allocation 1, extents 4x3) while allocating gadget (node toolbar, owner GtkToolbar)

(SWT:1612): Gtk-WARNING **: 16:48:02.018: Negative content width -6 (allocation 1, extents 4x3) while allocating gadget (node toolbar, owner GtkToolbar)

(SWT:1612): Gtk-WARNING **: 16:48:02.090: Negative content width -6 (allocation 1, extents 4x3) while allocating gadget (node toolbar, owner GtkToolbar)

(SWT:1612): Gtk-WARNING **: 16:48:02.191: Negative content width -6 (allocation 1, extents 4x3) while allocating gadget (node toolbar, owner GtkToolbar)

(SWT:1612): Gtk-WARNING **: 16:48:02.226: Negative content width -6 (allocation 1, extents 4x3) while allocating gadget (node toolbar, owner GtkToolbar)

(SWT:1612): Gtk-WARNING **: 16:48:02.399: Negative content width -6 (allocation 1, extents 4x3) while allocating gadget (node toolbar, owner GtkToolbar)

(SWT:1612): Gtk-WARNING **: 16:48:02.458: Negative content width -6 (allocation 1, extents 4x3) while allocating gadget (node toolbar, owner GtkToolbar)

(SWT:1612): Gtk-WARNING **: 16:48:02.544: Negative content width -6 (allocation 1, extents 4x3) while allocating gadget (node toolbar, owner GtkToolbar)

(SWT:1612): Gtk-WARNING **: 16:48:02.584: Negative content width -6 (allocation 1, extents 4x3) while allocating gadget (node toolbar, owner GtkToolbar)

(SWT:1612): Gtk-WARNING **: 16:48:02.676: Negative content width -6 (allocation 1, extents 4x3) while allocating gadget (node toolbar, owner GtkToolbar)

(SWT:1612): Gtk-WARNING **: 16:48:02.776: Negative content width -6 (allocation 1, extents 4x3) while allocating gadget (node toolbar, owner GtkToolbar)

(SWT:1612): Gtk-WARNING **: 16:48:03.131: Negative content width -6 (allocation 1, extents 4x3) while allocating gadget (node toolbar, owner GtkToolbar)

(SWT:1612): Gtk-WARNING **: 16:48:03.149: Negative content width -6 (allocation 1, extents 4x3) while allocating gadget (node toolbar, owner GtkToolbar)

(SWT:1612): Gtk-WARNING **: 16:48:04.042: Negative content width -6 (allocation 1, extents 4x3) while allocating gadget (node toolbar, owner GtkToolbar)

(SWT:1612): Gtk-WARNING **: 16:48:04.043: Negative content width -6 (allocation 1, extents 4x3) while allocating gadget (node toolbar, owner GtkToolbar)

(SWT:1612): Gtk-WARNING **: 16:48:04.055: Negative content width -6 (allocation 1, extents 4x3) while allocating gadget (node toolbar, owner GtkToolbar)

(SWT:1612): Gtk-WARNING **: 16:48:04.162: Negative content width -6 (allocation 1, extents 4x3) while allocating gadget (node toolbar, owner GtkToolbar)

(SWT:1612): Gtk-WARNING **: 16:48:04.252: Negative content width -6 (allocation 1, extents 4x3) while allocating gadget (node toolbar, owner GtkToolbar)

(SWT:1612): Gtk-WARNING **: 16:48:04.296: Negative content width -6 (allocation 1, extents 4x3) while allocating gadget (node toolbar, owner GtkToolbar)

(SWT:1612): Gtk-WARNING **: 16:48:04.399: Negative content width -6 (allocation 1, extents 4x3) while allocating gadget (node toolbar, owner GtkToolbar)

(SWT:1612): Gtk-WARNING **: 16:48:04.436: Negative content width -6 (allocation 1, extents 4x3) while allocating gadget (node toolbar, owner GtkToolbar)

(SWT:1612): Gtk-WARNING **: 16:48:04.543: Negative content width -6 (allocation 1, extents 4x3) while allocating gadget (node toolbar, owner GtkToolbar)

(SWT:1612): Gtk-WARNING **: 16:48:04.593: Negative content width -6 (allocation 1, extents 4x3) while allocating gadget (node toolbar, owner GtkToolbar)

(SWT:1612): Gtk-WARNING **: 16:48:04.682: Negative content width -6 (allocation 1, extents 4x3) while allocating gadget (node toolbar, owner GtkToolbar)

(SWT:1612): Gtk-WARNING **: 16:48:04.715: Negative content width -6 (allocation 1, extents 4x3) while allocating gadget (node toolbar, owner GtkToolbar)

(SWT:1612): Gtk-WARNING **: 16:48:04.812: Negative content width -6 (allocation 1, extents 4x3) while allocating gadget (node toolbar, owner GtkToolbar)

(SWT:1612): Gtk-WARNING **: 16:48:04.853: Negative content width -6 (allocation 1, extents 4x3) while allocating gadget (node toolbar, owner GtkToolbar)

(SWT:1612): Gtk-WARNING **: 16:48:04.953: Negative content width -6 (allocation 1, extents 4x3) while allocating gadget (node toolbar, owner GtkToolbar)

(SWT:1612): Gtk-WARNING **: 16:48:05.015: Negative content width -6 (allocation 1, extents 4x3) while allocating gadget (node toolbar, owner GtkToolbar)

(SWT:1612): Gtk-WARNING **: 16:48:05.129: Negative content width -6 (allocation 1, extents 4x3) while allocating gadget (node toolbar, owner GtkToolbar)

(SWT:1612): Gtk-WARNING **: 16:48:05.212: Negative content width -6 (allocation 1, extents 4x3) while allocating gadget (node toolbar, owner GtkToolbar)

(SWT:1612): Gtk-WARNING **: 16:48:05.692: Negative content width -6 (allocation 1, extents 4x3) while allocating gadget (node toolbar, owner GtkToolbar)

(SWT:1612): Gtk-WARNING **: 16:48:05.710: Negative content width -6 (allocation 1, extents 4x3) while allocating gadget (node toolbar, owner GtkToolbar)

(SWT:1612): Gtk-WARNING **: 16:48:06.607: Negative content width -6 (allocation 1, extents 4x3) while allocating gadget (node toolbar, owner GtkToolbar)

(SWT:1612): Gtk-WARNING **: 16:48:06.608: Negative content width -6 (allocation 1, extents 4x3) while allocating gadget (node toolbar, owner GtkToolbar)

(SWT:1612): Gtk-WARNING **: 16:48:06.622: Negative content width -6 (allocation 1, extents 4x3) while allocating gadget (node toolbar, owner GtkToolbar)

(SWT:1612): Gtk-WARNING **: 16:48:06.914: Negative content width -6 (allocation 1, extents 4x3) while allocating gadget (node toolbar, owner GtkToolbar)

(SWT:1612): Gtk-WARNING **: 16:48:07.437: Negative content width -6 (allocation 1, extents 4x3) while allocating gadget (node toolbar, owner GtkToolbar)

(SWT:1612): Gtk-WARNING **: 16:48:07.455: Negative content width -6 (allocation 1, extents 4x3) while allocating gadget (node toolbar, owner GtkToolbar)

(SWT:1612): Gtk-WARNING **: 16:48:08.256: Negative content width -6 (allocation 1, extents 4x3) while allocating gadget (node toolbar, owner GtkToolbar)

(SWT:1612): Gtk-WARNING **: 16:48:08.257: Negative content width -6 (allocation 1, extents 4x3) while allocating gadget (node toolbar, owner GtkToolbar)

(SWT:1612): Gtk-WARNING **: 16:48:08.270: Negative content width -6 (allocation 1, extents 4x3) while allocating gadget (node toolbar, owner GtkToolbar)

(SWT:1612): Gtk-WARNING **: 16:48:08.333: Negative content width -6 (allocation 1, extents 4x3) while allocating gadget (node toolbar, owner GtkToolbar)

(SWT:1612): Gtk-WARNING **: 16:48:08.428: Negative content width -6 (allocation 1, extents 4x3) while allocating gadget (node toolbar, owner GtkToolbar)

(SWT:1612): Gtk-WARNING **: 16:48:09.198: Negative content width -6 (allocation 1, extents 4x3) while allocating gadget (node toolbar, owner GtkToolbar)

(SWT:1612): Gtk-CRITICAL **: 16:48:09.760: gtk_box_gadget_distribute: assertion 'size >= 0' failed in GtkScrollbar

(SWT:1612): Gtk-WARNING **: 16:48:09.768: Negative content width -6 (allocation 1, extents 4x3) while allocating gadget (node toolbar, owner GtkToolbar)

(SWT:1612): Gtk-CRITICAL **: 16:48:09.786: gtk_box_gadget_distribute: assertion 'size >= 0' failed in GtkScrollbar

(SWT:1612): Gtk-CRITICAL **: 16:48:09.795: gtk_box_gadget_distribute: assertion 'size >= 0' failed in GtkScrollbar

(SWT:1612): Gtk-WARNING **: 16:48:09.849: Negative content width -6 (allocation 1, extents 4x3) while allocating gadget (node toolbar, owner GtkToolbar)

(SWT:1612): Gtk-WARNING **: 16:48:11.217: Negative content width -6 (allocation 1, extents 4x3) while allocating gadget (node toolbar, owner GtkToolbar)

(SWT:1612): Gtk-WARNING **: 16:48:11.239: Negative content width -6 (allocation 1, extents 4x3) while allocating gadget (node toolbar, owner GtkToolbar)

(SWT:1612): Gtk-WARNING **: 16:48:12.048: Negative content width -6 (allocation 1, extents 4x3) while allocating gadget (node toolbar, owner GtkToolbar)

(SWT:1612): Gtk-WARNING **: 16:48:12.049: Negative content width -6 (allocation 1, extents 4x3) while allocating gadget (node toolbar, owner GtkToolbar)

(SWT:1612): Gtk-WARNING **: 16:48:12.063: Negative content width -6 (allocation 1, extents 4x3) while allocating gadget (node toolbar, owner GtkToolbar)

(SWT:1612): Gtk-WARNING **: 16:48:12.167: Negative content width -6 (allocation 1, extents 4x3) while allocating gadget (node toolbar, owner GtkToolbar)

(SWT:1612): Gtk-WARNING **: 16:48:12.744: Negative content width -6 (allocation 1, extents 4x3) while allocating gadget (node toolbar, owner GtkToolbar)

(SWT:1612): Gtk-WARNING **: 16:48:12.764: Negative content width -6 (allocation 1, extents 4x3) while allocating gadget (node toolbar, owner GtkToolbar)

(SWT:1612): Gtk-WARNING **: 16:48:13.725: Negative content width -6 (allocation 1, extents 4x3) while allocating gadget (node toolbar, owner GtkToolbar)

(SWT:1612): Gtk-WARNING **: 16:48:13.726: Negative content width -6 (allocation 1, extents 4x3) while allocating gadget (node toolbar, owner GtkToolbar)

(SWT:1612): Gtk-WARNING **: 16:48:13.741: Negative content width -6 (allocation 1, extents 4x3) while allocating gadget (node toolbar, owner GtkToolbar)

(SWT:1612): Gtk-WARNING **: 16:48:14.612: Negative content width -6 (allocation 1, extents 4x3) while allocating gadget (node toolbar, owner GtkToolbar)

(SWT:1612): Gtk-WARNING **: 16:48:15.033: Negative content width -6 (allocation 1, extents 4x3) while allocating gadget (node toolbar, owner GtkToolbar)

(SWT:1612): Gtk-WARNING **: 16:48:15.052: Negative content width -6 (allocation 1, extents 4x3) while allocating gadget (node toolbar, owner GtkToolbar)

(SWT:1612): Gtk-WARNING **: 16:48:15.899: Negative content width -6 (allocation 1, extents 4x3) while allocating gadget (node toolbar, owner GtkToolbar)

(SWT:1612): Gtk-WARNING **: 16:48:15.900: Negative content width -6 (allocation 1, extents 4x3) while allocating gadget (node toolbar, owner GtkToolbar)

(SWT:1612): Gtk-WARNING **: 16:48:15.914: Negative content width -6 (allocation 1, extents 4x3) while allocating gadget (node toolbar, owner GtkToolbar)

(SWT:1612): Gtk-WARNING **: 16:48:16.261: Negative content width -6 (allocation 1, extents 4x3) while allocating gadget (node toolbar, owner GtkToolbar)

(SWT:1612): Gtk-WARNING **: 16:48:16.720: Negative content width -6 (allocation 1, extents 4x3) while allocating gadget (node toolbar, owner GtkToolbar)

(SWT:1612): Gtk-WARNING **: 16:48:16.737: Negative content width -6 (allocation 1, extents 4x3) while allocating gadget (node toolbar, owner GtkToolbar)

(SWT:1612): Gtk-WARNING **: 16:48:17.535: Negative content width -6 (allocation 1, extents 4x3) while allocating gadget (node toolbar, owner GtkToolbar)

(SWT:1612): Gtk-WARNING **: 16:48:17.536: Negative content width -6 (allocation 1, extents 4x3) while allocating gadget (node toolbar, owner GtkToolbar)

(SWT:1612): Gtk-WARNING **: 16:48:17.550: Negative content width -6 (allocation 1, extents 4x3) while allocating gadget (node toolbar, owner GtkToolbar)

(SWT:1612): Gtk-WARNING **: 16:48:17.780: Negative content width -6 (allocation 1, extents 4x3) while allocating gadget (node toolbar, owner GtkToolbar)

(SWT:1612): Gtk-WARNING **: 16:48:17.877: Negative content width -6 (allocation 1, extents 4x3) while allocating gadget (node toolbar, owner GtkToolbar)

(SWT:1612): Gtk-WARNING **: 16:48:17.919: Negative content width -6 (allocation 1, extents 4x3) while allocating gadget (node toolbar, owner GtkToolbar)

(SWT:1612): Gtk-WARNING **: 16:48:18.010: Negative content width -6 (allocation 1, extents 4x3) while allocating gadget (node toolbar, owner GtkToolbar)

(SWT:1612): Gtk-WARNING **: 16:48:18.079: Negative content width -6 (allocation 1, extents 4x3) while allocating gadget (node toolbar, owner GtkToolbar)

(SWT:1612): Gtk-WARNING **: 16:48:18.436: Negative content width -6 (allocation 1, extents 4x3) while allocating gadget (node toolbar, owner GtkToolbar)

(SWT:1612): Gtk-WARNING **: 16:48:18.452: Negative content width -6 (allocation 1, extents 4x3) while allocating gadget (node toolbar, owner GtkToolbar)

(SWT:1612): Gtk-WARNING **: 16:48:19.252: Negative content width -6 (allocation 1, extents 4x3) while allocating gadget (node toolbar, owner GtkToolbar)

(SWT:1612): Gtk-WARNING **: 16:48:19.252: Negative content width -6 (allocation 1, extents 4x3) while allocating gadget (node toolbar, owner GtkToolbar)

(SWT:1612): Gtk-WARNING **: 16:48:19.265: Negative content width -6 (allocation 1, extents 4x3) while allocating gadget (node toolbar, owner GtkToolbar)

(SWT:1612): Gtk-WARNING **: 16:48:19.369: Negative content width -6 (allocation 1, extents 4x3) while allocating gadget (node toolbar, owner GtkToolbar)

(SWT:1612): Gtk-WARNING **: 16:48:19.476: Negative content width -6 (allocation 1, extents 4x3) while allocating gadget (node toolbar, owner GtkToolbar)

(SWT:1612): Gtk-WARNING **: 16:48:19.588: Negative content width -6 (allocation 1, extents 4x3) while allocating gadget (node toolbar, owner GtkToolbar)

(SWT:1612): Gtk-WARNING **: 16:48:19.712: Negative content width -6 (allocation 1, extents 4x3) while allocating gadget (node toolbar, owner GtkToolbar)

(SWT:1612): Gtk-WARNING **: 16:48:19.755: Negative content width -6 (allocation 1, extents 4x3) while allocating gadget (node toolbar, owner GtkToolbar)

(SWT:1612): Gtk-WARNING **: 16:48:19.865: Negative content width -6 (allocation 1, extents 4x3) while allocating gadget (node toolbar, owner GtkToolbar)

(SWT:1612): Gtk-WARNING **: 16:48:19.901: Negative content width -6 (allocation 1, extents 4x3) while allocating gadget (node toolbar, owner GtkToolbar)

(SWT:1612): Gtk-WARNING **: 16:48:19.996: Negative content width -6 (allocation 1, extents 4x3) while allocating gadget (node toolbar, owner GtkToolbar)

(SWT:1612): Gtk-WARNING **: 16:48:20.033: Negative content width -6 (allocation 1, extents 4x3) while allocating gadget (node toolbar, owner GtkToolbar)

(SWT:1612): Gtk-WARNING **: 16:48:20.143: Negative content width -6 (allocation 1, extents 4x3) while allocating gadget (node toolbar, owner GtkToolbar)

(SWT:1612): Gtk-WARNING **: 16:48:20.182: Negative content width -6 (allocation 1, extents 4x3) while allocating gadget (node toolbar, owner GtkToolbar)

(SWT:1612): Gtk-WARNING **: 16:48:20.284: Negative content width -6 (allocation 1, extents 4x3) while allocating gadget (node toolbar, owner GtkToolbar)

(SWT:1612): Gtk-WARNING **: 16:48:20.353: Negative content width -6 (allocation 1, extents 4x3) while allocating gadget (node toolbar, owner GtkToolbar)

(SWT:1612): Gtk-WARNING **: 16:48:20.452: Negative content width -6 (allocation 1, extents 4x3) while allocating gadget (node toolbar, owner GtkToolbar)

(SWT:1612): Gtk-WARNING **: 16:48:20.538: Negative content width -6 (allocation 1, extents 4x3) while allocating gadget (node toolbar, owner GtkToolbar)

(SWT:1612): Gtk-WARNING **: 16:48:21.020: Negative content width -6 (allocation 1, extents 4x3) while allocating gadget (node toolbar, owner GtkToolbar)

(SWT:1612): Gtk-WARNING **: 16:48:21.037: Negative content width -6 (allocation 1, extents 4x3) while allocating gadget (node toolbar, owner GtkToolbar)

(SWT:1612): Gtk-WARNING **: 16:48:21.897: Negative content width -6 (allocation 1, extents 4x3) while allocating gadget (node toolbar, owner GtkToolbar)

(SWT:1612): Gtk-WARNING **: 16:48:21.898: Negative content width -6 (allocation 1, extents 4x3) while allocating gadget (node toolbar, owner GtkToolbar)

(SWT:1612): Gtk-WARNING **: 16:48:21.912: Negative content width -6 (allocation 1, extents 4x3) while allocating gadget (node toolbar, owner GtkToolbar)

(SWT:1612): Gtk-WARNING **: 16:48:22.015: Negative content width -6 (allocation 1, extents 4x3) while allocating gadget (node toolbar, owner GtkToolbar)

(SWT:1612): Gtk-WARNING **: 16:48:22.141: Negative content width -6 (allocation 1, extents 4x3) while allocating gadget (node toolbar, owner GtkToolbar)

(SWT:1612): Gtk-WARNING **: 16:48:22.205: Negative content width -6 (allocation 1, extents 4x3) while allocating gadget (node toolbar, owner GtkToolbar)

(SWT:1612): Gtk-WARNING **: 16:48:22.352: Negative content width -6 (allocation 1, extents 4x3) while allocating gadget (node toolbar, owner GtkToolbar)

(SWT:1612): Gtk-WARNING **: 16:48:22.394: Negative content width -6 (allocation 1, extents 4x3) while allocating gadget (node toolbar, owner GtkToolbar)

(SWT:1612): Gtk-WARNING **: 16:48:22.491: Negative content width -6 (allocation 1, extents 4x3) while allocating gadget (node toolbar, owner GtkToolbar)

(SWT:1612): Gtk-WARNING **: 16:48:22.533: Negative content width -6 (allocation 1, extents 4x3) while allocating gadget (node toolbar, owner GtkToolbar)

(SWT:1612): Gtk-WARNING **: 16:48:22.626: Negative content width -6 (allocation 1, extents 4x3) while allocating gadget (node toolbar, owner GtkToolbar)

(SWT:1612): Gtk-WARNING **: 16:48:22.664: Negative content width -6 (allocation 1, extents 4x3) while allocating gadget (node toolbar, owner GtkToolbar)

(SWT:1612): Gtk-WARNING **: 16:48:22.769: Negative content width -6 (allocation 1, extents 4x3) while allocating gadget (node toolbar, owner GtkToolbar)

(SWT:1612): Gtk-WARNING **: 16:48:22.890: Negative content width -6 (allocation 1, extents 4x3) while allocating gadget (node toolbar, owner GtkToolbar)

(SWT:1612): Gtk-WARNING **: 16:48:23.023: Negative content width -6 (allocation 1, extents 4x3) while allocating gadget (node toolbar, owner GtkToolbar)

(SWT:1612): Gtk-WARNING **: 16:48:23.063: Negative content width -6 (allocation 1, extents 4x3) while allocating gadget (node toolbar, owner GtkToolbar)

(SWT:1612): Gtk-WARNING **: 16:48:23.155: Negative content width -6 (allocation 1, extents 4x3) while allocating gadget (node toolbar, owner GtkToolbar)

(SWT:1612): Gtk-WARNING **: 16:48:23.225: Negative content width -6 (allocation 1, extents 4x3) while allocating gadget (node toolbar, owner GtkToolbar)

(SWT:1612): Gtk-WARNING **: 16:48:23.761: Negative content width -6 (allocation 1, extents 4x3) while allocating gadget (node toolbar, owner GtkToolbar)

(SWT:1612): Gtk-WARNING **: 16:48:23.778: Negative content width -6 (allocation 1, extents 4x3) while allocating gadget (node toolbar, owner GtkToolbar)

(SWT:1612): Gtk-WARNING **: 16:48:24.589: Negative content width -6 (allocation 1, extents 4x3) while allocating gadget (node toolbar, owner GtkToolbar)

(SWT:1612): Gtk-WARNING **: 16:48:24.590: Negative content width -6 (allocation 1, extents 4x3) while allocating gadget (node toolbar, owner GtkToolbar)

(SWT:1612): Gtk-WARNING **: 16:48:24.603: Negative content width -6 (allocation 1, extents 4x3) while allocating gadget (node toolbar, owner GtkToolbar)

(SWT:1612): Gtk-WARNING **: 16:48:25.032: Negative content width -6 (allocation 1, extents 4x3) while allocating gadget (node toolbar, owner GtkToolbar)

(SWT:1612): Gtk-WARNING **: 16:48:25.406: Negative content width -6 (allocation 1, extents 4x3) while allocating gadget (node toolbar, owner GtkToolbar)

(SWT:1612): Gtk-WARNING **: 16:48:25.426: Negative content width -6 (allocation 1, extents 4x3) while allocating gadget (node toolbar, owner GtkToolbar)

(SWT:1612): Gtk-WARNING **: 16:48:26.241: Negative content width -6 (allocation 1, extents 4x3) while allocating gadget (node toolbar, owner GtkToolbar)

(SWT:1612): Gtk-WARNING **: 16:48:26.241: Negative content width -6 (allocation 1, extents 4x3) while allocating gadget (node toolbar, owner GtkToolbar)

(SWT:1612): Gtk-WARNING **: 16:48:26.255: Negative content width -6 (allocation 1, extents 4x3) while allocating gadget (node toolbar, owner GtkToolbar)

(SWT:1612): Gtk-WARNING **: 16:48:26.373: Negative content width -6 (allocation 1, extents 4x3) while allocating gadget (node toolbar, owner GtkToolbar)

(SWT:1612): Gtk-WARNING **: 16:48:26.476: Negative content width -6 (allocation 1, extents 4x3) while allocating gadget (node toolbar, owner GtkToolbar)

(SWT:1612): Gtk-WARNING **: 16:48:26.522: Negative content width -6 (allocation 1, extents 4x3) while allocating gadget (node toolbar, owner GtkToolbar)

(SWT:1612): Gtk-WARNING **: 16:48:26.622: Negative content width -6 (allocation 1, extents 4x3) while allocating gadget (node toolbar, owner GtkToolbar)

(SWT:1612): Gtk-WARNING **: 16:48:26.677: Negative content width -6 (allocation 1, extents 4x3) while allocating gadget (node toolbar, owner GtkToolbar)

(SWT:1612): Gtk-WARNING **: 16:48:26.787: Negative content width -6 (allocation 1, extents 4x3) while allocating gadget (node toolbar, owner GtkToolbar)

(SWT:1612): Gtk-WARNING **: 16:48:26.832: Negative content width -6 (allocation 1, extents 4x3) while allocating gadget (node toolbar, owner GtkToolbar)

(SWT:1612): Gtk-WARNING **: 16:48:26.930: Negative content width -6 (allocation 1, extents 4x3) while allocating gadget (node toolbar, owner GtkToolbar)

(SWT:1612): Gtk-WARNING **: 16:48:26.970: Negative content width -6 (allocation 1, extents 4x3) while allocating gadget (node toolbar, owner GtkToolbar)

(SWT:1612): Gtk-WARNING **: 16:48:27.122: Negative content width -6 (allocation 1, extents 4x3) while allocating gadget (node toolbar, owner GtkToolbar)

(SWT:1612): Gtk-WARNING **: 16:48:27.164: Negative content width -6 (allocation 1, extents 4x3) while allocating gadget (node toolbar, owner GtkToolbar)

(SWT:1612): Gtk-WARNING **: 16:48:27.314: Negative content width -6 (allocation 1, extents 4x3) while allocating gadget (node toolbar, owner GtkToolbar)

(SWT:1612): Gtk-WARNING **: 16:48:27.376: Negative content width -6 (allocation 1, extents 4x3) while allocating gadget (node toolbar, owner GtkToolbar)

(SWT:1612): Gtk-WARNING **: 16:48:27.475: Negative content width -6 (allocation 1, extents 4x3) while allocating gadget (node toolbar, owner GtkToolbar)

(SWT:1612): Gtk-WARNING **: 16:48:27.514: Negative content width -6 (allocation 1, extents 4x3) while allocating gadget (node toolbar, owner GtkToolbar)

(SWT:1612): Gtk-WARNING **: 16:48:27.617: Negative content width -6 (allocation 1, extents 4x3) while allocating gadget (node toolbar, owner GtkToolbar)

(SWT:1612): Gtk-WARNING **: 16:48:27.673: Negative content width -6 (allocation 1, extents 4x3) while allocating gadget (node toolbar, owner GtkToolbar)

(SWT:1612): Gtk-WARNING **: 16:48:27.772: Negative content width -6 (allocation 1, extents 4x3) while allocating gadget (node toolbar, owner GtkToolbar)

(SWT:1612): Gtk-WARNING **: 16:48:27.844: Negative content width -6 (allocation 1, extents 4x3) while allocating gadget (node toolbar, owner GtkToolbar)

(SWT:1612): Gtk-WARNING **: 16:48:28.202: Negative content width -6 (allocation 1, extents 4x3) while allocating gadget (node toolbar, owner GtkToolbar)

(SWT:1612): Gtk-WARNING **: 16:48:28.225: Negative content width -6 (allocation 1, extents 4x3) while allocating gadget (node toolbar, owner GtkToolbar)

(SWT:1612): Gtk-WARNING **: 16:48:29.033: Negative content width -6 (allocation 1, extents 4x3) while allocating gadget (node toolbar, owner GtkToolbar)

(SWT:1612): Gtk-WARNING **: 16:48:29.034: Negative content width -6 (allocation 1, extents 4x3) while allocating gadget (node toolbar, owner GtkToolbar)

(SWT:1612): Gtk-WARNING **: 16:48:29.047: Negative content width -6 (allocation 1, extents 4x3) while allocating gadget (node toolbar, owner GtkToolbar)

(SWT:1612): Gtk-WARNING **: 16:48:29.238: Negative content width -6 (allocation 1, extents 4x3) while allocating gadget (node toolbar, owner GtkToolbar)

(SWT:1612): Gtk-WARNING **: 16:48:29.238: Negative content height -3 (allocation 1, extents 2x2) while allocating gadget (node toolbar, owner GtkToolbar)

(SWT:1612): Gtk-WARNING **: 16:48:29.238: Negative content width -6 (allocation 1, extents 4x3) while allocating gadget (node toolbar, owner GtkToolbar)

(SWT:1612): Gtk-WARNING **: 16:48:29.238: Negative content height -3 (allocation 1, extents 2x2) while allocating gadget (node toolbar, owner GtkToolbar)

(SWT:1612): Gtk-WARNING **: 16:48:29.412: Negative content width -6 (allocation 1, extents 4x3) while allocating gadget (node toolbar, owner GtkToolbar)

(SWT:1612): Gtk-WARNING **: 16:48:29.781: Negative content width -6 (allocation 1, extents 4x3) while allocating gadget (node toolbar, owner GtkToolbar)

(SWT:1612): Gtk-WARNING **: 16:48:29.799: Negative content width -6 (allocation 1, extents 4x3) while allocating gadget (node toolbar, owner GtkToolbar)
Tests run: 14, Failures: 0, Errors: 0, Skipped: 1, Time elapsed: 29.306 s - in org.eclipse.egit.ui.test.history.HistoryViewTest
testShowAllBranches(org.eclipse.egit.ui.test.history.HistoryViewTest)  Time elapsed: 2.68 s
testOpenHistoryOnFileFolderFilter(org.eclipse.egit.ui.test.history.HistoryViewTest)  Time elapsed: 2.493 s
testCheckOut(org.eclipse.egit.ui.test.history.HistoryViewTest)  Time elapsed: 1.743 s
testSelectBranch(org.eclipse.egit.ui.test.history.HistoryViewTest)  Time elapsed: 3.785 s
testOpenHistoryOnProject(org.eclipse.egit.ui.test.history.HistoryViewTest)  Time elapsed: 1.525 s
testRevertFailure(org.eclipse.egit.ui.test.history.HistoryViewTest)  Time elapsed: 2.287 s
testRebaseAlreadyUpToDate(org.eclipse.egit.ui.test.history.HistoryViewTest) skipped
testAddBranch(org.eclipse.egit.ui.test.history.HistoryViewTest)  Time elapsed: 1.686 s
testAddCommit(org.eclipse.egit.ui.test.history.HistoryViewTest)  Time elapsed: 1.713 s
testOpenHistoryOnFileProjectFilter(org.eclipse.egit.ui.test.history.HistoryViewTest)  Time elapsed: 2.639 s
testOpenHistoryOnFileRepoFilter(org.eclipse.egit.ui.test.history.HistoryViewTest)  Time elapsed: 2.69 s
testAddTag(org.eclipse.egit.ui.test.history.HistoryViewTest)  Time elapsed: 1.645 s
testOpenHistoryOnFileNoFilter(org.eclipse.egit.ui.test.history.HistoryViewTest)  Time elapsed: 2.802 s
testOpenOfDeletedFile(org.eclipse.egit.ui.test.history.HistoryViewTest)  Time elapsed: 1.571 s
Running org.eclipse.egit.ui.test.commit.CommitEditorTest

(SWT:1612): Gtk-WARNING **: 16:48:30.409: Negative content width -6 (allocation 1, extents 4x3) while allocating gadget (node toolbar, owner GtkToolbar)

(SWT:1612): Gtk-WARNING **: 16:48:30.409: Negative content height -3 (allocation 1, extents 2x2) while allocating gadget (node toolbar, owner GtkToolbar)

(SWT:1612): Gtk-WARNING **: 16:48:30.409: Negative content width -6 (allocation 1, extents 4x3) while allocating gadget (node toolbar, owner GtkToolbar)

(SWT:1612): Gtk-WARNING **: 16:48:30.409: Negative content height -3 (allocation 1, extents 2x2) while allocating gadget (node toolbar, owner GtkToolbar)

(SWT:1612): Gtk-WARNING **: 16:48:30.523: Negative content width -6 (allocation 1, extents 4x3) while allocating gadget (node toolbar, owner GtkToolbar)

(SWT:1612): Gtk-WARNING **: 16:48:30.559: Negative content width -6 (allocation 1, extents 4x3) while allocating gadget (node toolbar, owner GtkToolbar)

(SWT:1612): Gtk-CRITICAL **: 16:48:30.598: gtk_box_gadget_distribute: assertion 'size >= 0' failed in GtkScrollbar

(SWT:1612): Gtk-CRITICAL **: 16:48:30.598: gtk_box_gadget_distribute: assertion 'size >= 0' failed in GtkScrollbar

(SWT:1612): Gtk-CRITICAL **: 16:48:30.623: gtk_box_gadget_distribute: assertion 'size >= 0' failed in GtkScrollbar

(SWT:1612): Gtk-CRITICAL **: 16:48:30.623: gtk_box_gadget_distribute: assertion 'size >= 0' failed in GtkScrollbar

(SWT:1612): Gtk-CRITICAL **: 16:48:30.640: gtk_box_gadget_distribute: assertion 'size >= 0' failed in GtkScrollbar

(SWT:1612): Gtk-CRITICAL **: 16:48:30.641: gtk_box_gadget_distribute: assertion 'size >= 0' failed in GtkScrollbar

(SWT:1612): Gtk-CRITICAL **: 16:48:30.658: gtk_box_gadget_distribute: assertion 'size >= 0' failed in GtkScrollbar

(SWT:1612): Gtk-CRITICAL **: 16:48:30.659: gtk_box_gadget_distribute: assertion 'size >= 0' failed in GtkScrollbar

(SWT:1612): Gtk-WARNING **: 16:48:30.664: Negative content width -6 (allocation 1, extents 4x3) while allocating gadget (node toolbar, owner GtkToolbar)

(SWT:1612): Gtk-WARNING **: 16:48:30.664: Negative content height -3 (allocation 1, extents 2x2) while allocating gadget (node toolbar, owner GtkToolbar)

(SWT:1612): Gtk-WARNING **: 16:48:30.664: Negative content width -6 (allocation 1, extents 4x3) while allocating gadget (node toolbar, owner GtkToolbar)

(SWT:1612): Gtk-WARNING **: 16:48:30.664: Negative content height -3 (allocation 1, extents 2x2) while allocating gadget (node toolbar, owner GtkToolbar)

(SWT:1612): Gtk-WARNING **: 16:48:31.405: Negative content width -6 (allocation 1, extents 4x3) while allocating gadget (node toolbar, owner GtkToolbar)

(SWT:1612): Gtk-WARNING **: 16:48:31.405: Negative content height -3 (allocation 1, extents 2x2) while allocating gadget (node toolbar, owner GtkToolbar)

(SWT:1612): Gtk-WARNING **: 16:48:31.406: Negative content width -6 (allocation 1, extents 4x3) while allocating gadget (node toolbar, owner GtkToolbar)

(SWT:1612): Gtk-WARNING **: 16:48:31.406: Negative content height -3 (allocation 1, extents 2x2) while allocating gadget (node toolbar, owner GtkToolbar)

(SWT:1612): Gtk-WARNING **: 16:48:31.506: Negative content width -6 (allocation 1, extents 4x3) while allocating gadget (node toolbar, owner GtkToolbar)

(SWT:1612): Gtk-WARNING **: 16:48:31.533: Negative content width -6 (allocation 1, extents 4x3) while allocating gadget (node toolbar, owner GtkToolbar)

(SWT:1612): Gtk-CRITICAL **: 16:48:31.571: gtk_box_gadget_distribute: assertion 'size >= 0' failed in GtkScrollbar

(SWT:1612): Gtk-CRITICAL **: 16:48:31.571: gtk_box_gadget_distribute: assertion 'size >= 0' failed in GtkScrollbar

(SWT:1612): Gtk-CRITICAL **: 16:48:31.586: gtk_box_gadget_distribute: assertion 'size >= 0' failed in GtkScrollbar

(SWT:1612): Gtk-CRITICAL **: 16:48:31.586: gtk_box_gadget_distribute: assertion 'size >= 0' failed in GtkScrollbar

(SWT:1612): Gtk-CRITICAL **: 16:48:31.602: gtk_box_gadget_distribute: assertion 'size >= 0' failed in GtkScrollbar

(SWT:1612): Gtk-CRITICAL **: 16:48:31.602: gtk_box_gadget_distribute: assertion 'size >= 0' failed in GtkScrollbar

(SWT:1612): Gtk-CRITICAL **: 16:48:31.620: gtk_box_gadget_distribute: assertion 'size >= 0' failed in GtkScrollbar

(SWT:1612): Gtk-CRITICAL **: 16:48:31.621: gtk_box_gadget_distribute: assertion 'size >= 0' failed in GtkScrollbar
Tests run: 2, Failures: 0, Errors: 0, Skipped: 0, Time elapsed: 1.907 s - in org.eclipse.egit.ui.test.commit.CommitEditorTest
showAnnotations(org.eclipse.egit.ui.test.commit.CommitEditorTest)  Time elapsed: 1.001 s
openAllEditorPagesOnValidCommit(org.eclipse.egit.ui.test.commit.CommitEditorTest)  Time elapsed: 0.899 s
Running org.eclipse.egit.ui.test.commit.RepositoryCommitTest
Tests run: 4, Failures: 0, Errors: 0, Skipped: 0, Time elapsed: 2.291 s - in org.eclipse.egit.ui.test.commit.RepositoryCommitTest
testDiffs(org.eclipse.egit.ui.test.commit.RepositoryCommitTest)  Time elapsed: 0.563 s
testAdapters(org.eclipse.egit.ui.test.commit.RepositoryCommitTest)  Time elapsed: 0.643 s
testGetters(org.eclipse.egit.ui.test.commit.RepositoryCommitTest)  Time elapsed: 0.541 s
testConstructorAsserts(org.eclipse.egit.ui.test.commit.RepositoryCommitTest)  Time elapsed: 0.531 s
Running org.eclipse.egit.ui.test.commit.CommitEditorInputFactoryTest
Tests run: 2, Failures: 0, Errors: 0, Skipped: 0, Time elapsed: 1.086 s - in org.eclipse.egit.ui.test.commit.CommitEditorInputFactoryTest
shouldPersistAndRestoreStashCommit(org.eclipse.egit.ui.test.commit.CommitEditorInputFactoryTest)  Time elapsed: 0.544 s
shouldPersistAndRestoreCommit(org.eclipse.egit.ui.test.commit.CommitEditorInputFactoryTest)  Time elapsed: 0.535 s
Running org.eclipse.egit.ui.test.commit.DiffRegionFormatterTest
Tests run: 1, Failures: 0, Errors: 0, Skipped: 0, Time elapsed: 0.539 s - in org.eclipse.egit.ui.test.commit.DiffRegionFormatterTest
testRanges(org.eclipse.egit.ui.test.commit.DiffRegionFormatterTest)  Time elapsed: 0.535 s
Running org.eclipse.egit.ui.test.commit.CommitEditorInputTest
Tests run: 3, Failures: 0, Errors: 0, Skipped: 0, Time elapsed: 1.732 s - in org.eclipse.egit.ui.test.commit.CommitEditorInputTest
testInput(org.eclipse.egit.ui.test.commit.CommitEditorInputTest)  Time elapsed: 0.545 s
testAdapters(org.eclipse.egit.ui.test.commit.CommitEditorInputTest)  Time elapsed: 0.542 s
testConstructorAsserts(org.eclipse.egit.ui.test.commit.CommitEditorInputTest)  Time elapsed: 0.635 s
Running org.eclipse.egit.ui.test.trace.TraceConfigurationDialogTest

(SWT:1612): Gtk-CRITICAL **: 16:48:37.585: gtk_box_gadget_distribute: assertion 'size >= 0' failed in GtkScrollbar

(SWT:1612): Gtk-CRITICAL **: 16:48:37.605: gtk_box_gadget_distribute: assertion 'size >= 0' failed in GtkScrollbar

(SWT:1612): Gtk-CRITICAL **: 16:48:37.677: gtk_box_gadget_distribute: assertion 'size >= 0' failed in GtkScrollbar

(SWT:1612): Gtk-CRITICAL **: 16:48:37.746: gtk_box_gadget_distribute: assertion 'size >= 0' failed in GtkScrollbar

(SWT:1612): Gtk-CRITICAL **: 16:48:37.816: gtk_box_gadget_distribute: assertion 'size >= 0' failed in GtkScrollbar

(SWT:1612): Gtk-CRITICAL **: 16:48:37.897: gtk_box_gadget_distribute: assertion 'size >= 0' failed in GtkScrollbar

(SWT:1612): Gtk-CRITICAL **: 16:48:37.908: gtk_box_gadget_distribute: assertion 'size >= 0' failed in GtkScrollbar

(SWT:1612): Gtk-CRITICAL **: 16:48:37.981: gtk_box_gadget_distribute: assertion 'size >= 0' failed in GtkScrollbar
Tests run: 2, Failures: 0, Errors: 0, Skipped: 0, Time elapsed: 0.52 s - in org.eclipse.egit.ui.test.trace.TraceConfigurationDialogTest
testMainSwitch(org.eclipse.egit.ui.test.trace.TraceConfigurationDialogTest)  Time elapsed: 0.247 s
testTreeNode(org.eclipse.egit.ui.test.trace.TraceConfigurationDialogTest)  Time elapsed: 0.272 s
Running org.eclipse.egit.ui.prefpages.configuration.GlobalConfigurationPageTest

!ENTRY org.eclipse.ui 2 2 2019-09-20 16:48:38.068
!MESSAGE Invalid preference category path: org.eclipse.ui.net.NetPreferences (bundle: org.eclipse.jsch.ui, page: org.eclipse.jsch.ui.SSHPreferences)

(SWT:1612): Gtk-WARNING **: 16:48:38.084: Negative content width -13 (allocation 5, extents 9x9) while allocating gadget (node entry, owner GtkEntry)

(SWT:1612): Gtk-WARNING **: 16:48:38.290: Negative content width -13 (allocation 5, extents 9x9) while allocating gadget (node entry, owner GtkEntry)

(SWT:1612): Gtk-WARNING **: 16:48:38.509: Negative content width -13 (allocation 5, extents 9x9) while allocating gadget (node entry, owner GtkEntry)

(SWT:1612): Gtk-WARNING **: 16:48:38.706: Negative content width -13 (allocation 5, extents 9x9) while allocating gadget (node entry, owner GtkEntry)

(SWT:1612): Gtk-WARNING **: 16:48:38.843: Negative content width -13 (allocation 5, extents 9x9) while allocating gadget (node entry, owner GtkEntry)

(SWT:1612): Gtk-WARNING **: 16:48:39.004: Negative content width -13 (allocation 5, extents 9x9) while allocating gadget (node entry, owner GtkEntry)

(SWT:1612): Gtk-WARNING **: 16:48:39.229: Negative content width -13 (allocation 5, extents 9x9) while allocating gadget (node entry, owner GtkEntry)

(SWT:1612): Gtk-WARNING **: 16:48:39.318: Negative content width -6 (allocation 1, extents 4x3) while allocating gadget (node toolbar, owner GtkToolbar)

(SWT:1612): Gtk-WARNING **: 16:48:39.318: Negative content height -3 (allocation 1, extents 2x2) while allocating gadget (node toolbar, owner GtkToolbar)

(SWT:1612): Gtk-WARNING **: 16:48:39.318: Negative content width -6 (allocation 1, extents 4x3) while allocating gadget (node toolbar, owner GtkToolbar)

(SWT:1612): Gtk-WARNING **: 16:48:39.318: Negative content height -3 (allocation 1, extents 2x2) while allocating gadget (node toolbar, owner GtkToolbar)

(SWT:1612): Gtk-WARNING **: 16:48:39.551: Negative content width -13 (allocation 5, extents 9x9) while allocating gadget (node entry, owner GtkEntry)

(SWT:1612): Gtk-WARNING **: 16:48:39.743: Negative content width -13 (allocation 5, extents 9x9) while allocating gadget (node entry, owner GtkEntry)

(SWT:1612): Gtk-WARNING **: 16:48:39.985: Negative content width -13 (allocation 5, extents 9x9) while allocating gadget (node entry, owner GtkEntry)

(SWT:1612): Gtk-WARNING **: 16:48:40.162: Negative content width -13 (allocation 5, extents 9x9) while allocating gadget (node entry, owner GtkEntry)

(SWT:1612): Gtk-WARNING **: 16:48:40.330: Negative content width -13 (allocation 5, extents 9x9) while allocating gadget (node entry, owner GtkEntry)
Tests run: 11, Failures: 0, Errors: 0, Skipped: 0, Time elapsed: 2.434 s - in org.eclipse.egit.ui.prefpages.configuration.GlobalConfigurationPageTest
testAddSubSectionEntry(org.eclipse.egit.ui.prefpages.configuration.GlobalConfigurationPageTest)  Time elapsed: 0.229 s
testAddSectionEntry(org.eclipse.egit.ui.prefpages.configuration.GlobalConfigurationPageTest)  Time elapsed: 0.219 s
testCanCreateSameEntryValue(org.eclipse.egit.ui.prefpages.configuration.GlobalConfigurationPageTest)  Time elapsed: 0.197 s
testNodes(org.eclipse.egit.ui.prefpages.configuration.GlobalConfigurationPageTest)  Time elapsed: 0.134 s
testRemoveValue(org.eclipse.egit.ui.prefpages.configuration.GlobalConfigurationPageTest)  Time elapsed: 0.162 s
testAddSubSectionEntryWithSuggestion(org.eclipse.egit.ui.prefpages.configuration.GlobalConfigurationPageTest)  Time elapsed: 0.225 s
testOpenEditor(org.eclipse.egit.ui.prefpages.configuration.GlobalConfigurationPageTest)  Time elapsed: 0.323 s
testSubsectionWithDot(org.eclipse.egit.ui.prefpages.configuration.GlobalConfigurationPageTest)  Time elapsed: 0.193 s
testChecksForKey(org.eclipse.egit.ui.prefpages.configuration.GlobalConfigurationPageTest)  Time elapsed: 0.24 s
testRemoveSubSection(org.eclipse.egit.ui.prefpages.configuration.GlobalConfigurationPageTest)  Time elapsed: 0.179 s
testRemoveSection(org.eclipse.egit.ui.prefpages.configuration.GlobalConfigurationPageTest)  Time elapsed: 0.167 s
Running org.eclipse.egit.ui.variables.DynamicVariablesTest
Tests run: 4, Failures: 0, Errors: 0, Skipped: 0, Time elapsed: 4.405 s - in org.eclipse.egit.ui.variables.DynamicVariablesTest
testGitBranch(org.eclipse.egit.ui.variables.DynamicVariablesTest)  Time elapsed: 1.14 s
testGitPath(org.eclipse.egit.ui.variables.DynamicVariablesTest)  Time elapsed: 1.081 s
testGitWorkTree(org.eclipse.egit.ui.variables.DynamicVariablesTest)  Time elapsed: 1.091 s
testGitDir(org.eclipse.egit.ui.variables.DynamicVariablesTest)  Time elapsed: 1.091 s
Running org.eclipse.egit.ui.submodule.SubmoduleSyncTest

(SWT:1612): Gtk-WARNING **: 16:48:45.638: Negative content width -6 (allocation 1, extents 4x3) while allocating gadget (node toolbar, owner GtkToolbar)

(SWT:1612): Gtk-WARNING **: 16:48:50.287: Negative content width -6 (allocation 1, extents 4x3) while allocating gadget (node toolbar, owner GtkToolbar)
Tests run: 1, Failures: 0, Errors: 0, Skipped: 0, Time elapsed: 5.484 s - in org.eclipse.egit.ui.submodule.SubmoduleSyncTest
syncSubmodule(org.eclipse.egit.ui.submodule.SubmoduleSyncTest)  Time elapsed: 5.477 s
Running org.eclipse.egit.ui.submodule.SubmoduleAddTest

(SWT:1612): Gtk-WARNING **: 16:48:51.112: Negative content width -6 (allocation 1, extents 4x3) while allocating gadget (node toolbar, owner GtkToolbar)

(SWT:1612): Gtk-WARNING **: 16:48:54.718: Negative content width -6 (allocation 1, extents 4x3) while allocating gadget (node toolbar, owner GtkToolbar)
Tests run: 1, Failures: 0, Errors: 0, Skipped: 0, Time elapsed: 4.426 s - in org.eclipse.egit.ui.submodule.SubmoduleAddTest
addAtRoot(org.eclipse.egit.ui.submodule.SubmoduleAddTest)  Time elapsed: 4.419 s
Running org.eclipse.egit.ui.submodule.SubmoduleUpdateTest

(SWT:1612): Gtk-WARNING **: 16:48:55.551: Negative content width -6 (allocation 1, extents 4x3) while allocating gadget (node toolbar, owner GtkToolbar)

(SWT:1612): Gtk-WARNING **: 16:49:00.375: Negative content width -6 (allocation 1, extents 4x3) while allocating gadget (node toolbar, owner GtkToolbar)
Tests run: 1, Failures: 0, Errors: 0, Skipped: 0, Time elapsed: 5.652 s - in org.eclipse.egit.ui.submodule.SubmoduleUpdateTest
updateSubmodule(org.eclipse.egit.ui.submodule.SubmoduleUpdateTest)  Time elapsed: 5.646 s

Results:

Failures: 
  GitRepositoriesViewTest.testImportWizardGeneralProject:375 expected:<0> but was:<1>

Tests run: 483, Failures: 1, Errors: 0, Skipped: 13


!ENTRY org.eclipse.core.resources 2 10035 2019-09-20 16:49:01.830
!MESSAGE The workspace will exit with unsaved changes in this session.
[INFO] ------------------------------------------------------------------------
[INFO] Reactor Summary:
[INFO] 
[INFO] EGit Parent 5.5.1-SNAPSHOT ......................... SUCCESS [ 22.917 s]
[INFO] EGit Target Platform Definition .................... SUCCESS [  0.911 s]
[INFO] Eclipse EGit ....................................... SUCCESS [ 11.147 s]
[INFO] Git Team Provider (Core) ........................... SUCCESS [ 39.307 s]
[INFO] Git Team Provider (UI) ............................. SUCCESS [01:02 min]
[INFO] EGit Mylyn UI ...................................... SUCCESS [  8.615 s]
[INFO] Git Team Provider (Documentation) .................. SUCCESS [  4.843 s]
[INFO] Eclipse EGit Feature ............................... SUCCESS [  1.236 s]
[INFO] EGit Mylyn Feature ................................. SUCCESS [  1.176 s]
[INFO] Git Flow ........................................... SUCCESS [ 12.687 s]
[INFO] Git Flow UI ........................................ SUCCESS [ 10.883 s]
[INFO] Eclipse EGit Gitflow Feature ....................... SUCCESS [  1.273 s]
[INFO] EGit JUnit Support ................................. SUCCESS [  8.800 s]
[INFO] GitFlow Test Plug-in ............................... SUCCESS [ 34.935 s]
[INFO] Eclipse EGit Source Feature ........................ SUCCESS [  1.239 s]
[INFO] EGit P2 Repository ................................. SUCCESS [ 19.428 s]
[INFO] EGit Core Test Plug-in ............................. SUCCESS [02:19 min]
[INFO] EGit UI Test Plug-in ............................... FAILURE [13:20 min]
[INFO] EGit Mylyn UI Test Plug-in 5.5.1-SNAPSHOT .......... SKIPPED
[INFO] ------------------------------------------------------------------------
[INFO] BUILD FAILURE
[INFO] ------------------------------------------------------------------------
[INFO] Total time: 22:45 min
[INFO] Finished at: 2019-09-20T16:49:03Z
[INFO] ------------------------------------------------------------------------
[ERROR] Failed to execute goal org.eclipse.tycho:tycho-surefire-plugin:1.4.0:test (default-test) on project org.eclipse.egit.ui.test: There are test failures.
[ERROR] 
[ERROR] Please refer to /home/jenkins/agent/workspace/egit-stable/repo/org.eclipse.egit.ui.test/target/surefire-reports for the individual test results.
[ERROR] -> [Help 1]
org.apache.maven.lifecycle.LifecycleExecutionException: Failed to execute goal org.eclipse.tycho:tycho-surefire-plugin:1.4.0:test (default-test) on project org.eclipse.egit.ui.test: There are test failures.

Please refer to /home/jenkins/agent/workspace/egit-stable/repo/org.eclipse.egit.ui.test/target/surefire-reports for the individual test results.
    at org.apache.maven.lifecycle.internal.MojoExecutor.execute (MojoExecutor.java:213)
    at org.apache.maven.lifecycle.internal.MojoExecutor.execute (MojoExecutor.java:154)
    at org.apache.maven.lifecycle.internal.MojoExecutor.execute (MojoExecutor.java:146)
    at org.apache.maven.lifecycle.internal.LifecycleModuleBuilder.buildProject (LifecycleModuleBuilder.java:117)
    at org.apache.maven.lifecycle.internal.LifecycleModuleBuilder.buildProject (LifecycleModuleBuilder.java:81)
    at org.apache.maven.lifecycle.internal.builder.singlethreaded.SingleThreadedBuilder.build (SingleThreadedBuilder.java:56)
    at org.apache.maven.lifecycle.internal.LifecycleStarter.execute (LifecycleStarter.java:128)
    at org.apache.maven.DefaultMaven.doExecute (DefaultMaven.java:305)
    at org.apache.maven.DefaultMaven.doExecute (DefaultMaven.java:192)
    at org.apache.maven.DefaultMaven.execute (DefaultMaven.java:105)
    at org.apache.maven.cli.MavenCli.execute (MavenCli.java:954)
    at org.apache.maven.cli.MavenCli.doMain (MavenCli.java:288)
    at org.apache.maven.cli.MavenCli.main (MavenCli.java:192)
    at sun.reflect.NativeMethodAccessorImpl.invoke0 (Native Method)
    at sun.reflect.NativeMethodAccessorImpl.invoke (NativeMethodAccessorImpl.java:62)
    at sun.reflect.DelegatingMethodAccessorImpl.invoke (DelegatingMethodAccessorImpl.java:43)
    at java.lang.reflect.Method.invoke (Method.java:498)
    at org.codehaus.plexus.classworlds.launcher.Launcher.launchEnhanced (Launcher.java:289)
    at org.codehaus.plexus.classworlds.launcher.Launcher.launch (Launcher.java:229)
    at org.codehaus.plexus.classworlds.launcher.Launcher.mainWithExitCode (Launcher.java:415)
    at org.codehaus.plexus.classworlds.launcher.Launcher.main (Launcher.java:356)
Caused by: org.apache.maven.plugin.MojoFailureException: There are test failures.

Please refer to /home/jenkins/agent/workspace/egit-stable/repo/org.eclipse.egit.ui.test/target/surefire-reports for the individual test results.
    at org.eclipse.tycho.surefire.TestMojo.runTest (TestMojo.java:1044)
    at org.eclipse.tycho.surefire.TestMojo.execute (TestMojo.java:693)
    at org.apache.maven.plugin.DefaultBuildPluginManager.executeMojo (DefaultBuildPluginManager.java:137)
    at org.apache.maven.lifecycle.internal.MojoExecutor.execute (MojoExecutor.java:208)
    at org.apache.maven.lifecycle.internal.MojoExecutor.execute (MojoExecutor.java:154)
    at org.apache.maven.lifecycle.internal.MojoExecutor.execute (MojoExecutor.java:146)
    at org.apache.maven.lifecycle.internal.LifecycleModuleBuilder.buildProject (LifecycleModuleBuilder.java:117)
    at org.apache.maven.lifecycle.internal.LifecycleModuleBuilder.buildProject (LifecycleModuleBuilder.java:81)
    at org.apache.maven.lifecycle.internal.builder.singlethreaded.SingleThreadedBuilder.build (SingleThreadedBuilder.java:56)
    at org.apache.maven.lifecycle.internal.LifecycleStarter.execute (LifecycleStarter.java:128)
    at org.apache.maven.DefaultMaven.doExecute (DefaultMaven.java:305)
    at org.apache.maven.DefaultMaven.doExecute (DefaultMaven.java:192)
    at org.apache.maven.DefaultMaven.execute (DefaultMaven.java:105)
    at org.apache.maven.cli.MavenCli.execute (MavenCli.java:954)
    at org.apache.maven.cli.MavenCli.doMain (MavenCli.java:288)
    at org.apache.maven.cli.MavenCli.main (MavenCli.java:192)
    at sun.reflect.NativeMethodAccessorImpl.invoke0 (Native Method)
    at sun.reflect.NativeMethodAccessorImpl.invoke (NativeMethodAccessorImpl.java:62)
    at sun.reflect.DelegatingMethodAccessorImpl.invoke (DelegatingMethodAccessorImpl.java:43)
    at java.lang.reflect.Method.invoke (Method.java:498)
    at org.codehaus.plexus.classworlds.launcher.Launcher.launchEnhanced (Launcher.java:289)
    at org.codehaus.plexus.classworlds.launcher.Launcher.launch (Launcher.java:229)
    at org.codehaus.plexus.classworlds.launcher.Launcher.mainWithExitCode (Launcher.java:415)
    at org.codehaus.plexus.classworlds.launcher.Launcher.main (Launcher.java:356)
[ERROR] 
[ERROR] Re-run Maven using the -X switch to enable full debug logging.
[ERROR] 
[ERROR] For more information about the errors and possible solutions, please read the following articles:
[ERROR] [Help 1] http://cwiki.apache.org/confluence/display/MAVEN/MojoFailureException
[ERROR] 
[ERROR] After correcting the problems, you can resume the build with the command
[ERROR]   mvn <goals> -rf :org.eclipse.egit.ui.test
[Pipeline] }
[Pipeline] // stage
[Pipeline] stage
[Pipeline] { (Results)
[Pipeline] junit
Recording test results
[Pipeline] archiveArtifacts
Archiving artifacts
[Pipeline] findbugs
[FINDBUGS] Collecting findbugs analysis files...
[FINDBUGS] Searching for all files in /home/jenkins/agent/workspace/egit-stable/repo that match the pattern */target/*bugsXml.xml
[FINDBUGS] Parsing 8 files in /home/jenkins/agent/workspace/egit-stable/repo
[FINDBUGS] Successfully parsed file /home/jenkins/agent/workspace/egit-stable/repo/org.eclipse.egit.core.junit/target/spotbugsXml.xml with 4 unique warnings and 0 duplicates.
[FINDBUGS] Successfully parsed file /home/jenkins/agent/workspace/egit-stable/repo/org.eclipse.egit.core.test/target/spotbugsXml.xml with 9 unique warnings and 0 duplicates.
[FINDBUGS] Successfully parsed file /home/jenkins/agent/workspace/egit-stable/repo/org.eclipse.egit.core/target/spotbugsXml.xml with 20 unique warnings and 0 duplicates.
[FINDBUGS] Successfully parsed file /home/jenkins/agent/workspace/egit-stable/repo/org.eclipse.egit.gitflow.test/target/spotbugsXml.xml with 20 unique warnings and 0 duplicates.
[FINDBUGS] Successfully parsed file /home/jenkins/agent/workspace/egit-stable/repo/org.eclipse.egit.gitflow.ui/target/spotbugsXml.xml with 20 unique warnings and 0 duplicates.
[FINDBUGS] Successfully parsed file /home/jenkins/agent/workspace/egit-stable/repo/org.eclipse.egit.gitflow/target/spotbugsXml.xml with 22 unique warnings and 0 duplicates.
[FINDBUGS] Successfully parsed file /home/jenkins/agent/workspace/egit-stable/repo/org.eclipse.egit.mylyn.ui/target/spotbugsXml.xml with 22 unique warnings and 0 duplicates.
[FINDBUGS] Successfully parsed file /home/jenkins/agent/workspace/egit-stable/repo/org.eclipse.egit.ui/target/spotbugsXml.xml with 58 unique warnings and 0 duplicates.
Skipping warnings blame since pipelines do not have an SCM link.%n
[FINDBUGS] Computing warning deltas based on reference build #59
[Pipeline] dry
[DRY] Collecting duplicate code analysis files...
[DRY] Searching for all files in /home/jenkins/agent/workspace/egit-stable/repo that match the pattern **/cpd.xml
[DRY] Parsing 15 files in /home/jenkins/agent/workspace/egit-stable/repo
[DRY] Successfully parsed file /home/jenkins/agent/workspace/egit-stable/repo/org.eclipse.egit-feature/target/cpd.xml with 0 unique warnings and 0 duplicates.
[DRY] Successfully parsed file /home/jenkins/agent/workspace/egit-stable/repo/org.eclipse.egit.core.junit/target/cpd.xml with 0 unique warnings and 0 duplicates.
[DRY] Successfully parsed file /home/jenkins/agent/workspace/egit-stable/repo/org.eclipse.egit.core.test/target/cpd.xml with 0 unique warnings and 0 duplicates.
[DRY] Successfully parsed file /home/jenkins/agent/workspace/egit-stable/repo/org.eclipse.egit.core/target/cpd.xml with 4 unique warnings and 0 duplicates.
[DRY] Successfully parsed file /home/jenkins/agent/workspace/egit-stable/repo/org.eclipse.egit.doc/target/cpd.xml with 4 unique warnings and 0 duplicates.
[DRY] Successfully parsed file /home/jenkins/agent/workspace/egit-stable/repo/org.eclipse.egit.gitflow-feature/target/cpd.xml with 4 unique warnings and 0 duplicates.
[DRY] Successfully parsed file /home/jenkins/agent/workspace/egit-stable/repo/org.eclipse.egit.gitflow.test/target/cpd.xml with 4 unique warnings and 0 duplicates.
[DRY] Successfully parsed file /home/jenkins/agent/workspace/egit-stable/repo/org.eclipse.egit.gitflow.ui/target/cpd.xml with 4 unique warnings and 0 duplicates.
[DRY] Successfully parsed file /home/jenkins/agent/workspace/egit-stable/repo/org.eclipse.egit.gitflow/target/cpd.xml with 4 unique warnings and 0 duplicates.
[DRY] Successfully parsed file /home/jenkins/agent/workspace/egit-stable/repo/org.eclipse.egit.mylyn-feature/target/cpd.xml with 4 unique warnings and 0 duplicates.
[DRY] Successfully parsed file /home/jenkins/agent/workspace/egit-stable/repo/org.eclipse.egit.mylyn.ui/target/cpd.xml with 4 unique warnings and 0 duplicates.
[DRY] Successfully parsed file /home/jenkins/agent/workspace/egit-stable/repo/org.eclipse.egit.repository/target/cpd.xml with 4 unique warnings and 0 duplicates.
[DRY] Successfully parsed file /home/jenkins/agent/workspace/egit-stable/repo/org.eclipse.egit.source-feature/target/cpd.xml with 4 unique warnings and 0 duplicates.
[DRY] Successfully parsed file /home/jenkins/agent/workspace/egit-stable/repo/org.eclipse.egit.ui/target/cpd.xml with 35 unique warnings and 0 duplicates.
[DRY] Successfully parsed file /home/jenkins/agent/workspace/egit-stable/repo/org.eclipse.egit/target/cpd.xml with 35 unique warnings and 0 duplicates.
Skipping warnings blame since pipelines do not have an SCM link.%n
[DRY] Computing warning deltas based on reference build #59
[Pipeline] }
[Pipeline] // stage
[Pipeline] step
Sending e-mails to: egit-build@eclipse.org
[Pipeline] }
[Pipeline] // dir
[Pipeline] }
Terminating xvnc.
[Pipeline] // wrap
[Pipeline] }
[Pipeline] // timeout
[Pipeline] }
[Pipeline] // node
[Pipeline] }
[Pipeline] // timestamps
[Pipeline] End of Pipeline
ERROR: script returned exit code 1
Finished: FAILURE