FailedConsole Output

Skipping 293 KB.. Full Log
15:17:36 [2021-03-10T20:17:36.249Z] createCommentNullGistId(org.eclipse.egit.github.core.tests.GistServiceTest)  Time elapsed: 0 s
15:17:36 [2021-03-10T20:17:36.249Z] getCommentsOK(org.eclipse.egit.github.core.tests.GistServiceTest)  Time elapsed: 0 s
15:17:36 [2021-03-10T20:17:36.249Z] getCommentsNullGistId(org.eclipse.egit.github.core.tests.GistServiceTest)  Time elapsed: 0.001 s
15:17:36 [2021-03-10T20:17:36.249Z] unstarGistNullId(org.eclipse.egit.github.core.tests.GistServiceTest)  Time elapsed: 0 s
15:17:36 [2021-03-10T20:17:36.249Z] pageUserGistsNullId(org.eclipse.egit.github.core.tests.GistServiceTest)  Time elapsed: 0 s
15:17:36 [2021-03-10T20:17:36.249Z] getGistNullId(org.eclipse.egit.github.core.tests.GistServiceTest)  Time elapsed: 0 s
15:17:36 [2021-03-10T20:17:36.249Z] defaultContructor(org.eclipse.egit.github.core.tests.GistServiceTest)  Time elapsed: 0.001 s
15:17:36 [2021-03-10T20:17:36.249Z] getGistComment(org.eclipse.egit.github.core.tests.GistServiceTest)  Time elapsed: 0 s
15:17:36 [2021-03-10T20:17:36.249Z] createCommentNullComment(org.eclipse.egit.github.core.tests.GistServiceTest)  Time elapsed: 0 s
15:17:36 [2021-03-10T20:17:36.249Z] getGistsOK(org.eclipse.egit.github.core.tests.GistServiceTest)  Time elapsed: 0.001 s
15:17:36 [2021-03-10T20:17:36.249Z] starGist(org.eclipse.egit.github.core.tests.GistServiceTest)  Time elapsed: 0 s
15:17:36 [2021-03-10T20:17:36.249Z] createCommentOK(org.eclipse.egit.github.core.tests.GistServiceTest)  Time elapsed: 0 s
15:17:36 [2021-03-10T20:17:36.249Z] forkGistEmptyId(org.eclipse.egit.github.core.tests.GistServiceTest)  Time elapsed: 0 s
15:17:36 [2021-03-10T20:17:36.249Z] deleteGistComment(org.eclipse.egit.github.core.tests.GistServiceTest)  Time elapsed: 0 s
15:17:36 [2021-03-10T20:17:36.249Z] deleteGist(org.eclipse.egit.github.core.tests.GistServiceTest)  Time elapsed: 0 s
15:17:36 [2021-03-10T20:17:36.249Z] updateGistNullGist(org.eclipse.egit.github.core.tests.GistServiceTest)  Time elapsed: 0.001 s
15:17:36 [2021-03-10T20:17:36.249Z] getGistsEmptyUser(org.eclipse.egit.github.core.tests.GistServiceTest)  Time elapsed: 0 s
15:17:36 [2021-03-10T20:17:36.249Z] unstarGistEmptyId(org.eclipse.egit.github.core.tests.GistServiceTest)  Time elapsed: 0 s
15:17:36 [2021-03-10T20:17:36.249Z] updateFields(org.eclipse.egit.github.core.tests.GistTest)  Time elapsed: 0 s
15:17:36 [2021-03-10T20:17:36.249Z] defaultState(org.eclipse.egit.github.core.tests.GistTest)  Time elapsed: 0 s
15:17:36 [2021-03-10T20:17:36.249Z] getCreatedAtReferenceMutableObject(org.eclipse.egit.github.core.tests.GistTest)  Time elapsed: 0 s
15:17:36 [2021-03-10T20:17:36.249Z] getUpdatedAtReferenceMutableObject(org.eclipse.egit.github.core.tests.GistTest)  Time elapsed: 0 s
15:17:36 [2021-03-10T20:17:36.249Z] prefixLocalhost(org.eclipse.egit.github.core.tests.GitHubClientTest)  Time elapsed: 0 s
15:17:36 [2021-03-10T20:17:36.249Z] prefixHostApiV3(org.eclipse.egit.github.core.tests.GitHubClientTest)  Time elapsed: 0 s
15:17:36 [2021-03-10T20:17:36.249Z] updateFields(org.eclipse.egit.github.core.tests.GollumPageTest)  Time elapsed: 0 s
15:17:36 [2021-03-10T20:17:36.249Z] defaultState(org.eclipse.egit.github.core.tests.GollumPageTest)  Time elapsed: 0 s
15:17:36 [2021-03-10T20:17:36.249Z] updateFields(org.eclipse.egit.github.core.tests.GollumPayloadTest)  Time elapsed: 0 s
15:17:36 [2021-03-10T20:17:36.249Z] defaultState(org.eclipse.egit.github.core.tests.GollumPayloadTest)  Time elapsed: 0 s
15:17:36 [2021-03-10T20:17:36.249Z] seriazlizeNulls(org.eclipse.egit.github.core.tests.GsonUtilsTest)  Time elapsed: 0.001 s
15:17:36 [2021-03-10T20:17:36.249Z] noSeriazlizeNulls(org.eclipse.egit.github.core.tests.GsonUtilsTest)  Time elapsed: 0 s
15:17:36 [2021-03-10T20:17:36.249Z] getGson(org.eclipse.egit.github.core.tests.GsonUtilsTest)  Time elapsed: 0 s
15:17:36 [2021-03-10T20:17:36.249Z] createGson(org.eclipse.egit.github.core.tests.GsonUtilsTest)  Time elapsed: 0.002 s
15:17:36 [2021-03-10T20:17:36.249Z] defaultState(org.eclipse.egit.github.core.tests.IdTest)  Time elapsed: 0.001 s
15:17:36 [2021-03-10T20:17:36.249Z] updateField(org.eclipse.egit.github.core.tests.IdTest)  Time elapsed: 0 s
15:17:36 [2021-03-10T20:17:36.249Z] updateFields(org.eclipse.egit.github.core.tests.IssueCommentPayloadTest)  Time elapsed: 0 s
15:17:36 [2021-03-10T20:17:36.249Z] defaultState(org.eclipse.egit.github.core.tests.IssueCommentPayloadTest)  Time elapsed: 0 s
15:17:36 [2021-03-10T20:17:36.249Z] nonMutableCreatedAt(org.eclipse.egit.github.core.tests.IssueEventTest)  Time elapsed: 0 s
15:17:36 [2021-03-10T20:17:36.249Z] updateFields(org.eclipse.egit.github.core.tests.IssueEventTest)  Time elapsed: 0.001 s
15:17:36 [2021-03-10T20:17:36.249Z] defaultState(org.eclipse.egit.github.core.tests.IssueEventTest)  Time elapsed: 0 s
15:17:36 [2021-03-10T20:17:36.249Z] getCommentsEmptyUser(org.eclipse.egit.github.core.tests.IssueServiceTest)  Time elapsed: 0 s
15:17:36 [2021-03-10T20:17:36.249Z] createCommentNullIssueId(org.eclipse.egit.github.core.tests.IssueServiceTest)  Time elapsed: 0 s
15:17:36 [2021-03-10T20:17:36.249Z] createIssueEmptyUser(org.eclipse.egit.github.core.tests.IssueServiceTest)  Time elapsed: 0 s
15:17:36 [2021-03-10T20:17:36.249Z] getIssueComment(org.eclipse.egit.github.core.tests.IssueServiceTest)  Time elapsed: 0.001 s
15:17:36 [2021-03-10T20:17:36.249Z] pageIssueEvents(org.eclipse.egit.github.core.tests.IssueServiceTest)  Time elapsed: 0 s
15:17:36 [2021-03-10T20:17:36.249Z] editIssueNullRepositoryName(org.eclipse.egit.github.core.tests.IssueServiceTest)  Time elapsed: 0 s
15:17:36 [2021-03-10T20:17:36.249Z] deleteCommentNullRepositoryName(org.eclipse.egit.github.core.tests.IssueServiceTest)  Time elapsed: 0 s
15:17:36 [2021-03-10T20:17:36.249Z] getIssueNullRepositoryId(org.eclipse.egit.github.core.tests.IssueServiceTest)  Time elapsed: 0 s
15:17:36 [2021-03-10T20:17:36.249Z] deleteCommentWithRepositoryId(org.eclipse.egit.github.core.tests.IssueServiceTest)  Time elapsed: 0 s
15:17:36 [2021-03-10T20:17:36.249Z] deleteCommentNullId(org.eclipse.egit.github.core.tests.IssueServiceTest)  Time elapsed: 0.001 s
15:17:36 [2021-03-10T20:17:36.249Z] editIssue(org.eclipse.egit.github.core.tests.IssueServiceTest)  Time elapsed: 0 s
15:17:36 [2021-03-10T20:17:36.249Z] createCommentEmptyRepositoryName(org.eclipse.egit.github.core.tests.IssueServiceTest)  Time elapsed: 0.001 s
15:17:36 [2021-03-10T20:17:36.249Z] getIssueWithRepositoryId(org.eclipse.egit.github.core.tests.IssueServiceTest)  Time elapsed: 0 s
15:17:36 [2021-03-10T20:17:36.249Z] createCommentNullRepositoryName(org.eclipse.egit.github.core.tests.IssueServiceTest)  Time elapsed: 0 s
15:17:36 [2021-03-10T20:17:36.249Z] getIssueNullUser(org.eclipse.egit.github.core.tests.IssueServiceTest)  Time elapsed: 0 s
15:17:36 [2021-03-10T20:17:36.249Z] editIssueEmptyRepositoryName(org.eclipse.egit.github.core.tests.IssueServiceTest)  Time elapsed: 0 s
15:17:36 [2021-03-10T20:17:36.249Z] createIssueNullRepositoryName(org.eclipse.egit.github.core.tests.IssueServiceTest)  Time elapsed: 0 s
15:17:36 [2021-03-10T20:17:36.249Z] getCommentsNullRepositoryName(org.eclipse.egit.github.core.tests.IssueServiceTest)  Time elapsed: 0 s
15:17:36 [2021-03-10T20:17:36.249Z] deleteCommentEmptyRepositoryName(org.eclipse.egit.github.core.tests.IssueServiceTest)  Time elapsed: 0 s
15:17:36 [2021-03-10T20:17:36.249Z] getCommentsEmptyRepositoryName(org.eclipse.egit.github.core.tests.IssueServiceTest)  Time elapsed: 0 s
15:17:36 [2021-03-10T20:17:36.249Z] getIssueEmptyUser(org.eclipse.egit.github.core.tests.IssueServiceTest)  Time elapsed: 0 s
15:17:36 [2021-03-10T20:17:36.249Z] createComment(org.eclipse.egit.github.core.tests.IssueServiceTest)  Time elapsed: 0 s
15:17:36 [2021-03-10T20:17:36.249Z] getCommentsNullRepositoryId(org.eclipse.egit.github.core.tests.IssueServiceTest)  Time elapsed: 0 s
15:17:36 [2021-03-10T20:17:36.249Z] getIssuesNullUser(org.eclipse.egit.github.core.tests.IssueServiceTest)  Time elapsed: 0 s
15:17:36 [2021-03-10T20:17:36.249Z] editIssueCommentNullComment(org.eclipse.egit.github.core.tests.IssueServiceTest)  Time elapsed: 0 s
15:17:36 [2021-03-10T20:17:36.249Z] getCommentsWithRepositoryId(org.eclipse.egit.github.core.tests.IssueServiceTest)  Time elapsed: 0.001 s
15:17:36 [2021-03-10T20:17:36.249Z] constructorNullArgument(org.eclipse.egit.github.core.tests.IssueServiceTest)  Time elapsed: 0 s
15:17:36 [2021-03-10T20:17:36.249Z] pageRepsitoryIssuesWithRepositoryId(org.eclipse.egit.github.core.tests.IssueServiceTest)  Time elapsed: 0.001 s
15:17:36 [2021-03-10T20:17:36.250Z] getCommentsNullId(org.eclipse.egit.github.core.tests.IssueServiceTest)  Time elapsed: 0 s
15:17:36 [2021-03-10T20:17:36.250Z] deleteCommentEmptyUser(org.eclipse.egit.github.core.tests.IssueServiceTest)  Time elapsed: 0 s
15:17:36 [2021-03-10T20:17:36.250Z] getCurrentUserIssues(org.eclipse.egit.github.core.tests.IssueServiceTest)  Time elapsed: 0.001 s
15:17:36 [2021-03-10T20:17:36.250Z] createIssueNullIssueWithRepositoryId(org.eclipse.egit.github.core.tests.IssueServiceTest)  Time elapsed: 0 s
15:17:36 [2021-03-10T20:17:36.250Z] editIssueEmptyUser(org.eclipse.egit.github.core.tests.IssueServiceTest)  Time elapsed: 0 s
15:17:36 [2021-03-10T20:17:36.250Z] getIssueNullRepositoryName(org.eclipse.egit.github.core.tests.IssueServiceTest)  Time elapsed: 0 s
15:17:36 [2021-03-10T20:17:36.250Z] defaultConstructor(org.eclipse.egit.github.core.tests.IssueServiceTest)  Time elapsed: 0.001 s
15:17:36 [2021-03-10T20:17:36.250Z] getIssuesEmptyRepositoryName(org.eclipse.egit.github.core.tests.IssueServiceTest)  Time elapsed: 0 s
15:17:36 [2021-03-10T20:17:36.250Z] getIssueEmptyId(org.eclipse.egit.github.core.tests.IssueServiceTest)  Time elapsed: 0 s
15:17:36 [2021-03-10T20:17:36.250Z] deleteCommentNullUser(org.eclipse.egit.github.core.tests.IssueServiceTest)  Time elapsed: 0 s
15:17:36 [2021-03-10T20:17:36.250Z] createCommentNullUser(org.eclipse.egit.github.core.tests.IssueServiceTest)  Time elapsed: 0 s
15:17:36 [2021-03-10T20:17:36.250Z] createIssueEmptyRepositoryName(org.eclipse.egit.github.core.tests.IssueServiceTest)  Time elapsed: 0 s
15:17:36 [2021-03-10T20:17:36.250Z] searchIssues(org.eclipse.egit.github.core.tests.IssueServiceTest)  Time elapsed: 0 s
15:17:36 [2021-03-10T20:17:36.250Z] editIssueWithRepositoryId(org.eclipse.egit.github.core.tests.IssueServiceTest)  Time elapsed: 0 s
15:17:36 [2021-03-10T20:17:36.250Z] searchEscaped(org.eclipse.egit.github.core.tests.IssueServiceTest)  Time elapsed: 0 s
15:17:36 [2021-03-10T20:17:36.250Z] getCommentsEmptyId(org.eclipse.egit.github.core.tests.IssueServiceTest)  Time elapsed: 0 s
15:17:36 [2021-03-10T20:17:36.250Z] editIssueComment(org.eclipse.egit.github.core.tests.IssueServiceTest)  Time elapsed: 0 s
15:17:36 [2021-03-10T20:17:36.250Z] createCommentWithRepositoryId(org.eclipse.egit.github.core.tests.IssueServiceTest)  Time elapsed: 0.001 s
15:17:36 [2021-03-10T20:17:36.250Z] searchIssueEmptyQuery(org.eclipse.egit.github.core.tests.IssueServiceTest)  Time elapsed: 0 s
15:17:36 [2021-03-10T20:17:36.250Z] searchIssueEmptyState(org.eclipse.egit.github.core.tests.IssueServiceTest)  Time elapsed: 0 s
15:17:36 [2021-03-10T20:17:36.250Z] createIssueNullIssue(org.eclipse.egit.github.core.tests.IssueServiceTest)  Time elapsed: 0 s
15:17:36 [2021-03-10T20:17:36.250Z] getIssuesRepositoryId(org.eclipse.egit.github.core.tests.IssueServiceTest)  Time elapsed: 0 s
15:17:36 [2021-03-10T20:17:36.250Z] getIssues(org.eclipse.egit.github.core.tests.IssueServiceTest)  Time elapsed: 0.001 s
15:17:36 [2021-03-10T20:17:36.250Z] getIssueNullId(org.eclipse.egit.github.core.tests.IssueServiceTest)  Time elapsed: 0 s
15:17:36 [2021-03-10T20:17:36.250Z] editIssueCommentWithRepositoryId(org.eclipse.egit.github.core.tests.IssueServiceTest)  Time elapsed: 0 s
15:17:36 [2021-03-10T20:17:36.250Z] deleteComment(org.eclipse.egit.github.core.tests.IssueServiceTest)  Time elapsed: 0 s
15:17:36 [2021-03-10T20:17:36.250Z] pageEvents(org.eclipse.egit.github.core.tests.IssueServiceTest)  Time elapsed: 0 s
15:17:36 [2021-03-10T20:17:36.250Z] editIssueNullUser(org.eclipse.egit.github.core.tests.IssueServiceTest)  Time elapsed: 0.001 s
15:17:36 [2021-03-10T20:17:36.250Z] createCommentEmptyIssueId(org.eclipse.egit.github.core.tests.IssueServiceTest)  Time elapsed: 0 s
15:17:36 [2021-03-10T20:17:36.250Z] pageIssues(org.eclipse.egit.github.core.tests.IssueServiceTest)  Time elapsed: 0 s
15:17:36 [2021-03-10T20:17:36.250Z] createIssueNullUser(org.eclipse.egit.github.core.tests.IssueServiceTest)  Time elapsed: 0 s
15:17:36 [2021-03-10T20:17:36.250Z] getIssueEvent(org.eclipse.egit.github.core.tests.IssueServiceTest)  Time elapsed: 0 s
15:17:36 [2021-03-10T20:17:36.250Z] getIssueEmptyRepositoryName(org.eclipse.egit.github.core.tests.IssueServiceTest)  Time elapsed: 0.001 s
15:17:36 [2021-03-10T20:17:36.250Z] getIssuesNullRepositoryId(org.eclipse.egit.github.core.tests.IssueServiceTest)  Time elapsed: 0 s
15:17:36 [2021-03-10T20:17:36.250Z] getComments(org.eclipse.egit.github.core.tests.IssueServiceTest)  Time elapsed: 0 s
15:17:36 [2021-03-10T20:17:36.250Z] getIssuesNullRepositoryName(org.eclipse.egit.github.core.tests.IssueServiceTest)  Time elapsed: 0 s
15:17:36 [2021-03-10T20:17:36.250Z] createCommentEmptyUser(org.eclipse.egit.github.core.tests.IssueServiceTest)  Time elapsed: 0 s
15:17:36 [2021-03-10T20:17:36.250Z] deleteCommentEmptyId(org.eclipse.egit.github.core.tests.IssueServiceTest)  Time elapsed: 0 s
15:17:36 [2021-03-10T20:17:36.250Z] searchIssuesNullRepository(org.eclipse.egit.github.core.tests.IssueServiceTest)  Time elapsed: 0.001 s
15:17:36 [2021-03-10T20:17:36.250Z] pageRepsitoryIssues(org.eclipse.egit.github.core.tests.IssueServiceTest)  Time elapsed: 0 s
15:17:36 [2021-03-10T20:17:36.250Z] editIssueNullIssue(org.eclipse.egit.github.core.tests.IssueServiceTest)  Time elapsed: 0 s
15:17:36 [2021-03-10T20:17:36.250Z] getCommentsNullUser(org.eclipse.egit.github.core.tests.IssueServiceTest)  Time elapsed: 0 s
15:17:36 [2021-03-10T20:17:36.250Z] getIssue(org.eclipse.egit.github.core.tests.IssueServiceTest)  Time elapsed: 0 s
15:17:36 [2021-03-10T20:17:36.250Z] searchIssueNullQuery(org.eclipse.egit.github.core.tests.IssueServiceTest)  Time elapsed: 0 s
15:17:36 [2021-03-10T20:17:36.250Z] searchIssueNullState(org.eclipse.egit.github.core.tests.IssueServiceTest)  Time elapsed: 0.001 s
15:17:36 [2021-03-10T20:17:36.250Z] getIssuesEmptyUser(org.eclipse.egit.github.core.tests.IssueServiceTest)  Time elapsed: 0 s
15:17:36 [2021-03-10T20:17:36.250Z] getClosedAtReferenceMutableObject(org.eclipse.egit.github.core.tests.IssueTest)  Time elapsed: 0 s
15:17:36 [2021-03-10T20:17:36.250Z] updateFields(org.eclipse.egit.github.core.tests.IssueTest)  Time elapsed: 0 s
15:17:36 [2021-03-10T20:17:36.250Z] defaultState(org.eclipse.egit.github.core.tests.IssueTest)  Time elapsed: 0 s
15:17:36 [2021-03-10T20:17:36.250Z] getCreatedAtReferenceMutableObject(org.eclipse.egit.github.core.tests.IssueTest)  Time elapsed: 0 s
15:17:36 [2021-03-10T20:17:36.250Z] getUpdatedAtReferenceMutableObject(org.eclipse.egit.github.core.tests.IssueTest)  Time elapsed: 0 s
15:17:36 [2021-03-10T20:17:36.250Z] updateFields(org.eclipse.egit.github.core.tests.IssuesPayloadTest)  Time elapsed: 0 s
15:17:36 [2021-03-10T20:17:36.250Z] defaultState(org.eclipse.egit.github.core.tests.IssuesPayloadTest)  Time elapsed: 0 s
15:17:36 [2021-03-10T20:17:36.250Z] updateFields(org.eclipse.egit.github.core.tests.KeyTest)  Time elapsed: 0 s
15:17:36 [2021-03-10T20:17:36.250Z] defaultState(org.eclipse.egit.github.core.tests.KeyTest)  Time elapsed: 0 s
15:17:36 [2021-03-10T20:17:36.250Z] compareLabels(org.eclipse.egit.github.core.tests.LabelComparatorTest)  Time elapsed: 0.001 s
15:17:36 [2021-03-10T20:17:36.250Z] getLabelsNullUser(org.eclipse.egit.github.core.tests.LabelServiceTest)  Time elapsed: 0 s
15:17:36 [2021-03-10T20:17:36.250Z] setLabelsNullIssueId(org.eclipse.egit.github.core.tests.LabelServiceTest)  Time elapsed: 0 s
15:17:36 [2021-03-10T20:17:36.250Z] editLabel(org.eclipse.egit.github.core.tests.LabelServiceTest)  Time elapsed: 0.001 s
15:17:36 [2021-03-10T20:17:36.250Z] editLabelNullLabelName(org.eclipse.egit.github.core.tests.LabelServiceTest)  Time elapsed: 0 s
15:17:36 [2021-03-10T20:17:36.250Z] getEmptyUser(org.eclipse.egit.github.core.tests.LabelServiceTest)  Time elapsed: 0 s
15:17:36 [2021-03-10T20:17:36.250Z] getEmptyLabel(org.eclipse.egit.github.core.tests.LabelServiceTest)  Time elapsed: 0 s
15:17:36 [2021-03-10T20:17:36.250Z] getLabelWithRepositoryId(org.eclipse.egit.github.core.tests.LabelServiceTest)  Time elapsed: 0.001 s
15:17:36 [2021-03-10T20:17:36.250Z] deleteLabel(org.eclipse.egit.github.core.tests.LabelServiceTest)  Time elapsed: 0 s
15:17:36 [2021-03-10T20:17:36.250Z] getLabelsNullRepositoryName(org.eclipse.egit.github.core.tests.LabelServiceTest)  Time elapsed: 0 s
15:17:36 [2021-03-10T20:17:36.250Z] createLabelNullLabel(org.eclipse.egit.github.core.tests.LabelServiceTest)  Time elapsed: 0 s
15:17:36 [2021-03-10T20:17:36.250Z] constructorNullArgument(org.eclipse.egit.github.core.tests.LabelServiceTest)  Time elapsed: 0 s
15:17:36 [2021-03-10T20:17:36.250Z] deleteEmptyUser(org.eclipse.egit.github.core.tests.LabelServiceTest)  Time elapsed: 0.001 s
15:17:36 [2021-03-10T20:17:36.250Z] getEmptyRepositoryName(org.eclipse.egit.github.core.tests.LabelServiceTest)  Time elapsed: 0 s
15:17:36 [2021-03-10T20:17:36.250Z] createLabel(org.eclipse.egit.github.core.tests.LabelServiceTest)  Time elapsed: 0 s
15:17:36 [2021-03-10T20:17:36.250Z] setLabelsEmptyIssueId(org.eclipse.egit.github.core.tests.LabelServiceTest)  Time elapsed: 0 s
15:17:36 [2021-03-10T20:17:36.250Z] defaultConstuctor(org.eclipse.egit.github.core.tests.LabelServiceTest)  Time elapsed: 0 s
15:17:36 [2021-03-10T20:17:36.250Z] getNullUser(org.eclipse.egit.github.core.tests.LabelServiceTest)  Time elapsed: 0.001 s
15:17:36 [2021-03-10T20:17:36.250Z] setLabelsNullLabels(org.eclipse.egit.github.core.tests.LabelServiceTest)  Time elapsed: 0 s
15:17:36 [2021-03-10T20:17:36.250Z] deleteNullUser(org.eclipse.egit.github.core.tests.LabelServiceTest)  Time elapsed: 0.001 s
15:17:36 [2021-03-10T20:17:36.250Z] deleteNullRepositoryName(org.eclipse.egit.github.core.tests.LabelServiceTest)  Time elapsed: 0 s
15:17:36 [2021-03-10T20:17:36.250Z] setLabels(org.eclipse.egit.github.core.tests.LabelServiceTest)  Time elapsed: 0 s
15:17:36 [2021-03-10T20:17:36.250Z] deleteLabelWithRepositoryId(org.eclipse.egit.github.core.tests.LabelServiceTest)  Time elapsed: 0 s
15:17:36 [2021-03-10T20:17:36.250Z] getLabels(org.eclipse.egit.github.core.tests.LabelServiceTest)  Time elapsed: 0 s
15:17:36 [2021-03-10T20:17:36.250Z] editLabelNullLabel(org.eclipse.egit.github.core.tests.LabelServiceTest)  Time elapsed: 0 s
15:17:36 [2021-03-10T20:17:36.250Z] getNullRepositoryName(org.eclipse.egit.github.core.tests.LabelServiceTest)  Time elapsed: 0.001 s
15:17:36 [2021-03-10T20:17:36.250Z] getLabelsWithRepositoryId(org.eclipse.egit.github.core.tests.LabelServiceTest)  Time elapsed: 0 s
15:17:36 [2021-03-10T20:17:36.250Z] getNullLabel(org.eclipse.egit.github.core.tests.LabelServiceTest)  Time elapsed: 0 s
15:17:36 [2021-03-10T20:17:36.250Z] setLabelsNullUser(org.eclipse.egit.github.core.tests.LabelServiceTest)  Time elapsed: 0 s
15:17:36 [2021-03-10T20:17:36.250Z] editLabelEmptyLabelName(org.eclipse.egit.github.core.tests.LabelServiceTest)  Time elapsed: 0.001 s
15:17:36 [2021-03-10T20:17:36.250Z] deleteEmptyRepositoryName(org.eclipse.egit.github.core.tests.LabelServiceTest)  Time elapsed: 0 s
15:17:36 [2021-03-10T20:17:36.250Z] createLabelNullRepositoryName(org.eclipse.egit.github.core.tests.LabelServiceTest)  Time elapsed: 0 s
15:17:36 [2021-03-10T20:17:36.250Z] deleteEmptyLabel(org.eclipse.egit.github.core.tests.LabelServiceTest)  Time elapsed: 0 s
15:17:36 [2021-03-10T20:17:36.250Z] setLabelsWithRepositoryId(org.eclipse.egit.github.core.tests.LabelServiceTest)  Time elapsed: 0.001 s
15:17:36 [2021-03-10T20:17:36.250Z] createLabelNullUser(org.eclipse.egit.github.core.tests.LabelServiceTest)  Time elapsed: 0 s
15:17:36 [2021-03-10T20:17:36.250Z] deleteNullLabel(org.eclipse.egit.github.core.tests.LabelServiceTest)  Time elapsed: 0 s
15:17:36 [2021-03-10T20:17:36.250Z] setLabelsNullRepositoryName(org.eclipse.egit.github.core.tests.LabelServiceTest)  Time elapsed: 0 s
15:17:36 [2021-03-10T20:17:36.250Z] createLabelWithRepositoryId(org.eclipse.egit.github.core.tests.LabelServiceTest)  Time elapsed: 0 s
15:17:36 [2021-03-10T20:17:36.250Z] getLabel(org.eclipse.egit.github.core.tests.LabelServiceTest)  Time elapsed: 0.001 s
15:17:36 [2021-03-10T20:17:36.250Z] updateFields(org.eclipse.egit.github.core.tests.LabelTest)  Time elapsed: 0 s
15:17:36 [2021-03-10T20:17:36.250Z] defaultState(org.eclipse.egit.github.core.tests.LabelTest)  Time elapsed: 0 s
15:17:36 [2021-03-10T20:17:36.250Z] equality(org.eclipse.egit.github.core.tests.LabelTest)  Time elapsed: 0 s
15:17:36 [2021-03-10T20:17:36.250Z] languages(org.eclipse.egit.github.core.tests.LanguagesTest)  Time elapsed: 0.025 s
15:17:36 [2021-03-10T20:17:36.250Z] getRepositoryHtml(org.eclipse.egit.github.core.tests.MarkdownServiceTest)  Time elapsed: 0.001 s
15:17:36 [2021-03-10T20:17:36.250Z] getHtml(org.eclipse.egit.github.core.tests.MarkdownServiceTest)  Time elapsed: 0 s
15:17:36 [2021-03-10T20:17:36.250Z] getRepositoryHtmlNullRepository(org.eclipse.egit.github.core.tests.MarkdownServiceTest)  Time elapsed: 0 s
15:17:36 [2021-03-10T20:17:36.250Z] updateFields(org.eclipse.egit.github.core.tests.MemberPayloadTest)  Time elapsed: 0 s
15:17:36 [2021-03-10T20:17:36.250Z] defaultState(org.eclipse.egit.github.core.tests.MemberPayloadTest)  Time elapsed: 0 s
15:17:36 [2021-03-10T20:17:36.250Z] updateFields(org.eclipse.egit.github.core.tests.MergeStatusTest)  Time elapsed: 0 s
15:17:36 [2021-03-10T20:17:36.250Z] defaultState(org.eclipse.egit.github.core.tests.MergeStatusTest)  Time elapsed: 0 s
15:17:36 [2021-03-10T20:17:36.250Z] compareMilestones(org.eclipse.egit.github.core.tests.MilestoneComparatorTest)  Time elapsed: 0 s
15:17:36 [2021-03-10T20:17:36.250Z] deleteMilestoneNullUser(org.eclipse.egit.github.core.tests.MilestoneServiceTest)  Time elapsed: 0.001 s
15:17:36 [2021-03-10T20:17:36.250Z] editMilestoneDescription(org.eclipse.egit.github.core.tests.MilestoneServiceTest)  Time elapsed: 0.001 s
15:17:36 [2021-03-10T20:17:36.250Z] createMilestoneEmptyRepositoryName(org.eclipse.egit.github.core.tests.MilestoneServiceTest)  Time elapsed: 0 s
15:17:36 [2021-03-10T20:17:36.250Z] editMilestoneFull(org.eclipse.egit.github.core.tests.MilestoneServiceTest)  Time elapsed: 0.001 s
15:17:36 [2021-03-10T20:17:36.250Z] getMilestonesEmptyUser(org.eclipse.egit.github.core.tests.MilestoneServiceTest)  Time elapsed: 0 s
15:17:36 [2021-03-10T20:17:36.250Z] createMilestoneEmptyUser(org.eclipse.egit.github.core.tests.MilestoneServiceTest)  Time elapsed: 0.001 s
15:17:36 [2021-03-10T20:17:36.250Z] createMilestoneFull(org.eclipse.egit.github.core.tests.MilestoneServiceTest)  Time elapsed: 0 s
15:17:36 [2021-03-10T20:17:36.250Z] createMilestoneOpen(org.eclipse.egit.github.core.tests.MilestoneServiceTest)  Time elapsed: 0 s
15:17:36 [2021-03-10T20:17:36.250Z] editMilestoneEmptyMilestone(org.eclipse.egit.github.core.tests.MilestoneServiceTest)  Time elapsed: 0.001 s
15:17:36 [2021-03-10T20:17:36.250Z] createMilestoneNullRepositoryName(org.eclipse.egit.github.core.tests.MilestoneServiceTest)  Time elapsed: 0 s
15:17:36 [2021-03-10T20:17:36.250Z] deleteMilestoneEmptyUser(org.eclipse.egit.github.core.tests.MilestoneServiceTest)  Time elapsed: 0 s
15:17:36 [2021-03-10T20:17:36.250Z] getMilestone(org.eclipse.egit.github.core.tests.MilestoneServiceTest)  Time elapsed: 0.001 s
15:17:36 [2021-03-10T20:17:36.250Z] createMilestoneEmptyMilestone(org.eclipse.egit.github.core.tests.MilestoneServiceTest)  Time elapsed: 0 s
15:17:36 [2021-03-10T20:17:36.250Z] constructorNullArgument(org.eclipse.egit.github.core.tests.MilestoneServiceTest)  Time elapsed: 0 s
15:17:36 [2021-03-10T20:17:36.250Z] getMilestoneEmptyUser(org.eclipse.egit.github.core.tests.MilestoneServiceTest)  Time elapsed: 0 s
15:17:36 [2021-03-10T20:17:36.250Z] getMilestoneNullRepositoryName(org.eclipse.egit.github.core.tests.MilestoneServiceTest)  Time elapsed: 0.001 s
15:17:36 [2021-03-10T20:17:36.250Z] getMilestonesEmptyRepositoryName(org.eclipse.egit.github.core.tests.MilestoneServiceTest)  Time elapsed: 0 s
15:17:36 [2021-03-10T20:17:36.250Z] deleteMilestoneNullRepositoryName(org.eclipse.egit.github.core.tests.MilestoneServiceTest)  Time elapsed: 0 s
15:17:36 [2021-03-10T20:17:36.250Z] getMilestonesNullUser(org.eclipse.egit.github.core.tests.MilestoneServiceTest)  Time elapsed: 0.001 s
15:17:36 [2021-03-10T20:17:36.250Z] defaultConstructor(org.eclipse.egit.github.core.tests.MilestoneServiceTest)  Time elapsed: 0 s
15:17:36 [2021-03-10T20:17:36.250Z] deleteMilestone(org.eclipse.egit.github.core.tests.MilestoneServiceTest)  Time elapsed: 0 s
15:17:36 [2021-03-10T20:17:36.250Z] getMilestoneEmptyRepositoryName(org.eclipse.egit.github.core.tests.MilestoneServiceTest)  Time elapsed: 0 s
15:17:36 [2021-03-10T20:17:36.250Z] createMilestoneNullMilestone(org.eclipse.egit.github.core.tests.MilestoneServiceTest)  Time elapsed: 0.001 s
15:17:36 [2021-03-10T20:17:36.250Z] editMilestone(org.eclipse.egit.github.core.tests.MilestoneServiceTest)  Time elapsed: 0 s
15:17:36 [2021-03-10T20:17:36.250Z] createMilestoneNullUser(org.eclipse.egit.github.core.tests.MilestoneServiceTest)  Time elapsed: 0 s
15:17:36 [2021-03-10T20:17:36.250Z] createMilestoneInvalidState(org.eclipse.egit.github.core.tests.MilestoneServiceTest)  Time elapsed: 0 s
15:17:36 [2021-03-10T20:17:36.250Z] getMilestonesNullRepositoryName(org.eclipse.egit.github.core.tests.MilestoneServiceTest)  Time elapsed: 0 s
15:17:36 [2021-03-10T20:17:36.250Z] getMilestonesNullState(org.eclipse.egit.github.core.tests.MilestoneServiceTest)  Time elapsed: 0.001 s
15:17:36 [2021-03-10T20:17:36.251Z] getMilestoneWithRepositoryId(org.eclipse.egit.github.core.tests.MilestoneServiceTest)  Time elapsed: 0 s
15:17:36 [2021-03-10T20:17:36.251Z] getMilestonesOpenStateWithRepositoryId(org.eclipse.egit.github.core.tests.MilestoneServiceTest)  Time elapsed: 0.001 s
15:17:36 [2021-03-10T20:17:36.251Z] deleteMilestoneNullMilestone(org.eclipse.egit.github.core.tests.MilestoneServiceTest)  Time elapsed: 0 s
15:17:36 [2021-03-10T20:17:36.251Z] getMilestonesOpenState(org.eclipse.egit.github.core.tests.MilestoneServiceTest)  Time elapsed: 0.001 s
15:17:36 [2021-03-10T20:17:36.251Z] deleteMilestoneEmptyMilestone(org.eclipse.egit.github.core.tests.MilestoneServiceTest)  Time elapsed: 0 s
15:17:36 [2021-03-10T20:17:36.251Z] createMilestoneNoTitle(org.eclipse.egit.github.core.tests.MilestoneServiceTest)  Time elapsed: 0 s
15:17:36 [2021-03-10T20:17:36.251Z] createMilestoneClosed(org.eclipse.egit.github.core.tests.MilestoneServiceTest)  Time elapsed: 0 s
15:17:36 [2021-03-10T20:17:36.251Z] getMilestoneNullId(org.eclipse.egit.github.core.tests.MilestoneServiceTest)  Time elapsed: 0.001 s
15:17:36 [2021-03-10T20:17:36.251Z] createMilestone(org.eclipse.egit.github.core.tests.MilestoneServiceTest)  Time elapsed: 0 s
15:17:36 [2021-03-10T20:17:36.251Z] getMilestoneNullUser(org.eclipse.egit.github.core.tests.MilestoneServiceTest)  Time elapsed: 0 s
15:17:36 [2021-03-10T20:17:36.251Z] deleteMilestoneWithRepositoryId(org.eclipse.egit.github.core.tests.MilestoneServiceTest)  Time elapsed: 0 s
15:17:36 [2021-03-10T20:17:36.251Z] deleteMilestoneEmptyRepositoryName(org.eclipse.egit.github.core.tests.MilestoneServiceTest)  Time elapsed: 0 s
15:17:36 [2021-03-10T20:17:36.251Z] getMilestoneEmptyId(org.eclipse.egit.github.core.tests.MilestoneServiceTest)  Time elapsed: 0 s
15:17:36 [2021-03-10T20:17:36.251Z] createMilestoneWithRepositoryId(org.eclipse.egit.github.core.tests.MilestoneServiceTest)  Time elapsed: 0 s
15:17:36 [2021-03-10T20:17:36.251Z] editMilestoneNullMilestone(org.eclipse.egit.github.core.tests.MilestoneServiceTest)  Time elapsed: 0.001 s
15:17:36 [2021-03-10T20:17:36.251Z] setDueOnReferenceMutableObject(org.eclipse.egit.github.core.tests.MilestoneTest)  Time elapsed: 0 s
15:17:36 [2021-03-10T20:17:36.251Z] updateFields(org.eclipse.egit.github.core.tests.MilestoneTest)  Time elapsed: 0 s
15:17:36 [2021-03-10T20:17:36.251Z] getDueOn_ReferenceMutableObject(org.eclipse.egit.github.core.tests.MilestoneTest)  Time elapsed: 0 s
15:17:36 [2021-03-10T20:17:36.251Z] defaultState(org.eclipse.egit.github.core.tests.MilestoneTest)  Time elapsed: 0 s
15:17:36 [2021-03-10T20:17:36.251Z] getCreatedAtReferenceMutableObject(org.eclipse.egit.github.core.tests.MilestoneTest)  Time elapsed: 0 s
15:17:36 [2021-03-10T20:17:36.251Z] deleteAuthorization(org.eclipse.egit.github.core.tests.OAuthServiceTest)  Time elapsed: 0 s
15:17:36 [2021-03-10T20:17:36.251Z] removeScopes(org.eclipse.egit.github.core.tests.OAuthServiceTest)  Time elapsed: 0.001 s
15:17:36 [2021-03-10T20:17:36.251Z] constructorNullArgument(org.eclipse.egit.github.core.tests.OAuthServiceTest)  Time elapsed: 0 s
15:17:36 [2021-03-10T20:17:36.251Z] defaultConstructor(org.eclipse.egit.github.core.tests.OAuthServiceTest)  Time elapsed: 0 s
15:17:36 [2021-03-10T20:17:36.251Z] getAuthorizations(org.eclipse.egit.github.core.tests.OAuthServiceTest)  Time elapsed: 0 s
15:17:36 [2021-03-10T20:17:36.251Z] addScopes(org.eclipse.egit.github.core.tests.OAuthServiceTest)  Time elapsed: 0.001 s
15:17:36 [2021-03-10T20:17:36.251Z] createAuthorization(org.eclipse.egit.github.core.tests.OAuthServiceTest)  Time elapsed: 0 s
15:17:36 [2021-03-10T20:17:36.251Z] setScopes(org.eclipse.egit.github.core.tests.OAuthServiceTest)  Time elapsed: 0 s
15:17:36 [2021-03-10T20:17:36.251Z] getAuthorization(org.eclipse.egit.github.core.tests.OAuthServiceTest)  Time elapsed: 0.001 s
15:17:36 [2021-03-10T20:17:36.251Z] showMembershipEmptyName(org.eclipse.egit.github.core.tests.OrganizationServiceTest)  Time elapsed: 0.001 s
15:17:36 [2021-03-10T20:17:36.251Z] showMembershipEmptyUser(org.eclipse.egit.github.core.tests.OrganizationServiceTest)  Time elapsed: 0 s
15:17:36 [2021-03-10T20:17:36.251Z] getMembersAll(org.eclipse.egit.github.core.tests.OrganizationServiceTest)  Time elapsed: 0.001 s
15:17:36 [2021-03-10T20:17:36.251Z] constructor(org.eclipse.egit.github.core.tests.OrganizationServiceTest)  Time elapsed: 0 s
15:17:36 [2021-03-10T20:17:36.251Z] getOrganization(org.eclipse.egit.github.core.tests.OrganizationServiceTest)  Time elapsed: 0 s
15:17:36 [2021-03-10T20:17:36.251Z] removeMemberNullName(org.eclipse.egit.github.core.tests.OrganizationServiceTest)  Time elapsed: 0.001 s
15:17:36 [2021-03-10T20:17:36.251Z] removeMemberNullUser(org.eclipse.egit.github.core.tests.OrganizationServiceTest)  Time elapsed: 0 s
15:17:36 [2021-03-10T20:17:36.251Z] isMemberEmptyName(org.eclipse.egit.github.core.tests.OrganizationServiceTest)  Time elapsed: 0 s
15:17:36 [2021-03-10T20:17:36.251Z] isMemberEmptyUser(org.eclipse.egit.github.core.tests.OrganizationServiceTest)  Time elapsed: 0 s
15:17:36 [2021-03-10T20:17:36.251Z] hideMembershipNullName(org.eclipse.egit.github.core.tests.OrganizationServiceTest)  Time elapsed: 0 s
15:17:36 [2021-03-10T20:17:36.251Z] hideMembershipNullUser(org.eclipse.egit.github.core.tests.OrganizationServiceTest)  Time elapsed: 0 s
15:17:36 [2021-03-10T20:17:36.251Z] getCurrentUserOrganizations(org.eclipse.egit.github.core.tests.OrganizationServiceTest)  Time elapsed: 0 s
15:17:36 [2021-03-10T20:17:36.251Z] getPublicMembersNullName(org.eclipse.egit.github.core.tests.OrganizationServiceTest)  Time elapsed: 0 s
15:17:36 [2021-03-10T20:17:36.251Z] removeMember(org.eclipse.egit.github.core.tests.OrganizationServiceTest)  Time elapsed: 0 s
15:17:36 [2021-03-10T20:17:36.251Z] getMembersEmptyName(org.eclipse.egit.github.core.tests.OrganizationServiceTest)  Time elapsed: 0 s
15:17:36 [2021-03-10T20:17:36.251Z] editOrganizationNullOrgName(org.eclipse.egit.github.core.tests.OrganizationServiceTest)  Time elapsed: 0.001 s
15:17:36 [2021-03-10T20:17:36.251Z] showMembershipNullName(org.eclipse.egit.github.core.tests.OrganizationServiceTest)  Time elapsed: 0 s
15:17:36 [2021-03-10T20:17:36.251Z] showMembershipNullUser(org.eclipse.egit.github.core.tests.OrganizationServiceTest)  Time elapsed: 0 s
15:17:36 [2021-03-10T20:17:36.251Z] getOrganizationNullName(org.eclipse.egit.github.core.tests.OrganizationServiceTest)  Time elapsed: 0 s
15:17:36 [2021-03-10T20:17:36.251Z] isPublicMember(org.eclipse.egit.github.core.tests.OrganizationServiceTest)  Time elapsed: 0.001 s
15:17:36 [2021-03-10T20:17:36.251Z] isMember(org.eclipse.egit.github.core.tests.OrganizationServiceTest)  Time elapsed: 0 s
15:17:36 [2021-03-10T20:17:36.251Z] getOrganizationsEmptyUser(org.eclipse.egit.github.core.tests.OrganizationServiceTest)  Time elapsed: 0 s
15:17:36 [2021-03-10T20:17:36.251Z] isPublicMemberEmptyName(org.eclipse.egit.github.core.tests.OrganizationServiceTest)  Time elapsed: 0 s
15:17:36 [2021-03-10T20:17:36.251Z] isPublicMemberEmptyUser(org.eclipse.egit.github.core.tests.OrganizationServiceTest)  Time elapsed: 0 s
15:17:36 [2021-03-10T20:17:36.251Z] isPublicMemberNullName(org.eclipse.egit.github.core.tests.OrganizationServiceTest)  Time elapsed: 0 s
15:17:36 [2021-03-10T20:17:36.251Z] isPublicMemberNullUser(org.eclipse.egit.github.core.tests.OrganizationServiceTest)  Time elapsed: 0 s
15:17:36 [2021-03-10T20:17:36.251Z] showMembership(org.eclipse.egit.github.core.tests.OrganizationServiceTest)  Time elapsed: 0.001 s
15:17:36 [2021-03-10T20:17:36.251Z] editOrganizationEmptyOrgName(org.eclipse.egit.github.core.tests.OrganizationServiceTest)  Time elapsed: 0 s
15:17:36 [2021-03-10T20:17:36.251Z] hideMembershipEmptyName(org.eclipse.egit.github.core.tests.OrganizationServiceTest)  Time elapsed: 0 s
15:17:36 [2021-03-10T20:17:36.251Z] hideMembershipEmptyUser(org.eclipse.egit.github.core.tests.OrganizationServiceTest)  Time elapsed: 0 s
15:17:36 [2021-03-10T20:17:36.251Z] editOrganization(org.eclipse.egit.github.core.tests.OrganizationServiceTest)  Time elapsed: 0 s
15:17:36 [2021-03-10T20:17:36.251Z] isMemberNullName(org.eclipse.egit.github.core.tests.OrganizationServiceTest)  Time elapsed: 0 s
15:17:36 [2021-03-10T20:17:36.251Z] isMemberNullUser(org.eclipse.egit.github.core.tests.OrganizationServiceTest)  Time elapsed: 0.001 s
15:17:36 [2021-03-10T20:17:36.251Z] editOrganizationNullOrg(org.eclipse.egit.github.core.tests.OrganizationServiceTest)  Time elapsed: 0 s
15:17:36 [2021-03-10T20:17:36.251Z] getOrganizations(org.eclipse.egit.github.core.tests.OrganizationServiceTest)  Time elapsed: 0 s
15:17:36 [2021-03-10T20:17:36.251Z] getPublicMembers(org.eclipse.egit.github.core.tests.OrganizationServiceTest)  Time elapsed: 0.001 s
15:17:36 [2021-03-10T20:17:36.251Z] getPublicMembersEmptyName(org.eclipse.egit.github.core.tests.OrganizationServiceTest)  Time elapsed: 0 s
15:17:36 [2021-03-10T20:17:36.251Z] removeMemberEmptyName(org.eclipse.egit.github.core.tests.OrganizationServiceTest)  Time elapsed: 0 s
15:17:36 [2021-03-10T20:17:36.251Z] removeMemberEmptyUser(org.eclipse.egit.github.core.tests.OrganizationServiceTest)  Time elapsed: 0 s
15:17:36 [2021-03-10T20:17:36.251Z] getMembersMember(org.eclipse.egit.github.core.tests.OrganizationServiceTest)  Time elapsed: 0.001 s
15:17:36 [2021-03-10T20:17:36.251Z] getOrganizationEmptyName(org.eclipse.egit.github.core.tests.OrganizationServiceTest)  Time elapsed: 0 s
15:17:36 [2021-03-10T20:17:36.251Z] getOrganizationsNullUser(org.eclipse.egit.github.core.tests.OrganizationServiceTest)  Time elapsed: 0 s
15:17:36 [2021-03-10T20:17:36.251Z] getMembers(org.eclipse.egit.github.core.tests.OrganizationServiceTest)  Time elapsed: 0.001 s
15:17:36 [2021-03-10T20:17:36.251Z] getMembersNullName(org.eclipse.egit.github.core.tests.OrganizationServiceTest)  Time elapsed: 0 s
15:17:36 [2021-03-10T20:17:36.251Z] hideMembership(org.eclipse.egit.github.core.tests.OrganizationServiceTest)  Time elapsed: 0 s
15:17:36 [2021-03-10T20:17:36.251Z] getMembersAdmin(org.eclipse.egit.github.core.tests.OrganizationServiceTest)  Time elapsed: 0.001 s
15:17:36 [2021-03-10T20:17:36.251Z] defaultState(org.eclipse.egit.github.core.tests.PagedRequestTest)  Time elapsed: 0 s
15:17:36 [2021-03-10T20:17:36.251Z] updateFields(org.eclipse.egit.github.core.tests.PullRequestMarkerTest)  Time elapsed: 0 s
15:17:36 [2021-03-10T20:17:36.251Z] defaultState(org.eclipse.egit.github.core.tests.PullRequestMarkerTest)  Time elapsed: 0 s
15:17:36 [2021-03-10T20:17:36.251Z] updateFields(org.eclipse.egit.github.core.tests.PullRequestPayloadTest)  Time elapsed: 0 s
15:17:36 [2021-03-10T20:17:36.251Z] defaultState(org.eclipse.egit.github.core.tests.PullRequestPayloadTest)  Time elapsed: 0 s
15:17:36 [2021-03-10T20:17:36.251Z] updateFields(org.eclipse.egit.github.core.tests.PullRequestReviewCommentPayloadTest)  Time elapsed: 0 s
15:17:36 [2021-03-10T20:17:36.251Z] defaultState(org.eclipse.egit.github.core.tests.PullRequestReviewCommentPayloadTest)  Time elapsed: 0 s
15:17:36 [2021-03-10T20:17:36.251Z] getPullRequestNullRepository(org.eclipse.egit.github.core.tests.PullRequestServiceTest)  Time elapsed: 0 s
15:17:36 [2021-03-10T20:17:36.251Z] replyToComment(org.eclipse.egit.github.core.tests.PullRequestServiceTest)  Time elapsed: 0.001 s
15:17:36 [2021-03-10T20:17:36.251Z] constructor(org.eclipse.egit.github.core.tests.PullRequestServiceTest)  Time elapsed: 0 s
15:17:36 [2021-03-10T20:17:36.251Z] getPullRequest(org.eclipse.egit.github.core.tests.PullRequestServiceTest)  Time elapsed: 0 s
15:17:36 [2021-03-10T20:17:36.251Z] editComment(org.eclipse.egit.github.core.tests.PullRequestServiceTest)  Time elapsed: 0.001 s
15:17:36 [2021-03-10T20:17:36.251Z] getPullRequestsNullRepository(org.eclipse.egit.github.core.tests.PullRequestServiceTest)  Time elapsed: 0 s
15:17:36 [2021-03-10T20:17:36.251Z] createComment(org.eclipse.egit.github.core.tests.PullRequestServiceTest)  Time elapsed: 0 s
15:17:36 [2021-03-10T20:17:36.251Z] constructorNullArgument(org.eclipse.egit.github.core.tests.PullRequestServiceTest)  Time elapsed: 0.001 s
15:17:36 [2021-03-10T20:17:36.251Z] editPullRequestNullRequest(org.eclipse.egit.github.core.tests.PullRequestServiceTest)  Time elapsed: 0 s
15:17:36 [2021-03-10T20:17:36.251Z] getPullRequestsNullRepositoryId(org.eclipse.egit.github.core.tests.PullRequestServiceTest)  Time elapsed: 0 s
15:17:36 [2021-03-10T20:17:36.251Z] createPullRequestFromIssue(org.eclipse.egit.github.core.tests.PullRequestServiceTest)  Time elapsed: 0.001 s
15:17:36 [2021-03-10T20:17:36.251Z] isMerged(org.eclipse.egit.github.core.tests.PullRequestServiceTest)  Time elapsed: 0 s
15:17:36 [2021-03-10T20:17:36.251Z] createPullRequest(org.eclipse.egit.github.core.tests.PullRequestServiceTest)  Time elapsed: 0 s
15:17:36 [2021-03-10T20:17:36.251Z] editCommentNullComment(org.eclipse.egit.github.core.tests.PullRequestServiceTest)  Time elapsed: 0 s
15:17:36 [2021-03-10T20:17:36.251Z] merge(org.eclipse.egit.github.core.tests.PullRequestServiceTest)  Time elapsed: 0.001 s
15:17:36 [2021-03-10T20:17:36.251Z] deleteComment(org.eclipse.egit.github.core.tests.PullRequestServiceTest)  Time elapsed: 0 s
15:17:36 [2021-03-10T20:17:36.251Z] editPullRequest(org.eclipse.egit.github.core.tests.PullRequestServiceTest)  Time elapsed: 0.001 s
15:17:36 [2021-03-10T20:17:36.251Z] getPullRequests(org.eclipse.egit.github.core.tests.PullRequestServiceTest)  Time elapsed: 0 s
15:17:36 [2021-03-10T20:17:36.251Z] getComments(org.eclipse.egit.github.core.tests.PullRequestServiceTest)  Time elapsed: 0.001 s
15:17:36 [2021-03-10T20:17:36.251Z] getFiles(org.eclipse.egit.github.core.tests.PullRequestServiceTest)  Time elapsed: 0 s
15:17:36 [2021-03-10T20:17:36.251Z] getComment(org.eclipse.egit.github.core.tests.PullRequestServiceTest)  Time elapsed: 0.001 s
15:17:36 [2021-03-10T20:17:36.251Z] getCommits(org.eclipse.egit.github.core.tests.PullRequestServiceTest)  Time elapsed: 0 s
15:17:36 [2021-03-10T20:17:36.251Z] getClosedAtReferenceMutableObject(org.eclipse.egit.github.core.tests.PullRequestTest)  Time elapsed: 0 s
15:17:36 [2021-03-10T20:17:36.251Z] getMergedAtReferenceMutableObject(org.eclipse.egit.github.core.tests.PullRequestTest)  Time elapsed: 0 s
15:17:36 [2021-03-10T20:17:36.251Z] updateFields(org.eclipse.egit.github.core.tests.PullRequestTest)  Time elapsed: 0 s
15:17:36 [2021-03-10T20:17:36.251Z] defaultState(org.eclipse.egit.github.core.tests.PullRequestTest)  Time elapsed: 0 s
15:17:36 [2021-03-10T20:17:36.251Z] getCreatedAtReferenceMutableObject(org.eclipse.egit.github.core.tests.PullRequestTest)  Time elapsed: 0 s
15:17:36 [2021-03-10T20:17:36.251Z] getUpdatedAtReferenceMutableObject(org.eclipse.egit.github.core.tests.PullRequestTest)  Time elapsed: 0 s
15:17:36 [2021-03-10T20:17:36.251Z] updateFields(org.eclipse.egit.github.core.tests.PushPayloadTest)  Time elapsed: 0 s
15:17:36 [2021-03-10T20:17:36.251Z] defaultState(org.eclipse.egit.github.core.tests.PushPayloadTest)  Time elapsed: 0 s
15:17:36 [2021-03-10T20:17:36.251Z] updateFields(org.eclipse.egit.github.core.tests.ReferenceTest)  Time elapsed: 0 s
15:17:36 [2021-03-10T20:17:36.251Z] defaultState(org.eclipse.egit.github.core.tests.ReferenceTest)  Time elapsed: 0 s
15:17:36 [2021-03-10T20:17:36.251Z] updateFields(org.eclipse.egit.github.core.tests.RepositoryBranchTest)  Time elapsed: 0 s
15:17:36 [2021-03-10T20:17:36.252Z] defaultState(org.eclipse.egit.github.core.tests.RepositoryBranchTest)  Time elapsed: 0 s
15:17:36 [2021-03-10T20:17:36.252Z] updateFields(org.eclipse.egit.github.core.tests.RepositoryCommitCompareTest)  Time elapsed: 0 s
15:17:36 [2021-03-10T20:17:36.252Z] defaultState(org.eclipse.egit.github.core.tests.RepositoryCommitCompareTest)  Time elapsed: 0 s
15:17:36 [2021-03-10T20:17:36.252Z] updateFields(org.eclipse.egit.github.core.tests.RepositoryCommitTest)  Time elapsed: 0.001 s
15:17:36 [2021-03-10T20:17:36.252Z] defaultState(org.eclipse.egit.github.core.tests.RepositoryCommitTest)  Time elapsed: 0 s
15:17:36 [2021-03-10T20:17:36.252Z] updateFields(org.eclipse.egit.github.core.tests.RepositoryContentsTest)  Time elapsed: 0 s
15:17:36 [2021-03-10T20:17:36.252Z] defaultState(org.eclipse.egit.github.core.tests.RepositoryContentsTest)  Time elapsed: 0 s
15:17:36 [2021-03-10T20:17:36.252Z] updateFields(org.eclipse.egit.github.core.tests.RepositoryHookResponseTest)  Time elapsed: 0 s
15:17:36 [2021-03-10T20:17:36.252Z] defaultState(org.eclipse.egit.github.core.tests.RepositoryHookResponseTest)  Time elapsed: 0 s
15:17:36 [2021-03-10T20:17:36.252Z] updateFields(org.eclipse.egit.github.core.tests.RepositoryHookTest)  Time elapsed: 0 s
15:17:36 [2021-03-10T20:17:36.252Z] defaultState(org.eclipse.egit.github.core.tests.RepositoryHookTest)  Time elapsed: 0 s
15:17:36 [2021-03-10T20:17:36.252Z] createFromNullString(org.eclipse.egit.github.core.tests.RepositoryIdTest)  Time elapsed: 0 s
15:17:36 [2021-03-10T20:17:36.252Z] create(org.eclipse.egit.github.core.tests.RepositoryIdTest)  Time elapsed: 0 s
15:17:36 [2021-03-10T20:17:36.252Z] createFromEmptyString(org.eclipse.egit.github.core.tests.RepositoryIdTest)  Time elapsed: 0 s
15:17:36 [2021-03-10T20:17:36.252Z] createFromNullUrl(org.eclipse.egit.github.core.tests.RepositoryIdTest)  Time elapsed: 0 s
15:17:36 [2021-03-10T20:17:36.252Z] createNullName(org.eclipse.egit.github.core.tests.RepositoryIdTest)  Time elapsed: 0.001 s
15:17:36 [2021-03-10T20:17:36.252Z] createFromStringUrl(org.eclipse.egit.github.core.tests.RepositoryIdTest)  Time elapsed: 0 s
15:17:36 [2021-03-10T20:17:36.252Z] createNullOwner(org.eclipse.egit.github.core.tests.RepositoryIdTest)  Time elapsed: 0 s
15:17:36 [2021-03-10T20:17:36.252Z] createFromString(org.eclipse.egit.github.core.tests.RepositoryIdTest)  Time elapsed: 0 s
15:17:36 [2021-03-10T20:17:36.252Z] createFromMalformedStringUrl(org.eclipse.egit.github.core.tests.RepositoryIdTest)  Time elapsed: 0 s
15:17:36 [2021-03-10T20:17:36.252Z] equality(org.eclipse.egit.github.core.tests.RepositoryIdTest)  Time elapsed: 0 s
15:17:36 [2021-03-10T20:17:36.252Z] createEmptyOwner(org.eclipse.egit.github.core.tests.RepositoryIdTest)  Time elapsed: 0 s
15:17:36 [2021-03-10T20:17:36.252Z] createFromNullStringUrl(org.eclipse.egit.github.core.tests.RepositoryIdTest)  Time elapsed: 0 s
15:17:36 [2021-03-10T20:17:36.252Z] createFromInvalidUrl1(org.eclipse.egit.github.core.tests.RepositoryIdTest)  Time elapsed: 0 s
15:17:36 [2021-03-10T20:17:36.252Z] createFromInvalidUrl2(org.eclipse.egit.github.core.tests.RepositoryIdTest)  Time elapsed: 0 s
15:17:36 [2021-03-10T20:17:36.252Z] createFromInvalidUrl3(org.eclipse.egit.github.core.tests.RepositoryIdTest)  Time elapsed: 0 s
15:17:36 [2021-03-10T20:17:36.252Z] createFromInvalidUrl4(org.eclipse.egit.github.core.tests.RepositoryIdTest)  Time elapsed: 0 s
15:17:36 [2021-03-10T20:17:36.252Z] createEmptyName(org.eclipse.egit.github.core.tests.RepositoryIdTest)  Time elapsed: 0 s
15:17:36 [2021-03-10T20:17:36.252Z] createFromUrl(org.eclipse.egit.github.core.tests.RepositoryIdTest)  Time elapsed: 0.001 s
15:17:36 [2021-03-10T20:17:36.252Z] updateFields(org.eclipse.egit.github.core.tests.RepositoryIssueTest)  Time elapsed: 0 s
15:17:36 [2021-03-10T20:17:36.252Z] defaultState(org.eclipse.egit.github.core.tests.RepositoryIssueTest)  Time elapsed: 0 s
15:17:36 [2021-03-10T20:17:36.252Z] getPrivateOrgRepositories(org.eclipse.egit.github.core.tests.RepositoryServiceTest)  Time elapsed: 0.001 s
15:17:36 [2021-03-10T20:17:36.252Z] editRepositoryNullRepository(org.eclipse.egit.github.core.tests.RepositoryServiceTest)  Time elapsed: 0 s
15:17:36 [2021-03-10T20:17:36.252Z] getRepositoriesNullOrg(org.eclipse.egit.github.core.tests.RepositoryServiceTest)  Time elapsed: 0 s
15:17:36 [2021-03-10T20:17:36.252Z] getPublicRepositories(org.eclipse.egit.github.core.tests.RepositoryServiceTest)  Time elapsed: 0 s
15:17:36 [2021-03-10T20:17:36.252Z] constructor(org.eclipse.egit.github.core.tests.RepositoryServiceTest)  Time elapsed: 0.001 s
15:17:36 [2021-03-10T20:17:36.252Z] searchRepositoriesEmptyQuery(org.eclipse.egit.github.core.tests.RepositoryServiceTest)  Time elapsed: 0 s
15:17:36 [2021-03-10T20:17:36.252Z] getRepositoriesEmptyUser(org.eclipse.egit.github.core.tests.RepositoryServiceTest)  Time elapsed: 0 s
15:17:36 [2021-03-10T20:17:36.252Z] forkRepositoryToOrg(org.eclipse.egit.github.core.tests.RepositoryServiceTest)  Time elapsed: 0 s
15:17:36 [2021-03-10T20:17:36.252Z] getRepositoriesEmptyOrg(org.eclipse.egit.github.core.tests.RepositoryServiceTest)  Time elapsed: 0 s
15:17:36 [2021-03-10T20:17:36.252Z] getContributors(org.eclipse.egit.github.core.tests.RepositoryServiceTest)  Time elapsed: 0 s
15:17:36 [2021-03-10T20:17:36.252Z] searchRepositoriesNullQuery(org.eclipse.egit.github.core.tests.RepositoryServiceTest)  Time elapsed: 0 s
15:17:36 [2021-03-10T20:17:36.252Z] createOrgRepositoryNullRepository(org.eclipse.egit.github.core.tests.RepositoryServiceTest)  Time elapsed: 0 s
15:17:36 [2021-03-10T20:17:36.252Z] editRepositoryProviderWithNullFields(org.eclipse.egit.github.core.tests.RepositoryServiceTest)  Time elapsed: 0.001 s
15:17:36 [2021-03-10T20:17:36.252Z] searchRepositoriesStartingAtPage(org.eclipse.egit.github.core.tests.RepositoryServiceTest)  Time elapsed: 0 s
15:17:36 [2021-03-10T20:17:36.252Z] editRepositoryProviderWithFields(org.eclipse.egit.github.core.tests.RepositoryServiceTest)  Time elapsed: 0 s
15:17:36 [2021-03-10T20:17:36.252Z] editRepository(org.eclipse.egit.github.core.tests.RepositoryServiceTest)  Time elapsed: 0.001 s
15:17:36 [2021-03-10T20:17:36.252Z] createRepositoryNullRepository(org.eclipse.egit.github.core.tests.RepositoryServiceTest)  Time elapsed: 0 s
15:17:36 [2021-03-10T20:17:36.252Z] getRepositories(org.eclipse.egit.github.core.tests.RepositoryServiceTest)  Time elapsed: 0 s
15:17:36 [2021-03-10T20:17:36.252Z] createRepository(org.eclipse.egit.github.core.tests.RepositoryServiceTest)  Time elapsed: 0.001 s
15:17:36 [2021-03-10T20:17:36.252Z] getOrgRepositories(org.eclipse.egit.github.core.tests.RepositoryServiceTest)  Time elapsed: 0 s
15:17:36 [2021-03-10T20:17:36.252Z] getRepositoriesNullUser(org.eclipse.egit.github.core.tests.RepositoryServiceTest)  Time elapsed: 0 s
15:17:36 [2021-03-10T20:17:36.252Z] getContributorsWithAnonymous(org.eclipse.egit.github.core.tests.RepositoryServiceTest)  Time elapsed: 0 s
15:17:36 [2021-03-10T20:17:36.252Z] searchEscaped(org.eclipse.egit.github.core.tests.RepositoryServiceTest)  Time elapsed: 0 s
15:17:36 [2021-03-10T20:17:36.252Z] getUserRepositories(org.eclipse.egit.github.core.tests.RepositoryServiceTest)  Time elapsed: 0.001 s
15:17:36 [2021-03-10T20:17:36.252Z] getHook(org.eclipse.egit.github.core.tests.RepositoryServiceTest)  Time elapsed: 0 s
15:17:36 [2021-03-10T20:17:36.252Z] getTags(org.eclipse.egit.github.core.tests.RepositoryServiceTest)  Time elapsed: 0 s
15:17:36 [2021-03-10T20:17:36.252Z] forkRepository(org.eclipse.egit.github.core.tests.RepositoryServiceTest)  Time elapsed: 0.001 s
15:17:36 [2021-03-10T20:17:36.252Z] editHookNullHook(org.eclipse.egit.github.core.tests.RepositoryServiceTest)  Time elapsed: 0 s
15:17:36 [2021-03-10T20:17:36.252Z] createOrgRepositoryNullOrg(org.eclipse.egit.github.core.tests.RepositoryServiceTest)  Time elapsed: 0 s
15:17:36 [2021-03-10T20:17:36.252Z] pageAllRepositoriesSince(org.eclipse.egit.github.core.tests.RepositoryServiceTest)  Time elapsed: 0 s
15:17:36 [2021-03-10T20:17:36.252Z] createOrgRepositoryEmptyOrg(org.eclipse.egit.github.core.tests.RepositoryServiceTest)  Time elapsed: 0 s
15:17:36 [2021-03-10T20:17:36.252Z] createOrgRepository(org.eclipse.egit.github.core.tests.RepositoryServiceTest)  Time elapsed: 0.001 s
15:17:36 [2021-03-10T20:17:36.252Z] getRepositoryProvider(org.eclipse.egit.github.core.tests.RepositoryServiceTest)  Time elapsed: 0 s
15:17:36 [2021-03-10T20:17:36.252Z] editRepositoryWithNullFields(org.eclipse.egit.github.core.tests.RepositoryServiceTest)  Time elapsed: 0 s
15:17:36 [2021-03-10T20:17:36.252Z] pageAllRepositories(org.eclipse.egit.github.core.tests.RepositoryServiceTest)  Time elapsed: 0 s
15:17:36 [2021-03-10T20:17:36.252Z] runMerge(org.eclipse.egit.github.core.tests.RepositoryServiceTest)  Time elapsed: 0.001 s
15:17:36 [2021-03-10T20:17:36.252Z] searchRepositoriesMatchingLanguage(org.eclipse.egit.github.core.tests.RepositoryServiceTest)  Time elapsed: 0 s
15:17:36 [2021-03-10T20:17:36.252Z] editRepositoryWithFields(org.eclipse.egit.github.core.tests.RepositoryServiceTest)  Time elapsed: 0.001 s
15:17:36 [2021-03-10T20:17:36.252Z] createHook(org.eclipse.egit.github.core.tests.RepositoryServiceTest)  Time elapsed: 0 s
15:17:36 [2021-03-10T20:17:36.252Z] getLanguages(org.eclipse.egit.github.core.tests.RepositoryServiceTest)  Time elapsed: 0 s
15:17:36 [2021-03-10T20:17:36.252Z] runHook(org.eclipse.egit.github.core.tests.RepositoryServiceTest)  Time elapsed: 0.001 s
15:17:36 [2021-03-10T20:17:36.252Z] editHook(org.eclipse.egit.github.core.tests.RepositoryServiceTest)  Time elapsed: 0 s
15:17:36 [2021-03-10T20:17:36.252Z] searchRepositories(org.eclipse.egit.github.core.tests.RepositoryServiceTest)  Time elapsed: 0 s
15:17:36 [2021-03-10T20:17:36.252Z] getRepository(org.eclipse.egit.github.core.tests.RepositoryServiceTest)  Time elapsed: 0.001 s
15:17:36 [2021-03-10T20:17:36.252Z] deleteHook(org.eclipse.egit.github.core.tests.RepositoryServiceTest)  Time elapsed: 0 s
15:17:36 [2021-03-10T20:17:36.252Z] getForks(org.eclipse.egit.github.core.tests.RepositoryServiceTest)  Time elapsed: 0 s
15:17:36 [2021-03-10T20:17:36.252Z] getHooks(org.eclipse.egit.github.core.tests.RepositoryServiceTest)  Time elapsed: 0.001 s
15:17:36 [2021-03-10T20:17:36.252Z] getBranches(org.eclipse.egit.github.core.tests.RepositoryServiceTest)  Time elapsed: 0 s
15:17:36 [2021-03-10T20:17:36.252Z] updateFields(org.eclipse.egit.github.core.tests.RepositoryTagTest)  Time elapsed: 0.001 s
15:17:36 [2021-03-10T20:17:36.252Z] defaultState(org.eclipse.egit.github.core.tests.RepositoryTagTest)  Time elapsed: 0 s
15:17:36 [2021-03-10T20:17:36.252Z] generateIdNullName(org.eclipse.egit.github.core.tests.RepositoryTest)  Time elapsed: 0 s
15:17:36 [2021-03-10T20:17:36.252Z] generateIdEmptyName(org.eclipse.egit.github.core.tests.RepositoryTest)  Time elapsed: 0 s
15:17:36 [2021-03-10T20:17:36.252Z] updateFields(org.eclipse.egit.github.core.tests.RepositoryTest)  Time elapsed: 0 s
15:17:36 [2021-03-10T20:17:36.252Z] fromJson(org.eclipse.egit.github.core.tests.RepositoryTest)  Time elapsed: 0.002 s
15:17:36 [2021-03-10T20:17:36.252Z] defaultState(org.eclipse.egit.github.core.tests.RepositoryTest)  Time elapsed: 0 s
15:17:36 [2021-03-10T20:17:36.252Z] generateIdEmptyOwnerLogin(org.eclipse.egit.github.core.tests.RepositoryTest)  Time elapsed: 0 s
15:17:36 [2021-03-10T20:17:36.252Z] generateId(org.eclipse.egit.github.core.tests.RepositoryTest)  Time elapsed: 0 s
15:17:36 [2021-03-10T20:17:36.252Z] generateIdNullOwner(org.eclipse.egit.github.core.tests.RepositoryTest)  Time elapsed: 0 s
15:17:36 [2021-03-10T20:17:36.252Z] generateIdNullOwnerLogin(org.eclipse.egit.github.core.tests.RepositoryTest)  Time elapsed: 0 s
15:17:36 [2021-03-10T20:17:36.252Z] requestErrorWithMessageField(org.eclipse.egit.github.core.tests.RequestErrorTest)  Time elapsed: 0 s
15:17:36 [2021-03-10T20:17:36.252Z] requestErrorWithErrorAndMessageField(org.eclipse.egit.github.core.tests.RequestErrorTest)  Time elapsed: 0.001 s
15:17:36 [2021-03-10T20:17:36.252Z] requestErrorWithErrorField(org.eclipse.egit.github.core.tests.RequestErrorTest)  Time elapsed: 0 s
15:17:36 [2021-03-10T20:17:36.252Z] invalidFieldValue(org.eclipse.egit.github.core.tests.RequestExceptionTest)  Time elapsed: 0.001 s
15:17:36 [2021-03-10T20:17:36.252Z] customCode(org.eclipse.egit.github.core.tests.RequestExceptionTest)  Time elapsed: 0 s
15:17:36 [2021-03-10T20:17:36.252Z] missingField(org.eclipse.egit.github.core.tests.RequestExceptionTest)  Time elapsed: 0 s
15:17:36 [2021-03-10T20:17:36.252Z] invalidField(org.eclipse.egit.github.core.tests.RequestExceptionTest)  Time elapsed: 0 s
15:17:36 [2021-03-10T20:17:36.252Z] existentField(org.eclipse.egit.github.core.tests.RequestExceptionTest)  Time elapsed: 0 s
15:17:36 [2021-03-10T20:17:36.252Z] errorField(org.eclipse.egit.github.core.tests.RequestExceptionTest)  Time elapsed: 0 s
15:17:36 [2021-03-10T20:17:36.252Z] updateFields(org.eclipse.egit.github.core.tests.SearchIssueTest)  Time elapsed: 0.001 s
15:17:36 [2021-03-10T20:17:36.252Z] defaultState(org.eclipse.egit.github.core.tests.SearchIssueTest)  Time elapsed: 0 s
15:17:36 [2021-03-10T20:17:36.252Z] createNullName(org.eclipse.egit.github.core.tests.SearchRepositoryTest)  Time elapsed: 0 s
15:17:36 [2021-03-10T20:17:36.252Z] defaultState(org.eclipse.egit.github.core.tests.SearchRepositoryTest)  Time elapsed: 0 s
15:17:36 [2021-03-10T20:17:36.252Z] createNullOwner(org.eclipse.egit.github.core.tests.SearchRepositoryTest)  Time elapsed: 0 s
15:17:36 [2021-03-10T20:17:36.252Z] equality(org.eclipse.egit.github.core.tests.SearchRepositoryTest)  Time elapsed: 0 s
15:17:36 [2021-03-10T20:17:36.252Z] getCreatedAtReferenceMutableObject(org.eclipse.egit.github.core.tests.SearchRepositoryTest)  Time elapsed: 0.001 s
15:17:36 [2021-03-10T20:17:36.252Z] createEmptyOwner(org.eclipse.egit.github.core.tests.SearchRepositoryTest)  Time elapsed: 0 s
15:17:36 [2021-03-10T20:17:36.252Z] getPushedAtReferenceMutableObject(org.eclipse.egit.github.core.tests.SearchRepositoryTest)  Time elapsed: 0 s
15:17:36 [2021-03-10T20:17:36.252Z] createEmptyName(org.eclipse.egit.github.core.tests.SearchRepositoryTest)  Time elapsed: 0 s
15:17:36 [2021-03-10T20:17:36.252Z] noGeneratedId(org.eclipse.egit.github.core.tests.SearchRepositoryTest)  Time elapsed: 0 s
15:17:36 [2021-03-10T20:17:36.252Z] updateFields(org.eclipse.egit.github.core.tests.ShaResourceTest)  Time elapsed: 0 s
15:17:36 [2021-03-10T20:17:36.252Z] defaultState(org.eclipse.egit.github.core.tests.ShaResourceTest)  Time elapsed: 0 s
15:17:36 [2021-03-10T20:17:36.252Z] getStarredNullName(org.eclipse.egit.github.core.tests.StargazerServiceTest)  Time elapsed: 0 s
15:17:36 [2021-03-10T20:17:36.252Z] constructor(org.eclipse.egit.github.core.tests.StargazerServiceTest)  Time elapsed: 0.001 s
15:17:36 [2021-03-10T20:17:36.252Z] pageCurrentStarred(org.eclipse.egit.github.core.tests.StargazerServiceTest)  Time elapsed: 0 s
15:17:36 [2021-03-10T20:17:36.252Z] getStarred(org.eclipse.egit.github.core.tests.StargazerServiceTest)  Time elapsed: 0.019 s
15:17:36 [2021-03-10T20:17:36.252Z] unstar(org.eclipse.egit.github.core.tests.StargazerServiceTest)  Time elapsed: 0 s
15:17:36 [2021-03-10T20:17:36.252Z] star(org.eclipse.egit.github.core.tests.StargazerServiceTest)  Time elapsed: 0 s
15:17:36 [2021-03-10T20:17:36.252Z] pageStargazers(org.eclipse.egit.github.core.tests.StargazerServiceTest)  Time elapsed: 0 s
15:17:36 [2021-03-10T20:17:36.252Z] getCurrentStarred(org.eclipse.egit.github.core.tests.StargazerServiceTest)  Time elapsed: 0 s
15:17:36 [2021-03-10T20:17:36.252Z] isStarring(org.eclipse.egit.github.core.tests.StargazerServiceTest)  Time elapsed: 0.001 s
15:17:36 [2021-03-10T20:17:36.252Z] getStarredEmptyName(org.eclipse.egit.github.core.tests.StargazerServiceTest)  Time elapsed: 0 s
15:17:36 [2021-03-10T20:17:36.252Z] pageStarred(org.eclipse.egit.github.core.tests.StargazerServiceTest)  Time elapsed: 0 s
15:17:36 [2021-03-10T20:17:36.252Z] getStargazers(org.eclipse.egit.github.core.tests.StargazerServiceTest)  Time elapsed: 0 s
15:17:36 [2021-03-10T20:17:36.252Z] updateFields(org.eclipse.egit.github.core.tests.TagTest)  Time elapsed: 0 s
15:17:36 [2021-03-10T20:17:36.252Z] defaultState(org.eclipse.egit.github.core.tests.TagTest)  Time elapsed: 0 s
15:17:36 [2021-03-10T20:17:36.252Z] updateFields(org.eclipse.egit.github.core.tests.TeamAddPayloadTest)  Time elapsed: 0 s
15:17:36 [2021-03-10T20:17:36.252Z] defaultState(org.eclipse.egit.github.core.tests.TeamAddPayloadTest)  Time elapsed: 0 s
15:17:36 [2021-03-10T20:17:36.252Z] getMembershipEmptyName(org.eclipse.egit.github.core.tests.TeamServiceTest)  Time elapsed: 0 s
15:17:36 [2021-03-10T20:17:36.252Z] getTeamsEmptyName(org.eclipse.egit.github.core.tests.TeamServiceTest)  Time elapsed: 0 s
15:17:36 [2021-03-10T20:17:36.252Z] createTeamWithRepos(org.eclipse.egit.github.core.tests.TeamServiceTest)  Time elapsed: 0 s
15:17:36 [2021-03-10T20:17:36.252Z] getMembership(org.eclipse.egit.github.core.tests.TeamServiceTest)  Time elapsed: 0 s
15:17:36 [2021-03-10T20:17:36.252Z] constructor(org.eclipse.egit.github.core.tests.TeamServiceTest)  Time elapsed: 0 s
15:17:36 [2021-03-10T20:17:36.252Z] removeMemberNullName(org.eclipse.egit.github.core.tests.TeamServiceTest)  Time elapsed: 0 s
15:17:36 [2021-03-10T20:17:36.252Z] createTeamEmptyOrg(org.eclipse.egit.github.core.tests.TeamServiceTest)  Time elapsed: 0.001 s
15:17:36 [2021-03-10T20:17:36.252Z] addMembership(org.eclipse.egit.github.core.tests.TeamServiceTest)  Time elapsed: 0 s
15:17:36 [2021-03-10T20:17:36.252Z] removeRepository(org.eclipse.egit.github.core.tests.TeamServiceTest)  Time elapsed: 0 s
15:17:36 [2021-03-10T20:17:36.252Z] isMemberEmptyName(org.eclipse.egit.github.core.tests.TeamServiceTest)  Time elapsed: 0 s
15:17:36 [2021-03-10T20:17:36.252Z] removeMember(org.eclipse.egit.github.core.tests.TeamServiceTest)  Time elapsed: 0 s
15:17:36 [2021-03-10T20:17:36.252Z] addMembershipEmptyName(org.eclipse.egit.github.core.tests.TeamServiceTest)  Time elapsed: 0 s
15:17:36 [2021-03-10T20:17:36.253Z] getRepositories(org.eclipse.egit.github.core.tests.TeamServiceTest)  Time elapsed: 0.001 s
15:17:36 [2021-03-10T20:17:36.253Z] addMembershipNullName(org.eclipse.egit.github.core.tests.TeamServiceTest)  Time elapsed: 0 s
15:17:36 [2021-03-10T20:17:36.253Z] removeMembershipEmptyName(org.eclipse.egit.github.core.tests.TeamServiceTest)  Time elapsed: 0 s
15:17:36 [2021-03-10T20:17:36.253Z] getAllTeams(org.eclipse.egit.github.core.tests.TeamServiceTest)  Time elapsed: 0.001 s
15:17:36 [2021-03-10T20:17:36.253Z] isMember(org.eclipse.egit.github.core.tests.TeamServiceTest)  Time elapsed: 0 s
15:17:36 [2021-03-10T20:17:36.253Z] removeMembership(org.eclipse.egit.github.core.tests.TeamServiceTest)  Time elapsed: 0.001 s
15:17:36 [2021-03-10T20:17:36.253Z] getMembershipNullName(org.eclipse.egit.github.core.tests.TeamServiceTest)  Time elapsed: 0 s
15:17:36 [2021-03-10T20:17:36.253Z] createTeamNullTeam(org.eclipse.egit.github.core.tests.TeamServiceTest)  Time elapsed: 0 s
15:17:36 [2021-03-10T20:17:36.253Z] addMember(org.eclipse.egit.github.core.tests.TeamServiceTest)  Time elapsed: 0 s
15:17:36 [2021-03-10T20:17:36.253Z] isRepository(org.eclipse.egit.github.core.tests.TeamServiceTest)  Time elapsed: 0 s
15:17:36 [2021-03-10T20:17:36.253Z] getTeam(org.eclipse.egit.github.core.tests.TeamServiceTest)  Time elapsed: 0.001 s
15:17:36 [2021-03-10T20:17:36.253Z] addMemberNullName(org.eclipse.egit.github.core.tests.TeamServiceTest)  Time elapsed: 0 s
15:17:36 [2021-03-10T20:17:36.253Z] isMemberNullName(org.eclipse.egit.github.core.tests.TeamServiceTest)  Time elapsed: 0 s
15:17:36 [2021-03-10T20:17:36.253Z] removeMemberEmptyName(org.eclipse.egit.github.core.tests.TeamServiceTest)  Time elapsed: 0 s
15:17:36 [2021-03-10T20:17:36.253Z] createTeam(org.eclipse.egit.github.core.tests.TeamServiceTest)  Time elapsed: 0 s
15:17:36 [2021-03-10T20:17:36.253Z] editTeamNullTeam(org.eclipse.egit.github.core.tests.TeamServiceTest)  Time elapsed: 0 s
15:17:36 [2021-03-10T20:17:36.253Z] createTeamNullOrg(org.eclipse.egit.github.core.tests.TeamServiceTest)  Time elapsed: 0.001 s
15:17:36 [2021-03-10T20:17:36.253Z] editTeam(org.eclipse.egit.github.core.tests.TeamServiceTest)  Time elapsed: 0 s
15:17:36 [2021-03-10T20:17:36.253Z] getRepositoryTeams(org.eclipse.egit.github.core.tests.TeamServiceTest)  Time elapsed: 0 s
15:17:36 [2021-03-10T20:17:36.253Z] addMemberEmptyName(org.eclipse.egit.github.core.tests.TeamServiceTest)  Time elapsed: 0 s
15:17:36 [2021-03-10T20:17:36.253Z] deleteTeam(org.eclipse.egit.github.core.tests.TeamServiceTest)  Time elapsed: 0.001 s
15:17:36 [2021-03-10T20:17:36.253Z] removeMembershipNullName(org.eclipse.egit.github.core.tests.TeamServiceTest)  Time elapsed: 0 s
15:17:36 [2021-03-10T20:17:36.253Z] getTeamsNullName(org.eclipse.egit.github.core.tests.TeamServiceTest)  Time elapsed: 0 s
15:17:36 [2021-03-10T20:17:36.253Z] getTeams(org.eclipse.egit.github.core.tests.TeamServiceTest)  Time elapsed: 0.001 s
15:17:36 [2021-03-10T20:17:36.253Z] addRepository(org.eclipse.egit.github.core.tests.TeamServiceTest)  Time elapsed: 0 s
15:17:36 [2021-03-10T20:17:36.253Z] getMembers(org.eclipse.egit.github.core.tests.TeamServiceTest)  Time elapsed: 0 s
15:17:36 [2021-03-10T20:17:36.253Z] updateFields(org.eclipse.egit.github.core.tests.TeamTest)  Time elapsed: 0 s
15:17:36 [2021-03-10T20:17:36.253Z] defaultState(org.eclipse.egit.github.core.tests.TeamTest)  Time elapsed: 0 s
15:17:36 [2021-03-10T20:17:36.253Z] updateFields(org.eclipse.egit.github.core.tests.TreeEntryTest)  Time elapsed: 0 s
15:17:36 [2021-03-10T20:17:36.253Z] defaultState(org.eclipse.egit.github.core.tests.TreeEntryTest)  Time elapsed: 0 s
15:17:36 [2021-03-10T20:17:36.253Z] updateFields(org.eclipse.egit.github.core.tests.TreeTest)  Time elapsed: 0 s
15:17:36 [2021-03-10T20:17:36.253Z] defaultState(org.eclipse.egit.github.core.tests.TreeTest)  Time elapsed: 0 s
15:17:36 [2021-03-10T20:17:36.253Z] updateFields(org.eclipse.egit.github.core.tests.TypedResourceTest)  Time elapsed: 0 s
15:17:36 [2021-03-10T20:17:36.253Z] defaultState(org.eclipse.egit.github.core.tests.TypedResourceTest)  Time elapsed: 0 s
15:17:36 [2021-03-10T20:17:36.253Z] generateSshUrl(org.eclipse.egit.github.core.tests.UrlUtilsTest)  Time elapsed: 0 s
15:17:36 [2021-03-10T20:17:36.253Z] generateReadOnlyUrl(org.eclipse.egit.github.core.tests.UrlUtilsTest)  Time elapsed: 0 s
15:17:36 [2021-03-10T20:17:36.253Z] encode(org.eclipse.egit.github.core.tests.UrlUtilsTest)  Time elapsed: 0 s
15:17:36 [2021-03-10T20:17:36.253Z] generateHttpsUrl(org.eclipse.egit.github.core.tests.UrlUtilsTest)  Time elapsed: 0 s
15:17:36 [2021-03-10T20:17:36.253Z] updateFields(org.eclipse.egit.github.core.tests.UserPlanTest)  Time elapsed: 0 s
15:17:36 [2021-03-10T20:17:36.253Z] defaultState(org.eclipse.egit.github.core.tests.UserPlanTest)  Time elapsed: 0.001 s
15:17:36 [2021-03-10T20:17:36.253Z] addEmailEmptyEmails(org.eclipse.egit.github.core.tests.UserServiceTest)  Time elapsed: 0 s
15:17:36 [2021-03-10T20:17:36.253Z] removeEmailNullEmails(org.eclipse.egit.github.core.tests.UserServiceTest)  Time elapsed: 0 s
15:17:36 [2021-03-10T20:17:36.253Z] isFollowingEmptyUser(org.eclipse.egit.github.core.tests.UserServiceTest)  Time elapsed: 0 s
15:17:36 [2021-03-10T20:17:36.253Z] editKey(org.eclipse.egit.github.core.tests.UserServiceTest)  Time elapsed: 0 s
15:17:36 [2021-03-10T20:17:36.253Z] unfollowNullUser(org.eclipse.egit.github.core.tests.UserServiceTest)  Time elapsed: 0 s
15:17:36 [2021-03-10T20:17:36.253Z] constructor(org.eclipse.egit.github.core.tests.UserServiceTest)  Time elapsed: 0 s
15:17:36 [2021-03-10T20:17:36.253Z] unfollowEmptyUser(org.eclipse.egit.github.core.tests.UserServiceTest)  Time elapsed: 0 s
15:17:36 [2021-03-10T20:17:36.253Z] addEmailNullEmails(org.eclipse.egit.github.core.tests.UserServiceTest)  Time elapsed: 0 s
15:17:36 [2021-03-10T20:17:36.253Z] follow(org.eclipse.egit.github.core.tests.UserServiceTest)  Time elapsed: 0 s
15:17:36 [2021-03-10T20:17:36.253Z] addEmail(org.eclipse.egit.github.core.tests.UserServiceTest)  Time elapsed: 0.001 s
15:17:36 [2021-03-10T20:17:36.253Z] getKey(org.eclipse.egit.github.core.tests.UserServiceTest)  Time elapsed: 0.001 s
15:17:36 [2021-03-10T20:17:36.253Z] getFollowingNullName(org.eclipse.egit.github.core.tests.UserServiceTest)  Time elapsed: 0 s
15:17:36 [2021-03-10T20:17:36.253Z] getUserNullName(org.eclipse.egit.github.core.tests.UserServiceTest)  Time elapsed: 0 s
15:17:36 [2021-03-10T20:17:36.253Z] getFollowingEmptyName(org.eclipse.egit.github.core.tests.UserServiceTest)  Time elapsed: 0 s
15:17:36 [2021-03-10T20:17:36.253Z] followEmptyUser(org.eclipse.egit.github.core.tests.UserServiceTest)  Time elapsed: 0 s
15:17:36 [2021-03-10T20:17:36.253Z] getUserEmptyName(org.eclipse.egit.github.core.tests.UserServiceTest)  Time elapsed: 0 s
15:17:36 [2021-03-10T20:17:36.253Z] followNullUser(org.eclipse.egit.github.core.tests.UserServiceTest)  Time elapsed: 0 s
15:17:36 [2021-03-10T20:17:36.253Z] unfollow(org.eclipse.egit.github.core.tests.UserServiceTest)  Time elapsed: 0 s
15:17:36 [2021-03-10T20:17:36.253Z] deleteKey(org.eclipse.egit.github.core.tests.UserServiceTest)  Time elapsed: 0 s
15:17:36 [2021-03-10T20:17:36.253Z] removeEmail(org.eclipse.egit.github.core.tests.UserServiceTest)  Time elapsed: 0 s
15:17:36 [2021-03-10T20:17:36.253Z] isFollowingNullUser(org.eclipse.egit.github.core.tests.UserServiceTest)  Time elapsed: 0 s
15:17:36 [2021-03-10T20:17:36.253Z] getKeys(org.eclipse.egit.github.core.tests.UserServiceTest)  Time elapsed: 0.001 s
15:17:36 [2021-03-10T20:17:36.253Z] getUser(org.eclipse.egit.github.core.tests.UserServiceTest)  Time elapsed: 0 s
15:17:36 [2021-03-10T20:17:36.253Z] editKeyNullKey(org.eclipse.egit.github.core.tests.UserServiceTest)  Time elapsed: 0 s
15:17:36 [2021-03-10T20:17:36.253Z] getCurrentUser(org.eclipse.egit.github.core.tests.UserServiceTest)  Time elapsed: 0.001 s
15:17:36 [2021-03-10T20:17:36.253Z] getEmails(org.eclipse.egit.github.core.tests.UserServiceTest)  Time elapsed: 0 s
15:17:36 [2021-03-10T20:17:36.253Z] getCurrentFollowers(org.eclipse.egit.github.core.tests.UserServiceTest)  Time elapsed: 0.001 s
15:17:36 [2021-03-10T20:17:36.253Z] getCurrentFollowing(org.eclipse.egit.github.core.tests.UserServiceTest)  Time elapsed: 0 s
15:17:36 [2021-03-10T20:17:36.253Z] createKey(org.eclipse.egit.github.core.tests.UserServiceTest)  Time elapsed: 0 s
15:17:36 [2021-03-10T20:17:36.253Z] getFollowersNullName(org.eclipse.egit.github.core.tests.UserServiceTest)  Time elapsed: 0.001 s
15:17:36 [2021-03-10T20:17:36.253Z] getFollowers(org.eclipse.egit.github.core.tests.UserServiceTest)  Time elapsed: 0 s
15:17:36 [2021-03-10T20:17:36.253Z] getFollowing(org.eclipse.egit.github.core.tests.UserServiceTest)  Time elapsed: 0 s
15:17:36 [2021-03-10T20:17:36.253Z] editUserNullUser(org.eclipse.egit.github.core.tests.UserServiceTest)  Time elapsed: 0 s
15:17:36 [2021-03-10T20:17:36.253Z] editUser(org.eclipse.egit.github.core.tests.UserServiceTest)  Time elapsed: 0.001 s
15:17:36 [2021-03-10T20:17:36.253Z] removeEmailEmptyEmails(org.eclipse.egit.github.core.tests.UserServiceTest)  Time elapsed: 0 s
15:17:36 [2021-03-10T20:17:36.253Z] isFollowing(org.eclipse.egit.github.core.tests.UserServiceTest)  Time elapsed: 0 s
15:17:36 [2021-03-10T20:17:36.253Z] getFollowersEmptyName(org.eclipse.egit.github.core.tests.UserServiceTest)  Time elapsed: 0 s
15:17:36 [2021-03-10T20:17:36.253Z] updateFields(org.eclipse.egit.github.core.tests.UserTest)  Time elapsed: 0 s
15:17:36 [2021-03-10T20:17:36.253Z] defaultState(org.eclipse.egit.github.core.tests.UserTest)  Time elapsed: 0 s
15:17:36 [2021-03-10T20:17:36.253Z] updateFields(org.eclipse.egit.github.core.tests.WatchPayloadTest)  Time elapsed: 0 s
15:17:36 [2021-03-10T20:17:36.253Z] defaultState(org.eclipse.egit.github.core.tests.WatchPayloadTest)  Time elapsed: 0 s
15:17:36 [2021-03-10T20:17:36.253Z] 
15:17:36 [2021-03-10T20:17:36.253Z] Results:
15:17:36 [2021-03-10T20:17:36.253Z] 
15:17:36 [2021-03-10T20:17:36.253Z] Tests run: 787, Failures: 0, Errors: 0, Skipped: 0
15:17:36 [2021-03-10T20:17:36.253Z] 
15:17:36 [2021-03-10T20:17:36.814Z] 20:17:36 [INFO] All tests passed!
15:17:36 [2021-03-10T20:17:36.814Z] 20:17:36 [INFO] 
15:17:36 [2021-03-10T20:17:36.814Z] 20:17:36 [INFO] >>> spotbugs-maven-plugin:3.1.11:check (default) > :spotbugs @ org.eclipse.egit.github.core.tests >>>
15:17:36 [2021-03-10T20:17:36.814Z] 20:17:36 [INFO] 
15:17:36 [2021-03-10T20:17:36.814Z] 20:17:36 [INFO] --- spotbugs-maven-plugin:3.1.11:spotbugs (spotbugs) @ org.eclipse.egit.github.core.tests ---
15:17:36 [2021-03-10T20:17:36.814Z] 20:17:36 [INFO] Fork Value is true
15:17:42 [2021-03-10T20:17:42.111Z]      [java] Warnings generated: 3
15:17:42 [2021-03-10T20:17:42.111Z] 20:17:41 [INFO] Done SpotBugs Analysis....
15:17:42 [2021-03-10T20:17:42.111Z] 20:17:41 [INFO] 
15:17:42 [2021-03-10T20:17:42.111Z] 20:17:41 [INFO] <<< spotbugs-maven-plugin:3.1.11:check (default) < :spotbugs @ org.eclipse.egit.github.core.tests <<<
15:17:42 [2021-03-10T20:17:42.111Z] 20:17:41 [INFO] 
15:17:42 [2021-03-10T20:17:42.111Z] 20:17:41 [INFO] 
15:17:42 [2021-03-10T20:17:42.111Z] 20:17:41 [INFO] --- spotbugs-maven-plugin:3.1.11:check (default) @ org.eclipse.egit.github.core.tests ---
15:17:42 [2021-03-10T20:17:42.111Z] 20:17:41 [INFO] BugInstance size is 3
15:17:42 [2021-03-10T20:17:42.111Z] 20:17:41 [INFO] Error size is 0
15:17:42 [2021-03-10T20:17:42.111Z] 20:17:41 [INFO] Total bugs: 3
15:17:42 [2021-03-10T20:17:42.111Z] 20:17:41 [ERROR] Found reliance on default encoding in org.eclipse.egit.github.core.tests.EncodingUtilsTest.encodeDecode(): new String(byte[]) [org.eclipse.egit.github.core.tests.EncodingUtilsTest] At EncodingUtilsTest.java:[line 40] DM_DEFAULT_ENCODING
15:17:42 [2021-03-10T20:17:42.111Z] 20:17:41 [ERROR] Found reliance on default encoding in org.eclipse.egit.github.core.tests.EncodingUtilsTest.encodeDecode(): String.getBytes() [org.eclipse.egit.github.core.tests.EncodingUtilsTest] At EncodingUtilsTest.java:[line 33] DM_DEFAULT_ENCODING
15:17:42 [2021-03-10T20:17:42.111Z] 20:17:41 [ERROR] Found reliance on default encoding in org.eclipse.egit.github.core.tests.live.CommitTest.readLine(InputStream, int): new java.util.Scanner(InputStream) [org.eclipse.egit.github.core.tests.live.CommitTest] At CommitTest.java:[line 176] DM_DEFAULT_ENCODING
15:17:42 [2021-03-10T20:17:42.111Z] 20:17:41 [INFO] 
15:17:42 [2021-03-10T20:17:42.111Z] 
15:17:42 [2021-03-10T20:17:42.111Z] 
15:17:42 [2021-03-10T20:17:42.111Z] To see bug detail using the Spotbugs GUI, use the following command "mvn spotbugs:gui"
15:17:42 [2021-03-10T20:17:42.111Z] 
15:17:42 [2021-03-10T20:17:42.111Z] 
15:17:42 [2021-03-10T20:17:42.111Z] 
15:17:42 [2021-03-10T20:17:42.111Z] 20:17:41 [INFO] 
15:17:42 [2021-03-10T20:17:42.111Z] 20:17:41 [INFO] >>> maven-pmd-plugin:3.11.0:cpd-check (default) > :cpd @ org.eclipse.egit.github.core.tests >>>
15:17:42 [2021-03-10T20:17:42.111Z] 20:17:41 [INFO] 
15:17:42 [2021-03-10T20:17:42.111Z] 20:17:41 [INFO] --- maven-pmd-plugin:3.11.0:cpd (cpd) @ org.eclipse.egit.github.core.tests ---
15:17:42 [2021-03-10T20:17:42.111Z] 20:17:42 [INFO] 
15:17:42 [2021-03-10T20:17:42.111Z] 20:17:42 [INFO] <<< maven-pmd-plugin:3.11.0:cpd-check (default) < :cpd @ org.eclipse.egit.github.core.tests <<<
15:17:42 [2021-03-10T20:17:42.111Z] 20:17:42 [INFO] 
15:17:42 [2021-03-10T20:17:42.111Z] 20:17:42 [INFO] 
15:17:42 [2021-03-10T20:17:42.111Z] 20:17:42 [INFO] --- maven-pmd-plugin:3.11.0:cpd-check (default) @ org.eclipse.egit.github.core.tests ---
15:17:42 [2021-03-10T20:17:42.111Z] 20:17:42 [INFO] You have 3 CPD duplications. For more details see: /home/jenkins/agent/workspace/egit-github/repo/org.eclipse.egit.github.core.tests/target/cpd.xml
15:17:42 [2021-03-10T20:17:42.111Z] 20:17:42 [INFO] 
15:17:42 [2021-03-10T20:17:42.111Z] 20:17:42 [INFO] --- tycho-pack200a-plugin:1.7.0:normalize (pack200-normalize) @ org.eclipse.egit.github.core.tests ---
15:17:42 [2021-03-10T20:17:42.111Z] 20:17:42 [INFO] Pack200 normalizing jar /home/jenkins/agent/workspace/egit-github/repo/org.eclipse.egit.github.core.tests/target/org.eclipse.egit.github.core.tests-5.11.0.202103091610-r.jar
15:17:42 [2021-03-10T20:17:42.368Z] 20:17:42 [INFO] 
15:17:42 [2021-03-10T20:17:42.368Z] 20:17:42 [INFO] --- eclipse-jarsigner-plugin:1.1.5:sign (sign) @ org.eclipse.egit.github.core.tests ---
15:17:42 [2021-03-10T20:17:42.368Z] 20:17:42 [INFO] Signing jar: /home/jenkins/agent/workspace/egit-github/repo/org.eclipse.egit.github.core.tests/target/org.eclipse.egit.github.core.tests-5.11.0.202103091610-r.jar
15:17:43 [2021-03-10T20:17:43.734Z] 20:17:43 [INFO] 
15:17:43 [2021-03-10T20:17:43.734Z] 20:17:43 [INFO] --- tycho-pack200b-plugin:1.7.0:pack (pack200-pack) @ org.eclipse.egit.github.core.tests ---
15:17:43 [2021-03-10T20:17:43.734Z] 20:17:43 [INFO] Pack200 packing jar /home/jenkins/agent/workspace/egit-github/repo/org.eclipse.egit.github.core.tests/target/org.eclipse.egit.github.core.tests-5.11.0.202103091610-r.jar
15:17:43 [2021-03-10T20:17:43.734Z] 20:17:43 [INFO] 
15:17:43 [2021-03-10T20:17:43.734Z] 20:17:43 [INFO] --- tycho-p2-plugin:1.7.0:p2-metadata (p2-metadata) @ org.eclipse.egit.github.core.tests ---
15:17:43 [2021-03-10T20:17:43.734Z] 20:17:43 [INFO] 
15:17:43 [2021-03-10T20:17:43.734Z] 20:17:43 [INFO] --- maven-install-plugin:2.3.1:install (default-install) @ org.eclipse.egit.github.core.tests ---
15:17:43 [2021-03-10T20:17:43.734Z] 20:17:43 [INFO] Installing /home/jenkins/agent/workspace/egit-github/repo/org.eclipse.egit.github.core.tests/target/org.eclipse.egit.github.core.tests-5.11.0.202103091610-r.jar to /home/jenkins/agent/workspace/egit-github/.repository/org/eclipse/mylyn/github/org.eclipse.egit.github.core.tests/5.11.0.202103091610-r/org.eclipse.egit.github.core.tests-5.11.0.202103091610-r.jar
15:17:43 [2021-03-10T20:17:43.734Z] 20:17:43 [INFO] Installing /home/jenkins/agent/workspace/egit-github/repo/org.eclipse.egit.github.core.tests/pom.xml to /home/jenkins/agent/workspace/egit-github/.repository/org/eclipse/mylyn/github/org.eclipse.egit.github.core.tests/5.11.0.202103091610-r/org.eclipse.egit.github.core.tests-5.11.0.202103091610-r.pom
15:17:43 [2021-03-10T20:17:43.734Z] 20:17:43 [INFO] Installing /home/jenkins/agent/workspace/egit-github/repo/org.eclipse.egit.github.core.tests/target/org.eclipse.egit.github.core.tests-5.11.0.202103091610-r.jar.pack.gz to /home/jenkins/agent/workspace/egit-github/.repository/org/eclipse/mylyn/github/org.eclipse.egit.github.core.tests/5.11.0.202103091610-r/org.eclipse.egit.github.core.tests-5.11.0.202103091610-r-pack200.jar.pack.gz
15:17:43 [2021-03-10T20:17:43.734Z] 20:17:43 [INFO] Installing /home/jenkins/agent/workspace/egit-github/repo/org.eclipse.egit.github.core.tests/target/p2content.xml to /home/jenkins/agent/workspace/egit-github/.repository/org/eclipse/mylyn/github/org.eclipse.egit.github.core.tests/5.11.0.202103091610-r/org.eclipse.egit.github.core.tests-5.11.0.202103091610-r-p2metadata.xml
15:17:43 [2021-03-10T20:17:43.734Z] 20:17:43 [INFO] Installing /home/jenkins/agent/workspace/egit-github/repo/org.eclipse.egit.github.core.tests/target/p2artifacts.xml to /home/jenkins/agent/workspace/egit-github/.repository/org/eclipse/mylyn/github/org.eclipse.egit.github.core.tests/5.11.0.202103091610-r/org.eclipse.egit.github.core.tests-5.11.0.202103091610-r-p2artifacts.xml
15:17:43 [2021-03-10T20:17:43.734Z] 20:17:43 [INFO] 
15:17:43 [2021-03-10T20:17:43.734Z] 20:17:43 [INFO] --- tycho-p2-plugin:1.7.0:update-local-index (default-update-local-index) @ org.eclipse.egit.github.core.tests ---
15:17:43 [2021-03-10T20:17:43.734Z] 20:17:43 [INFO] 
15:17:43 [2021-03-10T20:17:43.734Z] 20:17:43 [INFO] ------< org.eclipse.mylyn.github:org.eclipse.mylyn.github.tests >-------
15:17:43 [2021-03-10T20:17:43.734Z] 20:17:43 [INFO] Building Eclipse EGit Mylyn GitHub Test Plug-in 5.11.0.202103091610-r [9/10]
15:17:43 [2021-03-10T20:17:43.734Z] 20:17:43 [INFO] ------------------------[ eclipse-test-plugin ]-------------------------
15:17:43 [2021-03-10T20:17:43.734Z] 20:17:43 [INFO] 
15:17:43 [2021-03-10T20:17:43.734Z] 20:17:43 [INFO] --- maven-clean-plugin:2.5:clean (default-clean) @ org.eclipse.mylyn.github.tests ---
15:17:43 [2021-03-10T20:17:43.734Z] 20:17:43 [INFO] 
15:17:43 [2021-03-10T20:17:43.734Z] 20:17:43 [INFO] --- tycho-packaging-plugin:1.7.0:build-qualifier (default-build-qualifier) @ org.eclipse.mylyn.github.tests ---
15:17:43 [2021-03-10T20:17:43.734Z] 20:17:43 [INFO] The project's OSGi version is 5.11.0.202103091610-r
15:17:43 [2021-03-10T20:17:43.734Z] 20:17:43 [INFO] 
15:17:43 [2021-03-10T20:17:43.734Z] 20:17:43 [INFO] --- tycho-packaging-plugin:1.7.0:validate-id (default-validate-id) @ org.eclipse.mylyn.github.tests ---
15:17:43 [2021-03-10T20:17:43.734Z] 20:17:43 [INFO] 
15:17:43 [2021-03-10T20:17:43.734Z] 20:17:43 [INFO] --- tycho-packaging-plugin:1.7.0:validate-version (default-validate-version) @ org.eclipse.mylyn.github.tests ---
15:17:43 [2021-03-10T20:17:43.734Z] 20:17:43 [INFO] 
15:17:43 [2021-03-10T20:17:43.734Z] 20:17:43 [INFO] --- maven-enforcer-plugin:3.0.0-M2:enforce (enforce-maven) @ org.eclipse.mylyn.github.tests ---
15:17:43 [2021-03-10T20:17:43.734Z] 20:17:43 [INFO] 
15:17:43 [2021-03-10T20:17:43.734Z] 20:17:43 [INFO] --- maven-resources-plugin:3.1.0:resources (default-resources) @ org.eclipse.mylyn.github.tests ---
15:17:43 [2021-03-10T20:17:43.734Z] 20:17:43 [INFO] Using 'UTF-8' encoding to copy filtered resources.
15:17:43 [2021-03-10T20:17:43.734Z] 20:17:43 [INFO] skip non existing resourceDirectory /home/jenkins/agent/workspace/egit-github/repo/org.eclipse.mylyn.github.tests/src/main/resources
15:17:43 [2021-03-10T20:17:43.734Z] 20:17:43 [INFO] 
15:17:43 [2021-03-10T20:17:43.734Z] 20:17:43 [INFO] --- tycho-compiler-plugin:1.7.0:compile (default-compile) @ org.eclipse.mylyn.github.tests ---
15:17:43 [2021-03-10T20:17:43.734Z] 20:17:43 [INFO] Compiling 1 source file to /home/jenkins/agent/workspace/egit-github/repo/org.eclipse.mylyn.github.tests/target/classes
15:17:43 [2021-03-10T20:17:43.734Z] 20:17:43 [INFO] 
15:17:43 [2021-03-10T20:17:43.734Z] 20:17:43 [INFO] --- maven-resources-plugin:3.1.0:testResources (default-testResources) @ org.eclipse.mylyn.github.tests ---
15:17:43 [2021-03-10T20:17:43.734Z] 20:17:43 [INFO] Using 'UTF-8' encoding to copy filtered resources.
15:17:43 [2021-03-10T20:17:43.734Z] 20:17:43 [INFO] skip non existing resourceDirectory /home/jenkins/agent/workspace/egit-github/repo/org.eclipse.mylyn.github.tests/src/test/resources
15:17:43 [2021-03-10T20:17:43.734Z] 20:17:43 [INFO] 
15:17:43 [2021-03-10T20:17:43.734Z] 20:17:43 [INFO] --- target-platform-configuration:1.7.0:target-platform (default-target-platform) @ org.eclipse.mylyn.github.tests ---
15:17:43 [2021-03-10T20:17:43.734Z] 20:17:43 [INFO] 
15:17:43 [2021-03-10T20:17:43.734Z] 20:17:43 [INFO] --- tycho-packaging-plugin:1.7.0:package-plugin (default-package-plugin) @ org.eclipse.mylyn.github.tests ---
15:17:43 [2021-03-10T20:17:43.734Z] 20:17:43 [INFO] Building jar: /home/jenkins/agent/workspace/egit-github/repo/org.eclipse.mylyn.github.tests/target/org.eclipse.mylyn.github.tests-5.11.0.202103091610-r.jar
15:17:43 [2021-03-10T20:17:43.734Z] 20:17:43 [INFO] 
15:17:43 [2021-03-10T20:17:43.734Z] 20:17:43 [INFO] --- tycho-p2-plugin:1.7.0:p2-metadata-default (default-p2-metadata-default) @ org.eclipse.mylyn.github.tests ---
15:17:43 [2021-03-10T20:17:43.734Z] 20:17:43 [INFO] 
15:17:43 [2021-03-10T20:17:43.734Z] 20:17:43 [INFO] --- tycho-surefire-plugin:1.7.0:test (default-test) @ org.eclipse.mylyn.github.tests ---
15:17:43 [2021-03-10T20:17:43.990Z] 20:17:43 [INFO] Executing Test Runtime with timeout 0, logs (if any) will be placed at: /home/jenkins/agent/workspace/egit-github/repo/org.eclipse.mylyn.github.tests/target/work/data/.metadata/.log
15:17:43 [2021-03-10T20:17:43.990Z] 20:17:43 [INFO] Command line:
15:17:43 [2021-03-10T20:17:43.990Z] 	[/opt/tools/java/adoptopenjdk/hotspot-jdk-8/1.8.0_282-b08/jre/bin/java, -Dosgi.noShutdown=false, -Dosgi.os=linux, -Dosgi.ws=gtk, -Dosgi.arch=x86_64, -Declipse.consoleLog=true, -Xmx1024m, -Dorg.eclipse.swtbot.search.timeout=30000, -Dorg.eclipse.swtbot.screenshots.dir=target/screenshots, -Dosgi.clean=true, -jar, /home/jenkins/agent/workspace/egit-github/.repository/p2/osgi/bundle/org.eclipse.equinox.launcher/1.4.0.v20161219-1356/org.eclipse.equinox.launcher-1.4.0.v20161219-1356.jar, -data, /home/jenkins/agent/workspace/egit-github/repo/org.eclipse.mylyn.github.tests/target/work/data, -install, /home/jenkins/agent/workspace/egit-github/repo/org.eclipse.mylyn.github.tests/target/work, -configuration, /home/jenkins/agent/workspace/egit-github/repo/org.eclipse.mylyn.github.tests/target/work/configuration, -application, org.eclipse.tycho.surefire.osgibooter.uitest, -testproperties, /home/jenkins/agent/workspace/egit-github/repo/org.eclipse.mylyn.github.tests/target/surefire.properties, -testApplication, org.eclipse.ui.ide.workbench, -nouithread]
15:17:45 [2021-03-10T20:17:45.878Z] !SESSION 2021-03-10 20:17:44.028 -----------------------------------------------
15:17:45 [2021-03-10T20:17:45.878Z] eclipse.buildId=unknown
15:17:45 [2021-03-10T20:17:45.878Z] java.version=1.8.0_282
15:17:45 [2021-03-10T20:17:45.878Z] java.vendor=AdoptOpenJDK
15:17:45 [2021-03-10T20:17:45.878Z] BootLoader constants: OS=linux, ARCH=x86_64, WS=gtk, NL=en_US
15:17:45 [2021-03-10T20:17:45.878Z] Framework arguments:  -application org.eclipse.tycho.surefire.osgibooter.uitest -testproperties /home/jenkins/agent/workspace/egit-github/repo/org.eclipse.mylyn.github.tests/target/surefire.properties -testApplication org.eclipse.ui.ide.workbench -nouithread
15:17:45 [2021-03-10T20:17:45.878Z] Command-line arguments:  -data /home/jenkins/agent/workspace/egit-github/repo/org.eclipse.mylyn.github.tests/target/work/data -application org.eclipse.tycho.surefire.osgibooter.uitest -testproperties /home/jenkins/agent/workspace/egit-github/repo/org.eclipse.mylyn.github.tests/target/surefire.properties -testApplication org.eclipse.ui.ide.workbench -nouithread
15:17:45 [2021-03-10T20:17:45.878Z] 
15:17:45 [2021-03-10T20:17:45.878Z] !ENTRY org.eclipse.jdt.launching.macosx 4 0 2021-03-10 20:17:45.524
15:17:45 [2021-03-10T20:17:45.878Z] !MESSAGE FrameworkEvent ERROR
15:17:45 [2021-03-10T20:17:45.878Z] !STACK 0
15:17:45 [2021-03-10T20:17:45.878Z] org.osgi.framework.BundleException: Could not resolve module: org.eclipse.jdt.launching.macosx [270]
15:17:45 [2021-03-10T20:17:45.878Z]   Unresolved requirement: Require-Capability: eclipse.platform; filter:="(osgi.os=macosx)"
15:17:45 [2021-03-10T20:17:45.878Z] 
15:17:45 [2021-03-10T20:17:45.878Z] 	at org.eclipse.osgi.container.Module.start(Module.java:444)
15:17:45 [2021-03-10T20:17:45.878Z] 	at org.eclipse.osgi.container.ModuleContainer$ContainerStartLevel.incStartLevel(ModuleContainer.java:1634)
15:17:45 [2021-03-10T20:17:45.878Z] 	at org.eclipse.osgi.container.ModuleContainer$ContainerStartLevel.incStartLevel(ModuleContainer.java:1613)
15:17:45 [2021-03-10T20:17:45.878Z] 	at org.eclipse.osgi.container.ModuleContainer$ContainerStartLevel.doContainerStartLevel(ModuleContainer.java:1585)
15:17:45 [2021-03-10T20:17:45.878Z] 	at org.eclipse.osgi.container.ModuleContainer$ContainerStartLevel.dispatchEvent(ModuleContainer.java:1528)
15:17:45 [2021-03-10T20:17:45.878Z] 	at org.eclipse.osgi.container.ModuleContainer$ContainerStartLevel.dispatchEvent(ModuleContainer.java:1)
15:17:45 [2021-03-10T20:17:45.878Z] 	at org.eclipse.osgi.framework.eventmgr.EventManager.dispatchEvent(EventManager.java:230)
15:17:45 [2021-03-10T20:17:45.878Z] 	at org.eclipse.osgi.framework.eventmgr.EventManager$EventThread.run(EventManager.java:340)
15:17:45 [2021-03-10T20:17:45.878Z] 
15:17:45 [2021-03-10T20:17:45.878Z] !ENTRY org.eclipse.jdt.launching.ui.macosx 4 0 2021-03-10 20:17:45.525
15:17:45 [2021-03-10T20:17:45.878Z] !MESSAGE FrameworkEvent ERROR
15:17:45 [2021-03-10T20:17:45.878Z] !STACK 0
15:17:45 [2021-03-10T20:17:45.878Z] org.osgi.framework.BundleException: Could not resolve module: org.eclipse.jdt.launching.ui.macosx [271]
15:17:45 [2021-03-10T20:17:45.878Z]   Unresolved requirement: Require-Capability: eclipse.platform; filter:="(osgi.os=macosx)"
15:17:45 [2021-03-10T20:17:45.878Z] 
15:17:45 [2021-03-10T20:17:45.878Z] 	at org.eclipse.osgi.container.Module.start(Module.java:444)
15:17:45 [2021-03-10T20:17:45.878Z] 	at org.eclipse.osgi.container.ModuleContainer$ContainerStartLevel.incStartLevel(ModuleContainer.java:1634)
15:17:45 [2021-03-10T20:17:45.878Z] 	at org.eclipse.osgi.container.ModuleContainer$ContainerStartLevel.incStartLevel(ModuleContainer.java:1613)
15:17:45 [2021-03-10T20:17:45.878Z] 	at org.eclipse.osgi.container.ModuleContainer$ContainerStartLevel.doContainerStartLevel(ModuleContainer.java:1585)
15:17:45 [2021-03-10T20:17:45.878Z] 	at org.eclipse.osgi.container.ModuleContainer$ContainerStartLevel.dispatchEvent(ModuleContainer.java:1528)
15:17:45 [2021-03-10T20:17:45.878Z] 	at org.eclipse.osgi.container.ModuleContainer$ContainerStartLevel.dispatchEvent(ModuleContainer.java:1)
15:17:45 [2021-03-10T20:17:45.878Z] 	at org.eclipse.osgi.framework.eventmgr.EventManager.dispatchEvent(EventManager.java:230)
15:17:45 [2021-03-10T20:17:45.878Z] 	at org.eclipse.osgi.framework.eventmgr.EventManager$EventThread.run(EventManager.java:340)
15:17:45 [2021-03-10T20:17:45.878Z] Launching application org.eclipse.ui.ide.workbench...
15:17:47 [2021-03-10T20:17:47.767Z] SLF4J: Failed to load class "org.slf4j.impl.StaticLoggerBinder".
15:17:47 [2021-03-10T20:17:47.767Z] SLF4J: Defaulting to no-operation (NOP) logger implementation
15:17:47 [2021-03-10T20:17:47.767Z] SLF4J: See http://www.slf4j.org/codes.html#StaticLoggerBinder for further details.
15:17:48 [2021-03-10T20:17:48.329Z] Running org.eclipse.mylyn.github.ui.internal.GitHubRepositoryConnectorUIHeadlessTest
15:17:48 [2021-03-10T20:17:48.329Z] Tests run: 1, Failures: 0, Errors: 0, Skipped: 0, Time elapsed: 0.016 s - in org.eclipse.mylyn.github.ui.internal.GitHubRepositoryConnectorUIHeadlessTest
15:17:48 [2021-03-10T20:17:48.329Z] testFindHyperlinksTaskRepositoryStringIntInt(org.eclipse.mylyn.github.ui.internal.GitHubRepositoryConnectorUIHeadlessTest)  Time elapsed: 0.002 s
15:17:48 [2021-03-10T20:17:48.329Z] 
15:17:48 [2021-03-10T20:17:48.329Z] Results:
15:17:48 [2021-03-10T20:17:48.329Z] 
15:17:48 [2021-03-10T20:17:48.329Z] Tests run: 1, Failures: 0, Errors: 0, Skipped: 0
15:17:48 [2021-03-10T20:17:48.329Z] 
15:17:49 [2021-03-10T20:17:49.256Z] 
15:17:49 [2021-03-10T20:17:49.256Z] (SWT:1187): Gtk-WARNING **: 20:17:49.082: Negative content width -1 (allocation 1, extents 1x1) while allocating gadget (node trough, owner GtkProgressBar)
15:17:49 [2021-03-10T20:17:49.256Z] 
15:17:49 [2021-03-10T20:17:49.256Z] (SWT:1187): Gtk-WARNING **: 20:17:49.082: Negative content width -1 (allocation 1, extents 1x1) while allocating gadget (node trough, owner GtkProgressBar)
15:17:51 [2021-03-10T20:17:51.769Z] 20:17:51 [INFO] All tests passed!
15:17:51 [2021-03-10T20:17:51.769Z] 20:17:51 [INFO] 
15:17:51 [2021-03-10T20:17:51.769Z] 20:17:51 [INFO] >>> spotbugs-maven-plugin:3.1.11:check (default) > :spotbugs @ org.eclipse.mylyn.github.tests >>>
15:17:51 [2021-03-10T20:17:51.769Z] 20:17:51 [INFO] 
15:17:51 [2021-03-10T20:17:51.769Z] 20:17:51 [INFO] --- spotbugs-maven-plugin:3.1.11:spotbugs (spotbugs) @ org.eclipse.mylyn.github.tests ---
15:17:51 [2021-03-10T20:17:51.769Z] 20:17:51 [INFO] Fork Value is true
15:17:53 [2021-03-10T20:17:53.670Z] 20:17:53 [INFO] Done SpotBugs Analysis....
15:17:53 [2021-03-10T20:17:53.670Z] 20:17:53 [INFO] 
15:17:53 [2021-03-10T20:17:53.670Z] 20:17:53 [INFO] <<< spotbugs-maven-plugin:3.1.11:check (default) < :spotbugs @ org.eclipse.mylyn.github.tests <<<
15:17:53 [2021-03-10T20:17:53.670Z] 20:17:53 [INFO] 
15:17:53 [2021-03-10T20:17:53.670Z] 20:17:53 [INFO] 
15:17:53 [2021-03-10T20:17:53.670Z] 20:17:53 [INFO] --- spotbugs-maven-plugin:3.1.11:check (default) @ org.eclipse.mylyn.github.tests ---
15:17:53 [2021-03-10T20:17:53.670Z] 20:17:53 [INFO] BugInstance size is 0
15:17:53 [2021-03-10T20:17:53.670Z] 20:17:53 [INFO] Error size is 0
15:17:53 [2021-03-10T20:17:53.670Z] 20:17:53 [INFO] No errors/warnings found
15:17:53 [2021-03-10T20:17:53.670Z] 20:17:53 [INFO] 
15:17:53 [2021-03-10T20:17:53.670Z] 20:17:53 [INFO] >>> maven-pmd-plugin:3.11.0:cpd-check (default) > :cpd @ org.eclipse.mylyn.github.tests >>>
15:17:53 [2021-03-10T20:17:53.670Z] 20:17:53 [INFO] 
15:17:53 [2021-03-10T20:17:53.670Z] 20:17:53 [INFO] --- maven-pmd-plugin:3.11.0:cpd (cpd) @ org.eclipse.mylyn.github.tests ---
15:17:53 [2021-03-10T20:17:53.670Z] 20:17:53 [INFO] 
15:17:53 [2021-03-10T20:17:53.670Z] 20:17:53 [INFO] <<< maven-pmd-plugin:3.11.0:cpd-check (default) < :cpd @ org.eclipse.mylyn.github.tests <<<
15:17:53 [2021-03-10T20:17:53.670Z] 20:17:53 [INFO] 
15:17:53 [2021-03-10T20:17:53.670Z] 20:17:53 [INFO] 
15:17:53 [2021-03-10T20:17:53.670Z] 20:17:53 [INFO] --- maven-pmd-plugin:3.11.0:cpd-check (default) @ org.eclipse.mylyn.github.tests ---
15:17:53 [2021-03-10T20:17:53.670Z] 20:17:53 [INFO] 
15:17:53 [2021-03-10T20:17:53.670Z] 20:17:53 [INFO] 
15:17:53 [2021-03-10T20:17:53.670Z] 20:17:53 [INFO] --- tycho-pack200a-plugin:1.7.0:normalize (pack200-normalize) @ org.eclipse.mylyn.github.tests ---
15:17:53 [2021-03-10T20:17:53.670Z] 20:17:53 [INFO] Pack200 normalizing jar /home/jenkins/agent/workspace/egit-github/repo/org.eclipse.mylyn.github.tests/target/org.eclipse.mylyn.github.tests-5.11.0.202103091610-r.jar
15:17:53 [2021-03-10T20:17:53.670Z] 20:17:53 [INFO] 
15:17:53 [2021-03-10T20:17:53.670Z] 20:17:53 [INFO] --- eclipse-jarsigner-plugin:1.1.5:sign (sign) @ org.eclipse.mylyn.github.tests ---
15:17:53 [2021-03-10T20:17:53.671Z] 20:17:53 [INFO] Signing jar: /home/jenkins/agent/workspace/egit-github/repo/org.eclipse.mylyn.github.tests/target/org.eclipse.mylyn.github.tests-5.11.0.202103091610-r.jar
15:17:54 [2021-03-10T20:17:54.596Z] 20:17:54 [INFO] 
15:17:54 [2021-03-10T20:17:54.596Z] 20:17:54 [INFO] --- tycho-pack200b-plugin:1.7.0:pack (pack200-pack) @ org.eclipse.mylyn.github.tests ---
15:17:54 [2021-03-10T20:17:54.596Z] 20:17:54 [INFO] Pack200 packing jar /home/jenkins/agent/workspace/egit-github/repo/org.eclipse.mylyn.github.tests/target/org.eclipse.mylyn.github.tests-5.11.0.202103091610-r.jar
15:17:54 [2021-03-10T20:17:54.596Z] 20:17:54 [INFO] 
15:17:54 [2021-03-10T20:17:54.596Z] 20:17:54 [INFO] --- tycho-p2-plugin:1.7.0:p2-metadata (p2-metadata) @ org.eclipse.mylyn.github.tests ---
15:17:54 [2021-03-10T20:17:54.596Z] 20:17:54 [INFO] 
15:17:54 [2021-03-10T20:17:54.596Z] 20:17:54 [INFO] --- maven-install-plugin:2.3.1:install (default-install) @ org.eclipse.mylyn.github.tests ---
15:17:54 [2021-03-10T20:17:54.596Z] 20:17:54 [INFO] Installing /home/jenkins/agent/workspace/egit-github/repo/org.eclipse.mylyn.github.tests/target/org.eclipse.mylyn.github.tests-5.11.0.202103091610-r.jar to /home/jenkins/agent/workspace/egit-github/.repository/org/eclipse/mylyn/github/org.eclipse.mylyn.github.tests/5.11.0.202103091610-r/org.eclipse.mylyn.github.tests-5.11.0.202103091610-r.jar
15:17:54 [2021-03-10T20:17:54.596Z] 20:17:54 [INFO] Installing /home/jenkins/agent/workspace/egit-github/repo/org.eclipse.mylyn.github.tests/pom.xml to /home/jenkins/agent/workspace/egit-github/.repository/org/eclipse/mylyn/github/org.eclipse.mylyn.github.tests/5.11.0.202103091610-r/org.eclipse.mylyn.github.tests-5.11.0.202103091610-r.pom
15:17:54 [2021-03-10T20:17:54.596Z] 20:17:54 [INFO] Installing /home/jenkins/agent/workspace/egit-github/repo/org.eclipse.mylyn.github.tests/target/org.eclipse.mylyn.github.tests-5.11.0.202103091610-r.jar.pack.gz to /home/jenkins/agent/workspace/egit-github/.repository/org/eclipse/mylyn/github/org.eclipse.mylyn.github.tests/5.11.0.202103091610-r/org.eclipse.mylyn.github.tests-5.11.0.202103091610-r-pack200.jar.pack.gz
15:17:54 [2021-03-10T20:17:54.596Z] 20:17:54 [INFO] Installing /home/jenkins/agent/workspace/egit-github/repo/org.eclipse.mylyn.github.tests/target/p2content.xml to /home/jenkins/agent/workspace/egit-github/.repository/org/eclipse/mylyn/github/org.eclipse.mylyn.github.tests/5.11.0.202103091610-r/org.eclipse.mylyn.github.tests-5.11.0.202103091610-r-p2metadata.xml
15:17:54 [2021-03-10T20:17:54.596Z] 20:17:54 [INFO] Installing /home/jenkins/agent/workspace/egit-github/repo/org.eclipse.mylyn.github.tests/target/p2artifacts.xml to /home/jenkins/agent/workspace/egit-github/.repository/org/eclipse/mylyn/github/org.eclipse.mylyn.github.tests/5.11.0.202103091610-r/org.eclipse.mylyn.github.tests-5.11.0.202103091610-r-p2artifacts.xml
15:17:54 [2021-03-10T20:17:54.596Z] 20:17:54 [INFO] 
15:17:54 [2021-03-10T20:17:54.596Z] 20:17:54 [INFO] --- tycho-p2-plugin:1.7.0:update-local-index (default-update-local-index) @ org.eclipse.mylyn.github.tests ---
15:17:54 [2021-03-10T20:17:54.596Z] 20:17:54 [INFO] 
15:17:54 [2021-03-10T20:17:54.596Z] 20:17:54 [INFO] -------------< org.eclipse.mylyn.github:github-updatesite >-------------
15:17:54 [2021-03-10T20:17:54.596Z] 20:17:54 [INFO] Building Eclipse EGit Mylyn GitHub Repository 5.11.0.202103091610-r [10/10]
15:17:54 [2021-03-10T20:17:54.596Z] 20:17:54 [INFO] -------------------------[ eclipse-repository ]-------------------------
15:17:54 [2021-03-10T20:17:54.596Z] 20:17:54 [INFO] 
15:17:54 [2021-03-10T20:17:54.596Z] 20:17:54 [INFO] --- maven-clean-plugin:2.5:clean (default-clean) @ github-updatesite ---
15:17:54 [2021-03-10T20:17:54.596Z] 20:17:54 [INFO] 
15:17:54 [2021-03-10T20:17:54.596Z] 20:17:54 [INFO] --- tycho-packaging-plugin:1.7.0:build-qualifier-aggregator (default-build-qualifier-aggregator) @ github-updatesite ---
15:17:54 [2021-03-10T20:17:54.596Z] 20:17:54 [INFO] The project's OSGi version is 5.11.0.202103091610-r
15:17:54 [2021-03-10T20:17:54.596Z] 20:17:54 [INFO] 
15:17:54 [2021-03-10T20:17:54.596Z] 20:17:54 [INFO] --- maven-enforcer-plugin:3.0.0-M2:enforce (enforce-maven) @ github-updatesite ---
15:17:54 [2021-03-10T20:17:54.596Z] 20:17:54 [INFO] 
15:17:54 [2021-03-10T20:17:54.596Z] 20:17:54 [INFO] --- maven-clean-plugin:2.5:clean (default-clean-1) @ github-updatesite ---
15:17:54 [2021-03-10T20:17:54.596Z] 20:17:54 [INFO] 
15:17:54 [2021-03-10T20:17:54.596Z] 20:17:54 [INFO] --- maven-resources-plugin:3.1.0:resources (default-resources) @ github-updatesite ---
15:17:54 [2021-03-10T20:17:54.596Z] 20:17:54 [INFO] Using 'UTF-8' encoding to copy filtered resources.
15:17:54 [2021-03-10T20:17:54.596Z] 20:17:54 [INFO] skip non existing resourceDirectory /home/jenkins/agent/workspace/egit-github/repo/org.eclipse.mylyn.github-site/src/main/resources
15:17:54 [2021-03-10T20:17:54.596Z] 20:17:54 [INFO] 
15:17:54 [2021-03-10T20:17:54.596Z] 20:17:54 [INFO] --- target-platform-configuration:1.7.0:target-platform (default-target-platform) @ github-updatesite ---
15:17:54 [2021-03-10T20:17:54.596Z] 20:17:54 [INFO] 
15:17:54 [2021-03-10T20:17:54.596Z] 20:17:54 [INFO] --- tycho-p2-publisher-plugin:1.7.0:publish-osgi-ee (default-publish-osgi-ee) @ github-updatesite ---
15:17:54 [2021-03-10T20:17:54.596Z] 20:17:54 [INFO] Published profile IUs: [a.jre.javase 11.0.0, config.a.jre.javase 11.0.0]
15:17:54 [2021-03-10T20:17:54.596Z] 20:17:54 [INFO] Published profile IUs: [a.jre.javase 14.0.0, config.a.jre.javase 14.0.0]
15:17:54 [2021-03-10T20:17:54.596Z] 20:17:54 [INFO] 
15:17:54 [2021-03-10T20:17:54.596Z] 20:17:54 [INFO] --- tycho-p2-publisher-plugin:1.7.0:publish-products (default-publish-products) @ github-updatesite ---
15:17:54 [2021-03-10T20:17:54.596Z] 20:17:54 [INFO] 
15:17:54 [2021-03-10T20:17:54.596Z] 20:17:54 [INFO] --- tycho-p2-publisher-plugin:1.7.0:publish-categories (default-publish-categories) @ github-updatesite ---
15:17:54 [2021-03-10T20:17:54.596Z] 20:17:54 [INFO] 
15:17:54 [2021-03-10T20:17:54.596Z] 20:17:54 [INFO] --- tycho-p2-publisher-plugin:1.7.0:attach-artifacts (default-attach-artifacts) @ github-updatesite ---
15:17:54 [2021-03-10T20:17:54.596Z] 20:17:54 [INFO] 
15:17:54 [2021-03-10T20:17:54.596Z] 20:17:54 [INFO] --- tycho-p2-repository-plugin:1.7.0:assemble-repository (default-assemble-repository) @ github-updatesite ---
15:17:55 [2021-03-10T20:17:55.526Z] 20:17:55 [INFO] 
15:17:55 [2021-03-10T20:17:55.526Z] 20:17:55 [INFO] --- tycho-p2-repository-plugin:1.7.0:archive-repository (default-archive-repository) @ github-updatesite ---
15:17:55 [2021-03-10T20:17:55.526Z] 20:17:55 [INFO] Building zip: /home/jenkins/agent/workspace/egit-github/repo/org.eclipse.mylyn.github-site/target/github-updatesite-5.11.0.202103091610-r.zip
15:17:55 [2021-03-10T20:17:55.526Z] 20:17:55 [INFO] 
15:17:55 [2021-03-10T20:17:55.526Z] 20:17:55 [INFO] >>> spotbugs-maven-plugin:3.1.11:check (default) > :spotbugs @ github-updatesite >>>
15:17:55 [2021-03-10T20:17:55.782Z] 20:17:55 [INFO] 
15:17:55 [2021-03-10T20:17:55.782Z] 20:17:55 [INFO] --- spotbugs-maven-plugin:3.1.11:spotbugs (spotbugs) @ github-updatesite ---
15:17:55 [2021-03-10T20:17:55.782Z] 20:17:55 [INFO] 
15:17:55 [2021-03-10T20:17:55.782Z] 20:17:55 [INFO] <<< spotbugs-maven-plugin:3.1.11:check (default) < :spotbugs @ github-updatesite <<<
15:17:55 [2021-03-10T20:17:55.782Z] 20:17:55 [INFO] 
15:17:55 [2021-03-10T20:17:55.782Z] 20:17:55 [INFO] 
15:17:55 [2021-03-10T20:17:55.782Z] 20:17:55 [INFO] --- spotbugs-maven-plugin:3.1.11:check (default) @ github-updatesite ---
15:17:55 [2021-03-10T20:17:55.782Z] 20:17:55 [INFO] 
15:17:55 [2021-03-10T20:17:55.782Z] 20:17:55 [INFO] >>> maven-pmd-plugin:3.11.0:cpd-check (default) > :cpd @ github-updatesite >>>
15:17:55 [2021-03-10T20:17:55.782Z] 20:17:55 [INFO] 
15:17:55 [2021-03-10T20:17:55.782Z] 20:17:55 [INFO] --- maven-pmd-plugin:3.11.0:cpd (cpd) @ github-updatesite ---
15:17:55 [2021-03-10T20:17:55.782Z] 20:17:55 [INFO] 
15:17:55 [2021-03-10T20:17:55.782Z] 20:17:55 [INFO] <<< maven-pmd-plugin:3.11.0:cpd-check (default) < :cpd @ github-updatesite <<<
15:17:55 [2021-03-10T20:17:55.782Z] 20:17:55 [INFO] 
15:17:55 [2021-03-10T20:17:55.782Z] 20:17:55 [INFO] 
15:17:55 [2021-03-10T20:17:55.782Z] 20:17:55 [INFO] --- maven-pmd-plugin:3.11.0:cpd-check (default) @ github-updatesite ---
15:17:55 [2021-03-10T20:17:55.782Z] 20:17:55 [INFO] 
15:17:55 [2021-03-10T20:17:55.782Z] 20:17:55 [INFO] 
15:17:55 [2021-03-10T20:17:55.782Z] 20:17:55 [INFO] --- tycho-pack200a-plugin:1.7.0:normalize (pack200-normalize) @ github-updatesite ---
15:17:55 [2021-03-10T20:17:55.782Z] 20:17:55 [INFO] 
15:17:55 [2021-03-10T20:17:55.782Z] 20:17:55 [INFO] --- eclipse-jarsigner-plugin:1.1.5:sign (sign) @ github-updatesite ---
15:17:55 [2021-03-10T20:17:55.782Z] 20:17:55 [INFO] 
15:17:55 [2021-03-10T20:17:55.782Z] 20:17:55 [INFO] --- tycho-pack200b-plugin:1.7.0:pack (pack200-pack) @ github-updatesite ---
15:17:55 [2021-03-10T20:17:55.782Z] 20:17:55 [INFO] 
15:17:55 [2021-03-10T20:17:55.782Z] 20:17:55 [INFO] --- tycho-p2-plugin:1.7.0:p2-metadata (p2-metadata) @ github-updatesite ---
15:17:55 [2021-03-10T20:17:55.782Z] 20:17:55 [INFO] 
15:17:55 [2021-03-10T20:17:55.782Z] 20:17:55 [INFO] --- maven-install-plugin:2.3.1:install (default-install) @ github-updatesite ---
15:17:55 [2021-03-10T20:17:55.782Z] 20:17:55 [INFO] Installing /home/jenkins/agent/workspace/egit-github/repo/org.eclipse.mylyn.github-site/target/github-updatesite-5.11.0.202103091610-r.zip to /home/jenkins/agent/workspace/egit-github/.repository/org/eclipse/mylyn/github/github-updatesite/5.11.0.202103091610-r/github-updatesite-5.11.0.202103091610-r.zip
15:17:55 [2021-03-10T20:17:55.782Z] 20:17:55 [INFO] Installing /home/jenkins/agent/workspace/egit-github/repo/org.eclipse.mylyn.github-site/pom.xml to /home/jenkins/agent/workspace/egit-github/.repository/org/eclipse/mylyn/github/github-updatesite/5.11.0.202103091610-r/github-updatesite-5.11.0.202103091610-r.pom
15:17:55 [2021-03-10T20:17:55.782Z] 20:17:55 [INFO] Installing /home/jenkins/agent/workspace/egit-github/repo/org.eclipse.mylyn.github-site/target/p2content.xml to /home/jenkins/agent/workspace/egit-github/.repository/org/eclipse/mylyn/github/github-updatesite/5.11.0.202103091610-r/github-updatesite-5.11.0.202103091610-r-p2metadata.xml
15:17:55 [2021-03-10T20:17:55.782Z] 20:17:55 [INFO] Installing /home/jenkins/agent/workspace/egit-github/repo/org.eclipse.mylyn.github-site/target/p2artifacts.xml to /home/jenkins/agent/workspace/egit-github/.repository/org/eclipse/mylyn/github/github-updatesite/5.11.0.202103091610-r/github-updatesite-5.11.0.202103091610-r-p2artifacts.xml
15:17:55 [2021-03-10T20:17:55.782Z] 20:17:55 [INFO] 
15:17:55 [2021-03-10T20:17:55.782Z] 20:17:55 [INFO] --- tycho-p2-plugin:1.7.0:update-local-index (default-update-local-index) @ github-updatesite ---
15:17:55 [2021-03-10T20:17:55.782Z] 20:17:55 [INFO] ------------------------------------------------------------------------
15:17:55 [2021-03-10T20:17:55.782Z] 20:17:55 [INFO] Reactor Summary for Eclipse EGit Mylyn GitHub Connector Parent 5.11.0.202103091610-r:
15:17:55 [2021-03-10T20:17:55.782Z] 20:17:55 [INFO] 
15:17:55 [2021-03-10T20:17:55.782Z] 20:17:55 [INFO] Eclipse EGit Mylyn GitHub Connector Parent ......... SUCCESS [01:11 min]
15:17:55 [2021-03-10T20:17:55.782Z] 20:17:55 [INFO] EGit GitHub Target Platform Definition ............. SUCCESS [  3.081 s]
15:17:55 [2021-03-10T20:17:55.782Z] 20:17:55 [INFO] Eclipse EGit GitHub API Core ....................... SUCCESS [ 14.261 s]
15:17:55 [2021-03-10T20:17:55.782Z] 20:17:55 [INFO] Eclipse EGit Mylyn GitHub Core ..................... SUCCESS [  5.685 s]
15:17:55 [2021-03-10T20:17:55.782Z] 20:17:55 [INFO] Eclipse EGit Mylyn GitHub UI ....................... SUCCESS [ 10.132 s]
15:17:55 [2021-03-10T20:17:55.782Z] 20:17:55 [INFO] Eclipse EGit Mylyn GitHub Documentation ............ SUCCESS [  8.161 s]
15:17:55 [2021-03-10T20:17:55.782Z] 20:17:55 [INFO] Eclipse EGit Mylyn GitHub Feature .................. SUCCESS [  1.100 s]
15:17:55 [2021-03-10T20:17:55.782Z] 20:17:55 [INFO] Eclipse EGit GitHub API Test Plug-in ............... SUCCESS [ 10.222 s]
15:17:55 [2021-03-10T20:17:55.782Z] 20:17:55 [INFO] Eclipse EGit Mylyn GitHub Test Plug-in ............. SUCCESS [ 10.877 s]
15:17:55 [2021-03-10T20:17:55.782Z] 20:17:55 [INFO] Eclipse EGit Mylyn GitHub Repository ............... SUCCESS [  1.140 s]
15:17:55 [2021-03-10T20:17:55.782Z] 20:17:55 [INFO] ------------------------------------------------------------------------
15:17:55 [2021-03-10T20:17:55.782Z] 20:17:55 [INFO] BUILD SUCCESS
15:17:55 [2021-03-10T20:17:55.782Z] 20:17:55 [INFO] ------------------------------------------------------------------------
15:17:55 [2021-03-10T20:17:55.782Z] 20:17:55 [INFO] Total time:  04:09 min
15:17:55 [2021-03-10T20:17:55.782Z] 20:17:55 [INFO] Finished at: 2021-03-10T20:17:55Z
15:17:55 [2021-03-10T20:17:55.782Z] 20:17:55 [INFO] ------------------------------------------------------------------------
[Pipeline] }
[Pipeline] // stage
[Pipeline] stage
[Pipeline] { (Deploy)
[Pipeline] tool
[Pipeline] isUnix
[Pipeline] sh
15:17:57 [2021-03-10T20:17:57.070Z] + /opt/tools/apache-maven/latest/bin/mvn deploy -DskipTests=true -Dskip-ui-tests=true -Pstatic-checks,other-os,eclipse-sign -Degit-site=https://repo.eclipse.org/content/unzip/releases.unzip/org/eclipse/egit/org.eclipse.egit.repository/5.11.0.202103091610-r/org.eclipse.egit.repository-5.11.0.202103091610-r.zip-unzip/ -DPUBLISH_FOLDER=/egit/github/updates-5.11 --batch-mode --errors -Dmaven.repo.local=/home/jenkins/agent/workspace/egit-github/.repository -Declipse.p2.mirrors=false -Degit.test.tmpdir=/home/jenkins/agent/workspace/egit-github/tmp/egit.tmp/ -Djava.io.tmpdir=/home/jenkins/agent/workspace/egit-github/tmp/ -Dtest.vmparams=-Declipse.consoleLog=true -Dorg.slf4j.simpleLogger.showDateTime=true -Dorg.slf4j.simpleLogger.dateTimeFormat=HH:mm:ss -Dorg.slf4j.simpleLogger.log.org.apache.maven.cli.transfer.Slf4jMavenTransferListener=warn -Dorg.slf4j.simpleLogger.log.org.apache.maven.lifecycle.internal.builder.BuilderCommon=error
15:17:57 [2021-03-10T20:17:57.071Z] Apache Maven 3.6.3 (cecedd343002696d0abb50b32b541b8a6ba2883f)
15:17:57 [2021-03-10T20:17:57.071Z] Maven home: /opt/tools/apache-maven/latest
15:17:57 [2021-03-10T20:17:57.071Z] Java version: 1.8.0_282, vendor: AdoptOpenJDK, runtime: /opt/tools/java/adoptopenjdk/hotspot-jdk-8/1.8.0_282-b08/jre
15:17:57 [2021-03-10T20:17:57.071Z] Default locale: en_US, platform encoding: UTF-8
15:17:57 [2021-03-10T20:17:57.071Z] OS name: "linux", version: "3.10.0-1062.el7.x86_64", arch: "amd64", family: "unix"
15:17:57 [2021-03-10T20:17:57.633Z] 20:17:57 [INFO] Error stacktraces are turned on.
15:17:57 [2021-03-10T20:17:57.633Z] 20:17:57 [INFO] Scanning for projects...
15:17:59 [2021-03-10T20:17:59.542Z] 20:17:59 [INFO] Computing target platform for MavenProject: org.eclipse.mylyn.github:org.eclipse.egit.github.core:5.11.0.202103091610-r @ /home/jenkins/agent/workspace/egit-github/repo/org.eclipse.egit.github.core/pom.xml
15:18:00 [2021-03-10T20:18:00.103Z] 20:17:59 [INFO] Adding repository https://download.eclipse.org/jetty/updates/jetty-bundles-9.x/9.4.36.v20210114
15:18:00 [2021-03-10T20:18:00.103Z] 20:17:59 [INFO] Fetching p2.index from https://download.eclipse.org/cbi/updates/license/2.0.2.v20181016-2210/ (172B)
15:18:00 [2021-03-10T20:18:00.103Z] 20:18:00 [INFO] Adding repository https://download.eclipse.org/cbi/updates/license/2.0.2.v20181016-2210
15:18:00 [2021-03-10T20:18:00.103Z] 20:18:00 [INFO] Fetching p2.index from https://download.eclipse.org/technology/swtbot/snapshots/ (172B)
15:18:00 [2021-03-10T20:18:00.360Z] 20:18:00 [INFO] Adding repository https://download.eclipse.org/technology/swtbot/snapshots
15:18:00 [2021-03-10T20:18:00.360Z] 20:18:00 [INFO] Fetching p2.index from https://download.eclipse.org/tools/orbit/downloads/drops/S20210223232630/repository/ (134B)
15:18:00 [2021-03-10T20:18:00.360Z] 20:18:00 [INFO] Adding repository https://download.eclipse.org/tools/orbit/downloads/drops/S20210223232630/repository
15:18:00 [2021-03-10T20:18:00.360Z] 20:18:00 [INFO] Fetching p2.index from https://download.eclipse.org/tools/orbit/downloads/drops2/S20210223232630/repository/ (172B)
15:18:00 [2021-03-10T20:18:00.615Z] 20:18:00 [INFO] Fetching p2.index from https://download.eclipse.org/releases/oxygen/ (122B)
15:18:00 [2021-03-10T20:18:00.871Z] 20:18:00 [INFO] Adding repository https://download.eclipse.org/releases/oxygen
15:18:00 [2021-03-10T20:18:00.871Z] 20:18:00 [INFO] Fetching p2.index from http://download.eclipse.org/technology/epp/packages/oxygen/ (142B)
15:18:01 [2021-03-10T20:18:01.128Z] 20:18:00 [INFO] Fetching p2.index from https://download.eclipse.org/releases/oxygen/201804111000/ (142B)
15:18:02 [2021-03-10T20:18:02.055Z] 20:18:01 [INFO] Fetching p2.index from https://download.eclipse.org/releases/oxygen/201803211000/ (142B)
15:18:03 [2021-03-10T20:18:03.424Z] Mar 10, 2021 8:18:03 PM org.apache.http.impl.execchain.RetryExec execute
15:18:03 [2021-03-10T20:18:03.424Z] INFO: I/O exception (org.apache.http.NoHttpResponseException) caught when processing request to {s}->https://download.eclipse.org:443: The target server failed to respond
15:18:03 [2021-03-10T20:18:03.424Z] Mar 10, 2021 8:18:03 PM org.apache.http.impl.execchain.RetryExec execute
15:18:03 [2021-03-10T20:18:03.424Z] INFO: Retrying request to {s}->https://download.eclipse.org:443
15:18:03 [2021-03-10T20:18:03.424Z] 20:18:03 [INFO] Fetching p2.index from https://download.eclipse.org/releases/oxygen/201712201001/ (142B)
15:18:04 [2021-03-10T20:18:04.788Z] 20:18:04 [INFO] Fetching p2.index from https://repo.eclipse.org/content/unzip/releases.unzip/org/eclipse/egit/org.eclipse.egit.repository/5.11.0.202103091610-r/org.eclipse.egit.repository-5.11.0.202103091610-r.zip-unzip/ (172B)
15:18:04 [2021-03-10T20:18:04.788Z] 20:18:04 [INFO] Adding repository https://repo.eclipse.org/content/unzip/releases.unzip/org/eclipse/egit/org.eclipse.egit.repository/5.11.0.202103091610-r/org.eclipse.egit.repository-5.11.0.202103091610-r.zip-unzip
15:18:04 [2021-03-10T20:18:04.788Z] 20:18:04 [INFO] Fetching p2.index from http://download.eclipse.org/cbi/updates/license/ (134B)
15:18:04 [2021-03-10T20:18:04.788Z] 20:18:04 [INFO] Adding repository http://download.eclipse.org/cbi/updates/license
15:18:04 [2021-03-10T20:18:04.788Z] 20:18:04 [INFO] Fetching p2.index from http://download.eclipse.org/cbi/updates/license/2.0.2.v20181016-2210/ (172B)
15:18:04 [2021-03-10T20:18:04.788Z] 20:18:04 [INFO] Resolving dependencies of MavenProject: org.eclipse.mylyn.github:org.eclipse.egit.github.core:5.11.0.202103091610-r @ /home/jenkins/agent/workspace/egit-github/repo/org.eclipse.egit.github.core/pom.xml
15:18:07 [2021-03-10T20:18:07.311Z] 20:18:06 [WARNING] The following locally built units have been used to resolve project dependencies:
15:18:07 [2021-03-10T20:18:07.311Z] 20:18:06 [WARNING]   org.eclipse.egit.github.core/5.11.0.202103091610-r
15:18:07 [2021-03-10T20:18:07.311Z] 20:18:06 [INFO] Resolving class path of MavenProject: org.eclipse.mylyn.github:org.eclipse.egit.github.core:5.11.0.202103091610-r @ /home/jenkins/agent/workspace/egit-github/repo/org.eclipse.egit.github.core/pom.xml
15:18:07 [2021-03-10T20:18:07.311Z] 20:18:06 [INFO] Computing target platform for MavenProject: org.eclipse.mylyn.github:org.eclipse.mylyn.github.core:5.11.0.202103091610-r @ /home/jenkins/agent/workspace/egit-github/repo/org.eclipse.mylyn.github.core/pom.xml
15:18:07 [2021-03-10T20:18:07.311Z] 20:18:06 [INFO] Resolving dependencies of MavenProject: org.eclipse.mylyn.github:org.eclipse.mylyn.github.core:5.11.0.202103091610-r @ /home/jenkins/agent/workspace/egit-github/repo/org.eclipse.mylyn.github.core/pom.xml
15:18:07 [2021-03-10T20:18:07.311Z] 20:18:07 [WARNING] The following locally built units have been used to resolve project dependencies:
15:18:07 [2021-03-10T20:18:07.311Z] 20:18:07 [WARNING]   org.eclipse.mylyn.github.core/5.11.0.202103091610-r
15:18:07 [2021-03-10T20:18:07.311Z] 20:18:07 [WARNING]   org.eclipse.egit.github.core/5.11.0.202103091610-r
15:18:07 [2021-03-10T20:18:07.311Z] 20:18:07 [INFO] Resolving class path of MavenProject: org.eclipse.mylyn.github:org.eclipse.mylyn.github.core:5.11.0.202103091610-r @ /home/jenkins/agent/workspace/egit-github/repo/org.eclipse.mylyn.github.core/pom.xml
15:18:07 [2021-03-10T20:18:07.311Z] 20:18:07 [INFO] Computing target platform for MavenProject: org.eclipse.mylyn.github:org.eclipse.mylyn.github.ui:5.11.0.202103091610-r @ /home/jenkins/agent/workspace/egit-github/repo/org.eclipse.mylyn.github.ui/pom.xml
15:18:07 [2021-03-10T20:18:07.311Z] 20:18:07 [INFO] Resolving dependencies of MavenProject: org.eclipse.mylyn.github:org.eclipse.mylyn.github.ui:5.11.0.202103091610-r @ /home/jenkins/agent/workspace/egit-github/repo/org.eclipse.mylyn.github.ui/pom.xml
15:18:07 [2021-03-10T20:18:07.566Z] 20:18:07 [WARNING] The following locally built units have been used to resolve project dependencies:
15:18:07 [2021-03-10T20:18:07.566Z] 20:18:07 [WARNING]   org.eclipse.mylyn.github.ui/5.11.0.202103091610-r
15:18:07 [2021-03-10T20:18:07.566Z] 20:18:07 [WARNING]   org.eclipse.mylyn.github.core/5.11.0.202103091610-r
15:18:07 [2021-03-10T20:18:07.566Z] 20:18:07 [WARNING]   org.eclipse.egit.github.core/5.11.0.202103091610-r
15:18:07 [2021-03-10T20:18:07.566Z] 20:18:07 [INFO] Resolving class path of MavenProject: org.eclipse.mylyn.github:org.eclipse.mylyn.github.ui:5.11.0.202103091610-r @ /home/jenkins/agent/workspace/egit-github/repo/org.eclipse.mylyn.github.ui/pom.xml
15:18:07 [2021-03-10T20:18:07.566Z] 20:18:07 [INFO] Computing target platform for MavenProject: org.eclipse.mylyn.github:org.eclipse.mylyn.github.feature:5.11.0.202103091610-r @ /home/jenkins/agent/workspace/egit-github/repo/org.eclipse.mylyn.github-feature/pom.xml
15:18:07 [2021-03-10T20:18:07.822Z] 20:18:07 [INFO] Resolving dependencies of MavenProject: org.eclipse.mylyn.github:org.eclipse.mylyn.github.feature:5.11.0.202103091610-r @ /home/jenkins/agent/workspace/egit-github/repo/org.eclipse.mylyn.github-feature/pom.xml
15:18:08 [2021-03-10T20:18:08.077Z] 20:18:07 [WARNING] The following locally built units have been used to resolve project dependencies:
15:18:08 [2021-03-10T20:18:08.077Z] 20:18:07 [WARNING]   org.eclipse.mylyn.github.ui/5.11.0.202103091610-r
15:18:08 [2021-03-10T20:18:08.077Z] 20:18:07 [WARNING]   org.eclipse.mylyn.github.core/5.11.0.202103091610-r
15:18:08 [2021-03-10T20:18:08.077Z] 20:18:07 [WARNING]   org.eclipse.mylyn.github.feature.feature.group/5.11.0.202103091610-r
15:18:08 [2021-03-10T20:18:08.077Z] 20:18:07 [WARNING]   org.eclipse.mylyn.github.doc/5.11.0.202103091610-r
15:18:08 [2021-03-10T20:18:08.077Z] 20:18:07 [WARNING]   org.eclipse.egit.github.core/5.11.0.202103091610-r
15:18:08 [2021-03-10T20:18:08.077Z] 20:18:07 [INFO] Resolving class path of MavenProject: org.eclipse.mylyn.github:org.eclipse.mylyn.github.feature:5.11.0.202103091610-r @ /home/jenkins/agent/workspace/egit-github/repo/org.eclipse.mylyn.github-feature/pom.xml
15:18:08 [2021-03-10T20:18:08.077Z] 20:18:08 [INFO] Computing target platform for MavenProject: org.eclipse.mylyn.github:org.eclipse.egit.github.core.tests:5.11.0.202103091610-r @ /home/jenkins/agent/workspace/egit-github/repo/org.eclipse.egit.github.core.tests/pom.xml
15:18:08 [2021-03-10T20:18:08.077Z] 20:18:08 [INFO] Resolving dependencies of MavenProject: org.eclipse.mylyn.github:org.eclipse.egit.github.core.tests:5.11.0.202103091610-r @ /home/jenkins/agent/workspace/egit-github/repo/org.eclipse.egit.github.core.tests/pom.xml
15:18:08 [2021-03-10T20:18:08.333Z] 20:18:08 [WARNING] The following locally built units have been used to resolve project dependencies:
15:18:08 [2021-03-10T20:18:08.333Z] 20:18:08 [WARNING]   org.eclipse.egit.github.core.tests/5.11.0.202103091610-r
15:18:08 [2021-03-10T20:18:08.333Z] 20:18:08 [WARNING]   org.eclipse.egit.github.core/5.11.0.202103091610-r
15:18:08 [2021-03-10T20:18:08.333Z] 20:18:08 [INFO] Resolving class path of MavenProject: org.eclipse.mylyn.github:org.eclipse.egit.github.core.tests:5.11.0.202103091610-r @ /home/jenkins/agent/workspace/egit-github/repo/org.eclipse.egit.github.core.tests/pom.xml
15:18:08 [2021-03-10T20:18:08.333Z] 20:18:08 [INFO] Computing target platform for MavenProject: org.eclipse.mylyn.github:org.eclipse.mylyn.github.tests:5.11.0.202103091610-r @ /home/jenkins/agent/workspace/egit-github/repo/org.eclipse.mylyn.github.tests/pom.xml
15:18:08 [2021-03-10T20:18:08.333Z] 20:18:08 [INFO] Resolving dependencies of MavenProject: org.eclipse.mylyn.github:org.eclipse.mylyn.github.tests:5.11.0.202103091610-r @ /home/jenkins/agent/workspace/egit-github/repo/org.eclipse.mylyn.github.tests/pom.xml
15:18:08 [2021-03-10T20:18:08.589Z] 20:18:08 [WARNING] The following locally built units have been used to resolve project dependencies:
15:18:08 [2021-03-10T20:18:08.589Z] 20:18:08 [WARNING]   org.eclipse.mylyn.github.ui/5.11.0.202103091610-r
15:18:08 [2021-03-10T20:18:08.589Z] 20:18:08 [WARNING]   org.eclipse.mylyn.github.tests/5.11.0.202103091610-r
15:18:08 [2021-03-10T20:18:08.589Z] 20:18:08 [WARNING]   org.eclipse.mylyn.github.core/5.11.0.202103091610-r
15:18:08 [2021-03-10T20:18:08.589Z] 20:18:08 [WARNING]   org.eclipse.mylyn.github.feature.feature.group/5.11.0.202103091610-r
15:18:08 [2021-03-10T20:18:08.589Z] 20:18:08 [WARNING]   org.eclipse.mylyn.github.doc/5.11.0.202103091610-r
15:18:08 [2021-03-10T20:18:08.589Z] 20:18:08 [WARNING]   org.eclipse.egit.github.core/5.11.0.202103091610-r
15:18:08 [2021-03-10T20:18:08.589Z] 20:18:08 [INFO] Resolving class path of MavenProject: org.eclipse.mylyn.github:org.eclipse.mylyn.github.tests:5.11.0.202103091610-r @ /home/jenkins/agent/workspace/egit-github/repo/org.eclipse.mylyn.github.tests/pom.xml
15:18:08 [2021-03-10T20:18:08.589Z] 20:18:08 [INFO] Computing target platform for MavenProject: org.eclipse.mylyn.github:github-updatesite:5.11.0.202103091610-r @ /home/jenkins/agent/workspace/egit-github/repo/org.eclipse.mylyn.github-site/pom.xml
15:18:08 [2021-03-10T20:18:08.589Z] 20:18:08 [INFO] Resolving dependencies of MavenProject: org.eclipse.mylyn.github:github-updatesite:5.11.0.202103091610-r @ /home/jenkins/agent/workspace/egit-github/repo/org.eclipse.mylyn.github-site/pom.xml
15:18:08 [2021-03-10T20:18:08.844Z] 20:18:08 [WARNING] The following locally built units have been used to resolve project dependencies:
15:18:08 [2021-03-10T20:18:08.844Z] 20:18:08 [WARNING]   org.eclipse.mylyn.github.ui/5.11.0.202103091610-r
15:18:08 [2021-03-10T20:18:08.844Z] 20:18:08 [WARNING]   org.eclipse.mylyn.github.core/5.11.0.202103091610-r
15:18:08 [2021-03-10T20:18:08.844Z] 20:18:08 [WARNING]   org.eclipse.mylyn.github.feature.feature.group/5.11.0.202103091610-r
15:18:08 [2021-03-10T20:18:08.844Z] 20:18:08 [WARNING]   org.eclipse.mylyn.github.doc/5.11.0.202103091610-r
15:18:08 [2021-03-10T20:18:08.844Z] 20:18:08 [WARNING]   org.eclipse.egit.github.core/5.11.0.202103091610-r
15:18:08 [2021-03-10T20:18:08.844Z] 20:18:08 [INFO] Resolving class path of MavenProject: org.eclipse.mylyn.github:github-updatesite:5.11.0.202103091610-r @ /home/jenkins/agent/workspace/egit-github/repo/org.eclipse.mylyn.github-site/pom.xml
15:18:08 [2021-03-10T20:18:08.844Z] 20:18:08 [INFO] Computing target platform for MavenProject: org.eclipse.mylyn.github:org.eclipse.mylyn.github.doc:5.11.0.202103091610-r @ /home/jenkins/agent/workspace/egit-github/repo/org.eclipse.mylyn.github.doc/pom.xml
15:18:08 [2021-03-10T20:18:08.844Z] 20:18:08 [INFO] Resolving dependencies of MavenProject: org.eclipse.mylyn.github:org.eclipse.mylyn.github.doc:5.11.0.202103091610-r @ /home/jenkins/agent/workspace/egit-github/repo/org.eclipse.mylyn.github.doc/pom.xml
15:18:08 [2021-03-10T20:18:08.844Z] 20:18:08 [WARNING] The following locally built units have been used to resolve project dependencies:
15:18:08 [2021-03-10T20:18:08.844Z] 20:18:08 [WARNING]   org.eclipse.mylyn.github.doc/5.11.0.202103091610-r
15:18:08 [2021-03-10T20:18:08.844Z] 20:18:08 [INFO] Resolving class path of MavenProject: org.eclipse.mylyn.github:org.eclipse.mylyn.github.doc:5.11.0.202103091610-r @ /home/jenkins/agent/workspace/egit-github/repo/org.eclipse.mylyn.github.doc/pom.xml
15:18:08 [2021-03-10T20:18:08.844Z] 20:18:08 [INFO] ------------------------------------------------------------------------
15:18:08 [2021-03-10T20:18:08.844Z] 20:18:08 [INFO] Reactor Build Order:
15:18:08 [2021-03-10T20:18:08.844Z] 20:18:08 [INFO] 
15:18:08 [2021-03-10T20:18:08.844Z] 20:18:08 [INFO] Eclipse EGit Mylyn GitHub Connector Parent                         [pom]
15:18:08 [2021-03-10T20:18:08.844Z] 20:18:08 [INFO] EGit GitHub Target Platform Definition                             [pom]
15:18:08 [2021-03-10T20:18:08.844Z] 20:18:08 [INFO] Eclipse EGit GitHub API Core                            [eclipse-plugin]
15:18:08 [2021-03-10T20:18:08.844Z] 20:18:08 [INFO] Eclipse EGit Mylyn GitHub Core                          [eclipse-plugin]
15:18:08 [2021-03-10T20:18:08.844Z] 20:18:08 [INFO] Eclipse EGit Mylyn GitHub UI                            [eclipse-plugin]
15:18:08 [2021-03-10T20:18:08.845Z] 20:18:08 [INFO] Eclipse EGit Mylyn GitHub Documentation                 [eclipse-plugin]
15:18:08 [2021-03-10T20:18:08.845Z] 20:18:08 [INFO] Eclipse EGit Mylyn GitHub Feature                      [eclipse-feature]
15:18:08 [2021-03-10T20:18:08.845Z] 20:18:08 [INFO] Eclipse EGit GitHub API Test Plug-in               [eclipse-test-plugin]
15:18:08 [2021-03-10T20:18:08.845Z] 20:18:08 [INFO] Eclipse EGit Mylyn GitHub Test Plug-in             [eclipse-test-plugin]
15:18:08 [2021-03-10T20:18:08.845Z] 20:18:08 [INFO] Eclipse EGit Mylyn GitHub Repository                [eclipse-repository]
15:18:08 [2021-03-10T20:18:08.845Z] 20:18:08 [INFO] 
15:18:08 [2021-03-10T20:18:08.845Z] 20:18:08 [INFO] ---------------< org.eclipse.mylyn.github:github-parent >---------------
15:18:08 [2021-03-10T20:18:08.845Z] 20:18:08 [INFO] Building Eclipse EGit Mylyn GitHub Connector Parent 5.11.0.202103091610-r [1/10]
15:18:08 [2021-03-10T20:18:08.845Z] 20:18:08 [INFO] --------------------------------[ pom ]---------------------------------
15:18:10 [2021-03-10T20:18:10.733Z] 20:18:10 [INFO] 
15:18:10 [2021-03-10T20:18:10.733Z] 20:18:10 [INFO] --- maven-enforcer-plugin:3.0.0-M2:enforce (enforce-maven) @ github-parent ---
15:18:10 [2021-03-10T20:18:10.733Z] 20:18:10 [INFO] 
15:18:10 [2021-03-10T20:18:10.733Z] 20:18:10 [INFO] >>> spotbugs-maven-plugin:3.1.11:check (default) > :spotbugs @ github-parent >>>
15:18:10 [2021-03-10T20:18:10.733Z] 20:18:10 [INFO] 
15:18:10 [2021-03-10T20:18:10.733Z] 20:18:10 [INFO] --- spotbugs-maven-plugin:3.1.11:spotbugs (spotbugs) @ github-parent ---
15:18:11 [2021-03-10T20:18:11.293Z] 20:18:11 [INFO] 
15:18:11 [2021-03-10T20:18:11.293Z] 20:18:11 [INFO] <<< spotbugs-maven-plugin:3.1.11:check (default) < :spotbugs @ github-parent <<<
15:18:11 [2021-03-10T20:18:11.293Z] 20:18:11 [INFO] 
15:18:11 [2021-03-10T20:18:11.293Z] 20:18:11 [INFO] 
15:18:11 [2021-03-10T20:18:11.293Z] 20:18:11 [INFO] --- spotbugs-maven-plugin:3.1.11:check (default) @ github-parent ---
15:18:11 [2021-03-10T20:18:11.293Z] 20:18:11 [INFO] 
15:18:11 [2021-03-10T20:18:11.293Z] 20:18:11 [INFO] >>> maven-pmd-plugin:3.11.0:cpd-check (default) > :cpd @ github-parent >>>
15:18:11 [2021-03-10T20:18:11.293Z] 20:18:11 [INFO] 
15:18:11 [2021-03-10T20:18:11.293Z] 20:18:11 [INFO] --- maven-pmd-plugin:3.11.0:cpd (cpd) @ github-parent ---
15:18:11 [2021-03-10T20:18:11.293Z] 20:18:11 [INFO] 
15:18:11 [2021-03-10T20:18:11.293Z] 20:18:11 [INFO] <<< maven-pmd-plugin:3.11.0:cpd-check (default) < :cpd @ github-parent <<<
15:18:11 [2021-03-10T20:18:11.293Z] 20:18:11 [INFO] 
15:18:11 [2021-03-10T20:18:11.293Z] 20:18:11 [INFO] 
15:18:11 [2021-03-10T20:18:11.293Z] 20:18:11 [INFO] --- maven-pmd-plugin:3.11.0:cpd-check (default) @ github-parent ---
15:18:11 [2021-03-10T20:18:11.293Z] 20:18:11 [INFO] 
15:18:11 [2021-03-10T20:18:11.293Z] 20:18:11 [INFO] --- tycho-pack200a-plugin:1.7.0:normalize (pack200-normalize) @ github-parent ---
15:18:11 [2021-03-10T20:18:11.293Z] 20:18:11 [INFO] 
15:18:11 [2021-03-10T20:18:11.293Z] 20:18:11 [INFO] --- eclipse-jarsigner-plugin:1.1.5:sign (sign) @ github-parent ---
15:18:11 [2021-03-10T20:18:11.563Z] 20:18:11 [INFO] 
15:18:11 [2021-03-10T20:18:11.563Z] 20:18:11 [INFO] --- tycho-pack200b-plugin:1.7.0:pack (pack200-pack) @ github-parent ---
15:18:11 [2021-03-10T20:18:11.563Z] 20:18:11 [INFO] 
15:18:11 [2021-03-10T20:18:11.563Z] 20:18:11 [INFO] --- tycho-p2-plugin:1.7.0:p2-metadata (p2-metadata) @ github-parent ---
15:18:11 [2021-03-10T20:18:11.563Z] 20:18:11 [INFO] 
15:18:11 [2021-03-10T20:18:11.563Z] 20:18:11 [INFO] --- maven-install-plugin:2.4:install (default-install) @ github-parent ---
15:18:11 [2021-03-10T20:18:11.563Z] 20:18:11 [INFO] Installing /home/jenkins/agent/workspace/egit-github/repo/pom.xml to /home/jenkins/agent/workspace/egit-github/.repository/org/eclipse/mylyn/github/github-parent/5.11.0.202103091610-r/github-parent-5.11.0.202103091610-r.pom
15:18:11 [2021-03-10T20:18:11.563Z] 20:18:11 [INFO] 
15:18:11 [2021-03-10T20:18:11.563Z] 20:18:11 [INFO] --- maven-deploy-plugin:2.7:deploy (default-deploy) @ github-parent ---
15:18:11 [2021-03-10T20:18:11.563Z] 20:18:11 [INFO] ------------------------------------------------------------------------
15:18:11 [2021-03-10T20:18:11.563Z] 20:18:11 [INFO] Reactor Summary for Eclipse EGit Mylyn GitHub Connector Parent 5.11.0.202103091610-r:
15:18:11 [2021-03-10T20:18:11.563Z] 20:18:11 [INFO] 
15:18:11 [2021-03-10T20:18:11.563Z] 20:18:11 [INFO] Eclipse EGit Mylyn GitHub Connector Parent ......... FAILURE [  2.692 s]
15:18:11 [2021-03-10T20:18:11.563Z] 20:18:11 [INFO] EGit GitHub Target Platform Definition ............. SKIPPED
15:18:11 [2021-03-10T20:18:11.563Z] 20:18:11 [INFO] Eclipse EGit GitHub API Core ....................... SKIPPED
15:18:11 [2021-03-10T20:18:11.563Z] 20:18:11 [INFO] Eclipse EGit Mylyn GitHub Core ..................... SKIPPED
15:18:11 [2021-03-10T20:18:11.563Z] 20:18:11 [INFO] Eclipse EGit Mylyn GitHub UI ....................... SKIPPED
15:18:11 [2021-03-10T20:18:11.563Z] 20:18:11 [INFO] Eclipse EGit Mylyn GitHub Documentation ............ SKIPPED
15:18:11 [2021-03-10T20:18:11.563Z] 20:18:11 [INFO] Eclipse EGit Mylyn GitHub Feature .................. SKIPPED
15:18:11 [2021-03-10T20:18:11.563Z] 20:18:11 [INFO] Eclipse EGit GitHub API Test Plug-in ............... SKIPPED
15:18:11 [2021-03-10T20:18:11.563Z] 20:18:11 [INFO] Eclipse EGit Mylyn GitHub Test Plug-in ............. SKIPPED
15:18:11 [2021-03-10T20:18:11.563Z] 20:18:11 [INFO] Eclipse EGit Mylyn GitHub Repository ............... SKIPPED
15:18:11 [2021-03-10T20:18:11.563Z] 20:18:11 [INFO] ------------------------------------------------------------------------
15:18:11 [2021-03-10T20:18:11.563Z] 20:18:11 [INFO] BUILD FAILURE
15:18:11 [2021-03-10T20:18:11.563Z] 20:18:11 [INFO] ------------------------------------------------------------------------
15:18:11 [2021-03-10T20:18:11.563Z] 20:18:11 [INFO] Total time:  13.908 s
15:18:11 [2021-03-10T20:18:11.563Z] 20:18:11 [INFO] Finished at: 2021-03-10T20:18:11Z
15:18:11 [2021-03-10T20:18:11.563Z] 20:18:11 [INFO] ------------------------------------------------------------------------
15:18:11 [2021-03-10T20:18:11.563Z] 20:18:11 [ERROR] Failed to execute goal org.apache.maven.plugins:maven-deploy-plugin:2.7:deploy (default-deploy) on project github-parent: Failed to deploy artifacts: Could not transfer artifact org.eclipse.mylyn.github:github-parent:pom:5.11.0.202103091610-r from/to repo.eclipse.org (https://repo.eclipse.org/content/repositories/egit-releases/): Transfer failed for https://repo.eclipse.org/content/repositories/egit-releases/org/eclipse/mylyn/github/github-parent/5.11.0.202103091610-r/github-parent-5.11.0.202103091610-r.pom 400 Bad Request -> [Help 1]
15:18:11 [2021-03-10T20:18:11.563Z] org.apache.maven.lifecycle.LifecycleExecutionException: Failed to execute goal org.apache.maven.plugins:maven-deploy-plugin:2.7:deploy (default-deploy) on project github-parent: Failed to deploy artifacts: Could not transfer artifact org.eclipse.mylyn.github:github-parent:pom:5.11.0.202103091610-r from/to repo.eclipse.org (https://repo.eclipse.org/content/repositories/egit-releases/): Transfer failed for https://repo.eclipse.org/content/repositories/egit-releases/org/eclipse/mylyn/github/github-parent/5.11.0.202103091610-r/github-parent-5.11.0.202103091610-r.pom 400 Bad Request
15:18:11 [2021-03-10T20:18:11.563Z]     at org.apache.maven.lifecycle.internal.MojoExecutor.execute (MojoExecutor.java:215)
15:18:11 [2021-03-10T20:18:11.563Z]     at org.apache.maven.lifecycle.internal.MojoExecutor.execute (MojoExecutor.java:156)
15:18:11 [2021-03-10T20:18:11.563Z]     at org.apache.maven.lifecycle.internal.MojoExecutor.execute (MojoExecutor.java:148)
15:18:11 [2021-03-10T20:18:11.563Z]     at org.apache.maven.lifecycle.internal.LifecycleModuleBuilder.buildProject (LifecycleModuleBuilder.java:117)
15:18:11 [2021-03-10T20:18:11.563Z]     at org.apache.maven.lifecycle.internal.LifecycleModuleBuilder.buildProject (LifecycleModuleBuilder.java:81)
15:18:11 [2021-03-10T20:18:11.563Z]     at org.apache.maven.lifecycle.internal.builder.singlethreaded.SingleThreadedBuilder.build (SingleThreadedBuilder.java:56)
15:18:11 [2021-03-10T20:18:11.563Z]     at org.apache.maven.lifecycle.internal.LifecycleStarter.execute (LifecycleStarter.java:128)
15:18:11 [2021-03-10T20:18:11.563Z]     at org.apache.maven.DefaultMaven.doExecute (DefaultMaven.java:305)
15:18:11 [2021-03-10T20:18:11.563Z]     at org.apache.maven.DefaultMaven.doExecute (DefaultMaven.java:192)
15:18:11 [2021-03-10T20:18:11.563Z]     at org.apache.maven.DefaultMaven.execute (DefaultMaven.java:105)
15:18:11 [2021-03-10T20:18:11.563Z]     at org.apache.maven.cli.MavenCli.execute (MavenCli.java:957)
15:18:11 [2021-03-10T20:18:11.563Z]     at org.apache.maven.cli.MavenCli.doMain (MavenCli.java:289)
15:18:11 [2021-03-10T20:18:11.563Z]     at org.apache.maven.cli.MavenCli.main (MavenCli.java:193)
15:18:11 [2021-03-10T20:18:11.563Z]     at sun.reflect.NativeMethodAccessorImpl.invoke0 (Native Method)
15:18:11 [2021-03-10T20:18:11.563Z]     at sun.reflect.NativeMethodAccessorImpl.invoke (NativeMethodAccessorImpl.java:62)
15:18:11 [2021-03-10T20:18:11.563Z]     at sun.reflect.DelegatingMethodAccessorImpl.invoke (DelegatingMethodAccessorImpl.java:43)
15:18:11 [2021-03-10T20:18:11.563Z]     at java.lang.reflect.Method.invoke (Method.java:498)
15:18:11 [2021-03-10T20:18:11.563Z]     at org.codehaus.plexus.classworlds.launcher.Launcher.launchEnhanced (Launcher.java:282)
15:18:11 [2021-03-10T20:18:11.563Z]     at org.codehaus.plexus.classworlds.launcher.Launcher.launch (Launcher.java:225)
15:18:11 [2021-03-10T20:18:11.563Z]     at org.codehaus.plexus.classworlds.launcher.Launcher.mainWithExitCode (Launcher.java:406)
15:18:11 [2021-03-10T20:18:11.563Z]     at org.codehaus.plexus.classworlds.launcher.Launcher.main (Launcher.java:347)
15:18:11 [2021-03-10T20:18:11.563Z] Caused by: org.apache.maven.plugin.MojoExecutionException: Failed to deploy artifacts: Could not transfer artifact org.eclipse.mylyn.github:github-parent:pom:5.11.0.202103091610-r from/to repo.eclipse.org (https://repo.eclipse.org/content/repositories/egit-releases/): Transfer failed for https://repo.eclipse.org/content/repositories/egit-releases/org/eclipse/mylyn/github/github-parent/5.11.0.202103091610-r/github-parent-5.11.0.202103091610-r.pom 400 Bad Request
15:18:11 [2021-03-10T20:18:11.563Z]     at org.apache.maven.plugin.deploy.DeployMojo.execute (DeployMojo.java:193)
15:18:11 [2021-03-10T20:18:11.563Z]     at org.apache.maven.plugin.DefaultBuildPluginManager.executeMojo (DefaultBuildPluginManager.java:137)
15:18:11 [2021-03-10T20:18:11.563Z]     at org.apache.maven.lifecycle.internal.MojoExecutor.execute (MojoExecutor.java:210)
15:18:11 [2021-03-10T20:18:11.563Z]     at org.apache.maven.lifecycle.internal.MojoExecutor.execute (MojoExecutor.java:156)
15:18:11 [2021-03-10T20:18:11.563Z]     at org.apache.maven.lifecycle.internal.MojoExecutor.execute (MojoExecutor.java:148)
15:18:11 [2021-03-10T20:18:11.563Z]     at org.apache.maven.lifecycle.internal.LifecycleModuleBuilder.buildProject (LifecycleModuleBuilder.java:117)
15:18:11 [2021-03-10T20:18:11.563Z]     at org.apache.maven.lifecycle.internal.LifecycleModuleBuilder.buildProject (LifecycleModuleBuilder.java:81)
15:18:11 [2021-03-10T20:18:11.563Z]     at org.apache.maven.lifecycle.internal.builder.singlethreaded.SingleThreadedBuilder.build (SingleThreadedBuilder.java:56)
15:18:11 [2021-03-10T20:18:11.563Z]     at org.apache.maven.lifecycle.internal.LifecycleStarter.execute (LifecycleStarter.java:128)
15:18:11 [2021-03-10T20:18:11.563Z]     at org.apache.maven.DefaultMaven.doExecute (DefaultMaven.java:305)
15:18:11 [2021-03-10T20:18:11.563Z]     at org.apache.maven.DefaultMaven.doExecute (DefaultMaven.java:192)
15:18:11 [2021-03-10T20:18:11.563Z]     at org.apache.maven.DefaultMaven.execute (DefaultMaven.java:105)
15:18:11 [2021-03-10T20:18:11.563Z]     at org.apache.maven.cli.MavenCli.execute (MavenCli.java:957)
15:18:11 [2021-03-10T20:18:11.563Z]     at org.apache.maven.cli.MavenCli.doMain (MavenCli.java:289)
15:18:11 [2021-03-10T20:18:11.563Z]     at org.apache.maven.cli.MavenCli.main (MavenCli.java:193)
15:18:11 [2021-03-10T20:18:11.563Z]     at sun.reflect.NativeMethodAccessorImpl.invoke0 (Native Method)
15:18:11 [2021-03-10T20:18:11.563Z]     at sun.reflect.NativeMethodAccessorImpl.invoke (NativeMethodAccessorImpl.java:62)
15:18:11 [2021-03-10T20:18:11.563Z]     at sun.reflect.DelegatingMethodAccessorImpl.invoke (DelegatingMethodAccessorImpl.java:43)
15:18:11 [2021-03-10T20:18:11.563Z]     at java.lang.reflect.Method.invoke (Method.java:498)
15:18:11 [2021-03-10T20:18:11.563Z]     at org.codehaus.plexus.classworlds.launcher.Launcher.launchEnhanced (Launcher.java:282)
15:18:11 [2021-03-10T20:18:11.563Z]     at org.codehaus.plexus.classworlds.launcher.Launcher.launch (Launcher.java:225)
15:18:11 [2021-03-10T20:18:11.563Z]     at org.codehaus.plexus.classworlds.launcher.Launcher.mainWithExitCode (Launcher.java:406)
15:18:11 [2021-03-10T20:18:11.563Z]     at org.codehaus.plexus.classworlds.launcher.Launcher.main (Launcher.java:347)
15:18:11 [2021-03-10T20:18:11.563Z] Caused by: org.apache.maven.artifact.deployer.ArtifactDeploymentException: Failed to deploy artifacts: Could not transfer artifact org.eclipse.mylyn.github:github-parent:pom:5.11.0.202103091610-r from/to repo.eclipse.org (https://repo.eclipse.org/content/repositories/egit-releases/): Transfer failed for https://repo.eclipse.org/content/repositories/egit-releases/org/eclipse/mylyn/github/github-parent/5.11.0.202103091610-r/github-parent-5.11.0.202103091610-r.pom 400 Bad Request
15:18:11 [2021-03-10T20:18:11.563Z]     at org.apache.maven.artifact.deployer.DefaultArtifactDeployer.deploy (DefaultArtifactDeployer.java:146)
15:18:11 [2021-03-10T20:18:11.563Z]     at org.apache.maven.plugin.deploy.AbstractDeployMojo.deploy (AbstractDeployMojo.java:167)
15:18:11 [2021-03-10T20:18:11.563Z]     at org.apache.maven.plugin.deploy.DeployMojo.execute (DeployMojo.java:149)
15:18:11 [2021-03-10T20:18:11.563Z]     at org.apache.maven.plugin.DefaultBuildPluginManager.executeMojo (DefaultBuildPluginManager.java:137)
15:18:11 [2021-03-10T20:18:11.563Z]     at org.apache.maven.lifecycle.internal.MojoExecutor.execute (MojoExecutor.java:210)
15:18:11 [2021-03-10T20:18:11.564Z]     at org.apache.maven.lifecycle.internal.MojoExecutor.execute (MojoExecutor.java:156)
15:18:11 [2021-03-10T20:18:11.564Z]     at org.apache.maven.lifecycle.internal.MojoExecutor.execute (MojoExecutor.java:148)
15:18:11 [2021-03-10T20:18:11.564Z]     at org.apache.maven.lifecycle.internal.LifecycleModuleBuilder.buildProject (LifecycleModuleBuilder.java:117)
15:18:11 [2021-03-10T20:18:11.564Z]     at org.apache.maven.lifecycle.internal.LifecycleModuleBuilder.buildProject (LifecycleModuleBuilder.java:81)
15:18:11 [2021-03-10T20:18:11.564Z]     at org.apache.maven.lifecycle.internal.builder.singlethreaded.SingleThreadedBuilder.build (SingleThreadedBuilder.java:56)
15:18:11 [2021-03-10T20:18:11.564Z]     at org.apache.maven.lifecycle.internal.LifecycleStarter.execute (LifecycleStarter.java:128)
15:18:11 [2021-03-10T20:18:11.564Z]     at org.apache.maven.DefaultMaven.doExecute (DefaultMaven.java:305)
15:18:11 [2021-03-10T20:18:11.564Z]     at org.apache.maven.DefaultMaven.doExecute (DefaultMaven.java:192)
15:18:11 [2021-03-10T20:18:11.564Z]     at org.apache.maven.DefaultMaven.execute (DefaultMaven.java:105)
15:18:11 [2021-03-10T20:18:11.564Z]     at org.apache.maven.cli.MavenCli.execute (MavenCli.java:957)
15:18:11 [2021-03-10T20:18:11.564Z]     at org.apache.maven.cli.MavenCli.doMain (MavenCli.java:289)
15:18:11 [2021-03-10T20:18:11.564Z]     at org.apache.maven.cli.MavenCli.main (MavenCli.java:193)
15:18:11 [2021-03-10T20:18:11.564Z]     at sun.reflect.NativeMethodAccessorImpl.invoke0 (Native Method)
15:18:11 [2021-03-10T20:18:11.564Z]     at sun.reflect.NativeMethodAccessorImpl.invoke (NativeMethodAccessorImpl.java:62)
15:18:11 [2021-03-10T20:18:11.564Z]     at sun.reflect.DelegatingMethodAccessorImpl.invoke (DelegatingMethodAccessorImpl.java:43)
15:18:11 [2021-03-10T20:18:11.564Z]     at java.lang.reflect.Method.invoke (Method.java:498)
15:18:11 [2021-03-10T20:18:11.564Z]     at org.codehaus.plexus.classworlds.launcher.Launcher.launchEnhanced (Launcher.java:282)
15:18:11 [2021-03-10T20:18:11.564Z]     at org.codehaus.plexus.classworlds.launcher.Launcher.launch (Launcher.java:225)
15:18:11 [2021-03-10T20:18:11.564Z]     at org.codehaus.plexus.classworlds.launcher.Launcher.mainWithExitCode (Launcher.java:406)
15:18:11 [2021-03-10T20:18:11.564Z]     at org.codehaus.plexus.classworlds.launcher.Launcher.main (Launcher.java:347)
15:18:11 [2021-03-10T20:18:11.564Z] Caused by: org.eclipse.aether.deployment.DeploymentException: Failed to deploy artifacts: Could not transfer artifact org.eclipse.mylyn.github:github-parent:pom:5.11.0.202103091610-r from/to repo.eclipse.org (https://repo.eclipse.org/content/repositories/egit-releases/): Transfer failed for https://repo.eclipse.org/content/repositories/egit-releases/org/eclipse/mylyn/github/github-parent/5.11.0.202103091610-r/github-parent-5.11.0.202103091610-r.pom 400 Bad Request
15:18:11 [2021-03-10T20:18:11.564Z]     at org.eclipse.aether.internal.impl.DefaultDeployer.deploy (DefaultDeployer.java:301)
15:18:11 [2021-03-10T20:18:11.564Z]     at org.eclipse.aether.internal.impl.DefaultDeployer.deploy (DefaultDeployer.java:213)
15:18:11 [2021-03-10T20:18:11.564Z]     at org.eclipse.aether.internal.impl.DefaultRepositorySystem.deploy (DefaultRepositorySystem.java:386)
15:18:11 [2021-03-10T20:18:11.564Z]     at org.apache.maven.artifact.deployer.DefaultArtifactDeployer.deploy (DefaultArtifactDeployer.java:142)
15:18:11 [2021-03-10T20:18:11.564Z]     at org.apache.maven.plugin.deploy.AbstractDeployMojo.deploy (AbstractDeployMojo.java:167)
15:18:11 [2021-03-10T20:18:11.564Z]     at org.apache.maven.plugin.deploy.DeployMojo.execute (DeployMojo.java:149)
15:18:11 [2021-03-10T20:18:11.564Z]     at org.apache.maven.plugin.DefaultBuildPluginManager.executeMojo (DefaultBuildPluginManager.java:137)
15:18:11 [2021-03-10T20:18:11.564Z]     at org.apache.maven.lifecycle.internal.MojoExecutor.execute (MojoExecutor.java:210)
15:18:11 [2021-03-10T20:18:11.564Z]     at org.apache.maven.lifecycle.internal.MojoExecutor.execute (MojoExecutor.java:156)
15:18:11 [2021-03-10T20:18:11.564Z]     at org.apache.maven.lifecycle.internal.MojoExecutor.execute (MojoExecutor.java:148)
15:18:11 [2021-03-10T20:18:11.564Z]     at org.apache.maven.lifecycle.internal.LifecycleModuleBuilder.buildProject (LifecycleModuleBuilder.java:117)
15:18:11 [2021-03-10T20:18:11.564Z]     at org.apache.maven.lifecycle.internal.LifecycleModuleBuilder.buildProject (LifecycleModuleBuilder.java:81)
15:18:11 [2021-03-10T20:18:11.564Z]     at org.apache.maven.lifecycle.internal.builder.singlethreaded.SingleThreadedBuilder.build (SingleThreadedBuilder.java:56)
15:18:11 [2021-03-10T20:18:11.564Z]     at org.apache.maven.lifecycle.internal.LifecycleStarter.execute (LifecycleStarter.java:128)
15:18:11 [2021-03-10T20:18:11.564Z]     at org.apache.maven.DefaultMaven.doExecute (DefaultMaven.java:305)
15:18:11 [2021-03-10T20:18:11.564Z]     at org.apache.maven.DefaultMaven.doExecute (DefaultMaven.java:192)
15:18:11 [2021-03-10T20:18:11.564Z]     at org.apache.maven.DefaultMaven.execute (DefaultMaven.java:105)
15:18:11 [2021-03-10T20:18:11.564Z]     at org.apache.maven.cli.MavenCli.execute (MavenCli.java:957)
15:18:11 [2021-03-10T20:18:11.564Z]     at org.apache.maven.cli.MavenCli.doMain (MavenCli.java:289)
15:18:11 [2021-03-10T20:18:11.564Z]     at org.apache.maven.cli.MavenCli.main (MavenCli.java:193)
15:18:11 [2021-03-10T20:18:11.564Z]     at sun.reflect.NativeMethodAccessorImpl.invoke0 (Native Method)
15:18:11 [2021-03-10T20:18:11.564Z]     at sun.reflect.NativeMethodAccessorImpl.invoke (NativeMethodAccessorImpl.java:62)
15:18:11 [2021-03-10T20:18:11.564Z]     at sun.reflect.DelegatingMethodAccessorImpl.invoke (DelegatingMethodAccessorImpl.java:43)
15:18:11 [2021-03-10T20:18:11.564Z]     at java.lang.reflect.Method.invoke (Method.java:498)
15:18:11 [2021-03-10T20:18:11.564Z]     at org.codehaus.plexus.classworlds.launcher.Launcher.launchEnhanced (Launcher.java:282)
15:18:11 [2021-03-10T20:18:11.564Z]     at org.codehaus.plexus.classworlds.launcher.Launcher.launch (Launcher.java:225)
15:18:11 [2021-03-10T20:18:11.564Z]     at org.codehaus.plexus.classworlds.launcher.Launcher.mainWithExitCode (Launcher.java:406)
15:18:11 [2021-03-10T20:18:11.564Z]     at org.codehaus.plexus.classworlds.launcher.Launcher.main (Launcher.java:347)
15:18:11 [2021-03-10T20:18:11.564Z] Caused by: org.eclipse.aether.transfer.ArtifactTransferException: Could not transfer artifact org.eclipse.mylyn.github:github-parent:pom:5.11.0.202103091610-r from/to repo.eclipse.org (https://repo.eclipse.org/content/repositories/egit-releases/): Transfer failed for https://repo.eclipse.org/content/repositories/egit-releases/org/eclipse/mylyn/github/github-parent/5.11.0.202103091610-r/github-parent-5.11.0.202103091610-r.pom 400 Bad Request
15:18:11 [2021-03-10T20:18:11.564Z]     at org.eclipse.aether.connector.basic.ArtifactTransportListener.transferFailed (ArtifactTransportListener.java:52)
15:18:11 [2021-03-10T20:18:11.564Z]     at org.eclipse.aether.connector.basic.BasicRepositoryConnector$TaskRunner.run (BasicRepositoryConnector.java:369)
15:18:11 [2021-03-10T20:18:11.564Z]     at org.eclipse.aether.connector.basic.BasicRepositoryConnector.put (BasicRepositoryConnector.java:288)
15:18:11 [2021-03-10T20:18:11.564Z]     at org.eclipse.aether.internal.impl.DefaultDeployer.deploy (DefaultDeployer.java:295)
15:18:11 [2021-03-10T20:18:11.564Z]     at org.eclipse.aether.internal.impl.DefaultDeployer.deploy (DefaultDeployer.java:213)
15:18:11 [2021-03-10T20:18:11.564Z]     at org.eclipse.aether.internal.impl.DefaultRepositorySystem.deploy (DefaultRepositorySystem.java:386)
15:18:11 [2021-03-10T20:18:11.564Z]     at org.apache.maven.artifact.deployer.DefaultArtifactDeployer.deploy (DefaultArtifactDeployer.java:142)
15:18:11 [2021-03-10T20:18:11.564Z]     at org.apache.maven.plugin.deploy.AbstractDeployMojo.deploy (AbstractDeployMojo.java:167)
15:18:11 [2021-03-10T20:18:11.564Z]     at org.apache.maven.plugin.deploy.DeployMojo.execute (DeployMojo.java:149)
15:18:11 [2021-03-10T20:18:11.564Z]     at org.apache.maven.plugin.DefaultBuildPluginManager.executeMojo (DefaultBuildPluginManager.java:137)
15:18:11 [2021-03-10T20:18:11.564Z]     at org.apache.maven.lifecycle.internal.MojoExecutor.execute (MojoExecutor.java:210)
15:18:11 [2021-03-10T20:18:11.564Z]     at org.apache.maven.lifecycle.internal.MojoExecutor.execute (MojoExecutor.java:156)
15:18:11 [2021-03-10T20:18:11.564Z]     at org.apache.maven.lifecycle.internal.MojoExecutor.execute (MojoExecutor.java:148)
15:18:11 [2021-03-10T20:18:11.564Z]     at org.apache.maven.lifecycle.internal.LifecycleModuleBuilder.buildProject (LifecycleModuleBuilder.java:117)
15:18:11 [2021-03-10T20:18:11.564Z]     at org.apache.maven.lifecycle.internal.LifecycleModuleBuilder.buildProject (LifecycleModuleBuilder.java:81)
15:18:11 [2021-03-10T20:18:11.564Z]     at org.apache.maven.lifecycle.internal.builder.singlethreaded.SingleThreadedBuilder.build (SingleThreadedBuilder.java:56)
15:18:11 [2021-03-10T20:18:11.564Z]     at org.apache.maven.lifecycle.internal.LifecycleStarter.execute (LifecycleStarter.java:128)
15:18:11 [2021-03-10T20:18:11.564Z]     at org.apache.maven.DefaultMaven.doExecute (DefaultMaven.java:305)
15:18:11 [2021-03-10T20:18:11.564Z]     at org.apache.maven.DefaultMaven.doExecute (DefaultMaven.java:192)
15:18:11 [2021-03-10T20:18:11.564Z]     at org.apache.maven.DefaultMaven.execute (DefaultMaven.java:105)
15:18:11 [2021-03-10T20:18:11.564Z]     at org.apache.maven.cli.MavenCli.execute (MavenCli.java:957)
15:18:11 [2021-03-10T20:18:11.564Z]     at org.apache.maven.cli.MavenCli.doMain (MavenCli.java:289)
15:18:11 [2021-03-10T20:18:11.564Z]     at org.apache.maven.cli.MavenCli.main (MavenCli.java:193)
15:18:11 [2021-03-10T20:18:11.564Z]     at sun.reflect.NativeMethodAccessorImpl.invoke0 (Native Method)
15:18:11 [2021-03-10T20:18:11.564Z]     at sun.reflect.NativeMethodAccessorImpl.invoke (NativeMethodAccessorImpl.java:62)
15:18:11 [2021-03-10T20:18:11.564Z]     at sun.reflect.DelegatingMethodAccessorImpl.invoke (DelegatingMethodAccessorImpl.java:43)
15:18:11 [2021-03-10T20:18:11.564Z]     at java.lang.reflect.Method.invoke (Method.java:498)
15:18:11 [2021-03-10T20:18:11.564Z]     at org.codehaus.plexus.classworlds.launcher.Launcher.launchEnhanced (Launcher.java:282)
15:18:11 [2021-03-10T20:18:11.564Z]     at org.codehaus.plexus.classworlds.launcher.Launcher.launch (Launcher.java:225)
15:18:11 [2021-03-10T20:18:11.564Z]     at org.codehaus.plexus.classworlds.launcher.Launcher.mainWithExitCode (Launcher.java:406)
15:18:11 [2021-03-10T20:18:11.564Z]     at org.codehaus.plexus.classworlds.launcher.Launcher.main (Launcher.java:347)
15:18:11 [2021-03-10T20:18:11.564Z] Caused by: org.apache.maven.wagon.TransferFailedException: Transfer failed for https://repo.eclipse.org/content/repositories/egit-releases/org/eclipse/mylyn/github/github-parent/5.11.0.202103091610-r/github-parent-5.11.0.202103091610-r.pom 400 Bad Request
15:18:11 [2021-03-10T20:18:11.564Z]     at org.apache.maven.wagon.providers.http.wagon.shared.AbstractHttpClientWagon.put (AbstractHttpClientWagon.java:820)
15:18:11 [2021-03-10T20:18:11.564Z]     at org.apache.maven.wagon.providers.http.wagon.shared.AbstractHttpClientWagon.put (AbstractHttpClientWagon.java:737)
15:18:11 [2021-03-10T20:18:11.564Z]     at org.apache.maven.wagon.providers.http.wagon.shared.AbstractHttpClientWagon.put (AbstractHttpClientWagon.java:709)
15:18:11 [2021-03-10T20:18:11.564Z]     at org.apache.maven.wagon.providers.http.wagon.shared.AbstractHttpClientWagon.put (AbstractHttpClientWagon.java:703)
15:18:11 [2021-03-10T20:18:11.564Z]     at org.apache.maven.wagon.providers.http.wagon.shared.AbstractHttpClientWagon.put (AbstractHttpClientWagon.java:683)
15:18:11 [2021-03-10T20:18:11.564Z]     at org.eclipse.aether.transport.wagon.WagonTransporter$PutTaskRunner.run (WagonTransporter.java:686)
15:18:11 [2021-03-10T20:18:11.564Z]     at org.eclipse.aether.transport.wagon.WagonTransporter.execute (WagonTransporter.java:435)
15:18:11 [2021-03-10T20:18:11.564Z]     at org.eclipse.aether.transport.wagon.WagonTransporter.put (WagonTransporter.java:418)
15:18:11 [2021-03-10T20:18:11.564Z]     at org.eclipse.aether.connector.basic.BasicRepositoryConnector$PutTaskRunner.runTask (BasicRepositoryConnector.java:556)
15:18:11 [2021-03-10T20:18:11.564Z]     at org.eclipse.aether.connector.basic.BasicRepositoryConnector$TaskRunner.run (BasicRepositoryConnector.java:364)
15:18:11 [2021-03-10T20:18:11.564Z]     at org.eclipse.aether.connector.basic.BasicRepositoryConnector.put (BasicRepositoryConnector.java:288)
15:18:11 [2021-03-10T20:18:11.564Z]     at org.eclipse.aether.internal.impl.DefaultDeployer.deploy (DefaultDeployer.java:295)
15:18:11 [2021-03-10T20:18:11.564Z]     at org.eclipse.aether.internal.impl.DefaultDeployer.deploy (DefaultDeployer.java:213)
15:18:11 [2021-03-10T20:18:11.564Z]     at org.eclipse.aether.internal.impl.DefaultRepositorySystem.deploy (DefaultRepositorySystem.java:386)
15:18:11 [2021-03-10T20:18:11.564Z]     at org.apache.maven.artifact.deployer.DefaultArtifactDeployer.deploy (DefaultArtifactDeployer.java:142)
15:18:11 [2021-03-10T20:18:11.564Z]     at org.apache.maven.plugin.deploy.AbstractDeployMojo.deploy (AbstractDeployMojo.java:167)
15:18:11 [2021-03-10T20:18:11.564Z]     at org.apache.maven.plugin.deploy.DeployMojo.execute (DeployMojo.java:149)
15:18:11 [2021-03-10T20:18:11.564Z]     at org.apache.maven.plugin.DefaultBuildPluginManager.executeMojo (DefaultBuildPluginManager.java:137)
15:18:11 [2021-03-10T20:18:11.564Z]     at org.apache.maven.lifecycle.internal.MojoExecutor.execute (MojoExecutor.java:210)
15:18:11 [2021-03-10T20:18:11.564Z]     at org.apache.maven.lifecycle.internal.MojoExecutor.execute (MojoExecutor.java:156)
15:18:11 [2021-03-10T20:18:11.564Z]     at org.apache.maven.lifecycle.internal.MojoExecutor.execute (MojoExecutor.java:148)
15:18:11 [2021-03-10T20:18:11.564Z]     at org.apache.maven.lifecycle.internal.LifecycleModuleBuilder.buildProject (LifecycleModuleBuilder.java:117)
15:18:11 [2021-03-10T20:18:11.564Z]     at org.apache.maven.lifecycle.internal.LifecycleModuleBuilder.buildProject (LifecycleModuleBuilder.java:81)
15:18:11 [2021-03-10T20:18:11.564Z]     at org.apache.maven.lifecycle.internal.builder.singlethreaded.SingleThreadedBuilder.build (SingleThreadedBuilder.java:56)
15:18:11 [2021-03-10T20:18:11.564Z]     at org.apache.maven.lifecycle.internal.LifecycleStarter.execute (LifecycleStarter.java:128)
15:18:11 [2021-03-10T20:18:11.564Z]     at org.apache.maven.DefaultMaven.doExecute (DefaultMaven.java:305)
15:18:11 [2021-03-10T20:18:11.564Z]     at org.apache.maven.DefaultMaven.doExecute (DefaultMaven.java:192)
15:18:11 [2021-03-10T20:18:11.564Z]     at org.apache.maven.DefaultMaven.execute (DefaultMaven.java:105)
15:18:11 [2021-03-10T20:18:11.564Z]     at org.apache.maven.cli.MavenCli.execute (MavenCli.java:957)
15:18:11 [2021-03-10T20:18:11.564Z]     at org.apache.maven.cli.MavenCli.doMain (MavenCli.java:289)
15:18:11 [2021-03-10T20:18:11.564Z]     at org.apache.maven.cli.MavenCli.main (MavenCli.java:193)
15:18:11 [2021-03-10T20:18:11.564Z]     at sun.reflect.NativeMethodAccessorImpl.invoke0 (Native Method)
15:18:11 [2021-03-10T20:18:11.564Z]     at sun.reflect.NativeMethodAccessorImpl.invoke (NativeMethodAccessorImpl.java:62)
15:18:11 [2021-03-10T20:18:11.564Z]     at sun.reflect.DelegatingMethodAccessorImpl.invoke (DelegatingMethodAccessorImpl.java:43)
15:18:11 [2021-03-10T20:18:11.564Z]     at java.lang.reflect.Method.invoke (Method.java:498)
15:18:11 [2021-03-10T20:18:11.564Z]     at org.codehaus.plexus.classworlds.launcher.Launcher.launchEnhanced (Launcher.java:282)
15:18:11 [2021-03-10T20:18:11.564Z]     at org.codehaus.plexus.classworlds.launcher.Launcher.launch (Launcher.java:225)
15:18:11 [2021-03-10T20:18:11.564Z]     at org.codehaus.plexus.classworlds.launcher.Launcher.mainWithExitCode (Launcher.java:406)
15:18:11 [2021-03-10T20:18:11.564Z]     at org.codehaus.plexus.classworlds.launcher.Launcher.main (Launcher.java:347)
15:18:11 [2021-03-10T20:18:11.564Z] 20:18:11 [ERROR] 
15:18:11 [2021-03-10T20:18:11.564Z] 20:18:11 [ERROR] Re-run Maven using the -X switch to enable full debug logging.
15:18:11 [2021-03-10T20:18:11.564Z] 20:18:11 [ERROR] 
15:18:11 [2021-03-10T20:18:11.564Z] 20:18:11 [ERROR] For more information about the errors and possible solutions, please read the following articles:
15:18:11 [2021-03-10T20:18:11.564Z] 20:18:11 [ERROR] [Help 1] http://cwiki.apache.org/confluence/display/MAVEN/MojoExecutionException
[Pipeline] }
[Pipeline] // stage
[Pipeline] stage
[Pipeline] { (Results)
[Pipeline] junit
15:18:12 [2021-03-10T20:18:12.153Z] Recording test results
15:18:12 [2021-03-10T20:18:12.577Z] [Checks API] No suitable checks publisher found.
[Pipeline] archiveArtifacts
15:18:12 [2021-03-10T20:18:12.585Z] Archiving artifacts
[Pipeline] findbugs
15:18:12 [2021-03-10T20:18:12.860Z] [FINDBUGS] Collecting findbugs analysis files...
15:18:15 [2021-03-10T20:18:15.285Z] [FINDBUGS] Searching for all files in /home/jenkins/agent/workspace/egit-github/repo that match the pattern */target/*bugsXml.xml
15:18:15 [2021-03-10T20:18:15.285Z] [FINDBUGS] Parsing 5 files in /home/jenkins/agent/workspace/egit-github/repo
15:18:15 [2021-03-10T20:18:15.285Z] [FINDBUGS] Successfully parsed file /home/jenkins/agent/workspace/egit-github/repo/org.eclipse.egit.github.core.tests/target/spotbugsXml.xml with 3 unique warnings and 0 duplicates.
15:18:15 [2021-03-10T20:18:15.285Z] [FINDBUGS] Successfully parsed file /home/jenkins/agent/workspace/egit-github/repo/org.eclipse.egit.github.core/target/spotbugsXml.xml with 13 unique warnings and 0 duplicates.
15:18:15 [2021-03-10T20:18:15.285Z] [FINDBUGS] Successfully parsed file /home/jenkins/agent/workspace/egit-github/repo/org.eclipse.mylyn.github.core/target/spotbugsXml.xml with 16 unique warnings and 0 duplicates.
15:18:15 [2021-03-10T20:18:15.285Z] [FINDBUGS] Successfully parsed file /home/jenkins/agent/workspace/egit-github/repo/org.eclipse.mylyn.github.tests/target/spotbugsXml.xml with 16 unique warnings and 0 duplicates.
15:18:15 [2021-03-10T20:18:15.285Z] [FINDBUGS] Successfully parsed file /home/jenkins/agent/workspace/egit-github/repo/org.eclipse.mylyn.github.ui/target/spotbugsXml.xml with 19 unique warnings and 0 duplicates.
15:18:15 [2021-03-10T20:18:15.285Z] Skipping warnings blame since pipelines do not have an SCM link.%n
15:18:15 [2021-03-10T20:18:15.302Z] [FINDBUGS] Computing warning deltas based on reference build #511
[Pipeline] dry
15:18:15 [2021-03-10T20:18:15.347Z] [DRY] Collecting duplicate code analysis files...
15:18:15 [2021-03-10T20:18:15.508Z] [DRY] Searching for all files in /home/jenkins/agent/workspace/egit-github/repo that match the pattern **/cpd.xml
15:18:15 [2021-03-10T20:18:15.508Z] [DRY] Parsing 8 files in /home/jenkins/agent/workspace/egit-github/repo
15:18:15 [2021-03-10T20:18:15.508Z] [DRY] Successfully parsed file /home/jenkins/agent/workspace/egit-github/repo/org.eclipse.egit.github.core.tests/target/cpd.xml with 6 unique warnings and 0 duplicates.
15:18:15 [2021-03-10T20:18:15.508Z] [DRY] Successfully parsed file /home/jenkins/agent/workspace/egit-github/repo/org.eclipse.egit.github.core/target/cpd.xml with 13 unique warnings and 0 duplicates.
15:18:15 [2021-03-10T20:18:15.508Z] [DRY] Successfully parsed file /home/jenkins/agent/workspace/egit-github/repo/org.eclipse.mylyn.github-feature/target/cpd.xml with 13 unique warnings and 0 duplicates.
15:18:15 [2021-03-10T20:18:15.508Z] [DRY] Successfully parsed file /home/jenkins/agent/workspace/egit-github/repo/org.eclipse.mylyn.github-site/target/cpd.xml with 13 unique warnings and 0 duplicates.
15:18:15 [2021-03-10T20:18:15.508Z] [DRY] Successfully parsed file /home/jenkins/agent/workspace/egit-github/repo/org.eclipse.mylyn.github.core/target/cpd.xml with 13 unique warnings and 0 duplicates.
15:18:15 [2021-03-10T20:18:15.508Z] [DRY] Successfully parsed file /home/jenkins/agent/workspace/egit-github/repo/org.eclipse.mylyn.github.doc/target/cpd.xml with 13 unique warnings and 0 duplicates.
15:18:15 [2021-03-10T20:18:15.508Z] [DRY] Successfully parsed file /home/jenkins/agent/workspace/egit-github/repo/org.eclipse.mylyn.github.tests/target/cpd.xml with 13 unique warnings and 0 duplicates.
15:18:15 [2021-03-10T20:18:15.508Z] [DRY] Successfully parsed file /home/jenkins/agent/workspace/egit-github/repo/org.eclipse.mylyn.github.ui/target/cpd.xml with 17 unique warnings and 0 duplicates.
15:18:15 [2021-03-10T20:18:15.508Z] Skipping warnings blame since pipelines do not have an SCM link.%n
15:18:15 [2021-03-10T20:18:15.528Z] [DRY] Computing warning deltas based on reference build #511
[Pipeline] }
[Pipeline] // stage
[Pipeline] step
[Pipeline] }
[Pipeline] // dir
[Pipeline] }
15:18:15 [2021-03-10T20:18:15.576Z] Terminating xvnc.
[Pipeline] // xvnc
[Pipeline] }
[Pipeline] // timeout
[Pipeline] }
[Pipeline] // node
[Pipeline] }
[Pipeline] // timestamps
[Pipeline] End of Pipeline
ERROR: script returned exit code 1
Finished: FAILURE