SuccessConsole Output

Skipping 261 KB.. Full Log
.eclipse.egit.github.core.tests.MemberPayloadTest)  Time elapsed: 0 s
19:47:44 [2021-02-06T00:47:44.062Z] defaultState(org.eclipse.egit.github.core.tests.MemberPayloadTest)  Time elapsed: 0.001 s
19:47:44 [2021-02-06T00:47:44.062Z] updateFields(org.eclipse.egit.github.core.tests.PullRequestPayloadTest)  Time elapsed: 0 s
19:47:44 [2021-02-06T00:47:44.062Z] defaultState(org.eclipse.egit.github.core.tests.PullRequestPayloadTest)  Time elapsed: 0 s
19:47:44 [2021-02-06T00:47:44.062Z] updateFields(org.eclipse.egit.github.core.tests.PullRequestReviewCommentPayloadTest)  Time elapsed: 0.014 s
19:47:44 [2021-02-06T00:47:44.062Z] defaultState(org.eclipse.egit.github.core.tests.PullRequestReviewCommentPayloadTest)  Time elapsed: 0 s
19:47:44 [2021-02-06T00:47:44.062Z] updateFields(org.eclipse.egit.github.core.tests.PushPayloadTest)  Time elapsed: 0.001 s
19:47:44 [2021-02-06T00:47:44.062Z] defaultState(org.eclipse.egit.github.core.tests.PushPayloadTest)  Time elapsed: 0 s
19:47:44 [2021-02-06T00:47:44.062Z] updateFields(org.eclipse.egit.github.core.tests.TeamAddPayloadTest)  Time elapsed: 0 s
19:47:44 [2021-02-06T00:47:44.062Z] defaultState(org.eclipse.egit.github.core.tests.TeamAddPayloadTest)  Time elapsed: 0 s
19:47:44 [2021-02-06T00:47:44.062Z] updateFields(org.eclipse.egit.github.core.tests.WatchPayloadTest)  Time elapsed: 0 s
19:47:44 [2021-02-06T00:47:44.062Z] defaultState(org.eclipse.egit.github.core.tests.WatchPayloadTest)  Time elapsed: 0 s
19:47:44 [2021-02-06T00:47:44.062Z] updateFields(org.eclipse.egit.github.core.tests.EventRepositoryTest)  Time elapsed: 0 s
19:47:44 [2021-02-06T00:47:44.062Z] defaultState(org.eclipse.egit.github.core.tests.EventRepositoryTest)  Time elapsed: 0 s
19:47:44 [2021-02-06T00:47:44.062Z] pageUserEvents(org.eclipse.egit.github.core.tests.EventServiceTest)  Time elapsed: 0.001 s
19:47:44 [2021-02-06T00:47:44.062Z] pagePublicEvents(org.eclipse.egit.github.core.tests.EventServiceTest)  Time elapsed: 0 s
19:47:44 [2021-02-06T00:47:44.062Z] constructorNullArgument(org.eclipse.egit.github.core.tests.EventServiceTest)  Time elapsed: 0 s
19:47:44 [2021-02-06T00:47:44.062Z] defaultConstructor(org.eclipse.egit.github.core.tests.EventServiceTest)  Time elapsed: 0 s
19:47:44 [2021-02-06T00:47:44.062Z] pageNetworkEvents(org.eclipse.egit.github.core.tests.EventServiceTest)  Time elapsed: 0 s
19:47:44 [2021-02-06T00:47:44.062Z] pageUserOrgEvents(org.eclipse.egit.github.core.tests.EventServiceTest)  Time elapsed: 0 s
19:47:44 [2021-02-06T00:47:44.062Z] pagePublicUserEvents(org.eclipse.egit.github.core.tests.EventServiceTest)  Time elapsed: 0 s
19:47:44 [2021-02-06T00:47:44.062Z] pageUserReceivedEvents(org.eclipse.egit.github.core.tests.EventServiceTest)  Time elapsed: 0 s
19:47:44 [2021-02-06T00:47:44.062Z] pageOrgEvents(org.eclipse.egit.github.core.tests.EventServiceTest)  Time elapsed: 0.001 s
19:47:44 [2021-02-06T00:47:44.062Z] pagePublicUserReceivedEvents(org.eclipse.egit.github.core.tests.EventServiceTest)  Time elapsed: 0 s
19:47:44 [2021-02-06T00:47:44.062Z] pageRepsitoryEvents(org.eclipse.egit.github.core.tests.EventServiceTest)  Time elapsed: 0 s
19:47:44 [2021-02-06T00:47:44.062Z] updateFields(org.eclipse.egit.github.core.tests.EventTest)  Time elapsed: 0 s
19:47:44 [2021-02-06T00:47:44.062Z] defaultState(org.eclipse.egit.github.core.tests.EventTest)  Time elapsed: 0 s
19:47:44 [2021-02-06T00:47:44.062Z] getCreatedAtReferenceMutableObject(org.eclipse.egit.github.core.tests.EventTest)  Time elapsed: 0 s
19:47:44 [2021-02-06T00:47:44.062Z] updateFields(org.eclipse.egit.github.core.tests.FieldErrorTest)  Time elapsed: 0.001 s
19:47:44 [2021-02-06T00:47:44.062Z] defaultState(org.eclipse.egit.github.core.tests.FieldErrorTest)  Time elapsed: 0 s
19:47:44 [2021-02-06T00:47:44.062Z] updateFields(org.eclipse.egit.github.core.tests.FollowPayloadTest)  Time elapsed: 0 s
19:47:44 [2021-02-06T00:47:44.062Z] defaultState(org.eclipse.egit.github.core.tests.FollowPayloadTest)  Time elapsed: 0 s
19:47:44 [2021-02-06T00:47:44.062Z] updateFields(org.eclipse.egit.github.core.tests.ForkApplyPayloadTest)  Time elapsed: 0 s
19:47:44 [2021-02-06T00:47:44.062Z] defaultState(org.eclipse.egit.github.core.tests.ForkApplyPayloadTest)  Time elapsed: 0 s
19:47:44 [2021-02-06T00:47:44.062Z] updateFields(org.eclipse.egit.github.core.tests.ForkPayloadTest)  Time elapsed: 0 s
19:47:44 [2021-02-06T00:47:44.062Z] defaultState(org.eclipse.egit.github.core.tests.ForkPayloadTest)  Time elapsed: 0 s
19:47:44 [2021-02-06T00:47:44.062Z] updateFields(org.eclipse.egit.github.core.tests.GistChangeStatusTest)  Time elapsed: 0 s
19:47:44 [2021-02-06T00:47:44.062Z] defaultState(org.eclipse.egit.github.core.tests.GistChangeStatusTest)  Time elapsed: 0 s
19:47:44 [2021-02-06T00:47:44.062Z] updateFields(org.eclipse.egit.github.core.tests.GistFileTest)  Time elapsed: 0 s
19:47:44 [2021-02-06T00:47:44.062Z] defaultState(org.eclipse.egit.github.core.tests.GistFileTest)  Time elapsed: 0 s
19:47:44 [2021-02-06T00:47:44.062Z] updateFields(org.eclipse.egit.github.core.tests.GistPayloadTest)  Time elapsed: 0 s
19:47:44 [2021-02-06T00:47:44.062Z] defaultState(org.eclipse.egit.github.core.tests.GistPayloadTest)  Time elapsed: 0 s
19:47:44 [2021-02-06T00:47:44.062Z] updateFields(org.eclipse.egit.github.core.tests.GistRevisionTest)  Time elapsed: 0.001 s
19:47:44 [2021-02-06T00:47:44.062Z] defaultState(org.eclipse.egit.github.core.tests.GistRevisionTest)  Time elapsed: 0 s
19:47:44 [2021-02-06T00:47:44.062Z] getCreatedAReferenceMutableObject(org.eclipse.egit.github.core.tests.GistRevisionTest)  Time elapsed: 0 s
19:47:44 [2021-02-06T00:47:44.062Z] starGistNullId(org.eclipse.egit.github.core.tests.GistServiceTest)  Time elapsed: 0 s
19:47:44 [2021-02-06T00:47:44.062Z] pageUserGistsEmptyId(org.eclipse.egit.github.core.tests.GistServiceTest)  Time elapsed: 0 s
19:47:44 [2021-02-06T00:47:44.062Z] getGistsNullUser(org.eclipse.egit.github.core.tests.GistServiceTest)  Time elapsed: 0.001 s
19:47:44 [2021-02-06T00:47:44.062Z] getGistEmptyId(org.eclipse.egit.github.core.tests.GistServiceTest)  Time elapsed: 0 s
19:47:44 [2021-02-06T00:47:44.062Z] unstarGist(org.eclipse.egit.github.core.tests.GistServiceTest)  Time elapsed: 0 s
19:47:44 [2021-02-06T00:47:44.062Z] starGistEmptyId(org.eclipse.egit.github.core.tests.GistServiceTest)  Time elapsed: 0 s
19:47:44 [2021-02-06T00:47:44.062Z] updateGistOK(org.eclipse.egit.github.core.tests.GistServiceTest)  Time elapsed: 0 s
19:47:44 [2021-02-06T00:47:44.062Z] getStarredGists(org.eclipse.egit.github.core.tests.GistServiceTest)  Time elapsed: 0.001 s
19:47:44 [2021-02-06T00:47:44.062Z] editGistComment(org.eclipse.egit.github.core.tests.GistServiceTest)  Time elapsed: 0 s
19:47:44 [2021-02-06T00:47:44.062Z] createGistNullOwner(org.eclipse.egit.github.core.tests.GistServiceTest)  Time elapsed: 0 s
19:47:44 [2021-02-06T00:47:44.062Z] isStarredGistNullId(org.eclipse.egit.github.core.tests.GistServiceTest)  Time elapsed: 0 s
19:47:44 [2021-02-06T00:47:44.062Z] deleteGistEmptyId(org.eclipse.egit.github.core.tests.GistServiceTest)  Time elapsed: 0.001 s
19:47:44 [2021-02-06T00:47:44.062Z] forkGistNullId(org.eclipse.egit.github.core.tests.GistServiceTest)  Time elapsed: 0 s
19:47:44 [2021-02-06T00:47:44.062Z] constructorNullArgument(org.eclipse.egit.github.core.tests.GistServiceTest)  Time elapsed: 0 s
19:47:44 [2021-02-06T00:47:44.062Z] editGistCommentNullComment(org.eclipse.egit.github.core.tests.GistServiceTest)  Time elapsed: 0 s
19:47:44 [2021-02-06T00:47:44.062Z] deleteGistNullId(org.eclipse.egit.github.core.tests.GistServiceTest)  Time elapsed: 0.001 s
19:47:44 [2021-02-06T00:47:44.062Z] isStarredGist(org.eclipse.egit.github.core.tests.GistServiceTest)  Time elapsed: 0 s
19:47:44 [2021-02-06T00:47:44.062Z] updateGistNullId(org.eclipse.egit.github.core.tests.GistServiceTest)  Time elapsed: 0 s
19:47:44 [2021-02-06T00:47:44.062Z] getGist(org.eclipse.egit.github.core.tests.GistServiceTest)  Time elapsed: 0 s
19:47:44 [2021-02-06T00:47:44.062Z] isStarredGistEmptyId(org.eclipse.egit.github.core.tests.GistServiceTest)  Time elapsed: 0 s
19:47:44 [2021-02-06T00:47:44.062Z] pagePublicGists(org.eclipse.egit.github.core.tests.GistServiceTest)  Time elapsed: 0.001 s
19:47:44 [2021-02-06T00:47:44.062Z] pageStarredGists(org.eclipse.egit.github.core.tests.GistServiceTest)  Time elapsed: 0 s
19:47:44 [2021-02-06T00:47:44.062Z] pageUserGists(org.eclipse.egit.github.core.tests.GistServiceTest)  Time elapsed: 0 s
19:47:44 [2021-02-06T00:47:44.062Z] forkGist(org.eclipse.egit.github.core.tests.GistServiceTest)  Time elapsed: 0 s
19:47:44 [2021-02-06T00:47:44.062Z] createGistNullGist(org.eclipse.egit.github.core.tests.GistServiceTest)  Time elapsed: 0 s
19:47:44 [2021-02-06T00:47:44.062Z] createCommentNullGistId(org.eclipse.egit.github.core.tests.GistServiceTest)  Time elapsed: 0.001 s
19:47:44 [2021-02-06T00:47:44.062Z] getCommentsOK(org.eclipse.egit.github.core.tests.GistServiceTest)  Time elapsed: 0 s
19:47:44 [2021-02-06T00:47:44.062Z] getCommentsNullGistId(org.eclipse.egit.github.core.tests.GistServiceTest)  Time elapsed: 0 s
19:47:44 [2021-02-06T00:47:44.062Z] unstarGistNullId(org.eclipse.egit.github.core.tests.GistServiceTest)  Time elapsed: 0 s
19:47:44 [2021-02-06T00:47:44.062Z] pageUserGistsNullId(org.eclipse.egit.github.core.tests.GistServiceTest)  Time elapsed: 0 s
19:47:44 [2021-02-06T00:47:44.062Z] getGistNullId(org.eclipse.egit.github.core.tests.GistServiceTest)  Time elapsed: 0 s
19:47:44 [2021-02-06T00:47:44.062Z] defaultContructor(org.eclipse.egit.github.core.tests.GistServiceTest)  Time elapsed: 0 s
19:47:44 [2021-02-06T00:47:44.062Z] getGistComment(org.eclipse.egit.github.core.tests.GistServiceTest)  Time elapsed: 0 s
19:47:44 [2021-02-06T00:47:44.062Z] createCommentNullComment(org.eclipse.egit.github.core.tests.GistServiceTest)  Time elapsed: 0 s
19:47:44 [2021-02-06T00:47:44.062Z] getGistsOK(org.eclipse.egit.github.core.tests.GistServiceTest)  Time elapsed: 0.001 s
19:47:44 [2021-02-06T00:47:44.062Z] starGist(org.eclipse.egit.github.core.tests.GistServiceTest)  Time elapsed: 0 s
19:47:44 [2021-02-06T00:47:44.063Z] createCommentOK(org.eclipse.egit.github.core.tests.GistServiceTest)  Time elapsed: 0 s
19:47:44 [2021-02-06T00:47:44.063Z] forkGistEmptyId(org.eclipse.egit.github.core.tests.GistServiceTest)  Time elapsed: 0 s
19:47:44 [2021-02-06T00:47:44.063Z] deleteGistComment(org.eclipse.egit.github.core.tests.GistServiceTest)  Time elapsed: 0 s
19:47:44 [2021-02-06T00:47:44.063Z] deleteGist(org.eclipse.egit.github.core.tests.GistServiceTest)  Time elapsed: 0.001 s
19:47:44 [2021-02-06T00:47:44.063Z] updateGistNullGist(org.eclipse.egit.github.core.tests.GistServiceTest)  Time elapsed: 0 s
19:47:44 [2021-02-06T00:47:44.063Z] getGistsEmptyUser(org.eclipse.egit.github.core.tests.GistServiceTest)  Time elapsed: 0 s
19:47:44 [2021-02-06T00:47:44.063Z] unstarGistEmptyId(org.eclipse.egit.github.core.tests.GistServiceTest)  Time elapsed: 0 s
19:47:44 [2021-02-06T00:47:44.063Z] updateFields(org.eclipse.egit.github.core.tests.GistTest)  Time elapsed: 0 s
19:47:44 [2021-02-06T00:47:44.063Z] defaultState(org.eclipse.egit.github.core.tests.GistTest)  Time elapsed: 0 s
19:47:44 [2021-02-06T00:47:44.063Z] getCreatedAtReferenceMutableObject(org.eclipse.egit.github.core.tests.GistTest)  Time elapsed: 0 s
19:47:44 [2021-02-06T00:47:44.063Z] getUpdatedAtReferenceMutableObject(org.eclipse.egit.github.core.tests.GistTest)  Time elapsed: 0 s
19:47:44 [2021-02-06T00:47:44.063Z] prefixLocalhost(org.eclipse.egit.github.core.tests.GitHubClientTest)  Time elapsed: 0.001 s
19:47:44 [2021-02-06T00:47:44.063Z] prefixHostApiV3(org.eclipse.egit.github.core.tests.GitHubClientTest)  Time elapsed: 0 s
19:47:44 [2021-02-06T00:47:44.063Z] updateFields(org.eclipse.egit.github.core.tests.GollumPageTest)  Time elapsed: 0 s
19:47:44 [2021-02-06T00:47:44.063Z] defaultState(org.eclipse.egit.github.core.tests.GollumPageTest)  Time elapsed: 0 s
19:47:44 [2021-02-06T00:47:44.063Z] updateFields(org.eclipse.egit.github.core.tests.GollumPayloadTest)  Time elapsed: 0 s
19:47:44 [2021-02-06T00:47:44.063Z] defaultState(org.eclipse.egit.github.core.tests.GollumPayloadTest)  Time elapsed: 0 s
19:47:44 [2021-02-06T00:47:44.063Z] seriazlizeNulls(org.eclipse.egit.github.core.tests.GsonUtilsTest)  Time elapsed: 0.001 s
19:47:44 [2021-02-06T00:47:44.063Z] noSeriazlizeNulls(org.eclipse.egit.github.core.tests.GsonUtilsTest)  Time elapsed: 0 s
19:47:44 [2021-02-06T00:47:44.063Z] getGson(org.eclipse.egit.github.core.tests.GsonUtilsTest)  Time elapsed: 0 s
19:47:44 [2021-02-06T00:47:44.063Z] createGson(org.eclipse.egit.github.core.tests.GsonUtilsTest)  Time elapsed: 0.001 s
19:47:44 [2021-02-06T00:47:44.063Z] defaultState(org.eclipse.egit.github.core.tests.IdTest)  Time elapsed: 0 s
19:47:44 [2021-02-06T00:47:44.063Z] updateField(org.eclipse.egit.github.core.tests.IdTest)  Time elapsed: 0.001 s
19:47:44 [2021-02-06T00:47:44.063Z] updateFields(org.eclipse.egit.github.core.tests.IssueCommentPayloadTest)  Time elapsed: 0 s
19:47:44 [2021-02-06T00:47:44.063Z] defaultState(org.eclipse.egit.github.core.tests.IssueCommentPayloadTest)  Time elapsed: 0 s
19:47:44 [2021-02-06T00:47:44.063Z] nonMutableCreatedAt(org.eclipse.egit.github.core.tests.IssueEventTest)  Time elapsed: 0 s
19:47:44 [2021-02-06T00:47:44.063Z] updateFields(org.eclipse.egit.github.core.tests.IssueEventTest)  Time elapsed: 0.001 s
19:47:44 [2021-02-06T00:47:44.063Z] defaultState(org.eclipse.egit.github.core.tests.IssueEventTest)  Time elapsed: 0 s
19:47:44 [2021-02-06T00:47:44.063Z] getCommentsEmptyUser(org.eclipse.egit.github.core.tests.IssueServiceTest)  Time elapsed: 0 s
19:47:44 [2021-02-06T00:47:44.063Z] createCommentNullIssueId(org.eclipse.egit.github.core.tests.IssueServiceTest)  Time elapsed: 0.001 s
19:47:44 [2021-02-06T00:47:44.063Z] createIssueEmptyUser(org.eclipse.egit.github.core.tests.IssueServiceTest)  Time elapsed: 0 s
19:47:44 [2021-02-06T00:47:44.063Z] getIssueComment(org.eclipse.egit.github.core.tests.IssueServiceTest)  Time elapsed: 0 s
19:47:44 [2021-02-06T00:47:44.063Z] pageIssueEvents(org.eclipse.egit.github.core.tests.IssueServiceTest)  Time elapsed: 0.001 s
19:47:44 [2021-02-06T00:47:44.063Z] editIssueNullRepositoryName(org.eclipse.egit.github.core.tests.IssueServiceTest)  Time elapsed: 0 s
19:47:44 [2021-02-06T00:47:44.063Z] deleteCommentNullRepositoryName(org.eclipse.egit.github.core.tests.IssueServiceTest)  Time elapsed: 0 s
19:47:44 [2021-02-06T00:47:44.063Z] getIssueNullRepositoryId(org.eclipse.egit.github.core.tests.IssueServiceTest)  Time elapsed: 0 s
19:47:44 [2021-02-06T00:47:44.063Z] deleteCommentWithRepositoryId(org.eclipse.egit.github.core.tests.IssueServiceTest)  Time elapsed: 0.001 s
19:47:44 [2021-02-06T00:47:44.063Z] deleteCommentNullId(org.eclipse.egit.github.core.tests.IssueServiceTest)  Time elapsed: 0 s
19:47:44 [2021-02-06T00:47:44.063Z] editIssue(org.eclipse.egit.github.core.tests.IssueServiceTest)  Time elapsed: 0 s
19:47:44 [2021-02-06T00:47:44.063Z] createCommentEmptyRepositoryName(org.eclipse.egit.github.core.tests.IssueServiceTest)  Time elapsed: 0 s
19:47:44 [2021-02-06T00:47:44.063Z] getIssueWithRepositoryId(org.eclipse.egit.github.core.tests.IssueServiceTest)  Time elapsed: 0.001 s
19:47:44 [2021-02-06T00:47:44.063Z] createCommentNullRepositoryName(org.eclipse.egit.github.core.tests.IssueServiceTest)  Time elapsed: 0 s
19:47:44 [2021-02-06T00:47:44.063Z] getIssueNullUser(org.eclipse.egit.github.core.tests.IssueServiceTest)  Time elapsed: 0 s
19:47:44 [2021-02-06T00:47:44.063Z] editIssueEmptyRepositoryName(org.eclipse.egit.github.core.tests.IssueServiceTest)  Time elapsed: 0.001 s
19:47:44 [2021-02-06T00:47:44.063Z] createIssueNullRepositoryName(org.eclipse.egit.github.core.tests.IssueServiceTest)  Time elapsed: 0 s
19:47:44 [2021-02-06T00:47:44.063Z] getCommentsNullRepositoryName(org.eclipse.egit.github.core.tests.IssueServiceTest)  Time elapsed: 0 s
19:47:44 [2021-02-06T00:47:44.063Z] deleteCommentEmptyRepositoryName(org.eclipse.egit.github.core.tests.IssueServiceTest)  Time elapsed: 0 s
19:47:44 [2021-02-06T00:47:44.063Z] getCommentsEmptyRepositoryName(org.eclipse.egit.github.core.tests.IssueServiceTest)  Time elapsed: 0.001 s
19:47:44 [2021-02-06T00:47:44.063Z] getIssueEmptyUser(org.eclipse.egit.github.core.tests.IssueServiceTest)  Time elapsed: 0 s
19:47:44 [2021-02-06T00:47:44.063Z] createComment(org.eclipse.egit.github.core.tests.IssueServiceTest)  Time elapsed: 0 s
19:47:44 [2021-02-06T00:47:44.063Z] getCommentsNullRepositoryId(org.eclipse.egit.github.core.tests.IssueServiceTest)  Time elapsed: 0 s
19:47:44 [2021-02-06T00:47:44.063Z] getIssuesNullUser(org.eclipse.egit.github.core.tests.IssueServiceTest)  Time elapsed: 0.001 s
19:47:44 [2021-02-06T00:47:44.063Z] editIssueCommentNullComment(org.eclipse.egit.github.core.tests.IssueServiceTest)  Time elapsed: 0 s
19:47:44 [2021-02-06T00:47:44.063Z] getCommentsWithRepositoryId(org.eclipse.egit.github.core.tests.IssueServiceTest)  Time elapsed: 0 s
19:47:44 [2021-02-06T00:47:44.063Z] constructorNullArgument(org.eclipse.egit.github.core.tests.IssueServiceTest)  Time elapsed: 0.001 s
19:47:44 [2021-02-06T00:47:44.063Z] pageRepsitoryIssuesWithRepositoryId(org.eclipse.egit.github.core.tests.IssueServiceTest)  Time elapsed: 0 s
19:47:44 [2021-02-06T00:47:44.063Z] getCommentsNullId(org.eclipse.egit.github.core.tests.IssueServiceTest)  Time elapsed: 0 s
19:47:44 [2021-02-06T00:47:44.063Z] deleteCommentEmptyUser(org.eclipse.egit.github.core.tests.IssueServiceTest)  Time elapsed: 0 s
19:47:44 [2021-02-06T00:47:44.063Z] getCurrentUserIssues(org.eclipse.egit.github.core.tests.IssueServiceTest)  Time elapsed: 0 s
19:47:44 [2021-02-06T00:47:44.063Z] createIssueNullIssueWithRepositoryId(org.eclipse.egit.github.core.tests.IssueServiceTest)  Time elapsed: 0 s
19:47:44 [2021-02-06T00:47:44.063Z] editIssueEmptyUser(org.eclipse.egit.github.core.tests.IssueServiceTest)  Time elapsed: 0 s
19:47:44 [2021-02-06T00:47:44.063Z] getIssueNullRepositoryName(org.eclipse.egit.github.core.tests.IssueServiceTest)  Time elapsed: 0 s
19:47:44 [2021-02-06T00:47:44.063Z] defaultConstructor(org.eclipse.egit.github.core.tests.IssueServiceTest)  Time elapsed: 0 s
19:47:44 [2021-02-06T00:47:44.063Z] getIssuesEmptyRepositoryName(org.eclipse.egit.github.core.tests.IssueServiceTest)  Time elapsed: 0 s
19:47:44 [2021-02-06T00:47:44.063Z] getIssueEmptyId(org.eclipse.egit.github.core.tests.IssueServiceTest)  Time elapsed: 0 s
19:47:44 [2021-02-06T00:47:44.063Z] deleteCommentNullUser(org.eclipse.egit.github.core.tests.IssueServiceTest)  Time elapsed: 0 s
19:47:44 [2021-02-06T00:47:44.063Z] createCommentNullUser(org.eclipse.egit.github.core.tests.IssueServiceTest)  Time elapsed: 0.001 s
19:47:44 [2021-02-06T00:47:44.063Z] createIssueEmptyRepositoryName(org.eclipse.egit.github.core.tests.IssueServiceTest)  Time elapsed: 0 s
19:47:44 [2021-02-06T00:47:44.063Z] searchIssues(org.eclipse.egit.github.core.tests.IssueServiceTest)  Time elapsed: 0 s
19:47:44 [2021-02-06T00:47:44.063Z] editIssueWithRepositoryId(org.eclipse.egit.github.core.tests.IssueServiceTest)  Time elapsed: 0.001 s
19:47:44 [2021-02-06T00:47:44.063Z] searchEscaped(org.eclipse.egit.github.core.tests.IssueServiceTest)  Time elapsed: 0 s
19:47:44 [2021-02-06T00:47:44.063Z] getCommentsEmptyId(org.eclipse.egit.github.core.tests.IssueServiceTest)  Time elapsed: 0 s
19:47:44 [2021-02-06T00:47:44.063Z] editIssueComment(org.eclipse.egit.github.core.tests.IssueServiceTest)  Time elapsed: 0 s
19:47:44 [2021-02-06T00:47:44.063Z] createCommentWithRepositoryId(org.eclipse.egit.github.core.tests.IssueServiceTest)  Time elapsed: 0 s
19:47:44 [2021-02-06T00:47:44.063Z] searchIssueEmptyQuery(org.eclipse.egit.github.core.tests.IssueServiceTest)  Time elapsed: 0 s
19:47:44 [2021-02-06T00:47:44.064Z] searchIssueEmptyState(org.eclipse.egit.github.core.tests.IssueServiceTest)  Time elapsed: 0 s
19:47:44 [2021-02-06T00:47:44.064Z] createIssueNullIssue(org.eclipse.egit.github.core.tests.IssueServiceTest)  Time elapsed: 0 s
19:47:44 [2021-02-06T00:47:44.064Z] getIssuesRepositoryId(org.eclipse.egit.github.core.tests.IssueServiceTest)  Time elapsed: 0.001 s
19:47:44 [2021-02-06T00:47:44.064Z] getIssues(org.eclipse.egit.github.core.tests.IssueServiceTest)  Time elapsed: 0 s
19:47:44 [2021-02-06T00:47:44.064Z] getIssueNullId(org.eclipse.egit.github.core.tests.IssueServiceTest)  Time elapsed: 0 s
19:47:44 [2021-02-06T00:47:44.064Z] editIssueCommentWithRepositoryId(org.eclipse.egit.github.core.tests.IssueServiceTest)  Time elapsed: 0 s
19:47:44 [2021-02-06T00:47:44.064Z] deleteComment(org.eclipse.egit.github.core.tests.IssueServiceTest)  Time elapsed: 0 s
19:47:44 [2021-02-06T00:47:44.064Z] pageEvents(org.eclipse.egit.github.core.tests.IssueServiceTest)  Time elapsed: 0 s
19:47:44 [2021-02-06T00:47:44.064Z] editIssueNullUser(org.eclipse.egit.github.core.tests.IssueServiceTest)  Time elapsed: 0 s
19:47:44 [2021-02-06T00:47:44.064Z] createCommentEmptyIssueId(org.eclipse.egit.github.core.tests.IssueServiceTest)  Time elapsed: 0 s
19:47:44 [2021-02-06T00:47:44.064Z] pageIssues(org.eclipse.egit.github.core.tests.IssueServiceTest)  Time elapsed: 0.001 s
19:47:44 [2021-02-06T00:47:44.064Z] createIssueNullUser(org.eclipse.egit.github.core.tests.IssueServiceTest)  Time elapsed: 0 s
19:47:44 [2021-02-06T00:47:44.064Z] getIssueEvent(org.eclipse.egit.github.core.tests.IssueServiceTest)  Time elapsed: 0 s
19:47:44 [2021-02-06T00:47:44.064Z] getIssueEmptyRepositoryName(org.eclipse.egit.github.core.tests.IssueServiceTest)  Time elapsed: 0 s
19:47:44 [2021-02-06T00:47:44.064Z] getIssuesNullRepositoryId(org.eclipse.egit.github.core.tests.IssueServiceTest)  Time elapsed: 0 s
19:47:44 [2021-02-06T00:47:44.064Z] getComments(org.eclipse.egit.github.core.tests.IssueServiceTest)  Time elapsed: 0 s
19:47:44 [2021-02-06T00:47:44.064Z] getIssuesNullRepositoryName(org.eclipse.egit.github.core.tests.IssueServiceTest)  Time elapsed: 0 s
19:47:44 [2021-02-06T00:47:44.064Z] createCommentEmptyUser(org.eclipse.egit.github.core.tests.IssueServiceTest)  Time elapsed: 0 s
19:47:44 [2021-02-06T00:47:44.064Z] deleteCommentEmptyId(org.eclipse.egit.github.core.tests.IssueServiceTest)  Time elapsed: 0 s
19:47:44 [2021-02-06T00:47:44.064Z] searchIssuesNullRepository(org.eclipse.egit.github.core.tests.IssueServiceTest)  Time elapsed: 0.001 s
19:47:44 [2021-02-06T00:47:44.064Z] pageRepsitoryIssues(org.eclipse.egit.github.core.tests.IssueServiceTest)  Time elapsed: 0 s
19:47:44 [2021-02-06T00:47:44.064Z] editIssueNullIssue(org.eclipse.egit.github.core.tests.IssueServiceTest)  Time elapsed: 0 s
19:47:44 [2021-02-06T00:47:44.064Z] getCommentsNullUser(org.eclipse.egit.github.core.tests.IssueServiceTest)  Time elapsed: 0 s
19:47:44 [2021-02-06T00:47:44.064Z] getIssue(org.eclipse.egit.github.core.tests.IssueServiceTest)  Time elapsed: 0 s
19:47:44 [2021-02-06T00:47:44.064Z] searchIssueNullQuery(org.eclipse.egit.github.core.tests.IssueServiceTest)  Time elapsed: 0.001 s
19:47:44 [2021-02-06T00:47:44.064Z] searchIssueNullState(org.eclipse.egit.github.core.tests.IssueServiceTest)  Time elapsed: 0 s
19:47:44 [2021-02-06T00:47:44.064Z] getIssuesEmptyUser(org.eclipse.egit.github.core.tests.IssueServiceTest)  Time elapsed: 0 s
19:47:44 [2021-02-06T00:47:44.064Z] getClosedAtReferenceMutableObject(org.eclipse.egit.github.core.tests.IssueTest)  Time elapsed: 0.001 s
19:47:44 [2021-02-06T00:47:44.064Z] updateFields(org.eclipse.egit.github.core.tests.IssueTest)  Time elapsed: 0 s
19:47:44 [2021-02-06T00:47:44.064Z] defaultState(org.eclipse.egit.github.core.tests.IssueTest)  Time elapsed: 0 s
19:47:44 [2021-02-06T00:47:44.064Z] getCreatedAtReferenceMutableObject(org.eclipse.egit.github.core.tests.IssueTest)  Time elapsed: 0 s
19:47:44 [2021-02-06T00:47:44.064Z] getUpdatedAtReferenceMutableObject(org.eclipse.egit.github.core.tests.IssueTest)  Time elapsed: 0 s
19:47:44 [2021-02-06T00:47:44.064Z] updateFields(org.eclipse.egit.github.core.tests.IssuesPayloadTest)  Time elapsed: 0 s
19:47:44 [2021-02-06T00:47:44.064Z] defaultState(org.eclipse.egit.github.core.tests.IssuesPayloadTest)  Time elapsed: 0 s
19:47:44 [2021-02-06T00:47:44.064Z] updateFields(org.eclipse.egit.github.core.tests.KeyTest)  Time elapsed: 0 s
19:47:44 [2021-02-06T00:47:44.064Z] defaultState(org.eclipse.egit.github.core.tests.KeyTest)  Time elapsed: 0 s
19:47:44 [2021-02-06T00:47:44.064Z] compareLabels(org.eclipse.egit.github.core.tests.LabelComparatorTest)  Time elapsed: 0.001 s
19:47:44 [2021-02-06T00:47:44.064Z] getLabelsNullUser(org.eclipse.egit.github.core.tests.LabelServiceTest)  Time elapsed: 0 s
19:47:44 [2021-02-06T00:47:44.064Z] setLabelsNullIssueId(org.eclipse.egit.github.core.tests.LabelServiceTest)  Time elapsed: 0 s
19:47:44 [2021-02-06T00:47:44.064Z] editLabel(org.eclipse.egit.github.core.tests.LabelServiceTest)  Time elapsed: 0.001 s
19:47:44 [2021-02-06T00:47:44.064Z] editLabelNullLabelName(org.eclipse.egit.github.core.tests.LabelServiceTest)  Time elapsed: 0 s
19:47:44 [2021-02-06T00:47:44.064Z] getEmptyUser(org.eclipse.egit.github.core.tests.LabelServiceTest)  Time elapsed: 0 s
19:47:44 [2021-02-06T00:47:44.064Z] getEmptyLabel(org.eclipse.egit.github.core.tests.LabelServiceTest)  Time elapsed: 0 s
19:47:44 [2021-02-06T00:47:44.064Z] getLabelWithRepositoryId(org.eclipse.egit.github.core.tests.LabelServiceTest)  Time elapsed: 0.001 s
19:47:44 [2021-02-06T00:47:44.064Z] deleteLabel(org.eclipse.egit.github.core.tests.LabelServiceTest)  Time elapsed: 0 s
19:47:44 [2021-02-06T00:47:44.064Z] getLabelsNullRepositoryName(org.eclipse.egit.github.core.tests.LabelServiceTest)  Time elapsed: 0 s
19:47:44 [2021-02-06T00:47:44.064Z] createLabelNullLabel(org.eclipse.egit.github.core.tests.LabelServiceTest)  Time elapsed: 0 s
19:47:44 [2021-02-06T00:47:44.064Z] constructorNullArgument(org.eclipse.egit.github.core.tests.LabelServiceTest)  Time elapsed: 0.001 s
19:47:44 [2021-02-06T00:47:44.064Z] deleteEmptyUser(org.eclipse.egit.github.core.tests.LabelServiceTest)  Time elapsed: 0 s
19:47:44 [2021-02-06T00:47:44.064Z] getEmptyRepositoryName(org.eclipse.egit.github.core.tests.LabelServiceTest)  Time elapsed: 0 s
19:47:44 [2021-02-06T00:47:44.064Z] createLabel(org.eclipse.egit.github.core.tests.LabelServiceTest)  Time elapsed: 0 s
19:47:44 [2021-02-06T00:47:44.064Z] setLabelsEmptyIssueId(org.eclipse.egit.github.core.tests.LabelServiceTest)  Time elapsed: 0.001 s
19:47:44 [2021-02-06T00:47:44.064Z] defaultConstuctor(org.eclipse.egit.github.core.tests.LabelServiceTest)  Time elapsed: 0 s
19:47:44 [2021-02-06T00:47:44.064Z] getNullUser(org.eclipse.egit.github.core.tests.LabelServiceTest)  Time elapsed: 0 s
19:47:44 [2021-02-06T00:47:44.064Z] setLabelsNullLabels(org.eclipse.egit.github.core.tests.LabelServiceTest)  Time elapsed: 0.001 s
19:47:44 [2021-02-06T00:47:44.064Z] deleteNullUser(org.eclipse.egit.github.core.tests.LabelServiceTest)  Time elapsed: 0 s
19:47:44 [2021-02-06T00:47:44.064Z] deleteNullRepositoryName(org.eclipse.egit.github.core.tests.LabelServiceTest)  Time elapsed: 0 s
19:47:44 [2021-02-06T00:47:44.064Z] setLabels(org.eclipse.egit.github.core.tests.LabelServiceTest)  Time elapsed: 0.001 s
19:47:44 [2021-02-06T00:47:44.064Z] deleteLabelWithRepositoryId(org.eclipse.egit.github.core.tests.LabelServiceTest)  Time elapsed: 0 s
19:47:44 [2021-02-06T00:47:44.064Z] getLabels(org.eclipse.egit.github.core.tests.LabelServiceTest)  Time elapsed: 0 s
19:47:44 [2021-02-06T00:47:44.064Z] editLabelNullLabel(org.eclipse.egit.github.core.tests.LabelServiceTest)  Time elapsed: 0.001 s
19:47:44 [2021-02-06T00:47:44.064Z] getNullRepositoryName(org.eclipse.egit.github.core.tests.LabelServiceTest)  Time elapsed: 0 s
19:47:44 [2021-02-06T00:47:44.064Z] getLabelsWithRepositoryId(org.eclipse.egit.github.core.tests.LabelServiceTest)  Time elapsed: 0 s
19:47:44 [2021-02-06T00:47:44.064Z] getNullLabel(org.eclipse.egit.github.core.tests.LabelServiceTest)  Time elapsed: 0 s
19:47:44 [2021-02-06T00:47:44.064Z] setLabelsNullUser(org.eclipse.egit.github.core.tests.LabelServiceTest)  Time elapsed: 0 s
19:47:44 [2021-02-06T00:47:44.064Z] editLabelEmptyLabelName(org.eclipse.egit.github.core.tests.LabelServiceTest)  Time elapsed: 0 s
19:47:44 [2021-02-06T00:47:44.064Z] deleteEmptyRepositoryName(org.eclipse.egit.github.core.tests.LabelServiceTest)  Time elapsed: 0 s
19:47:44 [2021-02-06T00:47:44.064Z] createLabelNullRepositoryName(org.eclipse.egit.github.core.tests.LabelServiceTest)  Time elapsed: 0 s
19:47:44 [2021-02-06T00:47:44.064Z] deleteEmptyLabel(org.eclipse.egit.github.core.tests.LabelServiceTest)  Time elapsed: 0 s
19:47:44 [2021-02-06T00:47:44.064Z] setLabelsWithRepositoryId(org.eclipse.egit.github.core.tests.LabelServiceTest)  Time elapsed: 0 s
19:47:44 [2021-02-06T00:47:44.064Z] createLabelNullUser(org.eclipse.egit.github.core.tests.LabelServiceTest)  Time elapsed: 0 s
19:47:44 [2021-02-06T00:47:44.064Z] deleteNullLabel(org.eclipse.egit.github.core.tests.LabelServiceTest)  Time elapsed: 0 s
19:47:44 [2021-02-06T00:47:44.064Z] setLabelsNullRepositoryName(org.eclipse.egit.github.core.tests.LabelServiceTest)  Time elapsed: 0 s
19:47:44 [2021-02-06T00:47:44.064Z] createLabelWithRepositoryId(org.eclipse.egit.github.core.tests.LabelServiceTest)  Time elapsed: 0 s
19:47:44 [2021-02-06T00:47:44.064Z] getLabel(org.eclipse.egit.github.core.tests.LabelServiceTest)  Time elapsed: 0 s
19:47:44 [2021-02-06T00:47:44.064Z] updateFields(org.eclipse.egit.github.core.tests.LabelTest)  Time elapsed: 0 s
19:47:44 [2021-02-06T00:47:44.064Z] defaultState(org.eclipse.egit.github.core.tests.LabelTest)  Time elapsed: 0 s
19:47:44 [2021-02-06T00:47:44.064Z] equality(org.eclipse.egit.github.core.tests.LabelTest)  Time elapsed: 0 s
19:47:44 [2021-02-06T00:47:44.064Z] languages(org.eclipse.egit.github.core.tests.LanguagesTest)  Time elapsed: 0.005 s
19:47:44 [2021-02-06T00:47:44.065Z] getRepositoryHtml(org.eclipse.egit.github.core.tests.MarkdownServiceTest)  Time elapsed: 0 s
19:47:44 [2021-02-06T00:47:44.065Z] getHtml(org.eclipse.egit.github.core.tests.MarkdownServiceTest)  Time elapsed: 0.001 s
19:47:44 [2021-02-06T00:47:44.065Z] getRepositoryHtmlNullRepository(org.eclipse.egit.github.core.tests.MarkdownServiceTest)  Time elapsed: 0 s
19:47:44 [2021-02-06T00:47:44.065Z] updateFields(org.eclipse.egit.github.core.tests.MemberPayloadTest)  Time elapsed: 0 s
19:47:44 [2021-02-06T00:47:44.065Z] defaultState(org.eclipse.egit.github.core.tests.MemberPayloadTest)  Time elapsed: 0 s
19:47:44 [2021-02-06T00:47:44.065Z] updateFields(org.eclipse.egit.github.core.tests.MergeStatusTest)  Time elapsed: 0.001 s
19:47:44 [2021-02-06T00:47:44.065Z] defaultState(org.eclipse.egit.github.core.tests.MergeStatusTest)  Time elapsed: 0 s
19:47:44 [2021-02-06T00:47:44.065Z] compareMilestones(org.eclipse.egit.github.core.tests.MilestoneComparatorTest)  Time elapsed: 0 s
19:47:44 [2021-02-06T00:47:44.065Z] deleteMilestoneNullUser(org.eclipse.egit.github.core.tests.MilestoneServiceTest)  Time elapsed: 0.001 s
19:47:44 [2021-02-06T00:47:44.065Z] editMilestoneDescription(org.eclipse.egit.github.core.tests.MilestoneServiceTest)  Time elapsed: 0.001 s
19:47:44 [2021-02-06T00:47:44.065Z] createMilestoneEmptyRepositoryName(org.eclipse.egit.github.core.tests.MilestoneServiceTest)  Time elapsed: 0 s
19:47:44 [2021-02-06T00:47:44.065Z] editMilestoneFull(org.eclipse.egit.github.core.tests.MilestoneServiceTest)  Time elapsed: 0.001 s
19:47:44 [2021-02-06T00:47:44.065Z] getMilestonesEmptyUser(org.eclipse.egit.github.core.tests.MilestoneServiceTest)  Time elapsed: 0 s
19:47:44 [2021-02-06T00:47:44.065Z] createMilestoneEmptyUser(org.eclipse.egit.github.core.tests.MilestoneServiceTest)  Time elapsed: 0 s
19:47:44 [2021-02-06T00:47:44.065Z] createMilestoneFull(org.eclipse.egit.github.core.tests.MilestoneServiceTest)  Time elapsed: 0 s
19:47:44 [2021-02-06T00:47:44.065Z] createMilestoneOpen(org.eclipse.egit.github.core.tests.MilestoneServiceTest)  Time elapsed: 0.001 s
19:47:44 [2021-02-06T00:47:44.065Z] editMilestoneEmptyMilestone(org.eclipse.egit.github.core.tests.MilestoneServiceTest)  Time elapsed: 0 s
19:47:44 [2021-02-06T00:47:44.065Z] createMilestoneNullRepositoryName(org.eclipse.egit.github.core.tests.MilestoneServiceTest)  Time elapsed: 0 s
19:47:44 [2021-02-06T00:47:44.065Z] deleteMilestoneEmptyUser(org.eclipse.egit.github.core.tests.MilestoneServiceTest)  Time elapsed: 0 s
19:47:44 [2021-02-06T00:47:44.065Z] getMilestone(org.eclipse.egit.github.core.tests.MilestoneServiceTest)  Time elapsed: 0 s
19:47:44 [2021-02-06T00:47:44.065Z] createMilestoneEmptyMilestone(org.eclipse.egit.github.core.tests.MilestoneServiceTest)  Time elapsed: 0 s
19:47:44 [2021-02-06T00:47:44.065Z] constructorNullArgument(org.eclipse.egit.github.core.tests.MilestoneServiceTest)  Time elapsed: 0 s
19:47:44 [2021-02-06T00:47:44.065Z] getMilestoneEmptyUser(org.eclipse.egit.github.core.tests.MilestoneServiceTest)  Time elapsed: 0 s
19:47:44 [2021-02-06T00:47:44.065Z] getMilestoneNullRepositoryName(org.eclipse.egit.github.core.tests.MilestoneServiceTest)  Time elapsed: 0 s
19:47:44 [2021-02-06T00:47:44.065Z] getMilestonesEmptyRepositoryName(org.eclipse.egit.github.core.tests.MilestoneServiceTest)  Time elapsed: 0 s
19:47:44 [2021-02-06T00:47:44.065Z] deleteMilestoneNullRepositoryName(org.eclipse.egit.github.core.tests.MilestoneServiceTest)  Time elapsed: 0 s
19:47:44 [2021-02-06T00:47:44.065Z] getMilestonesNullUser(org.eclipse.egit.github.core.tests.MilestoneServiceTest)  Time elapsed: 0 s
19:47:44 [2021-02-06T00:47:44.065Z] defaultConstructor(org.eclipse.egit.github.core.tests.MilestoneServiceTest)  Time elapsed: 0 s
19:47:44 [2021-02-06T00:47:44.065Z] deleteMilestone(org.eclipse.egit.github.core.tests.MilestoneServiceTest)  Time elapsed: 0 s
19:47:44 [2021-02-06T00:47:44.065Z] getMilestoneEmptyRepositoryName(org.eclipse.egit.github.core.tests.MilestoneServiceTest)  Time elapsed: 0 s
19:47:44 [2021-02-06T00:47:44.065Z] createMilestoneNullMilestone(org.eclipse.egit.github.core.tests.MilestoneServiceTest)  Time elapsed: 0.001 s
19:47:44 [2021-02-06T00:47:44.065Z] editMilestone(org.eclipse.egit.github.core.tests.MilestoneServiceTest)  Time elapsed: 0 s
19:47:44 [2021-02-06T00:47:44.065Z] createMilestoneNullUser(org.eclipse.egit.github.core.tests.MilestoneServiceTest)  Time elapsed: 0 s
19:47:44 [2021-02-06T00:47:44.065Z] createMilestoneInvalidState(org.eclipse.egit.github.core.tests.MilestoneServiceTest)  Time elapsed: 0 s
19:47:44 [2021-02-06T00:47:44.065Z] getMilestonesNullRepositoryName(org.eclipse.egit.github.core.tests.MilestoneServiceTest)  Time elapsed: 0 s
19:47:44 [2021-02-06T00:47:44.065Z] getMilestonesNullState(org.eclipse.egit.github.core.tests.MilestoneServiceTest)  Time elapsed: 0.001 s
19:47:44 [2021-02-06T00:47:44.065Z] getMilestoneWithRepositoryId(org.eclipse.egit.github.core.tests.MilestoneServiceTest)  Time elapsed: 0 s
19:47:44 [2021-02-06T00:47:44.065Z] getMilestonesOpenStateWithRepositoryId(org.eclipse.egit.github.core.tests.MilestoneServiceTest)  Time elapsed: 0 s
19:47:44 [2021-02-06T00:47:44.065Z] deleteMilestoneNullMilestone(org.eclipse.egit.github.core.tests.MilestoneServiceTest)  Time elapsed: 0 s
19:47:44 [2021-02-06T00:47:44.065Z] getMilestonesOpenState(org.eclipse.egit.github.core.tests.MilestoneServiceTest)  Time elapsed: 0.001 s
19:47:44 [2021-02-06T00:47:44.065Z] deleteMilestoneEmptyMilestone(org.eclipse.egit.github.core.tests.MilestoneServiceTest)  Time elapsed: 0 s
19:47:44 [2021-02-06T00:47:44.065Z] createMilestoneNoTitle(org.eclipse.egit.github.core.tests.MilestoneServiceTest)  Time elapsed: 0 s
19:47:44 [2021-02-06T00:47:44.065Z] createMilestoneClosed(org.eclipse.egit.github.core.tests.MilestoneServiceTest)  Time elapsed: 0 s
19:47:44 [2021-02-06T00:47:44.065Z] getMilestoneNullId(org.eclipse.egit.github.core.tests.MilestoneServiceTest)  Time elapsed: 0 s
19:47:44 [2021-02-06T00:47:44.065Z] createMilestone(org.eclipse.egit.github.core.tests.MilestoneServiceTest)  Time elapsed: 0 s
19:47:44 [2021-02-06T00:47:44.065Z] getMilestoneNullUser(org.eclipse.egit.github.core.tests.MilestoneServiceTest)  Time elapsed: 0 s
19:47:44 [2021-02-06T00:47:44.065Z] deleteMilestoneWithRepositoryId(org.eclipse.egit.github.core.tests.MilestoneServiceTest)  Time elapsed: 0 s
19:47:44 [2021-02-06T00:47:44.065Z] deleteMilestoneEmptyRepositoryName(org.eclipse.egit.github.core.tests.MilestoneServiceTest)  Time elapsed: 0 s
19:47:44 [2021-02-06T00:47:44.065Z] getMilestoneEmptyId(org.eclipse.egit.github.core.tests.MilestoneServiceTest)  Time elapsed: 0.001 s
19:47:44 [2021-02-06T00:47:44.065Z] createMilestoneWithRepositoryId(org.eclipse.egit.github.core.tests.MilestoneServiceTest)  Time elapsed: 0 s
19:47:44 [2021-02-06T00:47:44.065Z] editMilestoneNullMilestone(org.eclipse.egit.github.core.tests.MilestoneServiceTest)  Time elapsed: 0 s
19:47:44 [2021-02-06T00:47:44.065Z] setDueOnReferenceMutableObject(org.eclipse.egit.github.core.tests.MilestoneTest)  Time elapsed: 0 s
19:47:44 [2021-02-06T00:47:44.065Z] updateFields(org.eclipse.egit.github.core.tests.MilestoneTest)  Time elapsed: 0 s
19:47:44 [2021-02-06T00:47:44.065Z] getDueOn_ReferenceMutableObject(org.eclipse.egit.github.core.tests.MilestoneTest)  Time elapsed: 0 s
19:47:44 [2021-02-06T00:47:44.065Z] defaultState(org.eclipse.egit.github.core.tests.MilestoneTest)  Time elapsed: 0 s
19:47:44 [2021-02-06T00:47:44.065Z] getCreatedAtReferenceMutableObject(org.eclipse.egit.github.core.tests.MilestoneTest)  Time elapsed: 0 s
19:47:44 [2021-02-06T00:47:44.065Z] deleteAuthorization(org.eclipse.egit.github.core.tests.OAuthServiceTest)  Time elapsed: 0.001 s
19:47:44 [2021-02-06T00:47:44.065Z] removeScopes(org.eclipse.egit.github.core.tests.OAuthServiceTest)  Time elapsed: 0 s
19:47:44 [2021-02-06T00:47:44.065Z] constructorNullArgument(org.eclipse.egit.github.core.tests.OAuthServiceTest)  Time elapsed: 0 s
19:47:44 [2021-02-06T00:47:44.065Z] defaultConstructor(org.eclipse.egit.github.core.tests.OAuthServiceTest)  Time elapsed: 0 s
19:47:44 [2021-02-06T00:47:44.065Z] getAuthorizations(org.eclipse.egit.github.core.tests.OAuthServiceTest)  Time elapsed: 0.001 s
19:47:44 [2021-02-06T00:47:44.065Z] addScopes(org.eclipse.egit.github.core.tests.OAuthServiceTest)  Time elapsed: 0 s
19:47:44 [2021-02-06T00:47:44.065Z] createAuthorization(org.eclipse.egit.github.core.tests.OAuthServiceTest)  Time elapsed: 0 s
19:47:44 [2021-02-06T00:47:44.065Z] setScopes(org.eclipse.egit.github.core.tests.OAuthServiceTest)  Time elapsed: 0 s
19:47:44 [2021-02-06T00:47:44.066Z] getAuthorization(org.eclipse.egit.github.core.tests.OAuthServiceTest)  Time elapsed: 0 s
19:47:44 [2021-02-06T00:47:44.066Z] showMembershipEmptyName(org.eclipse.egit.github.core.tests.OrganizationServiceTest)  Time elapsed: 0 s
19:47:44 [2021-02-06T00:47:44.066Z] showMembershipEmptyUser(org.eclipse.egit.github.core.tests.OrganizationServiceTest)  Time elapsed: 0 s
19:47:44 [2021-02-06T00:47:44.066Z] getMembersAll(org.eclipse.egit.github.core.tests.OrganizationServiceTest)  Time elapsed: 0 s
19:47:44 [2021-02-06T00:47:44.066Z] constructor(org.eclipse.egit.github.core.tests.OrganizationServiceTest)  Time elapsed: 0 s
19:47:44 [2021-02-06T00:47:44.066Z] getOrganization(org.eclipse.egit.github.core.tests.OrganizationServiceTest)  Time elapsed: 0 s
19:47:44 [2021-02-06T00:47:44.066Z] removeMemberNullName(org.eclipse.egit.github.core.tests.OrganizationServiceTest)  Time elapsed: 0 s
19:47:44 [2021-02-06T00:47:44.066Z] removeMemberNullUser(org.eclipse.egit.github.core.tests.OrganizationServiceTest)  Time elapsed: 0 s
19:47:44 [2021-02-06T00:47:44.066Z] isMemberEmptyName(org.eclipse.egit.github.core.tests.OrganizationServiceTest)  Time elapsed: 0 s
19:47:44 [2021-02-06T00:47:44.066Z] isMemberEmptyUser(org.eclipse.egit.github.core.tests.OrganizationServiceTest)  Time elapsed: 0 s
19:47:44 [2021-02-06T00:47:44.066Z] hideMembershipNullName(org.eclipse.egit.github.core.tests.OrganizationServiceTest)  Time elapsed: 0 s
19:47:44 [2021-02-06T00:47:44.066Z] hideMembershipNullUser(org.eclipse.egit.github.core.tests.OrganizationServiceTest)  Time elapsed: 0.001 s
19:47:44 [2021-02-06T00:47:44.066Z] getCurrentUserOrganizations(org.eclipse.egit.github.core.tests.OrganizationServiceTest)  Time elapsed: 0 s
19:47:44 [2021-02-06T00:47:44.066Z] getPublicMembersNullName(org.eclipse.egit.github.core.tests.OrganizationServiceTest)  Time elapsed: 0 s
19:47:44 [2021-02-06T00:47:44.066Z] removeMember(org.eclipse.egit.github.core.tests.OrganizationServiceTest)  Time elapsed: 0 s
19:47:44 [2021-02-06T00:47:44.066Z] getMembersEmptyName(org.eclipse.egit.github.core.tests.OrganizationServiceTest)  Time elapsed: 0 s
19:47:44 [2021-02-06T00:47:44.066Z] editOrganizationNullOrgName(org.eclipse.egit.github.core.tests.OrganizationServiceTest)  Time elapsed: 0.001 s
19:47:44 [2021-02-06T00:47:44.066Z] showMembershipNullName(org.eclipse.egit.github.core.tests.OrganizationServiceTest)  Time elapsed: 0 s
19:47:44 [2021-02-06T00:47:44.066Z] showMembershipNullUser(org.eclipse.egit.github.core.tests.OrganizationServiceTest)  Time elapsed: 0 s
19:47:44 [2021-02-06T00:47:44.066Z] getOrganizationNullName(org.eclipse.egit.github.core.tests.OrganizationServiceTest)  Time elapsed: 0 s
19:47:44 [2021-02-06T00:47:44.066Z] isPublicMember(org.eclipse.egit.github.core.tests.OrganizationServiceTest)  Time elapsed: 0 s
19:47:44 [2021-02-06T00:47:44.066Z] isMember(org.eclipse.egit.github.core.tests.OrganizationServiceTest)  Time elapsed: 0 s
19:47:44 [2021-02-06T00:47:44.066Z] getOrganizationsEmptyUser(org.eclipse.egit.github.core.tests.OrganizationServiceTest)  Time elapsed: 0 s
19:47:44 [2021-02-06T00:47:44.066Z] isPublicMemberEmptyName(org.eclipse.egit.github.core.tests.OrganizationServiceTest)  Time elapsed: 0 s
19:47:44 [2021-02-06T00:47:44.066Z] isPublicMemberEmptyUser(org.eclipse.egit.github.core.tests.OrganizationServiceTest)  Time elapsed: 0 s
19:47:44 [2021-02-06T00:47:44.066Z] isPublicMemberNullName(org.eclipse.egit.github.core.tests.OrganizationServiceTest)  Time elapsed: 0 s
19:47:44 [2021-02-06T00:47:44.066Z] isPublicMemberNullUser(org.eclipse.egit.github.core.tests.OrganizationServiceTest)  Time elapsed: 0 s
19:47:44 [2021-02-06T00:47:44.066Z] showMembership(org.eclipse.egit.github.core.tests.OrganizationServiceTest)  Time elapsed: 0.001 s
19:47:44 [2021-02-06T00:47:44.066Z] editOrganizationEmptyOrgName(org.eclipse.egit.github.core.tests.OrganizationServiceTest)  Time elapsed: 0 s
19:47:44 [2021-02-06T00:47:44.066Z] hideMembershipEmptyName(org.eclipse.egit.github.core.tests.OrganizationServiceTest)  Time elapsed: 0 s
19:47:44 [2021-02-06T00:47:44.066Z] hideMembershipEmptyUser(org.eclipse.egit.github.core.tests.OrganizationServiceTest)  Time elapsed: 0 s
19:47:44 [2021-02-06T00:47:44.066Z] editOrganization(org.eclipse.egit.github.core.tests.OrganizationServiceTest)  Time elapsed: 0 s
19:47:44 [2021-02-06T00:47:44.066Z] isMemberNullName(org.eclipse.egit.github.core.tests.OrganizationServiceTest)  Time elapsed: 0 s
19:47:44 [2021-02-06T00:47:44.066Z] isMemberNullUser(org.eclipse.egit.github.core.tests.OrganizationServiceTest)  Time elapsed: 0.001 s
19:47:44 [2021-02-06T00:47:44.066Z] editOrganizationNullOrg(org.eclipse.egit.github.core.tests.OrganizationServiceTest)  Time elapsed: 0 s
19:47:44 [2021-02-06T00:47:44.066Z] getOrganizations(org.eclipse.egit.github.core.tests.OrganizationServiceTest)  Time elapsed: 0 s
19:47:44 [2021-02-06T00:47:44.066Z] getPublicMembers(org.eclipse.egit.github.core.tests.OrganizationServiceTest)  Time elapsed: 0 s
19:47:44 [2021-02-06T00:47:44.066Z] getPublicMembersEmptyName(org.eclipse.egit.github.core.tests.OrganizationServiceTest)  Time elapsed: 0 s
19:47:44 [2021-02-06T00:47:44.066Z] removeMemberEmptyName(org.eclipse.egit.github.core.tests.OrganizationServiceTest)  Time elapsed: 0.001 s
19:47:44 [2021-02-06T00:47:44.066Z] removeMemberEmptyUser(org.eclipse.egit.github.core.tests.OrganizationServiceTest)  Time elapsed: 0 s
19:47:44 [2021-02-06T00:47:44.066Z] getMembersMember(org.eclipse.egit.github.core.tests.OrganizationServiceTest)  Time elapsed: 0 s
19:47:44 [2021-02-06T00:47:44.066Z] getOrganizationEmptyName(org.eclipse.egit.github.core.tests.OrganizationServiceTest)  Time elapsed: 0 s
19:47:44 [2021-02-06T00:47:44.066Z] getOrganizationsNullUser(org.eclipse.egit.github.core.tests.OrganizationServiceTest)  Time elapsed: 0 s
19:47:44 [2021-02-06T00:47:44.066Z] getMembers(org.eclipse.egit.github.core.tests.OrganizationServiceTest)  Time elapsed: 0.001 s
19:47:44 [2021-02-06T00:47:44.066Z] getMembersNullName(org.eclipse.egit.github.core.tests.OrganizationServiceTest)  Time elapsed: 0 s
19:47:44 [2021-02-06T00:47:44.066Z] hideMembership(org.eclipse.egit.github.core.tests.OrganizationServiceTest)  Time elapsed: 0 s
19:47:44 [2021-02-06T00:47:44.066Z] getMembersAdmin(org.eclipse.egit.github.core.tests.OrganizationServiceTest)  Time elapsed: 0 s
19:47:44 [2021-02-06T00:47:44.066Z] defaultState(org.eclipse.egit.github.core.tests.PagedRequestTest)  Time elapsed: 0 s
19:47:44 [2021-02-06T00:47:44.066Z] updateFields(org.eclipse.egit.github.core.tests.PullRequestMarkerTest)  Time elapsed: 0 s
19:47:44 [2021-02-06T00:47:44.066Z] defaultState(org.eclipse.egit.github.core.tests.PullRequestMarkerTest)  Time elapsed: 0 s
19:47:44 [2021-02-06T00:47:44.066Z] updateFields(org.eclipse.egit.github.core.tests.PullRequestPayloadTest)  Time elapsed: 0 s
19:47:44 [2021-02-06T00:47:44.066Z] defaultState(org.eclipse.egit.github.core.tests.PullRequestPayloadTest)  Time elapsed: 0 s
19:47:44 [2021-02-06T00:47:44.066Z] updateFields(org.eclipse.egit.github.core.tests.PullRequestReviewCommentPayloadTest)  Time elapsed: 0 s
19:47:44 [2021-02-06T00:47:44.066Z] defaultState(org.eclipse.egit.github.core.tests.PullRequestReviewCommentPayloadTest)  Time elapsed: 0 s
19:47:44 [2021-02-06T00:47:44.066Z] getPullRequestNullRepository(org.eclipse.egit.github.core.tests.PullRequestServiceTest)  Time elapsed: 0 s
19:47:44 [2021-02-06T00:47:44.066Z] replyToComment(org.eclipse.egit.github.core.tests.PullRequestServiceTest)  Time elapsed: 0.001 s
19:47:44 [2021-02-06T00:47:44.066Z] constructor(org.eclipse.egit.github.core.tests.PullRequestServiceTest)  Time elapsed: 0 s
19:47:44 [2021-02-06T00:47:44.066Z] getPullRequest(org.eclipse.egit.github.core.tests.PullRequestServiceTest)  Time elapsed: 0 s
19:47:44 [2021-02-06T00:47:44.066Z] editComment(org.eclipse.egit.github.core.tests.PullRequestServiceTest)  Time elapsed: 0 s
19:47:44 [2021-02-06T00:47:44.066Z] getPullRequestsNullRepository(org.eclipse.egit.github.core.tests.PullRequestServiceTest)  Time elapsed: 0 s
19:47:44 [2021-02-06T00:47:44.066Z] createComment(org.eclipse.egit.github.core.tests.PullRequestServiceTest)  Time elapsed: 0 s
19:47:44 [2021-02-06T00:47:44.066Z] constructorNullArgument(org.eclipse.egit.github.core.tests.PullRequestServiceTest)  Time elapsed: 0 s
19:47:44 [2021-02-06T00:47:44.066Z] editPullRequestNullRequest(org.eclipse.egit.github.core.tests.PullRequestServiceTest)  Time elapsed: 0 s
19:47:44 [2021-02-06T00:47:44.066Z] getPullRequestsNullRepositoryId(org.eclipse.egit.github.core.tests.PullRequestServiceTest)  Time elapsed: 0 s
19:47:44 [2021-02-06T00:47:44.066Z] createPullRequestFromIssue(org.eclipse.egit.github.core.tests.PullRequestServiceTest)  Time elapsed: 0.001 s
19:47:44 [2021-02-06T00:47:44.066Z] isMerged(org.eclipse.egit.github.core.tests.PullRequestServiceTest)  Time elapsed: 0 s
19:47:44 [2021-02-06T00:47:44.066Z] createPullRequest(org.eclipse.egit.github.core.tests.PullRequestServiceTest)  Time elapsed: 0 s
19:47:44 [2021-02-06T00:47:44.066Z] editCommentNullComment(org.eclipse.egit.github.core.tests.PullRequestServiceTest)  Time elapsed: 0 s
19:47:44 [2021-02-06T00:47:44.066Z] merge(org.eclipse.egit.github.core.tests.PullRequestServiceTest)  Time elapsed: 0 s
19:47:44 [2021-02-06T00:47:44.067Z] deleteComment(org.eclipse.egit.github.core.tests.PullRequestServiceTest)  Time elapsed: 0.001 s
19:47:44 [2021-02-06T00:47:44.067Z] editPullRequest(org.eclipse.egit.github.core.tests.PullRequestServiceTest)  Time elapsed: 0 s
19:47:44 [2021-02-06T00:47:44.067Z] getPullRequests(org.eclipse.egit.github.core.tests.PullRequestServiceTest)  Time elapsed: 0 s
19:47:44 [2021-02-06T00:47:44.067Z] getComments(org.eclipse.egit.github.core.tests.PullRequestServiceTest)  Time elapsed: 0.001 s
19:47:44 [2021-02-06T00:47:44.067Z] getFiles(org.eclipse.egit.github.core.tests.PullRequestServiceTest)  Time elapsed: 0 s
19:47:44 [2021-02-06T00:47:44.067Z] getComment(org.eclipse.egit.github.core.tests.PullRequestServiceTest)  Time elapsed: 0 s
19:47:44 [2021-02-06T00:47:44.067Z] getCommits(org.eclipse.egit.github.core.tests.PullRequestServiceTest)  Time elapsed: 0.001 s
19:47:44 [2021-02-06T00:47:44.067Z] getClosedAtReferenceMutableObject(org.eclipse.egit.github.core.tests.PullRequestTest)  Time elapsed: 0 s
19:47:44 [2021-02-06T00:47:44.067Z] getMergedAtReferenceMutableObject(org.eclipse.egit.github.core.tests.PullRequestTest)  Time elapsed: 0 s
19:47:44 [2021-02-06T00:47:44.067Z] updateFields(org.eclipse.egit.github.core.tests.PullRequestTest)  Time elapsed: 0 s
19:47:44 [2021-02-06T00:47:44.067Z] defaultState(org.eclipse.egit.github.core.tests.PullRequestTest)  Time elapsed: 0 s
19:47:44 [2021-02-06T00:47:44.067Z] getCreatedAtReferenceMutableObject(org.eclipse.egit.github.core.tests.PullRequestTest)  Time elapsed: 0 s
19:47:44 [2021-02-06T00:47:44.067Z] getUpdatedAtReferenceMutableObject(org.eclipse.egit.github.core.tests.PullRequestTest)  Time elapsed: 0 s
19:47:44 [2021-02-06T00:47:44.067Z] updateFields(org.eclipse.egit.github.core.tests.PushPayloadTest)  Time elapsed: 0 s
19:47:44 [2021-02-06T00:47:44.067Z] defaultState(org.eclipse.egit.github.core.tests.PushPayloadTest)  Time elapsed: 0 s
19:47:44 [2021-02-06T00:47:44.067Z] updateFields(org.eclipse.egit.github.core.tests.ReferenceTest)  Time elapsed: 0 s
19:47:44 [2021-02-06T00:47:44.067Z] defaultState(org.eclipse.egit.github.core.tests.ReferenceTest)  Time elapsed: 0 s
19:47:44 [2021-02-06T00:47:44.067Z] updateFields(org.eclipse.egit.github.core.tests.RepositoryBranchTest)  Time elapsed: 0.001 s
19:47:44 [2021-02-06T00:47:44.067Z] defaultState(org.eclipse.egit.github.core.tests.RepositoryBranchTest)  Time elapsed: 0 s
19:47:44 [2021-02-06T00:47:44.067Z] updateFields(org.eclipse.egit.github.core.tests.RepositoryCommitCompareTest)  Time elapsed: 0 s
19:47:44 [2021-02-06T00:47:44.067Z] defaultState(org.eclipse.egit.github.core.tests.RepositoryCommitCompareTest)  Time elapsed: 0 s
19:47:44 [2021-02-06T00:47:44.067Z] updateFields(org.eclipse.egit.github.core.tests.RepositoryCommitTest)  Time elapsed: 0 s
19:47:44 [2021-02-06T00:47:44.067Z] defaultState(org.eclipse.egit.github.core.tests.RepositoryCommitTest)  Time elapsed: 0 s
19:47:44 [2021-02-06T00:47:44.067Z] updateFields(org.eclipse.egit.github.core.tests.RepositoryContentsTest)  Time elapsed: 0 s
19:47:44 [2021-02-06T00:47:44.067Z] defaultState(org.eclipse.egit.github.core.tests.RepositoryContentsTest)  Time elapsed: 0 s
19:47:44 [2021-02-06T00:47:44.067Z] updateFields(org.eclipse.egit.github.core.tests.RepositoryHookResponseTest)  Time elapsed: 0 s
19:47:44 [2021-02-06T00:47:44.067Z] defaultState(org.eclipse.egit.github.core.tests.RepositoryHookResponseTest)  Time elapsed: 0 s
19:47:44 [2021-02-06T00:47:44.067Z] updateFields(org.eclipse.egit.github.core.tests.RepositoryHookTest)  Time elapsed: 0 s
19:47:44 [2021-02-06T00:47:44.067Z] defaultState(org.eclipse.egit.github.core.tests.RepositoryHookTest)  Time elapsed: 0 s
19:47:44 [2021-02-06T00:47:44.067Z] createFromNullString(org.eclipse.egit.github.core.tests.RepositoryIdTest)  Time elapsed: 0 s
19:47:44 [2021-02-06T00:47:44.067Z] create(org.eclipse.egit.github.core.tests.RepositoryIdTest)  Time elapsed: 0 s
19:47:44 [2021-02-06T00:47:44.067Z] createFromEmptyString(org.eclipse.egit.github.core.tests.RepositoryIdTest)  Time elapsed: 0 s
19:47:44 [2021-02-06T00:47:44.067Z] createFromNullUrl(org.eclipse.egit.github.core.tests.RepositoryIdTest)  Time elapsed: 0 s
19:47:44 [2021-02-06T00:47:44.067Z] createNullName(org.eclipse.egit.github.core.tests.RepositoryIdTest)  Time elapsed: 0 s
19:47:44 [2021-02-06T00:47:44.067Z] createFromStringUrl(org.eclipse.egit.github.core.tests.RepositoryIdTest)  Time elapsed: 0 s
19:47:44 [2021-02-06T00:47:44.067Z] createNullOwner(org.eclipse.egit.github.core.tests.RepositoryIdTest)  Time elapsed: 0 s
19:47:44 [2021-02-06T00:47:44.067Z] createFromString(org.eclipse.egit.github.core.tests.RepositoryIdTest)  Time elapsed: 0 s
19:47:44 [2021-02-06T00:47:44.067Z] createFromMalformedStringUrl(org.eclipse.egit.github.core.tests.RepositoryIdTest)  Time elapsed: 0 s
19:47:44 [2021-02-06T00:47:44.067Z] equality(org.eclipse.egit.github.core.tests.RepositoryIdTest)  Time elapsed: 0 s
19:47:44 [2021-02-06T00:47:44.067Z] createEmptyOwner(org.eclipse.egit.github.core.tests.RepositoryIdTest)  Time elapsed: 0 s
19:47:44 [2021-02-06T00:47:44.067Z] createFromNullStringUrl(org.eclipse.egit.github.core.tests.RepositoryIdTest)  Time elapsed: 0 s
19:47:44 [2021-02-06T00:47:44.067Z] createFromInvalidUrl1(org.eclipse.egit.github.core.tests.RepositoryIdTest)  Time elapsed: 0 s
19:47:44 [2021-02-06T00:47:44.067Z] createFromInvalidUrl2(org.eclipse.egit.github.core.tests.RepositoryIdTest)  Time elapsed: 0 s
19:47:44 [2021-02-06T00:47:44.067Z] createFromInvalidUrl3(org.eclipse.egit.github.core.tests.RepositoryIdTest)  Time elapsed: 0 s
19:47:44 [2021-02-06T00:47:44.067Z] createFromInvalidUrl4(org.eclipse.egit.github.core.tests.RepositoryIdTest)  Time elapsed: 0 s
19:47:44 [2021-02-06T00:47:44.067Z] createEmptyName(org.eclipse.egit.github.core.tests.RepositoryIdTest)  Time elapsed: 0 s
19:47:44 [2021-02-06T00:47:44.067Z] createFromUrl(org.eclipse.egit.github.core.tests.RepositoryIdTest)  Time elapsed: 0 s
19:47:44 [2021-02-06T00:47:44.067Z] updateFields(org.eclipse.egit.github.core.tests.RepositoryIssueTest)  Time elapsed: 0 s
19:47:44 [2021-02-06T00:47:44.067Z] defaultState(org.eclipse.egit.github.core.tests.RepositoryIssueTest)  Time elapsed: 0 s
19:47:44 [2021-02-06T00:47:44.067Z] getPrivateOrgRepositories(org.eclipse.egit.github.core.tests.RepositoryServiceTest)  Time elapsed: 0.001 s
19:47:44 [2021-02-06T00:47:44.067Z] editRepositoryNullRepository(org.eclipse.egit.github.core.tests.RepositoryServiceTest)  Time elapsed: 0 s
19:47:44 [2021-02-06T00:47:44.067Z] getRepositoriesNullOrg(org.eclipse.egit.github.core.tests.RepositoryServiceTest)  Time elapsed: 0.001 s
19:47:44 [2021-02-06T00:47:44.067Z] getPublicRepositories(org.eclipse.egit.github.core.tests.RepositoryServiceTest)  Time elapsed: 0 s
19:47:44 [2021-02-06T00:47:44.067Z] constructor(org.eclipse.egit.github.core.tests.RepositoryServiceTest)  Time elapsed: 0 s
19:47:44 [2021-02-06T00:47:44.067Z] searchRepositoriesEmptyQuery(org.eclipse.egit.github.core.tests.RepositoryServiceTest)  Time elapsed: 0 s
19:47:44 [2021-02-06T00:47:44.067Z] getRepositoriesEmptyUser(org.eclipse.egit.github.core.tests.RepositoryServiceTest)  Time elapsed: 0 s
19:47:44 [2021-02-06T00:47:44.067Z] forkRepositoryToOrg(org.eclipse.egit.github.core.tests.RepositoryServiceTest)  Time elapsed: 0.001 s
19:47:44 [2021-02-06T00:47:44.067Z] getRepositoriesEmptyOrg(org.eclipse.egit.github.core.tests.RepositoryServiceTest)  Time elapsed: 0 s
19:47:44 [2021-02-06T00:47:44.067Z] getContributors(org.eclipse.egit.github.core.tests.RepositoryServiceTest)  Time elapsed: 0 s
19:47:44 [2021-02-06T00:47:44.067Z] searchRepositoriesNullQuery(org.eclipse.egit.github.core.tests.RepositoryServiceTest)  Time elapsed: 0 s
19:47:44 [2021-02-06T00:47:44.067Z] createOrgRepositoryNullRepository(org.eclipse.egit.github.core.tests.RepositoryServiceTest)  Time elapsed: 0 s
19:47:44 [2021-02-06T00:47:44.067Z] editRepositoryProviderWithNullFields(org.eclipse.egit.github.core.tests.RepositoryServiceTest)  Time elapsed: 0.001 s
19:47:44 [2021-02-06T00:47:44.067Z] searchRepositoriesStartingAtPage(org.eclipse.egit.github.core.tests.RepositoryServiceTest)  Time elapsed: 0 s
19:47:44 [2021-02-06T00:47:44.067Z] editRepositoryProviderWithFields(org.eclipse.egit.github.core.tests.RepositoryServiceTest)  Time elapsed: 0 s
19:47:44 [2021-02-06T00:47:44.067Z] editRepository(org.eclipse.egit.github.core.tests.RepositoryServiceTest)  Time elapsed: 0.001 s
19:47:44 [2021-02-06T00:47:44.067Z] createRepositoryNullRepository(org.eclipse.egit.github.core.tests.RepositoryServiceTest)  Time elapsed: 0 s
19:47:44 [2021-02-06T00:47:44.067Z] getRepositories(org.eclipse.egit.github.core.tests.RepositoryServiceTest)  Time elapsed: 0 s
19:47:44 [2021-02-06T00:47:44.067Z] createRepository(org.eclipse.egit.github.core.tests.RepositoryServiceTest)  Time elapsed: 0 s
19:47:44 [2021-02-06T00:47:44.067Z] getOrgRepositories(org.eclipse.egit.github.core.tests.RepositoryServiceTest)  Time elapsed: 0 s
19:47:44 [2021-02-06T00:47:44.067Z] getRepositoriesNullUser(org.eclipse.egit.github.core.tests.RepositoryServiceTest)  Time elapsed: 0 s
19:47:44 [2021-02-06T00:47:44.067Z] getContributorsWithAnonymous(org.eclipse.egit.github.core.tests.RepositoryServiceTest)  Time elapsed: 0.001 s
19:47:44 [2021-02-06T00:47:44.067Z] searchEscaped(org.eclipse.egit.github.core.tests.RepositoryServiceTest)  Time elapsed: 0 s
19:47:44 [2021-02-06T00:47:44.067Z] getUserRepositories(org.eclipse.egit.github.core.tests.RepositoryServiceTest)  Time elapsed: 0 s
19:47:44 [2021-02-06T00:47:44.068Z] getHook(org.eclipse.egit.github.core.tests.RepositoryServiceTest)  Time elapsed: 0 s
19:47:44 [2021-02-06T00:47:44.068Z] getTags(org.eclipse.egit.github.core.tests.RepositoryServiceTest)  Time elapsed: 0.001 s
19:47:44 [2021-02-06T00:47:44.068Z] forkRepository(org.eclipse.egit.github.core.tests.RepositoryServiceTest)  Time elapsed: 0 s
19:47:44 [2021-02-06T00:47:44.068Z] editHookNullHook(org.eclipse.egit.github.core.tests.RepositoryServiceTest)  Time elapsed: 0 s
19:47:44 [2021-02-06T00:47:44.068Z] createOrgRepositoryNullOrg(org.eclipse.egit.github.core.tests.RepositoryServiceTest)  Time elapsed: 0 s
19:47:44 [2021-02-06T00:47:44.068Z] pageAllRepositoriesSince(org.eclipse.egit.github.core.tests.RepositoryServiceTest)  Time elapsed: 0.001 s
19:47:44 [2021-02-06T00:47:44.068Z] createOrgRepositoryEmptyOrg(org.eclipse.egit.github.core.tests.RepositoryServiceTest)  Time elapsed: 0 s
19:47:44 [2021-02-06T00:47:44.068Z] createOrgRepository(org.eclipse.egit.github.core.tests.RepositoryServiceTest)  Time elapsed: 0 s
19:47:44 [2021-02-06T00:47:44.068Z] getRepositoryProvider(org.eclipse.egit.github.core.tests.RepositoryServiceTest)  Time elapsed: 0 s
19:47:44 [2021-02-06T00:47:44.068Z] editRepositoryWithNullFields(org.eclipse.egit.github.core.tests.RepositoryServiceTest)  Time elapsed: 0 s
19:47:44 [2021-02-06T00:47:44.068Z] pageAllRepositories(org.eclipse.egit.github.core.tests.RepositoryServiceTest)  Time elapsed: 0.001 s
19:47:44 [2021-02-06T00:47:44.068Z] runMerge(org.eclipse.egit.github.core.tests.RepositoryServiceTest)  Time elapsed: 0 s
19:47:44 [2021-02-06T00:47:44.068Z] searchRepositoriesMatchingLanguage(org.eclipse.egit.github.core.tests.RepositoryServiceTest)  Time elapsed: 0.001 s
19:47:44 [2021-02-06T00:47:44.068Z] editRepositoryWithFields(org.eclipse.egit.github.core.tests.RepositoryServiceTest)  Time elapsed: 0 s
19:47:44 [2021-02-06T00:47:44.068Z] createHook(org.eclipse.egit.github.core.tests.RepositoryServiceTest)  Time elapsed: 0 s
19:47:44 [2021-02-06T00:47:44.068Z] getLanguages(org.eclipse.egit.github.core.tests.RepositoryServiceTest)  Time elapsed: 0 s
19:47:44 [2021-02-06T00:47:44.068Z] runHook(org.eclipse.egit.github.core.tests.RepositoryServiceTest)  Time elapsed: 0 s
19:47:44 [2021-02-06T00:47:44.068Z] editHook(org.eclipse.egit.github.core.tests.RepositoryServiceTest)  Time elapsed: 0 s
19:47:44 [2021-02-06T00:47:44.068Z] searchRepositories(org.eclipse.egit.github.core.tests.RepositoryServiceTest)  Time elapsed: 0 s
19:47:44 [2021-02-06T00:47:44.068Z] getRepository(org.eclipse.egit.github.core.tests.RepositoryServiceTest)  Time elapsed: 0 s
19:47:44 [2021-02-06T00:47:44.068Z] deleteHook(org.eclipse.egit.github.core.tests.RepositoryServiceTest)  Time elapsed: 0 s
19:47:44 [2021-02-06T00:47:44.068Z] getForks(org.eclipse.egit.github.core.tests.RepositoryServiceTest)  Time elapsed: 0 s
19:47:44 [2021-02-06T00:47:44.068Z] getHooks(org.eclipse.egit.github.core.tests.RepositoryServiceTest)  Time elapsed: 0.001 s
19:47:44 [2021-02-06T00:47:44.068Z] getBranches(org.eclipse.egit.github.core.tests.RepositoryServiceTest)  Time elapsed: 0 s
19:47:44 [2021-02-06T00:47:44.068Z] updateFields(org.eclipse.egit.github.core.tests.RepositoryTagTest)  Time elapsed: 0 s
19:47:44 [2021-02-06T00:47:44.068Z] defaultState(org.eclipse.egit.github.core.tests.RepositoryTagTest)  Time elapsed: 0 s
19:47:44 [2021-02-06T00:47:44.068Z] generateIdNullName(org.eclipse.egit.github.core.tests.RepositoryTest)  Time elapsed: 0 s
19:47:44 [2021-02-06T00:47:44.068Z] generateIdEmptyName(org.eclipse.egit.github.core.tests.RepositoryTest)  Time elapsed: 0 s
19:47:44 [2021-02-06T00:47:44.068Z] updateFields(org.eclipse.egit.github.core.tests.RepositoryTest)  Time elapsed: 0 s
19:47:44 [2021-02-06T00:47:44.068Z] fromJson(org.eclipse.egit.github.core.tests.RepositoryTest)  Time elapsed: 0.001 s
19:47:44 [2021-02-06T00:47:44.068Z] defaultState(org.eclipse.egit.github.core.tests.RepositoryTest)  Time elapsed: 0 s
19:47:44 [2021-02-06T00:47:44.068Z] generateIdEmptyOwnerLogin(org.eclipse.egit.github.core.tests.RepositoryTest)  Time elapsed: 0 s
19:47:44 [2021-02-06T00:47:44.068Z] generateId(org.eclipse.egit.github.core.tests.RepositoryTest)  Time elapsed: 0 s
19:47:44 [2021-02-06T00:47:44.068Z] generateIdNullOwner(org.eclipse.egit.github.core.tests.RepositoryTest)  Time elapsed: 0 s
19:47:44 [2021-02-06T00:47:44.068Z] generateIdNullOwnerLogin(org.eclipse.egit.github.core.tests.RepositoryTest)  Time elapsed: 0 s
19:47:44 [2021-02-06T00:47:44.068Z] requestErrorWithMessageField(org.eclipse.egit.github.core.tests.RequestErrorTest)  Time elapsed: 0.001 s
19:47:44 [2021-02-06T00:47:44.068Z] requestErrorWithErrorAndMessageField(org.eclipse.egit.github.core.tests.RequestErrorTest)  Time elapsed: 0 s
19:47:44 [2021-02-06T00:47:44.068Z] requestErrorWithErrorField(org.eclipse.egit.github.core.tests.RequestErrorTest)  Time elapsed: 0 s
19:47:44 [2021-02-06T00:47:44.068Z] invalidFieldValue(org.eclipse.egit.github.core.tests.RequestExceptionTest)  Time elapsed: 0.001 s
19:47:44 [2021-02-06T00:47:44.068Z] customCode(org.eclipse.egit.github.core.tests.RequestExceptionTest)  Time elapsed: 0 s
19:47:44 [2021-02-06T00:47:44.068Z] missingField(org.eclipse.egit.github.core.tests.RequestExceptionTest)  Time elapsed: 0 s
19:47:44 [2021-02-06T00:47:44.068Z] invalidField(org.eclipse.egit.github.core.tests.RequestExceptionTest)  Time elapsed: 0 s
19:47:44 [2021-02-06T00:47:44.068Z] existentField(org.eclipse.egit.github.core.tests.RequestExceptionTest)  Time elapsed: 0 s
19:47:44 [2021-02-06T00:47:44.068Z] errorField(org.eclipse.egit.github.core.tests.RequestExceptionTest)  Time elapsed: 0 s
19:47:44 [2021-02-06T00:47:44.068Z] updateFields(org.eclipse.egit.github.core.tests.SearchIssueTest)  Time elapsed: 0.001 s
19:47:44 [2021-02-06T00:47:44.068Z] defaultState(org.eclipse.egit.github.core.tests.SearchIssueTest)  Time elapsed: 0 s
19:47:44 [2021-02-06T00:47:44.068Z] createNullName(org.eclipse.egit.github.core.tests.SearchRepositoryTest)  Time elapsed: 0 s
19:47:44 [2021-02-06T00:47:44.068Z] defaultState(org.eclipse.egit.github.core.tests.SearchRepositoryTest)  Time elapsed: 0 s
19:47:44 [2021-02-06T00:47:44.068Z] createNullOwner(org.eclipse.egit.github.core.tests.SearchRepositoryTest)  Time elapsed: 0 s
19:47:44 [2021-02-06T00:47:44.068Z] equality(org.eclipse.egit.github.core.tests.SearchRepositoryTest)  Time elapsed: 0 s
19:47:44 [2021-02-06T00:47:44.068Z] getCreatedAtReferenceMutableObject(org.eclipse.egit.github.core.tests.SearchRepositoryTest)  Time elapsed: 0.001 s
19:47:44 [2021-02-06T00:47:44.068Z] createEmptyOwner(org.eclipse.egit.github.core.tests.SearchRepositoryTest)  Time elapsed: 0 s
19:47:44 [2021-02-06T00:47:44.068Z] getPushedAtReferenceMutableObject(org.eclipse.egit.github.core.tests.SearchRepositoryTest)  Time elapsed: 0 s
19:47:44 [2021-02-06T00:47:44.068Z] createEmptyName(org.eclipse.egit.github.core.tests.SearchRepositoryTest)  Time elapsed: 0 s
19:47:44 [2021-02-06T00:47:44.068Z] noGeneratedId(org.eclipse.egit.github.core.tests.SearchRepositoryTest)  Time elapsed: 0 s
19:47:44 [2021-02-06T00:47:44.068Z] updateFields(org.eclipse.egit.github.core.tests.ShaResourceTest)  Time elapsed: 0 s
19:47:44 [2021-02-06T00:47:44.068Z] defaultState(org.eclipse.egit.github.core.tests.ShaResourceTest)  Time elapsed: 0 s
19:47:44 [2021-02-06T00:47:44.068Z] getStarredNullName(org.eclipse.egit.github.core.tests.StargazerServiceTest)  Time elapsed: 0.001 s
19:47:44 [2021-02-06T00:47:44.068Z] constructor(org.eclipse.egit.github.core.tests.StargazerServiceTest)  Time elapsed: 0 s
19:47:44 [2021-02-06T00:47:44.068Z] pageCurrentStarred(org.eclipse.egit.github.core.tests.StargazerServiceTest)  Time elapsed: 0 s
19:47:44 [2021-02-06T00:47:44.068Z] getStarred(org.eclipse.egit.github.core.tests.StargazerServiceTest)  Time elapsed: 0 s
19:47:44 [2021-02-06T00:47:44.068Z] unstar(org.eclipse.egit.github.core.tests.StargazerServiceTest)  Time elapsed: 0.001 s
19:47:44 [2021-02-06T00:47:44.068Z] star(org.eclipse.egit.github.core.tests.StargazerServiceTest)  Time elapsed: 0 s
19:47:44 [2021-02-06T00:47:44.068Z] pageStargazers(org.eclipse.egit.github.core.tests.StargazerServiceTest)  Time elapsed: 0 s
19:47:44 [2021-02-06T00:47:44.068Z] getCurrentStarred(org.eclipse.egit.github.core.tests.StargazerServiceTest)  Time elapsed: 0 s
19:47:44 [2021-02-06T00:47:44.068Z] isStarring(org.eclipse.egit.github.core.tests.StargazerServiceTest)  Time elapsed: 0 s
19:47:44 [2021-02-06T00:47:44.068Z] getStarredEmptyName(org.eclipse.egit.github.core.tests.StargazerServiceTest)  Time elapsed: 0 s
19:47:44 [2021-02-06T00:47:44.068Z] pageStarred(org.eclipse.egit.github.core.tests.StargazerServiceTest)  Time elapsed: 0 s
19:47:44 [2021-02-06T00:47:44.068Z] getStargazers(org.eclipse.egit.github.core.tests.StargazerServiceTest)  Time elapsed: 0 s
19:47:44 [2021-02-06T00:47:44.068Z] updateFields(org.eclipse.egit.github.core.tests.TagTest)  Time elapsed: 0.001 s
19:47:44 [2021-02-06T00:47:44.068Z] defaultState(org.eclipse.egit.github.core.tests.TagTest)  Time elapsed: 0 s
19:47:44 [2021-02-06T00:47:44.068Z] updateFields(org.eclipse.egit.github.core.tests.TeamAddPayloadTest)  Time elapsed: 0 s
19:47:44 [2021-02-06T00:47:44.068Z] defaultState(org.eclipse.egit.github.core.tests.TeamAddPayloadTest)  Time elapsed: 0 s
19:47:44 [2021-02-06T00:47:44.068Z] getMembershipEmptyName(org.eclipse.egit.github.core.tests.TeamServiceTest)  Time elapsed: 0 s
19:47:44 [2021-02-06T00:47:44.068Z] getTeamsEmptyName(org.eclipse.egit.github.core.tests.TeamServiceTest)  Time elapsed: 0 s
19:47:44 [2021-02-06T00:47:44.068Z] createTeamWithRepos(org.eclipse.egit.github.core.tests.TeamServiceTest)  Time elapsed: 0 s
19:47:44 [2021-02-06T00:47:44.068Z] getMembership(org.eclipse.egit.github.core.tests.TeamServiceTest)  Time elapsed: 0.001 s
19:47:44 [2021-02-06T00:47:44.069Z] constructor(org.eclipse.egit.github.core.tests.TeamServiceTest)  Time elapsed: 0 s
19:47:44 [2021-02-06T00:47:44.069Z] removeMemberNullName(org.eclipse.egit.github.core.tests.TeamServiceTest)  Time elapsed: 0 s
19:47:44 [2021-02-06T00:47:44.069Z] createTeamEmptyOrg(org.eclipse.egit.github.core.tests.TeamServiceTest)  Time elapsed: 0 s
19:47:44 [2021-02-06T00:47:44.069Z] addMembership(org.eclipse.egit.github.core.tests.TeamServiceTest)  Time elapsed: 0 s
19:47:44 [2021-02-06T00:47:44.069Z] removeRepository(org.eclipse.egit.github.core.tests.TeamServiceTest)  Time elapsed: 0 s
19:47:44 [2021-02-06T00:47:44.069Z] isMemberEmptyName(org.eclipse.egit.github.core.tests.TeamServiceTest)  Time elapsed: 0 s
19:47:44 [2021-02-06T00:47:44.069Z] removeMember(org.eclipse.egit.github.core.tests.TeamServiceTest)  Time elapsed: 0 s
19:47:44 [2021-02-06T00:47:44.069Z] addMembershipEmptyName(org.eclipse.egit.github.core.tests.TeamServiceTest)  Time elapsed: 0 s
19:47:44 [2021-02-06T00:47:44.069Z] getRepositories(org.eclipse.egit.github.core.tests.TeamServiceTest)  Time elapsed: 0 s
19:47:44 [2021-02-06T00:47:44.069Z] addMembershipNullName(org.eclipse.egit.github.core.tests.TeamServiceTest)  Time elapsed: 0 s
19:47:44 [2021-02-06T00:47:44.069Z] removeMembershipEmptyName(org.eclipse.egit.github.core.tests.TeamServiceTest)  Time elapsed: 0 s
19:47:44 [2021-02-06T00:47:44.069Z] getAllTeams(org.eclipse.egit.github.core.tests.TeamServiceTest)  Time elapsed: 0.001 s
19:47:44 [2021-02-06T00:47:44.069Z] isMember(org.eclipse.egit.github.core.tests.TeamServiceTest)  Time elapsed: 0 s
19:47:44 [2021-02-06T00:47:44.069Z] removeMembership(org.eclipse.egit.github.core.tests.TeamServiceTest)  Time elapsed: 0 s
19:47:44 [2021-02-06T00:47:44.069Z] getMembershipNullName(org.eclipse.egit.github.core.tests.TeamServiceTest)  Time elapsed: 0 s
19:47:44 [2021-02-06T00:47:44.069Z] createTeamNullTeam(org.eclipse.egit.github.core.tests.TeamServiceTest)  Time elapsed: 0.001 s
19:47:44 [2021-02-06T00:47:44.069Z] addMember(org.eclipse.egit.github.core.tests.TeamServiceTest)  Time elapsed: 0 s
19:47:44 [2021-02-06T00:47:44.069Z] isRepository(org.eclipse.egit.github.core.tests.TeamServiceTest)  Time elapsed: 0 s
19:47:44 [2021-02-06T00:47:44.069Z] getTeam(org.eclipse.egit.github.core.tests.TeamServiceTest)  Time elapsed: 0 s
19:47:44 [2021-02-06T00:47:44.069Z] addMemberNullName(org.eclipse.egit.github.core.tests.TeamServiceTest)  Time elapsed: 0 s
19:47:44 [2021-02-06T00:47:44.069Z] isMemberNullName(org.eclipse.egit.github.core.tests.TeamServiceTest)  Time elapsed: 0 s
19:47:44 [2021-02-06T00:47:44.069Z] removeMemberEmptyName(org.eclipse.egit.github.core.tests.TeamServiceTest)  Time elapsed: 0 s
19:47:44 [2021-02-06T00:47:44.069Z] createTeam(org.eclipse.egit.github.core.tests.TeamServiceTest)  Time elapsed: 0.001 s
19:47:44 [2021-02-06T00:47:44.069Z] editTeamNullTeam(org.eclipse.egit.github.core.tests.TeamServiceTest)  Time elapsed: 0 s
19:47:44 [2021-02-06T00:47:44.069Z] createTeamNullOrg(org.eclipse.egit.github.core.tests.TeamServiceTest)  Time elapsed: 0 s
19:47:44 [2021-02-06T00:47:44.069Z] editTeam(org.eclipse.egit.github.core.tests.TeamServiceTest)  Time elapsed: 0 s
19:47:44 [2021-02-06T00:47:44.069Z] getRepositoryTeams(org.eclipse.egit.github.core.tests.TeamServiceTest)  Time elapsed: 0 s
19:47:44 [2021-02-06T00:47:44.069Z] addMemberEmptyName(org.eclipse.egit.github.core.tests.TeamServiceTest)  Time elapsed: 0 s
19:47:44 [2021-02-06T00:47:44.069Z] deleteTeam(org.eclipse.egit.github.core.tests.TeamServiceTest)  Time elapsed: 0.001 s
19:47:44 [2021-02-06T00:47:44.069Z] removeMembershipNullName(org.eclipse.egit.github.core.tests.TeamServiceTest)  Time elapsed: 0 s
19:47:44 [2021-02-06T00:47:44.069Z] getTeamsNullName(org.eclipse.egit.github.core.tests.TeamServiceTest)  Time elapsed: 0 s
19:47:44 [2021-02-06T00:47:44.069Z] getTeams(org.eclipse.egit.github.core.tests.TeamServiceTest)  Time elapsed: 0 s
19:47:44 [2021-02-06T00:47:44.069Z] addRepository(org.eclipse.egit.github.core.tests.TeamServiceTest)  Time elapsed: 0 s
19:47:44 [2021-02-06T00:47:44.069Z] getMembers(org.eclipse.egit.github.core.tests.TeamServiceTest)  Time elapsed: 0.001 s
19:47:44 [2021-02-06T00:47:44.069Z] updateFields(org.eclipse.egit.github.core.tests.TeamTest)  Time elapsed: 0 s
19:47:44 [2021-02-06T00:47:44.069Z] defaultState(org.eclipse.egit.github.core.tests.TeamTest)  Time elapsed: 0 s
19:47:44 [2021-02-06T00:47:44.069Z] updateFields(org.eclipse.egit.github.core.tests.TreeEntryTest)  Time elapsed: 0.001 s
19:47:44 [2021-02-06T00:47:44.069Z] defaultState(org.eclipse.egit.github.core.tests.TreeEntryTest)  Time elapsed: 0 s
19:47:44 [2021-02-06T00:47:44.069Z] updateFields(org.eclipse.egit.github.core.tests.TreeTest)  Time elapsed: 0 s
19:47:44 [2021-02-06T00:47:44.069Z] defaultState(org.eclipse.egit.github.core.tests.TreeTest)  Time elapsed: 0 s
19:47:44 [2021-02-06T00:47:44.069Z] updateFields(org.eclipse.egit.github.core.tests.TypedResourceTest)  Time elapsed: 0 s
19:47:44 [2021-02-06T00:47:44.069Z] defaultState(org.eclipse.egit.github.core.tests.TypedResourceTest)  Time elapsed: 0 s
19:47:44 [2021-02-06T00:47:44.069Z] generateSshUrl(org.eclipse.egit.github.core.tests.UrlUtilsTest)  Time elapsed: 0 s
19:47:44 [2021-02-06T00:47:44.069Z] generateReadOnlyUrl(org.eclipse.egit.github.core.tests.UrlUtilsTest)  Time elapsed: 0 s
19:47:44 [2021-02-06T00:47:44.069Z] encode(org.eclipse.egit.github.core.tests.UrlUtilsTest)  Time elapsed: 0 s
19:47:44 [2021-02-06T00:47:44.069Z] generateHttpsUrl(org.eclipse.egit.github.core.tests.UrlUtilsTest)  Time elapsed: 0 s
19:47:44 [2021-02-06T00:47:44.069Z] updateFields(org.eclipse.egit.github.core.tests.UserPlanTest)  Time elapsed: 0 s
19:47:44 [2021-02-06T00:47:44.069Z] defaultState(org.eclipse.egit.github.core.tests.UserPlanTest)  Time elapsed: 0 s
19:47:44 [2021-02-06T00:47:44.069Z] addEmailEmptyEmails(org.eclipse.egit.github.core.tests.UserServiceTest)  Time elapsed: 0.001 s
19:47:44 [2021-02-06T00:47:44.069Z] removeEmailNullEmails(org.eclipse.egit.github.core.tests.UserServiceTest)  Time elapsed: 0 s
19:47:44 [2021-02-06T00:47:44.069Z] isFollowingEmptyUser(org.eclipse.egit.github.core.tests.UserServiceTest)  Time elapsed: 0 s
19:47:44 [2021-02-06T00:47:44.069Z] editKey(org.eclipse.egit.github.core.tests.UserServiceTest)  Time elapsed: 0 s
19:47:44 [2021-02-06T00:47:44.069Z] unfollowNullUser(org.eclipse.egit.github.core.tests.UserServiceTest)  Time elapsed: 0 s
19:47:44 [2021-02-06T00:47:44.069Z] constructor(org.eclipse.egit.github.core.tests.UserServiceTest)  Time elapsed: 0 s
19:47:44 [2021-02-06T00:47:44.069Z] unfollowEmptyUser(org.eclipse.egit.github.core.tests.UserServiceTest)  Time elapsed: 0 s
19:47:44 [2021-02-06T00:47:44.069Z] addEmailNullEmails(org.eclipse.egit.github.core.tests.UserServiceTest)  Time elapsed: 0 s
19:47:44 [2021-02-06T00:47:44.069Z] follow(org.eclipse.egit.github.core.tests.UserServiceTest)  Time elapsed: 0 s
19:47:44 [2021-02-06T00:47:44.069Z] addEmail(org.eclipse.egit.github.core.tests.UserServiceTest)  Time elapsed: 0 s
19:47:44 [2021-02-06T00:47:44.069Z] getKey(org.eclipse.egit.github.core.tests.UserServiceTest)  Time elapsed: 0.001 s
19:47:44 [2021-02-06T00:47:44.069Z] getFollowingNullName(org.eclipse.egit.github.core.tests.UserServiceTest)  Time elapsed: 0 s
19:47:44 [2021-02-06T00:47:44.069Z] getUserNullName(org.eclipse.egit.github.core.tests.UserServiceTest)  Time elapsed: 0 s
19:47:44 [2021-02-06T00:47:44.069Z] getFollowingEmptyName(org.eclipse.egit.github.core.tests.UserServiceTest)  Time elapsed: 0 s
19:47:44 [2021-02-06T00:47:44.069Z] followEmptyUser(org.eclipse.egit.github.core.tests.UserServiceTest)  Time elapsed: 0 s
19:47:44 [2021-02-06T00:47:44.069Z] getUserEmptyName(org.eclipse.egit.github.core.tests.UserServiceTest)  Time elapsed: 0 s
19:47:44 [2021-02-06T00:47:44.069Z] followNullUser(org.eclipse.egit.github.core.tests.UserServiceTest)  Time elapsed: 0 s
19:47:44 [2021-02-06T00:47:44.069Z] unfollow(org.eclipse.egit.github.core.tests.UserServiceTest)  Time elapsed: 0 s
19:47:44 [2021-02-06T00:47:44.069Z] deleteKey(org.eclipse.egit.github.core.tests.UserServiceTest)  Time elapsed: 0 s
19:47:44 [2021-02-06T00:47:44.069Z] removeEmail(org.eclipse.egit.github.core.tests.UserServiceTest)  Time elapsed: 0 s
19:47:44 [2021-02-06T00:47:44.069Z] isFollowingNullUser(org.eclipse.egit.github.core.tests.UserServiceTest)  Time elapsed: 0 s
19:47:44 [2021-02-06T00:47:44.069Z] getKeys(org.eclipse.egit.github.core.tests.UserServiceTest)  Time elapsed: 0.001 s
19:47:44 [2021-02-06T00:47:44.069Z] getUser(org.eclipse.egit.github.core.tests.UserServiceTest)  Time elapsed: 0 s
19:47:44 [2021-02-06T00:47:44.069Z] editKeyNullKey(org.eclipse.egit.github.core.tests.UserServiceTest)  Time elapsed: 0 s
19:47:44 [2021-02-06T00:47:44.069Z] getCurrentUser(org.eclipse.egit.github.core.tests.UserServiceTest)  Time elapsed: 0 s
19:47:44 [2021-02-06T00:47:44.069Z] getEmails(org.eclipse.egit.github.core.tests.UserServiceTest)  Time elapsed: 0.001 s
19:47:44 [2021-02-06T00:47:44.069Z] getCurrentFollowers(org.eclipse.egit.github.core.tests.UserServiceTest)  Time elapsed: 0 s
19:47:44 [2021-02-06T00:47:44.069Z] getCurrentFollowing(org.eclipse.egit.github.core.tests.UserServiceTest)  Time elapsed: 0 s
19:47:44 [2021-02-06T00:47:44.069Z] createKey(org.eclipse.egit.github.core.tests.UserServiceTest)  Time elapsed: 0 s
19:47:44 [2021-02-06T00:47:44.069Z] getFollowersNullName(org.eclipse.egit.github.core.tests.UserServiceTest)  Time elapsed: 0 s
19:47:44 [2021-02-06T00:47:44.069Z] getFollowers(org.eclipse.egit.github.core.tests.UserServiceTest)  Time elapsed: 0.001 s
19:47:44 [2021-02-06T00:47:44.069Z] getFollowing(org.eclipse.egit.github.core.tests.UserServiceTest)  Time elapsed: 0 s
19:47:44 [2021-02-06T00:47:44.070Z] editUserNullUser(org.eclipse.egit.github.core.tests.UserServiceTest)  Time elapsed: 0 s
19:47:44 [2021-02-06T00:47:44.070Z] editUser(org.eclipse.egit.github.core.tests.UserServiceTest)  Time elapsed: 0 s
19:47:44 [2021-02-06T00:47:44.070Z] removeEmailEmptyEmails(org.eclipse.egit.github.core.tests.UserServiceTest)  Time elapsed: 0 s
19:47:44 [2021-02-06T00:47:44.070Z] isFollowing(org.eclipse.egit.github.core.tests.UserServiceTest)  Time elapsed: 0 s
19:47:44 [2021-02-06T00:47:44.070Z] getFollowersEmptyName(org.eclipse.egit.github.core.tests.UserServiceTest)  Time elapsed: 0 s
19:47:44 [2021-02-06T00:47:44.070Z] updateFields(org.eclipse.egit.github.core.tests.UserTest)  Time elapsed: 0 s
19:47:44 [2021-02-06T00:47:44.070Z] defaultState(org.eclipse.egit.github.core.tests.UserTest)  Time elapsed: 0 s
19:47:44 [2021-02-06T00:47:44.070Z] updateFields(org.eclipse.egit.github.core.tests.WatchPayloadTest)  Time elapsed: 0 s
19:47:44 [2021-02-06T00:47:44.070Z] defaultState(org.eclipse.egit.github.core.tests.WatchPayloadTest)  Time elapsed: 0 s
19:47:44 [2021-02-06T00:47:44.070Z] 
19:47:44 [2021-02-06T00:47:44.070Z] Results:
19:47:44 [2021-02-06T00:47:44.070Z] 
19:47:44 [2021-02-06T00:47:44.070Z] Tests run: 787, Failures: 0, Errors: 0, Skipped: 0
19:47:44 [2021-02-06T00:47:44.070Z] 
19:47:44 [2021-02-06T00:47:44.635Z] 00:47:44 [INFO] All tests passed!
19:47:44 [2021-02-06T00:47:44.635Z] 00:47:44 [INFO] 
19:47:44 [2021-02-06T00:47:44.635Z] 00:47:44 [INFO] >>> spotbugs-maven-plugin:3.1.11:check (default) > :spotbugs @ org.eclipse.egit.github.core.tests >>>
19:47:44 [2021-02-06T00:47:44.635Z] 00:47:44 [INFO] 
19:47:44 [2021-02-06T00:47:44.635Z] 00:47:44 [INFO] --- spotbugs-maven-plugin:3.1.11:spotbugs (spotbugs) @ org.eclipse.egit.github.core.tests ---
19:47:44 [2021-02-06T00:47:44.635Z] 00:47:44 [INFO] Fork Value is true
19:47:49 [2021-02-06T00:47:49.918Z]      [java] Warnings generated: 3
19:47:49 [2021-02-06T00:47:49.918Z] 00:47:49 [INFO] Done SpotBugs Analysis....
19:47:49 [2021-02-06T00:47:49.918Z] 00:47:49 [INFO] 
19:47:49 [2021-02-06T00:47:49.918Z] 00:47:49 [INFO] <<< spotbugs-maven-plugin:3.1.11:check (default) < :spotbugs @ org.eclipse.egit.github.core.tests <<<
19:47:49 [2021-02-06T00:47:49.918Z] 00:47:49 [INFO] 
19:47:49 [2021-02-06T00:47:49.918Z] 00:47:49 [INFO] 
19:47:49 [2021-02-06T00:47:49.918Z] 00:47:49 [INFO] --- spotbugs-maven-plugin:3.1.11:check (default) @ org.eclipse.egit.github.core.tests ---
19:47:49 [2021-02-06T00:47:49.918Z] 00:47:49 [INFO] BugInstance size is 3
19:47:49 [2021-02-06T00:47:49.918Z] 00:47:49 [INFO] Error size is 0
19:47:49 [2021-02-06T00:47:49.918Z] 00:47:49 [INFO] Total bugs: 3
19:47:49 [2021-02-06T00:47:49.918Z] 00:47:49 [ERROR] Found reliance on default encoding in org.eclipse.egit.github.core.tests.EncodingUtilsTest.encodeDecode(): new String(byte[]) [org.eclipse.egit.github.core.tests.EncodingUtilsTest] At EncodingUtilsTest.java:[line 40] DM_DEFAULT_ENCODING
19:47:49 [2021-02-06T00:47:49.918Z] 00:47:49 [ERROR] Found reliance on default encoding in org.eclipse.egit.github.core.tests.EncodingUtilsTest.encodeDecode(): String.getBytes() [org.eclipse.egit.github.core.tests.EncodingUtilsTest] At EncodingUtilsTest.java:[line 33] DM_DEFAULT_ENCODING
19:47:49 [2021-02-06T00:47:49.918Z] 00:47:49 [ERROR] Found reliance on default encoding in org.eclipse.egit.github.core.tests.live.CommitTest.readLine(InputStream, int): new java.util.Scanner(InputStream) [org.eclipse.egit.github.core.tests.live.CommitTest] At CommitTest.java:[line 176] DM_DEFAULT_ENCODING
19:47:49 [2021-02-06T00:47:49.918Z] 00:47:49 [INFO] 
19:47:49 [2021-02-06T00:47:49.918Z] 
19:47:49 [2021-02-06T00:47:49.918Z] 
19:47:49 [2021-02-06T00:47:49.918Z] To see bug detail using the Spotbugs GUI, use the following command "mvn spotbugs:gui"
19:47:49 [2021-02-06T00:47:49.918Z] 
19:47:49 [2021-02-06T00:47:49.918Z] 
19:47:49 [2021-02-06T00:47:49.918Z] 
19:47:49 [2021-02-06T00:47:49.918Z] 00:47:49 [INFO] 
19:47:49 [2021-02-06T00:47:49.918Z] 00:47:49 [INFO] >>> maven-pmd-plugin:3.11.0:cpd-check (default) > :cpd @ org.eclipse.egit.github.core.tests >>>
19:47:49 [2021-02-06T00:47:49.918Z] 00:47:49 [INFO] 
19:47:49 [2021-02-06T00:47:49.918Z] 00:47:49 [INFO] --- maven-pmd-plugin:3.11.0:cpd (cpd) @ org.eclipse.egit.github.core.tests ---
19:47:49 [2021-02-06T00:47:49.918Z] 00:47:49 [INFO] 
19:47:49 [2021-02-06T00:47:49.918Z] 00:47:49 [INFO] <<< maven-pmd-plugin:3.11.0:cpd-check (default) < :cpd @ org.eclipse.egit.github.core.tests <<<
19:47:49 [2021-02-06T00:47:49.918Z] 00:47:49 [INFO] 
19:47:49 [2021-02-06T00:47:49.918Z] 00:47:49 [INFO] 
19:47:49 [2021-02-06T00:47:49.918Z] 00:47:49 [INFO] --- maven-pmd-plugin:3.11.0:cpd-check (default) @ org.eclipse.egit.github.core.tests ---
19:47:49 [2021-02-06T00:47:49.918Z] 00:47:49 [INFO] You have 3 CPD duplications. For more details see: /home/jenkins/agent/workspace/egit-github/repo/org.eclipse.egit.github.core.tests/target/cpd.xml
19:47:49 [2021-02-06T00:47:49.918Z] 00:47:49 [INFO] 
19:47:49 [2021-02-06T00:47:49.918Z] 00:47:49 [INFO] --- tycho-pack200a-plugin:1.7.0:normalize (pack200-normalize) @ org.eclipse.egit.github.core.tests ---
19:47:49 [2021-02-06T00:47:49.918Z] 00:47:49 [INFO] Pack200 normalizing jar /home/jenkins/agent/workspace/egit-github/repo/org.eclipse.egit.github.core.tests/target/org.eclipse.egit.github.core.tests-5.11.0-SNAPSHOT.jar
19:47:49 [2021-02-06T00:47:49.918Z] 00:47:49 [INFO] 
19:47:49 [2021-02-06T00:47:49.918Z] 00:47:49 [INFO] --- eclipse-jarsigner-plugin:1.1.5:sign (sign) @ org.eclipse.egit.github.core.tests ---
19:47:49 [2021-02-06T00:47:49.918Z] 00:47:49 [INFO] Signing jar: /home/jenkins/agent/workspace/egit-github/repo/org.eclipse.egit.github.core.tests/target/org.eclipse.egit.github.core.tests-5.11.0-SNAPSHOT.jar
19:47:51 [2021-02-06T00:47:51.292Z] 00:47:50 [INFO] 
19:47:51 [2021-02-06T00:47:51.292Z] 00:47:50 [INFO] --- tycho-pack200b-plugin:1.7.0:pack (pack200-pack) @ org.eclipse.egit.github.core.tests ---
19:47:51 [2021-02-06T00:47:51.292Z] 00:47:50 [INFO] Pack200 packing jar /home/jenkins/agent/workspace/egit-github/repo/org.eclipse.egit.github.core.tests/target/org.eclipse.egit.github.core.tests-5.11.0-SNAPSHOT.jar
19:47:51 [2021-02-06T00:47:51.292Z] 00:47:51 [INFO] 
19:47:51 [2021-02-06T00:47:51.292Z] 00:47:51 [INFO] --- tycho-p2-plugin:1.7.0:p2-metadata (p2-metadata) @ org.eclipse.egit.github.core.tests ---
19:47:51 [2021-02-06T00:47:51.292Z] 00:47:51 [INFO] 
19:47:51 [2021-02-06T00:47:51.292Z] 00:47:51 [INFO] --- maven-install-plugin:2.3.1:install (default-install) @ org.eclipse.egit.github.core.tests ---
19:47:51 [2021-02-06T00:47:51.292Z] 00:47:51 [INFO] Installing /home/jenkins/agent/workspace/egit-github/repo/org.eclipse.egit.github.core.tests/target/org.eclipse.egit.github.core.tests-5.11.0-SNAPSHOT.jar to /home/jenkins/agent/workspace/egit-github/.repository/org/eclipse/mylyn/github/org.eclipse.egit.github.core.tests/5.11.0-SNAPSHOT/org.eclipse.egit.github.core.tests-5.11.0-SNAPSHOT.jar
19:47:51 [2021-02-06T00:47:51.292Z] 00:47:51 [INFO] Installing /home/jenkins/agent/workspace/egit-github/repo/org.eclipse.egit.github.core.tests/pom.xml to /home/jenkins/agent/workspace/egit-github/.repository/org/eclipse/mylyn/github/org.eclipse.egit.github.core.tests/5.11.0-SNAPSHOT/org.eclipse.egit.github.core.tests-5.11.0-SNAPSHOT.pom
19:47:51 [2021-02-06T00:47:51.292Z] 00:47:51 [INFO] Installing /home/jenkins/agent/workspace/egit-github/repo/org.eclipse.egit.github.core.tests/target/org.eclipse.egit.github.core.tests-5.11.0-SNAPSHOT.jar.pack.gz to /home/jenkins/agent/workspace/egit-github/.repository/org/eclipse/mylyn/github/org.eclipse.egit.github.core.tests/5.11.0-SNAPSHOT/org.eclipse.egit.github.core.tests-5.11.0-SNAPSHOT-pack200.jar.pack.gz
19:47:51 [2021-02-06T00:47:51.292Z] 00:47:51 [INFO] Installing /home/jenkins/agent/workspace/egit-github/repo/org.eclipse.egit.github.core.tests/target/p2content.xml to /home/jenkins/agent/workspace/egit-github/.repository/org/eclipse/mylyn/github/org.eclipse.egit.github.core.tests/5.11.0-SNAPSHOT/org.eclipse.egit.github.core.tests-5.11.0-SNAPSHOT-p2metadata.xml
19:47:51 [2021-02-06T00:47:51.292Z] 00:47:51 [INFO] Installing /home/jenkins/agent/workspace/egit-github/repo/org.eclipse.egit.github.core.tests/target/p2artifacts.xml to /home/jenkins/agent/workspace/egit-github/.repository/org/eclipse/mylyn/github/org.eclipse.egit.github.core.tests/5.11.0-SNAPSHOT/org.eclipse.egit.github.core.tests-5.11.0-SNAPSHOT-p2artifacts.xml
19:47:51 [2021-02-06T00:47:51.292Z] 00:47:51 [INFO] 
19:47:51 [2021-02-06T00:47:51.292Z] 00:47:51 [INFO] --- tycho-p2-plugin:1.7.0:update-local-index (default-update-local-index) @ org.eclipse.egit.github.core.tests ---
19:47:51 [2021-02-06T00:47:51.292Z] 00:47:51 [INFO] 
19:47:51 [2021-02-06T00:47:51.292Z] 00:47:51 [INFO] ------< org.eclipse.mylyn.github:org.eclipse.mylyn.github.tests >-------
19:47:51 [2021-02-06T00:47:51.292Z] 00:47:51 [INFO] Building Eclipse EGit Mylyn GitHub Test Plug-in 5.11.0-SNAPSHOT   [9/10]
19:47:51 [2021-02-06T00:47:51.292Z] 00:47:51 [INFO] ------------------------[ eclipse-test-plugin ]-------------------------
19:47:51 [2021-02-06T00:47:51.292Z] 00:47:51 [INFO] 
19:47:51 [2021-02-06T00:47:51.292Z] 00:47:51 [INFO] --- maven-clean-plugin:2.5:clean (default-clean) @ org.eclipse.mylyn.github.tests ---
19:47:51 [2021-02-06T00:47:51.292Z] 00:47:51 [INFO] 
19:47:51 [2021-02-06T00:47:51.292Z] 00:47:51 [INFO] --- tycho-packaging-plugin:1.7.0:build-qualifier (default-build-qualifier) @ org.eclipse.mylyn.github.tests ---
19:47:51 [2021-02-06T00:47:51.292Z] 00:47:51 [INFO] The project's OSGi version is 5.11.0.202102060045
19:47:51 [2021-02-06T00:47:51.292Z] 00:47:51 [INFO] 
19:47:51 [2021-02-06T00:47:51.292Z] 00:47:51 [INFO] --- tycho-packaging-plugin:1.7.0:validate-id (default-validate-id) @ org.eclipse.mylyn.github.tests ---
19:47:51 [2021-02-06T00:47:51.292Z] 00:47:51 [INFO] 
19:47:51 [2021-02-06T00:47:51.292Z] 00:47:51 [INFO] --- tycho-packaging-plugin:1.7.0:validate-version (default-validate-version) @ org.eclipse.mylyn.github.tests ---
19:47:51 [2021-02-06T00:47:51.292Z] 00:47:51 [INFO] 
19:47:51 [2021-02-06T00:47:51.292Z] 00:47:51 [INFO] --- maven-enforcer-plugin:3.0.0-M2:enforce (enforce-maven) @ org.eclipse.mylyn.github.tests ---
19:47:51 [2021-02-06T00:47:51.292Z] 00:47:51 [INFO] 
19:47:51 [2021-02-06T00:47:51.292Z] 00:47:51 [INFO] --- maven-resources-plugin:3.1.0:resources (default-resources) @ org.eclipse.mylyn.github.tests ---
19:47:51 [2021-02-06T00:47:51.292Z] 00:47:51 [INFO] Using 'UTF-8' encoding to copy filtered resources.
19:47:51 [2021-02-06T00:47:51.292Z] 00:47:51 [INFO] skip non existing resourceDirectory /home/jenkins/agent/workspace/egit-github/repo/org.eclipse.mylyn.github.tests/src/main/resources
19:47:51 [2021-02-06T00:47:51.292Z] 00:47:51 [INFO] 
19:47:51 [2021-02-06T00:47:51.292Z] 00:47:51 [INFO] --- tycho-compiler-plugin:1.7.0:compile (default-compile) @ org.eclipse.mylyn.github.tests ---
19:47:51 [2021-02-06T00:47:51.292Z] 00:47:51 [INFO] Compiling 1 source file to /home/jenkins/agent/workspace/egit-github/repo/org.eclipse.mylyn.github.tests/target/classes
19:47:51 [2021-02-06T00:47:51.292Z] 00:47:51 [INFO] 
19:47:51 [2021-02-06T00:47:51.292Z] 00:47:51 [INFO] --- maven-resources-plugin:3.1.0:testResources (default-testResources) @ org.eclipse.mylyn.github.tests ---
19:47:51 [2021-02-06T00:47:51.292Z] 00:47:51 [INFO] Using 'UTF-8' encoding to copy filtered resources.
19:47:51 [2021-02-06T00:47:51.292Z] 00:47:51 [INFO] skip non existing resourceDirectory /home/jenkins/agent/workspace/egit-github/repo/org.eclipse.mylyn.github.tests/src/test/resources
19:47:51 [2021-02-06T00:47:51.292Z] 00:47:51 [INFO] 
19:47:51 [2021-02-06T00:47:51.292Z] 00:47:51 [INFO] --- target-platform-configuration:1.7.0:target-platform (default-target-platform) @ org.eclipse.mylyn.github.tests ---
19:47:51 [2021-02-06T00:47:51.292Z] 00:47:51 [INFO] 
19:47:51 [2021-02-06T00:47:51.292Z] 00:47:51 [INFO] --- tycho-packaging-plugin:1.7.0:package-plugin (default-package-plugin) @ org.eclipse.mylyn.github.tests ---
19:47:51 [2021-02-06T00:47:51.292Z] 00:47:51 [INFO] Building jar: /home/jenkins/agent/workspace/egit-github/repo/org.eclipse.mylyn.github.tests/target/org.eclipse.mylyn.github.tests-5.11.0-SNAPSHOT.jar
19:47:51 [2021-02-06T00:47:51.292Z] 00:47:51 [INFO] 
19:47:51 [2021-02-06T00:47:51.293Z] 00:47:51 [INFO] --- tycho-p2-plugin:1.7.0:p2-metadata-default (default-p2-metadata-default) @ org.eclipse.mylyn.github.tests ---
19:47:51 [2021-02-06T00:47:51.293Z] 00:47:51 [INFO] 
19:47:51 [2021-02-06T00:47:51.293Z] 00:47:51 [INFO] --- tycho-surefire-plugin:1.7.0:test (default-test) @ org.eclipse.mylyn.github.tests ---
19:47:51 [2021-02-06T00:47:51.550Z] 00:47:51 [INFO] Executing Test Runtime with timeout 0, logs (if any) will be placed at: /home/jenkins/agent/workspace/egit-github/repo/org.eclipse.mylyn.github.tests/target/work/data/.metadata/.log
19:47:51 [2021-02-06T00:47:51.550Z] 00:47:51 [INFO] Command line:
19:47:51 [2021-02-06T00:47:51.550Z] 	[/opt/tools/java/adoptopenjdk/hotspot-jdk-8/1.8.0_252-b09/jre/bin/java, -Dosgi.noShutdown=false, -Dosgi.os=linux, -Dosgi.ws=gtk, -Dosgi.arch=x86_64, -Declipse.consoleLog=true, -Xmx1024m, -Dorg.eclipse.swtbot.search.timeout=30000, -Dorg.eclipse.swtbot.screenshots.dir=target/screenshots, -Dosgi.clean=true, -jar, /home/jenkins/agent/workspace/egit-github/.repository/p2/osgi/bundle/org.eclipse.equinox.launcher/1.4.0.v20161219-1356/org.eclipse.equinox.launcher-1.4.0.v20161219-1356.jar, -data, /home/jenkins/agent/workspace/egit-github/repo/org.eclipse.mylyn.github.tests/target/work/data, -install, /home/jenkins/agent/workspace/egit-github/repo/org.eclipse.mylyn.github.tests/target/work, -configuration, /home/jenkins/agent/workspace/egit-github/repo/org.eclipse.mylyn.github.tests/target/work/configuration, -application, org.eclipse.tycho.surefire.osgibooter.uitest, -testproperties, /home/jenkins/agent/workspace/egit-github/repo/org.eclipse.mylyn.github.tests/target/surefire.properties, -testApplication, org.eclipse.ui.ide.workbench, -nouithread]
19:47:53 [2021-02-06T00:47:53.489Z] !SESSION 2021-02-06 00:47:51.561 -----------------------------------------------
19:47:53 [2021-02-06T00:47:53.489Z] eclipse.buildId=unknown
19:47:53 [2021-02-06T00:47:53.489Z] java.version=1.8.0_252
19:47:53 [2021-02-06T00:47:53.489Z] java.vendor=AdoptOpenJDK
19:47:53 [2021-02-06T00:47:53.489Z] BootLoader constants: OS=linux, ARCH=x86_64, WS=gtk, NL=en_US
19:47:53 [2021-02-06T00:47:53.489Z] Framework arguments:  -application org.eclipse.tycho.surefire.osgibooter.uitest -testproperties /home/jenkins/agent/workspace/egit-github/repo/org.eclipse.mylyn.github.tests/target/surefire.properties -testApplication org.eclipse.ui.ide.workbench -nouithread
19:47:53 [2021-02-06T00:47:53.489Z] Command-line arguments:  -data /home/jenkins/agent/workspace/egit-github/repo/org.eclipse.mylyn.github.tests/target/work/data -application org.eclipse.tycho.surefire.osgibooter.uitest -testproperties /home/jenkins/agent/workspace/egit-github/repo/org.eclipse.mylyn.github.tests/target/surefire.properties -testApplication org.eclipse.ui.ide.workbench -nouithread
19:47:53 [2021-02-06T00:47:53.489Z] 
19:47:53 [2021-02-06T00:47:53.489Z] !ENTRY org.eclipse.jdt.launching.macosx 4 0 2021-02-06 00:47:52.933
19:47:53 [2021-02-06T00:47:53.489Z] !MESSAGE FrameworkEvent ERROR
19:47:53 [2021-02-06T00:47:53.489Z] !STACK 0
19:47:53 [2021-02-06T00:47:53.489Z] org.osgi.framework.BundleException: Could not resolve module: org.eclipse.jdt.launching.macosx [270]
19:47:53 [2021-02-06T00:47:53.489Z]   Unresolved requirement: Require-Capability: eclipse.platform; filter:="(osgi.os=macosx)"
19:47:53 [2021-02-06T00:47:53.489Z] 
19:47:53 [2021-02-06T00:47:53.489Z] 	at org.eclipse.osgi.container.Module.start(Module.java:444)
19:47:53 [2021-02-06T00:47:53.489Z] 	at org.eclipse.osgi.container.ModuleContainer$ContainerStartLevel.incStartLevel(ModuleContainer.java:1634)
19:47:53 [2021-02-06T00:47:53.489Z] 	at org.eclipse.osgi.container.ModuleContainer$ContainerStartLevel.incStartLevel(ModuleContainer.java:1613)
19:47:53 [2021-02-06T00:47:53.489Z] 	at org.eclipse.osgi.container.ModuleContainer$ContainerStartLevel.doContainerStartLevel(ModuleContainer.java:1585)
19:47:53 [2021-02-06T00:47:53.489Z] 	at org.eclipse.osgi.container.ModuleContainer$ContainerStartLevel.dispatchEvent(ModuleContainer.java:1528)
19:47:53 [2021-02-06T00:47:53.490Z] 	at org.eclipse.osgi.container.ModuleContainer$ContainerStartLevel.dispatchEvent(ModuleContainer.java:1)
19:47:53 [2021-02-06T00:47:53.490Z] 	at org.eclipse.osgi.framework.eventmgr.EventManager.dispatchEvent(EventManager.java:230)
19:47:53 [2021-02-06T00:47:53.490Z] 	at org.eclipse.osgi.framework.eventmgr.EventManager$EventThread.run(EventManager.java:340)
19:47:53 [2021-02-06T00:47:53.490Z] 
19:47:53 [2021-02-06T00:47:53.490Z] !ENTRY org.eclipse.jdt.launching.ui.macosx 4 0 2021-02-06 00:47:52.934
19:47:53 [2021-02-06T00:47:53.490Z] !MESSAGE FrameworkEvent ERROR
19:47:53 [2021-02-06T00:47:53.490Z] !STACK 0
19:47:53 [2021-02-06T00:47:53.490Z] org.osgi.framework.BundleException: Could not resolve module: org.eclipse.jdt.launching.ui.macosx [271]
19:47:53 [2021-02-06T00:47:53.490Z]   Unresolved requirement: Require-Capability: eclipse.platform; filter:="(osgi.os=macosx)"
19:47:53 [2021-02-06T00:47:53.490Z] 
19:47:53 [2021-02-06T00:47:53.490Z] 	at org.eclipse.osgi.container.Module.start(Module.java:444)
19:47:53 [2021-02-06T00:47:53.490Z] 	at org.eclipse.osgi.container.ModuleContainer$ContainerStartLevel.incStartLevel(ModuleContainer.java:1634)
19:47:53 [2021-02-06T00:47:53.490Z] 	at org.eclipse.osgi.container.ModuleContainer$ContainerStartLevel.incStartLevel(ModuleContainer.java:1613)
19:47:53 [2021-02-06T00:47:53.490Z] 	at org.eclipse.osgi.container.ModuleContainer$ContainerStartLevel.doContainerStartLevel(ModuleContainer.java:1585)
19:47:53 [2021-02-06T00:47:53.490Z] 	at org.eclipse.osgi.container.ModuleContainer$ContainerStartLevel.dispatchEvent(ModuleContainer.java:1528)
19:47:53 [2021-02-06T00:47:53.490Z] 	at org.eclipse.osgi.container.ModuleContainer$ContainerStartLevel.dispatchEvent(ModuleContainer.java:1)
19:47:53 [2021-02-06T00:47:53.490Z] 	at org.eclipse.osgi.framework.eventmgr.EventManager.dispatchEvent(EventManager.java:230)
19:47:53 [2021-02-06T00:47:53.490Z] 	at org.eclipse.osgi.framework.eventmgr.EventManager$EventThread.run(EventManager.java:340)
19:47:53 [2021-02-06T00:47:53.490Z] Launching application org.eclipse.ui.ide.workbench...
19:47:54 [2021-02-06T00:47:54.860Z] SLF4J: Failed to load class "org.slf4j.impl.StaticLoggerBinder".
19:47:54 [2021-02-06T00:47:54.860Z] SLF4J: Defaulting to no-operation (NOP) logger implementation
19:47:54 [2021-02-06T00:47:54.860Z] SLF4J: See http://www.slf4j.org/codes.html#StaticLoggerBinder for further details.
19:47:55 [2021-02-06T00:47:55.790Z] Running org.eclipse.mylyn.github.ui.internal.GitHubRepositoryConnectorUIHeadlessTest
19:47:55 [2021-02-06T00:47:55.790Z] Tests run: 1, Failures: 0, Errors: 0, Skipped: 0, Time elapsed: 0.043 s - in org.eclipse.mylyn.github.ui.internal.GitHubRepositoryConnectorUIHeadlessTest
19:47:55 [2021-02-06T00:47:55.790Z] testFindHyperlinksTaskRepositoryStringIntInt(org.eclipse.mylyn.github.ui.internal.GitHubRepositoryConnectorUIHeadlessTest)  Time elapsed: 0.002 s
19:47:55 [2021-02-06T00:47:55.790Z] 
19:47:55 [2021-02-06T00:47:55.790Z] Results:
19:47:55 [2021-02-06T00:47:55.790Z] 
19:47:55 [2021-02-06T00:47:55.790Z] Tests run: 1, Failures: 0, Errors: 0, Skipped: 0
19:47:55 [2021-02-06T00:47:55.790Z] 
19:47:56 [2021-02-06T00:47:56.720Z] 
19:47:56 [2021-02-06T00:47:56.720Z] (SWT:918): Gtk-WARNING **: 00:47:56.598: Negative content width -1 (allocation 1, extents 1x1) while allocating gadget (node trough, owner GtkProgressBar)
19:47:56 [2021-02-06T00:47:56.720Z] 
19:47:56 [2021-02-06T00:47:56.720Z] (SWT:918): Gtk-WARNING **: 00:47:56.598: Negative content width -1 (allocation 1, extents 1x1) while allocating gadget (node trough, owner GtkProgressBar)
19:47:56 [2021-02-06T00:47:56.984Z] 
19:47:56 [2021-02-06T00:47:56.984Z] !ENTRY org.eclipse.equinox.registry 4 1 2021-02-06 00:47:56.968
19:47:56 [2021-02-06T00:47:56.984Z] !MESSAGE Plug-in "org.eclipse.ui.ide" was unable to instantiate class "org.eclipse.ui.internal.ide.SymlinkDecorator".
19:47:56 [2021-02-06T00:47:56.984Z] !STACK 0
19:47:56 [2021-02-06T00:47:56.984Z] java.lang.ExceptionInInitializerError
19:47:56 [2021-02-06T00:47:56.984Z] 	at sun.reflect.NativeConstructorAccessorImpl.newInstance0(Native Method)
19:47:56 [2021-02-06T00:47:56.984Z] 	at sun.reflect.NativeConstructorAccessorImpl.newInstance(NativeConstructorAccessorImpl.java:62)
19:47:56 [2021-02-06T00:47:56.984Z] 	at sun.reflect.DelegatingConstructorAccessorImpl.newInstance(DelegatingConstructorAccessorImpl.java:45)
19:47:56 [2021-02-06T00:47:56.984Z] 	at java.lang.reflect.Constructor.newInstance(Constructor.java:423)
19:47:56 [2021-02-06T00:47:56.984Z] 	at java.lang.Class.newInstance(Class.java:442)
19:47:56 [2021-02-06T00:47:56.984Z] 	at org.eclipse.core.internal.registry.osgi.RegistryStrategyOSGI.createExecutableExtension(RegistryStrategyOSGI.java:184)
19:47:56 [2021-02-06T00:47:56.984Z] 	at org.eclipse.core.internal.registry.ExtensionRegistry.createExecutableExtension(ExtensionRegistry.java:905)
19:47:56 [2021-02-06T00:47:56.984Z] 	at org.eclipse.core.internal.registry.ConfigurationElement.createExecutableExtension(ConfigurationElement.java:243)
19:47:56 [2021-02-06T00:47:56.984Z] 	at org.eclipse.core.internal.registry.ConfigurationElementHandle.createExecutableExtension(ConfigurationElementHandle.java:55)
19:47:56 [2021-02-06T00:47:56.984Z] 	at org.eclipse.ui.internal.WorkbenchPlugin.createExtension(WorkbenchPlugin.java:281)
19:47:56 [2021-02-06T00:47:56.984Z] 	at org.eclipse.ui.internal.decorators.LightweightDecoratorDefinition$1.run(LightweightDecoratorDefinition.java:125)
19:47:56 [2021-02-06T00:47:56.984Z] 	at org.eclipse.core.runtime.SafeRunner.run(SafeRunner.java:42)
19:47:56 [2021-02-06T00:47:56.984Z] 	at org.eclipse.ui.internal.decorators.LightweightDecoratorDefinition.internalGetDecorator(LightweightDecoratorDefinition.java:120)
19:47:56 [2021-02-06T00:47:56.984Z] 	at org.eclipse.ui.internal.decorators.LightweightDecoratorDefinition.decorate(LightweightDecoratorDefinition.java:242)
19:47:56 [2021-02-06T00:47:56.984Z] 	at org.eclipse.ui.internal.decorators.LightweightDecoratorManager$LightweightRunnable.run(LightweightDecoratorManager.java:104)
19:47:56 [2021-02-06T00:47:56.984Z] 	at org.eclipse.core.runtime.SafeRunner.run(SafeRunner.java:42)
19:47:56 [2021-02-06T00:47:56.984Z] 	at org.eclipse.ui.internal.decorators.LightweightDecoratorManager.decorate(LightweightDecoratorManager.java:377)
19:47:56 [2021-02-06T00:47:56.984Z] 	at org.eclipse.ui.internal.decorators.LightweightDecoratorManager.getDecorations(LightweightDecoratorManager.java:359)
19:47:56 [2021-02-06T00:47:56.984Z] 	at org.eclipse.ui.internal.decorators.DecorationScheduler$1.ensureResultCached(DecorationScheduler.java:347)
19:47:56 [2021-02-06T00:47:56.984Z] 	at org.eclipse.ui.internal.decorators.DecorationScheduler$1.run(DecorationScheduler.java:311)
19:47:56 [2021-02-06T00:47:56.984Z] 	at org.eclipse.core.internal.jobs.Worker.run(Worker.java:56)
19:47:56 [2021-02-06T00:47:56.984Z] Caused by: java.lang.NullPointerException
19:47:56 [2021-02-06T00:47:56.984Z] 	at org.eclipse.ui.plugin.AbstractUIPlugin.imageDescriptorFromPlugin(AbstractUIPlugin.java:664)
19:47:56 [2021-02-06T00:47:56.984Z] 	at org.eclipse.ui.internal.ide.SymlinkDecorator.<clinit>(SymlinkDecorator.java:32)
19:47:56 [2021-02-06T00:47:56.984Z] 	... 21 more
19:47:56 [2021-02-06T00:47:56.984Z] 
19:47:56 [2021-02-06T00:47:56.984Z] !ENTRY org.eclipse.equinox.registry 4 1 2021-02-06 00:47:56.969
19:47:56 [2021-02-06T00:47:56.984Z] !MESSAGE Plug-in "org.eclipse.ui.ide" was unable to instantiate class "org.eclipse.ui.internal.ide.SymlinkDecorator".
19:47:56 [2021-02-06T00:47:56.984Z] !STACK 0
19:47:56 [2021-02-06T00:47:56.984Z] java.lang.ExceptionInInitializerError
19:47:56 [2021-02-06T00:47:56.984Z] 	at sun.reflect.NativeConstructorAccessorImpl.newInstance0(Native Method)
19:47:56 [2021-02-06T00:47:56.984Z] 	at sun.reflect.NativeConstructorAccessorImpl.newInstance(NativeConstructorAccessorImpl.java:62)
19:47:56 [2021-02-06T00:47:56.984Z] 	at sun.reflect.DelegatingConstructorAccessorImpl.newInstance(DelegatingConstructorAccessorImpl.java:45)
19:47:56 [2021-02-06T00:47:56.984Z] 	at java.lang.reflect.Constructor.newInstance(Constructor.java:423)
19:47:56 [2021-02-06T00:47:56.984Z] 	at java.lang.Class.newInstance(Class.java:442)
19:47:56 [2021-02-06T00:47:56.984Z] 	at org.eclipse.core.internal.registry.osgi.RegistryStrategyOSGI.createExecutableExtension(RegistryStrategyOSGI.java:184)
19:47:56 [2021-02-06T00:47:56.984Z] 	at org.eclipse.core.internal.registry.ExtensionRegistry.createExecutableExtension(ExtensionRegistry.java:905)
19:47:56 [2021-02-06T00:47:56.984Z] 	at org.eclipse.core.internal.registry.ConfigurationElement.createExecutableExtension(ConfigurationElement.java:243)
19:47:56 [2021-02-06T00:47:56.984Z] 	at org.eclipse.core.internal.registry.ConfigurationElementHandle.createExecutableExtension(ConfigurationElementHandle.java:55)
19:47:56 [2021-02-06T00:47:56.984Z] 	at org.eclipse.ui.internal.WorkbenchPlugin.createExtension(WorkbenchPlugin.java:281)
19:47:56 [2021-02-06T00:47:56.984Z] 	at org.eclipse.ui.internal.decorators.LightweightDecoratorDefinition$1.run(LightweightDecoratorDefinition.java:125)
19:47:56 [2021-02-06T00:47:56.984Z] 	at org.eclipse.core.runtime.SafeRunner.run(SafeRunner.java:42)
19:47:56 [2021-02-06T00:47:56.984Z] 	at org.eclipse.ui.internal.decorators.LightweightDecoratorDefinition.internalGetDecorator(LightweightDecoratorDefinition.java:120)
19:47:56 [2021-02-06T00:47:56.984Z] 	at org.eclipse.ui.internal.decorators.LightweightDecoratorDefinition.decorate(LightweightDecoratorDefinition.java:242)
19:47:56 [2021-02-06T00:47:56.984Z] 	at org.eclipse.ui.internal.decorators.LightweightDecoratorManager$LightweightRunnable.run(LightweightDecoratorManager.java:104)
19:47:56 [2021-02-06T00:47:56.985Z] 	at org.eclipse.core.runtime.SafeRunner.run(SafeRunner.java:42)
19:47:56 [2021-02-06T00:47:56.985Z] 	at org.eclipse.ui.internal.decorators.LightweightDecoratorManager.decorate(LightweightDecoratorManager.java:377)
19:47:56 [2021-02-06T00:47:56.985Z] 	at org.eclipse.ui.internal.decorators.LightweightDecoratorManager.getDecorations(LightweightDecoratorManager.java:359)
19:47:56 [2021-02-06T00:47:56.985Z] 	at org.eclipse.ui.internal.decorators.DecorationScheduler$1.ensureResultCached(DecorationScheduler.java:347)
19:47:56 [2021-02-06T00:47:56.985Z] 	at org.eclipse.ui.internal.decorators.DecorationScheduler$1.run(DecorationScheduler.java:311)
19:47:56 [2021-02-06T00:47:56.985Z] 	at org.eclipse.core.internal.jobs.Worker.run(Worker.java:56)
19:47:56 [2021-02-06T00:47:56.985Z] Caused by: java.lang.NullPointerException
19:47:56 [2021-02-06T00:47:56.985Z] 	at org.eclipse.ui.plugin.AbstractUIPlugin.imageDescriptorFromPlugin(AbstractUIPlugin.java:664)
19:47:56 [2021-02-06T00:47:56.985Z] 	at org.eclipse.ui.internal.ide.SymlinkDecorator.<clinit>(SymlinkDecorator.java:32)
19:47:56 [2021-02-06T00:47:56.985Z] 	... 21 more
19:47:56 [2021-02-06T00:47:56.985Z] 
19:47:56 [2021-02-06T00:47:56.985Z] !ENTRY org.eclipse.ui 4 0 2021-02-06 00:47:56.969
19:47:56 [2021-02-06T00:47:56.985Z] !MESSAGE Error occurred during status handling
19:47:56 [2021-02-06T00:47:56.985Z] !STACK 0
19:47:56 [2021-02-06T00:47:56.985Z] java.lang.NullPointerException
19:47:56 [2021-02-06T00:47:56.985Z] 	at org.eclipse.ui.internal.statushandlers.StatusHandlerRegistry.<init>(StatusHandlerRegistry.java:71)
19:47:56 [2021-02-06T00:47:56.985Z] 	at org.eclipse.ui.internal.statushandlers.StatusHandlerRegistry.getDefault(StatusHandlerRegistry.java:90)
19:47:56 [2021-02-06T00:47:56.985Z] 	at org.eclipse.ui.statushandlers.StatusManager.getStatusHandler(StatusManager.java:152)
19:47:56 [2021-02-06T00:47:56.985Z] 	at org.eclipse.ui.statushandlers.StatusManager.handle(StatusManager.java:211)
19:47:56 [2021-02-06T00:47:56.985Z] 	at org.eclipse.ui.statushandlers.StatusManager.handle(StatusManager.java:260)
19:47:56 [2021-02-06T00:47:56.985Z] 	at org.eclipse.ui.statushandlers.StatusManager$StatusManagerLogListener.logging(StatusManager.java:331)
19:47:56 [2021-02-06T00:47:56.985Z] 	at org.eclipse.core.internal.runtime.RuntimeLog.logToListeners(RuntimeLog.java:161)
19:47:56 [2021-02-06T00:47:56.985Z] 	at org.eclipse.core.internal.runtime.PlatformLogWriter.logged(PlatformLogWriter.java:103)
19:47:56 [2021-02-06T00:47:56.985Z] 	at org.eclipse.osgi.internal.log.ExtendedLogReaderServiceFactory.safeLogged(ExtendedLogReaderServiceFactory.java:88)
19:47:56 [2021-02-06T00:47:56.985Z] 	at org.eclipse.osgi.internal.log.ExtendedLogReaderServiceFactory.logPrivileged(ExtendedLogReaderServiceFactory.java:217)
19:47:56 [2021-02-06T00:47:56.985Z] 	at org.eclipse.osgi.internal.log.ExtendedLogReaderServiceFactory.log(ExtendedLogReaderServiceFactory.java:189)
19:47:56 [2021-02-06T00:47:56.985Z] 	at org.eclipse.osgi.internal.log.ExtendedLogServiceFactory.log(ExtendedLogServiceFactory.java:65)
19:47:56 [2021-02-06T00:47:56.985Z] 	at org.eclipse.osgi.internal.log.ExtendedLogServiceImpl.log(ExtendedLogServiceImpl.java:87)
19:47:56 [2021-02-06T00:47:56.985Z] 	at org.eclipse.osgi.internal.log.LoggerImpl.log(LoggerImpl.java:54)
19:47:56 [2021-02-06T00:47:56.985Z] 	at org.eclipse.core.internal.runtime.Log.log(Log.java:65)
19:47:56 [2021-02-06T00:47:56.985Z] 	at org.eclipse.ui.internal.WorkbenchPlugin.log(WorkbenchPlugin.java:663)
19:47:56 [2021-02-06T00:47:56.985Z] 	at org.eclipse.ui.internal.decorators.DecoratorDefinition.handleCoreException(DecoratorDefinition.java:266)
19:47:56 [2021-02-06T00:47:56.985Z] 	at org.eclipse.ui.internal.decorators.LightweightDecoratorDefinition.decorate(LightweightDecoratorDefinition.java:263)
19:47:56 [2021-02-06T00:47:56.985Z] 	at org.eclipse.ui.internal.decorators.LightweightDecoratorManager$LightweightRunnable.run(LightweightDecoratorManager.java:104)
19:47:56 [2021-02-06T00:47:56.985Z] 	at org.eclipse.core.runtime.SafeRunner.run(SafeRunner.java:42)
19:47:56 [2021-02-06T00:47:56.985Z] 	at org.eclipse.ui.internal.decorators.LightweightDecoratorManager.decorate(LightweightDecoratorManager.java:377)
19:47:56 [2021-02-06T00:47:56.985Z] 	at org.eclipse.ui.internal.decorators.LightweightDecoratorManager.getDecorations(LightweightDecoratorManager.java:359)
19:47:56 [2021-02-06T00:47:56.985Z] 	at org.eclipse.ui.internal.decorators.DecorationScheduler$1.ensureResultCached(DecorationScheduler.java:347)
19:47:56 [2021-02-06T00:47:56.985Z] 	at org.eclipse.ui.internal.decorators.DecorationScheduler$1.run(DecorationScheduler.java:311)
19:47:56 [2021-02-06T00:47:56.985Z] 	at org.eclipse.core.internal.jobs.Worker.run(Worker.java:56)
19:47:56 [2021-02-06T00:47:56.985Z] 
19:47:56 [2021-02-06T00:47:56.985Z] !ENTRY org.eclipse.equinox.registry 4 1 2021-02-06 00:47:56.970
19:47:56 [2021-02-06T00:47:56.985Z] !MESSAGE Plug-in "org.eclipse.ui.ide" was unable to instantiate class "org.eclipse.ui.internal.ide.LinkedResourceDecorator".
19:47:56 [2021-02-06T00:47:56.985Z] !STACK 0
19:47:56 [2021-02-06T00:47:56.985Z] java.lang.ExceptionInInitializerError
19:47:56 [2021-02-06T00:47:56.985Z] 	at sun.reflect.NativeConstructorAccessorImpl.newInstance0(Native Method)
19:47:56 [2021-02-06T00:47:56.985Z] 	at sun.reflect.NativeConstructorAccessorImpl.newInstance(NativeConstructorAccessorImpl.java:62)
19:47:56 [2021-02-06T00:47:56.985Z] 	at sun.reflect.DelegatingConstructorAccessorImpl.newInstance(DelegatingConstructorAccessorImpl.java:45)
19:47:56 [2021-02-06T00:47:56.985Z] 	at java.lang.reflect.Constructor.newInstance(Constructor.java:423)
19:47:56 [2021-02-06T00:47:56.985Z] 	at java.lang.Class.newInstance(Class.java:442)
19:47:56 [2021-02-06T00:47:56.985Z] 	at org.eclipse.core.internal.registry.osgi.RegistryStrategyOSGI.createExecutableExtension(RegistryStrategyOSGI.java:184)
19:47:56 [2021-02-06T00:47:56.985Z] 	at org.eclipse.core.internal.registry.ExtensionRegistry.createExecutableExtension(ExtensionRegistry.java:905)
19:47:56 [2021-02-06T00:47:56.985Z] 	at org.eclipse.core.internal.registry.ConfigurationElement.createExecutableExtension(ConfigurationElement.java:243)
19:47:56 [2021-02-06T00:47:56.985Z] 	at org.eclipse.core.internal.registry.ConfigurationElementHandle.createExecutableExtension(ConfigurationElementHandle.java:55)
19:47:56 [2021-02-06T00:47:56.985Z] 	at org.eclipse.ui.internal.WorkbenchPlugin.createExtension(WorkbenchPlugin.java:281)
19:47:56 [2021-02-06T00:47:56.985Z] 	at org.eclipse.ui.internal.decorators.LightweightDecoratorDefinition$1.run(LightweightDecoratorDefinition.java:125)
19:47:56 [2021-02-06T00:47:56.985Z] 	at org.eclipse.core.runtime.SafeRunner.run(SafeRunner.java:42)
19:47:56 [2021-02-06T00:47:56.985Z] 	at org.eclipse.ui.internal.decorators.LightweightDecoratorDefinition.internalGetDecorator(LightweightDecoratorDefinition.java:120)
19:47:56 [2021-02-06T00:47:56.985Z] 	at org.eclipse.ui.internal.decorators.LightweightDecoratorDefinition.decorate(LightweightDecoratorDefinition.java:242)
19:47:56 [2021-02-06T00:47:56.985Z] 	at org.eclipse.ui.internal.decorators.LightweightDecoratorManager$LightweightRunnable.run(LightweightDecoratorManager.java:104)
19:47:56 [2021-02-06T00:47:56.985Z] 	at org.eclipse.core.runtime.SafeRunner.run(SafeRunner.java:42)
19:47:56 [2021-02-06T00:47:56.985Z] 	at org.eclipse.ui.internal.decorators.LightweightDecoratorManager.decorate(LightweightDecoratorManager.java:377)
19:47:56 [2021-02-06T00:47:56.985Z] 	at org.eclipse.ui.internal.decorators.LightweightDecoratorManager.getDecorations(LightweightDecoratorManager.java:359)
19:47:56 [2021-02-06T00:47:56.985Z] 	at org.eclipse.ui.internal.decorators.DecorationScheduler$1.ensureResultCached(DecorationScheduler.java:347)
19:47:56 [2021-02-06T00:47:56.985Z] 	at org.eclipse.ui.internal.decorators.DecorationScheduler$1.run(DecorationScheduler.java:311)
19:47:56 [2021-02-06T00:47:56.985Z] 	at org.eclipse.core.internal.jobs.Worker.run(Worker.java:56)
19:47:56 [2021-02-06T00:47:56.985Z] Caused by: java.lang.NullPointerException
19:47:56 [2021-02-06T00:47:56.985Z] 	at org.eclipse.ui.plugin.AbstractUIPlugin.imageDescriptorFromPlugin(AbstractUIPlugin.java:664)
19:47:56 [2021-02-06T00:47:56.985Z] 	at org.eclipse.ui.internal.ide.LinkedResourceDecorator.<clinit>(LinkedResourceDecorator.java:37)
19:47:56 [2021-02-06T00:47:56.985Z] 	... 21 more
19:47:56 [2021-02-06T00:47:56.985Z] 
19:47:56 [2021-02-06T00:47:56.985Z] !ENTRY org.eclipse.equinox.registry 4 1 2021-02-06 00:47:56.970
19:47:56 [2021-02-06T00:47:56.985Z] !MESSAGE Plug-in "org.eclipse.ui.ide" was unable to instantiate class "org.eclipse.ui.internal.ide.LinkedResourceDecorator".
19:47:56 [2021-02-06T00:47:56.985Z] !STACK 0
19:47:56 [2021-02-06T00:47:56.985Z] java.lang.ExceptionInInitializerError
19:47:56 [2021-02-06T00:47:56.985Z] 	at sun.reflect.NativeConstructorAccessorImpl.newInstance0(Native Method)
19:47:56 [2021-02-06T00:47:56.985Z] 	at sun.reflect.NativeConstructorAccessorImpl.newInstance(NativeConstructorAccessorImpl.java:62)
19:47:56 [2021-02-06T00:47:56.985Z] 	at sun.reflect.DelegatingConstructorAccessorImpl.newInstance(DelegatingConstructorAccessorImpl.java:45)
19:47:56 [2021-02-06T00:47:56.985Z] 	at java.lang.reflect.Constructor.newInstance(Constructor.java:423)
19:47:56 [2021-02-06T00:47:56.985Z] 	at java.lang.Class.newInstance(Class.java:442)
19:47:56 [2021-02-06T00:47:56.985Z] 	at org.eclipse.core.internal.registry.osgi.RegistryStrategyOSGI.createExecutableExtension(RegistryStrategyOSGI.java:184)
19:47:56 [2021-02-06T00:47:56.985Z] 	at org.eclipse.core.internal.registry.ExtensionRegistry.createExecutableExtension(ExtensionRegistry.java:905)
19:47:56 [2021-02-06T00:47:56.985Z] 	at org.eclipse.core.internal.registry.ConfigurationElement.createExecutableExtension(ConfigurationElement.java:243)
19:47:56 [2021-02-06T00:47:56.985Z] 	at org.eclipse.core.internal.registry.ConfigurationElementHandle.createExecutableExtension(ConfigurationElementHandle.java:55)
19:47:56 [2021-02-06T00:47:56.985Z] 	at org.eclipse.ui.internal.WorkbenchPlugin.createExtension(WorkbenchPlugin.java:281)
19:47:56 [2021-02-06T00:47:56.985Z] 	at org.eclipse.ui.internal.decorators.LightweightDecoratorDefinition$1.run(LightweightDecoratorDefinition.java:125)
19:47:56 [2021-02-06T00:47:56.985Z] 	at org.eclipse.core.runtime.SafeRunner.run(SafeRunner.java:42)
19:47:56 [2021-02-06T00:47:56.985Z] 	at org.eclipse.ui.internal.decorators.LightweightDecoratorDefinition.internalGetDecorator(LightweightDecoratorDefinition.java:120)
19:47:56 [2021-02-06T00:47:56.985Z] 	at org.eclipse.ui.internal.decorators.LightweightDecoratorDefinition.decorate(LightweightDecoratorDefinition.java:242)
19:47:56 [2021-02-06T00:47:56.986Z] 	at org.eclipse.ui.internal.decorators.LightweightDecoratorManager$LightweightRunnable.run(LightweightDecoratorManager.java:104)
19:47:56 [2021-02-06T00:47:56.986Z] 	at org.eclipse.core.runtime.SafeRunner.run(SafeRunner.java:42)
19:47:56 [2021-02-06T00:47:56.986Z] 	at org.eclipse.ui.internal.decorators.LightweightDecoratorManager.decorate(LightweightDecoratorManager.java:377)
19:47:56 [2021-02-06T00:47:56.986Z] 	at org.eclipse.ui.internal.decorators.LightweightDecoratorManager.getDecorations(LightweightDecoratorManager.java:359)
19:47:56 [2021-02-06T00:47:56.986Z] 	at org.eclipse.ui.internal.decorators.DecorationScheduler$1.ensureResultCached(DecorationScheduler.java:347)
19:47:56 [2021-02-06T00:47:56.986Z] 	at org.eclipse.ui.internal.decorators.DecorationScheduler$1.run(DecorationScheduler.java:311)
19:47:56 [2021-02-06T00:47:56.986Z] 	at org.eclipse.core.internal.jobs.Worker.run(Worker.java:56)
19:47:56 [2021-02-06T00:47:56.986Z] Caused by: java.lang.NullPointerException
19:47:56 [2021-02-06T00:47:56.986Z] 	at org.eclipse.ui.plugin.AbstractUIPlugin.imageDescriptorFromPlugin(AbstractUIPlugin.java:664)
19:47:56 [2021-02-06T00:47:56.986Z] 	at org.eclipse.ui.internal.ide.LinkedResourceDecorator.<clinit>(LinkedResourceDecorator.java:37)
19:47:56 [2021-02-06T00:47:56.986Z] 	... 21 more
19:47:56 [2021-02-06T00:47:56.986Z] 
19:47:56 [2021-02-06T00:47:56.986Z] !ENTRY org.eclipse.ui 4 0 2021-02-06 00:47:56.970
19:47:56 [2021-02-06T00:47:56.986Z] !MESSAGE Error occurred during status handling
19:47:56 [2021-02-06T00:47:56.986Z] !STACK 0
19:47:56 [2021-02-06T00:47:56.986Z] java.lang.NullPointerException
19:47:56 [2021-02-06T00:47:56.986Z] 	at org.eclipse.ui.internal.statushandlers.StatusHandlerRegistry.<init>(StatusHandlerRegistry.java:71)
19:47:56 [2021-02-06T00:47:56.986Z] 	at org.eclipse.ui.internal.statushandlers.StatusHandlerRegistry.getDefault(StatusHandlerRegistry.java:90)
19:47:56 [2021-02-06T00:47:56.986Z] 	at org.eclipse.ui.statushandlers.StatusManager.getStatusHandler(StatusManager.java:152)
19:47:56 [2021-02-06T00:47:56.986Z] 	at org.eclipse.ui.statushandlers.StatusManager.handle(StatusManager.java:211)
19:47:56 [2021-02-06T00:47:56.986Z] 	at org.eclipse.ui.statushandlers.StatusManager.handle(StatusManager.java:260)
19:47:56 [2021-02-06T00:47:56.986Z] 	at org.eclipse.ui.statushandlers.StatusManager$StatusManagerLogListener.logging(StatusManager.java:331)
19:47:56 [2021-02-06T00:47:56.986Z] 	at org.eclipse.core.internal.runtime.RuntimeLog.logToListeners(RuntimeLog.java:161)
19:47:56 [2021-02-06T00:47:56.986Z] 	at org.eclipse.core.internal.runtime.PlatformLogWriter.logged(PlatformLogWriter.java:103)
19:47:56 [2021-02-06T00:47:56.986Z] 	at org.eclipse.osgi.internal.log.ExtendedLogReaderServiceFactory.safeLogged(ExtendedLogReaderServiceFactory.java:88)
19:47:56 [2021-02-06T00:47:56.986Z] 	at org.eclipse.osgi.internal.log.ExtendedLogReaderServiceFactory.logPrivileged(ExtendedLogReaderServiceFactory.java:217)
19:47:56 [2021-02-06T00:47:56.986Z] 	at org.eclipse.osgi.internal.log.ExtendedLogReaderServiceFactory.log(ExtendedLogReaderServiceFactory.java:189)
19:47:56 [2021-02-06T00:47:56.986Z] 	at org.eclipse.osgi.internal.log.ExtendedLogServiceFactory.log(ExtendedLogServiceFactory.java:65)
19:47:56 [2021-02-06T00:47:56.986Z] 	at org.eclipse.osgi.internal.log.ExtendedLogServiceImpl.log(ExtendedLogServiceImpl.java:87)
19:47:56 [2021-02-06T00:47:56.986Z] 	at org.eclipse.osgi.internal.log.LoggerImpl.log(LoggerImpl.java:54)
19:47:56 [2021-02-06T00:47:56.986Z] 	at org.eclipse.core.internal.runtime.Log.log(Log.java:65)
19:47:56 [2021-02-06T00:47:56.986Z] 	at org.eclipse.ui.internal.WorkbenchPlugin.log(WorkbenchPlugin.java:663)
19:47:56 [2021-02-06T00:47:56.986Z] 	at org.eclipse.ui.internal.decorators.DecoratorDefinition.handleCoreException(DecoratorDefinition.java:266)
19:47:56 [2021-02-06T00:47:56.986Z] 	at org.eclipse.ui.internal.decorators.LightweightDecoratorDefinition.decorate(LightweightDecoratorDefinition.java:263)
19:47:56 [2021-02-06T00:47:56.986Z] 	at org.eclipse.ui.internal.decorators.LightweightDecoratorManager$LightweightRunnable.run(LightweightDecoratorManager.java:104)
19:47:56 [2021-02-06T00:47:56.986Z] 	at org.eclipse.core.runtime.SafeRunner.run(SafeRunner.java:42)
19:47:56 [2021-02-06T00:47:56.986Z] 	at org.eclipse.ui.internal.decorators.LightweightDecoratorManager.decorate(LightweightDecoratorManager.java:377)
19:47:56 [2021-02-06T00:47:56.986Z] 	at org.eclipse.ui.internal.decorators.LightweightDecoratorManager.getDecorations(LightweightDecoratorManager.java:359)
19:47:56 [2021-02-06T00:47:56.986Z] 	at org.eclipse.ui.internal.decorators.DecorationScheduler$1.ensureResultCached(DecorationScheduler.java:347)
19:47:56 [2021-02-06T00:47:56.986Z] 	at org.eclipse.ui.internal.decorators.DecorationScheduler$1.run(DecorationScheduler.java:311)
19:47:56 [2021-02-06T00:47:56.986Z] 	at org.eclipse.core.internal.jobs.Worker.run(Worker.java:56)
19:47:56 [2021-02-06T00:47:56.986Z] 
19:47:56 [2021-02-06T00:47:56.986Z] !ENTRY org.eclipse.equinox.registry 4 1 2021-02-06 00:47:56.971
19:47:56 [2021-02-06T00:47:56.986Z] !MESSAGE Plug-in "org.eclipse.ui.ide" was unable to instantiate class "org.eclipse.ui.internal.ide.VirtualResourceDecorator".
19:47:56 [2021-02-06T00:47:56.986Z] !STACK 0
19:47:56 [2021-02-06T00:47:56.986Z] java.lang.ExceptionInInitializerError
19:47:56 [2021-02-06T00:47:56.986Z] 	at sun.reflect.NativeConstructorAccessorImpl.newInstance0(Native Method)
19:47:56 [2021-02-06T00:47:56.986Z] 	at sun.reflect.NativeConstructorAccessorImpl.newInstance(NativeConstructorAccessorImpl.java:62)
19:47:56 [2021-02-06T00:47:56.986Z] 	at sun.reflect.DelegatingConstructorAccessorImpl.newInstance(DelegatingConstructorAccessorImpl.java:45)
19:47:56 [2021-02-06T00:47:56.986Z] 	at java.lang.reflect.Constructor.newInstance(Constructor.java:423)
19:47:56 [2021-02-06T00:47:56.986Z] 	at java.lang.Class.newInstance(Class.java:442)
19:47:56 [2021-02-06T00:47:56.986Z] 	at org.eclipse.core.internal.registry.osgi.RegistryStrategyOSGI.createExecutableExtension(RegistryStrategyOSGI.java:184)
19:47:56 [2021-02-06T00:47:56.986Z] 	at org.eclipse.core.internal.registry.ExtensionRegistry.createExecutableExtension(ExtensionRegistry.java:905)
19:47:56 [2021-02-06T00:47:56.987Z] 	at org.eclipse.core.internal.registry.ConfigurationElement.createExecutableExtension(ConfigurationElement.java:243)
19:47:56 [2021-02-06T00:47:56.987Z] 	at org.eclipse.core.internal.registry.ConfigurationElementHandle.createExecutableExtension(ConfigurationElementHandle.java:55)
19:47:56 [2021-02-06T00:47:56.987Z] 	at org.eclipse.ui.internal.WorkbenchPlugin.createExtension(WorkbenchPlugin.java:281)
19:47:56 [2021-02-06T00:47:56.987Z] 	at org.eclipse.ui.internal.decorators.LightweightDecoratorDefinition$1.run(LightweightDecoratorDefinition.java:125)
19:47:56 [2021-02-06T00:47:56.987Z] 	at org.eclipse.core.runtime.SafeRunner.run(SafeRunner.java:42)
19:47:56 [2021-02-06T00:47:56.987Z] 	at org.eclipse.ui.internal.decorators.LightweightDecoratorDefinition.internalGetDecorator(LightweightDecoratorDefinition.java:120)
19:47:56 [2021-02-06T00:47:56.987Z] 	at org.eclipse.ui.internal.decorators.LightweightDecoratorDefinition.decorate(LightweightDecoratorDefinition.java:242)
19:47:56 [2021-02-06T00:47:56.987Z] 	at org.eclipse.ui.internal.decorators.LightweightDecoratorManager$LightweightRunnable.run(LightweightDecoratorManager.java:104)
19:47:56 [2021-02-06T00:47:56.987Z] 	at org.eclipse.core.runtime.SafeRunner.run(SafeRunner.java:42)
19:47:56 [2021-02-06T00:47:56.987Z] 	at org.eclipse.ui.internal.decorators.LightweightDecoratorManager.decorate(LightweightDecoratorManager.java:377)
19:47:56 [2021-02-06T00:47:56.987Z] 	at org.eclipse.ui.internal.decorators.LightweightDecoratorManager.getDecorations(LightweightDecoratorManager.java:359)
19:47:56 [2021-02-06T00:47:56.987Z] 	at org.eclipse.ui.internal.decorators.DecorationScheduler$1.ensureResultCached(DecorationScheduler.java:347)
19:47:56 [2021-02-06T00:47:56.987Z] 	at org.eclipse.ui.internal.decorators.DecorationScheduler$1.run(DecorationScheduler.java:311)
19:47:56 [2021-02-06T00:47:56.987Z] 	at org.eclipse.core.internal.jobs.Worker.run(Worker.java:56)
19:47:56 [2021-02-06T00:47:56.987Z] Caused by: java.lang.NullPointerException
19:47:56 [2021-02-06T00:47:56.987Z] 	at org.eclipse.ui.plugin.AbstractUIPlugin.imageDescriptorFromPlugin(AbstractUIPlugin.java:664)
19:47:56 [2021-02-06T00:47:56.987Z] 	at org.eclipse.ui.internal.ide.VirtualResourceDecorator.<clinit>(VirtualResourceDecorator.java:30)
19:47:56 [2021-02-06T00:47:56.987Z] 	... 21 more
19:47:56 [2021-02-06T00:47:56.987Z] 
19:47:56 [2021-02-06T00:47:56.987Z] !ENTRY org.eclipse.equinox.registry 4 1 2021-02-06 00:47:56.971
19:47:56 [2021-02-06T00:47:56.987Z] !MESSAGE Plug-in "org.eclipse.ui.ide" was unable to instantiate class "org.eclipse.ui.internal.ide.VirtualResourceDecorator".
19:47:56 [2021-02-06T00:47:56.987Z] !STACK 0
19:47:56 [2021-02-06T00:47:56.987Z] java.lang.ExceptionInInitializerError
19:47:56 [2021-02-06T00:47:56.987Z] 	at sun.reflect.NativeConstructorAccessorImpl.newInstance0(Native Method)
19:47:56 [2021-02-06T00:47:56.987Z] 	at sun.reflect.NativeConstructorAccessorImpl.newInstance(NativeConstructorAccessorImpl.java:62)
19:47:56 [2021-02-06T00:47:56.987Z] 	at sun.reflect.DelegatingConstructorAccessorImpl.newInstance(DelegatingConstructorAccessorImpl.java:45)
19:47:56 [2021-02-06T00:47:56.987Z] 	at java.lang.reflect.Constructor.newInstance(Constructor.java:423)
19:47:56 [2021-02-06T00:47:56.987Z] 	at java.lang.Class.newInstance(Class.java:442)
19:47:56 [2021-02-06T00:47:56.987Z] 	at org.eclipse.core.internal.registry.osgi.RegistryStrategyOSGI.createExecutableExtension(RegistryStrategyOSGI.java:184)
19:47:56 [2021-02-06T00:47:56.987Z] 	at org.eclipse.core.internal.registry.ExtensionRegistry.createExecutableExtension(ExtensionRegistry.java:905)
19:47:56 [2021-02-06T00:47:56.987Z] 	at org.eclipse.core.internal.registry.ConfigurationElement.createExecutableExtension(ConfigurationElement.java:243)
19:47:56 [2021-02-06T00:47:56.987Z] 	at org.eclipse.core.internal.registry.ConfigurationElementHandle.createExecutableExtension(ConfigurationElementHandle.java:55)
19:47:56 [2021-02-06T00:47:56.987Z] 	at org.eclipse.ui.internal.WorkbenchPlugin.createExtension(WorkbenchPlugin.java:281)
19:47:56 [2021-02-06T00:47:56.987Z] 	at org.eclipse.ui.internal.decorators.LightweightDecoratorDefinition$1.run(LightweightDecoratorDefinition.java:125)
19:47:56 [2021-02-06T00:47:56.987Z] 	at org.eclipse.core.runtime.SafeRunner.run(SafeRunner.java:42)
19:47:56 [2021-02-06T00:47:56.987Z] 	at org.eclipse.ui.internal.decorators.LightweightDecoratorDefinition.internalGetDecorator(LightweightDecoratorDefinition.java:120)
19:47:56 [2021-02-06T00:47:56.987Z] 	at org.eclipse.ui.internal.decorators.LightweightDecoratorDefinition.decorate(LightweightDecoratorDefinition.java:242)
19:47:56 [2021-02-06T00:47:56.987Z] 	at org.eclipse.ui.internal.decorators.LightweightDecoratorManager$LightweightRunnable.run(LightweightDecoratorManager.java:104)
19:47:56 [2021-02-06T00:47:56.987Z] 	at org.eclipse.core.runtime.SafeRunner.run(SafeRunner.java:42)
19:47:56 [2021-02-06T00:47:56.987Z] 	at org.eclipse.ui.internal.decorators.LightweightDecoratorManager.decorate(LightweightDecoratorManager.java:377)
19:47:56 [2021-02-06T00:47:56.987Z] 	at org.eclipse.ui.internal.decorators.LightweightDecoratorManager.getDecorations(LightweightDecoratorManager.java:359)
19:47:56 [2021-02-06T00:47:56.987Z] 	at org.eclipse.ui.internal.decorators.DecorationScheduler$1.ensureResultCached(DecorationScheduler.java:347)
19:47:56 [2021-02-06T00:47:56.987Z] 	at org.eclipse.ui.internal.decorators.DecorationScheduler$1.run(DecorationScheduler.java:311)
19:47:56 [2021-02-06T00:47:56.987Z] 	at org.eclipse.core.internal.jobs.Worker.run(Worker.java:56)
19:47:56 [2021-02-06T00:47:56.987Z] Caused by: java.lang.NullPointerException
19:47:56 [2021-02-06T00:47:56.987Z] 	at org.eclipse.ui.plugin.AbstractUIPlugin.imageDescriptorFromPlugin(AbstractUIPlugin.java:664)
19:47:56 [2021-02-06T00:47:56.987Z] 	at org.eclipse.ui.internal.ide.VirtualResourceDecorator.<clinit>(VirtualResourceDecorator.java:30)
19:47:56 [2021-02-06T00:47:56.987Z] 	... 21 more
19:47:56 [2021-02-06T00:47:56.987Z] 
19:47:56 [2021-02-06T00:47:56.987Z] !ENTRY org.eclipse.ui 4 0 2021-02-06 00:47:56.980
19:47:56 [2021-02-06T00:47:56.987Z] !MESSAGE Error occurred during status handling
19:47:56 [2021-02-06T00:47:56.987Z] !STACK 0
19:47:56 [2021-02-06T00:47:56.987Z] java.lang.NullPointerException
19:47:56 [2021-02-06T00:47:56.987Z] 	at org.eclipse.ui.internal.statushandlers.StatusHandlerRegistry.<init>(StatusHandlerRegistry.java:71)
19:47:56 [2021-02-06T00:47:56.987Z] 	at org.eclipse.ui.internal.statushandlers.StatusHandlerRegistry.getDefault(StatusHandlerRegistry.java:90)
19:47:56 [2021-02-06T00:47:56.987Z] 	at org.eclipse.ui.statushandlers.StatusManager.getStatusHandler(StatusManager.java:152)
19:47:56 [2021-02-06T00:47:56.987Z] 	at org.eclipse.ui.statushandlers.StatusManager.handle(StatusManager.java:211)
19:47:56 [2021-02-06T00:47:56.987Z] 	at org.eclipse.ui.statushandlers.StatusManager.handle(StatusManager.java:260)
19:47:56 [2021-02-06T00:47:56.987Z] 	at org.eclipse.ui.statushandlers.StatusManager$StatusManagerLogListener.logging(StatusManager.java:331)
19:47:56 [2021-02-06T00:47:56.987Z] 	at org.eclipse.core.internal.runtime.RuntimeLog.logToListeners(RuntimeLog.java:161)
19:47:56 [2021-02-06T00:47:56.987Z] 	at org.eclipse.core.internal.runtime.PlatformLogWriter.logged(PlatformLogWriter.java:103)
19:47:56 [2021-02-06T00:47:56.987Z] 	at org.eclipse.osgi.internal.log.ExtendedLogReaderServiceFactory.safeLogged(ExtendedLogReaderServiceFactory.java:88)
19:47:56 [2021-02-06T00:47:56.987Z] 	at org.eclipse.osgi.internal.log.ExtendedLogReaderServiceFactory.logPrivileged(ExtendedLogReaderServiceFactory.java:217)
19:47:56 [2021-02-06T00:47:56.987Z] 	at org.eclipse.osgi.internal.log.ExtendedLogReaderServiceFactory.log(ExtendedLogReaderServiceFactory.java:189)
19:47:56 [2021-02-06T00:47:56.987Z] 	at org.eclipse.osgi.internal.log.ExtendedLogServiceFactory.log(ExtendedLogServiceFactory.java:65)
19:47:56 [2021-02-06T00:47:56.987Z] 	at org.eclipse.osgi.internal.log.ExtendedLogServiceImpl.log(ExtendedLogServiceImpl.java:87)
19:47:56 [2021-02-06T00:47:56.987Z] 	at org.eclipse.osgi.internal.log.LoggerImpl.log(LoggerImpl.java:54)
19:47:56 [2021-02-06T00:47:56.987Z] 	at org.eclipse.core.internal.runtime.Log.log(Log.java:65)
19:47:56 [2021-02-06T00:47:56.987Z] 	at org.eclipse.ui.internal.WorkbenchPlugin.log(WorkbenchPlugin.java:663)
19:47:56 [2021-02-06T00:47:56.987Z] 	at org.eclipse.ui.internal.decorators.DecoratorDefinition.handleCoreException(DecoratorDefinition.java:266)
19:47:56 [2021-02-06T00:47:56.987Z] 	at org.eclipse.ui.internal.decorators.LightweightDecoratorDefinition.decorate(LightweightDecoratorDefinition.java:263)
19:47:56 [2021-02-06T00:47:56.987Z] 	at org.eclipse.ui.internal.decorators.LightweightDecoratorManager$LightweightRunnable.run(LightweightDecoratorManager.java:104)
19:47:56 [2021-02-06T00:47:56.987Z] 	at org.eclipse.core.runtime.SafeRunner.run(SafeRunner.java:42)
19:47:56 [2021-02-06T00:47:56.987Z] 	at org.eclipse.ui.internal.decorators.LightweightDecoratorManager.decorate(LightweightDecoratorManager.java:377)
19:47:56 [2021-02-06T00:47:56.987Z] 	at org.eclipse.ui.internal.decorators.LightweightDecoratorManager.getDecorations(LightweightDecoratorManager.java:359)
19:47:56 [2021-02-06T00:47:56.987Z] 	at org.eclipse.ui.internal.decorators.DecorationScheduler$1.ensureResultCached(DecorationScheduler.java:347)
19:47:56 [2021-02-06T00:47:56.987Z] 	at org.eclipse.ui.internal.decorators.DecorationScheduler$1.run(DecorationScheduler.java:311)
19:47:56 [2021-02-06T00:47:56.987Z] 	at org.eclipse.core.internal.jobs.Worker.run(Worker.java:56)
19:47:56 [2021-02-06T00:47:56.987Z] 
19:47:56 [2021-02-06T00:47:56.987Z] !ENTRY org.eclipse.ui.workbench 4 2 2021-02-06 00:47:56.982
19:47:56 [2021-02-06T00:47:56.987Z] !MESSAGE Problems occurred when invoking code from plug-in: "org.eclipse.ui.workbench".
19:47:56 [2021-02-06T00:47:56.987Z] !STACK 0
19:47:56 [2021-02-06T00:47:56.987Z] java.lang.IllegalArgumentException
19:47:56 [2021-02-06T00:47:56.987Z] 	at org.eclipse.core.runtime.ListenerList.add(ListenerList.java:115)
19:47:56 [2021-02-06T00:47:56.987Z] 	at org.eclipse.jdt.internal.ui.AbstractJavaElementLabelDecorator.addListener(AbstractJavaElementLabelDecorator.java:59)
19:47:56 [2021-02-06T00:47:56.988Z] 	at org.eclipse.ui.internal.decorators.LightweightDecoratorDefinition$1.run(LightweightDecoratorDefinition.java:127)
19:47:56 [2021-02-06T00:47:56.988Z] 	at org.eclipse.core.runtime.SafeRunner.run(SafeRunner.java:42)
19:47:56 [2021-02-06T00:47:56.988Z] 	at org.eclipse.ui.internal.decorators.LightweightDecoratorDefinition.internalGetDecorator(LightweightDecoratorDefinition.java:120)
19:47:56 [2021-02-06T00:47:56.988Z] 	at org.eclipse.ui.internal.decorators.LightweightDecoratorDefinition.decorate(LightweightDecoratorDefinition.java:242)
19:47:56 [2021-02-06T00:47:56.988Z] 	at org.eclipse.ui.internal.decorators.LightweightDecoratorManager$LightweightRunnable.run(LightweightDecoratorManager.java:104)
19:47:56 [2021-02-06T00:47:56.988Z] 	at org.eclipse.core.runtime.SafeRunner.run(SafeRunner.java:42)
19:47:56 [2021-02-06T00:47:56.988Z] 	at org.eclipse.ui.internal.decorators.LightweightDecoratorManager.decorate(LightweightDecoratorManager.java:377)
19:47:56 [2021-02-06T00:47:56.988Z] 	at org.eclipse.ui.internal.decorators.LightweightDecoratorManager.getDecorations(LightweightDecoratorManager.java:359)
19:47:56 [2021-02-06T00:47:56.988Z] 	at org.eclipse.ui.internal.decorators.DecorationScheduler$1.ensureResultCached(DecorationScheduler.java:347)
19:47:56 [2021-02-06T00:47:56.988Z] 	at org.eclipse.ui.internal.decorators.DecorationScheduler$1.run(DecorationScheduler.java:311)
19:47:56 [2021-02-06T00:47:56.988Z] 	at org.eclipse.core.internal.jobs.Worker.run(Worker.java:56)
19:47:56 [2021-02-06T00:47:56.988Z] 
19:47:56 [2021-02-06T00:47:56.988Z] !ENTRY org.eclipse.ui.workbench 4 2 2021-02-06 00:47:56.982
19:47:56 [2021-02-06T00:47:56.988Z] !MESSAGE Problems occurred when invoking code from plug-in: "org.eclipse.ui.workbench".
19:47:56 [2021-02-06T00:47:56.988Z] !STACK 0
19:47:56 [2021-02-06T00:47:56.988Z] java.lang.IllegalArgumentException
19:47:56 [2021-02-06T00:47:56.988Z] 	at org.eclipse.core.runtime.ListenerList.add(ListenerList.java:115)
19:47:56 [2021-02-06T00:47:56.988Z] 	at org.eclipse.jdt.internal.ui.AbstractJavaElementLabelDecorator.addListener(AbstractJavaElementLabelDecorator.java:59)
19:47:56 [2021-02-06T00:47:56.988Z] 	at org.eclipse.ui.internal.decorators.LightweightDecoratorDefinition$1.run(LightweightDecoratorDefinition.java:127)
19:47:56 [2021-02-06T00:47:56.988Z] 	at org.eclipse.core.runtime.SafeRunner.run(SafeRunner.java:42)
19:47:56 [2021-02-06T00:47:56.988Z] 	at org.eclipse.ui.internal.decorators.LightweightDecoratorDefinition.internalGetDecorator(LightweightDecoratorDefinition.java:120)
19:47:56 [2021-02-06T00:47:56.988Z] 	at org.eclipse.ui.internal.decorators.LightweightDecoratorDefinition.decorate(LightweightDecoratorDefinition.java:242)
19:47:56 [2021-02-06T00:47:56.988Z] 	at org.eclipse.ui.internal.decorators.LightweightDecoratorManager$LightweightRunnable.run(LightweightDecoratorManager.java:104)
19:47:56 [2021-02-06T00:47:56.988Z] 	at org.eclipse.core.runtime.SafeRunner.run(SafeRunner.java:42)
19:47:56 [2021-02-06T00:47:56.988Z] 	at org.eclipse.ui.internal.decorators.LightweightDecoratorManager.decorate(LightweightDecoratorManager.java:377)
19:47:56 [2021-02-06T00:47:56.988Z] 	at org.eclipse.ui.internal.decorators.LightweightDecoratorManager.getDecorations(LightweightDecoratorManager.java:359)
19:47:56 [2021-02-06T00:47:56.988Z] 	at org.eclipse.ui.internal.decorators.DecorationScheduler$1.ensureResultCached(DecorationScheduler.java:347)
19:47:56 [2021-02-06T00:47:56.988Z] 	at org.eclipse.ui.internal.decorators.DecorationScheduler$1.run(DecorationScheduler.java:311)
19:47:56 [2021-02-06T00:47:56.988Z] 	at org.eclipse.core.internal.jobs.Worker.run(Worker.java:56)
19:47:56 [2021-02-06T00:47:56.988Z] 
19:47:56 [2021-02-06T00:47:56.988Z] !ENTRY org.eclipse.ui 4 0 2021-02-06 00:47:56.982
19:47:56 [2021-02-06T00:47:56.988Z] !MESSAGE Error occurred during status handling
19:47:56 [2021-02-06T00:47:56.988Z] !STACK 0
19:47:56 [2021-02-06T00:47:56.988Z] java.lang.NullPointerException
19:47:56 [2021-02-06T00:47:56.988Z] 	at org.eclipse.ui.internal.statushandlers.StatusHandlerRegistry.<init>(StatusHandlerRegistry.java:71)
19:47:56 [2021-02-06T00:47:56.988Z] 	at org.eclipse.ui.internal.statushandlers.StatusHandlerRegistry.getDefault(StatusHandlerRegistry.java:90)
19:47:56 [2021-02-06T00:47:56.988Z] 	at org.eclipse.ui.statushandlers.StatusManager.getStatusHandler(StatusManager.java:152)
19:47:56 [2021-02-06T00:47:56.988Z] 	at org.eclipse.ui.statushandlers.StatusManager.handle(StatusManager.java:211)
19:47:56 [2021-02-06T00:47:56.988Z] 	at org.eclipse.ui.statushandlers.StatusManager.handle(StatusManager.java:260)
19:47:56 [2021-02-06T00:47:56.988Z] 	at org.eclipse.ui.statushandlers.StatusManager$StatusManagerLogListener.logging(StatusManager.java:331)
19:47:56 [2021-02-06T00:47:56.988Z] 	at org.eclipse.core.internal.runtime.RuntimeLog.logToListeners(RuntimeLog.java:161)
19:47:56 [2021-02-06T00:47:56.988Z] 	at org.eclipse.core.internal.runtime.PlatformLogWriter.logged(PlatformLogWriter.java:103)
19:47:56 [2021-02-06T00:47:56.988Z] 	at org.eclipse.osgi.internal.log.ExtendedLogReaderServiceFactory.safeLogged(ExtendedLogReaderServiceFactory.java:88)
19:47:56 [2021-02-06T00:47:56.988Z] 	at org.eclipse.osgi.internal.log.ExtendedLogReaderServiceFactory.logPrivileged(ExtendedLogReaderServiceFactory.java:217)
19:47:56 [2021-02-06T00:47:56.988Z] 	at org.eclipse.osgi.internal.log.ExtendedLogReaderServiceFactory.log(ExtendedLogReaderServiceFactory.java:189)
19:47:56 [2021-02-06T00:47:56.988Z] 	at org.eclipse.osgi.internal.log.ExtendedLogServiceFactory.log(ExtendedLogServiceFactory.java:65)
19:47:56 [2021-02-06T00:47:56.988Z] 	at org.eclipse.osgi.internal.log.ExtendedLogServiceImpl.log(ExtendedLogServiceImpl.java:87)
19:47:56 [2021-02-06T00:47:56.988Z] 	at org.eclipse.osgi.internal.log.LoggerImpl.log(LoggerImpl.java:54)
19:47:56 [2021-02-06T00:47:56.988Z] 	at org.eclipse.core.internal.runtime.PlatformLogWriter.logging(PlatformLogWriter.java:44)
19:47:56 [2021-02-06T00:47:56.988Z] 	at org.eclipse.core.internal.runtime.RuntimeLog.log(RuntimeLog.java:97)
19:47:56 [2021-02-06T00:47:56.988Z] 	at org.eclipse.core.runtime.SafeRunner.handleException(SafeRunner.java:71)
19:47:56 [2021-02-06T00:47:56.988Z] 	at org.eclipse.core.runtime.SafeRunner.run(SafeRunner.java:44)
19:47:56 [2021-02-06T00:47:56.988Z] 	at org.eclipse.ui.internal.decorators.LightweightDecoratorDefinition.internalGetDecorator(LightweightDecoratorDefinition.java:120)
19:47:56 [2021-02-06T00:47:56.988Z] 	at org.eclipse.ui.internal.decorators.LightweightDecoratorDefinition.decorate(LightweightDecoratorDefinition.java:242)
19:47:56 [2021-02-06T00:47:56.988Z] 	at org.eclipse.ui.internal.decorators.LightweightDecoratorManager$LightweightRunnable.run(LightweightDecoratorManager.java:104)
19:47:56 [2021-02-06T00:47:56.988Z] 	at org.eclipse.core.runtime.SafeRunner.run(SafeRunner.java:42)
19:47:56 [2021-02-06T00:47:56.988Z] 	at org.eclipse.ui.internal.decorators.LightweightDecoratorManager.decorate(LightweightDecoratorManager.java:377)
19:47:56 [2021-02-06T00:47:56.988Z] 	at org.eclipse.ui.internal.decorators.LightweightDecoratorManager.getDecorations(LightweightDecoratorManager.java:359)
19:47:56 [2021-02-06T00:47:56.988Z] 	at org.eclipse.ui.internal.decorators.DecorationScheduler$1.ensureResultCached(DecorationScheduler.java:347)
19:47:56 [2021-02-06T00:47:56.988Z] 	at org.eclipse.ui.internal.decorators.DecorationScheduler$1.run(DecorationScheduler.java:311)
19:47:56 [2021-02-06T00:47:56.988Z] 	at org.eclipse.core.internal.jobs.Worker.run(Worker.java:56)
19:47:57 [2021-02-06T00:47:57.552Z] 
19:47:57 [2021-02-06T00:47:57.552Z] !ENTRY org.eclipse.equinox.registry 4 1 2021-02-06 00:47:57.466
19:47:57 [2021-02-06T00:47:57.552Z] !MESSAGE Plug-in "org.eclipse.egit.ui" was unable to instantiate class "org.eclipse.egit.ui.internal.decorators.GitLightweightDecorator".
19:47:57 [2021-02-06T00:47:57.552Z] !STACK 0
19:47:57 [2021-02-06T00:47:57.552Z] org.eclipse.swt.SWTException: Device is disposed
19:47:57 [2021-02-06T00:47:57.552Z] 	at org.eclipse.swt.SWT.error(SWT.java:4533)
19:47:57 [2021-02-06T00:47:57.552Z] 	at org.eclipse.swt.SWT.error(SWT.java:4448)
19:47:57 [2021-02-06T00:47:57.552Z] 	at org.eclipse.swt.SWT.error(SWT.java:4419)
19:47:57 [2021-02-06T00:47:57.552Z] 	at org.eclipse.swt.widgets.Display.error(Display.java:1289)
19:47:57 [2021-02-06T00:47:57.552Z] 	at org.eclipse.swt.widgets.Display.syncExec(Display.java:5526)
19:47:57 [2021-02-06T00:47:57.552Z] 	at org.eclipse.egit.ui.internal.decorators.GitLightweightDecorator$ChangeTrackingColorsAndFonts.reload(GitLightweightDecorator.java:336)
19:47:57 [2021-02-06T00:47:57.552Z] 	at org.eclipse.egit.ui.internal.decorators.GitLightweightDecorator$ChangeTrackingColorsAndFonts.<init>(GitLightweightDecorator.java:331)
19:47:57 [2021-02-06T00:47:57.552Z] 	at org.eclipse.egit.ui.internal.decorators.GitLightweightDecorator.<init>(GitLightweightDecorator.java:125)
19:47:57 [2021-02-06T00:47:57.552Z] 	at sun.reflect.NativeConstructorAccessorImpl.newInstance0(Native Method)
19:47:57 [2021-02-06T00:47:57.552Z] 	at sun.reflect.NativeConstructorAccessorImpl.newInstance(NativeConstructorAccessorImpl.java:62)
19:47:57 [2021-02-06T00:47:57.552Z] 	at sun.reflect.DelegatingConstructorAccessorImpl.newInstance(DelegatingConstructorAccessorImpl.java:45)
19:47:57 [2021-02-06T00:47:57.552Z] 	at java.lang.reflect.Constructor.newInstance(Constructor.java:423)
19:47:57 [2021-02-06T00:47:57.552Z] 	at java.lang.Class.newInstance(Class.java:442)
19:47:57 [2021-02-06T00:47:57.552Z] 	at org.eclipse.core.internal.registry.osgi.RegistryStrategyOSGI.createExecutableExtension(RegistryStrategyOSGI.java:184)
19:47:57 [2021-02-06T00:47:57.552Z] 	at org.eclipse.core.internal.registry.ExtensionRegistry.createExecutableExtension(ExtensionRegistry.java:905)
19:47:57 [2021-02-06T00:47:57.552Z] 	at org.eclipse.core.internal.registry.ConfigurationElement.createExecutableExtension(ConfigurationElement.java:243)
19:47:57 [2021-02-06T00:47:57.552Z] 	at org.eclipse.core.internal.registry.ConfigurationElementHandle.createExecutableExtension(ConfigurationElementHandle.java:55)
19:47:57 [2021-02-06T00:47:57.552Z] 	at org.eclipse.ui.internal.WorkbenchPlugin.createExtension(WorkbenchPlugin.java:281)
19:47:57 [2021-02-06T00:47:57.552Z] 	at org.eclipse.ui.internal.decorators.LightweightDecoratorDefinition$1.run(LightweightDecoratorDefinition.java:125)
19:47:57 [2021-02-06T00:47:57.552Z] 	at org.eclipse.core.runtime.SafeRunner.run(SafeRunner.java:42)
19:47:57 [2021-02-06T00:47:57.552Z] 	at org.eclipse.ui.internal.decorators.LightweightDecoratorDefinition.internalGetDecorator(LightweightDecoratorDefinition.java:120)
19:47:57 [2021-02-06T00:47:57.552Z] 	at org.eclipse.ui.internal.decorators.LightweightDecoratorDefinition.decorate(LightweightDecoratorDefinition.java:242)
19:47:57 [2021-02-06T00:47:57.552Z] 	at org.eclipse.ui.internal.decorators.LightweightDecoratorManager$LightweightRunnable.run(LightweightDecoratorManager.java:104)
19:47:57 [2021-02-06T00:47:57.552Z] 	at org.eclipse.core.runtime.SafeRunner.run(SafeRunner.java:42)
19:47:57 [2021-02-06T00:47:57.552Z] 	at org.eclipse.ui.internal.decorators.LightweightDecoratorManager.decorate(LightweightDecoratorManager.java:377)
19:47:57 [2021-02-06T00:47:57.552Z] 	at org.eclipse.ui.internal.decorators.LightweightDecoratorManager.getDecorations(LightweightDecoratorManager.java:359)
19:47:57 [2021-02-06T00:47:57.552Z] 	at org.eclipse.ui.internal.decorators.DecorationScheduler$1.ensureResultCached(DecorationScheduler.java:347)
19:47:57 [2021-02-06T00:47:57.552Z] 	at org.eclipse.ui.internal.decorators.DecorationScheduler$1.run(DecorationScheduler.java:311)
19:47:57 [2021-02-06T00:47:57.552Z] 	at org.eclipse.core.internal.jobs.Worker.run(Worker.java:56)
19:47:57 [2021-02-06T00:47:57.552Z] 
19:47:57 [2021-02-06T00:47:57.552Z] !ENTRY org.eclipse.equinox.registry 4 1 2021-02-06 00:47:57.467
19:47:57 [2021-02-06T00:47:57.552Z] !MESSAGE Plug-in "org.eclipse.egit.ui" was unable to instantiate class "org.eclipse.egit.ui.internal.decorators.GitLightweightDecorator".
19:47:57 [2021-02-06T00:47:57.552Z] !STACK 0
19:47:57 [2021-02-06T00:47:57.552Z] org.eclipse.swt.SWTException: Device is disposed
19:47:57 [2021-02-06T00:47:57.552Z] 	at org.eclipse.swt.SWT.error(SWT.java:4533)
19:47:57 [2021-02-06T00:47:57.552Z] 	at org.eclipse.swt.SWT.error(SWT.java:4448)
19:47:57 [2021-02-06T00:47:57.552Z] 	at org.eclipse.swt.SWT.error(SWT.java:4419)
19:47:57 [2021-02-06T00:47:57.552Z] 	at org.eclipse.swt.widgets.Display.error(Display.java:1289)
19:47:57 [2021-02-06T00:47:57.552Z] 	at org.eclipse.swt.widgets.Display.syncExec(Display.java:5526)
19:47:57 [2021-02-06T00:47:57.552Z] 	at org.eclipse.egit.ui.internal.decorators.GitLightweightDecorator$ChangeTrackingColorsAndFonts.reload(GitLightweightDecorator.java:336)
19:47:57 [2021-02-06T00:47:57.552Z] 	at org.eclipse.egit.ui.internal.decorators.GitLightweightDecorator$ChangeTrackingColorsAndFonts.<init>(GitLightweightDecorator.java:331)
19:47:57 [2021-02-06T00:47:57.552Z] 	at org.eclipse.egit.ui.internal.decorators.GitLightweightDecorator.<init>(GitLightweightDecorator.java:125)
19:47:57 [2021-02-06T00:47:57.552Z] 	at sun.reflect.NativeConstructorAccessorImpl.newInstance0(Native Method)
19:47:57 [2021-02-06T00:47:57.552Z] 	at sun.reflect.NativeConstructorAccessorImpl.newInstance(NativeConstructorAccessorImpl.java:62)
19:47:57 [2021-02-06T00:47:57.552Z] 	at sun.reflect.DelegatingConstructorAccessorImpl.newInstance(DelegatingConstructorAccessorImpl.java:45)
19:47:57 [2021-02-06T00:47:57.552Z] 	at java.lang.reflect.Constructor.newInstance(Constructor.java:423)
19:47:57 [2021-02-06T00:47:57.552Z] 	at java.lang.Class.newInstance(Class.java:442)
19:47:57 [2021-02-06T00:47:57.552Z] 	at org.eclipse.core.internal.registry.osgi.RegistryStrategyOSGI.createExecutableExtension(RegistryStrategyOSGI.java:184)
19:47:57 [2021-02-06T00:47:57.552Z] 	at org.eclipse.core.internal.registry.ExtensionRegistry.createExecutableExtension(ExtensionRegistry.java:905)
19:47:57 [2021-02-06T00:47:57.552Z] 	at org.eclipse.core.internal.registry.ConfigurationElement.createExecutableExtension(ConfigurationElement.java:243)
19:47:57 [2021-02-06T00:47:57.552Z] 	at org.eclipse.core.internal.registry.ConfigurationElementHandle.createExecutableExtension(ConfigurationElementHandle.java:55)
19:47:57 [2021-02-06T00:47:57.552Z] 	at org.eclipse.ui.internal.WorkbenchPlugin.createExtension(WorkbenchPlugin.java:281)
19:47:57 [2021-02-06T00:47:57.552Z] 	at org.eclipse.ui.internal.decorators.LightweightDecoratorDefinition$1.run(LightweightDecoratorDefinition.java:125)
19:47:57 [2021-02-06T00:47:57.552Z] 	at org.eclipse.core.runtime.SafeRunner.run(SafeRunner.java:42)
19:47:57 [2021-02-06T00:47:57.553Z] 	at org.eclipse.ui.internal.decorators.LightweightDecoratorDefinition.internalGetDecorator(LightweightDecoratorDefinition.java:120)
19:47:57 [2021-02-06T00:47:57.553Z] 	at org.eclipse.ui.internal.decorators.LightweightDecoratorDefinition.decorate(LightweightDecoratorDefinition.java:242)
19:47:57 [2021-02-06T00:47:57.553Z] 	at org.eclipse.ui.internal.decorators.LightweightDecoratorManager$LightweightRunnable.run(LightweightDecoratorManager.java:104)
19:47:57 [2021-02-06T00:47:57.553Z] 	at org.eclipse.core.runtime.SafeRunner.run(SafeRunner.java:42)
19:47:57 [2021-02-06T00:47:57.553Z] 	at org.eclipse.ui.internal.decorators.LightweightDecoratorManager.decorate(LightweightDecoratorManager.java:377)
19:47:57 [2021-02-06T00:47:57.553Z] 	at org.eclipse.ui.internal.decorators.LightweightDecoratorManager.getDecorations(LightweightDecoratorManager.java:359)
19:47:57 [2021-02-06T00:47:57.553Z] 	at org.eclipse.ui.internal.decorators.DecorationScheduler$1.ensureResultCached(DecorationScheduler.java:347)
19:47:57 [2021-02-06T00:47:57.553Z] 	at org.eclipse.ui.internal.decorators.DecorationScheduler$1.run(DecorationScheduler.java:311)
19:47:57 [2021-02-06T00:47:57.553Z] 	at org.eclipse.core.internal.jobs.Worker.run(Worker.java:56)
19:47:57 [2021-02-06T00:47:57.553Z] 
19:47:57 [2021-02-06T00:47:57.553Z] !ENTRY org.eclipse.ui 4 0 2021-02-06 00:47:57.467
19:47:57 [2021-02-06T00:47:57.553Z] !MESSAGE Error occurred during status handling
19:47:57 [2021-02-06T00:47:57.553Z] !STACK 0
19:47:57 [2021-02-06T00:47:57.553Z] java.lang.NullPointerException
19:47:57 [2021-02-06T00:47:57.553Z] 	at org.eclipse.ui.internal.statushandlers.StatusHandlerRegistry.<init>(StatusHandlerRegistry.java:71)
19:47:57 [2021-02-06T00:47:57.553Z] 	at org.eclipse.ui.internal.statushandlers.StatusHandlerRegistry.getDefault(StatusHandlerRegistry.java:90)
19:47:57 [2021-02-06T00:47:57.553Z] 	at org.eclipse.ui.statushandlers.StatusManager.getStatusHandler(StatusManager.java:152)
19:47:57 [2021-02-06T00:47:57.553Z] 	at org.eclipse.ui.statushandlers.StatusManager.handle(StatusManager.java:211)
19:47:57 [2021-02-06T00:47:57.553Z] 	at org.eclipse.ui.statushandlers.StatusManager.handle(StatusManager.java:260)
19:47:57 [2021-02-06T00:47:57.553Z] 	at org.eclipse.ui.statushandlers.StatusManager$StatusManagerLogListener.logging(StatusManager.java:331)
19:47:57 [2021-02-06T00:47:57.553Z] 	at org.eclipse.core.internal.runtime.RuntimeLog.logToListeners(RuntimeLog.java:161)
19:47:57 [2021-02-06T00:47:57.553Z] 	at org.eclipse.core.internal.runtime.PlatformLogWriter.logged(PlatformLogWriter.java:103)
19:47:57 [2021-02-06T00:47:57.553Z] 	at org.eclipse.osgi.internal.log.ExtendedLogReaderServiceFactory.safeLogged(ExtendedLogReaderServiceFactory.java:88)
19:47:57 [2021-02-06T00:47:57.553Z] 	at org.eclipse.osgi.internal.log.ExtendedLogReaderServiceFactory.logPrivileged(ExtendedLogReaderServiceFactory.java:217)
19:47:57 [2021-02-06T00:47:57.553Z] 	at org.eclipse.osgi.internal.log.ExtendedLogReaderServiceFactory.log(ExtendedLogReaderServiceFactory.java:189)
19:47:57 [2021-02-06T00:47:57.553Z] 	at org.eclipse.osgi.internal.log.ExtendedLogServiceFactory.log(ExtendedLogServiceFactory.java:65)
19:47:57 [2021-02-06T00:47:57.553Z] 	at org.eclipse.osgi.internal.log.ExtendedLogServiceImpl.log(ExtendedLogServiceImpl.java:87)
19:47:57 [2021-02-06T00:47:57.553Z] 	at org.eclipse.osgi.internal.log.LoggerImpl.log(LoggerImpl.java:54)
19:47:57 [2021-02-06T00:47:57.553Z] 	at org.eclipse.core.internal.runtime.Log.log(Log.java:65)
19:47:57 [2021-02-06T00:47:57.553Z] 	at org.eclipse.ui.internal.WorkbenchPlugin.log(WorkbenchPlugin.java:663)
19:47:57 [2021-02-06T00:47:57.553Z] 	at org.eclipse.ui.internal.decorators.DecoratorDefinition.handleCoreException(DecoratorDefinition.java:266)
19:47:57 [2021-02-06T00:47:57.553Z] 	at org.eclipse.ui.internal.decorators.LightweightDecoratorDefinition.decorate(LightweightDecoratorDefinition.java:263)
19:47:57 [2021-02-06T00:47:57.553Z] 	at org.eclipse.ui.internal.decorators.LightweightDecoratorManager$LightweightRunnable.run(LightweightDecoratorManager.java:104)
19:47:57 [2021-02-06T00:47:57.553Z] 	at org.eclipse.core.runtime.SafeRunner.run(SafeRunner.java:42)
19:47:57 [2021-02-06T00:47:57.553Z] 	at org.eclipse.ui.internal.decorators.LightweightDecoratorManager.decorate(LightweightDecoratorManager.java:377)
19:47:57 [2021-02-06T00:47:57.553Z] 	at org.eclipse.ui.internal.decorators.LightweightDecoratorManager.getDecorations(LightweightDecoratorManager.java:359)
19:47:57 [2021-02-06T00:47:57.553Z] 	at org.eclipse.ui.internal.decorators.DecorationScheduler$1.ensureResultCached(DecorationScheduler.java:347)
19:47:57 [2021-02-06T00:47:57.553Z] 	at org.eclipse.ui.internal.decorators.DecorationScheduler$1.run(DecorationScheduler.java:311)
19:47:57 [2021-02-06T00:47:57.553Z] 	at org.eclipse.core.internal.jobs.Worker.run(Worker.java:56)
19:47:58 [2021-02-06T00:47:58.922Z] 00:47:58 [INFO] All tests passed!
19:47:58 [2021-02-06T00:47:58.922Z] 00:47:58 [INFO] 
19:47:58 [2021-02-06T00:47:58.922Z] 00:47:58 [INFO] >>> spotbugs-maven-plugin:3.1.11:check (default) > :spotbugs @ org.eclipse.mylyn.github.tests >>>
19:47:58 [2021-02-06T00:47:58.922Z] 00:47:58 [INFO] 
19:47:58 [2021-02-06T00:47:58.922Z] 00:47:58 [INFO] --- spotbugs-maven-plugin:3.1.11:spotbugs (spotbugs) @ org.eclipse.mylyn.github.tests ---
19:47:58 [2021-02-06T00:47:58.922Z] 00:47:58 [INFO] Fork Value is true
19:48:00 [2021-02-06T00:48:00.821Z] 00:48:00 [INFO] Done SpotBugs Analysis....
19:48:00 [2021-02-06T00:48:00.821Z] 00:48:00 [INFO] 
19:48:00 [2021-02-06T00:48:00.821Z] 00:48:00 [INFO] <<< spotbugs-maven-plugin:3.1.11:check (default) < :spotbugs @ org.eclipse.mylyn.github.tests <<<
19:48:00 [2021-02-06T00:48:00.821Z] 00:48:00 [INFO] 
19:48:00 [2021-02-06T00:48:00.821Z] 00:48:00 [INFO] 
19:48:00 [2021-02-06T00:48:00.821Z] 00:48:00 [INFO] --- spotbugs-maven-plugin:3.1.11:check (default) @ org.eclipse.mylyn.github.tests ---
19:48:00 [2021-02-06T00:48:00.821Z] 00:48:00 [INFO] BugInstance size is 0
19:48:00 [2021-02-06T00:48:00.821Z] 00:48:00 [INFO] Error size is 0
19:48:00 [2021-02-06T00:48:00.821Z] 00:48:00 [INFO] No errors/warnings found
19:48:00 [2021-02-06T00:48:00.821Z] 00:48:00 [INFO] 
19:48:00 [2021-02-06T00:48:00.821Z] 00:48:00 [INFO] >>> maven-pmd-plugin:3.11.0:cpd-check (default) > :cpd @ org.eclipse.mylyn.github.tests >>>
19:48:00 [2021-02-06T00:48:00.821Z] 00:48:00 [INFO] 
19:48:00 [2021-02-06T00:48:00.821Z] 00:48:00 [INFO] --- maven-pmd-plugin:3.11.0:cpd (cpd) @ org.eclipse.mylyn.github.tests ---
19:48:00 [2021-02-06T00:48:00.821Z] 00:48:00 [INFO] 
19:48:00 [2021-02-06T00:48:00.821Z] 00:48:00 [INFO] <<< maven-pmd-plugin:3.11.0:cpd-check (default) < :cpd @ org.eclipse.mylyn.github.tests <<<
19:48:00 [2021-02-06T00:48:00.821Z] 00:48:00 [INFO] 
19:48:00 [2021-02-06T00:48:00.821Z] 00:48:00 [INFO] 
19:48:00 [2021-02-06T00:48:00.821Z] 00:48:00 [INFO] --- maven-pmd-plugin:3.11.0:cpd-check (default) @ org.eclipse.mylyn.github.tests ---
19:48:00 [2021-02-06T00:48:00.821Z] 00:48:00 [INFO] 
19:48:00 [2021-02-06T00:48:00.821Z] 00:48:00 [INFO] 
19:48:00 [2021-02-06T00:48:00.821Z] 00:48:00 [INFO] --- tycho-pack200a-plugin:1.7.0:normalize (pack200-normalize) @ org.eclipse.mylyn.github.tests ---
19:48:00 [2021-02-06T00:48:00.821Z] 00:48:00 [INFO] Pack200 normalizing jar /home/jenkins/agent/workspace/egit-github/repo/org.eclipse.mylyn.github.tests/target/org.eclipse.mylyn.github.tests-5.11.0-SNAPSHOT.jar
19:48:00 [2021-02-06T00:48:00.821Z] 00:48:00 [INFO] 
19:48:00 [2021-02-06T00:48:00.821Z] 00:48:00 [INFO] --- eclipse-jarsigner-plugin:1.1.5:sign (sign) @ org.eclipse.mylyn.github.tests ---
19:48:00 [2021-02-06T00:48:00.821Z] 00:48:00 [INFO] Signing jar: /home/jenkins/agent/workspace/egit-github/repo/org.eclipse.mylyn.github.tests/target/org.eclipse.mylyn.github.tests-5.11.0-SNAPSHOT.jar
19:48:02 [2021-02-06T00:48:02.193Z] 00:48:01 [INFO] 
19:48:02 [2021-02-06T00:48:02.193Z] 00:48:01 [INFO] --- tycho-pack200b-plugin:1.7.0:pack (pack200-pack) @ org.eclipse.mylyn.github.tests ---
19:48:02 [2021-02-06T00:48:02.193Z] 00:48:01 [INFO] Pack200 packing jar /home/jenkins/agent/workspace/egit-github/repo/org.eclipse.mylyn.github.tests/target/org.eclipse.mylyn.github.tests-5.11.0-SNAPSHOT.jar
19:48:02 [2021-02-06T00:48:02.193Z] 00:48:01 [INFO] 
19:48:02 [2021-02-06T00:48:02.193Z] 00:48:01 [INFO] --- tycho-p2-plugin:1.7.0:p2-metadata (p2-metadata) @ org.eclipse.mylyn.github.tests ---
19:48:02 [2021-02-06T00:48:02.193Z] 00:48:01 [INFO] 
19:48:02 [2021-02-06T00:48:02.193Z] 00:48:01 [INFO] --- maven-install-plugin:2.3.1:install (default-install) @ org.eclipse.mylyn.github.tests ---
19:48:02 [2021-02-06T00:48:02.193Z] 00:48:01 [INFO] Installing /home/jenkins/agent/workspace/egit-github/repo/org.eclipse.mylyn.github.tests/target/org.eclipse.mylyn.github.tests-5.11.0-SNAPSHOT.jar to /home/jenkins/agent/workspace/egit-github/.repository/org/eclipse/mylyn/github/org.eclipse.mylyn.github.tests/5.11.0-SNAPSHOT/org.eclipse.mylyn.github.tests-5.11.0-SNAPSHOT.jar
19:48:02 [2021-02-06T00:48:02.193Z] 00:48:01 [INFO] Installing /home/jenkins/agent/workspace/egit-github/repo/org.eclipse.mylyn.github.tests/pom.xml to /home/jenkins/agent/workspace/egit-github/.repository/org/eclipse/mylyn/github/org.eclipse.mylyn.github.tests/5.11.0-SNAPSHOT/org.eclipse.mylyn.github.tests-5.11.0-SNAPSHOT.pom
19:48:02 [2021-02-06T00:48:02.193Z] 00:48:01 [INFO] Installing /home/jenkins/agent/workspace/egit-github/repo/org.eclipse.mylyn.github.tests/target/org.eclipse.mylyn.github.tests-5.11.0-SNAPSHOT.jar.pack.gz to /home/jenkins/agent/workspace/egit-github/.repository/org/eclipse/mylyn/github/org.eclipse.mylyn.github.tests/5.11.0-SNAPSHOT/org.eclipse.mylyn.github.tests-5.11.0-SNAPSHOT-pack200.jar.pack.gz
19:48:02 [2021-02-06T00:48:02.193Z] 00:48:01 [INFO] Installing /home/jenkins/agent/workspace/egit-github/repo/org.eclipse.mylyn.github.tests/target/p2content.xml to /home/jenkins/agent/workspace/egit-github/.repository/org/eclipse/mylyn/github/org.eclipse.mylyn.github.tests/5.11.0-SNAPSHOT/org.eclipse.mylyn.github.tests-5.11.0-SNAPSHOT-p2metadata.xml
19:48:02 [2021-02-06T00:48:02.193Z] 00:48:01 [INFO] Installing /home/jenkins/agent/workspace/egit-github/repo/org.eclipse.mylyn.github.tests/target/p2artifacts.xml to /home/jenkins/agent/workspace/egit-github/.repository/org/eclipse/mylyn/github/org.eclipse.mylyn.github.tests/5.11.0-SNAPSHOT/org.eclipse.mylyn.github.tests-5.11.0-SNAPSHOT-p2artifacts.xml
19:48:02 [2021-02-06T00:48:02.193Z] 00:48:01 [INFO] 
19:48:02 [2021-02-06T00:48:02.193Z] 00:48:01 [INFO] --- tycho-p2-plugin:1.7.0:update-local-index (default-update-local-index) @ org.eclipse.mylyn.github.tests ---
19:48:02 [2021-02-06T00:48:02.193Z] 00:48:01 [INFO] 
19:48:02 [2021-02-06T00:48:02.193Z] 00:48:01 [INFO] -------------< org.eclipse.mylyn.github:github-updatesite >-------------
19:48:02 [2021-02-06T00:48:02.193Z] 00:48:01 [INFO] Building Eclipse EGit Mylyn GitHub Repository 5.11.0-SNAPSHOT    [10/10]
19:48:02 [2021-02-06T00:48:02.193Z] 00:48:01 [INFO] -------------------------[ eclipse-repository ]-------------------------
19:48:02 [2021-02-06T00:48:02.193Z] 00:48:01 [INFO] 
19:48:02 [2021-02-06T00:48:02.193Z] 00:48:01 [INFO] --- maven-clean-plugin:2.5:clean (default-clean) @ github-updatesite ---
19:48:02 [2021-02-06T00:48:02.193Z] 00:48:01 [INFO] 
19:48:02 [2021-02-06T00:48:02.193Z] 00:48:01 [INFO] --- tycho-packaging-plugin:1.7.0:build-qualifier-aggregator (default-build-qualifier-aggregator) @ github-updatesite ---
19:48:02 [2021-02-06T00:48:02.193Z] 00:48:01 [INFO] The project's OSGi version is 5.11.0.202102060045
19:48:02 [2021-02-06T00:48:02.193Z] 00:48:01 [INFO] 
19:48:02 [2021-02-06T00:48:02.193Z] 00:48:01 [INFO] --- maven-enforcer-plugin:3.0.0-M2:enforce (enforce-maven) @ github-updatesite ---
19:48:02 [2021-02-06T00:48:02.193Z] 00:48:01 [INFO] 
19:48:02 [2021-02-06T00:48:02.193Z] 00:48:01 [INFO] --- maven-clean-plugin:2.5:clean (default-clean-1) @ github-updatesite ---
19:48:02 [2021-02-06T00:48:02.193Z] 00:48:01 [INFO] 
19:48:02 [2021-02-06T00:48:02.193Z] 00:48:01 [INFO] --- maven-resources-plugin:3.1.0:resources (default-resources) @ github-updatesite ---
19:48:02 [2021-02-06T00:48:02.193Z] 00:48:01 [INFO] Using 'UTF-8' encoding to copy filtered resources.
19:48:02 [2021-02-06T00:48:02.193Z] 00:48:01 [INFO] skip non existing resourceDirectory /home/jenkins/agent/workspace/egit-github/repo/org.eclipse.mylyn.github-site/src/main/resources
19:48:02 [2021-02-06T00:48:02.193Z] 00:48:01 [INFO] 
19:48:02 [2021-02-06T00:48:02.193Z] 00:48:01 [INFO] --- target-platform-configuration:1.7.0:target-platform (default-target-platform) @ github-updatesite ---
19:48:02 [2021-02-06T00:48:02.193Z] 00:48:01 [INFO] 
19:48:02 [2021-02-06T00:48:02.193Z] 00:48:01 [INFO] --- tycho-p2-publisher-plugin:1.7.0:publish-osgi-ee (default-publish-osgi-ee) @ github-updatesite ---
19:48:02 [2021-02-06T00:48:02.193Z] 00:48:01 [INFO] Published profile IUs: [a.jre.javase 11.0.0, config.a.jre.javase 11.0.0]
19:48:02 [2021-02-06T00:48:02.193Z] 00:48:01 [INFO] Published profile IUs: [a.jre.javase 14.0.0, config.a.jre.javase 14.0.0]
19:48:02 [2021-02-06T00:48:02.193Z] 00:48:01 [INFO] 
19:48:02 [2021-02-06T00:48:02.193Z] 00:48:01 [INFO] --- tycho-p2-publisher-plugin:1.7.0:publish-products (default-publish-products) @ github-updatesite ---
19:48:02 [2021-02-06T00:48:02.193Z] 00:48:01 [INFO] 
19:48:02 [2021-02-06T00:48:02.193Z] 00:48:01 [INFO] --- tycho-p2-publisher-plugin:1.7.0:publish-categories (default-publish-categories) @ github-updatesite ---
19:48:02 [2021-02-06T00:48:02.193Z] 00:48:01 [INFO] 
19:48:02 [2021-02-06T00:48:02.193Z] 00:48:01 [INFO] --- tycho-p2-publisher-plugin:1.7.0:attach-artifacts (default-attach-artifacts) @ github-updatesite ---
19:48:02 [2021-02-06T00:48:02.193Z] 00:48:01 [INFO] 
19:48:02 [2021-02-06T00:48:02.193Z] 00:48:01 [INFO] --- tycho-p2-repository-plugin:1.7.0:assemble-repository (default-assemble-repository) @ github-updatesite ---
19:48:03 [2021-02-06T00:48:03.124Z] 00:48:02 [INFO] 
19:48:03 [2021-02-06T00:48:03.124Z] 00:48:02 [INFO] --- tycho-p2-repository-plugin:1.7.0:archive-repository (default-archive-repository) @ github-updatesite ---
19:48:03 [2021-02-06T00:48:03.124Z] 00:48:02 [INFO] Building zip: /home/jenkins/agent/workspace/egit-github/repo/org.eclipse.mylyn.github-site/target/github-updatesite-5.11.0-SNAPSHOT.zip
19:48:03 [2021-02-06T00:48:03.124Z] 00:48:03 [INFO] 
19:48:03 [2021-02-06T00:48:03.124Z] 00:48:03 [INFO] >>> spotbugs-maven-plugin:3.1.11:check (default) > :spotbugs @ github-updatesite >>>
19:48:03 [2021-02-06T00:48:03.124Z] 00:48:03 [INFO] 
19:48:03 [2021-02-06T00:48:03.124Z] 00:48:03 [INFO] --- spotbugs-maven-plugin:3.1.11:spotbugs (spotbugs) @ github-updatesite ---
19:48:03 [2021-02-06T00:48:03.124Z] 00:48:03 [INFO] 
19:48:03 [2021-02-06T00:48:03.124Z] 00:48:03 [INFO] <<< spotbugs-maven-plugin:3.1.11:check (default) < :spotbugs @ github-updatesite <<<
19:48:03 [2021-02-06T00:48:03.124Z] 00:48:03 [INFO] 
19:48:03 [2021-02-06T00:48:03.124Z] 00:48:03 [INFO] 
19:48:03 [2021-02-06T00:48:03.124Z] 00:48:03 [INFO] --- spotbugs-maven-plugin:3.1.11:check (default) @ github-updatesite ---
19:48:03 [2021-02-06T00:48:03.124Z] 00:48:03 [INFO] 
19:48:03 [2021-02-06T00:48:03.124Z] 00:48:03 [INFO] >>> maven-pmd-plugin:3.11.0:cpd-check (default) > :cpd @ github-updatesite >>>
19:48:03 [2021-02-06T00:48:03.124Z] 00:48:03 [INFO] 
19:48:03 [2021-02-06T00:48:03.124Z] 00:48:03 [INFO] --- maven-pmd-plugin:3.11.0:cpd (cpd) @ github-updatesite ---
19:48:03 [2021-02-06T00:48:03.124Z] 00:48:03 [INFO] 
19:48:03 [2021-02-06T00:48:03.124Z] 00:48:03 [INFO] <<< maven-pmd-plugin:3.11.0:cpd-check (default) < :cpd @ github-updatesite <<<
19:48:03 [2021-02-06T00:48:03.124Z] 00:48:03 [INFO] 
19:48:03 [2021-02-06T00:48:03.124Z] 00:48:03 [INFO] 
19:48:03 [2021-02-06T00:48:03.124Z] 00:48:03 [INFO] --- maven-pmd-plugin:3.11.0:cpd-check (default) @ github-updatesite ---
19:48:03 [2021-02-06T00:48:03.124Z] 00:48:03 [INFO] 
19:48:03 [2021-02-06T00:48:03.124Z] 00:48:03 [INFO] 
19:48:03 [2021-02-06T00:48:03.124Z] 00:48:03 [INFO] --- tycho-pack200a-plugin:1.7.0:normalize (pack200-normalize) @ github-updatesite ---
19:48:03 [2021-02-06T00:48:03.124Z] 00:48:03 [INFO] 
19:48:03 [2021-02-06T00:48:03.124Z] 00:48:03 [INFO] --- eclipse-jarsigner-plugin:1.1.5:sign (sign) @ github-updatesite ---
19:48:03 [2021-02-06T00:48:03.124Z] 00:48:03 [INFO] 
19:48:03 [2021-02-06T00:48:03.124Z] 00:48:03 [INFO] --- tycho-pack200b-plugin:1.7.0:pack (pack200-pack) @ github-updatesite ---
19:48:03 [2021-02-06T00:48:03.124Z] 00:48:03 [INFO] 
19:48:03 [2021-02-06T00:48:03.124Z] 00:48:03 [INFO] --- tycho-p2-plugin:1.7.0:p2-metadata (p2-metadata) @ github-updatesite ---
19:48:03 [2021-02-06T00:48:03.124Z] 00:48:03 [INFO] 
19:48:03 [2021-02-06T00:48:03.124Z] 00:48:03 [INFO] --- maven-install-plugin:2.3.1:install (default-install) @ github-updatesite ---
19:48:03 [2021-02-06T00:48:03.124Z] 00:48:03 [INFO] Installing /home/jenkins/agent/workspace/egit-github/repo/org.eclipse.mylyn.github-site/target/github-updatesite-5.11.0-SNAPSHOT.zip to /home/jenkins/agent/workspace/egit-github/.repository/org/eclipse/mylyn/github/github-updatesite/5.11.0-SNAPSHOT/github-updatesite-5.11.0-SNAPSHOT.zip
19:48:03 [2021-02-06T00:48:03.124Z] 00:48:03 [INFO] Installing /home/jenkins/agent/workspace/egit-github/repo/org.eclipse.mylyn.github-site/pom.xml to /home/jenkins/agent/workspace/egit-github/.repository/org/eclipse/mylyn/github/github-updatesite/5.11.0-SNAPSHOT/github-updatesite-5.11.0-SNAPSHOT.pom
19:48:03 [2021-02-06T00:48:03.124Z] 00:48:03 [INFO] Installing /home/jenkins/agent/workspace/egit-github/repo/org.eclipse.mylyn.github-site/target/p2content.xml to /home/jenkins/agent/workspace/egit-github/.repository/org/eclipse/mylyn/github/github-updatesite/5.11.0-SNAPSHOT/github-updatesite-5.11.0-SNAPSHOT-p2metadata.xml
19:48:03 [2021-02-06T00:48:03.124Z] 00:48:03 [INFO] Installing /home/jenkins/agent/workspace/egit-github/repo/org.eclipse.mylyn.github-site/target/p2artifacts.xml to /home/jenkins/agent/workspace/egit-github/.repository/org/eclipse/mylyn/github/github-updatesite/5.11.0-SNAPSHOT/github-updatesite-5.11.0-SNAPSHOT-p2artifacts.xml
19:48:03 [2021-02-06T00:48:03.124Z] 00:48:03 [INFO] 
19:48:03 [2021-02-06T00:48:03.124Z] 00:48:03 [INFO] --- tycho-p2-plugin:1.7.0:update-local-index (default-update-local-index) @ github-updatesite ---
19:48:03 [2021-02-06T00:48:03.124Z] 00:48:03 [INFO] ------------------------------------------------------------------------
19:48:03 [2021-02-06T00:48:03.124Z] 00:48:03 [INFO] Reactor Summary for Eclipse EGit Mylyn GitHub Connector Parent 5.11.0-SNAPSHOT:
19:48:03 [2021-02-06T00:48:03.124Z] 00:48:03 [INFO] 
19:48:03 [2021-02-06T00:48:03.125Z] 00:48:03 [INFO] Eclipse EGit Mylyn GitHub Connector Parent ......... SUCCESS [ 25.379 s]
19:48:03 [2021-02-06T00:48:03.125Z] 00:48:03 [INFO] EGit GitHub Target Platform Definition ............. SUCCESS [  0.665 s]
19:48:03 [2021-02-06T00:48:03.125Z] 00:48:03 [INFO] Eclipse EGit GitHub API Core ....................... SUCCESS [ 13.820 s]
19:48:03 [2021-02-06T00:48:03.125Z] 00:48:03 [INFO] Eclipse EGit Mylyn GitHub Core ..................... SUCCESS [  5.801 s]
19:48:03 [2021-02-06T00:48:03.125Z] 00:48:03 [INFO] Eclipse EGit Mylyn GitHub UI ....................... SUCCESS [  9.621 s]
19:48:03 [2021-02-06T00:48:03.125Z] 00:48:03 [INFO] Eclipse EGit Mylyn GitHub Documentation ............ SUCCESS [  4.957 s]
19:48:03 [2021-02-06T00:48:03.125Z] 00:48:03 [INFO] Eclipse EGit Mylyn GitHub Feature .................. SUCCESS [  1.090 s]
19:48:03 [2021-02-06T00:48:03.125Z] 00:48:03 [INFO] Eclipse EGit GitHub API Test Plug-in ............... SUCCESS [  9.700 s]
19:48:03 [2021-02-06T00:48:03.125Z] 00:48:03 [INFO] Eclipse EGit Mylyn GitHub Test Plug-in ............. SUCCESS [ 10.785 s]
19:48:03 [2021-02-06T00:48:03.125Z] 00:48:03 [INFO] Eclipse EGit Mylyn GitHub Repository ............... SUCCESS [  1.189 s]
19:48:03 [2021-02-06T00:48:03.125Z] 00:48:03 [INFO] ------------------------------------------------------------------------
19:48:03 [2021-02-06T00:48:03.125Z] 00:48:03 [INFO] BUILD SUCCESS
19:48:03 [2021-02-06T00:48:03.125Z] 00:48:03 [INFO] ------------------------------------------------------------------------
19:48:03 [2021-02-06T00:48:03.125Z] 00:48:03 [INFO] Total time:  02:58 min
19:48:03 [2021-02-06T00:48:03.125Z] 00:48:03 [INFO] Finished at: 2021-02-06T00:48:03Z
19:48:03 [2021-02-06T00:48:03.125Z] 00:48:03 [INFO] ------------------------------------------------------------------------