SuccessConsole Output

Skipping 261 KB.. Full Log
(org.eclipse.egit.github.core.tests.MemberPayloadTest)  Time elapsed: 0 s
15:32:30 [2021-02-05T20:32:30.528Z] defaultState(org.eclipse.egit.github.core.tests.MemberPayloadTest)  Time elapsed: 0 s
15:32:30 [2021-02-05T20:32:30.528Z] updateFields(org.eclipse.egit.github.core.tests.PullRequestPayloadTest)  Time elapsed: 0.001 s
15:32:30 [2021-02-05T20:32:30.528Z] defaultState(org.eclipse.egit.github.core.tests.PullRequestPayloadTest)  Time elapsed: 0 s
15:32:30 [2021-02-05T20:32:30.528Z] updateFields(org.eclipse.egit.github.core.tests.PullRequestReviewCommentPayloadTest)  Time elapsed: 0 s
15:32:30 [2021-02-05T20:32:30.528Z] defaultState(org.eclipse.egit.github.core.tests.PullRequestReviewCommentPayloadTest)  Time elapsed: 0 s
15:32:30 [2021-02-05T20:32:30.528Z] updateFields(org.eclipse.egit.github.core.tests.PushPayloadTest)  Time elapsed: 0 s
15:32:30 [2021-02-05T20:32:30.528Z] defaultState(org.eclipse.egit.github.core.tests.PushPayloadTest)  Time elapsed: 0.001 s
15:32:30 [2021-02-05T20:32:30.528Z] updateFields(org.eclipse.egit.github.core.tests.TeamAddPayloadTest)  Time elapsed: 0 s
15:32:30 [2021-02-05T20:32:30.528Z] defaultState(org.eclipse.egit.github.core.tests.TeamAddPayloadTest)  Time elapsed: 0 s
15:32:30 [2021-02-05T20:32:30.528Z] updateFields(org.eclipse.egit.github.core.tests.WatchPayloadTest)  Time elapsed: 0 s
15:32:30 [2021-02-05T20:32:30.528Z] defaultState(org.eclipse.egit.github.core.tests.WatchPayloadTest)  Time elapsed: 0 s
15:32:30 [2021-02-05T20:32:30.528Z] updateFields(org.eclipse.egit.github.core.tests.EventRepositoryTest)  Time elapsed: 0 s
15:32:30 [2021-02-05T20:32:30.528Z] defaultState(org.eclipse.egit.github.core.tests.EventRepositoryTest)  Time elapsed: 0 s
15:32:30 [2021-02-05T20:32:30.528Z] pageUserEvents(org.eclipse.egit.github.core.tests.EventServiceTest)  Time elapsed: 0.001 s
15:32:30 [2021-02-05T20:32:30.528Z] pagePublicEvents(org.eclipse.egit.github.core.tests.EventServiceTest)  Time elapsed: 0 s
15:32:30 [2021-02-05T20:32:30.528Z] constructorNullArgument(org.eclipse.egit.github.core.tests.EventServiceTest)  Time elapsed: 0 s
15:32:30 [2021-02-05T20:32:30.528Z] defaultConstructor(org.eclipse.egit.github.core.tests.EventServiceTest)  Time elapsed: 0 s
15:32:30 [2021-02-05T20:32:30.528Z] pageNetworkEvents(org.eclipse.egit.github.core.tests.EventServiceTest)  Time elapsed: 0 s
15:32:30 [2021-02-05T20:32:30.528Z] pageUserOrgEvents(org.eclipse.egit.github.core.tests.EventServiceTest)  Time elapsed: 0 s
15:32:30 [2021-02-05T20:32:30.528Z] pagePublicUserEvents(org.eclipse.egit.github.core.tests.EventServiceTest)  Time elapsed: 0 s
15:32:30 [2021-02-05T20:32:30.528Z] pageUserReceivedEvents(org.eclipse.egit.github.core.tests.EventServiceTest)  Time elapsed: 0 s
15:32:30 [2021-02-05T20:32:30.528Z] pageOrgEvents(org.eclipse.egit.github.core.tests.EventServiceTest)  Time elapsed: 0.001 s
15:32:30 [2021-02-05T20:32:30.529Z] pagePublicUserReceivedEvents(org.eclipse.egit.github.core.tests.EventServiceTest)  Time elapsed: 0 s
15:32:30 [2021-02-05T20:32:30.529Z] pageRepsitoryEvents(org.eclipse.egit.github.core.tests.EventServiceTest)  Time elapsed: 0 s
15:32:30 [2021-02-05T20:32:30.529Z] updateFields(org.eclipse.egit.github.core.tests.EventTest)  Time elapsed: 0 s
15:32:30 [2021-02-05T20:32:30.529Z] defaultState(org.eclipse.egit.github.core.tests.EventTest)  Time elapsed: 0 s
15:32:30 [2021-02-05T20:32:30.529Z] getCreatedAtReferenceMutableObject(org.eclipse.egit.github.core.tests.EventTest)  Time elapsed: 0 s
15:32:30 [2021-02-05T20:32:30.529Z] updateFields(org.eclipse.egit.github.core.tests.FieldErrorTest)  Time elapsed: 0 s
15:32:30 [2021-02-05T20:32:30.529Z] defaultState(org.eclipse.egit.github.core.tests.FieldErrorTest)  Time elapsed: 0.001 s
15:32:30 [2021-02-05T20:32:30.529Z] updateFields(org.eclipse.egit.github.core.tests.FollowPayloadTest)  Time elapsed: 0 s
15:32:30 [2021-02-05T20:32:30.529Z] defaultState(org.eclipse.egit.github.core.tests.FollowPayloadTest)  Time elapsed: 0 s
15:32:30 [2021-02-05T20:32:30.529Z] updateFields(org.eclipse.egit.github.core.tests.ForkApplyPayloadTest)  Time elapsed: 0 s
15:32:30 [2021-02-05T20:32:30.529Z] defaultState(org.eclipse.egit.github.core.tests.ForkApplyPayloadTest)  Time elapsed: 0 s
15:32:30 [2021-02-05T20:32:30.529Z] updateFields(org.eclipse.egit.github.core.tests.ForkPayloadTest)  Time elapsed: 0 s
15:32:30 [2021-02-05T20:32:30.529Z] defaultState(org.eclipse.egit.github.core.tests.ForkPayloadTest)  Time elapsed: 0 s
15:32:30 [2021-02-05T20:32:30.529Z] updateFields(org.eclipse.egit.github.core.tests.GistChangeStatusTest)  Time elapsed: 0 s
15:32:30 [2021-02-05T20:32:30.529Z] defaultState(org.eclipse.egit.github.core.tests.GistChangeStatusTest)  Time elapsed: 0 s
15:32:30 [2021-02-05T20:32:30.529Z] updateFields(org.eclipse.egit.github.core.tests.GistFileTest)  Time elapsed: 0 s
15:32:30 [2021-02-05T20:32:30.529Z] defaultState(org.eclipse.egit.github.core.tests.GistFileTest)  Time elapsed: 0 s
15:32:30 [2021-02-05T20:32:30.529Z] updateFields(org.eclipse.egit.github.core.tests.GistPayloadTest)  Time elapsed: 0 s
15:32:30 [2021-02-05T20:32:30.529Z] defaultState(org.eclipse.egit.github.core.tests.GistPayloadTest)  Time elapsed: 0 s
15:32:30 [2021-02-05T20:32:30.529Z] updateFields(org.eclipse.egit.github.core.tests.GistRevisionTest)  Time elapsed: 0 s
15:32:30 [2021-02-05T20:32:30.529Z] defaultState(org.eclipse.egit.github.core.tests.GistRevisionTest)  Time elapsed: 0 s
15:32:30 [2021-02-05T20:32:30.529Z] getCreatedAReferenceMutableObject(org.eclipse.egit.github.core.tests.GistRevisionTest)  Time elapsed: 0 s
15:32:30 [2021-02-05T20:32:30.529Z] starGistNullId(org.eclipse.egit.github.core.tests.GistServiceTest)  Time elapsed: 0 s
15:32:30 [2021-02-05T20:32:30.529Z] pageUserGistsEmptyId(org.eclipse.egit.github.core.tests.GistServiceTest)  Time elapsed: 0 s
15:32:30 [2021-02-05T20:32:30.529Z] getGistsNullUser(org.eclipse.egit.github.core.tests.GistServiceTest)  Time elapsed: 0 s
15:32:30 [2021-02-05T20:32:30.529Z] getGistEmptyId(org.eclipse.egit.github.core.tests.GistServiceTest)  Time elapsed: 0.001 s
15:32:30 [2021-02-05T20:32:30.529Z] unstarGist(org.eclipse.egit.github.core.tests.GistServiceTest)  Time elapsed: 0 s
15:32:30 [2021-02-05T20:32:30.529Z] starGistEmptyId(org.eclipse.egit.github.core.tests.GistServiceTest)  Time elapsed: 0 s
15:32:30 [2021-02-05T20:32:30.529Z] updateGistOK(org.eclipse.egit.github.core.tests.GistServiceTest)  Time elapsed: 0 s
15:32:30 [2021-02-05T20:32:30.529Z] getStarredGists(org.eclipse.egit.github.core.tests.GistServiceTest)  Time elapsed: 0.001 s
15:32:30 [2021-02-05T20:32:30.529Z] editGistComment(org.eclipse.egit.github.core.tests.GistServiceTest)  Time elapsed: 0 s
15:32:30 [2021-02-05T20:32:30.529Z] createGistNullOwner(org.eclipse.egit.github.core.tests.GistServiceTest)  Time elapsed: 0 s
15:32:30 [2021-02-05T20:32:30.529Z] isStarredGistNullId(org.eclipse.egit.github.core.tests.GistServiceTest)  Time elapsed: 0 s
15:32:30 [2021-02-05T20:32:30.529Z] deleteGistEmptyId(org.eclipse.egit.github.core.tests.GistServiceTest)  Time elapsed: 0 s
15:32:30 [2021-02-05T20:32:30.529Z] forkGistNullId(org.eclipse.egit.github.core.tests.GistServiceTest)  Time elapsed: 0.001 s
15:32:30 [2021-02-05T20:32:30.529Z] constructorNullArgument(org.eclipse.egit.github.core.tests.GistServiceTest)  Time elapsed: 0 s
15:32:30 [2021-02-05T20:32:30.529Z] editGistCommentNullComment(org.eclipse.egit.github.core.tests.GistServiceTest)  Time elapsed: 0 s
15:32:30 [2021-02-05T20:32:30.529Z] deleteGistNullId(org.eclipse.egit.github.core.tests.GistServiceTest)  Time elapsed: 0 s
15:32:30 [2021-02-05T20:32:30.529Z] isStarredGist(org.eclipse.egit.github.core.tests.GistServiceTest)  Time elapsed: 0.001 s
15:32:30 [2021-02-05T20:32:30.529Z] updateGistNullId(org.eclipse.egit.github.core.tests.GistServiceTest)  Time elapsed: 0 s
15:32:30 [2021-02-05T20:32:30.529Z] getGist(org.eclipse.egit.github.core.tests.GistServiceTest)  Time elapsed: 0 s
15:32:30 [2021-02-05T20:32:30.529Z] isStarredGistEmptyId(org.eclipse.egit.github.core.tests.GistServiceTest)  Time elapsed: 0 s
15:32:30 [2021-02-05T20:32:30.529Z] pagePublicGists(org.eclipse.egit.github.core.tests.GistServiceTest)  Time elapsed: 0 s
15:32:30 [2021-02-05T20:32:30.529Z] pageStarredGists(org.eclipse.egit.github.core.tests.GistServiceTest)  Time elapsed: 0.001 s
15:32:30 [2021-02-05T20:32:30.529Z] pageUserGists(org.eclipse.egit.github.core.tests.GistServiceTest)  Time elapsed: 0 s
15:32:30 [2021-02-05T20:32:30.529Z] forkGist(org.eclipse.egit.github.core.tests.GistServiceTest)  Time elapsed: 0 s
15:32:30 [2021-02-05T20:32:30.529Z] createGistNullGist(org.eclipse.egit.github.core.tests.GistServiceTest)  Time elapsed: 0 s
15:32:30 [2021-02-05T20:32:30.529Z] createCommentNullGistId(org.eclipse.egit.github.core.tests.GistServiceTest)  Time elapsed: 0 s
15:32:30 [2021-02-05T20:32:30.529Z] getCommentsOK(org.eclipse.egit.github.core.tests.GistServiceTest)  Time elapsed: 0.001 s
15:32:30 [2021-02-05T20:32:30.529Z] getCommentsNullGistId(org.eclipse.egit.github.core.tests.GistServiceTest)  Time elapsed: 0 s
15:32:30 [2021-02-05T20:32:30.529Z] unstarGistNullId(org.eclipse.egit.github.core.tests.GistServiceTest)  Time elapsed: 0 s
15:32:30 [2021-02-05T20:32:30.529Z] pageUserGistsNullId(org.eclipse.egit.github.core.tests.GistServiceTest)  Time elapsed: 0 s
15:32:30 [2021-02-05T20:32:30.529Z] getGistNullId(org.eclipse.egit.github.core.tests.GistServiceTest)  Time elapsed: 0 s
15:32:30 [2021-02-05T20:32:30.529Z] defaultContructor(org.eclipse.egit.github.core.tests.GistServiceTest)  Time elapsed: 0.001 s
15:32:30 [2021-02-05T20:32:30.529Z] getGistComment(org.eclipse.egit.github.core.tests.GistServiceTest)  Time elapsed: 0 s
15:32:30 [2021-02-05T20:32:30.529Z] createCommentNullComment(org.eclipse.egit.github.core.tests.GistServiceTest)  Time elapsed: 0 s
15:32:30 [2021-02-05T20:32:30.529Z] getGistsOK(org.eclipse.egit.github.core.tests.GistServiceTest)  Time elapsed: 0 s
15:32:30 [2021-02-05T20:32:30.529Z] starGist(org.eclipse.egit.github.core.tests.GistServiceTest)  Time elapsed: 0 s
15:32:30 [2021-02-05T20:32:30.529Z] createCommentOK(org.eclipse.egit.github.core.tests.GistServiceTest)  Time elapsed: 0 s
15:32:30 [2021-02-05T20:32:30.529Z] forkGistEmptyId(org.eclipse.egit.github.core.tests.GistServiceTest)  Time elapsed: 0 s
15:32:30 [2021-02-05T20:32:30.529Z] deleteGistComment(org.eclipse.egit.github.core.tests.GistServiceTest)  Time elapsed: 0 s
15:32:30 [2021-02-05T20:32:30.529Z] deleteGist(org.eclipse.egit.github.core.tests.GistServiceTest)  Time elapsed: 0 s
15:32:30 [2021-02-05T20:32:30.529Z] updateGistNullGist(org.eclipse.egit.github.core.tests.GistServiceTest)  Time elapsed: 0 s
15:32:30 [2021-02-05T20:32:30.529Z] getGistsEmptyUser(org.eclipse.egit.github.core.tests.GistServiceTest)  Time elapsed: 0.001 s
15:32:30 [2021-02-05T20:32:30.529Z] unstarGistEmptyId(org.eclipse.egit.github.core.tests.GistServiceTest)  Time elapsed: 0 s
15:32:30 [2021-02-05T20:32:30.529Z] updateFields(org.eclipse.egit.github.core.tests.GistTest)  Time elapsed: 0 s
15:32:30 [2021-02-05T20:32:30.529Z] defaultState(org.eclipse.egit.github.core.tests.GistTest)  Time elapsed: 0 s
15:32:30 [2021-02-05T20:32:30.529Z] getCreatedAtReferenceMutableObject(org.eclipse.egit.github.core.tests.GistTest)  Time elapsed: 0 s
15:32:30 [2021-02-05T20:32:30.529Z] getUpdatedAtReferenceMutableObject(org.eclipse.egit.github.core.tests.GistTest)  Time elapsed: 0 s
15:32:30 [2021-02-05T20:32:30.529Z] prefixLocalhost(org.eclipse.egit.github.core.tests.GitHubClientTest)  Time elapsed: 0 s
15:32:30 [2021-02-05T20:32:30.529Z] prefixHostApiV3(org.eclipse.egit.github.core.tests.GitHubClientTest)  Time elapsed: 0 s
15:32:30 [2021-02-05T20:32:30.529Z] updateFields(org.eclipse.egit.github.core.tests.GollumPageTest)  Time elapsed: 0 s
15:32:30 [2021-02-05T20:32:30.529Z] defaultState(org.eclipse.egit.github.core.tests.GollumPageTest)  Time elapsed: 0 s
15:32:30 [2021-02-05T20:32:30.529Z] updateFields(org.eclipse.egit.github.core.tests.GollumPayloadTest)  Time elapsed: 0 s
15:32:30 [2021-02-05T20:32:30.529Z] defaultState(org.eclipse.egit.github.core.tests.GollumPayloadTest)  Time elapsed: 0 s
15:32:30 [2021-02-05T20:32:30.529Z] seriazlizeNulls(org.eclipse.egit.github.core.tests.GsonUtilsTest)  Time elapsed: 0.001 s
15:32:30 [2021-02-05T20:32:30.530Z] noSeriazlizeNulls(org.eclipse.egit.github.core.tests.GsonUtilsTest)  Time elapsed: 0 s
15:32:30 [2021-02-05T20:32:30.530Z] getGson(org.eclipse.egit.github.core.tests.GsonUtilsTest)  Time elapsed: 0 s
15:32:30 [2021-02-05T20:32:30.530Z] createGson(org.eclipse.egit.github.core.tests.GsonUtilsTest)  Time elapsed: 0.001 s
15:32:30 [2021-02-05T20:32:30.530Z] defaultState(org.eclipse.egit.github.core.tests.IdTest)  Time elapsed: 0 s
15:32:30 [2021-02-05T20:32:30.530Z] updateField(org.eclipse.egit.github.core.tests.IdTest)  Time elapsed: 0 s
15:32:30 [2021-02-05T20:32:30.530Z] updateFields(org.eclipse.egit.github.core.tests.IssueCommentPayloadTest)  Time elapsed: 0 s
15:32:30 [2021-02-05T20:32:30.530Z] defaultState(org.eclipse.egit.github.core.tests.IssueCommentPayloadTest)  Time elapsed: 0 s
15:32:30 [2021-02-05T20:32:30.530Z] nonMutableCreatedAt(org.eclipse.egit.github.core.tests.IssueEventTest)  Time elapsed: 0.001 s
15:32:30 [2021-02-05T20:32:30.530Z] updateFields(org.eclipse.egit.github.core.tests.IssueEventTest)  Time elapsed: 0 s
15:32:30 [2021-02-05T20:32:30.530Z] defaultState(org.eclipse.egit.github.core.tests.IssueEventTest)  Time elapsed: 0 s
15:32:30 [2021-02-05T20:32:30.530Z] getCommentsEmptyUser(org.eclipse.egit.github.core.tests.IssueServiceTest)  Time elapsed: 0.001 s
15:32:30 [2021-02-05T20:32:30.530Z] createCommentNullIssueId(org.eclipse.egit.github.core.tests.IssueServiceTest)  Time elapsed: 0 s
15:32:30 [2021-02-05T20:32:30.530Z] createIssueEmptyUser(org.eclipse.egit.github.core.tests.IssueServiceTest)  Time elapsed: 0 s
15:32:30 [2021-02-05T20:32:30.530Z] getIssueComment(org.eclipse.egit.github.core.tests.IssueServiceTest)  Time elapsed: 0 s
15:32:30 [2021-02-05T20:32:30.530Z] pageIssueEvents(org.eclipse.egit.github.core.tests.IssueServiceTest)  Time elapsed: 0 s
15:32:30 [2021-02-05T20:32:30.530Z] editIssueNullRepositoryName(org.eclipse.egit.github.core.tests.IssueServiceTest)  Time elapsed: 0 s
15:32:30 [2021-02-05T20:32:30.530Z] deleteCommentNullRepositoryName(org.eclipse.egit.github.core.tests.IssueServiceTest)  Time elapsed: 0 s
15:32:30 [2021-02-05T20:32:30.530Z] getIssueNullRepositoryId(org.eclipse.egit.github.core.tests.IssueServiceTest)  Time elapsed: 0 s
15:32:30 [2021-02-05T20:32:30.530Z] deleteCommentWithRepositoryId(org.eclipse.egit.github.core.tests.IssueServiceTest)  Time elapsed: 0 s
15:32:30 [2021-02-05T20:32:30.530Z] deleteCommentNullId(org.eclipse.egit.github.core.tests.IssueServiceTest)  Time elapsed: 0 s
15:32:30 [2021-02-05T20:32:30.530Z] editIssue(org.eclipse.egit.github.core.tests.IssueServiceTest)  Time elapsed: 0.001 s
15:32:30 [2021-02-05T20:32:30.530Z] createCommentEmptyRepositoryName(org.eclipse.egit.github.core.tests.IssueServiceTest)  Time elapsed: 0 s
15:32:30 [2021-02-05T20:32:30.530Z] getIssueWithRepositoryId(org.eclipse.egit.github.core.tests.IssueServiceTest)  Time elapsed: 0 s
15:32:30 [2021-02-05T20:32:30.530Z] createCommentNullRepositoryName(org.eclipse.egit.github.core.tests.IssueServiceTest)  Time elapsed: 0 s
15:32:30 [2021-02-05T20:32:30.530Z] getIssueNullUser(org.eclipse.egit.github.core.tests.IssueServiceTest)  Time elapsed: 0.001 s
15:32:30 [2021-02-05T20:32:30.530Z] editIssueEmptyRepositoryName(org.eclipse.egit.github.core.tests.IssueServiceTest)  Time elapsed: 0 s
15:32:30 [2021-02-05T20:32:30.530Z] createIssueNullRepositoryName(org.eclipse.egit.github.core.tests.IssueServiceTest)  Time elapsed: 0 s
15:32:30 [2021-02-05T20:32:30.530Z] getCommentsNullRepositoryName(org.eclipse.egit.github.core.tests.IssueServiceTest)  Time elapsed: 0.001 s
15:32:30 [2021-02-05T20:32:30.530Z] deleteCommentEmptyRepositoryName(org.eclipse.egit.github.core.tests.IssueServiceTest)  Time elapsed: 0 s
15:32:30 [2021-02-05T20:32:30.530Z] getCommentsEmptyRepositoryName(org.eclipse.egit.github.core.tests.IssueServiceTest)  Time elapsed: 0 s
15:32:30 [2021-02-05T20:32:30.530Z] getIssueEmptyUser(org.eclipse.egit.github.core.tests.IssueServiceTest)  Time elapsed: 0 s
15:32:30 [2021-02-05T20:32:30.530Z] createComment(org.eclipse.egit.github.core.tests.IssueServiceTest)  Time elapsed: 0 s
15:32:30 [2021-02-05T20:32:30.530Z] getCommentsNullRepositoryId(org.eclipse.egit.github.core.tests.IssueServiceTest)  Time elapsed: 0.001 s
15:32:30 [2021-02-05T20:32:30.530Z] getIssuesNullUser(org.eclipse.egit.github.core.tests.IssueServiceTest)  Time elapsed: 0 s
15:32:30 [2021-02-05T20:32:30.530Z] editIssueCommentNullComment(org.eclipse.egit.github.core.tests.IssueServiceTest)  Time elapsed: 0 s
15:32:30 [2021-02-05T20:32:30.530Z] getCommentsWithRepositoryId(org.eclipse.egit.github.core.tests.IssueServiceTest)  Time elapsed: 0.001 s
15:32:30 [2021-02-05T20:32:30.530Z] constructorNullArgument(org.eclipse.egit.github.core.tests.IssueServiceTest)  Time elapsed: 0 s
15:32:30 [2021-02-05T20:32:30.530Z] pageRepsitoryIssuesWithRepositoryId(org.eclipse.egit.github.core.tests.IssueServiceTest)  Time elapsed: 0 s
15:32:30 [2021-02-05T20:32:30.530Z] getCommentsNullId(org.eclipse.egit.github.core.tests.IssueServiceTest)  Time elapsed: 0 s
15:32:30 [2021-02-05T20:32:30.530Z] deleteCommentEmptyUser(org.eclipse.egit.github.core.tests.IssueServiceTest)  Time elapsed: 0.001 s
15:32:30 [2021-02-05T20:32:30.530Z] getCurrentUserIssues(org.eclipse.egit.github.core.tests.IssueServiceTest)  Time elapsed: 0 s
15:32:30 [2021-02-05T20:32:30.530Z] createIssueNullIssueWithRepositoryId(org.eclipse.egit.github.core.tests.IssueServiceTest)  Time elapsed: 0 s
15:32:30 [2021-02-05T20:32:30.530Z] editIssueEmptyUser(org.eclipse.egit.github.core.tests.IssueServiceTest)  Time elapsed: 0 s
15:32:30 [2021-02-05T20:32:30.530Z] getIssueNullRepositoryName(org.eclipse.egit.github.core.tests.IssueServiceTest)  Time elapsed: 0.001 s
15:32:30 [2021-02-05T20:32:30.530Z] defaultConstructor(org.eclipse.egit.github.core.tests.IssueServiceTest)  Time elapsed: 0 s
15:32:30 [2021-02-05T20:32:30.530Z] getIssuesEmptyRepositoryName(org.eclipse.egit.github.core.tests.IssueServiceTest)  Time elapsed: 0 s
15:32:30 [2021-02-05T20:32:30.530Z] getIssueEmptyId(org.eclipse.egit.github.core.tests.IssueServiceTest)  Time elapsed: 0 s
15:32:30 [2021-02-05T20:32:30.530Z] deleteCommentNullUser(org.eclipse.egit.github.core.tests.IssueServiceTest)  Time elapsed: 0 s
15:32:30 [2021-02-05T20:32:30.530Z] createCommentNullUser(org.eclipse.egit.github.core.tests.IssueServiceTest)  Time elapsed: 0 s
15:32:30 [2021-02-05T20:32:30.530Z] createIssueEmptyRepositoryName(org.eclipse.egit.github.core.tests.IssueServiceTest)  Time elapsed: 0 s
15:32:30 [2021-02-05T20:32:30.530Z] searchIssues(org.eclipse.egit.github.core.tests.IssueServiceTest)  Time elapsed: 0 s
15:32:30 [2021-02-05T20:32:30.530Z] editIssueWithRepositoryId(org.eclipse.egit.github.core.tests.IssueServiceTest)  Time elapsed: 0 s
15:32:30 [2021-02-05T20:32:30.530Z] searchEscaped(org.eclipse.egit.github.core.tests.IssueServiceTest)  Time elapsed: 0 s
15:32:30 [2021-02-05T20:32:30.530Z] getCommentsEmptyId(org.eclipse.egit.github.core.tests.IssueServiceTest)  Time elapsed: 0.001 s
15:32:30 [2021-02-05T20:32:30.530Z] editIssueComment(org.eclipse.egit.github.core.tests.IssueServiceTest)  Time elapsed: 0 s
15:32:30 [2021-02-05T20:32:30.530Z] createCommentWithRepositoryId(org.eclipse.egit.github.core.tests.IssueServiceTest)  Time elapsed: 0 s
15:32:30 [2021-02-05T20:32:30.530Z] searchIssueEmptyQuery(org.eclipse.egit.github.core.tests.IssueServiceTest)  Time elapsed: 0 s
15:32:30 [2021-02-05T20:32:30.530Z] searchIssueEmptyState(org.eclipse.egit.github.core.tests.IssueServiceTest)  Time elapsed: 0 s
15:32:30 [2021-02-05T20:32:30.530Z] createIssueNullIssue(org.eclipse.egit.github.core.tests.IssueServiceTest)  Time elapsed: 0.001 s
15:32:30 [2021-02-05T20:32:30.530Z] getIssuesRepositoryId(org.eclipse.egit.github.core.tests.IssueServiceTest)  Time elapsed: 0 s
15:32:30 [2021-02-05T20:32:30.530Z] getIssues(org.eclipse.egit.github.core.tests.IssueServiceTest)  Time elapsed: 0 s
15:32:30 [2021-02-05T20:32:30.530Z] getIssueNullId(org.eclipse.egit.github.core.tests.IssueServiceTest)  Time elapsed: 0 s
15:32:30 [2021-02-05T20:32:30.530Z] editIssueCommentWithRepositoryId(org.eclipse.egit.github.core.tests.IssueServiceTest)  Time elapsed: 0 s
15:32:30 [2021-02-05T20:32:30.530Z] deleteComment(org.eclipse.egit.github.core.tests.IssueServiceTest)  Time elapsed: 0.001 s
15:32:30 [2021-02-05T20:32:30.530Z] pageEvents(org.eclipse.egit.github.core.tests.IssueServiceTest)  Time elapsed: 0 s
15:32:30 [2021-02-05T20:32:30.530Z] editIssueNullUser(org.eclipse.egit.github.core.tests.IssueServiceTest)  Time elapsed: 0 s
15:32:30 [2021-02-05T20:32:30.530Z] createCommentEmptyIssueId(org.eclipse.egit.github.core.tests.IssueServiceTest)  Time elapsed: 0 s
15:32:30 [2021-02-05T20:32:30.530Z] pageIssues(org.eclipse.egit.github.core.tests.IssueServiceTest)  Time elapsed: 0 s
15:32:30 [2021-02-05T20:32:30.530Z] createIssueNullUser(org.eclipse.egit.github.core.tests.IssueServiceTest)  Time elapsed: 0 s
15:32:30 [2021-02-05T20:32:30.530Z] getIssueEvent(org.eclipse.egit.github.core.tests.IssueServiceTest)  Time elapsed: 0 s
15:32:30 [2021-02-05T20:32:30.530Z] getIssueEmptyRepositoryName(org.eclipse.egit.github.core.tests.IssueServiceTest)  Time elapsed: 0 s
15:32:30 [2021-02-05T20:32:30.530Z] getIssuesNullRepositoryId(org.eclipse.egit.github.core.tests.IssueServiceTest)  Time elapsed: 0 s
15:32:30 [2021-02-05T20:32:30.530Z] getComments(org.eclipse.egit.github.core.tests.IssueServiceTest)  Time elapsed: 0 s
15:32:30 [2021-02-05T20:32:30.531Z] getIssuesNullRepositoryName(org.eclipse.egit.github.core.tests.IssueServiceTest)  Time elapsed: 0 s
15:32:30 [2021-02-05T20:32:30.531Z] createCommentEmptyUser(org.eclipse.egit.github.core.tests.IssueServiceTest)  Time elapsed: 0.001 s
15:32:30 [2021-02-05T20:32:30.531Z] deleteCommentEmptyId(org.eclipse.egit.github.core.tests.IssueServiceTest)  Time elapsed: 0 s
15:32:30 [2021-02-05T20:32:30.531Z] searchIssuesNullRepository(org.eclipse.egit.github.core.tests.IssueServiceTest)  Time elapsed: 0 s
15:32:30 [2021-02-05T20:32:30.531Z] pageRepsitoryIssues(org.eclipse.egit.github.core.tests.IssueServiceTest)  Time elapsed: 0 s
15:32:30 [2021-02-05T20:32:30.531Z] editIssueNullIssue(org.eclipse.egit.github.core.tests.IssueServiceTest)  Time elapsed: 0 s
15:32:30 [2021-02-05T20:32:30.531Z] getCommentsNullUser(org.eclipse.egit.github.core.tests.IssueServiceTest)  Time elapsed: 0 s
15:32:30 [2021-02-05T20:32:30.531Z] getIssue(org.eclipse.egit.github.core.tests.IssueServiceTest)  Time elapsed: 0.001 s
15:32:30 [2021-02-05T20:32:30.531Z] searchIssueNullQuery(org.eclipse.egit.github.core.tests.IssueServiceTest)  Time elapsed: 0 s
15:32:30 [2021-02-05T20:32:30.531Z] searchIssueNullState(org.eclipse.egit.github.core.tests.IssueServiceTest)  Time elapsed: 0 s
15:32:30 [2021-02-05T20:32:30.531Z] getIssuesEmptyUser(org.eclipse.egit.github.core.tests.IssueServiceTest)  Time elapsed: 0 s
15:32:30 [2021-02-05T20:32:30.531Z] getClosedAtReferenceMutableObject(org.eclipse.egit.github.core.tests.IssueTest)  Time elapsed: 0 s
15:32:30 [2021-02-05T20:32:30.531Z] updateFields(org.eclipse.egit.github.core.tests.IssueTest)  Time elapsed: 0.001 s
15:32:30 [2021-02-05T20:32:30.531Z] defaultState(org.eclipse.egit.github.core.tests.IssueTest)  Time elapsed: 0 s
15:32:30 [2021-02-05T20:32:30.531Z] getCreatedAtReferenceMutableObject(org.eclipse.egit.github.core.tests.IssueTest)  Time elapsed: 0 s
15:32:30 [2021-02-05T20:32:30.531Z] getUpdatedAtReferenceMutableObject(org.eclipse.egit.github.core.tests.IssueTest)  Time elapsed: 0 s
15:32:30 [2021-02-05T20:32:30.531Z] updateFields(org.eclipse.egit.github.core.tests.IssuesPayloadTest)  Time elapsed: 0 s
15:32:30 [2021-02-05T20:32:30.531Z] defaultState(org.eclipse.egit.github.core.tests.IssuesPayloadTest)  Time elapsed: 0 s
15:32:30 [2021-02-05T20:32:30.531Z] updateFields(org.eclipse.egit.github.core.tests.KeyTest)  Time elapsed: 0 s
15:32:30 [2021-02-05T20:32:30.531Z] defaultState(org.eclipse.egit.github.core.tests.KeyTest)  Time elapsed: 0 s
15:32:30 [2021-02-05T20:32:30.531Z] compareLabels(org.eclipse.egit.github.core.tests.LabelComparatorTest)  Time elapsed: 0 s
15:32:30 [2021-02-05T20:32:30.531Z] getLabelsNullUser(org.eclipse.egit.github.core.tests.LabelServiceTest)  Time elapsed: 0.001 s
15:32:30 [2021-02-05T20:32:30.531Z] setLabelsNullIssueId(org.eclipse.egit.github.core.tests.LabelServiceTest)  Time elapsed: 0 s
15:32:30 [2021-02-05T20:32:30.531Z] editLabel(org.eclipse.egit.github.core.tests.LabelServiceTest)  Time elapsed: 0 s
15:32:30 [2021-02-05T20:32:30.531Z] editLabelNullLabelName(org.eclipse.egit.github.core.tests.LabelServiceTest)  Time elapsed: 0 s
15:32:30 [2021-02-05T20:32:30.531Z] getEmptyUser(org.eclipse.egit.github.core.tests.LabelServiceTest)  Time elapsed: 0 s
15:32:30 [2021-02-05T20:32:30.531Z] getEmptyLabel(org.eclipse.egit.github.core.tests.LabelServiceTest)  Time elapsed: 0 s
15:32:30 [2021-02-05T20:32:30.531Z] getLabelWithRepositoryId(org.eclipse.egit.github.core.tests.LabelServiceTest)  Time elapsed: 0.001 s
15:32:30 [2021-02-05T20:32:30.531Z] deleteLabel(org.eclipse.egit.github.core.tests.LabelServiceTest)  Time elapsed: 0 s
15:32:30 [2021-02-05T20:32:30.531Z] getLabelsNullRepositoryName(org.eclipse.egit.github.core.tests.LabelServiceTest)  Time elapsed: 0 s
15:32:30 [2021-02-05T20:32:30.531Z] createLabelNullLabel(org.eclipse.egit.github.core.tests.LabelServiceTest)  Time elapsed: 0 s
15:32:30 [2021-02-05T20:32:30.531Z] constructorNullArgument(org.eclipse.egit.github.core.tests.LabelServiceTest)  Time elapsed: 0 s
15:32:30 [2021-02-05T20:32:30.531Z] deleteEmptyUser(org.eclipse.egit.github.core.tests.LabelServiceTest)  Time elapsed: 0.001 s
15:32:30 [2021-02-05T20:32:30.531Z] getEmptyRepositoryName(org.eclipse.egit.github.core.tests.LabelServiceTest)  Time elapsed: 0 s
15:32:30 [2021-02-05T20:32:30.531Z] createLabel(org.eclipse.egit.github.core.tests.LabelServiceTest)  Time elapsed: 0 s
15:32:30 [2021-02-05T20:32:30.531Z] setLabelsEmptyIssueId(org.eclipse.egit.github.core.tests.LabelServiceTest)  Time elapsed: 0 s
15:32:30 [2021-02-05T20:32:30.531Z] defaultConstuctor(org.eclipse.egit.github.core.tests.LabelServiceTest)  Time elapsed: 0.001 s
15:32:30 [2021-02-05T20:32:30.531Z] getNullUser(org.eclipse.egit.github.core.tests.LabelServiceTest)  Time elapsed: 0 s
15:32:30 [2021-02-05T20:32:30.531Z] setLabelsNullLabels(org.eclipse.egit.github.core.tests.LabelServiceTest)  Time elapsed: 0 s
15:32:30 [2021-02-05T20:32:30.531Z] deleteNullUser(org.eclipse.egit.github.core.tests.LabelServiceTest)  Time elapsed: 0 s
15:32:30 [2021-02-05T20:32:30.531Z] deleteNullRepositoryName(org.eclipse.egit.github.core.tests.LabelServiceTest)  Time elapsed: 0.001 s
15:32:30 [2021-02-05T20:32:30.531Z] setLabels(org.eclipse.egit.github.core.tests.LabelServiceTest)  Time elapsed: 0 s
15:32:30 [2021-02-05T20:32:30.531Z] deleteLabelWithRepositoryId(org.eclipse.egit.github.core.tests.LabelServiceTest)  Time elapsed: 0 s
15:32:30 [2021-02-05T20:32:30.531Z] getLabels(org.eclipse.egit.github.core.tests.LabelServiceTest)  Time elapsed: 0.001 s
15:32:30 [2021-02-05T20:32:30.531Z] editLabelNullLabel(org.eclipse.egit.github.core.tests.LabelServiceTest)  Time elapsed: 0 s
15:32:30 [2021-02-05T20:32:30.531Z] getNullRepositoryName(org.eclipse.egit.github.core.tests.LabelServiceTest)  Time elapsed: 0 s
15:32:30 [2021-02-05T20:32:30.531Z] getLabelsWithRepositoryId(org.eclipse.egit.github.core.tests.LabelServiceTest)  Time elapsed: 0 s
15:32:30 [2021-02-05T20:32:30.531Z] getNullLabel(org.eclipse.egit.github.core.tests.LabelServiceTest)  Time elapsed: 0 s
15:32:30 [2021-02-05T20:32:30.531Z] setLabelsNullUser(org.eclipse.egit.github.core.tests.LabelServiceTest)  Time elapsed: 0 s
15:32:30 [2021-02-05T20:32:30.531Z] editLabelEmptyLabelName(org.eclipse.egit.github.core.tests.LabelServiceTest)  Time elapsed: 0.001 s
15:32:30 [2021-02-05T20:32:30.531Z] deleteEmptyRepositoryName(org.eclipse.egit.github.core.tests.LabelServiceTest)  Time elapsed: 0 s
15:32:30 [2021-02-05T20:32:30.531Z] createLabelNullRepositoryName(org.eclipse.egit.github.core.tests.LabelServiceTest)  Time elapsed: 0 s
15:32:30 [2021-02-05T20:32:30.531Z] deleteEmptyLabel(org.eclipse.egit.github.core.tests.LabelServiceTest)  Time elapsed: 0 s
15:32:30 [2021-02-05T20:32:30.531Z] setLabelsWithRepositoryId(org.eclipse.egit.github.core.tests.LabelServiceTest)  Time elapsed: 0 s
15:32:30 [2021-02-05T20:32:30.531Z] createLabelNullUser(org.eclipse.egit.github.core.tests.LabelServiceTest)  Time elapsed: 0 s
15:32:30 [2021-02-05T20:32:30.531Z] deleteNullLabel(org.eclipse.egit.github.core.tests.LabelServiceTest)  Time elapsed: 0.001 s
15:32:30 [2021-02-05T20:32:30.531Z] setLabelsNullRepositoryName(org.eclipse.egit.github.core.tests.LabelServiceTest)  Time elapsed: 0 s
15:32:30 [2021-02-05T20:32:30.531Z] createLabelWithRepositoryId(org.eclipse.egit.github.core.tests.LabelServiceTest)  Time elapsed: 0 s
15:32:30 [2021-02-05T20:32:30.531Z] getLabel(org.eclipse.egit.github.core.tests.LabelServiceTest)  Time elapsed: 0 s
15:32:30 [2021-02-05T20:32:30.531Z] updateFields(org.eclipse.egit.github.core.tests.LabelTest)  Time elapsed: 0 s
15:32:30 [2021-02-05T20:32:30.531Z] defaultState(org.eclipse.egit.github.core.tests.LabelTest)  Time elapsed: 0 s
15:32:30 [2021-02-05T20:32:30.531Z] equality(org.eclipse.egit.github.core.tests.LabelTest)  Time elapsed: 0 s
15:32:30 [2021-02-05T20:32:30.531Z] languages(org.eclipse.egit.github.core.tests.LanguagesTest)  Time elapsed: 0.005 s
15:32:30 [2021-02-05T20:32:30.531Z] getRepositoryHtml(org.eclipse.egit.github.core.tests.MarkdownServiceTest)  Time elapsed: 0 s
15:32:30 [2021-02-05T20:32:30.531Z] getHtml(org.eclipse.egit.github.core.tests.MarkdownServiceTest)  Time elapsed: 0 s
15:32:30 [2021-02-05T20:32:30.531Z] getRepositoryHtmlNullRepository(org.eclipse.egit.github.core.tests.MarkdownServiceTest)  Time elapsed: 0 s
15:32:30 [2021-02-05T20:32:30.531Z] updateFields(org.eclipse.egit.github.core.tests.MemberPayloadTest)  Time elapsed: 0 s
15:32:30 [2021-02-05T20:32:30.531Z] defaultState(org.eclipse.egit.github.core.tests.MemberPayloadTest)  Time elapsed: 0 s
15:32:30 [2021-02-05T20:32:30.531Z] updateFields(org.eclipse.egit.github.core.tests.MergeStatusTest)  Time elapsed: 0 s
15:32:30 [2021-02-05T20:32:30.531Z] defaultState(org.eclipse.egit.github.core.tests.MergeStatusTest)  Time elapsed: 0 s
15:32:30 [2021-02-05T20:32:30.531Z] compareMilestones(org.eclipse.egit.github.core.tests.MilestoneComparatorTest)  Time elapsed: 0 s
15:32:30 [2021-02-05T20:32:30.531Z] deleteMilestoneNullUser(org.eclipse.egit.github.core.tests.MilestoneServiceTest)  Time elapsed: 0.001 s
15:32:30 [2021-02-05T20:32:30.531Z] editMilestoneDescription(org.eclipse.egit.github.core.tests.MilestoneServiceTest)  Time elapsed: 0.001 s
15:32:30 [2021-02-05T20:32:30.531Z] createMilestoneEmptyRepositoryName(org.eclipse.egit.github.core.tests.MilestoneServiceTest)  Time elapsed: 0 s
15:32:30 [2021-02-05T20:32:30.531Z] editMilestoneFull(org.eclipse.egit.github.core.tests.MilestoneServiceTest)  Time elapsed: 0.001 s
15:32:30 [2021-02-05T20:32:30.531Z] getMilestonesEmptyUser(org.eclipse.egit.github.core.tests.MilestoneServiceTest)  Time elapsed: 0 s
15:32:30 [2021-02-05T20:32:30.531Z] createMilestoneEmptyUser(org.eclipse.egit.github.core.tests.MilestoneServiceTest)  Time elapsed: 0 s
15:32:30 [2021-02-05T20:32:30.531Z] createMilestoneFull(org.eclipse.egit.github.core.tests.MilestoneServiceTest)  Time elapsed: 0 s
15:32:30 [2021-02-05T20:32:30.531Z] createMilestoneOpen(org.eclipse.egit.github.core.tests.MilestoneServiceTest)  Time elapsed: 0.001 s
15:32:30 [2021-02-05T20:32:30.531Z] editMilestoneEmptyMilestone(org.eclipse.egit.github.core.tests.MilestoneServiceTest)  Time elapsed: 0 s
15:32:30 [2021-02-05T20:32:30.532Z] createMilestoneNullRepositoryName(org.eclipse.egit.github.core.tests.MilestoneServiceTest)  Time elapsed: 0 s
15:32:30 [2021-02-05T20:32:30.532Z] deleteMilestoneEmptyUser(org.eclipse.egit.github.core.tests.MilestoneServiceTest)  Time elapsed: 0 s
15:32:30 [2021-02-05T20:32:30.532Z] getMilestone(org.eclipse.egit.github.core.tests.MilestoneServiceTest)  Time elapsed: 0 s
15:32:30 [2021-02-05T20:32:30.532Z] createMilestoneEmptyMilestone(org.eclipse.egit.github.core.tests.MilestoneServiceTest)  Time elapsed: 0.001 s
15:32:30 [2021-02-05T20:32:30.532Z] constructorNullArgument(org.eclipse.egit.github.core.tests.MilestoneServiceTest)  Time elapsed: 0 s
15:32:30 [2021-02-05T20:32:30.532Z] getMilestoneEmptyUser(org.eclipse.egit.github.core.tests.MilestoneServiceTest)  Time elapsed: 0 s
15:32:30 [2021-02-05T20:32:30.532Z] getMilestoneNullRepositoryName(org.eclipse.egit.github.core.tests.MilestoneServiceTest)  Time elapsed: 0 s
15:32:30 [2021-02-05T20:32:30.532Z] getMilestonesEmptyRepositoryName(org.eclipse.egit.github.core.tests.MilestoneServiceTest)  Time elapsed: 0.001 s
15:32:30 [2021-02-05T20:32:30.532Z] deleteMilestoneNullRepositoryName(org.eclipse.egit.github.core.tests.MilestoneServiceTest)  Time elapsed: 0 s
15:32:30 [2021-02-05T20:32:30.532Z] getMilestonesNullUser(org.eclipse.egit.github.core.tests.MilestoneServiceTest)  Time elapsed: 0 s
15:32:30 [2021-02-05T20:32:30.532Z] defaultConstructor(org.eclipse.egit.github.core.tests.MilestoneServiceTest)  Time elapsed: 0 s
15:32:30 [2021-02-05T20:32:30.532Z] deleteMilestone(org.eclipse.egit.github.core.tests.MilestoneServiceTest)  Time elapsed: 0 s
15:32:30 [2021-02-05T20:32:30.532Z] getMilestoneEmptyRepositoryName(org.eclipse.egit.github.core.tests.MilestoneServiceTest)  Time elapsed: 0 s
15:32:30 [2021-02-05T20:32:30.532Z] createMilestoneNullMilestone(org.eclipse.egit.github.core.tests.MilestoneServiceTest)  Time elapsed: 0 s
15:32:30 [2021-02-05T20:32:30.532Z] editMilestone(org.eclipse.egit.github.core.tests.MilestoneServiceTest)  Time elapsed: 0 s
15:32:30 [2021-02-05T20:32:30.532Z] createMilestoneNullUser(org.eclipse.egit.github.core.tests.MilestoneServiceTest)  Time elapsed: 0 s
15:32:30 [2021-02-05T20:32:30.532Z] createMilestoneInvalidState(org.eclipse.egit.github.core.tests.MilestoneServiceTest)  Time elapsed: 0 s
15:32:30 [2021-02-05T20:32:30.532Z] getMilestonesNullRepositoryName(org.eclipse.egit.github.core.tests.MilestoneServiceTest)  Time elapsed: 0 s
15:32:30 [2021-02-05T20:32:30.532Z] getMilestonesNullState(org.eclipse.egit.github.core.tests.MilestoneServiceTest)  Time elapsed: 0 s
15:32:30 [2021-02-05T20:32:30.532Z] getMilestoneWithRepositoryId(org.eclipse.egit.github.core.tests.MilestoneServiceTest)  Time elapsed: 0.019 s
15:32:30 [2021-02-05T20:32:30.532Z] getMilestonesOpenStateWithRepositoryId(org.eclipse.egit.github.core.tests.MilestoneServiceTest)  Time elapsed: 0.001 s
15:32:30 [2021-02-05T20:32:30.532Z] deleteMilestoneNullMilestone(org.eclipse.egit.github.core.tests.MilestoneServiceTest)  Time elapsed: 0 s
15:32:30 [2021-02-05T20:32:30.532Z] getMilestonesOpenState(org.eclipse.egit.github.core.tests.MilestoneServiceTest)  Time elapsed: 0 s
15:32:30 [2021-02-05T20:32:30.532Z] deleteMilestoneEmptyMilestone(org.eclipse.egit.github.core.tests.MilestoneServiceTest)  Time elapsed: 0 s
15:32:30 [2021-02-05T20:32:30.532Z] createMilestoneNoTitle(org.eclipse.egit.github.core.tests.MilestoneServiceTest)  Time elapsed: 0.001 s
15:32:30 [2021-02-05T20:32:30.532Z] createMilestoneClosed(org.eclipse.egit.github.core.tests.MilestoneServiceTest)  Time elapsed: 0 s
15:32:30 [2021-02-05T20:32:30.532Z] getMilestoneNullId(org.eclipse.egit.github.core.tests.MilestoneServiceTest)  Time elapsed: 0 s
15:32:30 [2021-02-05T20:32:30.532Z] createMilestone(org.eclipse.egit.github.core.tests.MilestoneServiceTest)  Time elapsed: 0 s
15:32:30 [2021-02-05T20:32:30.532Z] getMilestoneNullUser(org.eclipse.egit.github.core.tests.MilestoneServiceTest)  Time elapsed: 0 s
15:32:30 [2021-02-05T20:32:30.532Z] deleteMilestoneWithRepositoryId(org.eclipse.egit.github.core.tests.MilestoneServiceTest)  Time elapsed: 0.001 s
15:32:30 [2021-02-05T20:32:30.532Z] deleteMilestoneEmptyRepositoryName(org.eclipse.egit.github.core.tests.MilestoneServiceTest)  Time elapsed: 0 s
15:32:30 [2021-02-05T20:32:30.532Z] getMilestoneEmptyId(org.eclipse.egit.github.core.tests.MilestoneServiceTest)  Time elapsed: 0 s
15:32:30 [2021-02-05T20:32:30.532Z] createMilestoneWithRepositoryId(org.eclipse.egit.github.core.tests.MilestoneServiceTest)  Time elapsed: 0 s
15:32:30 [2021-02-05T20:32:30.532Z] editMilestoneNullMilestone(org.eclipse.egit.github.core.tests.MilestoneServiceTest)  Time elapsed: 0 s
15:32:30 [2021-02-05T20:32:30.532Z] setDueOnReferenceMutableObject(org.eclipse.egit.github.core.tests.MilestoneTest)  Time elapsed: 0 s
15:32:30 [2021-02-05T20:32:30.532Z] updateFields(org.eclipse.egit.github.core.tests.MilestoneTest)  Time elapsed: 0.001 s
15:32:30 [2021-02-05T20:32:30.532Z] getDueOn_ReferenceMutableObject(org.eclipse.egit.github.core.tests.MilestoneTest)  Time elapsed: 0 s
15:32:30 [2021-02-05T20:32:30.532Z] defaultState(org.eclipse.egit.github.core.tests.MilestoneTest)  Time elapsed: 0 s
15:32:30 [2021-02-05T20:32:30.532Z] getCreatedAtReferenceMutableObject(org.eclipse.egit.github.core.tests.MilestoneTest)  Time elapsed: 0 s
15:32:30 [2021-02-05T20:32:30.532Z] deleteAuthorization(org.eclipse.egit.github.core.tests.OAuthServiceTest)  Time elapsed: 0 s
15:32:30 [2021-02-05T20:32:30.532Z] removeScopes(org.eclipse.egit.github.core.tests.OAuthServiceTest)  Time elapsed: 0 s
15:32:30 [2021-02-05T20:32:30.532Z] constructorNullArgument(org.eclipse.egit.github.core.tests.OAuthServiceTest)  Time elapsed: 0 s
15:32:30 [2021-02-05T20:32:30.532Z] defaultConstructor(org.eclipse.egit.github.core.tests.OAuthServiceTest)  Time elapsed: 0.001 s
15:32:30 [2021-02-05T20:32:30.532Z] getAuthorizations(org.eclipse.egit.github.core.tests.OAuthServiceTest)  Time elapsed: 0 s
15:32:30 [2021-02-05T20:32:30.532Z] addScopes(org.eclipse.egit.github.core.tests.OAuthServiceTest)  Time elapsed: 0 s
15:32:30 [2021-02-05T20:32:30.532Z] createAuthorization(org.eclipse.egit.github.core.tests.OAuthServiceTest)  Time elapsed: 0 s
15:32:30 [2021-02-05T20:32:30.532Z] setScopes(org.eclipse.egit.github.core.tests.OAuthServiceTest)  Time elapsed: 0.001 s
15:32:30 [2021-02-05T20:32:30.532Z] getAuthorization(org.eclipse.egit.github.core.tests.OAuthServiceTest)  Time elapsed: 0 s
15:32:30 [2021-02-05T20:32:30.532Z] showMembershipEmptyName(org.eclipse.egit.github.core.tests.OrganizationServiceTest)  Time elapsed: 0.001 s
15:32:30 [2021-02-05T20:32:30.532Z] showMembershipEmptyUser(org.eclipse.egit.github.core.tests.OrganizationServiceTest)  Time elapsed: 0 s
15:32:30 [2021-02-05T20:32:30.532Z] getMembersAll(org.eclipse.egit.github.core.tests.OrganizationServiceTest)  Time elapsed: 0 s
15:32:30 [2021-02-05T20:32:30.532Z] constructor(org.eclipse.egit.github.core.tests.OrganizationServiceTest)  Time elapsed: 0 s
15:32:30 [2021-02-05T20:32:30.532Z] getOrganization(org.eclipse.egit.github.core.tests.OrganizationServiceTest)  Time elapsed: 0.001 s
15:32:30 [2021-02-05T20:32:30.532Z] removeMemberNullName(org.eclipse.egit.github.core.tests.OrganizationServiceTest)  Time elapsed: 0 s
15:32:30 [2021-02-05T20:32:30.532Z] removeMemberNullUser(org.eclipse.egit.github.core.tests.OrganizationServiceTest)  Time elapsed: 0 s
15:32:30 [2021-02-05T20:32:30.532Z] isMemberEmptyName(org.eclipse.egit.github.core.tests.OrganizationServiceTest)  Time elapsed: 0 s
15:32:30 [2021-02-05T20:32:30.532Z] isMemberEmptyUser(org.eclipse.egit.github.core.tests.OrganizationServiceTest)  Time elapsed: 0 s
15:32:30 [2021-02-05T20:32:30.532Z] hideMembershipNullName(org.eclipse.egit.github.core.tests.OrganizationServiceTest)  Time elapsed: 0 s
15:32:30 [2021-02-05T20:32:30.532Z] hideMembershipNullUser(org.eclipse.egit.github.core.tests.OrganizationServiceTest)  Time elapsed: 0 s
15:32:30 [2021-02-05T20:32:30.532Z] getCurrentUserOrganizations(org.eclipse.egit.github.core.tests.OrganizationServiceTest)  Time elapsed: 0 s
15:32:30 [2021-02-05T20:32:30.532Z] getPublicMembersNullName(org.eclipse.egit.github.core.tests.OrganizationServiceTest)  Time elapsed: 0 s
15:32:30 [2021-02-05T20:32:30.532Z] removeMember(org.eclipse.egit.github.core.tests.OrganizationServiceTest)  Time elapsed: 0 s
15:32:30 [2021-02-05T20:32:30.532Z] getMembersEmptyName(org.eclipse.egit.github.core.tests.OrganizationServiceTest)  Time elapsed: 0.001 s
15:32:30 [2021-02-05T20:32:30.532Z] editOrganizationNullOrgName(org.eclipse.egit.github.core.tests.OrganizationServiceTest)  Time elapsed: 0 s
15:32:30 [2021-02-05T20:32:30.532Z] showMembershipNullName(org.eclipse.egit.github.core.tests.OrganizationServiceTest)  Time elapsed: 0 s
15:32:30 [2021-02-05T20:32:30.532Z] showMembershipNullUser(org.eclipse.egit.github.core.tests.OrganizationServiceTest)  Time elapsed: 0 s
15:32:30 [2021-02-05T20:32:30.532Z] getOrganizationNullName(org.eclipse.egit.github.core.tests.OrganizationServiceTest)  Time elapsed: 0 s
15:32:30 [2021-02-05T20:32:30.532Z] isPublicMember(org.eclipse.egit.github.core.tests.OrganizationServiceTest)  Time elapsed: 0.001 s
15:32:30 [2021-02-05T20:32:30.532Z] isMember(org.eclipse.egit.github.core.tests.OrganizationServiceTest)  Time elapsed: 0 s
15:32:30 [2021-02-05T20:32:30.533Z] getOrganizationsEmptyUser(org.eclipse.egit.github.core.tests.OrganizationServiceTest)  Time elapsed: 0 s
15:32:30 [2021-02-05T20:32:30.533Z] isPublicMemberEmptyName(org.eclipse.egit.github.core.tests.OrganizationServiceTest)  Time elapsed: 0 s
15:32:30 [2021-02-05T20:32:30.533Z] isPublicMemberEmptyUser(org.eclipse.egit.github.core.tests.OrganizationServiceTest)  Time elapsed: 0 s
15:32:30 [2021-02-05T20:32:30.533Z] isPublicMemberNullName(org.eclipse.egit.github.core.tests.OrganizationServiceTest)  Time elapsed: 0 s
15:32:30 [2021-02-05T20:32:30.533Z] isPublicMemberNullUser(org.eclipse.egit.github.core.tests.OrganizationServiceTest)  Time elapsed: 0 s
15:32:30 [2021-02-05T20:32:30.533Z] showMembership(org.eclipse.egit.github.core.tests.OrganizationServiceTest)  Time elapsed: 0 s
15:32:30 [2021-02-05T20:32:30.533Z] editOrganizationEmptyOrgName(org.eclipse.egit.github.core.tests.OrganizationServiceTest)  Time elapsed: 0 s
15:32:30 [2021-02-05T20:32:30.533Z] hideMembershipEmptyName(org.eclipse.egit.github.core.tests.OrganizationServiceTest)  Time elapsed: 0 s
15:32:30 [2021-02-05T20:32:30.533Z] hideMembershipEmptyUser(org.eclipse.egit.github.core.tests.OrganizationServiceTest)  Time elapsed: 0 s
15:32:30 [2021-02-05T20:32:30.533Z] editOrganization(org.eclipse.egit.github.core.tests.OrganizationServiceTest)  Time elapsed: 0 s
15:32:30 [2021-02-05T20:32:30.533Z] isMemberNullName(org.eclipse.egit.github.core.tests.OrganizationServiceTest)  Time elapsed: 0 s
15:32:30 [2021-02-05T20:32:30.533Z] isMemberNullUser(org.eclipse.egit.github.core.tests.OrganizationServiceTest)  Time elapsed: 0 s
15:32:30 [2021-02-05T20:32:30.533Z] editOrganizationNullOrg(org.eclipse.egit.github.core.tests.OrganizationServiceTest)  Time elapsed: 0 s
15:32:30 [2021-02-05T20:32:30.533Z] getOrganizations(org.eclipse.egit.github.core.tests.OrganizationServiceTest)  Time elapsed: 0 s
15:32:30 [2021-02-05T20:32:30.533Z] getPublicMembers(org.eclipse.egit.github.core.tests.OrganizationServiceTest)  Time elapsed: 0 s
15:32:30 [2021-02-05T20:32:30.533Z] getPublicMembersEmptyName(org.eclipse.egit.github.core.tests.OrganizationServiceTest)  Time elapsed: 0.001 s
15:32:30 [2021-02-05T20:32:30.533Z] removeMemberEmptyName(org.eclipse.egit.github.core.tests.OrganizationServiceTest)  Time elapsed: 0 s
15:32:30 [2021-02-05T20:32:30.533Z] removeMemberEmptyUser(org.eclipse.egit.github.core.tests.OrganizationServiceTest)  Time elapsed: 0 s
15:32:30 [2021-02-05T20:32:30.533Z] getMembersMember(org.eclipse.egit.github.core.tests.OrganizationServiceTest)  Time elapsed: 0 s
15:32:30 [2021-02-05T20:32:30.533Z] getOrganizationEmptyName(org.eclipse.egit.github.core.tests.OrganizationServiceTest)  Time elapsed: 0 s
15:32:30 [2021-02-05T20:32:30.533Z] getOrganizationsNullUser(org.eclipse.egit.github.core.tests.OrganizationServiceTest)  Time elapsed: 0 s
15:32:30 [2021-02-05T20:32:30.533Z] getMembers(org.eclipse.egit.github.core.tests.OrganizationServiceTest)  Time elapsed: 0.001 s
15:32:30 [2021-02-05T20:32:30.533Z] getMembersNullName(org.eclipse.egit.github.core.tests.OrganizationServiceTest)  Time elapsed: 0 s
15:32:30 [2021-02-05T20:32:30.533Z] hideMembership(org.eclipse.egit.github.core.tests.OrganizationServiceTest)  Time elapsed: 0 s
15:32:30 [2021-02-05T20:32:30.533Z] getMembersAdmin(org.eclipse.egit.github.core.tests.OrganizationServiceTest)  Time elapsed: 0 s
15:32:30 [2021-02-05T20:32:30.533Z] defaultState(org.eclipse.egit.github.core.tests.PagedRequestTest)  Time elapsed: 0 s
15:32:30 [2021-02-05T20:32:30.533Z] updateFields(org.eclipse.egit.github.core.tests.PullRequestMarkerTest)  Time elapsed: 0.001 s
15:32:30 [2021-02-05T20:32:30.533Z] defaultState(org.eclipse.egit.github.core.tests.PullRequestMarkerTest)  Time elapsed: 0 s
15:32:30 [2021-02-05T20:32:30.533Z] updateFields(org.eclipse.egit.github.core.tests.PullRequestPayloadTest)  Time elapsed: 0 s
15:32:30 [2021-02-05T20:32:30.533Z] defaultState(org.eclipse.egit.github.core.tests.PullRequestPayloadTest)  Time elapsed: 0 s
15:32:30 [2021-02-05T20:32:30.533Z] updateFields(org.eclipse.egit.github.core.tests.PullRequestReviewCommentPayloadTest)  Time elapsed: 0 s
15:32:30 [2021-02-05T20:32:30.533Z] defaultState(org.eclipse.egit.github.core.tests.PullRequestReviewCommentPayloadTest)  Time elapsed: 0 s
15:32:30 [2021-02-05T20:32:30.533Z] getPullRequestNullRepository(org.eclipse.egit.github.core.tests.PullRequestServiceTest)  Time elapsed: 0 s
15:32:30 [2021-02-05T20:32:30.533Z] replyToComment(org.eclipse.egit.github.core.tests.PullRequestServiceTest)  Time elapsed: 0.001 s
15:32:30 [2021-02-05T20:32:30.533Z] constructor(org.eclipse.egit.github.core.tests.PullRequestServiceTest)  Time elapsed: 0 s
15:32:30 [2021-02-05T20:32:30.533Z] getPullRequest(org.eclipse.egit.github.core.tests.PullRequestServiceTest)  Time elapsed: 0 s
15:32:30 [2021-02-05T20:32:30.533Z] editComment(org.eclipse.egit.github.core.tests.PullRequestServiceTest)  Time elapsed: 0 s
15:32:30 [2021-02-05T20:32:30.533Z] getPullRequestsNullRepository(org.eclipse.egit.github.core.tests.PullRequestServiceTest)  Time elapsed: 0.001 s
15:32:30 [2021-02-05T20:32:30.533Z] createComment(org.eclipse.egit.github.core.tests.PullRequestServiceTest)  Time elapsed: 0 s
15:32:30 [2021-02-05T20:32:30.533Z] constructorNullArgument(org.eclipse.egit.github.core.tests.PullRequestServiceTest)  Time elapsed: 0 s
15:32:30 [2021-02-05T20:32:30.533Z] editPullRequestNullRequest(org.eclipse.egit.github.core.tests.PullRequestServiceTest)  Time elapsed: 0 s
15:32:30 [2021-02-05T20:32:30.533Z] getPullRequestsNullRepositoryId(org.eclipse.egit.github.core.tests.PullRequestServiceTest)  Time elapsed: 0 s
15:32:30 [2021-02-05T20:32:30.533Z] createPullRequestFromIssue(org.eclipse.egit.github.core.tests.PullRequestServiceTest)  Time elapsed: 0.001 s
15:32:30 [2021-02-05T20:32:30.533Z] isMerged(org.eclipse.egit.github.core.tests.PullRequestServiceTest)  Time elapsed: 0 s
15:32:30 [2021-02-05T20:32:30.533Z] createPullRequest(org.eclipse.egit.github.core.tests.PullRequestServiceTest)  Time elapsed: 0 s
15:32:30 [2021-02-05T20:32:30.533Z] editCommentNullComment(org.eclipse.egit.github.core.tests.PullRequestServiceTest)  Time elapsed: 0 s
15:32:30 [2021-02-05T20:32:30.533Z] merge(org.eclipse.egit.github.core.tests.PullRequestServiceTest)  Time elapsed: 0 s
15:32:30 [2021-02-05T20:32:30.533Z] deleteComment(org.eclipse.egit.github.core.tests.PullRequestServiceTest)  Time elapsed: 0.001 s
15:32:30 [2021-02-05T20:32:30.533Z] editPullRequest(org.eclipse.egit.github.core.tests.PullRequestServiceTest)  Time elapsed: 0 s
15:32:30 [2021-02-05T20:32:30.533Z] getPullRequests(org.eclipse.egit.github.core.tests.PullRequestServiceTest)  Time elapsed: 0 s
15:32:30 [2021-02-05T20:32:30.533Z] getComments(org.eclipse.egit.github.core.tests.PullRequestServiceTest)  Time elapsed: 0.001 s
15:32:30 [2021-02-05T20:32:30.533Z] getFiles(org.eclipse.egit.github.core.tests.PullRequestServiceTest)  Time elapsed: 0 s
15:32:30 [2021-02-05T20:32:30.533Z] getComment(org.eclipse.egit.github.core.tests.PullRequestServiceTest)  Time elapsed: 0 s
15:32:30 [2021-02-05T20:32:30.533Z] getCommits(org.eclipse.egit.github.core.tests.PullRequestServiceTest)  Time elapsed: 0.001 s
15:32:30 [2021-02-05T20:32:30.533Z] getClosedAtReferenceMutableObject(org.eclipse.egit.github.core.tests.PullRequestTest)  Time elapsed: 0 s
15:32:30 [2021-02-05T20:32:30.533Z] getMergedAtReferenceMutableObject(org.eclipse.egit.github.core.tests.PullRequestTest)  Time elapsed: 0 s
15:32:30 [2021-02-05T20:32:30.533Z] updateFields(org.eclipse.egit.github.core.tests.PullRequestTest)  Time elapsed: 0 s
15:32:30 [2021-02-05T20:32:30.533Z] defaultState(org.eclipse.egit.github.core.tests.PullRequestTest)  Time elapsed: 0 s
15:32:30 [2021-02-05T20:32:30.533Z] getCreatedAtReferenceMutableObject(org.eclipse.egit.github.core.tests.PullRequestTest)  Time elapsed: 0 s
15:32:30 [2021-02-05T20:32:30.533Z] getUpdatedAtReferenceMutableObject(org.eclipse.egit.github.core.tests.PullRequestTest)  Time elapsed: 0 s
15:32:30 [2021-02-05T20:32:30.533Z] updateFields(org.eclipse.egit.github.core.tests.PushPayloadTest)  Time elapsed: 0 s
15:32:30 [2021-02-05T20:32:30.534Z] defaultState(org.eclipse.egit.github.core.tests.PushPayloadTest)  Time elapsed: 0 s
15:32:30 [2021-02-05T20:32:30.534Z] updateFields(org.eclipse.egit.github.core.tests.ReferenceTest)  Time elapsed: 0 s
15:32:30 [2021-02-05T20:32:30.534Z] defaultState(org.eclipse.egit.github.core.tests.ReferenceTest)  Time elapsed: 0 s
15:32:30 [2021-02-05T20:32:30.534Z] updateFields(org.eclipse.egit.github.core.tests.RepositoryBranchTest)  Time elapsed: 0.001 s
15:32:30 [2021-02-05T20:32:30.534Z] defaultState(org.eclipse.egit.github.core.tests.RepositoryBranchTest)  Time elapsed: 0 s
15:32:30 [2021-02-05T20:32:30.534Z] updateFields(org.eclipse.egit.github.core.tests.RepositoryCommitCompareTest)  Time elapsed: 0 s
15:32:30 [2021-02-05T20:32:30.534Z] defaultState(org.eclipse.egit.github.core.tests.RepositoryCommitCompareTest)  Time elapsed: 0 s
15:32:30 [2021-02-05T20:32:30.534Z] updateFields(org.eclipse.egit.github.core.tests.RepositoryCommitTest)  Time elapsed: 0 s
15:32:30 [2021-02-05T20:32:30.534Z] defaultState(org.eclipse.egit.github.core.tests.RepositoryCommitTest)  Time elapsed: 0 s
15:32:30 [2021-02-05T20:32:30.534Z] updateFields(org.eclipse.egit.github.core.tests.RepositoryContentsTest)  Time elapsed: 0 s
15:32:30 [2021-02-05T20:32:30.534Z] defaultState(org.eclipse.egit.github.core.tests.RepositoryContentsTest)  Time elapsed: 0 s
15:32:30 [2021-02-05T20:32:30.534Z] updateFields(org.eclipse.egit.github.core.tests.RepositoryHookResponseTest)  Time elapsed: 0 s
15:32:30 [2021-02-05T20:32:30.534Z] defaultState(org.eclipse.egit.github.core.tests.RepositoryHookResponseTest)  Time elapsed: 0 s
15:32:30 [2021-02-05T20:32:30.534Z] updateFields(org.eclipse.egit.github.core.tests.RepositoryHookTest)  Time elapsed: 0.001 s
15:32:30 [2021-02-05T20:32:30.534Z] defaultState(org.eclipse.egit.github.core.tests.RepositoryHookTest)  Time elapsed: 0 s
15:32:30 [2021-02-05T20:32:30.534Z] createFromNullString(org.eclipse.egit.github.core.tests.RepositoryIdTest)  Time elapsed: 0 s
15:32:30 [2021-02-05T20:32:30.534Z] create(org.eclipse.egit.github.core.tests.RepositoryIdTest)  Time elapsed: 0 s
15:32:30 [2021-02-05T20:32:30.534Z] createFromEmptyString(org.eclipse.egit.github.core.tests.RepositoryIdTest)  Time elapsed: 0 s
15:32:30 [2021-02-05T20:32:30.534Z] createFromNullUrl(org.eclipse.egit.github.core.tests.RepositoryIdTest)  Time elapsed: 0 s
15:32:30 [2021-02-05T20:32:30.534Z] createNullName(org.eclipse.egit.github.core.tests.RepositoryIdTest)  Time elapsed: 0 s
15:32:30 [2021-02-05T20:32:30.534Z] createFromStringUrl(org.eclipse.egit.github.core.tests.RepositoryIdTest)  Time elapsed: 0 s
15:32:30 [2021-02-05T20:32:30.534Z] createNullOwner(org.eclipse.egit.github.core.tests.RepositoryIdTest)  Time elapsed: 0 s
15:32:30 [2021-02-05T20:32:30.534Z] createFromString(org.eclipse.egit.github.core.tests.RepositoryIdTest)  Time elapsed: 0 s
15:32:30 [2021-02-05T20:32:30.534Z] createFromMalformedStringUrl(org.eclipse.egit.github.core.tests.RepositoryIdTest)  Time elapsed: 0 s
15:32:30 [2021-02-05T20:32:30.534Z] equality(org.eclipse.egit.github.core.tests.RepositoryIdTest)  Time elapsed: 0.001 s
15:32:30 [2021-02-05T20:32:30.534Z] createEmptyOwner(org.eclipse.egit.github.core.tests.RepositoryIdTest)  Time elapsed: 0 s
15:32:30 [2021-02-05T20:32:30.534Z] createFromNullStringUrl(org.eclipse.egit.github.core.tests.RepositoryIdTest)  Time elapsed: 0 s
15:32:30 [2021-02-05T20:32:30.534Z] createFromInvalidUrl1(org.eclipse.egit.github.core.tests.RepositoryIdTest)  Time elapsed: 0 s
15:32:30 [2021-02-05T20:32:30.534Z] createFromInvalidUrl2(org.eclipse.egit.github.core.tests.RepositoryIdTest)  Time elapsed: 0 s
15:32:30 [2021-02-05T20:32:30.534Z] createFromInvalidUrl3(org.eclipse.egit.github.core.tests.RepositoryIdTest)  Time elapsed: 0 s
15:32:30 [2021-02-05T20:32:30.534Z] createFromInvalidUrl4(org.eclipse.egit.github.core.tests.RepositoryIdTest)  Time elapsed: 0 s
15:32:30 [2021-02-05T20:32:30.534Z] createEmptyName(org.eclipse.egit.github.core.tests.RepositoryIdTest)  Time elapsed: 0 s
15:32:30 [2021-02-05T20:32:30.534Z] createFromUrl(org.eclipse.egit.github.core.tests.RepositoryIdTest)  Time elapsed: 0 s
15:32:30 [2021-02-05T20:32:30.534Z] updateFields(org.eclipse.egit.github.core.tests.RepositoryIssueTest)  Time elapsed: 0 s
15:32:30 [2021-02-05T20:32:30.534Z] defaultState(org.eclipse.egit.github.core.tests.RepositoryIssueTest)  Time elapsed: 0 s
15:32:30 [2021-02-05T20:32:30.534Z] getPrivateOrgRepositories(org.eclipse.egit.github.core.tests.RepositoryServiceTest)  Time elapsed: 0.001 s
15:32:30 [2021-02-05T20:32:30.534Z] editRepositoryNullRepository(org.eclipse.egit.github.core.tests.RepositoryServiceTest)  Time elapsed: 0 s
15:32:30 [2021-02-05T20:32:30.534Z] getRepositoriesNullOrg(org.eclipse.egit.github.core.tests.RepositoryServiceTest)  Time elapsed: 0 s
15:32:30 [2021-02-05T20:32:30.534Z] getPublicRepositories(org.eclipse.egit.github.core.tests.RepositoryServiceTest)  Time elapsed: 0.001 s
15:32:30 [2021-02-05T20:32:30.534Z] constructor(org.eclipse.egit.github.core.tests.RepositoryServiceTest)  Time elapsed: 0 s
15:32:30 [2021-02-05T20:32:30.534Z] searchRepositoriesEmptyQuery(org.eclipse.egit.github.core.tests.RepositoryServiceTest)  Time elapsed: 0 s
15:32:30 [2021-02-05T20:32:30.534Z] getRepositoriesEmptyUser(org.eclipse.egit.github.core.tests.RepositoryServiceTest)  Time elapsed: 0 s
15:32:30 [2021-02-05T20:32:30.534Z] forkRepositoryToOrg(org.eclipse.egit.github.core.tests.RepositoryServiceTest)  Time elapsed: 0 s
15:32:30 [2021-02-05T20:32:30.534Z] getRepositoriesEmptyOrg(org.eclipse.egit.github.core.tests.RepositoryServiceTest)  Time elapsed: 0 s
15:32:30 [2021-02-05T20:32:30.534Z] getContributors(org.eclipse.egit.github.core.tests.RepositoryServiceTest)  Time elapsed: 0 s
15:32:30 [2021-02-05T20:32:30.534Z] searchRepositoriesNullQuery(org.eclipse.egit.github.core.tests.RepositoryServiceTest)  Time elapsed: 0 s
15:32:30 [2021-02-05T20:32:30.534Z] createOrgRepositoryNullRepository(org.eclipse.egit.github.core.tests.RepositoryServiceTest)  Time elapsed: 0 s
15:32:30 [2021-02-05T20:32:30.534Z] editRepositoryProviderWithNullFields(org.eclipse.egit.github.core.tests.RepositoryServiceTest)  Time elapsed: 0 s
15:32:30 [2021-02-05T20:32:30.534Z] searchRepositoriesStartingAtPage(org.eclipse.egit.github.core.tests.RepositoryServiceTest)  Time elapsed: 0.001 s
15:32:30 [2021-02-05T20:32:30.534Z] editRepositoryProviderWithFields(org.eclipse.egit.github.core.tests.RepositoryServiceTest)  Time elapsed: 0 s
15:32:30 [2021-02-05T20:32:30.534Z] editRepository(org.eclipse.egit.github.core.tests.RepositoryServiceTest)  Time elapsed: 0 s
15:32:30 [2021-02-05T20:32:30.534Z] createRepositoryNullRepository(org.eclipse.egit.github.core.tests.RepositoryServiceTest)  Time elapsed: 0 s
15:32:30 [2021-02-05T20:32:30.534Z] getRepositories(org.eclipse.egit.github.core.tests.RepositoryServiceTest)  Time elapsed: 0.001 s
15:32:30 [2021-02-05T20:32:30.534Z] createRepository(org.eclipse.egit.github.core.tests.RepositoryServiceTest)  Time elapsed: 0 s
15:32:30 [2021-02-05T20:32:30.534Z] getOrgRepositories(org.eclipse.egit.github.core.tests.RepositoryServiceTest)  Time elapsed: 0 s
15:32:30 [2021-02-05T20:32:30.534Z] getRepositoriesNullUser(org.eclipse.egit.github.core.tests.RepositoryServiceTest)  Time elapsed: 0 s
15:32:30 [2021-02-05T20:32:30.534Z] getContributorsWithAnonymous(org.eclipse.egit.github.core.tests.RepositoryServiceTest)  Time elapsed: 0 s
15:32:30 [2021-02-05T20:32:30.534Z] searchEscaped(org.eclipse.egit.github.core.tests.RepositoryServiceTest)  Time elapsed: 0.001 s
15:32:30 [2021-02-05T20:32:30.534Z] getUserRepositories(org.eclipse.egit.github.core.tests.RepositoryServiceTest)  Time elapsed: 0 s
15:32:30 [2021-02-05T20:32:30.534Z] getHook(org.eclipse.egit.github.core.tests.RepositoryServiceTest)  Time elapsed: 0 s
15:32:30 [2021-02-05T20:32:30.534Z] getTags(org.eclipse.egit.github.core.tests.RepositoryServiceTest)  Time elapsed: 0.001 s
15:32:30 [2021-02-05T20:32:30.534Z] forkRepository(org.eclipse.egit.github.core.tests.RepositoryServiceTest)  Time elapsed: 0 s
15:32:30 [2021-02-05T20:32:30.534Z] editHookNullHook(org.eclipse.egit.github.core.tests.RepositoryServiceTest)  Time elapsed: 0 s
15:32:30 [2021-02-05T20:32:30.534Z] createOrgRepositoryNullOrg(org.eclipse.egit.github.core.tests.RepositoryServiceTest)  Time elapsed: 0 s
15:32:30 [2021-02-05T20:32:30.534Z] pageAllRepositoriesSince(org.eclipse.egit.github.core.tests.RepositoryServiceTest)  Time elapsed: 0 s
15:32:30 [2021-02-05T20:32:30.534Z] createOrgRepositoryEmptyOrg(org.eclipse.egit.github.core.tests.RepositoryServiceTest)  Time elapsed: 0 s
15:32:30 [2021-02-05T20:32:30.534Z] createOrgRepository(org.eclipse.egit.github.core.tests.RepositoryServiceTest)  Time elapsed: 0.001 s
15:32:30 [2021-02-05T20:32:30.534Z] getRepositoryProvider(org.eclipse.egit.github.core.tests.RepositoryServiceTest)  Time elapsed: 0 s
15:32:30 [2021-02-05T20:32:30.534Z] editRepositoryWithNullFields(org.eclipse.egit.github.core.tests.RepositoryServiceTest)  Time elapsed: 0 s
15:32:30 [2021-02-05T20:32:30.534Z] pageAllRepositories(org.eclipse.egit.github.core.tests.RepositoryServiceTest)  Time elapsed: 0 s
15:32:30 [2021-02-05T20:32:30.534Z] runMerge(org.eclipse.egit.github.core.tests.RepositoryServiceTest)  Time elapsed: 0.001 s
15:32:30 [2021-02-05T20:32:30.534Z] searchRepositoriesMatchingLanguage(org.eclipse.egit.github.core.tests.RepositoryServiceTest)  Time elapsed: 0 s
15:32:30 [2021-02-05T20:32:30.534Z] editRepositoryWithFields(org.eclipse.egit.github.core.tests.RepositoryServiceTest)  Time elapsed: 0 s
15:32:30 [2021-02-05T20:32:30.534Z] createHook(org.eclipse.egit.github.core.tests.RepositoryServiceTest)  Time elapsed: 0 s
15:32:30 [2021-02-05T20:32:30.535Z] getLanguages(org.eclipse.egit.github.core.tests.RepositoryServiceTest)  Time elapsed: 0.001 s
15:32:30 [2021-02-05T20:32:30.535Z] runHook(org.eclipse.egit.github.core.tests.RepositoryServiceTest)  Time elapsed: 0 s
15:32:30 [2021-02-05T20:32:30.535Z] editHook(org.eclipse.egit.github.core.tests.RepositoryServiceTest)  Time elapsed: 0 s
15:32:30 [2021-02-05T20:32:30.535Z] searchRepositories(org.eclipse.egit.github.core.tests.RepositoryServiceTest)  Time elapsed: 0 s
15:32:30 [2021-02-05T20:32:30.535Z] getRepository(org.eclipse.egit.github.core.tests.RepositoryServiceTest)  Time elapsed: 0 s
15:32:30 [2021-02-05T20:32:30.535Z] deleteHook(org.eclipse.egit.github.core.tests.RepositoryServiceTest)  Time elapsed: 0.001 s
15:32:30 [2021-02-05T20:32:30.535Z] getForks(org.eclipse.egit.github.core.tests.RepositoryServiceTest)  Time elapsed: 0 s
15:32:30 [2021-02-05T20:32:30.535Z] getHooks(org.eclipse.egit.github.core.tests.RepositoryServiceTest)  Time elapsed: 0 s
15:32:30 [2021-02-05T20:32:30.535Z] getBranches(org.eclipse.egit.github.core.tests.RepositoryServiceTest)  Time elapsed: 0.001 s
15:32:30 [2021-02-05T20:32:30.535Z] updateFields(org.eclipse.egit.github.core.tests.RepositoryTagTest)  Time elapsed: 0 s
15:32:30 [2021-02-05T20:32:30.535Z] defaultState(org.eclipse.egit.github.core.tests.RepositoryTagTest)  Time elapsed: 0 s
15:32:30 [2021-02-05T20:32:30.535Z] generateIdNullName(org.eclipse.egit.github.core.tests.RepositoryTest)  Time elapsed: 0 s
15:32:30 [2021-02-05T20:32:30.535Z] generateIdEmptyName(org.eclipse.egit.github.core.tests.RepositoryTest)  Time elapsed: 0 s
15:32:30 [2021-02-05T20:32:30.535Z] updateFields(org.eclipse.egit.github.core.tests.RepositoryTest)  Time elapsed: 0 s
15:32:30 [2021-02-05T20:32:30.535Z] fromJson(org.eclipse.egit.github.core.tests.RepositoryTest)  Time elapsed: 0.002 s
15:32:30 [2021-02-05T20:32:30.535Z] defaultState(org.eclipse.egit.github.core.tests.RepositoryTest)  Time elapsed: 0 s
15:32:30 [2021-02-05T20:32:30.535Z] generateIdEmptyOwnerLogin(org.eclipse.egit.github.core.tests.RepositoryTest)  Time elapsed: 0 s
15:32:30 [2021-02-05T20:32:30.535Z] generateId(org.eclipse.egit.github.core.tests.RepositoryTest)  Time elapsed: 0 s
15:32:30 [2021-02-05T20:32:30.535Z] generateIdNullOwner(org.eclipse.egit.github.core.tests.RepositoryTest)  Time elapsed: 0 s
15:32:30 [2021-02-05T20:32:30.535Z] generateIdNullOwnerLogin(org.eclipse.egit.github.core.tests.RepositoryTest)  Time elapsed: 0 s
15:32:30 [2021-02-05T20:32:30.535Z] requestErrorWithMessageField(org.eclipse.egit.github.core.tests.RequestErrorTest)  Time elapsed: 0 s
15:32:30 [2021-02-05T20:32:30.535Z] requestErrorWithErrorAndMessageField(org.eclipse.egit.github.core.tests.RequestErrorTest)  Time elapsed: 0.001 s
15:32:30 [2021-02-05T20:32:30.535Z] requestErrorWithErrorField(org.eclipse.egit.github.core.tests.RequestErrorTest)  Time elapsed: 0 s
15:32:30 [2021-02-05T20:32:30.535Z] invalidFieldValue(org.eclipse.egit.github.core.tests.RequestExceptionTest)  Time elapsed: 0 s
15:32:30 [2021-02-05T20:32:30.535Z] customCode(org.eclipse.egit.github.core.tests.RequestExceptionTest)  Time elapsed: 0 s
15:32:30 [2021-02-05T20:32:30.535Z] missingField(org.eclipse.egit.github.core.tests.RequestExceptionTest)  Time elapsed: 0 s
15:32:30 [2021-02-05T20:32:30.535Z] invalidField(org.eclipse.egit.github.core.tests.RequestExceptionTest)  Time elapsed: 0 s
15:32:30 [2021-02-05T20:32:30.535Z] existentField(org.eclipse.egit.github.core.tests.RequestExceptionTest)  Time elapsed: 0 s
15:32:30 [2021-02-05T20:32:30.535Z] errorField(org.eclipse.egit.github.core.tests.RequestExceptionTest)  Time elapsed: 0 s
15:32:30 [2021-02-05T20:32:30.535Z] updateFields(org.eclipse.egit.github.core.tests.SearchIssueTest)  Time elapsed: 0 s
15:32:30 [2021-02-05T20:32:30.535Z] defaultState(org.eclipse.egit.github.core.tests.SearchIssueTest)  Time elapsed: 0 s
15:32:30 [2021-02-05T20:32:30.535Z] createNullName(org.eclipse.egit.github.core.tests.SearchRepositoryTest)  Time elapsed: 0.001 s
15:32:30 [2021-02-05T20:32:30.535Z] defaultState(org.eclipse.egit.github.core.tests.SearchRepositoryTest)  Time elapsed: 0 s
15:32:30 [2021-02-05T20:32:30.535Z] createNullOwner(org.eclipse.egit.github.core.tests.SearchRepositoryTest)  Time elapsed: 0 s
15:32:30 [2021-02-05T20:32:30.535Z] equality(org.eclipse.egit.github.core.tests.SearchRepositoryTest)  Time elapsed: 0 s
15:32:30 [2021-02-05T20:32:30.535Z] getCreatedAtReferenceMutableObject(org.eclipse.egit.github.core.tests.SearchRepositoryTest)  Time elapsed: 0 s
15:32:30 [2021-02-05T20:32:30.535Z] createEmptyOwner(org.eclipse.egit.github.core.tests.SearchRepositoryTest)  Time elapsed: 0 s
15:32:30 [2021-02-05T20:32:30.535Z] getPushedAtReferenceMutableObject(org.eclipse.egit.github.core.tests.SearchRepositoryTest)  Time elapsed: 0 s
15:32:30 [2021-02-05T20:32:30.535Z] createEmptyName(org.eclipse.egit.github.core.tests.SearchRepositoryTest)  Time elapsed: 0.001 s
15:32:30 [2021-02-05T20:32:30.535Z] noGeneratedId(org.eclipse.egit.github.core.tests.SearchRepositoryTest)  Time elapsed: 0 s
15:32:30 [2021-02-05T20:32:30.535Z] updateFields(org.eclipse.egit.github.core.tests.ShaResourceTest)  Time elapsed: 0 s
15:32:30 [2021-02-05T20:32:30.535Z] defaultState(org.eclipse.egit.github.core.tests.ShaResourceTest)  Time elapsed: 0 s
15:32:30 [2021-02-05T20:32:30.535Z] getStarredNullName(org.eclipse.egit.github.core.tests.StargazerServiceTest)  Time elapsed: 0 s
15:32:30 [2021-02-05T20:32:30.535Z] constructor(org.eclipse.egit.github.core.tests.StargazerServiceTest)  Time elapsed: 0 s
15:32:30 [2021-02-05T20:32:30.535Z] pageCurrentStarred(org.eclipse.egit.github.core.tests.StargazerServiceTest)  Time elapsed: 0.001 s
15:32:30 [2021-02-05T20:32:30.535Z] getStarred(org.eclipse.egit.github.core.tests.StargazerServiceTest)  Time elapsed: 0 s
15:32:30 [2021-02-05T20:32:30.535Z] unstar(org.eclipse.egit.github.core.tests.StargazerServiceTest)  Time elapsed: 0 s
15:32:30 [2021-02-05T20:32:30.535Z] star(org.eclipse.egit.github.core.tests.StargazerServiceTest)  Time elapsed: 0 s
15:32:30 [2021-02-05T20:32:30.535Z] pageStargazers(org.eclipse.egit.github.core.tests.StargazerServiceTest)  Time elapsed: 0 s
15:32:30 [2021-02-05T20:32:30.535Z] getCurrentStarred(org.eclipse.egit.github.core.tests.StargazerServiceTest)  Time elapsed: 0.001 s
15:32:30 [2021-02-05T20:32:30.535Z] isStarring(org.eclipse.egit.github.core.tests.StargazerServiceTest)  Time elapsed: 0 s
15:32:30 [2021-02-05T20:32:30.535Z] getStarredEmptyName(org.eclipse.egit.github.core.tests.StargazerServiceTest)  Time elapsed: 0 s
15:32:30 [2021-02-05T20:32:30.535Z] pageStarred(org.eclipse.egit.github.core.tests.StargazerServiceTest)  Time elapsed: 0 s
15:32:30 [2021-02-05T20:32:30.535Z] getStargazers(org.eclipse.egit.github.core.tests.StargazerServiceTest)  Time elapsed: 0 s
15:32:30 [2021-02-05T20:32:30.535Z] updateFields(org.eclipse.egit.github.core.tests.TagTest)  Time elapsed: 0 s
15:32:30 [2021-02-05T20:32:30.535Z] defaultState(org.eclipse.egit.github.core.tests.TagTest)  Time elapsed: 0 s
15:32:30 [2021-02-05T20:32:30.535Z] updateFields(org.eclipse.egit.github.core.tests.TeamAddPayloadTest)  Time elapsed: 0 s
15:32:30 [2021-02-05T20:32:30.535Z] defaultState(org.eclipse.egit.github.core.tests.TeamAddPayloadTest)  Time elapsed: 0 s
15:32:30 [2021-02-05T20:32:30.535Z] getMembershipEmptyName(org.eclipse.egit.github.core.tests.TeamServiceTest)  Time elapsed: 0.001 s
15:32:30 [2021-02-05T20:32:30.535Z] getTeamsEmptyName(org.eclipse.egit.github.core.tests.TeamServiceTest)  Time elapsed: 0 s
15:32:30 [2021-02-05T20:32:30.535Z] createTeamWithRepos(org.eclipse.egit.github.core.tests.TeamServiceTest)  Time elapsed: 0 s
15:32:30 [2021-02-05T20:32:30.535Z] getMembership(org.eclipse.egit.github.core.tests.TeamServiceTest)  Time elapsed: 0 s
15:32:30 [2021-02-05T20:32:30.535Z] constructor(org.eclipse.egit.github.core.tests.TeamServiceTest)  Time elapsed: 0 s
15:32:30 [2021-02-05T20:32:30.535Z] removeMemberNullName(org.eclipse.egit.github.core.tests.TeamServiceTest)  Time elapsed: 0 s
15:32:30 [2021-02-05T20:32:30.535Z] createTeamEmptyOrg(org.eclipse.egit.github.core.tests.TeamServiceTest)  Time elapsed: 0.001 s
15:32:30 [2021-02-05T20:32:30.535Z] addMembership(org.eclipse.egit.github.core.tests.TeamServiceTest)  Time elapsed: 0 s
15:32:30 [2021-02-05T20:32:30.535Z] removeRepository(org.eclipse.egit.github.core.tests.TeamServiceTest)  Time elapsed: 0 s
15:32:30 [2021-02-05T20:32:30.535Z] isMemberEmptyName(org.eclipse.egit.github.core.tests.TeamServiceTest)  Time elapsed: 0 s
15:32:30 [2021-02-05T20:32:30.535Z] removeMember(org.eclipse.egit.github.core.tests.TeamServiceTest)  Time elapsed: 0 s
15:32:30 [2021-02-05T20:32:30.535Z] addMembershipEmptyName(org.eclipse.egit.github.core.tests.TeamServiceTest)  Time elapsed: 0 s
15:32:30 [2021-02-05T20:32:30.535Z] getRepositories(org.eclipse.egit.github.core.tests.TeamServiceTest)  Time elapsed: 0.001 s
15:32:30 [2021-02-05T20:32:30.535Z] addMembershipNullName(org.eclipse.egit.github.core.tests.TeamServiceTest)  Time elapsed: 0 s
15:32:30 [2021-02-05T20:32:30.535Z] removeMembershipEmptyName(org.eclipse.egit.github.core.tests.TeamServiceTest)  Time elapsed: 0 s
15:32:30 [2021-02-05T20:32:30.535Z] getAllTeams(org.eclipse.egit.github.core.tests.TeamServiceTest)  Time elapsed: 0 s
15:32:30 [2021-02-05T20:32:30.535Z] isMember(org.eclipse.egit.github.core.tests.TeamServiceTest)  Time elapsed: 0 s
15:32:30 [2021-02-05T20:32:30.535Z] removeMembership(org.eclipse.egit.github.core.tests.TeamServiceTest)  Time elapsed: 0 s
15:32:30 [2021-02-05T20:32:30.535Z] getMembershipNullName(org.eclipse.egit.github.core.tests.TeamServiceTest)  Time elapsed: 0 s
15:32:30 [2021-02-05T20:32:30.535Z] createTeamNullTeam(org.eclipse.egit.github.core.tests.TeamServiceTest)  Time elapsed: 0 s
15:32:30 [2021-02-05T20:32:30.535Z] addMember(org.eclipse.egit.github.core.tests.TeamServiceTest)  Time elapsed: 0 s
15:32:30 [2021-02-05T20:32:30.535Z] isRepository(org.eclipse.egit.github.core.tests.TeamServiceTest)  Time elapsed: 0 s
15:32:30 [2021-02-05T20:32:30.536Z] getTeam(org.eclipse.egit.github.core.tests.TeamServiceTest)  Time elapsed: 0.001 s
15:32:30 [2021-02-05T20:32:30.536Z] addMemberNullName(org.eclipse.egit.github.core.tests.TeamServiceTest)  Time elapsed: 0 s
15:32:30 [2021-02-05T20:32:30.536Z] isMemberNullName(org.eclipse.egit.github.core.tests.TeamServiceTest)  Time elapsed: 0 s
15:32:30 [2021-02-05T20:32:30.536Z] removeMemberEmptyName(org.eclipse.egit.github.core.tests.TeamServiceTest)  Time elapsed: 0 s
15:32:30 [2021-02-05T20:32:30.536Z] createTeam(org.eclipse.egit.github.core.tests.TeamServiceTest)  Time elapsed: 0 s
15:32:30 [2021-02-05T20:32:30.536Z] editTeamNullTeam(org.eclipse.egit.github.core.tests.TeamServiceTest)  Time elapsed: 0 s
15:32:30 [2021-02-05T20:32:30.536Z] createTeamNullOrg(org.eclipse.egit.github.core.tests.TeamServiceTest)  Time elapsed: 0 s
15:32:30 [2021-02-05T20:32:30.536Z] editTeam(org.eclipse.egit.github.core.tests.TeamServiceTest)  Time elapsed: 0 s
15:32:30 [2021-02-05T20:32:30.536Z] getRepositoryTeams(org.eclipse.egit.github.core.tests.TeamServiceTest)  Time elapsed: 0.001 s
15:32:30 [2021-02-05T20:32:30.536Z] addMemberEmptyName(org.eclipse.egit.github.core.tests.TeamServiceTest)  Time elapsed: 0 s
15:32:30 [2021-02-05T20:32:30.536Z] deleteTeam(org.eclipse.egit.github.core.tests.TeamServiceTest)  Time elapsed: 0 s
15:32:30 [2021-02-05T20:32:30.536Z] removeMembershipNullName(org.eclipse.egit.github.core.tests.TeamServiceTest)  Time elapsed: 0 s
15:32:30 [2021-02-05T20:32:30.536Z] getTeamsNullName(org.eclipse.egit.github.core.tests.TeamServiceTest)  Time elapsed: 0 s
15:32:30 [2021-02-05T20:32:30.536Z] getTeams(org.eclipse.egit.github.core.tests.TeamServiceTest)  Time elapsed: 0.001 s
15:32:30 [2021-02-05T20:32:30.536Z] addRepository(org.eclipse.egit.github.core.tests.TeamServiceTest)  Time elapsed: 0 s
15:32:30 [2021-02-05T20:32:30.536Z] getMembers(org.eclipse.egit.github.core.tests.TeamServiceTest)  Time elapsed: 0 s
15:32:30 [2021-02-05T20:32:30.536Z] updateFields(org.eclipse.egit.github.core.tests.TeamTest)  Time elapsed: 0 s
15:32:30 [2021-02-05T20:32:30.536Z] defaultState(org.eclipse.egit.github.core.tests.TeamTest)  Time elapsed: 0 s
15:32:30 [2021-02-05T20:32:30.536Z] updateFields(org.eclipse.egit.github.core.tests.TreeEntryTest)  Time elapsed: 0 s
15:32:30 [2021-02-05T20:32:30.536Z] defaultState(org.eclipse.egit.github.core.tests.TreeEntryTest)  Time elapsed: 0 s
15:32:30 [2021-02-05T20:32:30.536Z] updateFields(org.eclipse.egit.github.core.tests.TreeTest)  Time elapsed: 0 s
15:32:30 [2021-02-05T20:32:30.536Z] defaultState(org.eclipse.egit.github.core.tests.TreeTest)  Time elapsed: 0 s
15:32:30 [2021-02-05T20:32:30.536Z] updateFields(org.eclipse.egit.github.core.tests.TypedResourceTest)  Time elapsed: 0 s
15:32:30 [2021-02-05T20:32:30.536Z] defaultState(org.eclipse.egit.github.core.tests.TypedResourceTest)  Time elapsed: 0 s
15:32:30 [2021-02-05T20:32:30.536Z] generateSshUrl(org.eclipse.egit.github.core.tests.UrlUtilsTest)  Time elapsed: 0 s
15:32:30 [2021-02-05T20:32:30.536Z] generateReadOnlyUrl(org.eclipse.egit.github.core.tests.UrlUtilsTest)  Time elapsed: 0 s
15:32:30 [2021-02-05T20:32:30.536Z] encode(org.eclipse.egit.github.core.tests.UrlUtilsTest)  Time elapsed: 0.001 s
15:32:30 [2021-02-05T20:32:30.536Z] generateHttpsUrl(org.eclipse.egit.github.core.tests.UrlUtilsTest)  Time elapsed: 0 s
15:32:30 [2021-02-05T20:32:30.536Z] updateFields(org.eclipse.egit.github.core.tests.UserPlanTest)  Time elapsed: 0 s
15:32:30 [2021-02-05T20:32:30.536Z] defaultState(org.eclipse.egit.github.core.tests.UserPlanTest)  Time elapsed: 0 s
15:32:30 [2021-02-05T20:32:30.536Z] addEmailEmptyEmails(org.eclipse.egit.github.core.tests.UserServiceTest)  Time elapsed: 0 s
15:32:30 [2021-02-05T20:32:30.536Z] removeEmailNullEmails(org.eclipse.egit.github.core.tests.UserServiceTest)  Time elapsed: 0 s
15:32:30 [2021-02-05T20:32:30.536Z] isFollowingEmptyUser(org.eclipse.egit.github.core.tests.UserServiceTest)  Time elapsed: 0 s
15:32:30 [2021-02-05T20:32:30.536Z] editKey(org.eclipse.egit.github.core.tests.UserServiceTest)  Time elapsed: 0.001 s
15:32:30 [2021-02-05T20:32:30.536Z] unfollowNullUser(org.eclipse.egit.github.core.tests.UserServiceTest)  Time elapsed: 0 s
15:32:30 [2021-02-05T20:32:30.536Z] constructor(org.eclipse.egit.github.core.tests.UserServiceTest)  Time elapsed: 0 s
15:32:30 [2021-02-05T20:32:30.536Z] unfollowEmptyUser(org.eclipse.egit.github.core.tests.UserServiceTest)  Time elapsed: 0 s
15:32:30 [2021-02-05T20:32:30.536Z] addEmailNullEmails(org.eclipse.egit.github.core.tests.UserServiceTest)  Time elapsed: 0 s
15:32:30 [2021-02-05T20:32:30.536Z] follow(org.eclipse.egit.github.core.tests.UserServiceTest)  Time elapsed: 0 s
15:32:30 [2021-02-05T20:32:30.536Z] addEmail(org.eclipse.egit.github.core.tests.UserServiceTest)  Time elapsed: 0.001 s
15:32:30 [2021-02-05T20:32:30.536Z] getKey(org.eclipse.egit.github.core.tests.UserServiceTest)  Time elapsed: 0 s
15:32:30 [2021-02-05T20:32:30.536Z] getFollowingNullName(org.eclipse.egit.github.core.tests.UserServiceTest)  Time elapsed: 0 s
15:32:30 [2021-02-05T20:32:30.536Z] getUserNullName(org.eclipse.egit.github.core.tests.UserServiceTest)  Time elapsed: 0 s
15:32:30 [2021-02-05T20:32:30.536Z] getFollowingEmptyName(org.eclipse.egit.github.core.tests.UserServiceTest)  Time elapsed: 0 s
15:32:30 [2021-02-05T20:32:30.536Z] followEmptyUser(org.eclipse.egit.github.core.tests.UserServiceTest)  Time elapsed: 0 s
15:32:30 [2021-02-05T20:32:30.536Z] getUserEmptyName(org.eclipse.egit.github.core.tests.UserServiceTest)  Time elapsed: 0.001 s
15:32:30 [2021-02-05T20:32:30.536Z] followNullUser(org.eclipse.egit.github.core.tests.UserServiceTest)  Time elapsed: 0 s
15:32:30 [2021-02-05T20:32:30.536Z] unfollow(org.eclipse.egit.github.core.tests.UserServiceTest)  Time elapsed: 0 s
15:32:30 [2021-02-05T20:32:30.536Z] deleteKey(org.eclipse.egit.github.core.tests.UserServiceTest)  Time elapsed: 0 s
15:32:30 [2021-02-05T20:32:30.536Z] removeEmail(org.eclipse.egit.github.core.tests.UserServiceTest)  Time elapsed: 0 s
15:32:30 [2021-02-05T20:32:30.536Z] isFollowingNullUser(org.eclipse.egit.github.core.tests.UserServiceTest)  Time elapsed: 0 s
15:32:30 [2021-02-05T20:32:30.536Z] getKeys(org.eclipse.egit.github.core.tests.UserServiceTest)  Time elapsed: 0.001 s
15:32:30 [2021-02-05T20:32:30.536Z] getUser(org.eclipse.egit.github.core.tests.UserServiceTest)  Time elapsed: 0 s
15:32:30 [2021-02-05T20:32:30.536Z] editKeyNullKey(org.eclipse.egit.github.core.tests.UserServiceTest)  Time elapsed: 0 s
15:32:30 [2021-02-05T20:32:30.536Z] getCurrentUser(org.eclipse.egit.github.core.tests.UserServiceTest)  Time elapsed: 0 s
15:32:30 [2021-02-05T20:32:30.536Z] getEmails(org.eclipse.egit.github.core.tests.UserServiceTest)  Time elapsed: 0.001 s
15:32:30 [2021-02-05T20:32:30.536Z] getCurrentFollowers(org.eclipse.egit.github.core.tests.UserServiceTest)  Time elapsed: 0 s
15:32:30 [2021-02-05T20:32:30.536Z] getCurrentFollowing(org.eclipse.egit.github.core.tests.UserServiceTest)  Time elapsed: 0 s
15:32:30 [2021-02-05T20:32:30.536Z] createKey(org.eclipse.egit.github.core.tests.UserServiceTest)  Time elapsed: 0 s
15:32:30 [2021-02-05T20:32:30.536Z] getFollowersNullName(org.eclipse.egit.github.core.tests.UserServiceTest)  Time elapsed: 0 s
15:32:30 [2021-02-05T20:32:30.536Z] getFollowers(org.eclipse.egit.github.core.tests.UserServiceTest)  Time elapsed: 0.001 s
15:32:30 [2021-02-05T20:32:30.536Z] getFollowing(org.eclipse.egit.github.core.tests.UserServiceTest)  Time elapsed: 0 s
15:32:30 [2021-02-05T20:32:30.536Z] editUserNullUser(org.eclipse.egit.github.core.tests.UserServiceTest)  Time elapsed: 0 s
15:32:30 [2021-02-05T20:32:30.536Z] editUser(org.eclipse.egit.github.core.tests.UserServiceTest)  Time elapsed: 0 s
15:32:30 [2021-02-05T20:32:30.536Z] removeEmailEmptyEmails(org.eclipse.egit.github.core.tests.UserServiceTest)  Time elapsed: 0 s
15:32:30 [2021-02-05T20:32:30.536Z] isFollowing(org.eclipse.egit.github.core.tests.UserServiceTest)  Time elapsed: 0 s
15:32:30 [2021-02-05T20:32:30.536Z] getFollowersEmptyName(org.eclipse.egit.github.core.tests.UserServiceTest)  Time elapsed: 0 s
15:32:30 [2021-02-05T20:32:30.536Z] updateFields(org.eclipse.egit.github.core.tests.UserTest)  Time elapsed: 0 s
15:32:30 [2021-02-05T20:32:30.536Z] defaultState(org.eclipse.egit.github.core.tests.UserTest)  Time elapsed: 0 s
15:32:30 [2021-02-05T20:32:30.536Z] updateFields(org.eclipse.egit.github.core.tests.WatchPayloadTest)  Time elapsed: 0 s
15:32:30 [2021-02-05T20:32:30.536Z] defaultState(org.eclipse.egit.github.core.tests.WatchPayloadTest)  Time elapsed: 0 s
15:32:30 [2021-02-05T20:32:30.536Z] 
15:32:30 [2021-02-05T20:32:30.536Z] Results:
15:32:30 [2021-02-05T20:32:30.536Z] 
15:32:30 [2021-02-05T20:32:30.536Z] Tests run: 787, Failures: 0, Errors: 0, Skipped: 0
15:32:30 [2021-02-05T20:32:30.536Z] 
15:32:31 [2021-02-05T20:32:31.469Z] 20:32:31 [INFO] All tests passed!
15:32:31 [2021-02-05T20:32:31.469Z] 20:32:31 [INFO] 
15:32:31 [2021-02-05T20:32:31.469Z] 20:32:31 [INFO] >>> spotbugs-maven-plugin:3.1.11:check (default) > :spotbugs @ org.eclipse.egit.github.core.tests >>>
15:32:31 [2021-02-05T20:32:31.469Z] 20:32:31 [INFO] 
15:32:31 [2021-02-05T20:32:31.469Z] 20:32:31 [INFO] --- spotbugs-maven-plugin:3.1.11:spotbugs (spotbugs) @ org.eclipse.egit.github.core.tests ---
15:32:31 [2021-02-05T20:32:31.469Z] 20:32:31 [INFO] Fork Value is true
15:32:36 [2021-02-05T20:32:36.751Z]      [java] Warnings generated: 3
15:32:36 [2021-02-05T20:32:36.751Z] 20:32:36 [INFO] Done SpotBugs Analysis....
15:32:36 [2021-02-05T20:32:36.751Z] 20:32:36 [INFO] 
15:32:36 [2021-02-05T20:32:36.751Z] 20:32:36 [INFO] <<< spotbugs-maven-plugin:3.1.11:check (default) < :spotbugs @ org.eclipse.egit.github.core.tests <<<
15:32:36 [2021-02-05T20:32:36.751Z] 20:32:36 [INFO] 
15:32:36 [2021-02-05T20:32:36.751Z] 20:32:36 [INFO] 
15:32:36 [2021-02-05T20:32:36.751Z] 20:32:36 [INFO] --- spotbugs-maven-plugin:3.1.11:check (default) @ org.eclipse.egit.github.core.tests ---
15:32:36 [2021-02-05T20:32:36.752Z] 20:32:36 [INFO] BugInstance size is 3
15:32:36 [2021-02-05T20:32:36.752Z] 20:32:36 [INFO] Error size is 0
15:32:36 [2021-02-05T20:32:36.752Z] 20:32:36 [INFO] Total bugs: 3
15:32:36 [2021-02-05T20:32:36.752Z] 20:32:36 [ERROR] Found reliance on default encoding in org.eclipse.egit.github.core.tests.EncodingUtilsTest.encodeDecode(): new String(byte[]) [org.eclipse.egit.github.core.tests.EncodingUtilsTest] At EncodingUtilsTest.java:[line 40] DM_DEFAULT_ENCODING
15:32:36 [2021-02-05T20:32:36.752Z] 20:32:36 [ERROR] Found reliance on default encoding in org.eclipse.egit.github.core.tests.EncodingUtilsTest.encodeDecode(): String.getBytes() [org.eclipse.egit.github.core.tests.EncodingUtilsTest] At EncodingUtilsTest.java:[line 33] DM_DEFAULT_ENCODING
15:32:36 [2021-02-05T20:32:36.752Z] 20:32:36 [ERROR] Found reliance on default encoding in org.eclipse.egit.github.core.tests.live.CommitTest.readLine(InputStream, int): new java.util.Scanner(InputStream) [org.eclipse.egit.github.core.tests.live.CommitTest] At CommitTest.java:[line 176] DM_DEFAULT_ENCODING
15:32:36 [2021-02-05T20:32:36.752Z] 20:32:36 [INFO] 
15:32:36 [2021-02-05T20:32:36.752Z] 
15:32:36 [2021-02-05T20:32:36.752Z] 
15:32:36 [2021-02-05T20:32:36.752Z] To see bug detail using the Spotbugs GUI, use the following command "mvn spotbugs:gui"
15:32:36 [2021-02-05T20:32:36.752Z] 
15:32:36 [2021-02-05T20:32:36.752Z] 
15:32:36 [2021-02-05T20:32:36.752Z] 
15:32:36 [2021-02-05T20:32:36.752Z] 20:32:36 [INFO] 
15:32:36 [2021-02-05T20:32:36.752Z] 20:32:36 [INFO] >>> maven-pmd-plugin:3.11.0:cpd-check (default) > :cpd @ org.eclipse.egit.github.core.tests >>>
15:32:36 [2021-02-05T20:32:36.752Z] 20:32:36 [INFO] 
15:32:36 [2021-02-05T20:32:36.752Z] 20:32:36 [INFO] --- maven-pmd-plugin:3.11.0:cpd (cpd) @ org.eclipse.egit.github.core.tests ---
15:32:36 [2021-02-05T20:32:36.752Z] 20:32:36 [INFO] 
15:32:36 [2021-02-05T20:32:36.752Z] 20:32:36 [INFO] <<< maven-pmd-plugin:3.11.0:cpd-check (default) < :cpd @ org.eclipse.egit.github.core.tests <<<
15:32:36 [2021-02-05T20:32:36.752Z] 20:32:36 [INFO] 
15:32:36 [2021-02-05T20:32:36.752Z] 20:32:36 [INFO] 
15:32:36 [2021-02-05T20:32:36.752Z] 20:32:36 [INFO] --- maven-pmd-plugin:3.11.0:cpd-check (default) @ org.eclipse.egit.github.core.tests ---
15:32:36 [2021-02-05T20:32:36.752Z] 20:32:36 [INFO] You have 3 CPD duplications. For more details see: /home/jenkins/agent/workspace/egit-github/repo/org.eclipse.egit.github.core.tests/target/cpd.xml
15:32:36 [2021-02-05T20:32:36.752Z] 20:32:36 [INFO] 
15:32:36 [2021-02-05T20:32:36.752Z] 20:32:36 [INFO] --- tycho-pack200a-plugin:1.7.0:normalize (pack200-normalize) @ org.eclipse.egit.github.core.tests ---
15:32:36 [2021-02-05T20:32:36.752Z] 20:32:36 [INFO] Pack200 normalizing jar /home/jenkins/agent/workspace/egit-github/repo/org.eclipse.egit.github.core.tests/target/org.eclipse.egit.github.core.tests-5.11.0-SNAPSHOT.jar
15:32:36 [2021-02-05T20:32:36.752Z] 20:32:36 [INFO] 
15:32:36 [2021-02-05T20:32:36.752Z] 20:32:36 [INFO] --- eclipse-jarsigner-plugin:1.1.5:sign (sign) @ org.eclipse.egit.github.core.tests ---
15:32:36 [2021-02-05T20:32:36.752Z] 20:32:36 [INFO] Signing jar: /home/jenkins/agent/workspace/egit-github/repo/org.eclipse.egit.github.core.tests/target/org.eclipse.egit.github.core.tests-5.11.0-SNAPSHOT.jar
15:32:37 [2021-02-05T20:32:37.684Z] 20:32:37 [INFO] 
15:32:37 [2021-02-05T20:32:37.684Z] 20:32:37 [INFO] --- tycho-pack200b-plugin:1.7.0:pack (pack200-pack) @ org.eclipse.egit.github.core.tests ---
15:32:37 [2021-02-05T20:32:37.684Z] 20:32:37 [INFO] Pack200 packing jar /home/jenkins/agent/workspace/egit-github/repo/org.eclipse.egit.github.core.tests/target/org.eclipse.egit.github.core.tests-5.11.0-SNAPSHOT.jar
15:32:37 [2021-02-05T20:32:37.941Z] 20:32:37 [INFO] 
15:32:37 [2021-02-05T20:32:37.941Z] 20:32:37 [INFO] --- tycho-p2-plugin:1.7.0:p2-metadata (p2-metadata) @ org.eclipse.egit.github.core.tests ---
15:32:37 [2021-02-05T20:32:37.941Z] 20:32:37 [INFO] 
15:32:37 [2021-02-05T20:32:37.941Z] 20:32:37 [INFO] --- maven-install-plugin:2.3.1:install (default-install) @ org.eclipse.egit.github.core.tests ---
15:32:37 [2021-02-05T20:32:37.941Z] 20:32:37 [INFO] Installing /home/jenkins/agent/workspace/egit-github/repo/org.eclipse.egit.github.core.tests/target/org.eclipse.egit.github.core.tests-5.11.0-SNAPSHOT.jar to /home/jenkins/agent/workspace/egit-github/.repository/org/eclipse/mylyn/github/org.eclipse.egit.github.core.tests/5.11.0-SNAPSHOT/org.eclipse.egit.github.core.tests-5.11.0-SNAPSHOT.jar
15:32:37 [2021-02-05T20:32:37.941Z] 20:32:37 [INFO] Installing /home/jenkins/agent/workspace/egit-github/repo/org.eclipse.egit.github.core.tests/pom.xml to /home/jenkins/agent/workspace/egit-github/.repository/org/eclipse/mylyn/github/org.eclipse.egit.github.core.tests/5.11.0-SNAPSHOT/org.eclipse.egit.github.core.tests-5.11.0-SNAPSHOT.pom
15:32:37 [2021-02-05T20:32:37.942Z] 20:32:37 [INFO] Installing /home/jenkins/agent/workspace/egit-github/repo/org.eclipse.egit.github.core.tests/target/org.eclipse.egit.github.core.tests-5.11.0-SNAPSHOT.jar.pack.gz to /home/jenkins/agent/workspace/egit-github/.repository/org/eclipse/mylyn/github/org.eclipse.egit.github.core.tests/5.11.0-SNAPSHOT/org.eclipse.egit.github.core.tests-5.11.0-SNAPSHOT-pack200.jar.pack.gz
15:32:37 [2021-02-05T20:32:37.942Z] 20:32:37 [INFO] Installing /home/jenkins/agent/workspace/egit-github/repo/org.eclipse.egit.github.core.tests/target/p2content.xml to /home/jenkins/agent/workspace/egit-github/.repository/org/eclipse/mylyn/github/org.eclipse.egit.github.core.tests/5.11.0-SNAPSHOT/org.eclipse.egit.github.core.tests-5.11.0-SNAPSHOT-p2metadata.xml
15:32:37 [2021-02-05T20:32:37.942Z] 20:32:37 [INFO] Installing /home/jenkins/agent/workspace/egit-github/repo/org.eclipse.egit.github.core.tests/target/p2artifacts.xml to /home/jenkins/agent/workspace/egit-github/.repository/org/eclipse/mylyn/github/org.eclipse.egit.github.core.tests/5.11.0-SNAPSHOT/org.eclipse.egit.github.core.tests-5.11.0-SNAPSHOT-p2artifacts.xml
15:32:37 [2021-02-05T20:32:37.942Z] 20:32:37 [INFO] 
15:32:37 [2021-02-05T20:32:37.942Z] 20:32:37 [INFO] --- tycho-p2-plugin:1.7.0:update-local-index (default-update-local-index) @ org.eclipse.egit.github.core.tests ---
15:32:37 [2021-02-05T20:32:37.942Z] 20:32:37 [INFO] 
15:32:37 [2021-02-05T20:32:37.942Z] 20:32:37 [INFO] ------< org.eclipse.mylyn.github:org.eclipse.mylyn.github.tests >-------
15:32:37 [2021-02-05T20:32:37.942Z] 20:32:37 [INFO] Building Eclipse EGit Mylyn GitHub Test Plug-in 5.11.0-SNAPSHOT   [9/10]
15:32:37 [2021-02-05T20:32:37.942Z] 20:32:37 [INFO] ------------------------[ eclipse-test-plugin ]-------------------------
15:32:37 [2021-02-05T20:32:37.942Z] 20:32:37 [INFO] 
15:32:37 [2021-02-05T20:32:37.942Z] 20:32:37 [INFO] --- maven-clean-plugin:2.5:clean (default-clean) @ org.eclipse.mylyn.github.tests ---
15:32:37 [2021-02-05T20:32:37.942Z] 20:32:37 [INFO] 
15:32:37 [2021-02-05T20:32:37.942Z] 20:32:37 [INFO] --- tycho-packaging-plugin:1.7.0:build-qualifier (default-build-qualifier) @ org.eclipse.mylyn.github.tests ---
15:32:37 [2021-02-05T20:32:37.942Z] 20:32:37 [INFO] The project's OSGi version is 5.11.0.202102052030
15:32:37 [2021-02-05T20:32:37.942Z] 20:32:37 [INFO] 
15:32:37 [2021-02-05T20:32:37.942Z] 20:32:37 [INFO] --- tycho-packaging-plugin:1.7.0:validate-id (default-validate-id) @ org.eclipse.mylyn.github.tests ---
15:32:37 [2021-02-05T20:32:37.942Z] 20:32:37 [INFO] 
15:32:37 [2021-02-05T20:32:37.942Z] 20:32:37 [INFO] --- tycho-packaging-plugin:1.7.0:validate-version (default-validate-version) @ org.eclipse.mylyn.github.tests ---
15:32:37 [2021-02-05T20:32:37.942Z] 20:32:37 [INFO] 
15:32:37 [2021-02-05T20:32:37.942Z] 20:32:37 [INFO] --- maven-enforcer-plugin:3.0.0-M2:enforce (enforce-maven) @ org.eclipse.mylyn.github.tests ---
15:32:37 [2021-02-05T20:32:37.942Z] 20:32:37 [INFO] 
15:32:37 [2021-02-05T20:32:37.942Z] 20:32:37 [INFO] --- maven-resources-plugin:3.1.0:resources (default-resources) @ org.eclipse.mylyn.github.tests ---
15:32:37 [2021-02-05T20:32:37.942Z] 20:32:37 [INFO] Using 'UTF-8' encoding to copy filtered resources.
15:32:37 [2021-02-05T20:32:37.942Z] 20:32:37 [INFO] skip non existing resourceDirectory /home/jenkins/agent/workspace/egit-github/repo/org.eclipse.mylyn.github.tests/src/main/resources
15:32:37 [2021-02-05T20:32:37.942Z] 20:32:37 [INFO] 
15:32:37 [2021-02-05T20:32:37.942Z] 20:32:37 [INFO] --- tycho-compiler-plugin:1.7.0:compile (default-compile) @ org.eclipse.mylyn.github.tests ---
15:32:37 [2021-02-05T20:32:37.942Z] 20:32:37 [INFO] Compiling 1 source file to /home/jenkins/agent/workspace/egit-github/repo/org.eclipse.mylyn.github.tests/target/classes
15:32:37 [2021-02-05T20:32:37.942Z] 20:32:37 [INFO] 
15:32:37 [2021-02-05T20:32:37.942Z] 20:32:37 [INFO] --- maven-resources-plugin:3.1.0:testResources (default-testResources) @ org.eclipse.mylyn.github.tests ---
15:32:37 [2021-02-05T20:32:37.942Z] 20:32:37 [INFO] Using 'UTF-8' encoding to copy filtered resources.
15:32:37 [2021-02-05T20:32:37.942Z] 20:32:37 [INFO] skip non existing resourceDirectory /home/jenkins/agent/workspace/egit-github/repo/org.eclipse.mylyn.github.tests/src/test/resources
15:32:37 [2021-02-05T20:32:37.942Z] 20:32:37 [INFO] 
15:32:37 [2021-02-05T20:32:37.942Z] 20:32:37 [INFO] --- target-platform-configuration:1.7.0:target-platform (default-target-platform) @ org.eclipse.mylyn.github.tests ---
15:32:37 [2021-02-05T20:32:37.942Z] 20:32:37 [INFO] 
15:32:37 [2021-02-05T20:32:37.942Z] 20:32:37 [INFO] --- tycho-packaging-plugin:1.7.0:package-plugin (default-package-plugin) @ org.eclipse.mylyn.github.tests ---
15:32:37 [2021-02-05T20:32:37.942Z] 20:32:37 [INFO] Building jar: /home/jenkins/agent/workspace/egit-github/repo/org.eclipse.mylyn.github.tests/target/org.eclipse.mylyn.github.tests-5.11.0-SNAPSHOT.jar
15:32:37 [2021-02-05T20:32:37.942Z] 20:32:37 [INFO] 
15:32:37 [2021-02-05T20:32:37.942Z] 20:32:37 [INFO] --- tycho-p2-plugin:1.7.0:p2-metadata-default (default-p2-metadata-default) @ org.eclipse.mylyn.github.tests ---
15:32:37 [2021-02-05T20:32:37.942Z] 20:32:37 [INFO] 
15:32:37 [2021-02-05T20:32:37.942Z] 20:32:37 [INFO] --- tycho-surefire-plugin:1.7.0:test (default-test) @ org.eclipse.mylyn.github.tests ---
15:32:38 [2021-02-05T20:32:38.199Z] 20:32:38 [INFO] Executing Test Runtime with timeout 0, logs (if any) will be placed at: /home/jenkins/agent/workspace/egit-github/repo/org.eclipse.mylyn.github.tests/target/work/data/.metadata/.log
15:32:38 [2021-02-05T20:32:38.199Z] 20:32:38 [INFO] Command line:
15:32:38 [2021-02-05T20:32:38.199Z] 	[/opt/tools/java/adoptopenjdk/hotspot-jdk-8/1.8.0_252-b09/jre/bin/java, -Dosgi.noShutdown=false, -Dosgi.os=linux, -Dosgi.ws=gtk, -Dosgi.arch=x86_64, -Declipse.consoleLog=true, -Xmx1024m, -Dorg.eclipse.swtbot.search.timeout=30000, -Dorg.eclipse.swtbot.screenshots.dir=target/screenshots, -Dosgi.clean=true, -jar, /home/jenkins/agent/workspace/egit-github/.repository/p2/osgi/bundle/org.eclipse.equinox.launcher/1.4.0.v20161219-1356/org.eclipse.equinox.launcher-1.4.0.v20161219-1356.jar, -data, /home/jenkins/agent/workspace/egit-github/repo/org.eclipse.mylyn.github.tests/target/work/data, -install, /home/jenkins/agent/workspace/egit-github/repo/org.eclipse.mylyn.github.tests/target/work, -configuration, /home/jenkins/agent/workspace/egit-github/repo/org.eclipse.mylyn.github.tests/target/work/configuration, -application, org.eclipse.tycho.surefire.osgibooter.uitest, -testproperties, /home/jenkins/agent/workspace/egit-github/repo/org.eclipse.mylyn.github.tests/target/surefire.properties, -testApplication, org.eclipse.ui.ide.workbench, -nouithread]
15:32:40 [2021-02-05T20:32:40.095Z] !SESSION 2021-02-05 20:32:38.286 -----------------------------------------------
15:32:40 [2021-02-05T20:32:40.095Z] eclipse.buildId=unknown
15:32:40 [2021-02-05T20:32:40.095Z] java.version=1.8.0_252
15:32:40 [2021-02-05T20:32:40.095Z] java.vendor=AdoptOpenJDK
15:32:40 [2021-02-05T20:32:40.095Z] BootLoader constants: OS=linux, ARCH=x86_64, WS=gtk, NL=en_US
15:32:40 [2021-02-05T20:32:40.095Z] Framework arguments:  -application org.eclipse.tycho.surefire.osgibooter.uitest -testproperties /home/jenkins/agent/workspace/egit-github/repo/org.eclipse.mylyn.github.tests/target/surefire.properties -testApplication org.eclipse.ui.ide.workbench -nouithread
15:32:40 [2021-02-05T20:32:40.095Z] Command-line arguments:  -data /home/jenkins/agent/workspace/egit-github/repo/org.eclipse.mylyn.github.tests/target/work/data -application org.eclipse.tycho.surefire.osgibooter.uitest -testproperties /home/jenkins/agent/workspace/egit-github/repo/org.eclipse.mylyn.github.tests/target/surefire.properties -testApplication org.eclipse.ui.ide.workbench -nouithread
15:32:40 [2021-02-05T20:32:40.095Z] 
15:32:40 [2021-02-05T20:32:40.095Z] !ENTRY org.eclipse.jdt.launching.macosx 4 0 2021-02-05 20:32:39.767
15:32:40 [2021-02-05T20:32:40.095Z] !MESSAGE FrameworkEvent ERROR
15:32:40 [2021-02-05T20:32:40.095Z] !STACK 0
15:32:40 [2021-02-05T20:32:40.095Z] org.osgi.framework.BundleException: Could not resolve module: org.eclipse.jdt.launching.macosx [270]
15:32:40 [2021-02-05T20:32:40.095Z]   Unresolved requirement: Require-Capability: eclipse.platform; filter:="(osgi.os=macosx)"
15:32:40 [2021-02-05T20:32:40.095Z] 
15:32:40 [2021-02-05T20:32:40.095Z] 	at org.eclipse.osgi.container.Module.start(Module.java:444)
15:32:40 [2021-02-05T20:32:40.095Z] 	at org.eclipse.osgi.container.ModuleContainer$ContainerStartLevel.incStartLevel(ModuleContainer.java:1634)
15:32:40 [2021-02-05T20:32:40.095Z] 	at org.eclipse.osgi.container.ModuleContainer$ContainerStartLevel.incStartLevel(ModuleContainer.java:1613)
15:32:40 [2021-02-05T20:32:40.095Z] 	at org.eclipse.osgi.container.ModuleContainer$ContainerStartLevel.doContainerStartLevel(ModuleContainer.java:1585)
15:32:40 [2021-02-05T20:32:40.095Z] 	at org.eclipse.osgi.container.ModuleContainer$ContainerStartLevel.dispatchEvent(ModuleContainer.java:1528)
15:32:40 [2021-02-05T20:32:40.095Z] 	at org.eclipse.osgi.container.ModuleContainer$ContainerStartLevel.dispatchEvent(ModuleContainer.java:1)
15:32:40 [2021-02-05T20:32:40.095Z] 	at org.eclipse.osgi.framework.eventmgr.EventManager.dispatchEvent(EventManager.java:230)
15:32:40 [2021-02-05T20:32:40.095Z] 	at org.eclipse.osgi.framework.eventmgr.EventManager$EventThread.run(EventManager.java:340)
15:32:40 [2021-02-05T20:32:40.095Z] 
15:32:40 [2021-02-05T20:32:40.095Z] !ENTRY org.eclipse.jdt.launching.ui.macosx 4 0 2021-02-05 20:32:39.768
15:32:40 [2021-02-05T20:32:40.095Z] !MESSAGE FrameworkEvent ERROR
15:32:40 [2021-02-05T20:32:40.095Z] !STACK 0
15:32:40 [2021-02-05T20:32:40.095Z] org.osgi.framework.BundleException: Could not resolve module: org.eclipse.jdt.launching.ui.macosx [271]
15:32:40 [2021-02-05T20:32:40.095Z]   Unresolved requirement: Require-Capability: eclipse.platform; filter:="(osgi.os=macosx)"
15:32:40 [2021-02-05T20:32:40.095Z] 
15:32:40 [2021-02-05T20:32:40.095Z] 	at org.eclipse.osgi.container.Module.start(Module.java:444)
15:32:40 [2021-02-05T20:32:40.095Z] 	at org.eclipse.osgi.container.ModuleContainer$ContainerStartLevel.incStartLevel(ModuleContainer.java:1634)
15:32:40 [2021-02-05T20:32:40.095Z] 	at org.eclipse.osgi.container.ModuleContainer$ContainerStartLevel.incStartLevel(ModuleContainer.java:1613)
15:32:40 [2021-02-05T20:32:40.095Z] 	at org.eclipse.osgi.container.ModuleContainer$ContainerStartLevel.doContainerStartLevel(ModuleContainer.java:1585)
15:32:40 [2021-02-05T20:32:40.095Z] 	at org.eclipse.osgi.container.ModuleContainer$ContainerStartLevel.dispatchEvent(ModuleContainer.java:1528)
15:32:40 [2021-02-05T20:32:40.095Z] 	at org.eclipse.osgi.container.ModuleContainer$ContainerStartLevel.dispatchEvent(ModuleContainer.java:1)
15:32:40 [2021-02-05T20:32:40.095Z] 	at org.eclipse.osgi.framework.eventmgr.EventManager.dispatchEvent(EventManager.java:230)
15:32:40 [2021-02-05T20:32:40.095Z] 	at org.eclipse.osgi.framework.eventmgr.EventManager$EventThread.run(EventManager.java:340)
15:32:40 [2021-02-05T20:32:40.095Z] Launching application org.eclipse.ui.ide.workbench...
15:32:41 [2021-02-05T20:32:41.993Z] SLF4J: Failed to load class "org.slf4j.impl.StaticLoggerBinder".
15:32:41 [2021-02-05T20:32:41.993Z] SLF4J: Defaulting to no-operation (NOP) logger implementation
15:32:41 [2021-02-05T20:32:41.993Z] SLF4J: See http://www.slf4j.org/codes.html#StaticLoggerBinder for further details.
15:32:42 [2021-02-05T20:32:42.558Z] Running org.eclipse.mylyn.github.ui.internal.GitHubRepositoryConnectorUIHeadlessTest
15:32:42 [2021-02-05T20:32:42.816Z] Tests run: 1, Failures: 0, Errors: 0, Skipped: 0, Time elapsed: 0.056 s - in org.eclipse.mylyn.github.ui.internal.GitHubRepositoryConnectorUIHeadlessTest
15:32:42 [2021-02-05T20:32:42.816Z] testFindHyperlinksTaskRepositoryStringIntInt(org.eclipse.mylyn.github.ui.internal.GitHubRepositoryConnectorUIHeadlessTest)  Time elapsed: 0.004 s
15:32:42 [2021-02-05T20:32:42.816Z] 
15:32:42 [2021-02-05T20:32:42.816Z] Results:
15:32:42 [2021-02-05T20:32:42.816Z] 
15:32:42 [2021-02-05T20:32:42.816Z] Tests run: 1, Failures: 0, Errors: 0, Skipped: 0
15:32:42 [2021-02-05T20:32:42.816Z] 
15:32:43 [2021-02-05T20:32:43.748Z] 
15:32:43 [2021-02-05T20:32:43.748Z] (SWT:918): Gtk-WARNING **: 20:32:43.481: Negative content width -1 (allocation 1, extents 1x1) while allocating gadget (node trough, owner GtkProgressBar)
15:32:43 [2021-02-05T20:32:43.748Z] 
15:32:43 [2021-02-05T20:32:43.748Z] (SWT:918): Gtk-WARNING **: 20:32:43.481: Negative content width -1 (allocation 1, extents 1x1) while allocating gadget (node trough, owner GtkProgressBar)
15:32:44 [2021-02-05T20:32:44.005Z] 
15:32:44 [2021-02-05T20:32:44.005Z] !ENTRY org.eclipse.equinox.registry 4 1 2021-02-05 20:32:43.792
15:32:44 [2021-02-05T20:32:44.006Z] !MESSAGE Plug-in "org.eclipse.ui.ide" was unable to instantiate class "org.eclipse.ui.internal.ide.SymlinkDecorator".
15:32:44 [2021-02-05T20:32:44.006Z] !STACK 0
15:32:44 [2021-02-05T20:32:44.006Z] java.lang.ExceptionInInitializerError
15:32:44 [2021-02-05T20:32:44.006Z] 	at sun.reflect.NativeConstructorAccessorImpl.newInstance0(Native Method)
15:32:44 [2021-02-05T20:32:44.006Z] 	at sun.reflect.NativeConstructorAccessorImpl.newInstance(NativeConstructorAccessorImpl.java:62)
15:32:44 [2021-02-05T20:32:44.006Z] 	at sun.reflect.DelegatingConstructorAccessorImpl.newInstance(DelegatingConstructorAccessorImpl.java:45)
15:32:44 [2021-02-05T20:32:44.006Z] 	at java.lang.reflect.Constructor.newInstance(Constructor.java:423)
15:32:44 [2021-02-05T20:32:44.006Z] 	at java.lang.Class.newInstance(Class.java:442)
15:32:44 [2021-02-05T20:32:44.006Z] 	at org.eclipse.core.internal.registry.osgi.RegistryStrategyOSGI.createExecutableExtension(RegistryStrategyOSGI.java:184)
15:32:44 [2021-02-05T20:32:44.006Z] 	at org.eclipse.core.internal.registry.ExtensionRegistry.createExecutableExtension(ExtensionRegistry.java:905)
15:32:44 [2021-02-05T20:32:44.006Z] 	at org.eclipse.core.internal.registry.ConfigurationElement.createExecutableExtension(ConfigurationElement.java:243)
15:32:44 [2021-02-05T20:32:44.006Z] 	at org.eclipse.core.internal.registry.ConfigurationElementHandle.createExecutableExtension(ConfigurationElementHandle.java:55)
15:32:44 [2021-02-05T20:32:44.006Z] 	at org.eclipse.ui.internal.WorkbenchPlugin.createExtension(WorkbenchPlugin.java:281)
15:32:44 [2021-02-05T20:32:44.006Z] 	at org.eclipse.ui.internal.decorators.LightweightDecoratorDefinition$1.run(LightweightDecoratorDefinition.java:125)
15:32:44 [2021-02-05T20:32:44.006Z] 	at org.eclipse.core.runtime.SafeRunner.run(SafeRunner.java:42)
15:32:44 [2021-02-05T20:32:44.006Z] 	at org.eclipse.ui.internal.decorators.LightweightDecoratorDefinition.internalGetDecorator(LightweightDecoratorDefinition.java:120)
15:32:44 [2021-02-05T20:32:44.006Z] 	at org.eclipse.ui.internal.decorators.LightweightDecoratorDefinition.decorate(LightweightDecoratorDefinition.java:242)
15:32:44 [2021-02-05T20:32:44.006Z] 	at org.eclipse.ui.internal.decorators.LightweightDecoratorManager$LightweightRunnable.run(LightweightDecoratorManager.java:104)
15:32:44 [2021-02-05T20:32:44.006Z] 	at org.eclipse.core.runtime.SafeRunner.run(SafeRunner.java:42)
15:32:44 [2021-02-05T20:32:44.006Z] 	at org.eclipse.ui.internal.decorators.LightweightDecoratorManager.decorate(LightweightDecoratorManager.java:377)
15:32:44 [2021-02-05T20:32:44.006Z] 	at org.eclipse.ui.internal.decorators.LightweightDecoratorManager.getDecorations(LightweightDecoratorManager.java:359)
15:32:44 [2021-02-05T20:32:44.006Z] 	at org.eclipse.ui.internal.decorators.DecorationScheduler$1.ensureResultCached(DecorationScheduler.java:347)
15:32:44 [2021-02-05T20:32:44.006Z] 	at org.eclipse.ui.internal.decorators.DecorationScheduler$1.run(DecorationScheduler.java:311)
15:32:44 [2021-02-05T20:32:44.006Z] 	at org.eclipse.core.internal.jobs.Worker.run(Worker.java:56)
15:32:44 [2021-02-05T20:32:44.006Z] Caused by: java.lang.NullPointerException
15:32:44 [2021-02-05T20:32:44.006Z] 	at org.eclipse.ui.plugin.AbstractUIPlugin.imageDescriptorFromPlugin(AbstractUIPlugin.java:664)
15:32:44 [2021-02-05T20:32:44.006Z] 	at org.eclipse.ui.internal.ide.SymlinkDecorator.<clinit>(SymlinkDecorator.java:32)
15:32:44 [2021-02-05T20:32:44.006Z] 	... 21 more
15:32:44 [2021-02-05T20:32:44.006Z] 
15:32:44 [2021-02-05T20:32:44.006Z] !ENTRY org.eclipse.equinox.registry 4 1 2021-02-05 20:32:43.794
15:32:44 [2021-02-05T20:32:44.006Z] !MESSAGE Plug-in "org.eclipse.ui.ide" was unable to instantiate class "org.eclipse.ui.internal.ide.SymlinkDecorator".
15:32:44 [2021-02-05T20:32:44.006Z] !STACK 0
15:32:44 [2021-02-05T20:32:44.006Z] java.lang.ExceptionInInitializerError
15:32:44 [2021-02-05T20:32:44.006Z] 	at sun.reflect.NativeConstructorAccessorImpl.newInstance0(Native Method)
15:32:44 [2021-02-05T20:32:44.006Z] 	at sun.reflect.NativeConstructorAccessorImpl.newInstance(NativeConstructorAccessorImpl.java:62)
15:32:44 [2021-02-05T20:32:44.006Z] 	at sun.reflect.DelegatingConstructorAccessorImpl.newInstance(DelegatingConstructorAccessorImpl.java:45)
15:32:44 [2021-02-05T20:32:44.006Z] 	at java.lang.reflect.Constructor.newInstance(Constructor.java:423)
15:32:44 [2021-02-05T20:32:44.006Z] 	at java.lang.Class.newInstance(Class.java:442)
15:32:44 [2021-02-05T20:32:44.006Z] 	at org.eclipse.core.internal.registry.osgi.RegistryStrategyOSGI.createExecutableExtension(RegistryStrategyOSGI.java:184)
15:32:44 [2021-02-05T20:32:44.006Z] 	at org.eclipse.core.internal.registry.ExtensionRegistry.createExecutableExtension(ExtensionRegistry.java:905)
15:32:44 [2021-02-05T20:32:44.006Z] 	at org.eclipse.core.internal.registry.ConfigurationElement.createExecutableExtension(ConfigurationElement.java:243)
15:32:44 [2021-02-05T20:32:44.006Z] 	at org.eclipse.core.internal.registry.ConfigurationElementHandle.createExecutableExtension(ConfigurationElementHandle.java:55)
15:32:44 [2021-02-05T20:32:44.006Z] 	at org.eclipse.ui.internal.WorkbenchPlugin.createExtension(WorkbenchPlugin.java:281)
15:32:44 [2021-02-05T20:32:44.006Z] 	at org.eclipse.ui.internal.decorators.LightweightDecoratorDefinition$1.run(LightweightDecoratorDefinition.java:125)
15:32:44 [2021-02-05T20:32:44.006Z] 	at org.eclipse.core.runtime.SafeRunner.run(SafeRunner.java:42)
15:32:44 [2021-02-05T20:32:44.006Z] 	at org.eclipse.ui.internal.decorators.LightweightDecoratorDefinition.internalGetDecorator(LightweightDecoratorDefinition.java:120)
15:32:44 [2021-02-05T20:32:44.006Z] 	at org.eclipse.ui.internal.decorators.LightweightDecoratorDefinition.decorate(LightweightDecoratorDefinition.java:242)
15:32:44 [2021-02-05T20:32:44.006Z] 	at org.eclipse.ui.internal.decorators.LightweightDecoratorManager$LightweightRunnable.run(LightweightDecoratorManager.java:104)
15:32:44 [2021-02-05T20:32:44.006Z] 	at org.eclipse.core.runtime.SafeRunner.run(SafeRunner.java:42)
15:32:44 [2021-02-05T20:32:44.006Z] 	at org.eclipse.ui.internal.decorators.LightweightDecoratorManager.decorate(LightweightDecoratorManager.java:377)
15:32:44 [2021-02-05T20:32:44.006Z] 	at org.eclipse.ui.internal.decorators.LightweightDecoratorManager.getDecorations(LightweightDecoratorManager.java:359)
15:32:44 [2021-02-05T20:32:44.006Z] 	at org.eclipse.ui.internal.decorators.DecorationScheduler$1.ensureResultCached(DecorationScheduler.java:347)
15:32:44 [2021-02-05T20:32:44.006Z] 	at org.eclipse.ui.internal.decorators.DecorationScheduler$1.run(DecorationScheduler.java:311)
15:32:44 [2021-02-05T20:32:44.006Z] 	at org.eclipse.core.internal.jobs.Worker.run(Worker.java:56)
15:32:44 [2021-02-05T20:32:44.006Z] Caused by: java.lang.NullPointerException
15:32:44 [2021-02-05T20:32:44.006Z] 	at org.eclipse.ui.plugin.AbstractUIPlugin.imageDescriptorFromPlugin(AbstractUIPlugin.java:664)
15:32:44 [2021-02-05T20:32:44.006Z] 	at org.eclipse.ui.internal.ide.SymlinkDecorator.<clinit>(SymlinkDecorator.java:32)
15:32:44 [2021-02-05T20:32:44.006Z] 	... 21 more
15:32:44 [2021-02-05T20:32:44.006Z] 
15:32:44 [2021-02-05T20:32:44.006Z] !ENTRY org.eclipse.ui 4 0 2021-02-05 20:32:43.795
15:32:44 [2021-02-05T20:32:44.006Z] !MESSAGE Error occurred during status handling
15:32:44 [2021-02-05T20:32:44.006Z] !STACK 0
15:32:44 [2021-02-05T20:32:44.006Z] java.lang.NullPointerException
15:32:44 [2021-02-05T20:32:44.006Z] 	at org.eclipse.ui.internal.statushandlers.StatusHandlerRegistry.<init>(StatusHandlerRegistry.java:71)
15:32:44 [2021-02-05T20:32:44.006Z] 	at org.eclipse.ui.internal.statushandlers.StatusHandlerRegistry.getDefault(StatusHandlerRegistry.java:90)
15:32:44 [2021-02-05T20:32:44.007Z] 	at org.eclipse.ui.statushandlers.StatusManager.getStatusHandler(StatusManager.java:152)
15:32:44 [2021-02-05T20:32:44.007Z] 	at org.eclipse.ui.statushandlers.StatusManager.handle(StatusManager.java:211)
15:32:44 [2021-02-05T20:32:44.007Z] 	at org.eclipse.ui.statushandlers.StatusManager.handle(StatusManager.java:260)
15:32:44 [2021-02-05T20:32:44.007Z] 	at org.eclipse.ui.statushandlers.StatusManager$StatusManagerLogListener.logging(StatusManager.java:331)
15:32:44 [2021-02-05T20:32:44.007Z] 	at org.eclipse.core.internal.runtime.RuntimeLog.logToListeners(RuntimeLog.java:161)
15:32:44 [2021-02-05T20:32:44.007Z] 	at org.eclipse.core.internal.runtime.PlatformLogWriter.logged(PlatformLogWriter.java:103)
15:32:44 [2021-02-05T20:32:44.007Z] 	at org.eclipse.osgi.internal.log.ExtendedLogReaderServiceFactory.safeLogged(ExtendedLogReaderServiceFactory.java:88)
15:32:44 [2021-02-05T20:32:44.007Z] 	at org.eclipse.osgi.internal.log.ExtendedLogReaderServiceFactory.logPrivileged(ExtendedLogReaderServiceFactory.java:217)
15:32:44 [2021-02-05T20:32:44.007Z] 	at org.eclipse.osgi.internal.log.ExtendedLogReaderServiceFactory.log(ExtendedLogReaderServiceFactory.java:189)
15:32:44 [2021-02-05T20:32:44.007Z] 	at org.eclipse.osgi.internal.log.ExtendedLogServiceFactory.log(ExtendedLogServiceFactory.java:65)
15:32:44 [2021-02-05T20:32:44.007Z] 	at org.eclipse.osgi.internal.log.ExtendedLogServiceImpl.log(ExtendedLogServiceImpl.java:87)
15:32:44 [2021-02-05T20:32:44.007Z] 	at org.eclipse.osgi.internal.log.LoggerImpl.log(LoggerImpl.java:54)
15:32:44 [2021-02-05T20:32:44.007Z] 	at org.eclipse.core.internal.runtime.Log.log(Log.java:65)
15:32:44 [2021-02-05T20:32:44.007Z] 	at org.eclipse.ui.internal.WorkbenchPlugin.log(WorkbenchPlugin.java:663)
15:32:44 [2021-02-05T20:32:44.007Z] 	at org.eclipse.ui.internal.decorators.DecoratorDefinition.handleCoreException(DecoratorDefinition.java:266)
15:32:44 [2021-02-05T20:32:44.007Z] 	at org.eclipse.ui.internal.decorators.LightweightDecoratorDefinition.decorate(LightweightDecoratorDefinition.java:263)
15:32:44 [2021-02-05T20:32:44.007Z] 	at org.eclipse.ui.internal.decorators.LightweightDecoratorManager$LightweightRunnable.run(LightweightDecoratorManager.java:104)
15:32:44 [2021-02-05T20:32:44.007Z] 	at org.eclipse.core.runtime.SafeRunner.run(SafeRunner.java:42)
15:32:44 [2021-02-05T20:32:44.007Z] 	at org.eclipse.ui.internal.decorators.LightweightDecoratorManager.decorate(LightweightDecoratorManager.java:377)
15:32:44 [2021-02-05T20:32:44.007Z] 	at org.eclipse.ui.internal.decorators.LightweightDecoratorManager.getDecorations(LightweightDecoratorManager.java:359)
15:32:44 [2021-02-05T20:32:44.007Z] 	at org.eclipse.ui.internal.decorators.DecorationScheduler$1.ensureResultCached(DecorationScheduler.java:347)
15:32:44 [2021-02-05T20:32:44.007Z] 	at org.eclipse.ui.internal.decorators.DecorationScheduler$1.run(DecorationScheduler.java:311)
15:32:44 [2021-02-05T20:32:44.007Z] 	at org.eclipse.core.internal.jobs.Worker.run(Worker.java:56)
15:32:44 [2021-02-05T20:32:44.007Z] 
15:32:44 [2021-02-05T20:32:44.007Z] !ENTRY org.eclipse.equinox.registry 4 1 2021-02-05 20:32:43.795
15:32:44 [2021-02-05T20:32:44.007Z] !MESSAGE Plug-in "org.eclipse.ui.ide" was unable to instantiate class "org.eclipse.ui.internal.ide.LinkedResourceDecorator".
15:32:44 [2021-02-05T20:32:44.007Z] !STACK 0
15:32:44 [2021-02-05T20:32:44.007Z] java.lang.ExceptionInInitializerError
15:32:44 [2021-02-05T20:32:44.007Z] 	at sun.reflect.NativeConstructorAccessorImpl.newInstance0(Native Method)
15:32:44 [2021-02-05T20:32:44.007Z] 	at sun.reflect.NativeConstructorAccessorImpl.newInstance(NativeConstructorAccessorImpl.java:62)
15:32:44 [2021-02-05T20:32:44.007Z] 	at sun.reflect.DelegatingConstructorAccessorImpl.newInstance(DelegatingConstructorAccessorImpl.java:45)
15:32:44 [2021-02-05T20:32:44.007Z] 	at java.lang.reflect.Constructor.newInstance(Constructor.java:423)
15:32:44 [2021-02-05T20:32:44.007Z] 	at java.lang.Class.newInstance(Class.java:442)
15:32:44 [2021-02-05T20:32:44.007Z] 	at org.eclipse.core.internal.registry.osgi.RegistryStrategyOSGI.createExecutableExtension(RegistryStrategyOSGI.java:184)
15:32:44 [2021-02-05T20:32:44.007Z] 	at org.eclipse.core.internal.registry.ExtensionRegistry.createExecutableExtension(ExtensionRegistry.java:905)
15:32:44 [2021-02-05T20:32:44.007Z] 	at org.eclipse.core.internal.registry.ConfigurationElement.createExecutableExtension(ConfigurationElement.java:243)
15:32:44 [2021-02-05T20:32:44.007Z] 	at org.eclipse.core.internal.registry.ConfigurationElementHandle.createExecutableExtension(ConfigurationElementHandle.java:55)
15:32:44 [2021-02-05T20:32:44.007Z] 	at org.eclipse.ui.internal.WorkbenchPlugin.createExtension(WorkbenchPlugin.java:281)
15:32:44 [2021-02-05T20:32:44.007Z] 	at org.eclipse.ui.internal.decorators.LightweightDecoratorDefinition$1.run(LightweightDecoratorDefinition.java:125)
15:32:44 [2021-02-05T20:32:44.007Z] 	at org.eclipse.core.runtime.SafeRunner.run(SafeRunner.java:42)
15:32:44 [2021-02-05T20:32:44.007Z] 	at org.eclipse.ui.internal.decorators.LightweightDecoratorDefinition.internalGetDecorator(LightweightDecoratorDefinition.java:120)
15:32:44 [2021-02-05T20:32:44.007Z] 	at org.eclipse.ui.internal.decorators.LightweightDecoratorDefinition.decorate(LightweightDecoratorDefinition.java:242)
15:32:44 [2021-02-05T20:32:44.007Z] 	at org.eclipse.ui.internal.decorators.LightweightDecoratorManager$LightweightRunnable.run(LightweightDecoratorManager.java:104)
15:32:44 [2021-02-05T20:32:44.007Z] 	at org.eclipse.core.runtime.SafeRunner.run(SafeRunner.java:42)
15:32:44 [2021-02-05T20:32:44.007Z] 	at org.eclipse.ui.internal.decorators.LightweightDecoratorManager.decorate(LightweightDecoratorManager.java:377)
15:32:44 [2021-02-05T20:32:44.007Z] 	at org.eclipse.ui.internal.decorators.LightweightDecoratorManager.getDecorations(LightweightDecoratorManager.java:359)
15:32:44 [2021-02-05T20:32:44.007Z] 	at org.eclipse.ui.internal.decorators.DecorationScheduler$1.ensureResultCached(DecorationScheduler.java:347)
15:32:44 [2021-02-05T20:32:44.007Z] 	at org.eclipse.ui.internal.decorators.DecorationScheduler$1.run(DecorationScheduler.java:311)
15:32:44 [2021-02-05T20:32:44.007Z] 	at org.eclipse.core.internal.jobs.Worker.run(Worker.java:56)
15:32:44 [2021-02-05T20:32:44.007Z] Caused by: java.lang.NullPointerException
15:32:44 [2021-02-05T20:32:44.007Z] 	at org.eclipse.ui.plugin.AbstractUIPlugin.imageDescriptorFromPlugin(AbstractUIPlugin.java:664)
15:32:44 [2021-02-05T20:32:44.007Z] 	at org.eclipse.ui.internal.ide.LinkedResourceDecorator.<clinit>(LinkedResourceDecorator.java:37)
15:32:44 [2021-02-05T20:32:44.007Z] 	... 21 more
15:32:44 [2021-02-05T20:32:44.007Z] 
15:32:44 [2021-02-05T20:32:44.007Z] !ENTRY org.eclipse.equinox.registry 4 1 2021-02-05 20:32:43.796
15:32:44 [2021-02-05T20:32:44.007Z] !MESSAGE Plug-in "org.eclipse.ui.ide" was unable to instantiate class "org.eclipse.ui.internal.ide.LinkedResourceDecorator".
15:32:44 [2021-02-05T20:32:44.007Z] !STACK 0
15:32:44 [2021-02-05T20:32:44.007Z] java.lang.ExceptionInInitializerError
15:32:44 [2021-02-05T20:32:44.007Z] 	at sun.reflect.NativeConstructorAccessorImpl.newInstance0(Native Method)
15:32:44 [2021-02-05T20:32:44.007Z] 	at sun.reflect.NativeConstructorAccessorImpl.newInstance(NativeConstructorAccessorImpl.java:62)
15:32:44 [2021-02-05T20:32:44.007Z] 	at sun.reflect.DelegatingConstructorAccessorImpl.newInstance(DelegatingConstructorAccessorImpl.java:45)
15:32:44 [2021-02-05T20:32:44.007Z] 	at java.lang.reflect.Constructor.newInstance(Constructor.java:423)
15:32:44 [2021-02-05T20:32:44.008Z] 	at java.lang.Class.newInstance(Class.java:442)
15:32:44 [2021-02-05T20:32:44.008Z] 	at org.eclipse.core.internal.registry.osgi.RegistryStrategyOSGI.createExecutableExtension(RegistryStrategyOSGI.java:184)
15:32:44 [2021-02-05T20:32:44.008Z] 	at org.eclipse.core.internal.registry.ExtensionRegistry.createExecutableExtension(ExtensionRegistry.java:905)
15:32:44 [2021-02-05T20:32:44.008Z] 	at org.eclipse.core.internal.registry.ConfigurationElement.createExecutableExtension(ConfigurationElement.java:243)
15:32:44 [2021-02-05T20:32:44.008Z] 	at org.eclipse.core.internal.registry.ConfigurationElementHandle.createExecutableExtension(ConfigurationElementHandle.java:55)
15:32:44 [2021-02-05T20:32:44.008Z] 	at org.eclipse.ui.internal.WorkbenchPlugin.createExtension(WorkbenchPlugin.java:281)
15:32:44 [2021-02-05T20:32:44.008Z] 	at org.eclipse.ui.internal.decorators.LightweightDecoratorDefinition$1.run(LightweightDecoratorDefinition.java:125)
15:32:44 [2021-02-05T20:32:44.008Z] 	at org.eclipse.core.runtime.SafeRunner.run(SafeRunner.java:42)
15:32:44 [2021-02-05T20:32:44.008Z] 	at org.eclipse.ui.internal.decorators.LightweightDecoratorDefinition.internalGetDecorator(LightweightDecoratorDefinition.java:120)
15:32:44 [2021-02-05T20:32:44.008Z] 	at org.eclipse.ui.internal.decorators.LightweightDecoratorDefinition.decorate(LightweightDecoratorDefinition.java:242)
15:32:44 [2021-02-05T20:32:44.008Z] 	at org.eclipse.ui.internal.decorators.LightweightDecoratorManager$LightweightRunnable.run(LightweightDecoratorManager.java:104)
15:32:44 [2021-02-05T20:32:44.008Z] 	at org.eclipse.core.runtime.SafeRunner.run(SafeRunner.java:42)
15:32:44 [2021-02-05T20:32:44.008Z] 	at org.eclipse.ui.internal.decorators.LightweightDecoratorManager.decorate(LightweightDecoratorManager.java:377)
15:32:44 [2021-02-05T20:32:44.008Z] 	at org.eclipse.ui.internal.decorators.LightweightDecoratorManager.getDecorations(LightweightDecoratorManager.java:359)
15:32:44 [2021-02-05T20:32:44.008Z] 	at org.eclipse.ui.internal.decorators.DecorationScheduler$1.ensureResultCached(DecorationScheduler.java:347)
15:32:44 [2021-02-05T20:32:44.008Z] 	at org.eclipse.ui.internal.decorators.DecorationScheduler$1.run(DecorationScheduler.java:311)
15:32:44 [2021-02-05T20:32:44.008Z] 	at org.eclipse.core.internal.jobs.Worker.run(Worker.java:56)
15:32:44 [2021-02-05T20:32:44.008Z] Caused by: java.lang.NullPointerException
15:32:44 [2021-02-05T20:32:44.008Z] 	at org.eclipse.ui.plugin.AbstractUIPlugin.imageDescriptorFromPlugin(AbstractUIPlugin.java:664)
15:32:44 [2021-02-05T20:32:44.008Z] 	at org.eclipse.ui.internal.ide.LinkedResourceDecorator.<clinit>(LinkedResourceDecorator.java:37)
15:32:44 [2021-02-05T20:32:44.008Z] 	... 21 more
15:32:44 [2021-02-05T20:32:44.008Z] 
15:32:44 [2021-02-05T20:32:44.008Z] !ENTRY org.eclipse.ui 4 0 2021-02-05 20:32:43.796
15:32:44 [2021-02-05T20:32:44.008Z] !MESSAGE Error occurred during status handling
15:32:44 [2021-02-05T20:32:44.008Z] !STACK 0
15:32:44 [2021-02-05T20:32:44.008Z] java.lang.NullPointerException
15:32:44 [2021-02-05T20:32:44.008Z] 	at org.eclipse.ui.internal.statushandlers.StatusHandlerRegistry.<init>(StatusHandlerRegistry.java:71)
15:32:44 [2021-02-05T20:32:44.008Z] 	at org.eclipse.ui.internal.statushandlers.StatusHandlerRegistry.getDefault(StatusHandlerRegistry.java:90)
15:32:44 [2021-02-05T20:32:44.008Z] 	at org.eclipse.ui.statushandlers.StatusManager.getStatusHandler(StatusManager.java:152)
15:32:44 [2021-02-05T20:32:44.008Z] 	at org.eclipse.ui.statushandlers.StatusManager.handle(StatusManager.java:211)
15:32:44 [2021-02-05T20:32:44.008Z] 	at org.eclipse.ui.statushandlers.StatusManager.handle(StatusManager.java:260)
15:32:44 [2021-02-05T20:32:44.008Z] 	at org.eclipse.ui.statushandlers.StatusManager$StatusManagerLogListener.logging(StatusManager.java:331)
15:32:44 [2021-02-05T20:32:44.008Z] 	at org.eclipse.core.internal.runtime.RuntimeLog.logToListeners(RuntimeLog.java:161)
15:32:44 [2021-02-05T20:32:44.008Z] 	at org.eclipse.core.internal.runtime.PlatformLogWriter.logged(PlatformLogWriter.java:103)
15:32:44 [2021-02-05T20:32:44.008Z] 	at org.eclipse.osgi.internal.log.ExtendedLogReaderServiceFactory.safeLogged(ExtendedLogReaderServiceFactory.java:88)
15:32:44 [2021-02-05T20:32:44.008Z] 	at org.eclipse.osgi.internal.log.ExtendedLogReaderServiceFactory.logPrivileged(ExtendedLogReaderServiceFactory.java:217)
15:32:44 [2021-02-05T20:32:44.008Z] 	at org.eclipse.osgi.internal.log.ExtendedLogReaderServiceFactory.log(ExtendedLogReaderServiceFactory.java:189)
15:32:44 [2021-02-05T20:32:44.008Z] 	at org.eclipse.osgi.internal.log.ExtendedLogServiceFactory.log(ExtendedLogServiceFactory.java:65)
15:32:44 [2021-02-05T20:32:44.008Z] 	at org.eclipse.osgi.internal.log.ExtendedLogServiceImpl.log(ExtendedLogServiceImpl.java:87)
15:32:44 [2021-02-05T20:32:44.008Z] 	at org.eclipse.osgi.internal.log.LoggerImpl.log(LoggerImpl.java:54)
15:32:44 [2021-02-05T20:32:44.008Z] 	at org.eclipse.core.internal.runtime.Log.log(Log.java:65)
15:32:44 [2021-02-05T20:32:44.008Z] 	at org.eclipse.ui.internal.WorkbenchPlugin.log(WorkbenchPlugin.java:663)
15:32:44 [2021-02-05T20:32:44.008Z] 	at org.eclipse.ui.internal.decorators.DecoratorDefinition.handleCoreException(DecoratorDefinition.java:266)
15:32:44 [2021-02-05T20:32:44.008Z] 	at org.eclipse.ui.internal.decorators.LightweightDecoratorDefinition.decorate(LightweightDecoratorDefinition.java:263)
15:32:44 [2021-02-05T20:32:44.008Z] 	at org.eclipse.ui.internal.decorators.LightweightDecoratorManager$LightweightRunnable.run(LightweightDecoratorManager.java:104)
15:32:44 [2021-02-05T20:32:44.008Z] 	at org.eclipse.core.runtime.SafeRunner.run(SafeRunner.java:42)
15:32:44 [2021-02-05T20:32:44.008Z] 	at org.eclipse.ui.internal.decorators.LightweightDecoratorManager.decorate(LightweightDecoratorManager.java:377)
15:32:44 [2021-02-05T20:32:44.008Z] 	at org.eclipse.ui.internal.decorators.LightweightDecoratorManager.getDecorations(LightweightDecoratorManager.java:359)
15:32:44 [2021-02-05T20:32:44.008Z] 	at org.eclipse.ui.internal.decorators.DecorationScheduler$1.ensureResultCached(DecorationScheduler.java:347)
15:32:44 [2021-02-05T20:32:44.008Z] 	at org.eclipse.ui.internal.decorators.DecorationScheduler$1.run(DecorationScheduler.java:311)
15:32:44 [2021-02-05T20:32:44.008Z] 	at org.eclipse.core.internal.jobs.Worker.run(Worker.java:56)
15:32:44 [2021-02-05T20:32:44.008Z] 
15:32:44 [2021-02-05T20:32:44.008Z] !ENTRY org.eclipse.equinox.registry 4 1 2021-02-05 20:32:43.797
15:32:44 [2021-02-05T20:32:44.008Z] !MESSAGE Plug-in "org.eclipse.ui.ide" was unable to instantiate class "org.eclipse.ui.internal.ide.VirtualResourceDecorator".
15:32:44 [2021-02-05T20:32:44.008Z] !STACK 0
15:32:44 [2021-02-05T20:32:44.008Z] java.lang.ExceptionInInitializerError
15:32:44 [2021-02-05T20:32:44.008Z] 	at sun.reflect.NativeConstructorAccessorImpl.newInstance0(Native Method)
15:32:44 [2021-02-05T20:32:44.008Z] 	at sun.reflect.NativeConstructorAccessorImpl.newInstance(NativeConstructorAccessorImpl.java:62)
15:32:44 [2021-02-05T20:32:44.008Z] 	at sun.reflect.DelegatingConstructorAccessorImpl.newInstance(DelegatingConstructorAccessorImpl.java:45)
15:32:44 [2021-02-05T20:32:44.008Z] 	at java.lang.reflect.Constructor.newInstance(Constructor.java:423)
15:32:44 [2021-02-05T20:32:44.009Z] 	at java.lang.Class.newInstance(Class.java:442)
15:32:44 [2021-02-05T20:32:44.009Z] 	at org.eclipse.core.internal.registry.osgi.RegistryStrategyOSGI.createExecutableExtension(RegistryStrategyOSGI.java:184)
15:32:44 [2021-02-05T20:32:44.009Z] 	at org.eclipse.core.internal.registry.ExtensionRegistry.createExecutableExtension(ExtensionRegistry.java:905)
15:32:44 [2021-02-05T20:32:44.009Z] 	at org.eclipse.core.internal.registry.ConfigurationElement.createExecutableExtension(ConfigurationElement.java:243)
15:32:44 [2021-02-05T20:32:44.009Z] 	at org.eclipse.core.internal.registry.ConfigurationElementHandle.createExecutableExtension(ConfigurationElementHandle.java:55)
15:32:44 [2021-02-05T20:32:44.009Z] 	at org.eclipse.ui.internal.WorkbenchPlugin.createExtension(WorkbenchPlugin.java:281)
15:32:44 [2021-02-05T20:32:44.009Z] 	at org.eclipse.ui.internal.decorators.LightweightDecoratorDefinition$1.run(LightweightDecoratorDefinition.java:125)
15:32:44 [2021-02-05T20:32:44.009Z] 	at org.eclipse.core.runtime.SafeRunner.run(SafeRunner.java:42)
15:32:44 [2021-02-05T20:32:44.009Z] 	at org.eclipse.ui.internal.decorators.LightweightDecoratorDefinition.internalGetDecorator(LightweightDecoratorDefinition.java:120)
15:32:44 [2021-02-05T20:32:44.009Z] 	at org.eclipse.ui.internal.decorators.LightweightDecoratorDefinition.decorate(LightweightDecoratorDefinition.java:242)
15:32:44 [2021-02-05T20:32:44.009Z] 	at org.eclipse.ui.internal.decorators.LightweightDecoratorManager$LightweightRunnable.run(LightweightDecoratorManager.java:104)
15:32:44 [2021-02-05T20:32:44.009Z] 	at org.eclipse.core.runtime.SafeRunner.run(SafeRunner.java:42)
15:32:44 [2021-02-05T20:32:44.009Z] 	at org.eclipse.ui.internal.decorators.LightweightDecoratorManager.decorate(LightweightDecoratorManager.java:377)
15:32:44 [2021-02-05T20:32:44.009Z] 	at org.eclipse.ui.internal.decorators.LightweightDecoratorManager.getDecorations(LightweightDecoratorManager.java:359)
15:32:44 [2021-02-05T20:32:44.009Z] 	at org.eclipse.ui.internal.decorators.DecorationScheduler$1.ensureResultCached(DecorationScheduler.java:347)
15:32:44 [2021-02-05T20:32:44.009Z] 	at org.eclipse.ui.internal.decorators.DecorationScheduler$1.run(DecorationScheduler.java:311)
15:32:44 [2021-02-05T20:32:44.009Z] 	at org.eclipse.core.internal.jobs.Worker.run(Worker.java:56)
15:32:44 [2021-02-05T20:32:44.009Z] Caused by: java.lang.NullPointerException
15:32:44 [2021-02-05T20:32:44.009Z] 	at org.eclipse.ui.plugin.AbstractUIPlugin.imageDescriptorFromPlugin(AbstractUIPlugin.java:664)
15:32:44 [2021-02-05T20:32:44.009Z] 	at org.eclipse.ui.internal.ide.VirtualResourceDecorator.<clinit>(VirtualResourceDecorator.java:30)
15:32:44 [2021-02-05T20:32:44.009Z] 	... 21 more
15:32:44 [2021-02-05T20:32:44.009Z] 
15:32:44 [2021-02-05T20:32:44.009Z] !ENTRY org.eclipse.equinox.registry 4 1 2021-02-05 20:32:43.797
15:32:44 [2021-02-05T20:32:44.009Z] !MESSAGE Plug-in "org.eclipse.ui.ide" was unable to instantiate class "org.eclipse.ui.internal.ide.VirtualResourceDecorator".
15:32:44 [2021-02-05T20:32:44.009Z] !STACK 0
15:32:44 [2021-02-05T20:32:44.009Z] java.lang.ExceptionInInitializerError
15:32:44 [2021-02-05T20:32:44.009Z] 	at sun.reflect.NativeConstructorAccessorImpl.newInstance0(Native Method)
15:32:44 [2021-02-05T20:32:44.009Z] 	at sun.reflect.NativeConstructorAccessorImpl.newInstance(NativeConstructorAccessorImpl.java:62)
15:32:44 [2021-02-05T20:32:44.009Z] 	at sun.reflect.DelegatingConstructorAccessorImpl.newInstance(DelegatingConstructorAccessorImpl.java:45)
15:32:44 [2021-02-05T20:32:44.009Z] 	at java.lang.reflect.Constructor.newInstance(Constructor.java:423)
15:32:44 [2021-02-05T20:32:44.009Z] 	at java.lang.Class.newInstance(Class.java:442)
15:32:44 [2021-02-05T20:32:44.009Z] 	at org.eclipse.core.internal.registry.osgi.RegistryStrategyOSGI.createExecutableExtension(RegistryStrategyOSGI.java:184)
15:32:44 [2021-02-05T20:32:44.009Z] 	at org.eclipse.core.internal.registry.ExtensionRegistry.createExecutableExtension(ExtensionRegistry.java:905)
15:32:44 [2021-02-05T20:32:44.009Z] 	at org.eclipse.core.internal.registry.ConfigurationElement.createExecutableExtension(ConfigurationElement.java:243)
15:32:44 [2021-02-05T20:32:44.009Z] 	at org.eclipse.core.internal.registry.ConfigurationElementHandle.createExecutableExtension(ConfigurationElementHandle.java:55)
15:32:44 [2021-02-05T20:32:44.009Z] 	at org.eclipse.ui.internal.WorkbenchPlugin.createExtension(WorkbenchPlugin.java:281)
15:32:44 [2021-02-05T20:32:44.009Z] 	at org.eclipse.ui.internal.decorators.LightweightDecoratorDefinition$1.run(LightweightDecoratorDefinition.java:125)
15:32:44 [2021-02-05T20:32:44.009Z] 	at org.eclipse.core.runtime.SafeRunner.run(SafeRunner.java:42)
15:32:44 [2021-02-05T20:32:44.009Z] 	at org.eclipse.ui.internal.decorators.LightweightDecoratorDefinition.internalGetDecorator(LightweightDecoratorDefinition.java:120)
15:32:44 [2021-02-05T20:32:44.009Z] 	at org.eclipse.ui.internal.decorators.LightweightDecoratorDefinition.decorate(LightweightDecoratorDefinition.java:242)
15:32:44 [2021-02-05T20:32:44.009Z] 	at org.eclipse.ui.internal.decorators.LightweightDecoratorManager$LightweightRunnable.run(LightweightDecoratorManager.java:104)
15:32:44 [2021-02-05T20:32:44.009Z] 	at org.eclipse.core.runtime.SafeRunner.run(SafeRunner.java:42)
15:32:44 [2021-02-05T20:32:44.009Z] 	at org.eclipse.ui.internal.decorators.LightweightDecoratorManager.decorate(LightweightDecoratorManager.java:377)
15:32:44 [2021-02-05T20:32:44.009Z] 	at org.eclipse.ui.internal.decorators.LightweightDecoratorManager.getDecorations(LightweightDecoratorManager.java:359)
15:32:44 [2021-02-05T20:32:44.009Z] 	at org.eclipse.ui.internal.decorators.DecorationScheduler$1.ensureResultCached(DecorationScheduler.java:347)
15:32:44 [2021-02-05T20:32:44.009Z] 	at org.eclipse.ui.internal.decorators.DecorationScheduler$1.run(DecorationScheduler.java:311)
15:32:44 [2021-02-05T20:32:44.009Z] 	at org.eclipse.core.internal.jobs.Worker.run(Worker.java:56)
15:32:44 [2021-02-05T20:32:44.009Z] Caused by: java.lang.NullPointerException
15:32:44 [2021-02-05T20:32:44.009Z] 	at org.eclipse.ui.plugin.AbstractUIPlugin.imageDescriptorFromPlugin(AbstractUIPlugin.java:664)
15:32:44 [2021-02-05T20:32:44.009Z] 	at org.eclipse.ui.internal.ide.VirtualResourceDecorator.<clinit>(VirtualResourceDecorator.java:30)
15:32:44 [2021-02-05T20:32:44.009Z] 	... 21 more
15:32:44 [2021-02-05T20:32:44.009Z] 
15:32:44 [2021-02-05T20:32:44.009Z] !ENTRY org.eclipse.ui 4 0 2021-02-05 20:32:43.798
15:32:44 [2021-02-05T20:32:44.009Z] !MESSAGE Error occurred during status handling
15:32:44 [2021-02-05T20:32:44.009Z] !STACK 0
15:32:44 [2021-02-05T20:32:44.009Z] java.lang.NullPointerException
15:32:44 [2021-02-05T20:32:44.009Z] 	at org.eclipse.ui.internal.statushandlers.StatusHandlerRegistry.<init>(StatusHandlerRegistry.java:71)
15:32:44 [2021-02-05T20:32:44.009Z] 	at org.eclipse.ui.internal.statushandlers.StatusHandlerRegistry.getDefault(StatusHandlerRegistry.java:90)
15:32:44 [2021-02-05T20:32:44.009Z] 	at org.eclipse.ui.statushandlers.StatusManager.getStatusHandler(StatusManager.java:152)
15:32:44 [2021-02-05T20:32:44.009Z] 	at org.eclipse.ui.statushandlers.StatusManager.handle(StatusManager.java:211)
15:32:44 [2021-02-05T20:32:44.009Z] 	at org.eclipse.ui.statushandlers.StatusManager.handle(StatusManager.java:260)
15:32:44 [2021-02-05T20:32:44.009Z] 	at org.eclipse.ui.statushandlers.StatusManager$StatusManagerLogListener.logging(StatusManager.java:331)
15:32:44 [2021-02-05T20:32:44.009Z] 	at org.eclipse.core.internal.runtime.RuntimeLog.logToListeners(RuntimeLog.java:161)
15:32:44 [2021-02-05T20:32:44.009Z] 	at org.eclipse.core.internal.runtime.PlatformLogWriter.logged(PlatformLogWriter.java:103)
15:32:44 [2021-02-05T20:32:44.009Z] 	at org.eclipse.osgi.internal.log.ExtendedLogReaderServiceFactory.safeLogged(ExtendedLogReaderServiceFactory.java:88)
15:32:44 [2021-02-05T20:32:44.009Z] 	at org.eclipse.osgi.internal.log.ExtendedLogReaderServiceFactory.logPrivileged(ExtendedLogReaderServiceFactory.java:217)
15:32:44 [2021-02-05T20:32:44.010Z] 	at org.eclipse.osgi.internal.log.ExtendedLogReaderServiceFactory.log(ExtendedLogReaderServiceFactory.java:189)
15:32:44 [2021-02-05T20:32:44.010Z] 	at org.eclipse.osgi.internal.log.ExtendedLogServiceFactory.log(ExtendedLogServiceFactory.java:65)
15:32:44 [2021-02-05T20:32:44.010Z] 	at org.eclipse.osgi.internal.log.ExtendedLogServiceImpl.log(ExtendedLogServiceImpl.java:87)
15:32:44 [2021-02-05T20:32:44.010Z] 	at org.eclipse.osgi.internal.log.LoggerImpl.log(LoggerImpl.java:54)
15:32:44 [2021-02-05T20:32:44.010Z] 	at org.eclipse.core.internal.runtime.Log.log(Log.java:65)
15:32:44 [2021-02-05T20:32:44.010Z] 	at org.eclipse.ui.internal.WorkbenchPlugin.log(WorkbenchPlugin.java:663)
15:32:44 [2021-02-05T20:32:44.010Z] 	at org.eclipse.ui.internal.decorators.DecoratorDefinition.handleCoreException(DecoratorDefinition.java:266)
15:32:44 [2021-02-05T20:32:44.010Z] 	at org.eclipse.ui.internal.decorators.LightweightDecoratorDefinition.decorate(LightweightDecoratorDefinition.java:263)
15:32:44 [2021-02-05T20:32:44.010Z] 	at org.eclipse.ui.internal.decorators.LightweightDecoratorManager$LightweightRunnable.run(LightweightDecoratorManager.java:104)
15:32:44 [2021-02-05T20:32:44.010Z] 	at org.eclipse.core.runtime.SafeRunner.run(SafeRunner.java:42)
15:32:44 [2021-02-05T20:32:44.010Z] 	at org.eclipse.ui.internal.decorators.LightweightDecoratorManager.decorate(LightweightDecoratorManager.java:377)
15:32:44 [2021-02-05T20:32:44.010Z] 	at org.eclipse.ui.internal.decorators.LightweightDecoratorManager.getDecorations(LightweightDecoratorManager.java:359)
15:32:44 [2021-02-05T20:32:44.010Z] 	at org.eclipse.ui.internal.decorators.DecorationScheduler$1.ensureResultCached(DecorationScheduler.java:347)
15:32:44 [2021-02-05T20:32:44.010Z] 	at org.eclipse.ui.internal.decorators.DecorationScheduler$1.run(DecorationScheduler.java:311)
15:32:44 [2021-02-05T20:32:44.010Z] 	at org.eclipse.core.internal.jobs.Worker.run(Worker.java:56)
15:32:44 [2021-02-05T20:32:44.010Z] 
15:32:44 [2021-02-05T20:32:44.010Z] !ENTRY org.eclipse.ui.workbench 4 2 2021-02-05 20:32:43.799
15:32:44 [2021-02-05T20:32:44.010Z] !MESSAGE Problems occurred when invoking code from plug-in: "org.eclipse.ui.workbench".
15:32:44 [2021-02-05T20:32:44.010Z] !STACK 0
15:32:44 [2021-02-05T20:32:44.010Z] java.lang.IllegalArgumentException
15:32:44 [2021-02-05T20:32:44.010Z] 	at org.eclipse.core.runtime.ListenerList.add(ListenerList.java:115)
15:32:44 [2021-02-05T20:32:44.010Z] 	at org.eclipse.jdt.internal.ui.AbstractJavaElementLabelDecorator.addListener(AbstractJavaElementLabelDecorator.java:59)
15:32:44 [2021-02-05T20:32:44.010Z] 	at org.eclipse.ui.internal.decorators.LightweightDecoratorDefinition$1.run(LightweightDecoratorDefinition.java:127)
15:32:44 [2021-02-05T20:32:44.010Z] 	at org.eclipse.core.runtime.SafeRunner.run(SafeRunner.java:42)
15:32:44 [2021-02-05T20:32:44.010Z] 	at org.eclipse.ui.internal.decorators.LightweightDecoratorDefinition.internalGetDecorator(LightweightDecoratorDefinition.java:120)
15:32:44 [2021-02-05T20:32:44.010Z] 	at org.eclipse.ui.internal.decorators.LightweightDecoratorDefinition.decorate(LightweightDecoratorDefinition.java:242)
15:32:44 [2021-02-05T20:32:44.010Z] 	at org.eclipse.ui.internal.decorators.LightweightDecoratorManager$LightweightRunnable.run(LightweightDecoratorManager.java:104)
15:32:44 [2021-02-05T20:32:44.010Z] 	at org.eclipse.core.runtime.SafeRunner.run(SafeRunner.java:42)
15:32:44 [2021-02-05T20:32:44.010Z] 	at org.eclipse.ui.internal.decorators.LightweightDecoratorManager.decorate(LightweightDecoratorManager.java:377)
15:32:44 [2021-02-05T20:32:44.010Z] 	at org.eclipse.ui.internal.decorators.LightweightDecoratorManager.getDecorations(LightweightDecoratorManager.java:359)
15:32:44 [2021-02-05T20:32:44.010Z] 	at org.eclipse.ui.internal.decorators.DecorationScheduler$1.ensureResultCached(DecorationScheduler.java:347)
15:32:44 [2021-02-05T20:32:44.010Z] 	at org.eclipse.ui.internal.decorators.DecorationScheduler$1.run(DecorationScheduler.java:311)
15:32:44 [2021-02-05T20:32:44.010Z] 	at org.eclipse.core.internal.jobs.Worker.run(Worker.java:56)
15:32:44 [2021-02-05T20:32:44.010Z] 
15:32:44 [2021-02-05T20:32:44.010Z] !ENTRY org.eclipse.ui.workbench 4 2 2021-02-05 20:32:43.816
15:32:44 [2021-02-05T20:32:44.010Z] !MESSAGE Problems occurred when invoking code from plug-in: "org.eclipse.ui.workbench".
15:32:44 [2021-02-05T20:32:44.010Z] !STACK 0
15:32:44 [2021-02-05T20:32:44.010Z] java.lang.IllegalArgumentException
15:32:44 [2021-02-05T20:32:44.010Z] 	at org.eclipse.core.runtime.ListenerList.add(ListenerList.java:115)
15:32:44 [2021-02-05T20:32:44.010Z] 	at org.eclipse.jdt.internal.ui.AbstractJavaElementLabelDecorator.addListener(AbstractJavaElementLabelDecorator.java:59)
15:32:44 [2021-02-05T20:32:44.010Z] 	at org.eclipse.ui.internal.decorators.LightweightDecoratorDefinition$1.run(LightweightDecoratorDefinition.java:127)
15:32:44 [2021-02-05T20:32:44.010Z] 	at org.eclipse.core.runtime.SafeRunner.run(SafeRunner.java:42)
15:32:44 [2021-02-05T20:32:44.010Z] 	at org.eclipse.ui.internal.decorators.LightweightDecoratorDefinition.internalGetDecorator(LightweightDecoratorDefinition.java:120)
15:32:44 [2021-02-05T20:32:44.010Z] 	at org.eclipse.ui.internal.decorators.LightweightDecoratorDefinition.decorate(LightweightDecoratorDefinition.java:242)
15:32:44 [2021-02-05T20:32:44.010Z] 	at org.eclipse.ui.internal.decorators.LightweightDecoratorManager$LightweightRunnable.run(LightweightDecoratorManager.java:104)
15:32:44 [2021-02-05T20:32:44.010Z] 	at org.eclipse.core.runtime.SafeRunner.run(SafeRunner.java:42)
15:32:44 [2021-02-05T20:32:44.010Z] 	at org.eclipse.ui.internal.decorators.LightweightDecoratorManager.decorate(LightweightDecoratorManager.java:377)
15:32:44 [2021-02-05T20:32:44.010Z] 	at org.eclipse.ui.internal.decorators.LightweightDecoratorManager.getDecorations(LightweightDecoratorManager.java:359)
15:32:44 [2021-02-05T20:32:44.010Z] 	at org.eclipse.ui.internal.decorators.DecorationScheduler$1.ensureResultCached(DecorationScheduler.java:347)
15:32:44 [2021-02-05T20:32:44.010Z] 	at org.eclipse.ui.internal.decorators.DecorationScheduler$1.run(DecorationScheduler.java:311)
15:32:44 [2021-02-05T20:32:44.010Z] 	at org.eclipse.core.internal.jobs.Worker.run(Worker.java:56)
15:32:44 [2021-02-05T20:32:44.010Z] 
15:32:44 [2021-02-05T20:32:44.010Z] !ENTRY org.eclipse.ui 4 0 2021-02-05 20:32:43.817
15:32:44 [2021-02-05T20:32:44.010Z] !MESSAGE Error occurred during status handling
15:32:44 [2021-02-05T20:32:44.010Z] !STACK 0
15:32:44 [2021-02-05T20:32:44.010Z] java.lang.NullPointerException
15:32:44 [2021-02-05T20:32:44.010Z] 	at org.eclipse.ui.internal.statushandlers.StatusHandlerRegistry.<init>(StatusHandlerRegistry.java:71)
15:32:44 [2021-02-05T20:32:44.010Z] 	at org.eclipse.ui.internal.statushandlers.StatusHandlerRegistry.getDefault(StatusHandlerRegistry.java:90)
15:32:44 [2021-02-05T20:32:44.010Z] 	at org.eclipse.ui.statushandlers.StatusManager.getStatusHandler(StatusManager.java:152)
15:32:44 [2021-02-05T20:32:44.010Z] 	at org.eclipse.ui.statushandlers.StatusManager.handle(StatusManager.java:211)
15:32:44 [2021-02-05T20:32:44.010Z] 	at org.eclipse.ui.statushandlers.StatusManager.handle(StatusManager.java:260)
15:32:44 [2021-02-05T20:32:44.010Z] 	at org.eclipse.ui.statushandlers.StatusManager$StatusManagerLogListener.logging(StatusManager.java:331)
15:32:44 [2021-02-05T20:32:44.011Z] 	at org.eclipse.core.internal.runtime.RuntimeLog.logToListeners(RuntimeLog.java:161)
15:32:44 [2021-02-05T20:32:44.011Z] 	at org.eclipse.core.internal.runtime.PlatformLogWriter.logged(PlatformLogWriter.java:103)
15:32:44 [2021-02-05T20:32:44.011Z] 	at org.eclipse.osgi.internal.log.ExtendedLogReaderServiceFactory.safeLogged(ExtendedLogReaderServiceFactory.java:88)
15:32:44 [2021-02-05T20:32:44.011Z] 	at org.eclipse.osgi.internal.log.ExtendedLogReaderServiceFactory.logPrivileged(ExtendedLogReaderServiceFactory.java:217)
15:32:44 [2021-02-05T20:32:44.011Z] 	at org.eclipse.osgi.internal.log.ExtendedLogReaderServiceFactory.log(ExtendedLogReaderServiceFactory.java:189)
15:32:44 [2021-02-05T20:32:44.011Z] 	at org.eclipse.osgi.internal.log.ExtendedLogServiceFactory.log(ExtendedLogServiceFactory.java:65)
15:32:44 [2021-02-05T20:32:44.011Z] 	at org.eclipse.osgi.internal.log.ExtendedLogServiceImpl.log(ExtendedLogServiceImpl.java:87)
15:32:44 [2021-02-05T20:32:44.011Z] 	at org.eclipse.osgi.internal.log.LoggerImpl.log(LoggerImpl.java:54)
15:32:44 [2021-02-05T20:32:44.011Z] 	at org.eclipse.core.internal.runtime.PlatformLogWriter.logging(PlatformLogWriter.java:44)
15:32:44 [2021-02-05T20:32:44.011Z] 	at org.eclipse.core.internal.runtime.RuntimeLog.log(RuntimeLog.java:97)
15:32:44 [2021-02-05T20:32:44.011Z] 	at org.eclipse.core.runtime.SafeRunner.handleException(SafeRunner.java:71)
15:32:44 [2021-02-05T20:32:44.011Z] 	at org.eclipse.core.runtime.SafeRunner.run(SafeRunner.java:44)
15:32:44 [2021-02-05T20:32:44.011Z] 	at org.eclipse.ui.internal.decorators.LightweightDecoratorDefinition.internalGetDecorator(LightweightDecoratorDefinition.java:120)
15:32:44 [2021-02-05T20:32:44.011Z] 	at org.eclipse.ui.internal.decorators.LightweightDecoratorDefinition.decorate(LightweightDecoratorDefinition.java:242)
15:32:44 [2021-02-05T20:32:44.011Z] 	at org.eclipse.ui.internal.decorators.LightweightDecoratorManager$LightweightRunnable.run(LightweightDecoratorManager.java:104)
15:32:44 [2021-02-05T20:32:44.011Z] 	at org.eclipse.core.runtime.SafeRunner.run(SafeRunner.java:42)
15:32:44 [2021-02-05T20:32:44.011Z] 	at org.eclipse.ui.internal.decorators.LightweightDecoratorManager.decorate(LightweightDecoratorManager.java:377)
15:32:44 [2021-02-05T20:32:44.011Z] 	at org.eclipse.ui.internal.decorators.LightweightDecoratorManager.getDecorations(LightweightDecoratorManager.java:359)
15:32:44 [2021-02-05T20:32:44.011Z] 	at org.eclipse.ui.internal.decorators.DecorationScheduler$1.ensureResultCached(DecorationScheduler.java:347)
15:32:44 [2021-02-05T20:32:44.011Z] 	at org.eclipse.ui.internal.decorators.DecorationScheduler$1.run(DecorationScheduler.java:311)
15:32:44 [2021-02-05T20:32:44.011Z] 	at org.eclipse.core.internal.jobs.Worker.run(Worker.java:56)
15:32:44 [2021-02-05T20:32:44.578Z] 
15:32:44 [2021-02-05T20:32:44.578Z] !ENTRY org.eclipse.equinox.registry 4 1 2021-02-05 20:32:44.354
15:32:44 [2021-02-05T20:32:44.578Z] !MESSAGE Plug-in "org.eclipse.egit.ui" was unable to instantiate class "org.eclipse.egit.ui.internal.decorators.GitLightweightDecorator".
15:32:44 [2021-02-05T20:32:44.578Z] !STACK 0
15:32:44 [2021-02-05T20:32:44.578Z] org.eclipse.swt.SWTException: Device is disposed
15:32:44 [2021-02-05T20:32:44.578Z] 	at org.eclipse.swt.SWT.error(SWT.java:4533)
15:32:44 [2021-02-05T20:32:44.578Z] 	at org.eclipse.swt.SWT.error(SWT.java:4448)
15:32:44 [2021-02-05T20:32:44.578Z] 	at org.eclipse.swt.SWT.error(SWT.java:4419)
15:32:44 [2021-02-05T20:32:44.578Z] 	at org.eclipse.swt.widgets.Display.error(Display.java:1289)
15:32:44 [2021-02-05T20:32:44.578Z] 	at org.eclipse.swt.widgets.Display.syncExec(Display.java:5526)
15:32:44 [2021-02-05T20:32:44.578Z] 	at org.eclipse.egit.ui.internal.decorators.GitLightweightDecorator$ChangeTrackingColorsAndFonts.reload(GitLightweightDecorator.java:336)
15:32:44 [2021-02-05T20:32:44.578Z] 	at org.eclipse.egit.ui.internal.decorators.GitLightweightDecorator$ChangeTrackingColorsAndFonts.<init>(GitLightweightDecorator.java:331)
15:32:44 [2021-02-05T20:32:44.578Z] 	at org.eclipse.egit.ui.internal.decorators.GitLightweightDecorator.<init>(GitLightweightDecorator.java:125)
15:32:44 [2021-02-05T20:32:44.578Z] 	at sun.reflect.NativeConstructorAccessorImpl.newInstance0(Native Method)
15:32:44 [2021-02-05T20:32:44.578Z] 	at sun.reflect.NativeConstructorAccessorImpl.newInstance(NativeConstructorAccessorImpl.java:62)
15:32:44 [2021-02-05T20:32:44.578Z] 	at sun.reflect.DelegatingConstructorAccessorImpl.newInstance(DelegatingConstructorAccessorImpl.java:45)
15:32:44 [2021-02-05T20:32:44.578Z] 	at java.lang.reflect.Constructor.newInstance(Constructor.java:423)
15:32:44 [2021-02-05T20:32:44.578Z] 	at java.lang.Class.newInstance(Class.java:442)
15:32:44 [2021-02-05T20:32:44.578Z] 	at org.eclipse.core.internal.registry.osgi.RegistryStrategyOSGI.createExecutableExtension(RegistryStrategyOSGI.java:184)
15:32:44 [2021-02-05T20:32:44.578Z] 	at org.eclipse.core.internal.registry.ExtensionRegistry.createExecutableExtension(ExtensionRegistry.java:905)
15:32:44 [2021-02-05T20:32:44.578Z] 	at org.eclipse.core.internal.registry.ConfigurationElement.createExecutableExtension(ConfigurationElement.java:243)
15:32:44 [2021-02-05T20:32:44.578Z] 	at org.eclipse.core.internal.registry.ConfigurationElementHandle.createExecutableExtension(ConfigurationElementHandle.java:55)
15:32:44 [2021-02-05T20:32:44.578Z] 	at org.eclipse.ui.internal.WorkbenchPlugin.createExtension(WorkbenchPlugin.java:281)
15:32:44 [2021-02-05T20:32:44.578Z] 	at org.eclipse.ui.internal.decorators.LightweightDecoratorDefinition$1.run(LightweightDecoratorDefinition.java:125)
15:32:44 [2021-02-05T20:32:44.578Z] 	at org.eclipse.core.runtime.SafeRunner.run(SafeRunner.java:42)
15:32:44 [2021-02-05T20:32:44.578Z] 	at org.eclipse.ui.internal.decorators.LightweightDecoratorDefinition.internalGetDecorator(LightweightDecoratorDefinition.java:120)
15:32:44 [2021-02-05T20:32:44.578Z] 	at org.eclipse.ui.internal.decorators.LightweightDecoratorDefinition.decorate(LightweightDecoratorDefinition.java:242)
15:32:44 [2021-02-05T20:32:44.578Z] 	at org.eclipse.ui.internal.decorators.LightweightDecoratorManager$LightweightRunnable.run(LightweightDecoratorManager.java:104)
15:32:44 [2021-02-05T20:32:44.578Z] 	at org.eclipse.core.runtime.SafeRunner.run(SafeRunner.java:42)
15:32:44 [2021-02-05T20:32:44.578Z] 	at org.eclipse.ui.internal.decorators.LightweightDecoratorManager.decorate(LightweightDecoratorManager.java:377)
15:32:44 [2021-02-05T20:32:44.578Z] 	at org.eclipse.ui.internal.decorators.LightweightDecoratorManager.getDecorations(LightweightDecoratorManager.java:359)
15:32:44 [2021-02-05T20:32:44.578Z] 	at org.eclipse.ui.internal.decorators.DecorationScheduler$1.ensureResultCached(DecorationScheduler.java:347)
15:32:44 [2021-02-05T20:32:44.578Z] 	at org.eclipse.ui.internal.decorators.DecorationScheduler$1.run(DecorationScheduler.java:311)
15:32:44 [2021-02-05T20:32:44.578Z] 	at org.eclipse.core.internal.jobs.Worker.run(Worker.java:56)
15:32:44 [2021-02-05T20:32:44.578Z] 
15:32:44 [2021-02-05T20:32:44.578Z] !ENTRY org.eclipse.equinox.registry 4 1 2021-02-05 20:32:44.355
15:32:44 [2021-02-05T20:32:44.578Z] !MESSAGE Plug-in "org.eclipse.egit.ui" was unable to instantiate class "org.eclipse.egit.ui.internal.decorators.GitLightweightDecorator".
15:32:44 [2021-02-05T20:32:44.578Z] !STACK 0
15:32:44 [2021-02-05T20:32:44.578Z] org.eclipse.swt.SWTException: Device is disposed
15:32:44 [2021-02-05T20:32:44.578Z] 	at org.eclipse.swt.SWT.error(SWT.java:4533)
15:32:44 [2021-02-05T20:32:44.578Z] 	at org.eclipse.swt.SWT.error(SWT.java:4448)
15:32:44 [2021-02-05T20:32:44.578Z] 	at org.eclipse.swt.SWT.error(SWT.java:4419)
15:32:44 [2021-02-05T20:32:44.578Z] 	at org.eclipse.swt.widgets.Display.error(Display.java:1289)
15:32:44 [2021-02-05T20:32:44.578Z] 	at org.eclipse.swt.widgets.Display.syncExec(Display.java:5526)
15:32:44 [2021-02-05T20:32:44.578Z] 	at org.eclipse.egit.ui.internal.decorators.GitLightweightDecorator$ChangeTrackingColorsAndFonts.reload(GitLightweightDecorator.java:336)
15:32:44 [2021-02-05T20:32:44.578Z] 	at org.eclipse.egit.ui.internal.decorators.GitLightweightDecorator$ChangeTrackingColorsAndFonts.<init>(GitLightweightDecorator.java:331)
15:32:44 [2021-02-05T20:32:44.578Z] 	at org.eclipse.egit.ui.internal.decorators.GitLightweightDecorator.<init>(GitLightweightDecorator.java:125)
15:32:44 [2021-02-05T20:32:44.579Z] 	at sun.reflect.NativeConstructorAccessorImpl.newInstance0(Native Method)
15:32:44 [2021-02-05T20:32:44.579Z] 	at sun.reflect.NativeConstructorAccessorImpl.newInstance(NativeConstructorAccessorImpl.java:62)
15:32:44 [2021-02-05T20:32:44.579Z] 	at sun.reflect.DelegatingConstructorAccessorImpl.newInstance(DelegatingConstructorAccessorImpl.java:45)
15:32:44 [2021-02-05T20:32:44.579Z] 	at java.lang.reflect.Constructor.newInstance(Constructor.java:423)
15:32:44 [2021-02-05T20:32:44.579Z] 	at java.lang.Class.newInstance(Class.java:442)
15:32:44 [2021-02-05T20:32:44.579Z] 	at org.eclipse.core.internal.registry.osgi.RegistryStrategyOSGI.createExecutableExtension(RegistryStrategyOSGI.java:184)
15:32:44 [2021-02-05T20:32:44.579Z] 	at org.eclipse.core.internal.registry.ExtensionRegistry.createExecutableExtension(ExtensionRegistry.java:905)
15:32:44 [2021-02-05T20:32:44.579Z] 	at org.eclipse.core.internal.registry.ConfigurationElement.createExecutableExtension(ConfigurationElement.java:243)
15:32:44 [2021-02-05T20:32:44.579Z] 	at org.eclipse.core.internal.registry.ConfigurationElementHandle.createExecutableExtension(ConfigurationElementHandle.java:55)
15:32:44 [2021-02-05T20:32:44.579Z] 	at org.eclipse.ui.internal.WorkbenchPlugin.createExtension(WorkbenchPlugin.java:281)
15:32:44 [2021-02-05T20:32:44.579Z] 	at org.eclipse.ui.internal.decorators.LightweightDecoratorDefinition$1.run(LightweightDecoratorDefinition.java:125)
15:32:44 [2021-02-05T20:32:44.579Z] 	at org.eclipse.core.runtime.SafeRunner.run(SafeRunner.java:42)
15:32:44 [2021-02-05T20:32:44.579Z] 	at org.eclipse.ui.internal.decorators.LightweightDecoratorDefinition.internalGetDecorator(LightweightDecoratorDefinition.java:120)
15:32:44 [2021-02-05T20:32:44.579Z] 	at org.eclipse.ui.internal.decorators.LightweightDecoratorDefinition.decorate(LightweightDecoratorDefinition.java:242)
15:32:44 [2021-02-05T20:32:44.579Z] 	at org.eclipse.ui.internal.decorators.LightweightDecoratorManager$LightweightRunnable.run(LightweightDecoratorManager.java:104)
15:32:44 [2021-02-05T20:32:44.579Z] 	at org.eclipse.core.runtime.SafeRunner.run(SafeRunner.java:42)
15:32:44 [2021-02-05T20:32:44.579Z] 	at org.eclipse.ui.internal.decorators.LightweightDecoratorManager.decorate(LightweightDecoratorManager.java:377)
15:32:44 [2021-02-05T20:32:44.579Z] 	at org.eclipse.ui.internal.decorators.LightweightDecoratorManager.getDecorations(LightweightDecoratorManager.java:359)
15:32:44 [2021-02-05T20:32:44.579Z] 	at org.eclipse.ui.internal.decorators.DecorationScheduler$1.ensureResultCached(DecorationScheduler.java:347)
15:32:44 [2021-02-05T20:32:44.579Z] 	at org.eclipse.ui.internal.decorators.DecorationScheduler$1.run(DecorationScheduler.java:311)
15:32:44 [2021-02-05T20:32:44.579Z] 	at org.eclipse.core.internal.jobs.Worker.run(Worker.java:56)
15:32:44 [2021-02-05T20:32:44.579Z] 
15:32:44 [2021-02-05T20:32:44.579Z] !ENTRY org.eclipse.ui 4 0 2021-02-05 20:32:44.355
15:32:44 [2021-02-05T20:32:44.579Z] !MESSAGE Error occurred during status handling
15:32:44 [2021-02-05T20:32:44.579Z] !STACK 0
15:32:44 [2021-02-05T20:32:44.579Z] java.lang.NullPointerException
15:32:44 [2021-02-05T20:32:44.579Z] 	at org.eclipse.ui.internal.statushandlers.StatusHandlerRegistry.<init>(StatusHandlerRegistry.java:71)
15:32:44 [2021-02-05T20:32:44.579Z] 	at org.eclipse.ui.internal.statushandlers.StatusHandlerRegistry.getDefault(StatusHandlerRegistry.java:90)
15:32:44 [2021-02-05T20:32:44.579Z] 	at org.eclipse.ui.statushandlers.StatusManager.getStatusHandler(StatusManager.java:152)
15:32:44 [2021-02-05T20:32:44.579Z] 	at org.eclipse.ui.statushandlers.StatusManager.handle(StatusManager.java:211)
15:32:44 [2021-02-05T20:32:44.579Z] 	at org.eclipse.ui.statushandlers.StatusManager.handle(StatusManager.java:260)
15:32:44 [2021-02-05T20:32:44.579Z] 	at org.eclipse.ui.statushandlers.StatusManager$StatusManagerLogListener.logging(StatusManager.java:331)
15:32:44 [2021-02-05T20:32:44.579Z] 	at org.eclipse.core.internal.runtime.RuntimeLog.logToListeners(RuntimeLog.java:161)
15:32:44 [2021-02-05T20:32:44.579Z] 	at org.eclipse.core.internal.runtime.PlatformLogWriter.logged(PlatformLogWriter.java:103)
15:32:44 [2021-02-05T20:32:44.579Z] 	at org.eclipse.osgi.internal.log.ExtendedLogReaderServiceFactory.safeLogged(ExtendedLogReaderServiceFactory.java:88)
15:32:44 [2021-02-05T20:32:44.579Z] 	at org.eclipse.osgi.internal.log.ExtendedLogReaderServiceFactory.logPrivileged(ExtendedLogReaderServiceFactory.java:217)
15:32:44 [2021-02-05T20:32:44.579Z] 	at org.eclipse.osgi.internal.log.ExtendedLogReaderServiceFactory.log(ExtendedLogReaderServiceFactory.java:189)
15:32:44 [2021-02-05T20:32:44.579Z] 	at org.eclipse.osgi.internal.log.ExtendedLogServiceFactory.log(ExtendedLogServiceFactory.java:65)
15:32:44 [2021-02-05T20:32:44.579Z] 	at org.eclipse.osgi.internal.log.ExtendedLogServiceImpl.log(ExtendedLogServiceImpl.java:87)
15:32:44 [2021-02-05T20:32:44.579Z] 	at org.eclipse.osgi.internal.log.LoggerImpl.log(LoggerImpl.java:54)
15:32:44 [2021-02-05T20:32:44.579Z] 	at org.eclipse.core.internal.runtime.Log.log(Log.java:65)
15:32:44 [2021-02-05T20:32:44.579Z] 	at org.eclipse.ui.internal.WorkbenchPlugin.log(WorkbenchPlugin.java:663)
15:32:44 [2021-02-05T20:32:44.579Z] 	at org.eclipse.ui.internal.decorators.DecoratorDefinition.handleCoreException(DecoratorDefinition.java:266)
15:32:44 [2021-02-05T20:32:44.579Z] 	at org.eclipse.ui.internal.decorators.LightweightDecoratorDefinition.decorate(LightweightDecoratorDefinition.java:263)
15:32:44 [2021-02-05T20:32:44.579Z] 	at org.eclipse.ui.internal.decorators.LightweightDecoratorManager$LightweightRunnable.run(LightweightDecoratorManager.java:104)
15:32:44 [2021-02-05T20:32:44.579Z] 	at org.eclipse.core.runtime.SafeRunner.run(SafeRunner.java:42)
15:32:44 [2021-02-05T20:32:44.579Z] 	at org.eclipse.ui.internal.decorators.LightweightDecoratorManager.decorate(LightweightDecoratorManager.java:377)
15:32:44 [2021-02-05T20:32:44.579Z] 	at org.eclipse.ui.internal.decorators.LightweightDecoratorManager.getDecorations(LightweightDecoratorManager.java:359)
15:32:44 [2021-02-05T20:32:44.579Z] 	at org.eclipse.ui.internal.decorators.DecorationScheduler$1.ensureResultCached(DecorationScheduler.java:347)
15:32:44 [2021-02-05T20:32:44.579Z] 	at org.eclipse.ui.internal.decorators.DecorationScheduler$1.run(DecorationScheduler.java:311)
15:32:44 [2021-02-05T20:32:44.579Z] 	at org.eclipse.core.internal.jobs.Worker.run(Worker.java:56)
15:32:45 [2021-02-05T20:32:45.950Z] 20:32:45 [INFO] All tests passed!
15:32:45 [2021-02-05T20:32:45.950Z] 20:32:45 [INFO] 
15:32:45 [2021-02-05T20:32:45.950Z] 20:32:45 [INFO] >>> spotbugs-maven-plugin:3.1.11:check (default) > :spotbugs @ org.eclipse.mylyn.github.tests >>>
15:32:45 [2021-02-05T20:32:45.950Z] 20:32:45 [INFO] 
15:32:45 [2021-02-05T20:32:45.950Z] 20:32:45 [INFO] --- spotbugs-maven-plugin:3.1.11:spotbugs (spotbugs) @ org.eclipse.mylyn.github.tests ---
15:32:45 [2021-02-05T20:32:45.950Z] 20:32:45 [INFO] Fork Value is true
15:32:47 [2021-02-05T20:32:47.910Z] 20:32:47 [INFO] Done SpotBugs Analysis....
15:32:47 [2021-02-05T20:32:47.910Z] 20:32:47 [INFO] 
15:32:47 [2021-02-05T20:32:47.910Z] 20:32:47 [INFO] <<< spotbugs-maven-plugin:3.1.11:check (default) < :spotbugs @ org.eclipse.mylyn.github.tests <<<
15:32:47 [2021-02-05T20:32:47.910Z] 20:32:47 [INFO] 
15:32:47 [2021-02-05T20:32:47.910Z] 20:32:47 [INFO] 
15:32:47 [2021-02-05T20:32:47.910Z] 20:32:47 [INFO] --- spotbugs-maven-plugin:3.1.11:check (default) @ org.eclipse.mylyn.github.tests ---
15:32:47 [2021-02-05T20:32:47.910Z] 20:32:47 [INFO] BugInstance size is 0
15:32:47 [2021-02-05T20:32:47.910Z] 20:32:47 [INFO] Error size is 0
15:32:47 [2021-02-05T20:32:47.910Z] 20:32:47 [INFO] No errors/warnings found
15:32:47 [2021-02-05T20:32:47.910Z] 20:32:47 [INFO] 
15:32:47 [2021-02-05T20:32:47.910Z] 20:32:47 [INFO] >>> maven-pmd-plugin:3.11.0:cpd-check (default) > :cpd @ org.eclipse.mylyn.github.tests >>>
15:32:47 [2021-02-05T20:32:47.910Z] 20:32:47 [INFO] 
15:32:47 [2021-02-05T20:32:47.910Z] 20:32:47 [INFO] --- maven-pmd-plugin:3.11.0:cpd (cpd) @ org.eclipse.mylyn.github.tests ---
15:32:47 [2021-02-05T20:32:47.910Z] 20:32:47 [INFO] 
15:32:47 [2021-02-05T20:32:47.910Z] 20:32:47 [INFO] <<< maven-pmd-plugin:3.11.0:cpd-check (default) < :cpd @ org.eclipse.mylyn.github.tests <<<
15:32:47 [2021-02-05T20:32:47.910Z] 20:32:47 [INFO] 
15:32:47 [2021-02-05T20:32:47.910Z] 20:32:47 [INFO] 
15:32:47 [2021-02-05T20:32:47.910Z] 20:32:47 [INFO] --- maven-pmd-plugin:3.11.0:cpd-check (default) @ org.eclipse.mylyn.github.tests ---
15:32:47 [2021-02-05T20:32:47.910Z] 20:32:47 [INFO] 
15:32:47 [2021-02-05T20:32:47.910Z] 20:32:47 [INFO] 
15:32:47 [2021-02-05T20:32:47.910Z] 20:32:47 [INFO] --- tycho-pack200a-plugin:1.7.0:normalize (pack200-normalize) @ org.eclipse.mylyn.github.tests ---
15:32:47 [2021-02-05T20:32:47.910Z] 20:32:47 [INFO] Pack200 normalizing jar /home/jenkins/agent/workspace/egit-github/repo/org.eclipse.mylyn.github.tests/target/org.eclipse.mylyn.github.tests-5.11.0-SNAPSHOT.jar
15:32:47 [2021-02-05T20:32:47.910Z] 20:32:47 [INFO] 
15:32:47 [2021-02-05T20:32:47.910Z] 20:32:47 [INFO] --- eclipse-jarsigner-plugin:1.1.5:sign (sign) @ org.eclipse.mylyn.github.tests ---
15:32:47 [2021-02-05T20:32:47.910Z] 20:32:47 [INFO] Signing jar: /home/jenkins/agent/workspace/egit-github/repo/org.eclipse.mylyn.github.tests/target/org.eclipse.mylyn.github.tests-5.11.0-SNAPSHOT.jar
15:32:48 [2021-02-05T20:32:48.841Z] 20:32:48 [INFO] 
15:32:48 [2021-02-05T20:32:48.841Z] 20:32:48 [INFO] --- tycho-pack200b-plugin:1.7.0:pack (pack200-pack) @ org.eclipse.mylyn.github.tests ---
15:32:48 [2021-02-05T20:32:48.841Z] 20:32:48 [INFO] Pack200 packing jar /home/jenkins/agent/workspace/egit-github/repo/org.eclipse.mylyn.github.tests/target/org.eclipse.mylyn.github.tests-5.11.0-SNAPSHOT.jar
15:32:48 [2021-02-05T20:32:48.841Z] 20:32:48 [INFO] 
15:32:48 [2021-02-05T20:32:48.841Z] 20:32:48 [INFO] --- tycho-p2-plugin:1.7.0:p2-metadata (p2-metadata) @ org.eclipse.mylyn.github.tests ---
15:32:48 [2021-02-05T20:32:48.841Z] 20:32:48 [INFO] 
15:32:48 [2021-02-05T20:32:48.841Z] 20:32:48 [INFO] --- maven-install-plugin:2.3.1:install (default-install) @ org.eclipse.mylyn.github.tests ---
15:32:48 [2021-02-05T20:32:48.841Z] 20:32:48 [INFO] Installing /home/jenkins/agent/workspace/egit-github/repo/org.eclipse.mylyn.github.tests/target/org.eclipse.mylyn.github.tests-5.11.0-SNAPSHOT.jar to /home/jenkins/agent/workspace/egit-github/.repository/org/eclipse/mylyn/github/org.eclipse.mylyn.github.tests/5.11.0-SNAPSHOT/org.eclipse.mylyn.github.tests-5.11.0-SNAPSHOT.jar
15:32:48 [2021-02-05T20:32:48.841Z] 20:32:48 [INFO] Installing /home/jenkins/agent/workspace/egit-github/repo/org.eclipse.mylyn.github.tests/pom.xml to /home/jenkins/agent/workspace/egit-github/.repository/org/eclipse/mylyn/github/org.eclipse.mylyn.github.tests/5.11.0-SNAPSHOT/org.eclipse.mylyn.github.tests-5.11.0-SNAPSHOT.pom
15:32:48 [2021-02-05T20:32:48.841Z] 20:32:48 [INFO] Installing /home/jenkins/agent/workspace/egit-github/repo/org.eclipse.mylyn.github.tests/target/org.eclipse.mylyn.github.tests-5.11.0-SNAPSHOT.jar.pack.gz to /home/jenkins/agent/workspace/egit-github/.repository/org/eclipse/mylyn/github/org.eclipse.mylyn.github.tests/5.11.0-SNAPSHOT/org.eclipse.mylyn.github.tests-5.11.0-SNAPSHOT-pack200.jar.pack.gz
15:32:48 [2021-02-05T20:32:48.841Z] 20:32:48 [INFO] Installing /home/jenkins/agent/workspace/egit-github/repo/org.eclipse.mylyn.github.tests/target/p2content.xml to /home/jenkins/agent/workspace/egit-github/.repository/org/eclipse/mylyn/github/org.eclipse.mylyn.github.tests/5.11.0-SNAPSHOT/org.eclipse.mylyn.github.tests-5.11.0-SNAPSHOT-p2metadata.xml
15:32:48 [2021-02-05T20:32:48.841Z] 20:32:48 [INFO] Installing /home/jenkins/agent/workspace/egit-github/repo/org.eclipse.mylyn.github.tests/target/p2artifacts.xml to /home/jenkins/agent/workspace/egit-github/.repository/org/eclipse/mylyn/github/org.eclipse.mylyn.github.tests/5.11.0-SNAPSHOT/org.eclipse.mylyn.github.tests-5.11.0-SNAPSHOT-p2artifacts.xml
15:32:48 [2021-02-05T20:32:48.841Z] 20:32:48 [INFO] 
15:32:48 [2021-02-05T20:32:48.841Z] 20:32:48 [INFO] --- tycho-p2-plugin:1.7.0:update-local-index (default-update-local-index) @ org.eclipse.mylyn.github.tests ---
15:32:49 [2021-02-05T20:32:49.099Z] 20:32:48 [INFO] 
15:32:49 [2021-02-05T20:32:49.099Z] 20:32:48 [INFO] -------------< org.eclipse.mylyn.github:github-updatesite >-------------
15:32:49 [2021-02-05T20:32:49.099Z] 20:32:48 [INFO] Building Eclipse EGit Mylyn GitHub Repository 5.11.0-SNAPSHOT    [10/10]
15:32:49 [2021-02-05T20:32:49.099Z] 20:32:48 [INFO] -------------------------[ eclipse-repository ]-------------------------
15:32:49 [2021-02-05T20:32:49.099Z] 20:32:48 [INFO] 
15:32:49 [2021-02-05T20:32:49.099Z] 20:32:48 [INFO] --- maven-clean-plugin:2.5:clean (default-clean) @ github-updatesite ---
15:32:49 [2021-02-05T20:32:49.099Z] 20:32:48 [INFO] 
15:32:49 [2021-02-05T20:32:49.099Z] 20:32:48 [INFO] --- tycho-packaging-plugin:1.7.0:build-qualifier-aggregator (default-build-qualifier-aggregator) @ github-updatesite ---
15:32:49 [2021-02-05T20:32:49.099Z] 20:32:48 [INFO] The project's OSGi version is 5.11.0.202102052030
15:32:49 [2021-02-05T20:32:49.099Z] 20:32:48 [INFO] 
15:32:49 [2021-02-05T20:32:49.099Z] 20:32:48 [INFO] --- maven-enforcer-plugin:3.0.0-M2:enforce (enforce-maven) @ github-updatesite ---
15:32:49 [2021-02-05T20:32:49.099Z] 20:32:48 [INFO] 
15:32:49 [2021-02-05T20:32:49.099Z] 20:32:48 [INFO] --- maven-clean-plugin:2.5:clean (default-clean-1) @ github-updatesite ---
15:32:49 [2021-02-05T20:32:49.099Z] 20:32:48 [INFO] 
15:32:49 [2021-02-05T20:32:49.099Z] 20:32:48 [INFO] --- maven-resources-plugin:3.1.0:resources (default-resources) @ github-updatesite ---
15:32:49 [2021-02-05T20:32:49.099Z] 20:32:48 [INFO] Using 'UTF-8' encoding to copy filtered resources.
15:32:49 [2021-02-05T20:32:49.099Z] 20:32:48 [INFO] skip non existing resourceDirectory /home/jenkins/agent/workspace/egit-github/repo/org.eclipse.mylyn.github-site/src/main/resources
15:32:49 [2021-02-05T20:32:49.099Z] 20:32:48 [INFO] 
15:32:49 [2021-02-05T20:32:49.099Z] 20:32:48 [INFO] --- target-platform-configuration:1.7.0:target-platform (default-target-platform) @ github-updatesite ---
15:32:49 [2021-02-05T20:32:49.099Z] 20:32:48 [INFO] 
15:32:49 [2021-02-05T20:32:49.099Z] 20:32:48 [INFO] --- tycho-p2-publisher-plugin:1.7.0:publish-osgi-ee (default-publish-osgi-ee) @ github-updatesite ---
15:32:49 [2021-02-05T20:32:49.099Z] 20:32:48 [INFO] Published profile IUs: [a.jre.javase 11.0.0, config.a.jre.javase 11.0.0]
15:32:49 [2021-02-05T20:32:49.099Z] 20:32:48 [INFO] Published profile IUs: [a.jre.javase 14.0.0, config.a.jre.javase 14.0.0]
15:32:49 [2021-02-05T20:32:49.099Z] 20:32:48 [INFO] 
15:32:49 [2021-02-05T20:32:49.099Z] 20:32:48 [INFO] --- tycho-p2-publisher-plugin:1.7.0:publish-products (default-publish-products) @ github-updatesite ---
15:32:49 [2021-02-05T20:32:49.099Z] 20:32:48 [INFO] 
15:32:49 [2021-02-05T20:32:49.099Z] 20:32:48 [INFO] --- tycho-p2-publisher-plugin:1.7.0:publish-categories (default-publish-categories) @ github-updatesite ---
15:32:49 [2021-02-05T20:32:49.099Z] 20:32:48 [INFO] 
15:32:49 [2021-02-05T20:32:49.099Z] 20:32:48 [INFO] --- tycho-p2-publisher-plugin:1.7.0:attach-artifacts (default-attach-artifacts) @ github-updatesite ---
15:32:49 [2021-02-05T20:32:49.099Z] 20:32:48 [INFO] 
15:32:49 [2021-02-05T20:32:49.099Z] 20:32:48 [INFO] --- tycho-p2-repository-plugin:1.7.0:assemble-repository (default-assemble-repository) @ github-updatesite ---
15:32:50 [2021-02-05T20:32:50.045Z] 20:32:49 [INFO] 
15:32:50 [2021-02-05T20:32:50.045Z] 20:32:49 [INFO] --- tycho-p2-repository-plugin:1.7.0:archive-repository (default-archive-repository) @ github-updatesite ---
15:32:50 [2021-02-05T20:32:50.045Z] 20:32:49 [INFO] Building zip: /home/jenkins/agent/workspace/egit-github/repo/org.eclipse.mylyn.github-site/target/github-updatesite-5.11.0-SNAPSHOT.zip
15:32:50 [2021-02-05T20:32:50.045Z] 20:32:49 [INFO] 
15:32:50 [2021-02-05T20:32:50.045Z] 20:32:49 [INFO] >>> spotbugs-maven-plugin:3.1.11:check (default) > :spotbugs @ github-updatesite >>>
15:32:50 [2021-02-05T20:32:50.045Z] 20:32:49 [INFO] 
15:32:50 [2021-02-05T20:32:50.045Z] 20:32:49 [INFO] --- spotbugs-maven-plugin:3.1.11:spotbugs (spotbugs) @ github-updatesite ---
15:32:50 [2021-02-05T20:32:50.045Z] 20:32:49 [INFO] 
15:32:50 [2021-02-05T20:32:50.045Z] 20:32:49 [INFO] <<< spotbugs-maven-plugin:3.1.11:check (default) < :spotbugs @ github-updatesite <<<
15:32:50 [2021-02-05T20:32:50.045Z] 20:32:49 [INFO] 
15:32:50 [2021-02-05T20:32:50.045Z] 20:32:49 [INFO] 
15:32:50 [2021-02-05T20:32:50.045Z] 20:32:49 [INFO] --- spotbugs-maven-plugin:3.1.11:check (default) @ github-updatesite ---
15:32:50 [2021-02-05T20:32:50.045Z] 20:32:49 [INFO] 
15:32:50 [2021-02-05T20:32:50.045Z] 20:32:49 [INFO] >>> maven-pmd-plugin:3.11.0:cpd-check (default) > :cpd @ github-updatesite >>>
15:32:50 [2021-02-05T20:32:50.045Z] 20:32:49 [INFO] 
15:32:50 [2021-02-05T20:32:50.045Z] 20:32:49 [INFO] --- maven-pmd-plugin:3.11.0:cpd (cpd) @ github-updatesite ---
15:32:50 [2021-02-05T20:32:50.045Z] 20:32:49 [INFO] 
15:32:50 [2021-02-05T20:32:50.045Z] 20:32:49 [INFO] <<< maven-pmd-plugin:3.11.0:cpd-check (default) < :cpd @ github-updatesite <<<
15:32:50 [2021-02-05T20:32:50.045Z] 20:32:49 [INFO] 
15:32:50 [2021-02-05T20:32:50.045Z] 20:32:49 [INFO] 
15:32:50 [2021-02-05T20:32:50.045Z] 20:32:49 [INFO] --- maven-pmd-plugin:3.11.0:cpd-check (default) @ github-updatesite ---
15:32:50 [2021-02-05T20:32:50.045Z] 20:32:49 [INFO] 
15:32:50 [2021-02-05T20:32:50.045Z] 20:32:49 [INFO] 
15:32:50 [2021-02-05T20:32:50.045Z] 20:32:49 [INFO] --- tycho-pack200a-plugin:1.7.0:normalize (pack200-normalize) @ github-updatesite ---
15:32:50 [2021-02-05T20:32:50.045Z] 20:32:49 [INFO] 
15:32:50 [2021-02-05T20:32:50.045Z] 20:32:49 [INFO] --- eclipse-jarsigner-plugin:1.1.5:sign (sign) @ github-updatesite ---
15:32:50 [2021-02-05T20:32:50.045Z] 20:32:49 [INFO] 
15:32:50 [2021-02-05T20:32:50.045Z] 20:32:49 [INFO] --- tycho-pack200b-plugin:1.7.0:pack (pack200-pack) @ github-updatesite ---
15:32:50 [2021-02-05T20:32:50.045Z] 20:32:49 [INFO] 
15:32:50 [2021-02-05T20:32:50.045Z] 20:32:49 [INFO] --- tycho-p2-plugin:1.7.0:p2-metadata (p2-metadata) @ github-updatesite ---
15:32:50 [2021-02-05T20:32:50.045Z] 20:32:49 [INFO] 
15:32:50 [2021-02-05T20:32:50.045Z] 20:32:49 [INFO] --- maven-install-plugin:2.3.1:install (default-install) @ github-updatesite ---
15:32:50 [2021-02-05T20:32:50.045Z] 20:32:49 [INFO] Installing /home/jenkins/agent/workspace/egit-github/repo/org.eclipse.mylyn.github-site/target/github-updatesite-5.11.0-SNAPSHOT.zip to /home/jenkins/agent/workspace/egit-github/.repository/org/eclipse/mylyn/github/github-updatesite/5.11.0-SNAPSHOT/github-updatesite-5.11.0-SNAPSHOT.zip
15:32:50 [2021-02-05T20:32:50.045Z] 20:32:49 [INFO] Installing /home/jenkins/agent/workspace/egit-github/repo/org.eclipse.mylyn.github-site/pom.xml to /home/jenkins/agent/workspace/egit-github/.repository/org/eclipse/mylyn/github/github-updatesite/5.11.0-SNAPSHOT/github-updatesite-5.11.0-SNAPSHOT.pom
15:32:50 [2021-02-05T20:32:50.045Z] 20:32:49 [INFO] Installing /home/jenkins/agent/workspace/egit-github/repo/org.eclipse.mylyn.github-site/target/p2content.xml to /home/jenkins/agent/workspace/egit-github/.repository/org/eclipse/mylyn/github/github-updatesite/5.11.0-SNAPSHOT/github-updatesite-5.11.0-SNAPSHOT-p2metadata.xml
15:32:50 [2021-02-05T20:32:50.045Z] 20:32:49 [INFO] Installing /home/jenkins/agent/workspace/egit-github/repo/org.eclipse.mylyn.github-site/target/p2artifacts.xml to /home/jenkins/agent/workspace/egit-github/.repository/org/eclipse/mylyn/github/github-updatesite/5.11.0-SNAPSHOT/github-updatesite-5.11.0-SNAPSHOT-p2artifacts.xml
15:32:50 [2021-02-05T20:32:50.045Z] 20:32:49 [INFO] 
15:32:50 [2021-02-05T20:32:50.046Z] 20:32:49 [INFO] --- tycho-p2-plugin:1.7.0:update-local-index (default-update-local-index) @ github-updatesite ---
15:32:50 [2021-02-05T20:32:50.046Z] 20:32:49 [INFO] ------------------------------------------------------------------------
15:32:50 [2021-02-05T20:32:50.046Z] 20:32:49 [INFO] Reactor Summary for Eclipse EGit Mylyn GitHub Connector Parent 5.11.0-SNAPSHOT:
15:32:50 [2021-02-05T20:32:50.046Z] 20:32:49 [INFO] 
15:32:50 [2021-02-05T20:32:50.046Z] 20:32:49 [INFO] Eclipse EGit Mylyn GitHub Connector Parent ......... SUCCESS [ 20.614 s]
15:32:50 [2021-02-05T20:32:50.046Z] 20:32:49 [INFO] EGit GitHub Target Platform Definition ............. SUCCESS [  0.833 s]
15:32:50 [2021-02-05T20:32:50.046Z] 20:32:49 [INFO] Eclipse EGit GitHub API Core ....................... SUCCESS [ 10.543 s]
15:32:50 [2021-02-05T20:32:50.046Z] 20:32:49 [INFO] Eclipse EGit Mylyn GitHub Core ..................... SUCCESS [  5.488 s]
15:32:50 [2021-02-05T20:32:50.046Z] 20:32:49 [INFO] Eclipse EGit Mylyn GitHub UI ....................... SUCCESS [  9.896 s]
15:32:50 [2021-02-05T20:32:50.046Z] 20:32:49 [INFO] Eclipse EGit Mylyn GitHub Documentation ............ SUCCESS [  3.136 s]
15:32:50 [2021-02-05T20:32:50.046Z] 20:32:49 [INFO] Eclipse EGit Mylyn GitHub Feature .................. SUCCESS [  1.429 s]
15:32:50 [2021-02-05T20:32:50.046Z] 20:32:49 [INFO] Eclipse EGit GitHub API Test Plug-in ............... SUCCESS [  9.749 s]
15:32:50 [2021-02-05T20:32:50.046Z] 20:32:49 [INFO] Eclipse EGit Mylyn GitHub Test Plug-in ............. SUCCESS [ 11.096 s]
15:32:50 [2021-02-05T20:32:50.046Z] 20:32:49 [INFO] Eclipse EGit Mylyn GitHub Repository ............... SUCCESS [  1.128 s]
15:32:50 [2021-02-05T20:32:50.046Z] 20:32:49 [INFO] ------------------------------------------------------------------------
15:32:50 [2021-02-05T20:32:50.046Z] 20:32:49 [INFO] BUILD SUCCESS
15:32:50 [2021-02-05T20:32:50.046Z] 20:32:49 [INFO] ------------------------------------------------------------------------
15:32:50 [2021-02-05T20:32:50.046Z] 20:32:49 [INFO] Total time:  02:47 min
15:32:50 [2021-02-05T20:32:50.046Z] 20:32:49 [INFO] Finished at: 2021-02-05T20:32:49Z
15:32:50 [2021-02-05T20:32:50.046Z] 20:32:49 [INFO] ------------------------------------------------------------------------