SuccessConsole Output

Skipping 262 KB.. Full Log
updateFields(org.eclipse.egit.github.core.tests.MemberPayloadTest)  Time elapsed: 0 s
17:27:12 [2021-02-04T22:27:12.563Z] defaultState(org.eclipse.egit.github.core.tests.MemberPayloadTest)  Time elapsed: 0 s
17:27:12 [2021-02-04T22:27:12.563Z] updateFields(org.eclipse.egit.github.core.tests.PullRequestPayloadTest)  Time elapsed: 0.001 s
17:27:12 [2021-02-04T22:27:12.563Z] defaultState(org.eclipse.egit.github.core.tests.PullRequestPayloadTest)  Time elapsed: 0 s
17:27:12 [2021-02-04T22:27:12.563Z] updateFields(org.eclipse.egit.github.core.tests.PullRequestReviewCommentPayloadTest)  Time elapsed: 0 s
17:27:12 [2021-02-04T22:27:12.563Z] defaultState(org.eclipse.egit.github.core.tests.PullRequestReviewCommentPayloadTest)  Time elapsed: 0 s
17:27:12 [2021-02-04T22:27:12.563Z] updateFields(org.eclipse.egit.github.core.tests.PushPayloadTest)  Time elapsed: 0 s
17:27:12 [2021-02-04T22:27:12.563Z] defaultState(org.eclipse.egit.github.core.tests.PushPayloadTest)  Time elapsed: 0 s
17:27:12 [2021-02-04T22:27:12.563Z] updateFields(org.eclipse.egit.github.core.tests.TeamAddPayloadTest)  Time elapsed: 0.001 s
17:27:12 [2021-02-04T22:27:12.563Z] defaultState(org.eclipse.egit.github.core.tests.TeamAddPayloadTest)  Time elapsed: 0 s
17:27:12 [2021-02-04T22:27:12.563Z] updateFields(org.eclipse.egit.github.core.tests.WatchPayloadTest)  Time elapsed: 0 s
17:27:12 [2021-02-04T22:27:12.563Z] defaultState(org.eclipse.egit.github.core.tests.WatchPayloadTest)  Time elapsed: 0 s
17:27:12 [2021-02-04T22:27:12.563Z] updateFields(org.eclipse.egit.github.core.tests.EventRepositoryTest)  Time elapsed: 0 s
17:27:12 [2021-02-04T22:27:12.563Z] defaultState(org.eclipse.egit.github.core.tests.EventRepositoryTest)  Time elapsed: 0 s
17:27:12 [2021-02-04T22:27:12.564Z] pageUserEvents(org.eclipse.egit.github.core.tests.EventServiceTest)  Time elapsed: 0 s
17:27:12 [2021-02-04T22:27:12.564Z] pagePublicEvents(org.eclipse.egit.github.core.tests.EventServiceTest)  Time elapsed: 0.001 s
17:27:12 [2021-02-04T22:27:12.564Z] constructorNullArgument(org.eclipse.egit.github.core.tests.EventServiceTest)  Time elapsed: 0 s
17:27:12 [2021-02-04T22:27:12.564Z] defaultConstructor(org.eclipse.egit.github.core.tests.EventServiceTest)  Time elapsed: 0 s
17:27:12 [2021-02-04T22:27:12.564Z] pageNetworkEvents(org.eclipse.egit.github.core.tests.EventServiceTest)  Time elapsed: 0 s
17:27:12 [2021-02-04T22:27:12.564Z] pageUserOrgEvents(org.eclipse.egit.github.core.tests.EventServiceTest)  Time elapsed: 0 s
17:27:12 [2021-02-04T22:27:12.564Z] pagePublicUserEvents(org.eclipse.egit.github.core.tests.EventServiceTest)  Time elapsed: 0.001 s
17:27:12 [2021-02-04T22:27:12.564Z] pageUserReceivedEvents(org.eclipse.egit.github.core.tests.EventServiceTest)  Time elapsed: 0 s
17:27:12 [2021-02-04T22:27:12.564Z] pageOrgEvents(org.eclipse.egit.github.core.tests.EventServiceTest)  Time elapsed: 0 s
17:27:12 [2021-02-04T22:27:12.564Z] pagePublicUserReceivedEvents(org.eclipse.egit.github.core.tests.EventServiceTest)  Time elapsed: 0 s
17:27:12 [2021-02-04T22:27:12.564Z] pageRepsitoryEvents(org.eclipse.egit.github.core.tests.EventServiceTest)  Time elapsed: 0.001 s
17:27:12 [2021-02-04T22:27:12.564Z] updateFields(org.eclipse.egit.github.core.tests.EventTest)  Time elapsed: 0 s
17:27:12 [2021-02-04T22:27:12.564Z] defaultState(org.eclipse.egit.github.core.tests.EventTest)  Time elapsed: 0 s
17:27:12 [2021-02-04T22:27:12.564Z] getCreatedAtReferenceMutableObject(org.eclipse.egit.github.core.tests.EventTest)  Time elapsed: 0 s
17:27:12 [2021-02-04T22:27:12.564Z] updateFields(org.eclipse.egit.github.core.tests.FieldErrorTest)  Time elapsed: 0 s
17:27:12 [2021-02-04T22:27:12.564Z] defaultState(org.eclipse.egit.github.core.tests.FieldErrorTest)  Time elapsed: 0 s
17:27:12 [2021-02-04T22:27:12.564Z] updateFields(org.eclipse.egit.github.core.tests.FollowPayloadTest)  Time elapsed: 0 s
17:27:12 [2021-02-04T22:27:12.564Z] defaultState(org.eclipse.egit.github.core.tests.FollowPayloadTest)  Time elapsed: 0 s
17:27:12 [2021-02-04T22:27:12.564Z] updateFields(org.eclipse.egit.github.core.tests.ForkApplyPayloadTest)  Time elapsed: 0 s
17:27:12 [2021-02-04T22:27:12.564Z] defaultState(org.eclipse.egit.github.core.tests.ForkApplyPayloadTest)  Time elapsed: 0 s
17:27:12 [2021-02-04T22:27:12.564Z] updateFields(org.eclipse.egit.github.core.tests.ForkPayloadTest)  Time elapsed: 0 s
17:27:12 [2021-02-04T22:27:12.564Z] defaultState(org.eclipse.egit.github.core.tests.ForkPayloadTest)  Time elapsed: 0 s
17:27:12 [2021-02-04T22:27:12.564Z] updateFields(org.eclipse.egit.github.core.tests.GistChangeStatusTest)  Time elapsed: 0 s
17:27:12 [2021-02-04T22:27:12.564Z] defaultState(org.eclipse.egit.github.core.tests.GistChangeStatusTest)  Time elapsed: 0 s
17:27:12 [2021-02-04T22:27:12.564Z] updateFields(org.eclipse.egit.github.core.tests.GistFileTest)  Time elapsed: 0.001 s
17:27:12 [2021-02-04T22:27:12.564Z] defaultState(org.eclipse.egit.github.core.tests.GistFileTest)  Time elapsed: 0 s
17:27:12 [2021-02-04T22:27:12.564Z] updateFields(org.eclipse.egit.github.core.tests.GistPayloadTest)  Time elapsed: 0 s
17:27:12 [2021-02-04T22:27:12.564Z] defaultState(org.eclipse.egit.github.core.tests.GistPayloadTest)  Time elapsed: 0 s
17:27:12 [2021-02-04T22:27:12.564Z] updateFields(org.eclipse.egit.github.core.tests.GistRevisionTest)  Time elapsed: 0 s
17:27:12 [2021-02-04T22:27:12.564Z] defaultState(org.eclipse.egit.github.core.tests.GistRevisionTest)  Time elapsed: 0 s
17:27:12 [2021-02-04T22:27:12.564Z] getCreatedAReferenceMutableObject(org.eclipse.egit.github.core.tests.GistRevisionTest)  Time elapsed: 0 s
17:27:12 [2021-02-04T22:27:12.564Z] starGistNullId(org.eclipse.egit.github.core.tests.GistServiceTest)  Time elapsed: 0 s
17:27:12 [2021-02-04T22:27:12.564Z] pageUserGistsEmptyId(org.eclipse.egit.github.core.tests.GistServiceTest)  Time elapsed: 0.001 s
17:27:12 [2021-02-04T22:27:12.564Z] getGistsNullUser(org.eclipse.egit.github.core.tests.GistServiceTest)  Time elapsed: 0 s
17:27:12 [2021-02-04T22:27:12.564Z] getGistEmptyId(org.eclipse.egit.github.core.tests.GistServiceTest)  Time elapsed: 0 s
17:27:12 [2021-02-04T22:27:12.564Z] unstarGist(org.eclipse.egit.github.core.tests.GistServiceTest)  Time elapsed: 0 s
17:27:12 [2021-02-04T22:27:12.564Z] starGistEmptyId(org.eclipse.egit.github.core.tests.GistServiceTest)  Time elapsed: 0 s
17:27:12 [2021-02-04T22:27:12.564Z] updateGistOK(org.eclipse.egit.github.core.tests.GistServiceTest)  Time elapsed: 0.001 s
17:27:12 [2021-02-04T22:27:12.564Z] getStarredGists(org.eclipse.egit.github.core.tests.GistServiceTest)  Time elapsed: 0 s
17:27:12 [2021-02-04T22:27:12.564Z] editGistComment(org.eclipse.egit.github.core.tests.GistServiceTest)  Time elapsed: 0 s
17:27:12 [2021-02-04T22:27:12.564Z] createGistNullOwner(org.eclipse.egit.github.core.tests.GistServiceTest)  Time elapsed: 0 s
17:27:12 [2021-02-04T22:27:12.564Z] isStarredGistNullId(org.eclipse.egit.github.core.tests.GistServiceTest)  Time elapsed: 0.001 s
17:27:12 [2021-02-04T22:27:12.564Z] deleteGistEmptyId(org.eclipse.egit.github.core.tests.GistServiceTest)  Time elapsed: 0 s
17:27:12 [2021-02-04T22:27:12.564Z] forkGistNullId(org.eclipse.egit.github.core.tests.GistServiceTest)  Time elapsed: 0 s
17:27:12 [2021-02-04T22:27:12.564Z] constructorNullArgument(org.eclipse.egit.github.core.tests.GistServiceTest)  Time elapsed: 0 s
17:27:12 [2021-02-04T22:27:12.564Z] editGistCommentNullComment(org.eclipse.egit.github.core.tests.GistServiceTest)  Time elapsed: 0 s
17:27:12 [2021-02-04T22:27:12.564Z] deleteGistNullId(org.eclipse.egit.github.core.tests.GistServiceTest)  Time elapsed: 0.001 s
17:27:12 [2021-02-04T22:27:12.564Z] isStarredGist(org.eclipse.egit.github.core.tests.GistServiceTest)  Time elapsed: 0 s
17:27:12 [2021-02-04T22:27:12.564Z] updateGistNullId(org.eclipse.egit.github.core.tests.GistServiceTest)  Time elapsed: 0 s
17:27:12 [2021-02-04T22:27:12.564Z] getGist(org.eclipse.egit.github.core.tests.GistServiceTest)  Time elapsed: 0 s
17:27:12 [2021-02-04T22:27:12.564Z] isStarredGistEmptyId(org.eclipse.egit.github.core.tests.GistServiceTest)  Time elapsed: 0 s
17:27:12 [2021-02-04T22:27:12.564Z] pagePublicGists(org.eclipse.egit.github.core.tests.GistServiceTest)  Time elapsed: 0 s
17:27:12 [2021-02-04T22:27:12.564Z] pageStarredGists(org.eclipse.egit.github.core.tests.GistServiceTest)  Time elapsed: 0 s
17:27:12 [2021-02-04T22:27:12.564Z] pageUserGists(org.eclipse.egit.github.core.tests.GistServiceTest)  Time elapsed: 0 s
17:27:12 [2021-02-04T22:27:12.564Z] forkGist(org.eclipse.egit.github.core.tests.GistServiceTest)  Time elapsed: 0 s
17:27:12 [2021-02-04T22:27:12.564Z] createGistNullGist(org.eclipse.egit.github.core.tests.GistServiceTest)  Time elapsed: 0.001 s
17:27:12 [2021-02-04T22:27:12.564Z] createCommentNullGistId(org.eclipse.egit.github.core.tests.GistServiceTest)  Time elapsed: 0 s
17:27:12 [2021-02-04T22:27:12.564Z] getCommentsOK(org.eclipse.egit.github.core.tests.GistServiceTest)  Time elapsed: 0 s
17:27:12 [2021-02-04T22:27:12.564Z] getCommentsNullGistId(org.eclipse.egit.github.core.tests.GistServiceTest)  Time elapsed: 0 s
17:27:12 [2021-02-04T22:27:12.564Z] unstarGistNullId(org.eclipse.egit.github.core.tests.GistServiceTest)  Time elapsed: 0 s
17:27:12 [2021-02-04T22:27:12.564Z] pageUserGistsNullId(org.eclipse.egit.github.core.tests.GistServiceTest)  Time elapsed: 0 s
17:27:12 [2021-02-04T22:27:12.564Z] getGistNullId(org.eclipse.egit.github.core.tests.GistServiceTest)  Time elapsed: 0 s
17:27:12 [2021-02-04T22:27:12.564Z] defaultContructor(org.eclipse.egit.github.core.tests.GistServiceTest)  Time elapsed: 0 s
17:27:12 [2021-02-04T22:27:12.564Z] getGistComment(org.eclipse.egit.github.core.tests.GistServiceTest)  Time elapsed: 0 s
17:27:12 [2021-02-04T22:27:12.564Z] createCommentNullComment(org.eclipse.egit.github.core.tests.GistServiceTest)  Time elapsed: 0 s
17:27:12 [2021-02-04T22:27:12.564Z] getGistsOK(org.eclipse.egit.github.core.tests.GistServiceTest)  Time elapsed: 0.001 s
17:27:12 [2021-02-04T22:27:12.564Z] starGist(org.eclipse.egit.github.core.tests.GistServiceTest)  Time elapsed: 0 s
17:27:12 [2021-02-04T22:27:12.564Z] createCommentOK(org.eclipse.egit.github.core.tests.GistServiceTest)  Time elapsed: 0 s
17:27:12 [2021-02-04T22:27:12.564Z] forkGistEmptyId(org.eclipse.egit.github.core.tests.GistServiceTest)  Time elapsed: 0 s
17:27:12 [2021-02-04T22:27:12.564Z] deleteGistComment(org.eclipse.egit.github.core.tests.GistServiceTest)  Time elapsed: 0 s
17:27:12 [2021-02-04T22:27:12.564Z] deleteGist(org.eclipse.egit.github.core.tests.GistServiceTest)  Time elapsed: 0.001 s
17:27:12 [2021-02-04T22:27:12.564Z] updateGistNullGist(org.eclipse.egit.github.core.tests.GistServiceTest)  Time elapsed: 0 s
17:27:12 [2021-02-04T22:27:12.564Z] getGistsEmptyUser(org.eclipse.egit.github.core.tests.GistServiceTest)  Time elapsed: 0 s
17:27:12 [2021-02-04T22:27:12.564Z] unstarGistEmptyId(org.eclipse.egit.github.core.tests.GistServiceTest)  Time elapsed: 0 s
17:27:12 [2021-02-04T22:27:12.564Z] updateFields(org.eclipse.egit.github.core.tests.GistTest)  Time elapsed: 0 s
17:27:12 [2021-02-04T22:27:12.565Z] defaultState(org.eclipse.egit.github.core.tests.GistTest)  Time elapsed: 0 s
17:27:12 [2021-02-04T22:27:12.565Z] getCreatedAtReferenceMutableObject(org.eclipse.egit.github.core.tests.GistTest)  Time elapsed: 0 s
17:27:12 [2021-02-04T22:27:12.565Z] getUpdatedAtReferenceMutableObject(org.eclipse.egit.github.core.tests.GistTest)  Time elapsed: 0 s
17:27:12 [2021-02-04T22:27:12.565Z] prefixLocalhost(org.eclipse.egit.github.core.tests.GitHubClientTest)  Time elapsed: 0.001 s
17:27:12 [2021-02-04T22:27:12.565Z] prefixHostApiV3(org.eclipse.egit.github.core.tests.GitHubClientTest)  Time elapsed: 0 s
17:27:12 [2021-02-04T22:27:12.565Z] updateFields(org.eclipse.egit.github.core.tests.GollumPageTest)  Time elapsed: 0 s
17:27:12 [2021-02-04T22:27:12.565Z] defaultState(org.eclipse.egit.github.core.tests.GollumPageTest)  Time elapsed: 0 s
17:27:12 [2021-02-04T22:27:12.565Z] updateFields(org.eclipse.egit.github.core.tests.GollumPayloadTest)  Time elapsed: 0 s
17:27:12 [2021-02-04T22:27:12.565Z] defaultState(org.eclipse.egit.github.core.tests.GollumPayloadTest)  Time elapsed: 0 s
17:27:12 [2021-02-04T22:27:12.565Z] seriazlizeNulls(org.eclipse.egit.github.core.tests.GsonUtilsTest)  Time elapsed: 0.001 s
17:27:12 [2021-02-04T22:27:12.565Z] noSeriazlizeNulls(org.eclipse.egit.github.core.tests.GsonUtilsTest)  Time elapsed: 0 s
17:27:12 [2021-02-04T22:27:12.565Z] getGson(org.eclipse.egit.github.core.tests.GsonUtilsTest)  Time elapsed: 0 s
17:27:12 [2021-02-04T22:27:12.565Z] createGson(org.eclipse.egit.github.core.tests.GsonUtilsTest)  Time elapsed: 0.002 s
17:27:12 [2021-02-04T22:27:12.565Z] defaultState(org.eclipse.egit.github.core.tests.IdTest)  Time elapsed: 0 s
17:27:12 [2021-02-04T22:27:12.565Z] updateField(org.eclipse.egit.github.core.tests.IdTest)  Time elapsed: 0 s
17:27:12 [2021-02-04T22:27:12.565Z] updateFields(org.eclipse.egit.github.core.tests.IssueCommentPayloadTest)  Time elapsed: 0 s
17:27:12 [2021-02-04T22:27:12.565Z] defaultState(org.eclipse.egit.github.core.tests.IssueCommentPayloadTest)  Time elapsed: 0 s
17:27:12 [2021-02-04T22:27:12.565Z] nonMutableCreatedAt(org.eclipse.egit.github.core.tests.IssueEventTest)  Time elapsed: 0 s
17:27:12 [2021-02-04T22:27:12.565Z] updateFields(org.eclipse.egit.github.core.tests.IssueEventTest)  Time elapsed: 0 s
17:27:12 [2021-02-04T22:27:12.565Z] defaultState(org.eclipse.egit.github.core.tests.IssueEventTest)  Time elapsed: 0 s
17:27:12 [2021-02-04T22:27:12.565Z] getCommentsEmptyUser(org.eclipse.egit.github.core.tests.IssueServiceTest)  Time elapsed: 0.001 s
17:27:12 [2021-02-04T22:27:12.565Z] createCommentNullIssueId(org.eclipse.egit.github.core.tests.IssueServiceTest)  Time elapsed: 0 s
17:27:12 [2021-02-04T22:27:12.565Z] createIssueEmptyUser(org.eclipse.egit.github.core.tests.IssueServiceTest)  Time elapsed: 0 s
17:27:12 [2021-02-04T22:27:12.565Z] getIssueComment(org.eclipse.egit.github.core.tests.IssueServiceTest)  Time elapsed: 0 s
17:27:12 [2021-02-04T22:27:12.565Z] pageIssueEvents(org.eclipse.egit.github.core.tests.IssueServiceTest)  Time elapsed: 0 s
17:27:12 [2021-02-04T22:27:12.565Z] editIssueNullRepositoryName(org.eclipse.egit.github.core.tests.IssueServiceTest)  Time elapsed: 0 s
17:27:12 [2021-02-04T22:27:12.565Z] deleteCommentNullRepositoryName(org.eclipse.egit.github.core.tests.IssueServiceTest)  Time elapsed: 0 s
17:27:12 [2021-02-04T22:27:12.565Z] getIssueNullRepositoryId(org.eclipse.egit.github.core.tests.IssueServiceTest)  Time elapsed: 0 s
17:27:12 [2021-02-04T22:27:12.565Z] deleteCommentWithRepositoryId(org.eclipse.egit.github.core.tests.IssueServiceTest)  Time elapsed: 0.001 s
17:27:12 [2021-02-04T22:27:12.565Z] deleteCommentNullId(org.eclipse.egit.github.core.tests.IssueServiceTest)  Time elapsed: 0 s
17:27:12 [2021-02-04T22:27:12.565Z] editIssue(org.eclipse.egit.github.core.tests.IssueServiceTest)  Time elapsed: 0.001 s
17:27:12 [2021-02-04T22:27:12.565Z] createCommentEmptyRepositoryName(org.eclipse.egit.github.core.tests.IssueServiceTest)  Time elapsed: 0 s
17:27:12 [2021-02-04T22:27:12.565Z] getIssueWithRepositoryId(org.eclipse.egit.github.core.tests.IssueServiceTest)  Time elapsed: 0 s
17:27:12 [2021-02-04T22:27:12.565Z] createCommentNullRepositoryName(org.eclipse.egit.github.core.tests.IssueServiceTest)  Time elapsed: 0 s
17:27:12 [2021-02-04T22:27:12.565Z] getIssueNullUser(org.eclipse.egit.github.core.tests.IssueServiceTest)  Time elapsed: 0 s
17:27:12 [2021-02-04T22:27:12.565Z] editIssueEmptyRepositoryName(org.eclipse.egit.github.core.tests.IssueServiceTest)  Time elapsed: 0.001 s
17:27:12 [2021-02-04T22:27:12.565Z] createIssueNullRepositoryName(org.eclipse.egit.github.core.tests.IssueServiceTest)  Time elapsed: 0 s
17:27:12 [2021-02-04T22:27:12.565Z] getCommentsNullRepositoryName(org.eclipse.egit.github.core.tests.IssueServiceTest)  Time elapsed: 0 s
17:27:12 [2021-02-04T22:27:12.565Z] deleteCommentEmptyRepositoryName(org.eclipse.egit.github.core.tests.IssueServiceTest)  Time elapsed: 0 s
17:27:12 [2021-02-04T22:27:12.565Z] getCommentsEmptyRepositoryName(org.eclipse.egit.github.core.tests.IssueServiceTest)  Time elapsed: 0 s
17:27:12 [2021-02-04T22:27:12.565Z] getIssueEmptyUser(org.eclipse.egit.github.core.tests.IssueServiceTest)  Time elapsed: 0 s
17:27:12 [2021-02-04T22:27:12.565Z] createComment(org.eclipse.egit.github.core.tests.IssueServiceTest)  Time elapsed: 0.001 s
17:27:12 [2021-02-04T22:27:12.565Z] getCommentsNullRepositoryId(org.eclipse.egit.github.core.tests.IssueServiceTest)  Time elapsed: 0 s
17:27:12 [2021-02-04T22:27:12.565Z] getIssuesNullUser(org.eclipse.egit.github.core.tests.IssueServiceTest)  Time elapsed: 0.018 s
17:27:12 [2021-02-04T22:27:12.565Z] editIssueCommentNullComment(org.eclipse.egit.github.core.tests.IssueServiceTest)  Time elapsed: 0.001 s
17:27:12 [2021-02-04T22:27:12.565Z] getCommentsWithRepositoryId(org.eclipse.egit.github.core.tests.IssueServiceTest)  Time elapsed: 0 s
17:27:12 [2021-02-04T22:27:12.565Z] constructorNullArgument(org.eclipse.egit.github.core.tests.IssueServiceTest)  Time elapsed: 0.001 s
17:27:12 [2021-02-04T22:27:12.565Z] pageRepsitoryIssuesWithRepositoryId(org.eclipse.egit.github.core.tests.IssueServiceTest)  Time elapsed: 0 s
17:27:12 [2021-02-04T22:27:12.565Z] getCommentsNullId(org.eclipse.egit.github.core.tests.IssueServiceTest)  Time elapsed: 0 s
17:27:12 [2021-02-04T22:27:12.565Z] deleteCommentEmptyUser(org.eclipse.egit.github.core.tests.IssueServiceTest)  Time elapsed: 0 s
17:27:12 [2021-02-04T22:27:12.565Z] getCurrentUserIssues(org.eclipse.egit.github.core.tests.IssueServiceTest)  Time elapsed: 0.001 s
17:27:12 [2021-02-04T22:27:12.565Z] createIssueNullIssueWithRepositoryId(org.eclipse.egit.github.core.tests.IssueServiceTest)  Time elapsed: 0 s
17:27:12 [2021-02-04T22:27:12.565Z] editIssueEmptyUser(org.eclipse.egit.github.core.tests.IssueServiceTest)  Time elapsed: 0 s
17:27:12 [2021-02-04T22:27:12.565Z] getIssueNullRepositoryName(org.eclipse.egit.github.core.tests.IssueServiceTest)  Time elapsed: 0 s
17:27:12 [2021-02-04T22:27:12.565Z] defaultConstructor(org.eclipse.egit.github.core.tests.IssueServiceTest)  Time elapsed: 0 s
17:27:12 [2021-02-04T22:27:12.565Z] getIssuesEmptyRepositoryName(org.eclipse.egit.github.core.tests.IssueServiceTest)  Time elapsed: 0.001 s
17:27:12 [2021-02-04T22:27:12.565Z] getIssueEmptyId(org.eclipse.egit.github.core.tests.IssueServiceTest)  Time elapsed: 0 s
17:27:12 [2021-02-04T22:27:12.565Z] deleteCommentNullUser(org.eclipse.egit.github.core.tests.IssueServiceTest)  Time elapsed: 0 s
17:27:12 [2021-02-04T22:27:12.565Z] createCommentNullUser(org.eclipse.egit.github.core.tests.IssueServiceTest)  Time elapsed: 0 s
17:27:12 [2021-02-04T22:27:12.565Z] createIssueEmptyRepositoryName(org.eclipse.egit.github.core.tests.IssueServiceTest)  Time elapsed: 0 s
17:27:12 [2021-02-04T22:27:12.565Z] searchIssues(org.eclipse.egit.github.core.tests.IssueServiceTest)  Time elapsed: 0.001 s
17:27:12 [2021-02-04T22:27:12.565Z] editIssueWithRepositoryId(org.eclipse.egit.github.core.tests.IssueServiceTest)  Time elapsed: 0 s
17:27:12 [2021-02-04T22:27:12.565Z] searchEscaped(org.eclipse.egit.github.core.tests.IssueServiceTest)  Time elapsed: 0 s
17:27:12 [2021-02-04T22:27:12.565Z] getCommentsEmptyId(org.eclipse.egit.github.core.tests.IssueServiceTest)  Time elapsed: 0 s
17:27:12 [2021-02-04T22:27:12.565Z] editIssueComment(org.eclipse.egit.github.core.tests.IssueServiceTest)  Time elapsed: 0.001 s
17:27:12 [2021-02-04T22:27:12.565Z] createCommentWithRepositoryId(org.eclipse.egit.github.core.tests.IssueServiceTest)  Time elapsed: 0 s
17:27:12 [2021-02-04T22:27:12.565Z] searchIssueEmptyQuery(org.eclipse.egit.github.core.tests.IssueServiceTest)  Time elapsed: 0 s
17:27:12 [2021-02-04T22:27:12.565Z] searchIssueEmptyState(org.eclipse.egit.github.core.tests.IssueServiceTest)  Time elapsed: 0 s
17:27:12 [2021-02-04T22:27:12.565Z] createIssueNullIssue(org.eclipse.egit.github.core.tests.IssueServiceTest)  Time elapsed: 0 s
17:27:12 [2021-02-04T22:27:12.565Z] getIssuesRepositoryId(org.eclipse.egit.github.core.tests.IssueServiceTest)  Time elapsed: 0.001 s
17:27:12 [2021-02-04T22:27:12.565Z] getIssues(org.eclipse.egit.github.core.tests.IssueServiceTest)  Time elapsed: 0 s
17:27:12 [2021-02-04T22:27:12.565Z] getIssueNullId(org.eclipse.egit.github.core.tests.IssueServiceTest)  Time elapsed: 0 s
17:27:12 [2021-02-04T22:27:12.565Z] editIssueCommentWithRepositoryId(org.eclipse.egit.github.core.tests.IssueServiceTest)  Time elapsed: 0 s
17:27:12 [2021-02-04T22:27:12.565Z] deleteComment(org.eclipse.egit.github.core.tests.IssueServiceTest)  Time elapsed: 0 s
17:27:12 [2021-02-04T22:27:12.566Z] pageEvents(org.eclipse.egit.github.core.tests.IssueServiceTest)  Time elapsed: 0.001 s
17:27:12 [2021-02-04T22:27:12.566Z] editIssueNullUser(org.eclipse.egit.github.core.tests.IssueServiceTest)  Time elapsed: 0 s
17:27:12 [2021-02-04T22:27:12.566Z] createCommentEmptyIssueId(org.eclipse.egit.github.core.tests.IssueServiceTest)  Time elapsed: 0 s
17:27:12 [2021-02-04T22:27:12.566Z] pageIssues(org.eclipse.egit.github.core.tests.IssueServiceTest)  Time elapsed: 0 s
17:27:12 [2021-02-04T22:27:12.566Z] createIssueNullUser(org.eclipse.egit.github.core.tests.IssueServiceTest)  Time elapsed: 0 s
17:27:12 [2021-02-04T22:27:12.566Z] getIssueEvent(org.eclipse.egit.github.core.tests.IssueServiceTest)  Time elapsed: 0 s
17:27:12 [2021-02-04T22:27:12.566Z] getIssueEmptyRepositoryName(org.eclipse.egit.github.core.tests.IssueServiceTest)  Time elapsed: 0 s
17:27:12 [2021-02-04T22:27:12.566Z] getIssuesNullRepositoryId(org.eclipse.egit.github.core.tests.IssueServiceTest)  Time elapsed: 0 s
17:27:12 [2021-02-04T22:27:12.566Z] getComments(org.eclipse.egit.github.core.tests.IssueServiceTest)  Time elapsed: 0 s
17:27:12 [2021-02-04T22:27:12.566Z] getIssuesNullRepositoryName(org.eclipse.egit.github.core.tests.IssueServiceTest)  Time elapsed: 0 s
17:27:12 [2021-02-04T22:27:12.566Z] createCommentEmptyUser(org.eclipse.egit.github.core.tests.IssueServiceTest)  Time elapsed: 0 s
17:27:12 [2021-02-04T22:27:12.566Z] deleteCommentEmptyId(org.eclipse.egit.github.core.tests.IssueServiceTest)  Time elapsed: 0.001 s
17:27:12 [2021-02-04T22:27:12.566Z] searchIssuesNullRepository(org.eclipse.egit.github.core.tests.IssueServiceTest)  Time elapsed: 0 s
17:27:12 [2021-02-04T22:27:12.566Z] pageRepsitoryIssues(org.eclipse.egit.github.core.tests.IssueServiceTest)  Time elapsed: 0 s
17:27:12 [2021-02-04T22:27:12.566Z] editIssueNullIssue(org.eclipse.egit.github.core.tests.IssueServiceTest)  Time elapsed: 0 s
17:27:12 [2021-02-04T22:27:12.566Z] getCommentsNullUser(org.eclipse.egit.github.core.tests.IssueServiceTest)  Time elapsed: 0 s
17:27:12 [2021-02-04T22:27:12.566Z] getIssue(org.eclipse.egit.github.core.tests.IssueServiceTest)  Time elapsed: 0 s
17:27:12 [2021-02-04T22:27:12.566Z] searchIssueNullQuery(org.eclipse.egit.github.core.tests.IssueServiceTest)  Time elapsed: 0.001 s
17:27:12 [2021-02-04T22:27:12.566Z] searchIssueNullState(org.eclipse.egit.github.core.tests.IssueServiceTest)  Time elapsed: 0 s
17:27:12 [2021-02-04T22:27:12.566Z] getIssuesEmptyUser(org.eclipse.egit.github.core.tests.IssueServiceTest)  Time elapsed: 0 s
17:27:12 [2021-02-04T22:27:12.566Z] getClosedAtReferenceMutableObject(org.eclipse.egit.github.core.tests.IssueTest)  Time elapsed: 0 s
17:27:12 [2021-02-04T22:27:12.566Z] updateFields(org.eclipse.egit.github.core.tests.IssueTest)  Time elapsed: 0.001 s
17:27:12 [2021-02-04T22:27:12.566Z] defaultState(org.eclipse.egit.github.core.tests.IssueTest)  Time elapsed: 0 s
17:27:12 [2021-02-04T22:27:12.566Z] getCreatedAtReferenceMutableObject(org.eclipse.egit.github.core.tests.IssueTest)  Time elapsed: 0 s
17:27:12 [2021-02-04T22:27:12.566Z] getUpdatedAtReferenceMutableObject(org.eclipse.egit.github.core.tests.IssueTest)  Time elapsed: 0 s
17:27:12 [2021-02-04T22:27:12.566Z] updateFields(org.eclipse.egit.github.core.tests.IssuesPayloadTest)  Time elapsed: 0 s
17:27:12 [2021-02-04T22:27:12.566Z] defaultState(org.eclipse.egit.github.core.tests.IssuesPayloadTest)  Time elapsed: 0 s
17:27:12 [2021-02-04T22:27:12.566Z] updateFields(org.eclipse.egit.github.core.tests.KeyTest)  Time elapsed: 0 s
17:27:12 [2021-02-04T22:27:12.566Z] defaultState(org.eclipse.egit.github.core.tests.KeyTest)  Time elapsed: 0 s
17:27:12 [2021-02-04T22:27:12.566Z] compareLabels(org.eclipse.egit.github.core.tests.LabelComparatorTest)  Time elapsed: 0 s
17:27:12 [2021-02-04T22:27:12.566Z] getLabelsNullUser(org.eclipse.egit.github.core.tests.LabelServiceTest)  Time elapsed: 0.001 s
17:27:12 [2021-02-04T22:27:12.566Z] setLabelsNullIssueId(org.eclipse.egit.github.core.tests.LabelServiceTest)  Time elapsed: 0 s
17:27:12 [2021-02-04T22:27:12.566Z] editLabel(org.eclipse.egit.github.core.tests.LabelServiceTest)  Time elapsed: 0 s
17:27:12 [2021-02-04T22:27:12.566Z] editLabelNullLabelName(org.eclipse.egit.github.core.tests.LabelServiceTest)  Time elapsed: 0 s
17:27:12 [2021-02-04T22:27:12.566Z] getEmptyUser(org.eclipse.egit.github.core.tests.LabelServiceTest)  Time elapsed: 0 s
17:27:12 [2021-02-04T22:27:12.566Z] getEmptyLabel(org.eclipse.egit.github.core.tests.LabelServiceTest)  Time elapsed: 0.001 s
17:27:12 [2021-02-04T22:27:12.566Z] getLabelWithRepositoryId(org.eclipse.egit.github.core.tests.LabelServiceTest)  Time elapsed: 0 s
17:27:12 [2021-02-04T22:27:12.566Z] deleteLabel(org.eclipse.egit.github.core.tests.LabelServiceTest)  Time elapsed: 0 s
17:27:12 [2021-02-04T22:27:12.566Z] getLabelsNullRepositoryName(org.eclipse.egit.github.core.tests.LabelServiceTest)  Time elapsed: 0 s
17:27:12 [2021-02-04T22:27:12.566Z] createLabelNullLabel(org.eclipse.egit.github.core.tests.LabelServiceTest)  Time elapsed: 0 s
17:27:12 [2021-02-04T22:27:12.566Z] constructorNullArgument(org.eclipse.egit.github.core.tests.LabelServiceTest)  Time elapsed: 0.001 s
17:27:12 [2021-02-04T22:27:12.566Z] deleteEmptyUser(org.eclipse.egit.github.core.tests.LabelServiceTest)  Time elapsed: 0 s
17:27:12 [2021-02-04T22:27:12.566Z] getEmptyRepositoryName(org.eclipse.egit.github.core.tests.LabelServiceTest)  Time elapsed: 0 s
17:27:12 [2021-02-04T22:27:12.566Z] createLabel(org.eclipse.egit.github.core.tests.LabelServiceTest)  Time elapsed: 0 s
17:27:12 [2021-02-04T22:27:12.566Z] setLabelsEmptyIssueId(org.eclipse.egit.github.core.tests.LabelServiceTest)  Time elapsed: 0 s
17:27:12 [2021-02-04T22:27:12.566Z] defaultConstuctor(org.eclipse.egit.github.core.tests.LabelServiceTest)  Time elapsed: 0.001 s
17:27:12 [2021-02-04T22:27:12.566Z] getNullUser(org.eclipse.egit.github.core.tests.LabelServiceTest)  Time elapsed: 0 s
17:27:12 [2021-02-04T22:27:12.566Z] setLabelsNullLabels(org.eclipse.egit.github.core.tests.LabelServiceTest)  Time elapsed: 0.001 s
17:27:12 [2021-02-04T22:27:12.566Z] deleteNullUser(org.eclipse.egit.github.core.tests.LabelServiceTest)  Time elapsed: 0 s
17:27:12 [2021-02-04T22:27:12.566Z] deleteNullRepositoryName(org.eclipse.egit.github.core.tests.LabelServiceTest)  Time elapsed: 0 s
17:27:12 [2021-02-04T22:27:12.566Z] setLabels(org.eclipse.egit.github.core.tests.LabelServiceTest)  Time elapsed: 0 s
17:27:12 [2021-02-04T22:27:12.566Z] deleteLabelWithRepositoryId(org.eclipse.egit.github.core.tests.LabelServiceTest)  Time elapsed: 0 s
17:27:12 [2021-02-04T22:27:12.566Z] getLabels(org.eclipse.egit.github.core.tests.LabelServiceTest)  Time elapsed: 0.001 s
17:27:12 [2021-02-04T22:27:12.566Z] editLabelNullLabel(org.eclipse.egit.github.core.tests.LabelServiceTest)  Time elapsed: 0 s
17:27:12 [2021-02-04T22:27:12.566Z] getNullRepositoryName(org.eclipse.egit.github.core.tests.LabelServiceTest)  Time elapsed: 0 s
17:27:12 [2021-02-04T22:27:12.566Z] getLabelsWithRepositoryId(org.eclipse.egit.github.core.tests.LabelServiceTest)  Time elapsed: 0 s
17:27:12 [2021-02-04T22:27:12.566Z] getNullLabel(org.eclipse.egit.github.core.tests.LabelServiceTest)  Time elapsed: 0.001 s
17:27:12 [2021-02-04T22:27:12.566Z] setLabelsNullUser(org.eclipse.egit.github.core.tests.LabelServiceTest)  Time elapsed: 0 s
17:27:12 [2021-02-04T22:27:12.566Z] editLabelEmptyLabelName(org.eclipse.egit.github.core.tests.LabelServiceTest)  Time elapsed: 0 s
17:27:12 [2021-02-04T22:27:12.566Z] deleteEmptyRepositoryName(org.eclipse.egit.github.core.tests.LabelServiceTest)  Time elapsed: 0 s
17:27:12 [2021-02-04T22:27:12.566Z] createLabelNullRepositoryName(org.eclipse.egit.github.core.tests.LabelServiceTest)  Time elapsed: 0 s
17:27:12 [2021-02-04T22:27:12.566Z] deleteEmptyLabel(org.eclipse.egit.github.core.tests.LabelServiceTest)  Time elapsed: 0 s
17:27:12 [2021-02-04T22:27:12.566Z] setLabelsWithRepositoryId(org.eclipse.egit.github.core.tests.LabelServiceTest)  Time elapsed: 0.001 s
17:27:12 [2021-02-04T22:27:12.566Z] createLabelNullUser(org.eclipse.egit.github.core.tests.LabelServiceTest)  Time elapsed: 0 s
17:27:12 [2021-02-04T22:27:12.566Z] deleteNullLabel(org.eclipse.egit.github.core.tests.LabelServiceTest)  Time elapsed: 0 s
17:27:12 [2021-02-04T22:27:12.566Z] setLabelsNullRepositoryName(org.eclipse.egit.github.core.tests.LabelServiceTest)  Time elapsed: 0 s
17:27:12 [2021-02-04T22:27:12.566Z] createLabelWithRepositoryId(org.eclipse.egit.github.core.tests.LabelServiceTest)  Time elapsed: 0 s
17:27:12 [2021-02-04T22:27:12.566Z] getLabel(org.eclipse.egit.github.core.tests.LabelServiceTest)  Time elapsed: 0 s
17:27:12 [2021-02-04T22:27:12.566Z] updateFields(org.eclipse.egit.github.core.tests.LabelTest)  Time elapsed: 0 s
17:27:12 [2021-02-04T22:27:12.566Z] defaultState(org.eclipse.egit.github.core.tests.LabelTest)  Time elapsed: 0 s
17:27:12 [2021-02-04T22:27:12.566Z] equality(org.eclipse.egit.github.core.tests.LabelTest)  Time elapsed: 0 s
17:27:12 [2021-02-04T22:27:12.566Z] languages(org.eclipse.egit.github.core.tests.LanguagesTest)  Time elapsed: 0.005 s
17:27:12 [2021-02-04T22:27:12.566Z] getRepositoryHtml(org.eclipse.egit.github.core.tests.MarkdownServiceTest)  Time elapsed: 0 s
17:27:12 [2021-02-04T22:27:12.566Z] getHtml(org.eclipse.egit.github.core.tests.MarkdownServiceTest)  Time elapsed: 0.001 s
17:27:12 [2021-02-04T22:27:12.567Z] getRepositoryHtmlNullRepository(org.eclipse.egit.github.core.tests.MarkdownServiceTest)  Time elapsed: 0 s
17:27:12 [2021-02-04T22:27:12.567Z] updateFields(org.eclipse.egit.github.core.tests.MemberPayloadTest)  Time elapsed: 0 s
17:27:12 [2021-02-04T22:27:12.567Z] defaultState(org.eclipse.egit.github.core.tests.MemberPayloadTest)  Time elapsed: 0 s
17:27:12 [2021-02-04T22:27:12.567Z] updateFields(org.eclipse.egit.github.core.tests.MergeStatusTest)  Time elapsed: 0 s
17:27:12 [2021-02-04T22:27:12.567Z] defaultState(org.eclipse.egit.github.core.tests.MergeStatusTest)  Time elapsed: 0 s
17:27:12 [2021-02-04T22:27:12.567Z] compareMilestones(org.eclipse.egit.github.core.tests.MilestoneComparatorTest)  Time elapsed: 0.001 s
17:27:12 [2021-02-04T22:27:12.567Z] deleteMilestoneNullUser(org.eclipse.egit.github.core.tests.MilestoneServiceTest)  Time elapsed: 0 s
17:27:12 [2021-02-04T22:27:12.567Z] editMilestoneDescription(org.eclipse.egit.github.core.tests.MilestoneServiceTest)  Time elapsed: 0.001 s
17:27:12 [2021-02-04T22:27:12.567Z] createMilestoneEmptyRepositoryName(org.eclipse.egit.github.core.tests.MilestoneServiceTest)  Time elapsed: 0 s
17:27:12 [2021-02-04T22:27:12.567Z] editMilestoneFull(org.eclipse.egit.github.core.tests.MilestoneServiceTest)  Time elapsed: 0.001 s
17:27:12 [2021-02-04T22:27:12.567Z] getMilestonesEmptyUser(org.eclipse.egit.github.core.tests.MilestoneServiceTest)  Time elapsed: 0 s
17:27:12 [2021-02-04T22:27:12.567Z] createMilestoneEmptyUser(org.eclipse.egit.github.core.tests.MilestoneServiceTest)  Time elapsed: 0.001 s
17:27:12 [2021-02-04T22:27:12.567Z] createMilestoneFull(org.eclipse.egit.github.core.tests.MilestoneServiceTest)  Time elapsed: 0 s
17:27:12 [2021-02-04T22:27:12.567Z] createMilestoneOpen(org.eclipse.egit.github.core.tests.MilestoneServiceTest)  Time elapsed: 0 s
17:27:12 [2021-02-04T22:27:12.567Z] editMilestoneEmptyMilestone(org.eclipse.egit.github.core.tests.MilestoneServiceTest)  Time elapsed: 0 s
17:27:12 [2021-02-04T22:27:12.567Z] createMilestoneNullRepositoryName(org.eclipse.egit.github.core.tests.MilestoneServiceTest)  Time elapsed: 0.001 s
17:27:12 [2021-02-04T22:27:12.567Z] deleteMilestoneEmptyUser(org.eclipse.egit.github.core.tests.MilestoneServiceTest)  Time elapsed: 0 s
17:27:12 [2021-02-04T22:27:12.567Z] getMilestone(org.eclipse.egit.github.core.tests.MilestoneServiceTest)  Time elapsed: 0 s
17:27:12 [2021-02-04T22:27:12.567Z] createMilestoneEmptyMilestone(org.eclipse.egit.github.core.tests.MilestoneServiceTest)  Time elapsed: 0 s
17:27:12 [2021-02-04T22:27:12.567Z] constructorNullArgument(org.eclipse.egit.github.core.tests.MilestoneServiceTest)  Time elapsed: 0 s
17:27:12 [2021-02-04T22:27:12.567Z] getMilestoneEmptyUser(org.eclipse.egit.github.core.tests.MilestoneServiceTest)  Time elapsed: 0 s
17:27:12 [2021-02-04T22:27:12.567Z] getMilestoneNullRepositoryName(org.eclipse.egit.github.core.tests.MilestoneServiceTest)  Time elapsed: 0 s
17:27:12 [2021-02-04T22:27:12.567Z] getMilestonesEmptyRepositoryName(org.eclipse.egit.github.core.tests.MilestoneServiceTest)  Time elapsed: 0 s
17:27:12 [2021-02-04T22:27:12.567Z] deleteMilestoneNullRepositoryName(org.eclipse.egit.github.core.tests.MilestoneServiceTest)  Time elapsed: 0 s
17:27:12 [2021-02-04T22:27:12.567Z] getMilestonesNullUser(org.eclipse.egit.github.core.tests.MilestoneServiceTest)  Time elapsed: 0 s
17:27:12 [2021-02-04T22:27:12.567Z] defaultConstructor(org.eclipse.egit.github.core.tests.MilestoneServiceTest)  Time elapsed: 0.001 s
17:27:12 [2021-02-04T22:27:12.567Z] deleteMilestone(org.eclipse.egit.github.core.tests.MilestoneServiceTest)  Time elapsed: 0 s
17:27:12 [2021-02-04T22:27:12.567Z] getMilestoneEmptyRepositoryName(org.eclipse.egit.github.core.tests.MilestoneServiceTest)  Time elapsed: 0 s
17:27:12 [2021-02-04T22:27:12.567Z] createMilestoneNullMilestone(org.eclipse.egit.github.core.tests.MilestoneServiceTest)  Time elapsed: 0 s
17:27:12 [2021-02-04T22:27:12.567Z] editMilestone(org.eclipse.egit.github.core.tests.MilestoneServiceTest)  Time elapsed: 0 s
17:27:12 [2021-02-04T22:27:12.567Z] createMilestoneNullUser(org.eclipse.egit.github.core.tests.MilestoneServiceTest)  Time elapsed: 0 s
17:27:12 [2021-02-04T22:27:12.567Z] createMilestoneInvalidState(org.eclipse.egit.github.core.tests.MilestoneServiceTest)  Time elapsed: 0 s
17:27:12 [2021-02-04T22:27:12.567Z] getMilestonesNullRepositoryName(org.eclipse.egit.github.core.tests.MilestoneServiceTest)  Time elapsed: 0 s
17:27:12 [2021-02-04T22:27:12.567Z] getMilestonesNullState(org.eclipse.egit.github.core.tests.MilestoneServiceTest)  Time elapsed: 0 s
17:27:12 [2021-02-04T22:27:12.567Z] getMilestoneWithRepositoryId(org.eclipse.egit.github.core.tests.MilestoneServiceTest)  Time elapsed: 0 s
17:27:12 [2021-02-04T22:27:12.567Z] getMilestonesOpenStateWithRepositoryId(org.eclipse.egit.github.core.tests.MilestoneServiceTest)  Time elapsed: 0 s
17:27:12 [2021-02-04T22:27:12.567Z] deleteMilestoneNullMilestone(org.eclipse.egit.github.core.tests.MilestoneServiceTest)  Time elapsed: 0 s
17:27:12 [2021-02-04T22:27:12.567Z] getMilestonesOpenState(org.eclipse.egit.github.core.tests.MilestoneServiceTest)  Time elapsed: 0 s
17:27:12 [2021-02-04T22:27:12.567Z] deleteMilestoneEmptyMilestone(org.eclipse.egit.github.core.tests.MilestoneServiceTest)  Time elapsed: 0 s
17:27:12 [2021-02-04T22:27:12.567Z] createMilestoneNoTitle(org.eclipse.egit.github.core.tests.MilestoneServiceTest)  Time elapsed: 0 s
17:27:12 [2021-02-04T22:27:12.567Z] createMilestoneClosed(org.eclipse.egit.github.core.tests.MilestoneServiceTest)  Time elapsed: 0 s
17:27:12 [2021-02-04T22:27:12.567Z] getMilestoneNullId(org.eclipse.egit.github.core.tests.MilestoneServiceTest)  Time elapsed: 0.001 s
17:27:12 [2021-02-04T22:27:12.567Z] createMilestone(org.eclipse.egit.github.core.tests.MilestoneServiceTest)  Time elapsed: 0 s
17:27:12 [2021-02-04T22:27:12.567Z] getMilestoneNullUser(org.eclipse.egit.github.core.tests.MilestoneServiceTest)  Time elapsed: 0 s
17:27:12 [2021-02-04T22:27:12.567Z] deleteMilestoneWithRepositoryId(org.eclipse.egit.github.core.tests.MilestoneServiceTest)  Time elapsed: 0 s
17:27:12 [2021-02-04T22:27:12.567Z] deleteMilestoneEmptyRepositoryName(org.eclipse.egit.github.core.tests.MilestoneServiceTest)  Time elapsed: 0 s
17:27:12 [2021-02-04T22:27:12.567Z] getMilestoneEmptyId(org.eclipse.egit.github.core.tests.MilestoneServiceTest)  Time elapsed: 0.001 s
17:27:12 [2021-02-04T22:27:12.567Z] createMilestoneWithRepositoryId(org.eclipse.egit.github.core.tests.MilestoneServiceTest)  Time elapsed: 0 s
17:27:12 [2021-02-04T22:27:12.567Z] editMilestoneNullMilestone(org.eclipse.egit.github.core.tests.MilestoneServiceTest)  Time elapsed: 0 s
17:27:12 [2021-02-04T22:27:12.567Z] setDueOnReferenceMutableObject(org.eclipse.egit.github.core.tests.MilestoneTest)  Time elapsed: 0 s
17:27:12 [2021-02-04T22:27:12.567Z] updateFields(org.eclipse.egit.github.core.tests.MilestoneTest)  Time elapsed: 0 s
17:27:12 [2021-02-04T22:27:12.567Z] getDueOn_ReferenceMutableObject(org.eclipse.egit.github.core.tests.MilestoneTest)  Time elapsed: 0 s
17:27:12 [2021-02-04T22:27:12.567Z] defaultState(org.eclipse.egit.github.core.tests.MilestoneTest)  Time elapsed: 0 s
17:27:12 [2021-02-04T22:27:12.567Z] getCreatedAtReferenceMutableObject(org.eclipse.egit.github.core.tests.MilestoneTest)  Time elapsed: 0 s
17:27:12 [2021-02-04T22:27:12.567Z] deleteAuthorization(org.eclipse.egit.github.core.tests.OAuthServiceTest)  Time elapsed: 0.001 s
17:27:12 [2021-02-04T22:27:12.567Z] removeScopes(org.eclipse.egit.github.core.tests.OAuthServiceTest)  Time elapsed: 0 s
17:27:12 [2021-02-04T22:27:12.567Z] constructorNullArgument(org.eclipse.egit.github.core.tests.OAuthServiceTest)  Time elapsed: 0 s
17:27:12 [2021-02-04T22:27:12.567Z] defaultConstructor(org.eclipse.egit.github.core.tests.OAuthServiceTest)  Time elapsed: 0 s
17:27:12 [2021-02-04T22:27:12.567Z] getAuthorizations(org.eclipse.egit.github.core.tests.OAuthServiceTest)  Time elapsed: 0.001 s
17:27:12 [2021-02-04T22:27:12.567Z] addScopes(org.eclipse.egit.github.core.tests.OAuthServiceTest)  Time elapsed: 0 s
17:27:12 [2021-02-04T22:27:12.567Z] createAuthorization(org.eclipse.egit.github.core.tests.OAuthServiceTest)  Time elapsed: 0 s
17:27:12 [2021-02-04T22:27:12.567Z] setScopes(org.eclipse.egit.github.core.tests.OAuthServiceTest)  Time elapsed: 0 s
17:27:12 [2021-02-04T22:27:12.567Z] getAuthorization(org.eclipse.egit.github.core.tests.OAuthServiceTest)  Time elapsed: 0 s
17:27:12 [2021-02-04T22:27:12.567Z] showMembershipEmptyName(org.eclipse.egit.github.core.tests.OrganizationServiceTest)  Time elapsed: 0 s
17:27:12 [2021-02-04T22:27:12.567Z] showMembershipEmptyUser(org.eclipse.egit.github.core.tests.OrganizationServiceTest)  Time elapsed: 0 s
17:27:12 [2021-02-04T22:27:12.567Z] getMembersAll(org.eclipse.egit.github.core.tests.OrganizationServiceTest)  Time elapsed: 0.001 s
17:27:12 [2021-02-04T22:27:12.567Z] constructor(org.eclipse.egit.github.core.tests.OrganizationServiceTest)  Time elapsed: 0 s
17:27:12 [2021-02-04T22:27:12.567Z] getOrganization(org.eclipse.egit.github.core.tests.OrganizationServiceTest)  Time elapsed: 0 s
17:27:12 [2021-02-04T22:27:12.567Z] removeMemberNullName(org.eclipse.egit.github.core.tests.OrganizationServiceTest)  Time elapsed: 0 s
17:27:12 [2021-02-04T22:27:12.567Z] removeMemberNullUser(org.eclipse.egit.github.core.tests.OrganizationServiceTest)  Time elapsed: 0.001 s
17:27:12 [2021-02-04T22:27:12.568Z] isMemberEmptyName(org.eclipse.egit.github.core.tests.OrganizationServiceTest)  Time elapsed: 0 s
17:27:12 [2021-02-04T22:27:12.568Z] isMemberEmptyUser(org.eclipse.egit.github.core.tests.OrganizationServiceTest)  Time elapsed: 0 s
17:27:12 [2021-02-04T22:27:12.568Z] hideMembershipNullName(org.eclipse.egit.github.core.tests.OrganizationServiceTest)  Time elapsed: 0 s
17:27:12 [2021-02-04T22:27:12.568Z] hideMembershipNullUser(org.eclipse.egit.github.core.tests.OrganizationServiceTest)  Time elapsed: 0 s
17:27:12 [2021-02-04T22:27:12.568Z] getCurrentUserOrganizations(org.eclipse.egit.github.core.tests.OrganizationServiceTest)  Time elapsed: 0.001 s
17:27:12 [2021-02-04T22:27:12.568Z] getPublicMembersNullName(org.eclipse.egit.github.core.tests.OrganizationServiceTest)  Time elapsed: 0 s
17:27:12 [2021-02-04T22:27:12.568Z] removeMember(org.eclipse.egit.github.core.tests.OrganizationServiceTest)  Time elapsed: 0 s
17:27:12 [2021-02-04T22:27:12.568Z] getMembersEmptyName(org.eclipse.egit.github.core.tests.OrganizationServiceTest)  Time elapsed: 0 s
17:27:12 [2021-02-04T22:27:12.568Z] editOrganizationNullOrgName(org.eclipse.egit.github.core.tests.OrganizationServiceTest)  Time elapsed: 0.001 s
17:27:12 [2021-02-04T22:27:12.568Z] showMembershipNullName(org.eclipse.egit.github.core.tests.OrganizationServiceTest)  Time elapsed: 0 s
17:27:12 [2021-02-04T22:27:12.568Z] showMembershipNullUser(org.eclipse.egit.github.core.tests.OrganizationServiceTest)  Time elapsed: 0 s
17:27:12 [2021-02-04T22:27:12.568Z] getOrganizationNullName(org.eclipse.egit.github.core.tests.OrganizationServiceTest)  Time elapsed: 0 s
17:27:12 [2021-02-04T22:27:12.568Z] isPublicMember(org.eclipse.egit.github.core.tests.OrganizationServiceTest)  Time elapsed: 0 s
17:27:12 [2021-02-04T22:27:12.568Z] isMember(org.eclipse.egit.github.core.tests.OrganizationServiceTest)  Time elapsed: 0 s
17:27:12 [2021-02-04T22:27:12.568Z] getOrganizationsEmptyUser(org.eclipse.egit.github.core.tests.OrganizationServiceTest)  Time elapsed: 0 s
17:27:12 [2021-02-04T22:27:12.568Z] isPublicMemberEmptyName(org.eclipse.egit.github.core.tests.OrganizationServiceTest)  Time elapsed: 0 s
17:27:12 [2021-02-04T22:27:12.568Z] isPublicMemberEmptyUser(org.eclipse.egit.github.core.tests.OrganizationServiceTest)  Time elapsed: 0 s
17:27:12 [2021-02-04T22:27:12.568Z] isPublicMemberNullName(org.eclipse.egit.github.core.tests.OrganizationServiceTest)  Time elapsed: 0 s
17:27:12 [2021-02-04T22:27:12.568Z] isPublicMemberNullUser(org.eclipse.egit.github.core.tests.OrganizationServiceTest)  Time elapsed: 0 s
17:27:12 [2021-02-04T22:27:12.568Z] showMembership(org.eclipse.egit.github.core.tests.OrganizationServiceTest)  Time elapsed: 0 s
17:27:12 [2021-02-04T22:27:12.568Z] editOrganizationEmptyOrgName(org.eclipse.egit.github.core.tests.OrganizationServiceTest)  Time elapsed: 0 s
17:27:12 [2021-02-04T22:27:12.568Z] hideMembershipEmptyName(org.eclipse.egit.github.core.tests.OrganizationServiceTest)  Time elapsed: 0.001 s
17:27:12 [2021-02-04T22:27:12.568Z] hideMembershipEmptyUser(org.eclipse.egit.github.core.tests.OrganizationServiceTest)  Time elapsed: 0 s
17:27:12 [2021-02-04T22:27:12.568Z] editOrganization(org.eclipse.egit.github.core.tests.OrganizationServiceTest)  Time elapsed: 0 s
17:27:12 [2021-02-04T22:27:12.568Z] isMemberNullName(org.eclipse.egit.github.core.tests.OrganizationServiceTest)  Time elapsed: 0 s
17:27:12 [2021-02-04T22:27:12.568Z] isMemberNullUser(org.eclipse.egit.github.core.tests.OrganizationServiceTest)  Time elapsed: 0 s
17:27:12 [2021-02-04T22:27:12.568Z] editOrganizationNullOrg(org.eclipse.egit.github.core.tests.OrganizationServiceTest)  Time elapsed: 0 s
17:27:12 [2021-02-04T22:27:12.568Z] getOrganizations(org.eclipse.egit.github.core.tests.OrganizationServiceTest)  Time elapsed: 0.001 s
17:27:12 [2021-02-04T22:27:12.568Z] getPublicMembers(org.eclipse.egit.github.core.tests.OrganizationServiceTest)  Time elapsed: 0 s
17:27:12 [2021-02-04T22:27:12.568Z] getPublicMembersEmptyName(org.eclipse.egit.github.core.tests.OrganizationServiceTest)  Time elapsed: 0 s
17:27:12 [2021-02-04T22:27:12.568Z] removeMemberEmptyName(org.eclipse.egit.github.core.tests.OrganizationServiceTest)  Time elapsed: 0 s
17:27:12 [2021-02-04T22:27:12.568Z] removeMemberEmptyUser(org.eclipse.egit.github.core.tests.OrganizationServiceTest)  Time elapsed: 0 s
17:27:12 [2021-02-04T22:27:12.568Z] getMembersMember(org.eclipse.egit.github.core.tests.OrganizationServiceTest)  Time elapsed: 0 s
17:27:12 [2021-02-04T22:27:12.568Z] getOrganizationEmptyName(org.eclipse.egit.github.core.tests.OrganizationServiceTest)  Time elapsed: 0 s
17:27:12 [2021-02-04T22:27:12.568Z] getOrganizationsNullUser(org.eclipse.egit.github.core.tests.OrganizationServiceTest)  Time elapsed: 0 s
17:27:12 [2021-02-04T22:27:12.568Z] getMembers(org.eclipse.egit.github.core.tests.OrganizationServiceTest)  Time elapsed: 0 s
17:27:12 [2021-02-04T22:27:12.568Z] getMembersNullName(org.eclipse.egit.github.core.tests.OrganizationServiceTest)  Time elapsed: 0 s
17:27:12 [2021-02-04T22:27:12.568Z] hideMembership(org.eclipse.egit.github.core.tests.OrganizationServiceTest)  Time elapsed: 0.001 s
17:27:12 [2021-02-04T22:27:12.568Z] getMembersAdmin(org.eclipse.egit.github.core.tests.OrganizationServiceTest)  Time elapsed: 0 s
17:27:12 [2021-02-04T22:27:12.568Z] defaultState(org.eclipse.egit.github.core.tests.PagedRequestTest)  Time elapsed: 0 s
17:27:12 [2021-02-04T22:27:12.568Z] updateFields(org.eclipse.egit.github.core.tests.PullRequestMarkerTest)  Time elapsed: 0 s
17:27:12 [2021-02-04T22:27:12.568Z] defaultState(org.eclipse.egit.github.core.tests.PullRequestMarkerTest)  Time elapsed: 0 s
17:27:12 [2021-02-04T22:27:12.568Z] updateFields(org.eclipse.egit.github.core.tests.PullRequestPayloadTest)  Time elapsed: 0 s
17:27:12 [2021-02-04T22:27:12.568Z] defaultState(org.eclipse.egit.github.core.tests.PullRequestPayloadTest)  Time elapsed: 0 s
17:27:12 [2021-02-04T22:27:12.568Z] updateFields(org.eclipse.egit.github.core.tests.PullRequestReviewCommentPayloadTest)  Time elapsed: 0 s
17:27:12 [2021-02-04T22:27:12.568Z] defaultState(org.eclipse.egit.github.core.tests.PullRequestReviewCommentPayloadTest)  Time elapsed: 0 s
17:27:12 [2021-02-04T22:27:12.568Z] getPullRequestNullRepository(org.eclipse.egit.github.core.tests.PullRequestServiceTest)  Time elapsed: 0 s
17:27:12 [2021-02-04T22:27:12.568Z] replyToComment(org.eclipse.egit.github.core.tests.PullRequestServiceTest)  Time elapsed: 0 s
17:27:12 [2021-02-04T22:27:12.568Z] constructor(org.eclipse.egit.github.core.tests.PullRequestServiceTest)  Time elapsed: 0.001 s
17:27:12 [2021-02-04T22:27:12.568Z] getPullRequest(org.eclipse.egit.github.core.tests.PullRequestServiceTest)  Time elapsed: 0 s
17:27:12 [2021-02-04T22:27:12.568Z] editComment(org.eclipse.egit.github.core.tests.PullRequestServiceTest)  Time elapsed: 0 s
17:27:12 [2021-02-04T22:27:12.568Z] getPullRequestsNullRepository(org.eclipse.egit.github.core.tests.PullRequestServiceTest)  Time elapsed: 0 s
17:27:12 [2021-02-04T22:27:12.568Z] createComment(org.eclipse.egit.github.core.tests.PullRequestServiceTest)  Time elapsed: 0 s
17:27:12 [2021-02-04T22:27:12.568Z] constructorNullArgument(org.eclipse.egit.github.core.tests.PullRequestServiceTest)  Time elapsed: 0.001 s
17:27:12 [2021-02-04T22:27:12.568Z] editPullRequestNullRequest(org.eclipse.egit.github.core.tests.PullRequestServiceTest)  Time elapsed: 0 s
17:27:12 [2021-02-04T22:27:12.568Z] getPullRequestsNullRepositoryId(org.eclipse.egit.github.core.tests.PullRequestServiceTest)  Time elapsed: 0 s
17:27:12 [2021-02-04T22:27:12.568Z] createPullRequestFromIssue(org.eclipse.egit.github.core.tests.PullRequestServiceTest)  Time elapsed: 0 s
17:27:12 [2021-02-04T22:27:12.568Z] isMerged(org.eclipse.egit.github.core.tests.PullRequestServiceTest)  Time elapsed: 0 s
17:27:12 [2021-02-04T22:27:12.568Z] createPullRequest(org.eclipse.egit.github.core.tests.PullRequestServiceTest)  Time elapsed: 0.001 s
17:27:12 [2021-02-04T22:27:12.568Z] editCommentNullComment(org.eclipse.egit.github.core.tests.PullRequestServiceTest)  Time elapsed: 0 s
17:27:12 [2021-02-04T22:27:12.568Z] merge(org.eclipse.egit.github.core.tests.PullRequestServiceTest)  Time elapsed: 0 s
17:27:12 [2021-02-04T22:27:12.569Z] deleteComment(org.eclipse.egit.github.core.tests.PullRequestServiceTest)  Time elapsed: 0 s
17:27:12 [2021-02-04T22:27:12.569Z] editPullRequest(org.eclipse.egit.github.core.tests.PullRequestServiceTest)  Time elapsed: 0 s
17:27:12 [2021-02-04T22:27:12.569Z] getPullRequests(org.eclipse.egit.github.core.tests.PullRequestServiceTest)  Time elapsed: 0 s
17:27:12 [2021-02-04T22:27:12.569Z] getComments(org.eclipse.egit.github.core.tests.PullRequestServiceTest)  Time elapsed: 0 s
17:27:12 [2021-02-04T22:27:12.569Z] getFiles(org.eclipse.egit.github.core.tests.PullRequestServiceTest)  Time elapsed: 0.001 s
17:27:12 [2021-02-04T22:27:12.569Z] getComment(org.eclipse.egit.github.core.tests.PullRequestServiceTest)  Time elapsed: 0 s
17:27:12 [2021-02-04T22:27:12.569Z] getCommits(org.eclipse.egit.github.core.tests.PullRequestServiceTest)  Time elapsed: 0 s
17:27:12 [2021-02-04T22:27:12.569Z] getClosedAtReferenceMutableObject(org.eclipse.egit.github.core.tests.PullRequestTest)  Time elapsed: 0 s
17:27:12 [2021-02-04T22:27:12.569Z] getMergedAtReferenceMutableObject(org.eclipse.egit.github.core.tests.PullRequestTest)  Time elapsed: 0 s
17:27:12 [2021-02-04T22:27:12.569Z] updateFields(org.eclipse.egit.github.core.tests.PullRequestTest)  Time elapsed: 0 s
17:27:12 [2021-02-04T22:27:12.569Z] defaultState(org.eclipse.egit.github.core.tests.PullRequestTest)  Time elapsed: 0 s
17:27:12 [2021-02-04T22:27:12.569Z] getCreatedAtReferenceMutableObject(org.eclipse.egit.github.core.tests.PullRequestTest)  Time elapsed: 0 s
17:27:12 [2021-02-04T22:27:12.569Z] getUpdatedAtReferenceMutableObject(org.eclipse.egit.github.core.tests.PullRequestTest)  Time elapsed: 0 s
17:27:12 [2021-02-04T22:27:12.569Z] updateFields(org.eclipse.egit.github.core.tests.PushPayloadTest)  Time elapsed: 0 s
17:27:12 [2021-02-04T22:27:12.569Z] defaultState(org.eclipse.egit.github.core.tests.PushPayloadTest)  Time elapsed: 0 s
17:27:12 [2021-02-04T22:27:12.569Z] updateFields(org.eclipse.egit.github.core.tests.ReferenceTest)  Time elapsed: 0 s
17:27:12 [2021-02-04T22:27:12.569Z] defaultState(org.eclipse.egit.github.core.tests.ReferenceTest)  Time elapsed: 0 s
17:27:12 [2021-02-04T22:27:12.569Z] updateFields(org.eclipse.egit.github.core.tests.RepositoryBranchTest)  Time elapsed: 0 s
17:27:12 [2021-02-04T22:27:12.569Z] defaultState(org.eclipse.egit.github.core.tests.RepositoryBranchTest)  Time elapsed: 0 s
17:27:12 [2021-02-04T22:27:12.569Z] updateFields(org.eclipse.egit.github.core.tests.RepositoryCommitCompareTest)  Time elapsed: 0.001 s
17:27:12 [2021-02-04T22:27:12.569Z] defaultState(org.eclipse.egit.github.core.tests.RepositoryCommitCompareTest)  Time elapsed: 0 s
17:27:12 [2021-02-04T22:27:12.569Z] updateFields(org.eclipse.egit.github.core.tests.RepositoryCommitTest)  Time elapsed: 0 s
17:27:12 [2021-02-04T22:27:12.569Z] defaultState(org.eclipse.egit.github.core.tests.RepositoryCommitTest)  Time elapsed: 0 s
17:27:12 [2021-02-04T22:27:12.569Z] updateFields(org.eclipse.egit.github.core.tests.RepositoryContentsTest)  Time elapsed: 0 s
17:27:12 [2021-02-04T22:27:12.569Z] defaultState(org.eclipse.egit.github.core.tests.RepositoryContentsTest)  Time elapsed: 0 s
17:27:12 [2021-02-04T22:27:12.569Z] updateFields(org.eclipse.egit.github.core.tests.RepositoryHookResponseTest)  Time elapsed: 0 s
17:27:12 [2021-02-04T22:27:12.569Z] defaultState(org.eclipse.egit.github.core.tests.RepositoryHookResponseTest)  Time elapsed: 0 s
17:27:12 [2021-02-04T22:27:12.569Z] updateFields(org.eclipse.egit.github.core.tests.RepositoryHookTest)  Time elapsed: 0 s
17:27:12 [2021-02-04T22:27:12.569Z] defaultState(org.eclipse.egit.github.core.tests.RepositoryHookTest)  Time elapsed: 0 s
17:27:12 [2021-02-04T22:27:12.569Z] createFromNullString(org.eclipse.egit.github.core.tests.RepositoryIdTest)  Time elapsed: 0 s
17:27:12 [2021-02-04T22:27:12.569Z] create(org.eclipse.egit.github.core.tests.RepositoryIdTest)  Time elapsed: 0 s
17:27:12 [2021-02-04T22:27:12.569Z] createFromEmptyString(org.eclipse.egit.github.core.tests.RepositoryIdTest)  Time elapsed: 0 s
17:27:12 [2021-02-04T22:27:12.569Z] createFromNullUrl(org.eclipse.egit.github.core.tests.RepositoryIdTest)  Time elapsed: 0 s
17:27:12 [2021-02-04T22:27:12.569Z] createNullName(org.eclipse.egit.github.core.tests.RepositoryIdTest)  Time elapsed: 0 s
17:27:12 [2021-02-04T22:27:12.569Z] createFromStringUrl(org.eclipse.egit.github.core.tests.RepositoryIdTest)  Time elapsed: 0 s
17:27:12 [2021-02-04T22:27:12.569Z] createNullOwner(org.eclipse.egit.github.core.tests.RepositoryIdTest)  Time elapsed: 0 s
17:27:12 [2021-02-04T22:27:12.569Z] createFromString(org.eclipse.egit.github.core.tests.RepositoryIdTest)  Time elapsed: 0 s
17:27:12 [2021-02-04T22:27:12.569Z] createFromMalformedStringUrl(org.eclipse.egit.github.core.tests.RepositoryIdTest)  Time elapsed: 0 s
17:27:12 [2021-02-04T22:27:12.569Z] equality(org.eclipse.egit.github.core.tests.RepositoryIdTest)  Time elapsed: 0 s
17:27:12 [2021-02-04T22:27:12.569Z] createEmptyOwner(org.eclipse.egit.github.core.tests.RepositoryIdTest)  Time elapsed: 0 s
17:27:12 [2021-02-04T22:27:12.569Z] createFromNullStringUrl(org.eclipse.egit.github.core.tests.RepositoryIdTest)  Time elapsed: 0 s
17:27:12 [2021-02-04T22:27:12.569Z] createFromInvalidUrl1(org.eclipse.egit.github.core.tests.RepositoryIdTest)  Time elapsed: 0 s
17:27:12 [2021-02-04T22:27:12.569Z] createFromInvalidUrl2(org.eclipse.egit.github.core.tests.RepositoryIdTest)  Time elapsed: 0 s
17:27:12 [2021-02-04T22:27:12.569Z] createFromInvalidUrl3(org.eclipse.egit.github.core.tests.RepositoryIdTest)  Time elapsed: 0 s
17:27:12 [2021-02-04T22:27:12.569Z] createFromInvalidUrl4(org.eclipse.egit.github.core.tests.RepositoryIdTest)  Time elapsed: 0 s
17:27:12 [2021-02-04T22:27:12.570Z] createEmptyName(org.eclipse.egit.github.core.tests.RepositoryIdTest)  Time elapsed: 0 s
17:27:12 [2021-02-04T22:27:12.570Z] createFromUrl(org.eclipse.egit.github.core.tests.RepositoryIdTest)  Time elapsed: 0 s
17:27:12 [2021-02-04T22:27:12.570Z] updateFields(org.eclipse.egit.github.core.tests.RepositoryIssueTest)  Time elapsed: 0 s
17:27:12 [2021-02-04T22:27:12.570Z] defaultState(org.eclipse.egit.github.core.tests.RepositoryIssueTest)  Time elapsed: 0 s
17:27:12 [2021-02-04T22:27:12.570Z] getPrivateOrgRepositories(org.eclipse.egit.github.core.tests.RepositoryServiceTest)  Time elapsed: 0.001 s
17:27:12 [2021-02-04T22:27:12.570Z] editRepositoryNullRepository(org.eclipse.egit.github.core.tests.RepositoryServiceTest)  Time elapsed: 0 s
17:27:12 [2021-02-04T22:27:12.570Z] getRepositoriesNullOrg(org.eclipse.egit.github.core.tests.RepositoryServiceTest)  Time elapsed: 0 s
17:27:12 [2021-02-04T22:27:12.570Z] getPublicRepositories(org.eclipse.egit.github.core.tests.RepositoryServiceTest)  Time elapsed: 0.001 s
17:27:12 [2021-02-04T22:27:12.570Z] constructor(org.eclipse.egit.github.core.tests.RepositoryServiceTest)  Time elapsed: 0 s
17:27:12 [2021-02-04T22:27:12.570Z] searchRepositoriesEmptyQuery(org.eclipse.egit.github.core.tests.RepositoryServiceTest)  Time elapsed: 0 s
17:27:12 [2021-02-04T22:27:12.570Z] getRepositoriesEmptyUser(org.eclipse.egit.github.core.tests.RepositoryServiceTest)  Time elapsed: 0 s
17:27:12 [2021-02-04T22:27:12.570Z] forkRepositoryToOrg(org.eclipse.egit.github.core.tests.RepositoryServiceTest)  Time elapsed: 0 s
17:27:12 [2021-02-04T22:27:12.570Z] getRepositoriesEmptyOrg(org.eclipse.egit.github.core.tests.RepositoryServiceTest)  Time elapsed: 0 s
17:27:12 [2021-02-04T22:27:12.570Z] getContributors(org.eclipse.egit.github.core.tests.RepositoryServiceTest)  Time elapsed: 0.001 s
17:27:12 [2021-02-04T22:27:12.570Z] searchRepositoriesNullQuery(org.eclipse.egit.github.core.tests.RepositoryServiceTest)  Time elapsed: 0 s
17:27:12 [2021-02-04T22:27:12.570Z] createOrgRepositoryNullRepository(org.eclipse.egit.github.core.tests.RepositoryServiceTest)  Time elapsed: 0 s
17:27:12 [2021-02-04T22:27:12.570Z] editRepositoryProviderWithNullFields(org.eclipse.egit.github.core.tests.RepositoryServiceTest)  Time elapsed: 0 s
17:27:12 [2021-02-04T22:27:12.570Z] searchRepositoriesStartingAtPage(org.eclipse.egit.github.core.tests.RepositoryServiceTest)  Time elapsed: 0.001 s
17:27:12 [2021-02-04T22:27:12.570Z] editRepositoryProviderWithFields(org.eclipse.egit.github.core.tests.RepositoryServiceTest)  Time elapsed: 0 s
17:27:12 [2021-02-04T22:27:12.570Z] editRepository(org.eclipse.egit.github.core.tests.RepositoryServiceTest)  Time elapsed: 0 s
17:27:12 [2021-02-04T22:27:12.570Z] createRepositoryNullRepository(org.eclipse.egit.github.core.tests.RepositoryServiceTest)  Time elapsed: 0 s
17:27:12 [2021-02-04T22:27:12.570Z] getRepositories(org.eclipse.egit.github.core.tests.RepositoryServiceTest)  Time elapsed: 0 s
17:27:12 [2021-02-04T22:27:12.570Z] createRepository(org.eclipse.egit.github.core.tests.RepositoryServiceTest)  Time elapsed: 0 s
17:27:12 [2021-02-04T22:27:12.570Z] getOrgRepositories(org.eclipse.egit.github.core.tests.RepositoryServiceTest)  Time elapsed: 0 s
17:27:12 [2021-02-04T22:27:12.570Z] getRepositoriesNullUser(org.eclipse.egit.github.core.tests.RepositoryServiceTest)  Time elapsed: 0 s
17:27:12 [2021-02-04T22:27:12.570Z] getContributorsWithAnonymous(org.eclipse.egit.github.core.tests.RepositoryServiceTest)  Time elapsed: 0.001 s
17:27:12 [2021-02-04T22:27:12.570Z] searchEscaped(org.eclipse.egit.github.core.tests.RepositoryServiceTest)  Time elapsed: 0 s
17:27:12 [2021-02-04T22:27:12.570Z] getUserRepositories(org.eclipse.egit.github.core.tests.RepositoryServiceTest)  Time elapsed: 0 s
17:27:12 [2021-02-04T22:27:12.570Z] getHook(org.eclipse.egit.github.core.tests.RepositoryServiceTest)  Time elapsed: 0 s
17:27:12 [2021-02-04T22:27:12.570Z] getTags(org.eclipse.egit.github.core.tests.RepositoryServiceTest)  Time elapsed: 0.001 s
17:27:12 [2021-02-04T22:27:12.570Z] forkRepository(org.eclipse.egit.github.core.tests.RepositoryServiceTest)  Time elapsed: 0 s
17:27:12 [2021-02-04T22:27:12.570Z] editHookNullHook(org.eclipse.egit.github.core.tests.RepositoryServiceTest)  Time elapsed: 0 s
17:27:12 [2021-02-04T22:27:12.570Z] createOrgRepositoryNullOrg(org.eclipse.egit.github.core.tests.RepositoryServiceTest)  Time elapsed: 0 s
17:27:12 [2021-02-04T22:27:12.570Z] pageAllRepositoriesSince(org.eclipse.egit.github.core.tests.RepositoryServiceTest)  Time elapsed: 0.001 s
17:27:12 [2021-02-04T22:27:12.570Z] createOrgRepositoryEmptyOrg(org.eclipse.egit.github.core.tests.RepositoryServiceTest)  Time elapsed: 0 s
17:27:12 [2021-02-04T22:27:12.570Z] createOrgRepository(org.eclipse.egit.github.core.tests.RepositoryServiceTest)  Time elapsed: 0 s
17:27:12 [2021-02-04T22:27:12.570Z] getRepositoryProvider(org.eclipse.egit.github.core.tests.RepositoryServiceTest)  Time elapsed: 0 s
17:27:12 [2021-02-04T22:27:12.570Z] editRepositoryWithNullFields(org.eclipse.egit.github.core.tests.RepositoryServiceTest)  Time elapsed: 0 s
17:27:12 [2021-02-04T22:27:12.570Z] pageAllRepositories(org.eclipse.egit.github.core.tests.RepositoryServiceTest)  Time elapsed: 0 s
17:27:12 [2021-02-04T22:27:12.570Z] runMerge(org.eclipse.egit.github.core.tests.RepositoryServiceTest)  Time elapsed: 0 s
17:27:12 [2021-02-04T22:27:12.570Z] searchRepositoriesMatchingLanguage(org.eclipse.egit.github.core.tests.RepositoryServiceTest)  Time elapsed: 0 s
17:27:12 [2021-02-04T22:27:12.570Z] editRepositoryWithFields(org.eclipse.egit.github.core.tests.RepositoryServiceTest)  Time elapsed: 0 s
17:27:12 [2021-02-04T22:27:12.570Z] createHook(org.eclipse.egit.github.core.tests.RepositoryServiceTest)  Time elapsed: 0.001 s
17:27:12 [2021-02-04T22:27:12.570Z] getLanguages(org.eclipse.egit.github.core.tests.RepositoryServiceTest)  Time elapsed: 0 s
17:27:12 [2021-02-04T22:27:12.570Z] runHook(org.eclipse.egit.github.core.tests.RepositoryServiceTest)  Time elapsed: 0 s
17:27:12 [2021-02-04T22:27:12.570Z] editHook(org.eclipse.egit.github.core.tests.RepositoryServiceTest)  Time elapsed: 0 s
17:27:12 [2021-02-04T22:27:12.570Z] searchRepositories(org.eclipse.egit.github.core.tests.RepositoryServiceTest)  Time elapsed: 0.001 s
17:27:12 [2021-02-04T22:27:12.570Z] getRepository(org.eclipse.egit.github.core.tests.RepositoryServiceTest)  Time elapsed: 0 s
17:27:12 [2021-02-04T22:27:12.570Z] deleteHook(org.eclipse.egit.github.core.tests.RepositoryServiceTest)  Time elapsed: 0 s
17:27:12 [2021-02-04T22:27:12.570Z] getForks(org.eclipse.egit.github.core.tests.RepositoryServiceTest)  Time elapsed: 0.019 s
17:27:12 [2021-02-04T22:27:12.570Z] getHooks(org.eclipse.egit.github.core.tests.RepositoryServiceTest)  Time elapsed: 0.001 s
17:27:12 [2021-02-04T22:27:12.570Z] getBranches(org.eclipse.egit.github.core.tests.RepositoryServiceTest)  Time elapsed: 0 s
17:27:12 [2021-02-04T22:27:12.570Z] updateFields(org.eclipse.egit.github.core.tests.RepositoryTagTest)  Time elapsed: 0 s
17:27:12 [2021-02-04T22:27:12.570Z] defaultState(org.eclipse.egit.github.core.tests.RepositoryTagTest)  Time elapsed: 0 s
17:27:12 [2021-02-04T22:27:12.570Z] generateIdNullName(org.eclipse.egit.github.core.tests.RepositoryTest)  Time elapsed: 0 s
17:27:12 [2021-02-04T22:27:12.570Z] generateIdEmptyName(org.eclipse.egit.github.core.tests.RepositoryTest)  Time elapsed: 0 s
17:27:12 [2021-02-04T22:27:12.570Z] updateFields(org.eclipse.egit.github.core.tests.RepositoryTest)  Time elapsed: 0 s
17:27:12 [2021-02-04T22:27:12.570Z] fromJson(org.eclipse.egit.github.core.tests.RepositoryTest)  Time elapsed: 0.001 s
17:27:12 [2021-02-04T22:27:12.570Z] defaultState(org.eclipse.egit.github.core.tests.RepositoryTest)  Time elapsed: 0 s
17:27:12 [2021-02-04T22:27:12.570Z] generateIdEmptyOwnerLogin(org.eclipse.egit.github.core.tests.RepositoryTest)  Time elapsed: 0 s
17:27:12 [2021-02-04T22:27:12.570Z] generateId(org.eclipse.egit.github.core.tests.RepositoryTest)  Time elapsed: 0 s
17:27:12 [2021-02-04T22:27:12.570Z] generateIdNullOwner(org.eclipse.egit.github.core.tests.RepositoryTest)  Time elapsed: 0 s
17:27:12 [2021-02-04T22:27:12.570Z] generateIdNullOwnerLogin(org.eclipse.egit.github.core.tests.RepositoryTest)  Time elapsed: 0 s
17:27:12 [2021-02-04T22:27:12.570Z] requestErrorWithMessageField(org.eclipse.egit.github.core.tests.RequestErrorTest)  Time elapsed: 0.001 s
17:27:12 [2021-02-04T22:27:12.570Z] requestErrorWithErrorAndMessageField(org.eclipse.egit.github.core.tests.RequestErrorTest)  Time elapsed: 0 s
17:27:12 [2021-02-04T22:27:12.570Z] requestErrorWithErrorField(org.eclipse.egit.github.core.tests.RequestErrorTest)  Time elapsed: 0 s
17:27:12 [2021-02-04T22:27:12.570Z] invalidFieldValue(org.eclipse.egit.github.core.tests.RequestExceptionTest)  Time elapsed: 0.001 s
17:27:12 [2021-02-04T22:27:12.570Z] customCode(org.eclipse.egit.github.core.tests.RequestExceptionTest)  Time elapsed: 0 s
17:27:12 [2021-02-04T22:27:12.570Z] missingField(org.eclipse.egit.github.core.tests.RequestExceptionTest)  Time elapsed: 0 s
17:27:12 [2021-02-04T22:27:12.570Z] invalidField(org.eclipse.egit.github.core.tests.RequestExceptionTest)  Time elapsed: 0 s
17:27:12 [2021-02-04T22:27:12.570Z] existentField(org.eclipse.egit.github.core.tests.RequestExceptionTest)  Time elapsed: 0 s
17:27:12 [2021-02-04T22:27:12.570Z] errorField(org.eclipse.egit.github.core.tests.RequestExceptionTest)  Time elapsed: 0 s
17:27:12 [2021-02-04T22:27:12.571Z] updateFields(org.eclipse.egit.github.core.tests.SearchIssueTest)  Time elapsed: 0 s
17:27:12 [2021-02-04T22:27:12.571Z] defaultState(org.eclipse.egit.github.core.tests.SearchIssueTest)  Time elapsed: 0 s
17:27:12 [2021-02-04T22:27:12.571Z] createNullName(org.eclipse.egit.github.core.tests.SearchRepositoryTest)  Time elapsed: 0.001 s
17:27:12 [2021-02-04T22:27:12.571Z] defaultState(org.eclipse.egit.github.core.tests.SearchRepositoryTest)  Time elapsed: 0 s
17:27:12 [2021-02-04T22:27:12.571Z] createNullOwner(org.eclipse.egit.github.core.tests.SearchRepositoryTest)  Time elapsed: 0 s
17:27:12 [2021-02-04T22:27:12.571Z] equality(org.eclipse.egit.github.core.tests.SearchRepositoryTest)  Time elapsed: 0 s
17:27:12 [2021-02-04T22:27:12.571Z] getCreatedAtReferenceMutableObject(org.eclipse.egit.github.core.tests.SearchRepositoryTest)  Time elapsed: 0.001 s
17:27:12 [2021-02-04T22:27:12.571Z] createEmptyOwner(org.eclipse.egit.github.core.tests.SearchRepositoryTest)  Time elapsed: 0 s
17:27:12 [2021-02-04T22:27:12.571Z] getPushedAtReferenceMutableObject(org.eclipse.egit.github.core.tests.SearchRepositoryTest)  Time elapsed: 0 s
17:27:12 [2021-02-04T22:27:12.571Z] createEmptyName(org.eclipse.egit.github.core.tests.SearchRepositoryTest)  Time elapsed: 0 s
17:27:12 [2021-02-04T22:27:12.571Z] noGeneratedId(org.eclipse.egit.github.core.tests.SearchRepositoryTest)  Time elapsed: 0 s
17:27:12 [2021-02-04T22:27:12.571Z] updateFields(org.eclipse.egit.github.core.tests.ShaResourceTest)  Time elapsed: 0 s
17:27:12 [2021-02-04T22:27:12.571Z] defaultState(org.eclipse.egit.github.core.tests.ShaResourceTest)  Time elapsed: 0 s
17:27:12 [2021-02-04T22:27:12.571Z] getStarredNullName(org.eclipse.egit.github.core.tests.StargazerServiceTest)  Time elapsed: 0.001 s
17:27:12 [2021-02-04T22:27:12.571Z] constructor(org.eclipse.egit.github.core.tests.StargazerServiceTest)  Time elapsed: 0 s
17:27:12 [2021-02-04T22:27:12.571Z] pageCurrentStarred(org.eclipse.egit.github.core.tests.StargazerServiceTest)  Time elapsed: 0 s
17:27:12 [2021-02-04T22:27:12.571Z] getStarred(org.eclipse.egit.github.core.tests.StargazerServiceTest)  Time elapsed: 0.001 s
17:27:12 [2021-02-04T22:27:12.571Z] unstar(org.eclipse.egit.github.core.tests.StargazerServiceTest)  Time elapsed: 0 s
17:27:12 [2021-02-04T22:27:12.571Z] star(org.eclipse.egit.github.core.tests.StargazerServiceTest)  Time elapsed: 0 s
17:27:12 [2021-02-04T22:27:12.571Z] pageStargazers(org.eclipse.egit.github.core.tests.StargazerServiceTest)  Time elapsed: 0 s
17:27:12 [2021-02-04T22:27:12.571Z] getCurrentStarred(org.eclipse.egit.github.core.tests.StargazerServiceTest)  Time elapsed: 0 s
17:27:12 [2021-02-04T22:27:12.571Z] isStarring(org.eclipse.egit.github.core.tests.StargazerServiceTest)  Time elapsed: 0 s
17:27:12 [2021-02-04T22:27:12.571Z] getStarredEmptyName(org.eclipse.egit.github.core.tests.StargazerServiceTest)  Time elapsed: 0 s
17:27:12 [2021-02-04T22:27:12.571Z] pageStarred(org.eclipse.egit.github.core.tests.StargazerServiceTest)  Time elapsed: 0.001 s
17:27:12 [2021-02-04T22:27:12.571Z] getStargazers(org.eclipse.egit.github.core.tests.StargazerServiceTest)  Time elapsed: 0 s
17:27:12 [2021-02-04T22:27:12.571Z] updateFields(org.eclipse.egit.github.core.tests.TagTest)  Time elapsed: 0 s
17:27:12 [2021-02-04T22:27:12.571Z] defaultState(org.eclipse.egit.github.core.tests.TagTest)  Time elapsed: 0 s
17:27:12 [2021-02-04T22:27:12.571Z] updateFields(org.eclipse.egit.github.core.tests.TeamAddPayloadTest)  Time elapsed: 0 s
17:27:12 [2021-02-04T22:27:12.571Z] defaultState(org.eclipse.egit.github.core.tests.TeamAddPayloadTest)  Time elapsed: 0 s
17:27:12 [2021-02-04T22:27:12.571Z] getMembershipEmptyName(org.eclipse.egit.github.core.tests.TeamServiceTest)  Time elapsed: 0 s
17:27:12 [2021-02-04T22:27:12.571Z] getTeamsEmptyName(org.eclipse.egit.github.core.tests.TeamServiceTest)  Time elapsed: 0 s
17:27:12 [2021-02-04T22:27:12.571Z] createTeamWithRepos(org.eclipse.egit.github.core.tests.TeamServiceTest)  Time elapsed: 0.001 s
17:27:12 [2021-02-04T22:27:12.571Z] getMembership(org.eclipse.egit.github.core.tests.TeamServiceTest)  Time elapsed: 0 s
17:27:12 [2021-02-04T22:27:12.571Z] constructor(org.eclipse.egit.github.core.tests.TeamServiceTest)  Time elapsed: 0 s
17:27:12 [2021-02-04T22:27:12.571Z] removeMemberNullName(org.eclipse.egit.github.core.tests.TeamServiceTest)  Time elapsed: 0 s
17:27:12 [2021-02-04T22:27:12.571Z] createTeamEmptyOrg(org.eclipse.egit.github.core.tests.TeamServiceTest)  Time elapsed: 0 s
17:27:12 [2021-02-04T22:27:12.571Z] addMembership(org.eclipse.egit.github.core.tests.TeamServiceTest)  Time elapsed: 0.001 s
17:27:12 [2021-02-04T22:27:12.571Z] removeRepository(org.eclipse.egit.github.core.tests.TeamServiceTest)  Time elapsed: 0 s
17:27:12 [2021-02-04T22:27:12.571Z] isMemberEmptyName(org.eclipse.egit.github.core.tests.TeamServiceTest)  Time elapsed: 0 s
17:27:12 [2021-02-04T22:27:12.571Z] removeMember(org.eclipse.egit.github.core.tests.TeamServiceTest)  Time elapsed: 0 s
17:27:12 [2021-02-04T22:27:12.571Z] addMembershipEmptyName(org.eclipse.egit.github.core.tests.TeamServiceTest)  Time elapsed: 0 s
17:27:12 [2021-02-04T22:27:12.571Z] getRepositories(org.eclipse.egit.github.core.tests.TeamServiceTest)  Time elapsed: 0.001 s
17:27:12 [2021-02-04T22:27:12.571Z] addMembershipNullName(org.eclipse.egit.github.core.tests.TeamServiceTest)  Time elapsed: 0 s
17:27:12 [2021-02-04T22:27:12.571Z] removeMembershipEmptyName(org.eclipse.egit.github.core.tests.TeamServiceTest)  Time elapsed: 0 s
17:27:12 [2021-02-04T22:27:12.571Z] getAllTeams(org.eclipse.egit.github.core.tests.TeamServiceTest)  Time elapsed: 0 s
17:27:12 [2021-02-04T22:27:12.571Z] isMember(org.eclipse.egit.github.core.tests.TeamServiceTest)  Time elapsed: 0 s
17:27:12 [2021-02-04T22:27:12.571Z] removeMembership(org.eclipse.egit.github.core.tests.TeamServiceTest)  Time elapsed: 0 s
17:27:12 [2021-02-04T22:27:12.571Z] getMembershipNullName(org.eclipse.egit.github.core.tests.TeamServiceTest)  Time elapsed: 0 s
17:27:12 [2021-02-04T22:27:12.571Z] createTeamNullTeam(org.eclipse.egit.github.core.tests.TeamServiceTest)  Time elapsed: 0 s
17:27:12 [2021-02-04T22:27:12.571Z] addMember(org.eclipse.egit.github.core.tests.TeamServiceTest)  Time elapsed: 0 s
17:27:12 [2021-02-04T22:27:12.571Z] isRepository(org.eclipse.egit.github.core.tests.TeamServiceTest)  Time elapsed: 0 s
17:27:12 [2021-02-04T22:27:12.571Z] getTeam(org.eclipse.egit.github.core.tests.TeamServiceTest)  Time elapsed: 0 s
17:27:12 [2021-02-04T22:27:12.571Z] addMemberNullName(org.eclipse.egit.github.core.tests.TeamServiceTest)  Time elapsed: 0 s
17:27:12 [2021-02-04T22:27:12.571Z] isMemberNullName(org.eclipse.egit.github.core.tests.TeamServiceTest)  Time elapsed: 0 s
17:27:12 [2021-02-04T22:27:12.571Z] removeMemberEmptyName(org.eclipse.egit.github.core.tests.TeamServiceTest)  Time elapsed: 0 s
17:27:12 [2021-02-04T22:27:12.571Z] createTeam(org.eclipse.egit.github.core.tests.TeamServiceTest)  Time elapsed: 0 s
17:27:12 [2021-02-04T22:27:12.571Z] editTeamNullTeam(org.eclipse.egit.github.core.tests.TeamServiceTest)  Time elapsed: 0 s
17:27:12 [2021-02-04T22:27:12.571Z] createTeamNullOrg(org.eclipse.egit.github.core.tests.TeamServiceTest)  Time elapsed: 0 s
17:27:12 [2021-02-04T22:27:12.571Z] editTeam(org.eclipse.egit.github.core.tests.TeamServiceTest)  Time elapsed: 0 s
17:27:12 [2021-02-04T22:27:12.571Z] getRepositoryTeams(org.eclipse.egit.github.core.tests.TeamServiceTest)  Time elapsed: 0.001 s
17:27:12 [2021-02-04T22:27:12.571Z] addMemberEmptyName(org.eclipse.egit.github.core.tests.TeamServiceTest)  Time elapsed: 0 s
17:27:12 [2021-02-04T22:27:12.571Z] deleteTeam(org.eclipse.egit.github.core.tests.TeamServiceTest)  Time elapsed: 0 s
17:27:12 [2021-02-04T22:27:12.571Z] removeMembershipNullName(org.eclipse.egit.github.core.tests.TeamServiceTest)  Time elapsed: 0 s
17:27:12 [2021-02-04T22:27:12.571Z] getTeamsNullName(org.eclipse.egit.github.core.tests.TeamServiceTest)  Time elapsed: 0 s
17:27:12 [2021-02-04T22:27:12.571Z] getTeams(org.eclipse.egit.github.core.tests.TeamServiceTest)  Time elapsed: 0.001 s
17:27:12 [2021-02-04T22:27:12.571Z] addRepository(org.eclipse.egit.github.core.tests.TeamServiceTest)  Time elapsed: 0 s
17:27:12 [2021-02-04T22:27:12.571Z] getMembers(org.eclipse.egit.github.core.tests.TeamServiceTest)  Time elapsed: 0 s
17:27:12 [2021-02-04T22:27:12.571Z] updateFields(org.eclipse.egit.github.core.tests.TeamTest)  Time elapsed: 0 s
17:27:12 [2021-02-04T22:27:12.571Z] defaultState(org.eclipse.egit.github.core.tests.TeamTest)  Time elapsed: 0 s
17:27:12 [2021-02-04T22:27:12.571Z] updateFields(org.eclipse.egit.github.core.tests.TreeEntryTest)  Time elapsed: 0 s
17:27:12 [2021-02-04T22:27:12.571Z] defaultState(org.eclipse.egit.github.core.tests.TreeEntryTest)  Time elapsed: 0 s
17:27:12 [2021-02-04T22:27:12.571Z] updateFields(org.eclipse.egit.github.core.tests.TreeTest)  Time elapsed: 0 s
17:27:12 [2021-02-04T22:27:12.571Z] defaultState(org.eclipse.egit.github.core.tests.TreeTest)  Time elapsed: 0 s
17:27:12 [2021-02-04T22:27:12.571Z] updateFields(org.eclipse.egit.github.core.tests.TypedResourceTest)  Time elapsed: 0 s
17:27:12 [2021-02-04T22:27:12.571Z] defaultState(org.eclipse.egit.github.core.tests.TypedResourceTest)  Time elapsed: 0 s
17:27:12 [2021-02-04T22:27:12.572Z] generateSshUrl(org.eclipse.egit.github.core.tests.UrlUtilsTest)  Time elapsed: 0 s
17:27:12 [2021-02-04T22:27:12.572Z] generateReadOnlyUrl(org.eclipse.egit.github.core.tests.UrlUtilsTest)  Time elapsed: 0 s
17:27:12 [2021-02-04T22:27:12.572Z] encode(org.eclipse.egit.github.core.tests.UrlUtilsTest)  Time elapsed: 0 s
17:27:12 [2021-02-04T22:27:12.572Z] generateHttpsUrl(org.eclipse.egit.github.core.tests.UrlUtilsTest)  Time elapsed: 0 s
17:27:12 [2021-02-04T22:27:12.572Z] updateFields(org.eclipse.egit.github.core.tests.UserPlanTest)  Time elapsed: 0 s
17:27:12 [2021-02-04T22:27:12.572Z] defaultState(org.eclipse.egit.github.core.tests.UserPlanTest)  Time elapsed: 0 s
17:27:12 [2021-02-04T22:27:12.572Z] addEmailEmptyEmails(org.eclipse.egit.github.core.tests.UserServiceTest)  Time elapsed: 0.001 s
17:27:12 [2021-02-04T22:27:12.572Z] removeEmailNullEmails(org.eclipse.egit.github.core.tests.UserServiceTest)  Time elapsed: 0 s
17:27:12 [2021-02-04T22:27:12.572Z] isFollowingEmptyUser(org.eclipse.egit.github.core.tests.UserServiceTest)  Time elapsed: 0 s
17:27:12 [2021-02-04T22:27:12.572Z] editKey(org.eclipse.egit.github.core.tests.UserServiceTest)  Time elapsed: 0 s
17:27:12 [2021-02-04T22:27:12.572Z] unfollowNullUser(org.eclipse.egit.github.core.tests.UserServiceTest)  Time elapsed: 0 s
17:27:12 [2021-02-04T22:27:12.572Z] constructor(org.eclipse.egit.github.core.tests.UserServiceTest)  Time elapsed: 0 s
17:27:12 [2021-02-04T22:27:12.572Z] unfollowEmptyUser(org.eclipse.egit.github.core.tests.UserServiceTest)  Time elapsed: 0.001 s
17:27:12 [2021-02-04T22:27:12.572Z] addEmailNullEmails(org.eclipse.egit.github.core.tests.UserServiceTest)  Time elapsed: 0 s
17:27:12 [2021-02-04T22:27:12.572Z] follow(org.eclipse.egit.github.core.tests.UserServiceTest)  Time elapsed: 0 s
17:27:12 [2021-02-04T22:27:12.572Z] addEmail(org.eclipse.egit.github.core.tests.UserServiceTest)  Time elapsed: 0.001 s
17:27:12 [2021-02-04T22:27:12.572Z] getKey(org.eclipse.egit.github.core.tests.UserServiceTest)  Time elapsed: 0 s
17:27:12 [2021-02-04T22:27:12.572Z] getFollowingNullName(org.eclipse.egit.github.core.tests.UserServiceTest)  Time elapsed: 0 s
17:27:12 [2021-02-04T22:27:12.572Z] getUserNullName(org.eclipse.egit.github.core.tests.UserServiceTest)  Time elapsed: 0 s
17:27:12 [2021-02-04T22:27:12.572Z] getFollowingEmptyName(org.eclipse.egit.github.core.tests.UserServiceTest)  Time elapsed: 0 s
17:27:12 [2021-02-04T22:27:12.572Z] followEmptyUser(org.eclipse.egit.github.core.tests.UserServiceTest)  Time elapsed: 0 s
17:27:12 [2021-02-04T22:27:12.572Z] getUserEmptyName(org.eclipse.egit.github.core.tests.UserServiceTest)  Time elapsed: 0 s
17:27:12 [2021-02-04T22:27:12.572Z] followNullUser(org.eclipse.egit.github.core.tests.UserServiceTest)  Time elapsed: 0 s
17:27:12 [2021-02-04T22:27:12.572Z] unfollow(org.eclipse.egit.github.core.tests.UserServiceTest)  Time elapsed: 0 s
17:27:12 [2021-02-04T22:27:12.572Z] deleteKey(org.eclipse.egit.github.core.tests.UserServiceTest)  Time elapsed: 0 s
17:27:12 [2021-02-04T22:27:12.572Z] removeEmail(org.eclipse.egit.github.core.tests.UserServiceTest)  Time elapsed: 0.001 s
17:27:12 [2021-02-04T22:27:12.572Z] isFollowingNullUser(org.eclipse.egit.github.core.tests.UserServiceTest)  Time elapsed: 0 s
17:27:12 [2021-02-04T22:27:12.572Z] getKeys(org.eclipse.egit.github.core.tests.UserServiceTest)  Time elapsed: 0 s
17:27:12 [2021-02-04T22:27:12.572Z] getUser(org.eclipse.egit.github.core.tests.UserServiceTest)  Time elapsed: 0 s
17:27:12 [2021-02-04T22:27:12.572Z] editKeyNullKey(org.eclipse.egit.github.core.tests.UserServiceTest)  Time elapsed: 0 s
17:27:12 [2021-02-04T22:27:12.572Z] getCurrentUser(org.eclipse.egit.github.core.tests.UserServiceTest)  Time elapsed: 0 s
17:27:12 [2021-02-04T22:27:12.572Z] getEmails(org.eclipse.egit.github.core.tests.UserServiceTest)  Time elapsed: 0 s
17:27:12 [2021-02-04T22:27:12.572Z] getCurrentFollowers(org.eclipse.egit.github.core.tests.UserServiceTest)  Time elapsed: 0 s
17:27:12 [2021-02-04T22:27:12.572Z] getCurrentFollowing(org.eclipse.egit.github.core.tests.UserServiceTest)  Time elapsed: 0.001 s
17:27:12 [2021-02-04T22:27:12.572Z] createKey(org.eclipse.egit.github.core.tests.UserServiceTest)  Time elapsed: 0 s
17:27:12 [2021-02-04T22:27:12.572Z] getFollowersNullName(org.eclipse.egit.github.core.tests.UserServiceTest)  Time elapsed: 0 s
17:27:12 [2021-02-04T22:27:12.572Z] getFollowers(org.eclipse.egit.github.core.tests.UserServiceTest)  Time elapsed: 0 s
17:27:12 [2021-02-04T22:27:12.572Z] getFollowing(org.eclipse.egit.github.core.tests.UserServiceTest)  Time elapsed: 0 s
17:27:12 [2021-02-04T22:27:12.572Z] editUserNullUser(org.eclipse.egit.github.core.tests.UserServiceTest)  Time elapsed: 0.001 s
17:27:12 [2021-02-04T22:27:12.572Z] editUser(org.eclipse.egit.github.core.tests.UserServiceTest)  Time elapsed: 0 s
17:27:12 [2021-02-04T22:27:12.572Z] removeEmailEmptyEmails(org.eclipse.egit.github.core.tests.UserServiceTest)  Time elapsed: 0 s
17:27:12 [2021-02-04T22:27:12.572Z] isFollowing(org.eclipse.egit.github.core.tests.UserServiceTest)  Time elapsed: 0 s
17:27:12 [2021-02-04T22:27:12.572Z] getFollowersEmptyName(org.eclipse.egit.github.core.tests.UserServiceTest)  Time elapsed: 0 s
17:27:12 [2021-02-04T22:27:12.572Z] updateFields(org.eclipse.egit.github.core.tests.UserTest)  Time elapsed: 0 s
17:27:12 [2021-02-04T22:27:12.572Z] defaultState(org.eclipse.egit.github.core.tests.UserTest)  Time elapsed: 0 s
17:27:12 [2021-02-04T22:27:12.572Z] updateFields(org.eclipse.egit.github.core.tests.WatchPayloadTest)  Time elapsed: 0 s
17:27:12 [2021-02-04T22:27:12.572Z] defaultState(org.eclipse.egit.github.core.tests.WatchPayloadTest)  Time elapsed: 0 s
17:27:12 [2021-02-04T22:27:12.572Z] 
17:27:12 [2021-02-04T22:27:12.572Z] Results:
17:27:12 [2021-02-04T22:27:12.572Z] 
17:27:12 [2021-02-04T22:27:12.572Z] Tests run: 787, Failures: 0, Errors: 0, Skipped: 0
17:27:12 [2021-02-04T22:27:12.572Z] 
17:27:13 [2021-02-04T22:27:13.137Z] 22:27:13 [INFO] All tests passed!
17:27:13 [2021-02-04T22:27:13.137Z] 22:27:13 [INFO] 
17:27:13 [2021-02-04T22:27:13.137Z] 22:27:13 [INFO] >>> spotbugs-maven-plugin:3.1.11:check (default) > :spotbugs @ org.eclipse.egit.github.core.tests >>>
17:27:13 [2021-02-04T22:27:13.137Z] 22:27:13 [INFO] 
17:27:13 [2021-02-04T22:27:13.137Z] 22:27:13 [INFO] --- spotbugs-maven-plugin:3.1.11:spotbugs (spotbugs) @ org.eclipse.egit.github.core.tests ---
17:27:13 [2021-02-04T22:27:13.137Z] 22:27:13 [INFO] Fork Value is true
17:27:18 [2021-02-04T22:27:18.418Z]      [java] Warnings generated: 3
17:27:18 [2021-02-04T22:27:18.418Z] 22:27:18 [INFO] Done SpotBugs Analysis....
17:27:18 [2021-02-04T22:27:18.418Z] 22:27:18 [INFO] 
17:27:18 [2021-02-04T22:27:18.418Z] 22:27:18 [INFO] <<< spotbugs-maven-plugin:3.1.11:check (default) < :spotbugs @ org.eclipse.egit.github.core.tests <<<
17:27:18 [2021-02-04T22:27:18.418Z] 22:27:18 [INFO] 
17:27:18 [2021-02-04T22:27:18.418Z] 22:27:18 [INFO] 
17:27:18 [2021-02-04T22:27:18.418Z] 22:27:18 [INFO] --- spotbugs-maven-plugin:3.1.11:check (default) @ org.eclipse.egit.github.core.tests ---
17:27:18 [2021-02-04T22:27:18.418Z] 22:27:18 [INFO] BugInstance size is 3
17:27:18 [2021-02-04T22:27:18.418Z] 22:27:18 [INFO] Error size is 0
17:27:18 [2021-02-04T22:27:18.418Z] 22:27:18 [INFO] Total bugs: 3
17:27:18 [2021-02-04T22:27:18.418Z] 22:27:18 [ERROR] Found reliance on default encoding in org.eclipse.egit.github.core.tests.EncodingUtilsTest.encodeDecode(): new String(byte[]) [org.eclipse.egit.github.core.tests.EncodingUtilsTest] At EncodingUtilsTest.java:[line 40] DM_DEFAULT_ENCODING
17:27:18 [2021-02-04T22:27:18.418Z] 22:27:18 [ERROR] Found reliance on default encoding in org.eclipse.egit.github.core.tests.EncodingUtilsTest.encodeDecode(): String.getBytes() [org.eclipse.egit.github.core.tests.EncodingUtilsTest] At EncodingUtilsTest.java:[line 33] DM_DEFAULT_ENCODING
17:27:18 [2021-02-04T22:27:18.418Z] 22:27:18 [ERROR] Found reliance on default encoding in org.eclipse.egit.github.core.tests.live.CommitTest.readLine(InputStream, int): new java.util.Scanner(InputStream) [org.eclipse.egit.github.core.tests.live.CommitTest] At CommitTest.java:[line 176] DM_DEFAULT_ENCODING
17:27:18 [2021-02-04T22:27:18.418Z] 22:27:18 [INFO] 
17:27:18 [2021-02-04T22:27:18.418Z] 
17:27:18 [2021-02-04T22:27:18.418Z] 
17:27:18 [2021-02-04T22:27:18.418Z] To see bug detail using the Spotbugs GUI, use the following command "mvn spotbugs:gui"
17:27:18 [2021-02-04T22:27:18.418Z] 
17:27:18 [2021-02-04T22:27:18.418Z] 
17:27:18 [2021-02-04T22:27:18.418Z] 
17:27:18 [2021-02-04T22:27:18.418Z] 22:27:18 [INFO] 
17:27:18 [2021-02-04T22:27:18.418Z] 22:27:18 [INFO] >>> maven-pmd-plugin:3.11.0:cpd-check (default) > :cpd @ org.eclipse.egit.github.core.tests >>>
17:27:18 [2021-02-04T22:27:18.418Z] 22:27:18 [INFO] 
17:27:18 [2021-02-04T22:27:18.418Z] 22:27:18 [INFO] --- maven-pmd-plugin:3.11.0:cpd (cpd) @ org.eclipse.egit.github.core.tests ---
17:27:18 [2021-02-04T22:27:18.418Z] 22:27:18 [INFO] 
17:27:18 [2021-02-04T22:27:18.418Z] 22:27:18 [INFO] <<< maven-pmd-plugin:3.11.0:cpd-check (default) < :cpd @ org.eclipse.egit.github.core.tests <<<
17:27:18 [2021-02-04T22:27:18.418Z] 22:27:18 [INFO] 
17:27:18 [2021-02-04T22:27:18.418Z] 22:27:18 [INFO] 
17:27:18 [2021-02-04T22:27:18.418Z] 22:27:18 [INFO] --- maven-pmd-plugin:3.11.0:cpd-check (default) @ org.eclipse.egit.github.core.tests ---
17:27:18 [2021-02-04T22:27:18.418Z] 22:27:18 [INFO] You have 3 CPD duplications. For more details see: /home/jenkins/agent/workspace/egit-github/repo/org.eclipse.egit.github.core.tests/target/cpd.xml
17:27:18 [2021-02-04T22:27:18.418Z] 22:27:18 [INFO] 
17:27:18 [2021-02-04T22:27:18.418Z] 22:27:18 [INFO] --- tycho-pack200a-plugin:1.7.0:normalize (pack200-normalize) @ org.eclipse.egit.github.core.tests ---
17:27:18 [2021-02-04T22:27:18.418Z] 22:27:18 [INFO] Pack200 normalizing jar /home/jenkins/agent/workspace/egit-github/repo/org.eclipse.egit.github.core.tests/target/org.eclipse.egit.github.core.tests-5.11.0-SNAPSHOT.jar
17:27:18 [2021-02-04T22:27:18.677Z] 22:27:18 [INFO] 
17:27:18 [2021-02-04T22:27:18.677Z] 22:27:18 [INFO] --- eclipse-jarsigner-plugin:1.1.5:sign (sign) @ org.eclipse.egit.github.core.tests ---
17:27:18 [2021-02-04T22:27:18.677Z] 22:27:18 [INFO] Signing jar: /home/jenkins/agent/workspace/egit-github/repo/org.eclipse.egit.github.core.tests/target/org.eclipse.egit.github.core.tests-5.11.0-SNAPSHOT.jar
17:27:20 [2021-02-04T22:27:20.047Z] 22:27:19 [INFO] 
17:27:20 [2021-02-04T22:27:20.047Z] 22:27:19 [INFO] --- tycho-pack200b-plugin:1.7.0:pack (pack200-pack) @ org.eclipse.egit.github.core.tests ---
17:27:20 [2021-02-04T22:27:20.047Z] 22:27:19 [INFO] Pack200 packing jar /home/jenkins/agent/workspace/egit-github/repo/org.eclipse.egit.github.core.tests/target/org.eclipse.egit.github.core.tests-5.11.0-SNAPSHOT.jar
17:27:20 [2021-02-04T22:27:20.047Z] 22:27:20 [INFO] 
17:27:20 [2021-02-04T22:27:20.047Z] 22:27:20 [INFO] --- tycho-p2-plugin:1.7.0:p2-metadata (p2-metadata) @ org.eclipse.egit.github.core.tests ---
17:27:20 [2021-02-04T22:27:20.047Z] 22:27:20 [INFO] 
17:27:20 [2021-02-04T22:27:20.047Z] 22:27:20 [INFO] --- maven-install-plugin:2.3.1:install (default-install) @ org.eclipse.egit.github.core.tests ---
17:27:20 [2021-02-04T22:27:20.047Z] 22:27:20 [INFO] Installing /home/jenkins/agent/workspace/egit-github/repo/org.eclipse.egit.github.core.tests/target/org.eclipse.egit.github.core.tests-5.11.0-SNAPSHOT.jar to /home/jenkins/agent/workspace/egit-github/.repository/org/eclipse/mylyn/github/org.eclipse.egit.github.core.tests/5.11.0-SNAPSHOT/org.eclipse.egit.github.core.tests-5.11.0-SNAPSHOT.jar
17:27:20 [2021-02-04T22:27:20.047Z] 22:27:20 [INFO] Installing /home/jenkins/agent/workspace/egit-github/repo/org.eclipse.egit.github.core.tests/pom.xml to /home/jenkins/agent/workspace/egit-github/.repository/org/eclipse/mylyn/github/org.eclipse.egit.github.core.tests/5.11.0-SNAPSHOT/org.eclipse.egit.github.core.tests-5.11.0-SNAPSHOT.pom
17:27:20 [2021-02-04T22:27:20.047Z] 22:27:20 [INFO] Installing /home/jenkins/agent/workspace/egit-github/repo/org.eclipse.egit.github.core.tests/target/org.eclipse.egit.github.core.tests-5.11.0-SNAPSHOT.jar.pack.gz to /home/jenkins/agent/workspace/egit-github/.repository/org/eclipse/mylyn/github/org.eclipse.egit.github.core.tests/5.11.0-SNAPSHOT/org.eclipse.egit.github.core.tests-5.11.0-SNAPSHOT-pack200.jar.pack.gz
17:27:20 [2021-02-04T22:27:20.048Z] 22:27:20 [INFO] Installing /home/jenkins/agent/workspace/egit-github/repo/org.eclipse.egit.github.core.tests/target/p2content.xml to /home/jenkins/agent/workspace/egit-github/.repository/org/eclipse/mylyn/github/org.eclipse.egit.github.core.tests/5.11.0-SNAPSHOT/org.eclipse.egit.github.core.tests-5.11.0-SNAPSHOT-p2metadata.xml
17:27:20 [2021-02-04T22:27:20.048Z] 22:27:20 [INFO] Installing /home/jenkins/agent/workspace/egit-github/repo/org.eclipse.egit.github.core.tests/target/p2artifacts.xml to /home/jenkins/agent/workspace/egit-github/.repository/org/eclipse/mylyn/github/org.eclipse.egit.github.core.tests/5.11.0-SNAPSHOT/org.eclipse.egit.github.core.tests-5.11.0-SNAPSHOT-p2artifacts.xml
17:27:20 [2021-02-04T22:27:20.048Z] 22:27:20 [INFO] 
17:27:20 [2021-02-04T22:27:20.048Z] 22:27:20 [INFO] --- tycho-p2-plugin:1.7.0:update-local-index (default-update-local-index) @ org.eclipse.egit.github.core.tests ---
17:27:20 [2021-02-04T22:27:20.048Z] 22:27:20 [INFO] 
17:27:20 [2021-02-04T22:27:20.048Z] 22:27:20 [INFO] ------< org.eclipse.mylyn.github:org.eclipse.mylyn.github.tests >-------
17:27:20 [2021-02-04T22:27:20.048Z] 22:27:20 [INFO] Building Eclipse EGit Mylyn GitHub Test Plug-in 5.11.0-SNAPSHOT   [9/10]
17:27:20 [2021-02-04T22:27:20.048Z] 22:27:20 [INFO] ------------------------[ eclipse-test-plugin ]-------------------------
17:27:20 [2021-02-04T22:27:20.048Z] 22:27:20 [INFO] 
17:27:20 [2021-02-04T22:27:20.048Z] 22:27:20 [INFO] --- maven-clean-plugin:2.5:clean (default-clean) @ org.eclipse.mylyn.github.tests ---
17:27:20 [2021-02-04T22:27:20.048Z] 22:27:20 [INFO] 
17:27:20 [2021-02-04T22:27:20.048Z] 22:27:20 [INFO] --- tycho-packaging-plugin:1.7.0:build-qualifier (default-build-qualifier) @ org.eclipse.mylyn.github.tests ---
17:27:20 [2021-02-04T22:27:20.048Z] 22:27:20 [INFO] The project's OSGi version is 5.11.0.202102042224
17:27:20 [2021-02-04T22:27:20.048Z] 22:27:20 [INFO] 
17:27:20 [2021-02-04T22:27:20.048Z] 22:27:20 [INFO] --- tycho-packaging-plugin:1.7.0:validate-id (default-validate-id) @ org.eclipse.mylyn.github.tests ---
17:27:20 [2021-02-04T22:27:20.048Z] 22:27:20 [INFO] 
17:27:20 [2021-02-04T22:27:20.048Z] 22:27:20 [INFO] --- tycho-packaging-plugin:1.7.0:validate-version (default-validate-version) @ org.eclipse.mylyn.github.tests ---
17:27:20 [2021-02-04T22:27:20.048Z] 22:27:20 [INFO] 
17:27:20 [2021-02-04T22:27:20.048Z] 22:27:20 [INFO] --- maven-enforcer-plugin:3.0.0-M2:enforce (enforce-maven) @ org.eclipse.mylyn.github.tests ---
17:27:20 [2021-02-04T22:27:20.048Z] 22:27:20 [INFO] 
17:27:20 [2021-02-04T22:27:20.048Z] 22:27:20 [INFO] --- maven-resources-plugin:3.1.0:resources (default-resources) @ org.eclipse.mylyn.github.tests ---
17:27:20 [2021-02-04T22:27:20.048Z] 22:27:20 [INFO] Using 'UTF-8' encoding to copy filtered resources.
17:27:20 [2021-02-04T22:27:20.048Z] 22:27:20 [INFO] skip non existing resourceDirectory /home/jenkins/agent/workspace/egit-github/repo/org.eclipse.mylyn.github.tests/src/main/resources
17:27:20 [2021-02-04T22:27:20.048Z] 22:27:20 [INFO] 
17:27:20 [2021-02-04T22:27:20.048Z] 22:27:20 [INFO] --- tycho-compiler-plugin:1.7.0:compile (default-compile) @ org.eclipse.mylyn.github.tests ---
17:27:20 [2021-02-04T22:27:20.048Z] 22:27:20 [INFO] Compiling 1 source file to /home/jenkins/agent/workspace/egit-github/repo/org.eclipse.mylyn.github.tests/target/classes
17:27:20 [2021-02-04T22:27:20.305Z] 22:27:20 [INFO] 
17:27:20 [2021-02-04T22:27:20.305Z] 22:27:20 [INFO] --- maven-resources-plugin:3.1.0:testResources (default-testResources) @ org.eclipse.mylyn.github.tests ---
17:27:20 [2021-02-04T22:27:20.305Z] 22:27:20 [INFO] Using 'UTF-8' encoding to copy filtered resources.
17:27:20 [2021-02-04T22:27:20.305Z] 22:27:20 [INFO] skip non existing resourceDirectory /home/jenkins/agent/workspace/egit-github/repo/org.eclipse.mylyn.github.tests/src/test/resources
17:27:20 [2021-02-04T22:27:20.305Z] 22:27:20 [INFO] 
17:27:20 [2021-02-04T22:27:20.306Z] 22:27:20 [INFO] --- target-platform-configuration:1.7.0:target-platform (default-target-platform) @ org.eclipse.mylyn.github.tests ---
17:27:20 [2021-02-04T22:27:20.306Z] 22:27:20 [INFO] 
17:27:20 [2021-02-04T22:27:20.306Z] 22:27:20 [INFO] --- tycho-packaging-plugin:1.7.0:package-plugin (default-package-plugin) @ org.eclipse.mylyn.github.tests ---
17:27:20 [2021-02-04T22:27:20.306Z] 22:27:20 [INFO] Building jar: /home/jenkins/agent/workspace/egit-github/repo/org.eclipse.mylyn.github.tests/target/org.eclipse.mylyn.github.tests-5.11.0-SNAPSHOT.jar
17:27:20 [2021-02-04T22:27:20.306Z] 22:27:20 [INFO] 
17:27:20 [2021-02-04T22:27:20.306Z] 22:27:20 [INFO] --- tycho-p2-plugin:1.7.0:p2-metadata-default (default-p2-metadata-default) @ org.eclipse.mylyn.github.tests ---
17:27:20 [2021-02-04T22:27:20.306Z] 22:27:20 [INFO] 
17:27:20 [2021-02-04T22:27:20.306Z] 22:27:20 [INFO] --- tycho-surefire-plugin:1.7.0:test (default-test) @ org.eclipse.mylyn.github.tests ---
17:27:20 [2021-02-04T22:27:20.584Z] 22:27:20 [INFO] Executing Test Runtime with timeout 0, logs (if any) will be placed at: /home/jenkins/agent/workspace/egit-github/repo/org.eclipse.mylyn.github.tests/target/work/data/.metadata/.log
17:27:20 [2021-02-04T22:27:20.584Z] 22:27:20 [INFO] Command line:
17:27:20 [2021-02-04T22:27:20.584Z] 	[/opt/tools/java/adoptopenjdk/hotspot-jdk-8/1.8.0_252-b09/jre/bin/java, -Dosgi.noShutdown=false, -Dosgi.os=linux, -Dosgi.ws=gtk, -Dosgi.arch=x86_64, -Declipse.consoleLog=true, -Xmx1024m, -Dorg.eclipse.swtbot.search.timeout=30000, -Dorg.eclipse.swtbot.screenshots.dir=target/screenshots, -Dosgi.clean=true, -jar, /home/jenkins/agent/workspace/egit-github/.repository/p2/osgi/bundle/org.eclipse.equinox.launcher/1.4.0.v20161219-1356/org.eclipse.equinox.launcher-1.4.0.v20161219-1356.jar, -data, /home/jenkins/agent/workspace/egit-github/repo/org.eclipse.mylyn.github.tests/target/work/data, -install, /home/jenkins/agent/workspace/egit-github/repo/org.eclipse.mylyn.github.tests/target/work, -configuration, /home/jenkins/agent/workspace/egit-github/repo/org.eclipse.mylyn.github.tests/target/work/configuration, -application, org.eclipse.tycho.surefire.osgibooter.uitest, -testproperties, /home/jenkins/agent/workspace/egit-github/repo/org.eclipse.mylyn.github.tests/target/surefire.properties, -testApplication, org.eclipse.ui.ide.workbench, -nouithread]
17:27:22 [2021-02-04T22:27:22.518Z] !SESSION 2021-02-04 22:27:20.581 -----------------------------------------------
17:27:22 [2021-02-04T22:27:22.518Z] eclipse.buildId=unknown
17:27:22 [2021-02-04T22:27:22.518Z] java.version=1.8.0_252
17:27:22 [2021-02-04T22:27:22.518Z] java.vendor=AdoptOpenJDK
17:27:22 [2021-02-04T22:27:22.518Z] BootLoader constants: OS=linux, ARCH=x86_64, WS=gtk, NL=en_US
17:27:22 [2021-02-04T22:27:22.518Z] Framework arguments:  -application org.eclipse.tycho.surefire.osgibooter.uitest -testproperties /home/jenkins/agent/workspace/egit-github/repo/org.eclipse.mylyn.github.tests/target/surefire.properties -testApplication org.eclipse.ui.ide.workbench -nouithread
17:27:22 [2021-02-04T22:27:22.518Z] Command-line arguments:  -data /home/jenkins/agent/workspace/egit-github/repo/org.eclipse.mylyn.github.tests/target/work/data -application org.eclipse.tycho.surefire.osgibooter.uitest -testproperties /home/jenkins/agent/workspace/egit-github/repo/org.eclipse.mylyn.github.tests/target/surefire.properties -testApplication org.eclipse.ui.ide.workbench -nouithread
17:27:22 [2021-02-04T22:27:22.518Z] 
17:27:22 [2021-02-04T22:27:22.518Z] !ENTRY org.eclipse.jdt.launching.macosx 4 0 2021-02-04 22:27:22.156
17:27:22 [2021-02-04T22:27:22.518Z] !MESSAGE FrameworkEvent ERROR
17:27:22 [2021-02-04T22:27:22.519Z] !STACK 0
17:27:22 [2021-02-04T22:27:22.519Z] org.osgi.framework.BundleException: Could not resolve module: org.eclipse.jdt.launching.macosx [270]
17:27:22 [2021-02-04T22:27:22.519Z]   Unresolved requirement: Require-Capability: eclipse.platform; filter:="(osgi.os=macosx)"
17:27:22 [2021-02-04T22:27:22.519Z] 
17:27:22 [2021-02-04T22:27:22.519Z] 	at org.eclipse.osgi.container.Module.start(Module.java:444)
17:27:22 [2021-02-04T22:27:22.519Z] 	at org.eclipse.osgi.container.ModuleContainer$ContainerStartLevel.incStartLevel(ModuleContainer.java:1634)
17:27:22 [2021-02-04T22:27:22.519Z] 	at org.eclipse.osgi.container.ModuleContainer$ContainerStartLevel.incStartLevel(ModuleContainer.java:1613)
17:27:22 [2021-02-04T22:27:22.519Z] 	at org.eclipse.osgi.container.ModuleContainer$ContainerStartLevel.doContainerStartLevel(ModuleContainer.java:1585)
17:27:22 [2021-02-04T22:27:22.519Z] 	at org.eclipse.osgi.container.ModuleContainer$ContainerStartLevel.dispatchEvent(ModuleContainer.java:1528)
17:27:22 [2021-02-04T22:27:22.519Z] 	at org.eclipse.osgi.container.ModuleContainer$ContainerStartLevel.dispatchEvent(ModuleContainer.java:1)
17:27:22 [2021-02-04T22:27:22.519Z] 	at org.eclipse.osgi.framework.eventmgr.EventManager.dispatchEvent(EventManager.java:230)
17:27:22 [2021-02-04T22:27:22.519Z] 	at org.eclipse.osgi.framework.eventmgr.EventManager$EventThread.run(EventManager.java:340)
17:27:22 [2021-02-04T22:27:22.519Z] 
17:27:22 [2021-02-04T22:27:22.519Z] !ENTRY org.eclipse.jdt.launching.ui.macosx 4 0 2021-02-04 22:27:22.157
17:27:22 [2021-02-04T22:27:22.519Z] !MESSAGE FrameworkEvent ERROR
17:27:22 [2021-02-04T22:27:22.519Z] !STACK 0
17:27:22 [2021-02-04T22:27:22.519Z] org.osgi.framework.BundleException: Could not resolve module: org.eclipse.jdt.launching.ui.macosx [271]
17:27:22 [2021-02-04T22:27:22.519Z]   Unresolved requirement: Require-Capability: eclipse.platform; filter:="(osgi.os=macosx)"
17:27:22 [2021-02-04T22:27:22.519Z] 
17:27:22 [2021-02-04T22:27:22.519Z] 	at org.eclipse.osgi.container.Module.start(Module.java:444)
17:27:22 [2021-02-04T22:27:22.519Z] 	at org.eclipse.osgi.container.ModuleContainer$ContainerStartLevel.incStartLevel(ModuleContainer.java:1634)
17:27:22 [2021-02-04T22:27:22.519Z] 	at org.eclipse.osgi.container.ModuleContainer$ContainerStartLevel.incStartLevel(ModuleContainer.java:1613)
17:27:22 [2021-02-04T22:27:22.519Z] 	at org.eclipse.osgi.container.ModuleContainer$ContainerStartLevel.doContainerStartLevel(ModuleContainer.java:1585)
17:27:22 [2021-02-04T22:27:22.519Z] 	at org.eclipse.osgi.container.ModuleContainer$ContainerStartLevel.dispatchEvent(ModuleContainer.java:1528)
17:27:22 [2021-02-04T22:27:22.519Z] 	at org.eclipse.osgi.container.ModuleContainer$ContainerStartLevel.dispatchEvent(ModuleContainer.java:1)
17:27:22 [2021-02-04T22:27:22.519Z] 	at org.eclipse.osgi.framework.eventmgr.EventManager.dispatchEvent(EventManager.java:230)
17:27:22 [2021-02-04T22:27:22.519Z] 	at org.eclipse.osgi.framework.eventmgr.EventManager$EventThread.run(EventManager.java:340)
17:27:22 [2021-02-04T22:27:22.519Z] Launching application org.eclipse.ui.ide.workbench...
17:27:23 [2021-02-04T22:27:23.890Z] SLF4J: Failed to load class "org.slf4j.impl.StaticLoggerBinder".
17:27:23 [2021-02-04T22:27:23.890Z] SLF4J: Defaulting to no-operation (NOP) logger implementation
17:27:23 [2021-02-04T22:27:23.890Z] SLF4J: See http://www.slf4j.org/codes.html#StaticLoggerBinder for further details.
17:27:24 [2021-02-04T22:27:24.821Z] Running org.eclipse.mylyn.github.ui.internal.GitHubRepositoryConnectorUIHeadlessTest
17:27:25 [2021-02-04T22:27:25.083Z] Tests run: 1, Failures: 0, Errors: 0, Skipped: 0, Time elapsed: 0.017 s - in org.eclipse.mylyn.github.ui.internal.GitHubRepositoryConnectorUIHeadlessTest
17:27:25 [2021-02-04T22:27:25.083Z] testFindHyperlinksTaskRepositoryStringIntInt(org.eclipse.mylyn.github.ui.internal.GitHubRepositoryConnectorUIHeadlessTest)  Time elapsed: 0.003 s
17:27:25 [2021-02-04T22:27:25.083Z] 
17:27:25 [2021-02-04T22:27:25.083Z] Results:
17:27:25 [2021-02-04T22:27:25.083Z] 
17:27:25 [2021-02-04T22:27:25.083Z] Tests run: 1, Failures: 0, Errors: 0, Skipped: 0
17:27:25 [2021-02-04T22:27:25.083Z] 
17:27:26 [2021-02-04T22:27:26.014Z] 
17:27:26 [2021-02-04T22:27:26.014Z] (SWT:905): Gtk-WARNING **: 22:27:25.706: Negative content width -1 (allocation 1, extents 1x1) while allocating gadget (node trough, owner GtkProgressBar)
17:27:26 [2021-02-04T22:27:26.014Z] 
17:27:26 [2021-02-04T22:27:26.014Z] (SWT:905): Gtk-WARNING **: 22:27:25.706: Negative content width -1 (allocation 1, extents 1x1) while allocating gadget (node trough, owner GtkProgressBar)
17:27:26 [2021-02-04T22:27:26.272Z] 
17:27:26 [2021-02-04T22:27:26.272Z] !ENTRY org.eclipse.equinox.registry 4 1 2021-02-04 22:27:26.053
17:27:26 [2021-02-04T22:27:26.272Z] !MESSAGE Plug-in "org.eclipse.ui.ide" was unable to instantiate class "org.eclipse.ui.internal.ide.SymlinkDecorator".
17:27:26 [2021-02-04T22:27:26.272Z] !STACK 0
17:27:26 [2021-02-04T22:27:26.272Z] java.lang.ExceptionInInitializerError
17:27:26 [2021-02-04T22:27:26.272Z] 	at sun.reflect.NativeConstructorAccessorImpl.newInstance0(Native Method)
17:27:26 [2021-02-04T22:27:26.272Z] 	at sun.reflect.NativeConstructorAccessorImpl.newInstance(NativeConstructorAccessorImpl.java:62)
17:27:26 [2021-02-04T22:27:26.272Z] 	at sun.reflect.DelegatingConstructorAccessorImpl.newInstance(DelegatingConstructorAccessorImpl.java:45)
17:27:26 [2021-02-04T22:27:26.272Z] 	at java.lang.reflect.Constructor.newInstance(Constructor.java:423)
17:27:26 [2021-02-04T22:27:26.272Z] 	at java.lang.Class.newInstance(Class.java:442)
17:27:26 [2021-02-04T22:27:26.272Z] 	at org.eclipse.core.internal.registry.osgi.RegistryStrategyOSGI.createExecutableExtension(RegistryStrategyOSGI.java:184)
17:27:26 [2021-02-04T22:27:26.272Z] 	at org.eclipse.core.internal.registry.ExtensionRegistry.createExecutableExtension(ExtensionRegistry.java:905)
17:27:26 [2021-02-04T22:27:26.272Z] 	at org.eclipse.core.internal.registry.ConfigurationElement.createExecutableExtension(ConfigurationElement.java:243)
17:27:26 [2021-02-04T22:27:26.272Z] 	at org.eclipse.core.internal.registry.ConfigurationElementHandle.createExecutableExtension(ConfigurationElementHandle.java:55)
17:27:26 [2021-02-04T22:27:26.272Z] 	at org.eclipse.ui.internal.WorkbenchPlugin.createExtension(WorkbenchPlugin.java:281)
17:27:26 [2021-02-04T22:27:26.272Z] 	at org.eclipse.ui.internal.decorators.LightweightDecoratorDefinition$1.run(LightweightDecoratorDefinition.java:125)
17:27:26 [2021-02-04T22:27:26.272Z] 	at org.eclipse.core.runtime.SafeRunner.run(SafeRunner.java:42)
17:27:26 [2021-02-04T22:27:26.272Z] 	at org.eclipse.ui.internal.decorators.LightweightDecoratorDefinition.internalGetDecorator(LightweightDecoratorDefinition.java:120)
17:27:26 [2021-02-04T22:27:26.272Z] 	at org.eclipse.ui.internal.decorators.LightweightDecoratorDefinition.decorate(LightweightDecoratorDefinition.java:242)
17:27:26 [2021-02-04T22:27:26.272Z] 	at org.eclipse.ui.internal.decorators.LightweightDecoratorManager$LightweightRunnable.run(LightweightDecoratorManager.java:104)
17:27:26 [2021-02-04T22:27:26.272Z] 	at org.eclipse.core.runtime.SafeRunner.run(SafeRunner.java:42)
17:27:26 [2021-02-04T22:27:26.272Z] 	at org.eclipse.ui.internal.decorators.LightweightDecoratorManager.decorate(LightweightDecoratorManager.java:377)
17:27:26 [2021-02-04T22:27:26.272Z] 	at org.eclipse.ui.internal.decorators.LightweightDecoratorManager.getDecorations(LightweightDecoratorManager.java:359)
17:27:26 [2021-02-04T22:27:26.272Z] 	at org.eclipse.ui.internal.decorators.DecorationScheduler$1.ensureResultCached(DecorationScheduler.java:347)
17:27:26 [2021-02-04T22:27:26.272Z] 	at org.eclipse.ui.internal.decorators.DecorationScheduler$1.run(DecorationScheduler.java:311)
17:27:26 [2021-02-04T22:27:26.272Z] 	at org.eclipse.core.internal.jobs.Worker.run(Worker.java:56)
17:27:26 [2021-02-04T22:27:26.272Z] Caused by: java.lang.NullPointerException
17:27:26 [2021-02-04T22:27:26.272Z] 	at org.eclipse.ui.plugin.AbstractUIPlugin.imageDescriptorFromPlugin(AbstractUIPlugin.java:664)
17:27:26 [2021-02-04T22:27:26.272Z] 	at org.eclipse.ui.internal.ide.SymlinkDecorator.<clinit>(SymlinkDecorator.java:32)
17:27:26 [2021-02-04T22:27:26.272Z] 	... 21 more
17:27:26 [2021-02-04T22:27:26.272Z] 
17:27:26 [2021-02-04T22:27:26.272Z] !ENTRY org.eclipse.equinox.registry 4 1 2021-02-04 22:27:26.054
17:27:26 [2021-02-04T22:27:26.272Z] !MESSAGE Plug-in "org.eclipse.ui.ide" was unable to instantiate class "org.eclipse.ui.internal.ide.SymlinkDecorator".
17:27:26 [2021-02-04T22:27:26.272Z] !STACK 0
17:27:26 [2021-02-04T22:27:26.272Z] java.lang.ExceptionInInitializerError
17:27:26 [2021-02-04T22:27:26.272Z] 	at sun.reflect.NativeConstructorAccessorImpl.newInstance0(Native Method)
17:27:26 [2021-02-04T22:27:26.272Z] 	at sun.reflect.NativeConstructorAccessorImpl.newInstance(NativeConstructorAccessorImpl.java:62)
17:27:26 [2021-02-04T22:27:26.272Z] 	at sun.reflect.DelegatingConstructorAccessorImpl.newInstance(DelegatingConstructorAccessorImpl.java:45)
17:27:26 [2021-02-04T22:27:26.272Z] 	at java.lang.reflect.Constructor.newInstance(Constructor.java:423)
17:27:26 [2021-02-04T22:27:26.272Z] 	at java.lang.Class.newInstance(Class.java:442)
17:27:26 [2021-02-04T22:27:26.272Z] 	at org.eclipse.core.internal.registry.osgi.RegistryStrategyOSGI.createExecutableExtension(RegistryStrategyOSGI.java:184)
17:27:26 [2021-02-04T22:27:26.272Z] 	at org.eclipse.core.internal.registry.ExtensionRegistry.createExecutableExtension(ExtensionRegistry.java:905)
17:27:26 [2021-02-04T22:27:26.272Z] 	at org.eclipse.core.internal.registry.ConfigurationElement.createExecutableExtension(ConfigurationElement.java:243)
17:27:26 [2021-02-04T22:27:26.272Z] 	at org.eclipse.core.internal.registry.ConfigurationElementHandle.createExecutableExtension(ConfigurationElementHandle.java:55)
17:27:26 [2021-02-04T22:27:26.272Z] 	at org.eclipse.ui.internal.WorkbenchPlugin.createExtension(WorkbenchPlugin.java:281)
17:27:26 [2021-02-04T22:27:26.272Z] 	at org.eclipse.ui.internal.decorators.LightweightDecoratorDefinition$1.run(LightweightDecoratorDefinition.java:125)
17:27:26 [2021-02-04T22:27:26.272Z] 	at org.eclipse.core.runtime.SafeRunner.run(SafeRunner.java:42)
17:27:26 [2021-02-04T22:27:26.272Z] 	at org.eclipse.ui.internal.decorators.LightweightDecoratorDefinition.internalGetDecorator(LightweightDecoratorDefinition.java:120)
17:27:26 [2021-02-04T22:27:26.272Z] 	at org.eclipse.ui.internal.decorators.LightweightDecoratorDefinition.decorate(LightweightDecoratorDefinition.java:242)
17:27:26 [2021-02-04T22:27:26.272Z] 	at org.eclipse.ui.internal.decorators.LightweightDecoratorManager$LightweightRunnable.run(LightweightDecoratorManager.java:104)
17:27:26 [2021-02-04T22:27:26.272Z] 	at org.eclipse.core.runtime.SafeRunner.run(SafeRunner.java:42)
17:27:26 [2021-02-04T22:27:26.272Z] 	at org.eclipse.ui.internal.decorators.LightweightDecoratorManager.decorate(LightweightDecoratorManager.java:377)
17:27:26 [2021-02-04T22:27:26.272Z] 	at org.eclipse.ui.internal.decorators.LightweightDecoratorManager.getDecorations(LightweightDecoratorManager.java:359)
17:27:26 [2021-02-04T22:27:26.272Z] 	at org.eclipse.ui.internal.decorators.DecorationScheduler$1.ensureResultCached(DecorationScheduler.java:347)
17:27:26 [2021-02-04T22:27:26.273Z] 	at org.eclipse.ui.internal.decorators.DecorationScheduler$1.run(DecorationScheduler.java:311)
17:27:26 [2021-02-04T22:27:26.273Z] 	at org.eclipse.core.internal.jobs.Worker.run(Worker.java:56)
17:27:26 [2021-02-04T22:27:26.273Z] Caused by: java.lang.NullPointerException
17:27:26 [2021-02-04T22:27:26.273Z] 	at org.eclipse.ui.plugin.AbstractUIPlugin.imageDescriptorFromPlugin(AbstractUIPlugin.java:664)
17:27:26 [2021-02-04T22:27:26.273Z] 	at org.eclipse.ui.internal.ide.SymlinkDecorator.<clinit>(SymlinkDecorator.java:32)
17:27:26 [2021-02-04T22:27:26.273Z] 	... 21 more
17:27:26 [2021-02-04T22:27:26.273Z] 
17:27:26 [2021-02-04T22:27:26.273Z] !ENTRY org.eclipse.ui 4 0 2021-02-04 22:27:26.055
17:27:26 [2021-02-04T22:27:26.273Z] !MESSAGE Error occurred during status handling
17:27:26 [2021-02-04T22:27:26.273Z] !STACK 0
17:27:26 [2021-02-04T22:27:26.273Z] java.lang.NullPointerException
17:27:26 [2021-02-04T22:27:26.273Z] 	at org.eclipse.ui.internal.statushandlers.StatusHandlerRegistry.<init>(StatusHandlerRegistry.java:71)
17:27:26 [2021-02-04T22:27:26.273Z] 	at org.eclipse.ui.internal.statushandlers.StatusHandlerRegistry.getDefault(StatusHandlerRegistry.java:90)
17:27:26 [2021-02-04T22:27:26.273Z] 	at org.eclipse.ui.statushandlers.StatusManager.getStatusHandler(StatusManager.java:152)
17:27:26 [2021-02-04T22:27:26.273Z] 	at org.eclipse.ui.statushandlers.StatusManager.handle(StatusManager.java:211)
17:27:26 [2021-02-04T22:27:26.273Z] 	at org.eclipse.ui.statushandlers.StatusManager.handle(StatusManager.java:260)
17:27:26 [2021-02-04T22:27:26.273Z] 	at org.eclipse.ui.statushandlers.StatusManager$StatusManagerLogListener.logging(StatusManager.java:331)
17:27:26 [2021-02-04T22:27:26.273Z] 	at org.eclipse.core.internal.runtime.RuntimeLog.logToListeners(RuntimeLog.java:161)
17:27:26 [2021-02-04T22:27:26.273Z] 	at org.eclipse.core.internal.runtime.PlatformLogWriter.logged(PlatformLogWriter.java:103)
17:27:26 [2021-02-04T22:27:26.273Z] 	at org.eclipse.osgi.internal.log.ExtendedLogReaderServiceFactory.safeLogged(ExtendedLogReaderServiceFactory.java:88)
17:27:26 [2021-02-04T22:27:26.273Z] 	at org.eclipse.osgi.internal.log.ExtendedLogReaderServiceFactory.logPrivileged(ExtendedLogReaderServiceFactory.java:217)
17:27:26 [2021-02-04T22:27:26.273Z] 	at org.eclipse.osgi.internal.log.ExtendedLogReaderServiceFactory.log(ExtendedLogReaderServiceFactory.java:189)
17:27:26 [2021-02-04T22:27:26.273Z] 	at org.eclipse.osgi.internal.log.ExtendedLogServiceFactory.log(ExtendedLogServiceFactory.java:65)
17:27:26 [2021-02-04T22:27:26.273Z] 	at org.eclipse.osgi.internal.log.ExtendedLogServiceImpl.log(ExtendedLogServiceImpl.java:87)
17:27:26 [2021-02-04T22:27:26.273Z] 	at org.eclipse.osgi.internal.log.LoggerImpl.log(LoggerImpl.java:54)
17:27:26 [2021-02-04T22:27:26.273Z] 	at org.eclipse.core.internal.runtime.Log.log(Log.java:65)
17:27:26 [2021-02-04T22:27:26.273Z] 	at org.eclipse.ui.internal.WorkbenchPlugin.log(WorkbenchPlugin.java:663)
17:27:26 [2021-02-04T22:27:26.273Z] 	at org.eclipse.ui.internal.decorators.DecoratorDefinition.handleCoreException(DecoratorDefinition.java:266)
17:27:26 [2021-02-04T22:27:26.273Z] 	at org.eclipse.ui.internal.decorators.LightweightDecoratorDefinition.decorate(LightweightDecoratorDefinition.java:263)
17:27:26 [2021-02-04T22:27:26.273Z] 	at org.eclipse.ui.internal.decorators.LightweightDecoratorManager$LightweightRunnable.run(LightweightDecoratorManager.java:104)
17:27:26 [2021-02-04T22:27:26.273Z] 	at org.eclipse.core.runtime.SafeRunner.run(SafeRunner.java:42)
17:27:26 [2021-02-04T22:27:26.273Z] 	at org.eclipse.ui.internal.decorators.LightweightDecoratorManager.decorate(LightweightDecoratorManager.java:377)
17:27:26 [2021-02-04T22:27:26.273Z] 	at org.eclipse.ui.internal.decorators.LightweightDecoratorManager.getDecorations(LightweightDecoratorManager.java:359)
17:27:26 [2021-02-04T22:27:26.273Z] 	at org.eclipse.ui.internal.decorators.DecorationScheduler$1.ensureResultCached(DecorationScheduler.java:347)
17:27:26 [2021-02-04T22:27:26.273Z] 	at org.eclipse.ui.internal.decorators.DecorationScheduler$1.run(DecorationScheduler.java:311)
17:27:26 [2021-02-04T22:27:26.273Z] 	at org.eclipse.core.internal.jobs.Worker.run(Worker.java:56)
17:27:26 [2021-02-04T22:27:26.273Z] 
17:27:26 [2021-02-04T22:27:26.273Z] !ENTRY org.eclipse.equinox.registry 4 1 2021-02-04 22:27:26.056
17:27:26 [2021-02-04T22:27:26.273Z] !MESSAGE Plug-in "org.eclipse.ui.ide" was unable to instantiate class "org.eclipse.ui.internal.ide.LinkedResourceDecorator".
17:27:26 [2021-02-04T22:27:26.273Z] !STACK 0
17:27:26 [2021-02-04T22:27:26.273Z] java.lang.ExceptionInInitializerError
17:27:26 [2021-02-04T22:27:26.273Z] 	at sun.reflect.NativeConstructorAccessorImpl.newInstance0(Native Method)
17:27:26 [2021-02-04T22:27:26.273Z] 	at sun.reflect.NativeConstructorAccessorImpl.newInstance(NativeConstructorAccessorImpl.java:62)
17:27:26 [2021-02-04T22:27:26.273Z] 	at sun.reflect.DelegatingConstructorAccessorImpl.newInstance(DelegatingConstructorAccessorImpl.java:45)
17:27:26 [2021-02-04T22:27:26.273Z] 	at java.lang.reflect.Constructor.newInstance(Constructor.java:423)
17:27:26 [2021-02-04T22:27:26.273Z] 	at java.lang.Class.newInstance(Class.java:442)
17:27:26 [2021-02-04T22:27:26.273Z] 	at org.eclipse.core.internal.registry.osgi.RegistryStrategyOSGI.createExecutableExtension(RegistryStrategyOSGI.java:184)
17:27:26 [2021-02-04T22:27:26.273Z] 	at org.eclipse.core.internal.registry.ExtensionRegistry.createExecutableExtension(ExtensionRegistry.java:905)
17:27:26 [2021-02-04T22:27:26.273Z] 	at org.eclipse.core.internal.registry.ConfigurationElement.createExecutableExtension(ConfigurationElement.java:243)
17:27:26 [2021-02-04T22:27:26.273Z] 	at org.eclipse.core.internal.registry.ConfigurationElementHandle.createExecutableExtension(ConfigurationElementHandle.java:55)
17:27:26 [2021-02-04T22:27:26.273Z] 	at org.eclipse.ui.internal.WorkbenchPlugin.createExtension(WorkbenchPlugin.java:281)
17:27:26 [2021-02-04T22:27:26.273Z] 	at org.eclipse.ui.internal.decorators.LightweightDecoratorDefinition$1.run(LightweightDecoratorDefinition.java:125)
17:27:26 [2021-02-04T22:27:26.273Z] 	at org.eclipse.core.runtime.SafeRunner.run(SafeRunner.java:42)
17:27:26 [2021-02-04T22:27:26.273Z] 	at org.eclipse.ui.internal.decorators.LightweightDecoratorDefinition.internalGetDecorator(LightweightDecoratorDefinition.java:120)
17:27:26 [2021-02-04T22:27:26.273Z] 	at org.eclipse.ui.internal.decorators.LightweightDecoratorDefinition.decorate(LightweightDecoratorDefinition.java:242)
17:27:26 [2021-02-04T22:27:26.273Z] 	at org.eclipse.ui.internal.decorators.LightweightDecoratorManager$LightweightRunnable.run(LightweightDecoratorManager.java:104)
17:27:26 [2021-02-04T22:27:26.273Z] 	at org.eclipse.core.runtime.SafeRunner.run(SafeRunner.java:42)
17:27:26 [2021-02-04T22:27:26.273Z] 	at org.eclipse.ui.internal.decorators.LightweightDecoratorManager.decorate(LightweightDecoratorManager.java:377)
17:27:26 [2021-02-04T22:27:26.273Z] 	at org.eclipse.ui.internal.decorators.LightweightDecoratorManager.getDecorations(LightweightDecoratorManager.java:359)
17:27:26 [2021-02-04T22:27:26.273Z] 	at org.eclipse.ui.internal.decorators.DecorationScheduler$1.ensureResultCached(DecorationScheduler.java:347)
17:27:26 [2021-02-04T22:27:26.273Z] 	at org.eclipse.ui.internal.decorators.DecorationScheduler$1.run(DecorationScheduler.java:311)
17:27:26 [2021-02-04T22:27:26.273Z] 	at org.eclipse.core.internal.jobs.Worker.run(Worker.java:56)
17:27:26 [2021-02-04T22:27:26.273Z] Caused by: java.lang.NullPointerException
17:27:26 [2021-02-04T22:27:26.273Z] 	at org.eclipse.ui.plugin.AbstractUIPlugin.imageDescriptorFromPlugin(AbstractUIPlugin.java:664)
17:27:26 [2021-02-04T22:27:26.273Z] 	at org.eclipse.ui.internal.ide.LinkedResourceDecorator.<clinit>(LinkedResourceDecorator.java:37)
17:27:26 [2021-02-04T22:27:26.273Z] 	... 21 more
17:27:26 [2021-02-04T22:27:26.273Z] 
17:27:26 [2021-02-04T22:27:26.273Z] !ENTRY org.eclipse.equinox.registry 4 1 2021-02-04 22:27:26.056
17:27:26 [2021-02-04T22:27:26.273Z] !MESSAGE Plug-in "org.eclipse.ui.ide" was unable to instantiate class "org.eclipse.ui.internal.ide.LinkedResourceDecorator".
17:27:26 [2021-02-04T22:27:26.273Z] !STACK 0
17:27:26 [2021-02-04T22:27:26.273Z] java.lang.ExceptionInInitializerError
17:27:26 [2021-02-04T22:27:26.273Z] 	at sun.reflect.NativeConstructorAccessorImpl.newInstance0(Native Method)
17:27:26 [2021-02-04T22:27:26.273Z] 	at sun.reflect.NativeConstructorAccessorImpl.newInstance(NativeConstructorAccessorImpl.java:62)
17:27:26 [2021-02-04T22:27:26.273Z] 	at sun.reflect.DelegatingConstructorAccessorImpl.newInstance(DelegatingConstructorAccessorImpl.java:45)
17:27:26 [2021-02-04T22:27:26.273Z] 	at java.lang.reflect.Constructor.newInstance(Constructor.java:423)
17:27:26 [2021-02-04T22:27:26.273Z] 	at java.lang.Class.newInstance(Class.java:442)
17:27:26 [2021-02-04T22:27:26.273Z] 	at org.eclipse.core.internal.registry.osgi.RegistryStrategyOSGI.createExecutableExtension(RegistryStrategyOSGI.java:184)
17:27:26 [2021-02-04T22:27:26.273Z] 	at org.eclipse.core.internal.registry.ExtensionRegistry.createExecutableExtension(ExtensionRegistry.java:905)
17:27:26 [2021-02-04T22:27:26.273Z] 	at org.eclipse.core.internal.registry.ConfigurationElement.createExecutableExtension(ConfigurationElement.java:243)
17:27:26 [2021-02-04T22:27:26.273Z] 	at org.eclipse.core.internal.registry.ConfigurationElementHandle.createExecutableExtension(ConfigurationElementHandle.java:55)
17:27:26 [2021-02-04T22:27:26.274Z] 	at org.eclipse.ui.internal.WorkbenchPlugin.createExtension(WorkbenchPlugin.java:281)
17:27:26 [2021-02-04T22:27:26.274Z] 	at org.eclipse.ui.internal.decorators.LightweightDecoratorDefinition$1.run(LightweightDecoratorDefinition.java:125)
17:27:26 [2021-02-04T22:27:26.274Z] 	at org.eclipse.core.runtime.SafeRunner.run(SafeRunner.java:42)
17:27:26 [2021-02-04T22:27:26.274Z] 	at org.eclipse.ui.internal.decorators.LightweightDecoratorDefinition.internalGetDecorator(LightweightDecoratorDefinition.java:120)
17:27:26 [2021-02-04T22:27:26.274Z] 	at org.eclipse.ui.internal.decorators.LightweightDecoratorDefinition.decorate(LightweightDecoratorDefinition.java:242)
17:27:26 [2021-02-04T22:27:26.274Z] 	at org.eclipse.ui.internal.decorators.LightweightDecoratorManager$LightweightRunnable.run(LightweightDecoratorManager.java:104)
17:27:26 [2021-02-04T22:27:26.274Z] 	at org.eclipse.core.runtime.SafeRunner.run(SafeRunner.java:42)
17:27:26 [2021-02-04T22:27:26.274Z] 	at org.eclipse.ui.internal.decorators.LightweightDecoratorManager.decorate(LightweightDecoratorManager.java:377)
17:27:26 [2021-02-04T22:27:26.274Z] 	at org.eclipse.ui.internal.decorators.LightweightDecoratorManager.getDecorations(LightweightDecoratorManager.java:359)
17:27:26 [2021-02-04T22:27:26.274Z] 	at org.eclipse.ui.internal.decorators.DecorationScheduler$1.ensureResultCached(DecorationScheduler.java:347)
17:27:26 [2021-02-04T22:27:26.274Z] 	at org.eclipse.ui.internal.decorators.DecorationScheduler$1.run(DecorationScheduler.java:311)
17:27:26 [2021-02-04T22:27:26.274Z] 	at org.eclipse.core.internal.jobs.Worker.run(Worker.java:56)
17:27:26 [2021-02-04T22:27:26.274Z] Caused by: java.lang.NullPointerException
17:27:26 [2021-02-04T22:27:26.274Z] 	at org.eclipse.ui.plugin.AbstractUIPlugin.imageDescriptorFromPlugin(AbstractUIPlugin.java:664)
17:27:26 [2021-02-04T22:27:26.274Z] 	at org.eclipse.ui.internal.ide.LinkedResourceDecorator.<clinit>(LinkedResourceDecorator.java:37)
17:27:26 [2021-02-04T22:27:26.274Z] 	... 21 more
17:27:26 [2021-02-04T22:27:26.274Z] 
17:27:26 [2021-02-04T22:27:26.274Z] !ENTRY org.eclipse.ui 4 0 2021-02-04 22:27:26.056
17:27:26 [2021-02-04T22:27:26.274Z] !MESSAGE Error occurred during status handling
17:27:26 [2021-02-04T22:27:26.274Z] !STACK 0
17:27:26 [2021-02-04T22:27:26.274Z] java.lang.NullPointerException
17:27:26 [2021-02-04T22:27:26.274Z] 	at org.eclipse.ui.internal.statushandlers.StatusHandlerRegistry.<init>(StatusHandlerRegistry.java:71)
17:27:26 [2021-02-04T22:27:26.274Z] 	at org.eclipse.ui.internal.statushandlers.StatusHandlerRegistry.getDefault(StatusHandlerRegistry.java:90)
17:27:26 [2021-02-04T22:27:26.274Z] 	at org.eclipse.ui.statushandlers.StatusManager.getStatusHandler(StatusManager.java:152)
17:27:26 [2021-02-04T22:27:26.274Z] 	at org.eclipse.ui.statushandlers.StatusManager.handle(StatusManager.java:211)
17:27:26 [2021-02-04T22:27:26.274Z] 	at org.eclipse.ui.statushandlers.StatusManager.handle(StatusManager.java:260)
17:27:26 [2021-02-04T22:27:26.274Z] 	at org.eclipse.ui.statushandlers.StatusManager$StatusManagerLogListener.logging(StatusManager.java:331)
17:27:26 [2021-02-04T22:27:26.274Z] 	at org.eclipse.core.internal.runtime.RuntimeLog.logToListeners(RuntimeLog.java:161)
17:27:26 [2021-02-04T22:27:26.274Z] 	at org.eclipse.core.internal.runtime.PlatformLogWriter.logged(PlatformLogWriter.java:103)
17:27:26 [2021-02-04T22:27:26.274Z] 	at org.eclipse.osgi.internal.log.ExtendedLogReaderServiceFactory.safeLogged(ExtendedLogReaderServiceFactory.java:88)
17:27:26 [2021-02-04T22:27:26.274Z] 	at org.eclipse.osgi.internal.log.ExtendedLogReaderServiceFactory.logPrivileged(ExtendedLogReaderServiceFactory.java:217)
17:27:26 [2021-02-04T22:27:26.274Z] 	at org.eclipse.osgi.internal.log.ExtendedLogReaderServiceFactory.log(ExtendedLogReaderServiceFactory.java:189)
17:27:26 [2021-02-04T22:27:26.274Z] 	at org.eclipse.osgi.internal.log.ExtendedLogServiceFactory.log(ExtendedLogServiceFactory.java:65)
17:27:26 [2021-02-04T22:27:26.274Z] 	at org.eclipse.osgi.internal.log.ExtendedLogServiceImpl.log(ExtendedLogServiceImpl.java:87)
17:27:26 [2021-02-04T22:27:26.274Z] 	at org.eclipse.osgi.internal.log.LoggerImpl.log(LoggerImpl.java:54)
17:27:26 [2021-02-04T22:27:26.274Z] 	at org.eclipse.core.internal.runtime.Log.log(Log.java:65)
17:27:26 [2021-02-04T22:27:26.274Z] 	at org.eclipse.ui.internal.WorkbenchPlugin.log(WorkbenchPlugin.java:663)
17:27:26 [2021-02-04T22:27:26.274Z] 	at org.eclipse.ui.internal.decorators.DecoratorDefinition.handleCoreException(DecoratorDefinition.java:266)
17:27:26 [2021-02-04T22:27:26.274Z] 	at org.eclipse.ui.internal.decorators.LightweightDecoratorDefinition.decorate(LightweightDecoratorDefinition.java:263)
17:27:26 [2021-02-04T22:27:26.274Z] 	at org.eclipse.ui.internal.decorators.LightweightDecoratorManager$LightweightRunnable.run(LightweightDecoratorManager.java:104)
17:27:26 [2021-02-04T22:27:26.274Z] 	at org.eclipse.core.runtime.SafeRunner.run(SafeRunner.java:42)
17:27:26 [2021-02-04T22:27:26.274Z] 	at org.eclipse.ui.internal.decorators.LightweightDecoratorManager.decorate(LightweightDecoratorManager.java:377)
17:27:26 [2021-02-04T22:27:26.274Z] 	at org.eclipse.ui.internal.decorators.LightweightDecoratorManager.getDecorations(LightweightDecoratorManager.java:359)
17:27:26 [2021-02-04T22:27:26.274Z] 	at org.eclipse.ui.internal.decorators.DecorationScheduler$1.ensureResultCached(DecorationScheduler.java:347)
17:27:26 [2021-02-04T22:27:26.274Z] 	at org.eclipse.ui.internal.decorators.DecorationScheduler$1.run(DecorationScheduler.java:311)
17:27:26 [2021-02-04T22:27:26.274Z] 	at org.eclipse.core.internal.jobs.Worker.run(Worker.java:56)
17:27:26 [2021-02-04T22:27:26.274Z] 
17:27:26 [2021-02-04T22:27:26.274Z] !ENTRY org.eclipse.equinox.registry 4 1 2021-02-04 22:27:26.057
17:27:26 [2021-02-04T22:27:26.274Z] !MESSAGE Plug-in "org.eclipse.ui.ide" was unable to instantiate class "org.eclipse.ui.internal.ide.VirtualResourceDecorator".
17:27:26 [2021-02-04T22:27:26.274Z] !STACK 0
17:27:26 [2021-02-04T22:27:26.274Z] java.lang.ExceptionInInitializerError
17:27:26 [2021-02-04T22:27:26.274Z] 	at sun.reflect.NativeConstructorAccessorImpl.newInstance0(Native Method)
17:27:26 [2021-02-04T22:27:26.274Z] 	at sun.reflect.NativeConstructorAccessorImpl.newInstance(NativeConstructorAccessorImpl.java:62)
17:27:26 [2021-02-04T22:27:26.274Z] 	at sun.reflect.DelegatingConstructorAccessorImpl.newInstance(DelegatingConstructorAccessorImpl.java:45)
17:27:26 [2021-02-04T22:27:26.274Z] 	at java.lang.reflect.Constructor.newInstance(Constructor.java:423)
17:27:26 [2021-02-04T22:27:26.274Z] 	at java.lang.Class.newInstance(Class.java:442)
17:27:26 [2021-02-04T22:27:26.274Z] 	at org.eclipse.core.internal.registry.osgi.RegistryStrategyOSGI.createExecutableExtension(RegistryStrategyOSGI.java:184)
17:27:26 [2021-02-04T22:27:26.274Z] 	at org.eclipse.core.internal.registry.ExtensionRegistry.createExecutableExtension(ExtensionRegistry.java:905)
17:27:26 [2021-02-04T22:27:26.274Z] 	at org.eclipse.core.internal.registry.ConfigurationElement.createExecutableExtension(ConfigurationElement.java:243)
17:27:26 [2021-02-04T22:27:26.274Z] 	at org.eclipse.core.internal.registry.ConfigurationElementHandle.createExecutableExtension(ConfigurationElementHandle.java:55)
17:27:26 [2021-02-04T22:27:26.274Z] 	at org.eclipse.ui.internal.WorkbenchPlugin.createExtension(WorkbenchPlugin.java:281)
17:27:26 [2021-02-04T22:27:26.274Z] 	at org.eclipse.ui.internal.decorators.LightweightDecoratorDefinition$1.run(LightweightDecoratorDefinition.java:125)
17:27:26 [2021-02-04T22:27:26.274Z] 	at org.eclipse.core.runtime.SafeRunner.run(SafeRunner.java:42)
17:27:26 [2021-02-04T22:27:26.274Z] 	at org.eclipse.ui.internal.decorators.LightweightDecoratorDefinition.internalGetDecorator(LightweightDecoratorDefinition.java:120)
17:27:26 [2021-02-04T22:27:26.274Z] 	at org.eclipse.ui.internal.decorators.LightweightDecoratorDefinition.decorate(LightweightDecoratorDefinition.java:242)
17:27:26 [2021-02-04T22:27:26.274Z] 	at org.eclipse.ui.internal.decorators.LightweightDecoratorManager$LightweightRunnable.run(LightweightDecoratorManager.java:104)
17:27:26 [2021-02-04T22:27:26.274Z] 	at org.eclipse.core.runtime.SafeRunner.run(SafeRunner.java:42)
17:27:26 [2021-02-04T22:27:26.274Z] 	at org.eclipse.ui.internal.decorators.LightweightDecoratorManager.decorate(LightweightDecoratorManager.java:377)
17:27:26 [2021-02-04T22:27:26.274Z] 	at org.eclipse.ui.internal.decorators.LightweightDecoratorManager.getDecorations(LightweightDecoratorManager.java:359)
17:27:26 [2021-02-04T22:27:26.274Z] 	at org.eclipse.ui.internal.decorators.DecorationScheduler$1.ensureResultCached(DecorationScheduler.java:347)
17:27:26 [2021-02-04T22:27:26.274Z] 	at org.eclipse.ui.internal.decorators.DecorationScheduler$1.run(DecorationScheduler.java:311)
17:27:26 [2021-02-04T22:27:26.274Z] 	at org.eclipse.core.internal.jobs.Worker.run(Worker.java:56)
17:27:26 [2021-02-04T22:27:26.274Z] Caused by: java.lang.NullPointerException
17:27:26 [2021-02-04T22:27:26.274Z] 	at org.eclipse.ui.plugin.AbstractUIPlugin.imageDescriptorFromPlugin(AbstractUIPlugin.java:664)
17:27:26 [2021-02-04T22:27:26.274Z] 	at org.eclipse.ui.internal.ide.VirtualResourceDecorator.<clinit>(VirtualResourceDecorator.java:30)
17:27:26 [2021-02-04T22:27:26.274Z] 	... 21 more
17:27:26 [2021-02-04T22:27:26.274Z] 
17:27:26 [2021-02-04T22:27:26.274Z] !ENTRY org.eclipse.equinox.registry 4 1 2021-02-04 22:27:26.058
17:27:26 [2021-02-04T22:27:26.274Z] !MESSAGE Plug-in "org.eclipse.ui.ide" was unable to instantiate class "org.eclipse.ui.internal.ide.VirtualResourceDecorator".
17:27:26 [2021-02-04T22:27:26.275Z] !STACK 0
17:27:26 [2021-02-04T22:27:26.275Z] java.lang.ExceptionInInitializerError
17:27:26 [2021-02-04T22:27:26.275Z] 	at sun.reflect.NativeConstructorAccessorImpl.newInstance0(Native Method)
17:27:26 [2021-02-04T22:27:26.275Z] 	at sun.reflect.NativeConstructorAccessorImpl.newInstance(NativeConstructorAccessorImpl.java:62)
17:27:26 [2021-02-04T22:27:26.275Z] 	at sun.reflect.DelegatingConstructorAccessorImpl.newInstance(DelegatingConstructorAccessorImpl.java:45)
17:27:26 [2021-02-04T22:27:26.275Z] 	at java.lang.reflect.Constructor.newInstance(Constructor.java:423)
17:27:26 [2021-02-04T22:27:26.275Z] 	at java.lang.Class.newInstance(Class.java:442)
17:27:26 [2021-02-04T22:27:26.275Z] 	at org.eclipse.core.internal.registry.osgi.RegistryStrategyOSGI.createExecutableExtension(RegistryStrategyOSGI.java:184)
17:27:26 [2021-02-04T22:27:26.275Z] 	at org.eclipse.core.internal.registry.ExtensionRegistry.createExecutableExtension(ExtensionRegistry.java:905)
17:27:26 [2021-02-04T22:27:26.275Z] 	at org.eclipse.core.internal.registry.ConfigurationElement.createExecutableExtension(ConfigurationElement.java:243)
17:27:26 [2021-02-04T22:27:26.275Z] 	at org.eclipse.core.internal.registry.ConfigurationElementHandle.createExecutableExtension(ConfigurationElementHandle.java:55)
17:27:26 [2021-02-04T22:27:26.275Z] 	at org.eclipse.ui.internal.WorkbenchPlugin.createExtension(WorkbenchPlugin.java:281)
17:27:26 [2021-02-04T22:27:26.275Z] 	at org.eclipse.ui.internal.decorators.LightweightDecoratorDefinition$1.run(LightweightDecoratorDefinition.java:125)
17:27:26 [2021-02-04T22:27:26.275Z] 	at org.eclipse.core.runtime.SafeRunner.run(SafeRunner.java:42)
17:27:26 [2021-02-04T22:27:26.275Z] 	at org.eclipse.ui.internal.decorators.LightweightDecoratorDefinition.internalGetDecorator(LightweightDecoratorDefinition.java:120)
17:27:26 [2021-02-04T22:27:26.275Z] 	at org.eclipse.ui.internal.decorators.LightweightDecoratorDefinition.decorate(LightweightDecoratorDefinition.java:242)
17:27:26 [2021-02-04T22:27:26.275Z] 	at org.eclipse.ui.internal.decorators.LightweightDecoratorManager$LightweightRunnable.run(LightweightDecoratorManager.java:104)
17:27:26 [2021-02-04T22:27:26.275Z] 	at org.eclipse.core.runtime.SafeRunner.run(SafeRunner.java:42)
17:27:26 [2021-02-04T22:27:26.275Z] 	at org.eclipse.ui.internal.decorators.LightweightDecoratorManager.decorate(LightweightDecoratorManager.java:377)
17:27:26 [2021-02-04T22:27:26.275Z] 	at org.eclipse.ui.internal.decorators.LightweightDecoratorManager.getDecorations(LightweightDecoratorManager.java:359)
17:27:26 [2021-02-04T22:27:26.275Z] 	at org.eclipse.ui.internal.decorators.DecorationScheduler$1.ensureResultCached(DecorationScheduler.java:347)
17:27:26 [2021-02-04T22:27:26.275Z] 	at org.eclipse.ui.internal.decorators.DecorationScheduler$1.run(DecorationScheduler.java:311)
17:27:26 [2021-02-04T22:27:26.275Z] 	at org.eclipse.core.internal.jobs.Worker.run(Worker.java:56)
17:27:26 [2021-02-04T22:27:26.275Z] Caused by: java.lang.NullPointerException
17:27:26 [2021-02-04T22:27:26.275Z] 	at org.eclipse.ui.plugin.AbstractUIPlugin.imageDescriptorFromPlugin(AbstractUIPlugin.java:664)
17:27:26 [2021-02-04T22:27:26.275Z] 	at org.eclipse.ui.internal.ide.VirtualResourceDecorator.<clinit>(VirtualResourceDecorator.java:30)
17:27:26 [2021-02-04T22:27:26.275Z] 	... 21 more
17:27:26 [2021-02-04T22:27:26.275Z] 
17:27:26 [2021-02-04T22:27:26.275Z] !ENTRY org.eclipse.ui 4 0 2021-02-04 22:27:26.058
17:27:26 [2021-02-04T22:27:26.275Z] !MESSAGE Error occurred during status handling
17:27:26 [2021-02-04T22:27:26.275Z] !STACK 0
17:27:26 [2021-02-04T22:27:26.275Z] java.lang.NullPointerException
17:27:26 [2021-02-04T22:27:26.275Z] 	at org.eclipse.ui.internal.statushandlers.StatusHandlerRegistry.<init>(StatusHandlerRegistry.java:71)
17:27:26 [2021-02-04T22:27:26.275Z] 	at org.eclipse.ui.internal.statushandlers.StatusHandlerRegistry.getDefault(StatusHandlerRegistry.java:90)
17:27:26 [2021-02-04T22:27:26.275Z] 	at org.eclipse.ui.statushandlers.StatusManager.getStatusHandler(StatusManager.java:152)
17:27:26 [2021-02-04T22:27:26.275Z] 	at org.eclipse.ui.statushandlers.StatusManager.handle(StatusManager.java:211)
17:27:26 [2021-02-04T22:27:26.275Z] 	at org.eclipse.ui.statushandlers.StatusManager.handle(StatusManager.java:260)
17:27:26 [2021-02-04T22:27:26.275Z] 	at org.eclipse.ui.statushandlers.StatusManager$StatusManagerLogListener.logging(StatusManager.java:331)
17:27:26 [2021-02-04T22:27:26.275Z] 	at org.eclipse.core.internal.runtime.RuntimeLog.logToListeners(RuntimeLog.java:161)
17:27:26 [2021-02-04T22:27:26.275Z] 	at org.eclipse.core.internal.runtime.PlatformLogWriter.logged(PlatformLogWriter.java:103)
17:27:26 [2021-02-04T22:27:26.275Z] 	at org.eclipse.osgi.internal.log.ExtendedLogReaderServiceFactory.safeLogged(ExtendedLogReaderServiceFactory.java:88)
17:27:26 [2021-02-04T22:27:26.275Z] 	at org.eclipse.osgi.internal.log.ExtendedLogReaderServiceFactory.logPrivileged(ExtendedLogReaderServiceFactory.java:217)
17:27:26 [2021-02-04T22:27:26.275Z] 	at org.eclipse.osgi.internal.log.ExtendedLogReaderServiceFactory.log(ExtendedLogReaderServiceFactory.java:189)
17:27:26 [2021-02-04T22:27:26.275Z] 	at org.eclipse.osgi.internal.log.ExtendedLogServiceFactory.log(ExtendedLogServiceFactory.java:65)
17:27:26 [2021-02-04T22:27:26.275Z] 	at org.eclipse.osgi.internal.log.ExtendedLogServiceImpl.log(ExtendedLogServiceImpl.java:87)
17:27:26 [2021-02-04T22:27:26.275Z] 	at org.eclipse.osgi.internal.log.LoggerImpl.log(LoggerImpl.java:54)
17:27:26 [2021-02-04T22:27:26.275Z] 	at org.eclipse.core.internal.runtime.Log.log(Log.java:65)
17:27:26 [2021-02-04T22:27:26.275Z] 	at org.eclipse.ui.internal.WorkbenchPlugin.log(WorkbenchPlugin.java:663)
17:27:26 [2021-02-04T22:27:26.275Z] 	at org.eclipse.ui.internal.decorators.DecoratorDefinition.handleCoreException(DecoratorDefinition.java:266)
17:27:26 [2021-02-04T22:27:26.275Z] 	at org.eclipse.ui.internal.decorators.LightweightDecoratorDefinition.decorate(LightweightDecoratorDefinition.java:263)
17:27:26 [2021-02-04T22:27:26.275Z] 	at org.eclipse.ui.internal.decorators.LightweightDecoratorManager$LightweightRunnable.run(LightweightDecoratorManager.java:104)
17:27:26 [2021-02-04T22:27:26.275Z] 	at org.eclipse.core.runtime.SafeRunner.run(SafeRunner.java:42)
17:27:26 [2021-02-04T22:27:26.275Z] 	at org.eclipse.ui.internal.decorators.LightweightDecoratorManager.decorate(LightweightDecoratorManager.java:377)
17:27:26 [2021-02-04T22:27:26.275Z] 	at org.eclipse.ui.internal.decorators.LightweightDecoratorManager.getDecorations(LightweightDecoratorManager.java:359)
17:27:26 [2021-02-04T22:27:26.275Z] 	at org.eclipse.ui.internal.decorators.DecorationScheduler$1.ensureResultCached(DecorationScheduler.java:347)
17:27:26 [2021-02-04T22:27:26.275Z] 	at org.eclipse.ui.internal.decorators.DecorationScheduler$1.run(DecorationScheduler.java:311)
17:27:26 [2021-02-04T22:27:26.275Z] 	at org.eclipse.core.internal.jobs.Worker.run(Worker.java:56)
17:27:26 [2021-02-04T22:27:26.275Z] 
17:27:26 [2021-02-04T22:27:26.275Z] !ENTRY org.eclipse.ui.workbench 4 2 2021-02-04 22:27:26.059
17:27:26 [2021-02-04T22:27:26.275Z] !MESSAGE Problems occurred when invoking code from plug-in: "org.eclipse.ui.workbench".
17:27:26 [2021-02-04T22:27:26.275Z] !STACK 0
17:27:26 [2021-02-04T22:27:26.275Z] java.lang.IllegalArgumentException
17:27:26 [2021-02-04T22:27:26.275Z] 	at org.eclipse.core.runtime.ListenerList.add(ListenerList.java:115)
17:27:26 [2021-02-04T22:27:26.275Z] 	at org.eclipse.jdt.internal.ui.AbstractJavaElementLabelDecorator.addListener(AbstractJavaElementLabelDecorator.java:59)
17:27:26 [2021-02-04T22:27:26.275Z] 	at org.eclipse.ui.internal.decorators.LightweightDecoratorDefinition$1.run(LightweightDecoratorDefinition.java:127)
17:27:26 [2021-02-04T22:27:26.275Z] 	at org.eclipse.core.runtime.SafeRunner.run(SafeRunner.java:42)
17:27:26 [2021-02-04T22:27:26.275Z] 	at org.eclipse.ui.internal.decorators.LightweightDecoratorDefinition.internalGetDecorator(LightweightDecoratorDefinition.java:120)
17:27:26 [2021-02-04T22:27:26.275Z] 	at org.eclipse.ui.internal.decorators.LightweightDecoratorDefinition.decorate(LightweightDecoratorDefinition.java:242)
17:27:26 [2021-02-04T22:27:26.275Z] 	at org.eclipse.ui.internal.decorators.LightweightDecoratorManager$LightweightRunnable.run(LightweightDecoratorManager.java:104)
17:27:26 [2021-02-04T22:27:26.275Z] 	at org.eclipse.core.runtime.SafeRunner.run(SafeRunner.java:42)
17:27:26 [2021-02-04T22:27:26.275Z] 	at org.eclipse.ui.internal.decorators.LightweightDecoratorManager.decorate(LightweightDecoratorManager.java:377)
17:27:26 [2021-02-04T22:27:26.275Z] 	at org.eclipse.ui.internal.decorators.LightweightDecoratorManager.getDecorations(LightweightDecoratorManager.java:359)
17:27:26 [2021-02-04T22:27:26.275Z] 	at org.eclipse.ui.internal.decorators.DecorationScheduler$1.ensureResultCached(DecorationScheduler.java:347)
17:27:26 [2021-02-04T22:27:26.275Z] 	at org.eclipse.ui.internal.decorators.DecorationScheduler$1.run(DecorationScheduler.java:311)
17:27:26 [2021-02-04T22:27:26.275Z] 	at org.eclipse.core.internal.jobs.Worker.run(Worker.java:56)
17:27:26 [2021-02-04T22:27:26.275Z] 
17:27:26 [2021-02-04T22:27:26.275Z] !ENTRY org.eclipse.ui.workbench 4 2 2021-02-04 22:27:26.059
17:27:26 [2021-02-04T22:27:26.275Z] !MESSAGE Problems occurred when invoking code from plug-in: "org.eclipse.ui.workbench".
17:27:26 [2021-02-04T22:27:26.275Z] !STACK 0
17:27:26 [2021-02-04T22:27:26.275Z] java.lang.IllegalArgumentException
17:27:26 [2021-02-04T22:27:26.275Z] 	at org.eclipse.core.runtime.ListenerList.add(ListenerList.java:115)
17:27:26 [2021-02-04T22:27:26.275Z] 	at org.eclipse.jdt.internal.ui.AbstractJavaElementLabelDecorator.addListener(AbstractJavaElementLabelDecorator.java:59)
17:27:26 [2021-02-04T22:27:26.275Z] 	at org.eclipse.ui.internal.decorators.LightweightDecoratorDefinition$1.run(LightweightDecoratorDefinition.java:127)
17:27:26 [2021-02-04T22:27:26.275Z] 	at org.eclipse.core.runtime.SafeRunner.run(SafeRunner.java:42)
17:27:26 [2021-02-04T22:27:26.275Z] 	at org.eclipse.ui.internal.decorators.LightweightDecoratorDefinition.internalGetDecorator(LightweightDecoratorDefinition.java:120)
17:27:26 [2021-02-04T22:27:26.276Z] 	at org.eclipse.ui.internal.decorators.LightweightDecoratorDefinition.decorate(LightweightDecoratorDefinition.java:242)
17:27:26 [2021-02-04T22:27:26.276Z] 	at org.eclipse.ui.internal.decorators.LightweightDecoratorManager$LightweightRunnable.run(LightweightDecoratorManager.java:104)
17:27:26 [2021-02-04T22:27:26.276Z] 	at org.eclipse.core.runtime.SafeRunner.run(SafeRunner.java:42)
17:27:26 [2021-02-04T22:27:26.276Z] 	at org.eclipse.ui.internal.decorators.LightweightDecoratorManager.decorate(LightweightDecoratorManager.java:377)
17:27:26 [2021-02-04T22:27:26.276Z] 	at org.eclipse.ui.internal.decorators.LightweightDecoratorManager.getDecorations(LightweightDecoratorManager.java:359)
17:27:26 [2021-02-04T22:27:26.276Z] 	at org.eclipse.ui.internal.decorators.DecorationScheduler$1.ensureResultCached(DecorationScheduler.java:347)
17:27:26 [2021-02-04T22:27:26.276Z] 	at org.eclipse.ui.internal.decorators.DecorationScheduler$1.run(DecorationScheduler.java:311)
17:27:26 [2021-02-04T22:27:26.276Z] 	at org.eclipse.core.internal.jobs.Worker.run(Worker.java:56)
17:27:26 [2021-02-04T22:27:26.276Z] 
17:27:26 [2021-02-04T22:27:26.276Z] !ENTRY org.eclipse.ui 4 0 2021-02-04 22:27:26.060
17:27:26 [2021-02-04T22:27:26.276Z] !MESSAGE Error occurred during status handling
17:27:26 [2021-02-04T22:27:26.276Z] !STACK 0
17:27:26 [2021-02-04T22:27:26.276Z] java.lang.NullPointerException
17:27:26 [2021-02-04T22:27:26.276Z] 	at org.eclipse.ui.internal.statushandlers.StatusHandlerRegistry.<init>(StatusHandlerRegistry.java:71)
17:27:26 [2021-02-04T22:27:26.276Z] 	at org.eclipse.ui.internal.statushandlers.StatusHandlerRegistry.getDefault(StatusHandlerRegistry.java:90)
17:27:26 [2021-02-04T22:27:26.276Z] 	at org.eclipse.ui.statushandlers.StatusManager.getStatusHandler(StatusManager.java:152)
17:27:26 [2021-02-04T22:27:26.276Z] 	at org.eclipse.ui.statushandlers.StatusManager.handle(StatusManager.java:211)
17:27:26 [2021-02-04T22:27:26.276Z] 	at org.eclipse.ui.statushandlers.StatusManager.handle(StatusManager.java:260)
17:27:26 [2021-02-04T22:27:26.276Z] 	at org.eclipse.ui.statushandlers.StatusManager$StatusManagerLogListener.logging(StatusManager.java:331)
17:27:26 [2021-02-04T22:27:26.276Z] 	at org.eclipse.core.internal.runtime.RuntimeLog.logToListeners(RuntimeLog.java:161)
17:27:26 [2021-02-04T22:27:26.276Z] 	at org.eclipse.core.internal.runtime.PlatformLogWriter.logged(PlatformLogWriter.java:103)
17:27:26 [2021-02-04T22:27:26.276Z] 	at org.eclipse.osgi.internal.log.ExtendedLogReaderServiceFactory.safeLogged(ExtendedLogReaderServiceFactory.java:88)
17:27:26 [2021-02-04T22:27:26.276Z] 	at org.eclipse.osgi.internal.log.ExtendedLogReaderServiceFactory.logPrivileged(ExtendedLogReaderServiceFactory.java:217)
17:27:26 [2021-02-04T22:27:26.276Z] 	at org.eclipse.osgi.internal.log.ExtendedLogReaderServiceFactory.log(ExtendedLogReaderServiceFactory.java:189)
17:27:26 [2021-02-04T22:27:26.276Z] 	at org.eclipse.osgi.internal.log.ExtendedLogServiceFactory.log(ExtendedLogServiceFactory.java:65)
17:27:26 [2021-02-04T22:27:26.276Z] 	at org.eclipse.osgi.internal.log.ExtendedLogServiceImpl.log(ExtendedLogServiceImpl.java:87)
17:27:26 [2021-02-04T22:27:26.276Z] 	at org.eclipse.osgi.internal.log.LoggerImpl.log(LoggerImpl.java:54)
17:27:26 [2021-02-04T22:27:26.276Z] 	at org.eclipse.core.internal.runtime.PlatformLogWriter.logging(PlatformLogWriter.java:44)
17:27:26 [2021-02-04T22:27:26.276Z] 	at org.eclipse.core.internal.runtime.RuntimeLog.log(RuntimeLog.java:97)
17:27:26 [2021-02-04T22:27:26.276Z] 	at org.eclipse.core.runtime.SafeRunner.handleException(SafeRunner.java:71)
17:27:26 [2021-02-04T22:27:26.276Z] 	at org.eclipse.core.runtime.SafeRunner.run(SafeRunner.java:44)
17:27:26 [2021-02-04T22:27:26.276Z] 	at org.eclipse.ui.internal.decorators.LightweightDecoratorDefinition.internalGetDecorator(LightweightDecoratorDefinition.java:120)
17:27:26 [2021-02-04T22:27:26.276Z] 	at org.eclipse.ui.internal.decorators.LightweightDecoratorDefinition.decorate(LightweightDecoratorDefinition.java:242)
17:27:26 [2021-02-04T22:27:26.276Z] 	at org.eclipse.ui.internal.decorators.LightweightDecoratorManager$LightweightRunnable.run(LightweightDecoratorManager.java:104)
17:27:26 [2021-02-04T22:27:26.276Z] 	at org.eclipse.core.runtime.SafeRunner.run(SafeRunner.java:42)
17:27:26 [2021-02-04T22:27:26.276Z] 	at org.eclipse.ui.internal.decorators.LightweightDecoratorManager.decorate(LightweightDecoratorManager.java:377)
17:27:26 [2021-02-04T22:27:26.276Z] 	at org.eclipse.ui.internal.decorators.LightweightDecoratorManager.getDecorations(LightweightDecoratorManager.java:359)
17:27:26 [2021-02-04T22:27:26.276Z] 	at org.eclipse.ui.internal.decorators.DecorationScheduler$1.ensureResultCached(DecorationScheduler.java:347)
17:27:26 [2021-02-04T22:27:26.276Z] 	at org.eclipse.ui.internal.decorators.DecorationScheduler$1.run(DecorationScheduler.java:311)
17:27:26 [2021-02-04T22:27:26.276Z] 	at org.eclipse.core.internal.jobs.Worker.run(Worker.java:56)
17:27:26 [2021-02-04T22:27:26.840Z] 
17:27:26 [2021-02-04T22:27:26.840Z] !ENTRY org.eclipse.equinox.registry 4 1 2021-02-04 22:27:26.553
17:27:26 [2021-02-04T22:27:26.840Z] !MESSAGE Plug-in "org.eclipse.egit.ui" was unable to instantiate class "org.eclipse.egit.ui.internal.decorators.GitLightweightDecorator".
17:27:26 [2021-02-04T22:27:26.840Z] !STACK 0
17:27:26 [2021-02-04T22:27:26.840Z] org.eclipse.swt.SWTException: Device is disposed
17:27:26 [2021-02-04T22:27:26.840Z] 	at org.eclipse.swt.SWT.error(SWT.java:4533)
17:27:26 [2021-02-04T22:27:26.840Z] 	at org.eclipse.swt.SWT.error(SWT.java:4448)
17:27:26 [2021-02-04T22:27:26.840Z] 	at org.eclipse.swt.SWT.error(SWT.java:4419)
17:27:26 [2021-02-04T22:27:26.840Z] 	at org.eclipse.swt.widgets.Display.error(Display.java:1289)
17:27:26 [2021-02-04T22:27:26.840Z] 	at org.eclipse.swt.widgets.Display.syncExec(Display.java:5526)
17:27:26 [2021-02-04T22:27:26.840Z] 	at org.eclipse.egit.ui.internal.decorators.GitLightweightDecorator$ChangeTrackingColorsAndFonts.reload(GitLightweightDecorator.java:336)
17:27:26 [2021-02-04T22:27:26.840Z] 	at org.eclipse.egit.ui.internal.decorators.GitLightweightDecorator$ChangeTrackingColorsAndFonts.<init>(GitLightweightDecorator.java:331)
17:27:26 [2021-02-04T22:27:26.840Z] 	at org.eclipse.egit.ui.internal.decorators.GitLightweightDecorator.<init>(GitLightweightDecorator.java:125)
17:27:26 [2021-02-04T22:27:26.840Z] 	at sun.reflect.NativeConstructorAccessorImpl.newInstance0(Native Method)
17:27:26 [2021-02-04T22:27:26.840Z] 	at sun.reflect.NativeConstructorAccessorImpl.newInstance(NativeConstructorAccessorImpl.java:62)
17:27:26 [2021-02-04T22:27:26.840Z] 	at sun.reflect.DelegatingConstructorAccessorImpl.newInstance(DelegatingConstructorAccessorImpl.java:45)
17:27:26 [2021-02-04T22:27:26.840Z] 	at java.lang.reflect.Constructor.newInstance(Constructor.java:423)
17:27:26 [2021-02-04T22:27:26.840Z] 	at java.lang.Class.newInstance(Class.java:442)
17:27:26 [2021-02-04T22:27:26.840Z] 	at org.eclipse.core.internal.registry.osgi.RegistryStrategyOSGI.createExecutableExtension(RegistryStrategyOSGI.java:184)
17:27:26 [2021-02-04T22:27:26.840Z] 	at org.eclipse.core.internal.registry.ExtensionRegistry.createExecutableExtension(ExtensionRegistry.java:905)
17:27:26 [2021-02-04T22:27:26.840Z] 	at org.eclipse.core.internal.registry.ConfigurationElement.createExecutableExtension(ConfigurationElement.java:243)
17:27:26 [2021-02-04T22:27:26.840Z] 	at org.eclipse.core.internal.registry.ConfigurationElementHandle.createExecutableExtension(ConfigurationElementHandle.java:55)
17:27:26 [2021-02-04T22:27:26.840Z] 	at org.eclipse.ui.internal.WorkbenchPlugin.createExtension(WorkbenchPlugin.java:281)
17:27:26 [2021-02-04T22:27:26.840Z] 	at org.eclipse.ui.internal.decorators.LightweightDecoratorDefinition$1.run(LightweightDecoratorDefinition.java:125)
17:27:26 [2021-02-04T22:27:26.840Z] 	at org.eclipse.core.runtime.SafeRunner.run(SafeRunner.java:42)
17:27:26 [2021-02-04T22:27:26.840Z] 	at org.eclipse.ui.internal.decorators.LightweightDecoratorDefinition.internalGetDecorator(LightweightDecoratorDefinition.java:120)
17:27:26 [2021-02-04T22:27:26.840Z] 	at org.eclipse.ui.internal.decorators.LightweightDecoratorDefinition.decorate(LightweightDecoratorDefinition.java:242)
17:27:26 [2021-02-04T22:27:26.840Z] 	at org.eclipse.ui.internal.decorators.LightweightDecoratorManager$LightweightRunnable.run(LightweightDecoratorManager.java:104)
17:27:26 [2021-02-04T22:27:26.840Z] 	at org.eclipse.core.runtime.SafeRunner.run(SafeRunner.java:42)
17:27:26 [2021-02-04T22:27:26.840Z] 	at org.eclipse.ui.internal.decorators.LightweightDecoratorManager.decorate(LightweightDecoratorManager.java:377)
17:27:26 [2021-02-04T22:27:26.840Z] 	at org.eclipse.ui.internal.decorators.LightweightDecoratorManager.getDecorations(LightweightDecoratorManager.java:359)
17:27:26 [2021-02-04T22:27:26.840Z] 	at org.eclipse.ui.internal.decorators.DecorationScheduler$1.ensureResultCached(DecorationScheduler.java:347)
17:27:26 [2021-02-04T22:27:26.840Z] 	at org.eclipse.ui.internal.decorators.DecorationScheduler$1.run(DecorationScheduler.java:311)
17:27:26 [2021-02-04T22:27:26.841Z] 	at org.eclipse.core.internal.jobs.Worker.run(Worker.java:56)
17:27:26 [2021-02-04T22:27:26.841Z] 
17:27:26 [2021-02-04T22:27:26.841Z] !ENTRY org.eclipse.equinox.registry 4 1 2021-02-04 22:27:26.554
17:27:26 [2021-02-04T22:27:26.841Z] !MESSAGE Plug-in "org.eclipse.egit.ui" was unable to instantiate class "org.eclipse.egit.ui.internal.decorators.GitLightweightDecorator".
17:27:26 [2021-02-04T22:27:26.841Z] !STACK 0
17:27:26 [2021-02-04T22:27:26.841Z] org.eclipse.swt.SWTException: Device is disposed
17:27:26 [2021-02-04T22:27:26.841Z] 	at org.eclipse.swt.SWT.error(SWT.java:4533)
17:27:26 [2021-02-04T22:27:26.841Z] 	at org.eclipse.swt.SWT.error(SWT.java:4448)
17:27:26 [2021-02-04T22:27:26.841Z] 	at org.eclipse.swt.SWT.error(SWT.java:4419)
17:27:26 [2021-02-04T22:27:26.841Z] 	at org.eclipse.swt.widgets.Display.error(Display.java:1289)
17:27:26 [2021-02-04T22:27:26.841Z] 	at org.eclipse.swt.widgets.Display.syncExec(Display.java:5526)
17:27:26 [2021-02-04T22:27:26.841Z] 	at org.eclipse.egit.ui.internal.decorators.GitLightweightDecorator$ChangeTrackingColorsAndFonts.reload(GitLightweightDecorator.java:336)
17:27:26 [2021-02-04T22:27:26.841Z] 	at org.eclipse.egit.ui.internal.decorators.GitLightweightDecorator$ChangeTrackingColorsAndFonts.<init>(GitLightweightDecorator.java:331)
17:27:26 [2021-02-04T22:27:26.841Z] 	at org.eclipse.egit.ui.internal.decorators.GitLightweightDecorator.<init>(GitLightweightDecorator.java:125)
17:27:26 [2021-02-04T22:27:26.841Z] 	at sun.reflect.NativeConstructorAccessorImpl.newInstance0(Native Method)
17:27:26 [2021-02-04T22:27:26.841Z] 	at sun.reflect.NativeConstructorAccessorImpl.newInstance(NativeConstructorAccessorImpl.java:62)
17:27:26 [2021-02-04T22:27:26.841Z] 	at sun.reflect.DelegatingConstructorAccessorImpl.newInstance(DelegatingConstructorAccessorImpl.java:45)
17:27:26 [2021-02-04T22:27:26.841Z] 	at java.lang.reflect.Constructor.newInstance(Constructor.java:423)
17:27:26 [2021-02-04T22:27:26.841Z] 	at java.lang.Class.newInstance(Class.java:442)
17:27:26 [2021-02-04T22:27:26.841Z] 	at org.eclipse.core.internal.registry.osgi.RegistryStrategyOSGI.createExecutableExtension(RegistryStrategyOSGI.java:184)
17:27:26 [2021-02-04T22:27:26.841Z] 	at org.eclipse.core.internal.registry.ExtensionRegistry.createExecutableExtension(ExtensionRegistry.java:905)
17:27:26 [2021-02-04T22:27:26.841Z] 	at org.eclipse.core.internal.registry.ConfigurationElement.createExecutableExtension(ConfigurationElement.java:243)
17:27:26 [2021-02-04T22:27:26.841Z] 	at org.eclipse.core.internal.registry.ConfigurationElementHandle.createExecutableExtension(ConfigurationElementHandle.java:55)
17:27:26 [2021-02-04T22:27:26.841Z] 	at org.eclipse.ui.internal.WorkbenchPlugin.createExtension(WorkbenchPlugin.java:281)
17:27:26 [2021-02-04T22:27:26.841Z] 	at org.eclipse.ui.internal.decorators.LightweightDecoratorDefinition$1.run(LightweightDecoratorDefinition.java:125)
17:27:26 [2021-02-04T22:27:26.841Z] 	at org.eclipse.core.runtime.SafeRunner.run(SafeRunner.java:42)
17:27:26 [2021-02-04T22:27:26.841Z] 	at org.eclipse.ui.internal.decorators.LightweightDecoratorDefinition.internalGetDecorator(LightweightDecoratorDefinition.java:120)
17:27:26 [2021-02-04T22:27:26.841Z] 	at org.eclipse.ui.internal.decorators.LightweightDecoratorDefinition.decorate(LightweightDecoratorDefinition.java:242)
17:27:26 [2021-02-04T22:27:26.841Z] 	at org.eclipse.ui.internal.decorators.LightweightDecoratorManager$LightweightRunnable.run(LightweightDecoratorManager.java:104)
17:27:26 [2021-02-04T22:27:26.841Z] 	at org.eclipse.core.runtime.SafeRunner.run(SafeRunner.java:42)
17:27:26 [2021-02-04T22:27:26.841Z] 	at org.eclipse.ui.internal.decorators.LightweightDecoratorManager.decorate(LightweightDecoratorManager.java:377)
17:27:26 [2021-02-04T22:27:26.841Z] 	at org.eclipse.ui.internal.decorators.LightweightDecoratorManager.getDecorations(LightweightDecoratorManager.java:359)
17:27:26 [2021-02-04T22:27:26.841Z] 	at org.eclipse.ui.internal.decorators.DecorationScheduler$1.ensureResultCached(DecorationScheduler.java:347)
17:27:26 [2021-02-04T22:27:26.841Z] 	at org.eclipse.ui.internal.decorators.DecorationScheduler$1.run(DecorationScheduler.java:311)
17:27:26 [2021-02-04T22:27:26.841Z] 	at org.eclipse.core.internal.jobs.Worker.run(Worker.java:56)
17:27:26 [2021-02-04T22:27:26.841Z] 
17:27:26 [2021-02-04T22:27:26.841Z] !ENTRY org.eclipse.ui 4 0 2021-02-04 22:27:26.554
17:27:26 [2021-02-04T22:27:26.841Z] !MESSAGE Error occurred during status handling
17:27:26 [2021-02-04T22:27:26.841Z] !STACK 0
17:27:26 [2021-02-04T22:27:26.841Z] java.lang.NullPointerException
17:27:26 [2021-02-04T22:27:26.841Z] 	at org.eclipse.ui.internal.statushandlers.StatusHandlerRegistry.<init>(StatusHandlerRegistry.java:71)
17:27:26 [2021-02-04T22:27:26.841Z] 	at org.eclipse.ui.internal.statushandlers.StatusHandlerRegistry.getDefault(StatusHandlerRegistry.java:90)
17:27:26 [2021-02-04T22:27:26.841Z] 	at org.eclipse.ui.statushandlers.StatusManager.getStatusHandler(StatusManager.java:152)
17:27:26 [2021-02-04T22:27:26.841Z] 	at org.eclipse.ui.statushandlers.StatusManager.handle(StatusManager.java:211)
17:27:26 [2021-02-04T22:27:26.841Z] 	at org.eclipse.ui.statushandlers.StatusManager.handle(StatusManager.java:260)
17:27:26 [2021-02-04T22:27:26.841Z] 	at org.eclipse.ui.statushandlers.StatusManager$StatusManagerLogListener.logging(StatusManager.java:331)
17:27:26 [2021-02-04T22:27:26.841Z] 	at org.eclipse.core.internal.runtime.RuntimeLog.logToListeners(RuntimeLog.java:161)
17:27:26 [2021-02-04T22:27:26.841Z] 	at org.eclipse.core.internal.runtime.PlatformLogWriter.logged(PlatformLogWriter.java:103)
17:27:26 [2021-02-04T22:27:26.841Z] 	at org.eclipse.osgi.internal.log.ExtendedLogReaderServiceFactory.safeLogged(ExtendedLogReaderServiceFactory.java:88)
17:27:26 [2021-02-04T22:27:26.841Z] 	at org.eclipse.osgi.internal.log.ExtendedLogReaderServiceFactory.logPrivileged(ExtendedLogReaderServiceFactory.java:217)
17:27:26 [2021-02-04T22:27:26.841Z] 	at org.eclipse.osgi.internal.log.ExtendedLogReaderServiceFactory.log(ExtendedLogReaderServiceFactory.java:189)
17:27:26 [2021-02-04T22:27:26.841Z] 	at org.eclipse.osgi.internal.log.ExtendedLogServiceFactory.log(ExtendedLogServiceFactory.java:65)
17:27:26 [2021-02-04T22:27:26.841Z] 	at org.eclipse.osgi.internal.log.ExtendedLogServiceImpl.log(ExtendedLogServiceImpl.java:87)
17:27:26 [2021-02-04T22:27:26.841Z] 	at org.eclipse.osgi.internal.log.LoggerImpl.log(LoggerImpl.java:54)
17:27:26 [2021-02-04T22:27:26.841Z] 	at org.eclipse.core.internal.runtime.Log.log(Log.java:65)
17:27:26 [2021-02-04T22:27:26.841Z] 	at org.eclipse.ui.internal.WorkbenchPlugin.log(WorkbenchPlugin.java:663)
17:27:26 [2021-02-04T22:27:26.841Z] 	at org.eclipse.ui.internal.decorators.DecoratorDefinition.handleCoreException(DecoratorDefinition.java:266)
17:27:26 [2021-02-04T22:27:26.841Z] 	at org.eclipse.ui.internal.decorators.LightweightDecoratorDefinition.decorate(LightweightDecoratorDefinition.java:263)
17:27:26 [2021-02-04T22:27:26.841Z] 	at org.eclipse.ui.internal.decorators.LightweightDecoratorManager$LightweightRunnable.run(LightweightDecoratorManager.java:104)
17:27:26 [2021-02-04T22:27:26.841Z] 	at org.eclipse.core.runtime.SafeRunner.run(SafeRunner.java:42)
17:27:26 [2021-02-04T22:27:26.841Z] 	at org.eclipse.ui.internal.decorators.LightweightDecoratorManager.decorate(LightweightDecoratorManager.java:377)
17:27:26 [2021-02-04T22:27:26.841Z] 	at org.eclipse.ui.internal.decorators.LightweightDecoratorManager.getDecorations(LightweightDecoratorManager.java:359)
17:27:26 [2021-02-04T22:27:26.841Z] 	at org.eclipse.ui.internal.decorators.DecorationScheduler$1.ensureResultCached(DecorationScheduler.java:347)
17:27:26 [2021-02-04T22:27:26.841Z] 	at org.eclipse.ui.internal.decorators.DecorationScheduler$1.run(DecorationScheduler.java:311)
17:27:26 [2021-02-04T22:27:26.841Z] 	at org.eclipse.core.internal.jobs.Worker.run(Worker.java:56)
17:27:28 [2021-02-04T22:27:28.737Z] 22:27:28 [INFO] All tests passed!
17:27:28 [2021-02-04T22:27:28.737Z] 22:27:28 [INFO] 
17:27:28 [2021-02-04T22:27:28.737Z] 22:27:28 [INFO] >>> spotbugs-maven-plugin:3.1.11:check (default) > :spotbugs @ org.eclipse.mylyn.github.tests >>>
17:27:28 [2021-02-04T22:27:28.737Z] 22:27:28 [INFO] 
17:27:28 [2021-02-04T22:27:28.737Z] 22:27:28 [INFO] --- spotbugs-maven-plugin:3.1.11:spotbugs (spotbugs) @ org.eclipse.mylyn.github.tests ---
17:27:28 [2021-02-04T22:27:28.737Z] 22:27:28 [INFO] Fork Value is true
17:27:30 [2021-02-04T22:27:30.669Z] 22:27:30 [INFO] Done SpotBugs Analysis....
17:27:30 [2021-02-04T22:27:30.669Z] 22:27:30 [INFO] 
17:27:30 [2021-02-04T22:27:30.669Z] 22:27:30 [INFO] <<< spotbugs-maven-plugin:3.1.11:check (default) < :spotbugs @ org.eclipse.mylyn.github.tests <<<
17:27:30 [2021-02-04T22:27:30.669Z] 22:27:30 [INFO] 
17:27:30 [2021-02-04T22:27:30.669Z] 22:27:30 [INFO] 
17:27:30 [2021-02-04T22:27:30.669Z] 22:27:30 [INFO] --- spotbugs-maven-plugin:3.1.11:check (default) @ org.eclipse.mylyn.github.tests ---
17:27:30 [2021-02-04T22:27:30.669Z] 22:27:30 [INFO] BugInstance size is 0
17:27:30 [2021-02-04T22:27:30.669Z] 22:27:30 [INFO] Error size is 0
17:27:30 [2021-02-04T22:27:30.669Z] 22:27:30 [INFO] No errors/warnings found
17:27:30 [2021-02-04T22:27:30.669Z] 22:27:30 [INFO] 
17:27:30 [2021-02-04T22:27:30.669Z] 22:27:30 [INFO] >>> maven-pmd-plugin:3.11.0:cpd-check (default) > :cpd @ org.eclipse.mylyn.github.tests >>>
17:27:30 [2021-02-04T22:27:30.669Z] 22:27:30 [INFO] 
17:27:30 [2021-02-04T22:27:30.669Z] 22:27:30 [INFO] --- maven-pmd-plugin:3.11.0:cpd (cpd) @ org.eclipse.mylyn.github.tests ---
17:27:30 [2021-02-04T22:27:30.669Z] 22:27:30 [INFO] 
17:27:30 [2021-02-04T22:27:30.669Z] 22:27:30 [INFO] <<< maven-pmd-plugin:3.11.0:cpd-check (default) < :cpd @ org.eclipse.mylyn.github.tests <<<
17:27:30 [2021-02-04T22:27:30.669Z] 22:27:30 [INFO] 
17:27:30 [2021-02-04T22:27:30.669Z] 22:27:30 [INFO] 
17:27:30 [2021-02-04T22:27:30.669Z] 22:27:30 [INFO] --- maven-pmd-plugin:3.11.0:cpd-check (default) @ org.eclipse.mylyn.github.tests ---
17:27:30 [2021-02-04T22:27:30.669Z] 22:27:30 [INFO] 
17:27:30 [2021-02-04T22:27:30.669Z] 22:27:30 [INFO] 
17:27:30 [2021-02-04T22:27:30.669Z] 22:27:30 [INFO] --- tycho-pack200a-plugin:1.7.0:normalize (pack200-normalize) @ org.eclipse.mylyn.github.tests ---
17:27:30 [2021-02-04T22:27:30.669Z] 22:27:30 [INFO] Pack200 normalizing jar /home/jenkins/agent/workspace/egit-github/repo/org.eclipse.mylyn.github.tests/target/org.eclipse.mylyn.github.tests-5.11.0-SNAPSHOT.jar
17:27:30 [2021-02-04T22:27:30.669Z] 22:27:30 [INFO] 
17:27:30 [2021-02-04T22:27:30.669Z] 22:27:30 [INFO] --- eclipse-jarsigner-plugin:1.1.5:sign (sign) @ org.eclipse.mylyn.github.tests ---
17:27:30 [2021-02-04T22:27:30.926Z] 22:27:30 [INFO] Signing jar: /home/jenkins/agent/workspace/egit-github/repo/org.eclipse.mylyn.github.tests/target/org.eclipse.mylyn.github.tests-5.11.0-SNAPSHOT.jar
17:27:32 [2021-02-04T22:27:32.297Z] 22:27:31 [INFO] 
17:27:32 [2021-02-04T22:27:32.297Z] 22:27:31 [INFO] --- tycho-pack200b-plugin:1.7.0:pack (pack200-pack) @ org.eclipse.mylyn.github.tests ---
17:27:32 [2021-02-04T22:27:32.297Z] 22:27:31 [INFO] Pack200 packing jar /home/jenkins/agent/workspace/egit-github/repo/org.eclipse.mylyn.github.tests/target/org.eclipse.mylyn.github.tests-5.11.0-SNAPSHOT.jar
17:27:32 [2021-02-04T22:27:32.297Z] 22:27:31 [INFO] 
17:27:32 [2021-02-04T22:27:32.297Z] 22:27:31 [INFO] --- tycho-p2-plugin:1.7.0:p2-metadata (p2-metadata) @ org.eclipse.mylyn.github.tests ---
17:27:32 [2021-02-04T22:27:32.297Z] 22:27:31 [INFO] 
17:27:32 [2021-02-04T22:27:32.297Z] 22:27:31 [INFO] --- maven-install-plugin:2.3.1:install (default-install) @ org.eclipse.mylyn.github.tests ---
17:27:32 [2021-02-04T22:27:32.297Z] 22:27:31 [INFO] Installing /home/jenkins/agent/workspace/egit-github/repo/org.eclipse.mylyn.github.tests/target/org.eclipse.mylyn.github.tests-5.11.0-SNAPSHOT.jar to /home/jenkins/agent/workspace/egit-github/.repository/org/eclipse/mylyn/github/org.eclipse.mylyn.github.tests/5.11.0-SNAPSHOT/org.eclipse.mylyn.github.tests-5.11.0-SNAPSHOT.jar
17:27:32 [2021-02-04T22:27:32.297Z] 22:27:31 [INFO] Installing /home/jenkins/agent/workspace/egit-github/repo/org.eclipse.mylyn.github.tests/pom.xml to /home/jenkins/agent/workspace/egit-github/.repository/org/eclipse/mylyn/github/org.eclipse.mylyn.github.tests/5.11.0-SNAPSHOT/org.eclipse.mylyn.github.tests-5.11.0-SNAPSHOT.pom
17:27:32 [2021-02-04T22:27:32.297Z] 22:27:31 [INFO] Installing /home/jenkins/agent/workspace/egit-github/repo/org.eclipse.mylyn.github.tests/target/org.eclipse.mylyn.github.tests-5.11.0-SNAPSHOT.jar.pack.gz to /home/jenkins/agent/workspace/egit-github/.repository/org/eclipse/mylyn/github/org.eclipse.mylyn.github.tests/5.11.0-SNAPSHOT/org.eclipse.mylyn.github.tests-5.11.0-SNAPSHOT-pack200.jar.pack.gz
17:27:32 [2021-02-04T22:27:32.297Z] 22:27:31 [INFO] Installing /home/jenkins/agent/workspace/egit-github/repo/org.eclipse.mylyn.github.tests/target/p2content.xml to /home/jenkins/agent/workspace/egit-github/.repository/org/eclipse/mylyn/github/org.eclipse.mylyn.github.tests/5.11.0-SNAPSHOT/org.eclipse.mylyn.github.tests-5.11.0-SNAPSHOT-p2metadata.xml
17:27:32 [2021-02-04T22:27:32.297Z] 22:27:31 [INFO] Installing /home/jenkins/agent/workspace/egit-github/repo/org.eclipse.mylyn.github.tests/target/p2artifacts.xml to /home/jenkins/agent/workspace/egit-github/.repository/org/eclipse/mylyn/github/org.eclipse.mylyn.github.tests/5.11.0-SNAPSHOT/org.eclipse.mylyn.github.tests-5.11.0-SNAPSHOT-p2artifacts.xml
17:27:32 [2021-02-04T22:27:32.297Z] 22:27:31 [INFO] 
17:27:32 [2021-02-04T22:27:32.297Z] 22:27:31 [INFO] --- tycho-p2-plugin:1.7.0:update-local-index (default-update-local-index) @ org.eclipse.mylyn.github.tests ---
17:27:32 [2021-02-04T22:27:32.297Z] 22:27:31 [INFO] 
17:27:32 [2021-02-04T22:27:32.297Z] 22:27:31 [INFO] -------------< org.eclipse.mylyn.github:github-updatesite >-------------
17:27:32 [2021-02-04T22:27:32.297Z] 22:27:31 [INFO] Building Eclipse EGit Mylyn GitHub Repository 5.11.0-SNAPSHOT    [10/10]
17:27:32 [2021-02-04T22:27:32.297Z] 22:27:31 [INFO] -------------------------[ eclipse-repository ]-------------------------
17:27:32 [2021-02-04T22:27:32.297Z] 22:27:31 [INFO] 
17:27:32 [2021-02-04T22:27:32.297Z] 22:27:31 [INFO] --- maven-clean-plugin:2.5:clean (default-clean) @ github-updatesite ---
17:27:32 [2021-02-04T22:27:32.297Z] 22:27:31 [INFO] 
17:27:32 [2021-02-04T22:27:32.297Z] 22:27:31 [INFO] --- tycho-packaging-plugin:1.7.0:build-qualifier-aggregator (default-build-qualifier-aggregator) @ github-updatesite ---
17:27:32 [2021-02-04T22:27:32.297Z] 22:27:31 [INFO] The project's OSGi version is 5.11.0.202102042224
17:27:32 [2021-02-04T22:27:32.297Z] 22:27:31 [INFO] 
17:27:32 [2021-02-04T22:27:32.297Z] 22:27:31 [INFO] --- maven-enforcer-plugin:3.0.0-M2:enforce (enforce-maven) @ github-updatesite ---
17:27:32 [2021-02-04T22:27:32.297Z] 22:27:31 [INFO] 
17:27:32 [2021-02-04T22:27:32.297Z] 22:27:31 [INFO] --- maven-clean-plugin:2.5:clean (default-clean-1) @ github-updatesite ---
17:27:32 [2021-02-04T22:27:32.297Z] 22:27:31 [INFO] 
17:27:32 [2021-02-04T22:27:32.297Z] 22:27:31 [INFO] --- maven-resources-plugin:3.1.0:resources (default-resources) @ github-updatesite ---
17:27:32 [2021-02-04T22:27:32.297Z] 22:27:31 [INFO] Using 'UTF-8' encoding to copy filtered resources.
17:27:32 [2021-02-04T22:27:32.297Z] 22:27:31 [INFO] skip non existing resourceDirectory /home/jenkins/agent/workspace/egit-github/repo/org.eclipse.mylyn.github-site/src/main/resources
17:27:32 [2021-02-04T22:27:32.297Z] 22:27:31 [INFO] 
17:27:32 [2021-02-04T22:27:32.297Z] 22:27:31 [INFO] --- target-platform-configuration:1.7.0:target-platform (default-target-platform) @ github-updatesite ---
17:27:32 [2021-02-04T22:27:32.297Z] 22:27:31 [INFO] 
17:27:32 [2021-02-04T22:27:32.297Z] 22:27:31 [INFO] --- tycho-p2-publisher-plugin:1.7.0:publish-osgi-ee (default-publish-osgi-ee) @ github-updatesite ---
17:27:32 [2021-02-04T22:27:32.297Z] 22:27:31 [INFO] Published profile IUs: [a.jre.javase 11.0.0, config.a.jre.javase 11.0.0]
17:27:32 [2021-02-04T22:27:32.297Z] 22:27:31 [INFO] Published profile IUs: [a.jre.javase 14.0.0, config.a.jre.javase 14.0.0]
17:27:32 [2021-02-04T22:27:32.297Z] 22:27:31 [INFO] 
17:27:32 [2021-02-04T22:27:32.297Z] 22:27:31 [INFO] --- tycho-p2-publisher-plugin:1.7.0:publish-products (default-publish-products) @ github-updatesite ---
17:27:32 [2021-02-04T22:27:32.297Z] 22:27:31 [INFO] 
17:27:32 [2021-02-04T22:27:32.297Z] 22:27:31 [INFO] --- tycho-p2-publisher-plugin:1.7.0:publish-categories (default-publish-categories) @ github-updatesite ---
17:27:32 [2021-02-04T22:27:32.297Z] 22:27:31 [INFO] 
17:27:32 [2021-02-04T22:27:32.297Z] 22:27:31 [INFO] --- tycho-p2-publisher-plugin:1.7.0:attach-artifacts (default-attach-artifacts) @ github-updatesite ---
17:27:32 [2021-02-04T22:27:32.297Z] 22:27:31 [INFO] 
17:27:32 [2021-02-04T22:27:32.297Z] 22:27:31 [INFO] --- tycho-p2-repository-plugin:1.7.0:assemble-repository (default-assemble-repository) @ github-updatesite ---
17:27:33 [2021-02-04T22:27:33.227Z] 22:27:32 [INFO] 
17:27:33 [2021-02-04T22:27:33.227Z] 22:27:32 [INFO] --- tycho-p2-repository-plugin:1.7.0:archive-repository (default-archive-repository) @ github-updatesite ---
17:27:33 [2021-02-04T22:27:33.227Z] 22:27:32 [INFO] Building zip: /home/jenkins/agent/workspace/egit-github/repo/org.eclipse.mylyn.github-site/target/github-updatesite-5.11.0-SNAPSHOT.zip
17:27:33 [2021-02-04T22:27:33.227Z] 22:27:32 [INFO] 
17:27:33 [2021-02-04T22:27:33.227Z] 22:27:32 [INFO] >>> spotbugs-maven-plugin:3.1.11:check (default) > :spotbugs @ github-updatesite >>>
17:27:33 [2021-02-04T22:27:33.227Z] 22:27:32 [INFO] 
17:27:33 [2021-02-04T22:27:33.227Z] 22:27:32 [INFO] --- spotbugs-maven-plugin:3.1.11:spotbugs (spotbugs) @ github-updatesite ---
17:27:33 [2021-02-04T22:27:33.227Z] 22:27:32 [INFO] 
17:27:33 [2021-02-04T22:27:33.227Z] 22:27:32 [INFO] <<< spotbugs-maven-plugin:3.1.11:check (default) < :spotbugs @ github-updatesite <<<
17:27:33 [2021-02-04T22:27:33.227Z] 22:27:32 [INFO] 
17:27:33 [2021-02-04T22:27:33.227Z] 22:27:32 [INFO] 
17:27:33 [2021-02-04T22:27:33.227Z] 22:27:32 [INFO] --- spotbugs-maven-plugin:3.1.11:check (default) @ github-updatesite ---
17:27:33 [2021-02-04T22:27:33.227Z] 22:27:32 [INFO] 
17:27:33 [2021-02-04T22:27:33.227Z] 22:27:32 [INFO] >>> maven-pmd-plugin:3.11.0:cpd-check (default) > :cpd @ github-updatesite >>>
17:27:33 [2021-02-04T22:27:33.227Z] 22:27:32 [INFO] 
17:27:33 [2021-02-04T22:27:33.227Z] 22:27:32 [INFO] --- maven-pmd-plugin:3.11.0:cpd (cpd) @ github-updatesite ---
17:27:33 [2021-02-04T22:27:33.227Z] 22:27:32 [INFO] 
17:27:33 [2021-02-04T22:27:33.227Z] 22:27:32 [INFO] <<< maven-pmd-plugin:3.11.0:cpd-check (default) < :cpd @ github-updatesite <<<
17:27:33 [2021-02-04T22:27:33.227Z] 22:27:32 [INFO] 
17:27:33 [2021-02-04T22:27:33.227Z] 22:27:32 [INFO] 
17:27:33 [2021-02-04T22:27:33.227Z] 22:27:32 [INFO] --- maven-pmd-plugin:3.11.0:cpd-check (default) @ github-updatesite ---
17:27:33 [2021-02-04T22:27:33.227Z] 22:27:32 [INFO] 
17:27:33 [2021-02-04T22:27:33.227Z] 22:27:32 [INFO] 
17:27:33 [2021-02-04T22:27:33.227Z] 22:27:32 [INFO] --- tycho-pack200a-plugin:1.7.0:normalize (pack200-normalize) @ github-updatesite ---
17:27:33 [2021-02-04T22:27:33.227Z] 22:27:32 [INFO] 
17:27:33 [2021-02-04T22:27:33.227Z] 22:27:32 [INFO] --- eclipse-jarsigner-plugin:1.1.5:sign (sign) @ github-updatesite ---
17:27:33 [2021-02-04T22:27:33.227Z] 22:27:32 [INFO] 
17:27:33 [2021-02-04T22:27:33.227Z] 22:27:32 [INFO] --- tycho-pack200b-plugin:1.7.0:pack (pack200-pack) @ github-updatesite ---
17:27:33 [2021-02-04T22:27:33.227Z] 22:27:32 [INFO] 
17:27:33 [2021-02-04T22:27:33.227Z] 22:27:32 [INFO] --- tycho-p2-plugin:1.7.0:p2-metadata (p2-metadata) @ github-updatesite ---
17:27:33 [2021-02-04T22:27:33.227Z] 22:27:32 [INFO] 
17:27:33 [2021-02-04T22:27:33.227Z] 22:27:32 [INFO] --- maven-install-plugin:2.3.1:install (default-install) @ github-updatesite ---
17:27:33 [2021-02-04T22:27:33.228Z] 22:27:32 [INFO] Installing /home/jenkins/agent/workspace/egit-github/repo/org.eclipse.mylyn.github-site/target/github-updatesite-5.11.0-SNAPSHOT.zip to /home/jenkins/agent/workspace/egit-github/.repository/org/eclipse/mylyn/github/github-updatesite/5.11.0-SNAPSHOT/github-updatesite-5.11.0-SNAPSHOT.zip
17:27:33 [2021-02-04T22:27:33.228Z] 22:27:32 [INFO] Installing /home/jenkins/agent/workspace/egit-github/repo/org.eclipse.mylyn.github-site/pom.xml to /home/jenkins/agent/workspace/egit-github/.repository/org/eclipse/mylyn/github/github-updatesite/5.11.0-SNAPSHOT/github-updatesite-5.11.0-SNAPSHOT.pom
17:27:33 [2021-02-04T22:27:33.228Z] 22:27:32 [INFO] Installing /home/jenkins/agent/workspace/egit-github/repo/org.eclipse.mylyn.github-site/target/p2content.xml to /home/jenkins/agent/workspace/egit-github/.repository/org/eclipse/mylyn/github/github-updatesite/5.11.0-SNAPSHOT/github-updatesite-5.11.0-SNAPSHOT-p2metadata.xml
17:27:33 [2021-02-04T22:27:33.228Z] 22:27:32 [INFO] Installing /home/jenkins/agent/workspace/egit-github/repo/org.eclipse.mylyn.github-site/target/p2artifacts.xml to /home/jenkins/agent/workspace/egit-github/.repository/org/eclipse/mylyn/github/github-updatesite/5.11.0-SNAPSHOT/github-updatesite-5.11.0-SNAPSHOT-p2artifacts.xml
17:27:33 [2021-02-04T22:27:33.228Z] 22:27:32 [INFO] 
17:27:33 [2021-02-04T22:27:33.228Z] 22:27:32 [INFO] --- tycho-p2-plugin:1.7.0:update-local-index (default-update-local-index) @ github-updatesite ---
17:27:33 [2021-02-04T22:27:33.228Z] 22:27:32 [INFO] ------------------------------------------------------------------------
17:27:33 [2021-02-04T22:27:33.228Z] 22:27:32 [INFO] Reactor Summary for Eclipse EGit Mylyn GitHub Connector Parent 5.11.0-SNAPSHOT:
17:27:33 [2021-02-04T22:27:33.228Z] 22:27:33 [INFO] 
17:27:33 [2021-02-04T22:27:33.228Z] 22:27:33 [INFO] Eclipse EGit Mylyn GitHub Connector Parent ......... SUCCESS [ 21.864 s]
17:27:33 [2021-02-04T22:27:33.228Z] 22:27:33 [INFO] EGit GitHub Target Platform Definition ............. SUCCESS [  0.767 s]
17:27:33 [2021-02-04T22:27:33.228Z] 22:27:33 [INFO] Eclipse EGit GitHub API Core ....................... SUCCESS [ 11.331 s]
17:27:33 [2021-02-04T22:27:33.228Z] 22:27:33 [INFO] Eclipse EGit Mylyn GitHub Core ..................... SUCCESS [  5.786 s]
17:27:33 [2021-02-04T22:27:33.228Z] 22:27:33 [INFO] Eclipse EGit Mylyn GitHub UI ....................... SUCCESS [  9.719 s]
17:27:33 [2021-02-04T22:27:33.228Z] 22:27:33 [INFO] Eclipse EGit Mylyn GitHub Documentation ............ SUCCESS [  3.551 s]
17:27:33 [2021-02-04T22:27:33.228Z] 22:27:33 [INFO] Eclipse EGit Mylyn GitHub Feature .................. SUCCESS [  1.305 s]
17:27:33 [2021-02-04T22:27:33.228Z] 22:27:33 [INFO] Eclipse EGit GitHub API Test Plug-in ............... SUCCESS [ 10.429 s]
17:27:33 [2021-02-04T22:27:33.228Z] 22:27:33 [INFO] Eclipse EGit Mylyn GitHub Test Plug-in ............. SUCCESS [ 11.929 s]
17:27:33 [2021-02-04T22:27:33.228Z] 22:27:33 [INFO] Eclipse EGit Mylyn GitHub Repository ............... SUCCESS [  1.045 s]
17:27:33 [2021-02-04T22:27:33.228Z] 22:27:33 [INFO] ------------------------------------------------------------------------
17:27:33 [2021-02-04T22:27:33.228Z] 22:27:33 [INFO] BUILD SUCCESS
17:27:33 [2021-02-04T22:27:33.228Z] 22:27:33 [INFO] ------------------------------------------------------------------------
17:27:33 [2021-02-04T22:27:33.228Z] 22:27:33 [INFO] Total time:  02:50 min
17:27:33 [2021-02-04T22:27:33.228Z] 22:27:33 [INFO] Finished at: 2021-02-04T22:27:33Z
17:27:33 [2021-02-04T22:27:33.228Z] 22:27:33 [INFO] ------------------------------------------------------------------------