SuccessConsole Output

Skipping 262 KB.. Full Log
teFields(org.eclipse.egit.github.core.tests.MemberPayloadTest)  Time elapsed: 0 s
18:03:58 [2021-02-03T23:03:58.482Z] defaultState(org.eclipse.egit.github.core.tests.MemberPayloadTest)  Time elapsed: 0 s
18:03:58 [2021-02-03T23:03:58.482Z] updateFields(org.eclipse.egit.github.core.tests.PullRequestPayloadTest)  Time elapsed: 0.001 s
18:03:58 [2021-02-03T23:03:58.482Z] defaultState(org.eclipse.egit.github.core.tests.PullRequestPayloadTest)  Time elapsed: 0 s
18:03:58 [2021-02-03T23:03:58.482Z] updateFields(org.eclipse.egit.github.core.tests.PullRequestReviewCommentPayloadTest)  Time elapsed: 0 s
18:03:58 [2021-02-03T23:03:58.482Z] defaultState(org.eclipse.egit.github.core.tests.PullRequestReviewCommentPayloadTest)  Time elapsed: 0 s
18:03:58 [2021-02-03T23:03:58.482Z] updateFields(org.eclipse.egit.github.core.tests.PushPayloadTest)  Time elapsed: 0 s
18:03:58 [2021-02-03T23:03:58.482Z] defaultState(org.eclipse.egit.github.core.tests.PushPayloadTest)  Time elapsed: 0 s
18:03:58 [2021-02-03T23:03:58.482Z] updateFields(org.eclipse.egit.github.core.tests.TeamAddPayloadTest)  Time elapsed: 0.001 s
18:03:58 [2021-02-03T23:03:58.482Z] defaultState(org.eclipse.egit.github.core.tests.TeamAddPayloadTest)  Time elapsed: 0 s
18:03:58 [2021-02-03T23:03:58.482Z] updateFields(org.eclipse.egit.github.core.tests.WatchPayloadTest)  Time elapsed: 0 s
18:03:58 [2021-02-03T23:03:58.482Z] defaultState(org.eclipse.egit.github.core.tests.WatchPayloadTest)  Time elapsed: 0 s
18:03:58 [2021-02-03T23:03:58.482Z] updateFields(org.eclipse.egit.github.core.tests.EventRepositoryTest)  Time elapsed: 0 s
18:03:58 [2021-02-03T23:03:58.482Z] defaultState(org.eclipse.egit.github.core.tests.EventRepositoryTest)  Time elapsed: 0 s
18:03:58 [2021-02-03T23:03:58.482Z] pageUserEvents(org.eclipse.egit.github.core.tests.EventServiceTest)  Time elapsed: 0.001 s
18:03:58 [2021-02-03T23:03:58.482Z] pagePublicEvents(org.eclipse.egit.github.core.tests.EventServiceTest)  Time elapsed: 0 s
18:03:58 [2021-02-03T23:03:58.482Z] constructorNullArgument(org.eclipse.egit.github.core.tests.EventServiceTest)  Time elapsed: 0 s
18:03:58 [2021-02-03T23:03:58.482Z] defaultConstructor(org.eclipse.egit.github.core.tests.EventServiceTest)  Time elapsed: 0.012 s
18:03:58 [2021-02-03T23:03:58.482Z] pageNetworkEvents(org.eclipse.egit.github.core.tests.EventServiceTest)  Time elapsed: 0 s
18:03:58 [2021-02-03T23:03:58.482Z] pageUserOrgEvents(org.eclipse.egit.github.core.tests.EventServiceTest)  Time elapsed: 0.001 s
18:03:58 [2021-02-03T23:03:58.482Z] pagePublicUserEvents(org.eclipse.egit.github.core.tests.EventServiceTest)  Time elapsed: 0 s
18:03:58 [2021-02-03T23:03:58.482Z] pageUserReceivedEvents(org.eclipse.egit.github.core.tests.EventServiceTest)  Time elapsed: 0 s
18:03:58 [2021-02-03T23:03:58.482Z] pageOrgEvents(org.eclipse.egit.github.core.tests.EventServiceTest)  Time elapsed: 0 s
18:03:58 [2021-02-03T23:03:58.482Z] pagePublicUserReceivedEvents(org.eclipse.egit.github.core.tests.EventServiceTest)  Time elapsed: 0.001 s
18:03:58 [2021-02-03T23:03:58.482Z] pageRepsitoryEvents(org.eclipse.egit.github.core.tests.EventServiceTest)  Time elapsed: 0 s
18:03:58 [2021-02-03T23:03:58.482Z] updateFields(org.eclipse.egit.github.core.tests.EventTest)  Time elapsed: 0 s
18:03:58 [2021-02-03T23:03:58.482Z] defaultState(org.eclipse.egit.github.core.tests.EventTest)  Time elapsed: 0 s
18:03:58 [2021-02-03T23:03:58.482Z] getCreatedAtReferenceMutableObject(org.eclipse.egit.github.core.tests.EventTest)  Time elapsed: 0 s
18:03:58 [2021-02-03T23:03:58.482Z] updateFields(org.eclipse.egit.github.core.tests.FieldErrorTest)  Time elapsed: 0 s
18:03:58 [2021-02-03T23:03:58.482Z] defaultState(org.eclipse.egit.github.core.tests.FieldErrorTest)  Time elapsed: 0 s
18:03:58 [2021-02-03T23:03:58.482Z] updateFields(org.eclipse.egit.github.core.tests.FollowPayloadTest)  Time elapsed: 0 s
18:03:58 [2021-02-03T23:03:58.482Z] defaultState(org.eclipse.egit.github.core.tests.FollowPayloadTest)  Time elapsed: 0 s
18:03:58 [2021-02-03T23:03:58.482Z] updateFields(org.eclipse.egit.github.core.tests.ForkApplyPayloadTest)  Time elapsed: 0 s
18:03:58 [2021-02-03T23:03:58.482Z] defaultState(org.eclipse.egit.github.core.tests.ForkApplyPayloadTest)  Time elapsed: 0 s
18:03:58 [2021-02-03T23:03:58.482Z] updateFields(org.eclipse.egit.github.core.tests.ForkPayloadTest)  Time elapsed: 0 s
18:03:58 [2021-02-03T23:03:58.482Z] defaultState(org.eclipse.egit.github.core.tests.ForkPayloadTest)  Time elapsed: 0 s
18:03:58 [2021-02-03T23:03:58.482Z] updateFields(org.eclipse.egit.github.core.tests.GistChangeStatusTest)  Time elapsed: 0 s
18:03:58 [2021-02-03T23:03:58.482Z] defaultState(org.eclipse.egit.github.core.tests.GistChangeStatusTest)  Time elapsed: 0 s
18:03:58 [2021-02-03T23:03:58.482Z] updateFields(org.eclipse.egit.github.core.tests.GistFileTest)  Time elapsed: 0 s
18:03:58 [2021-02-03T23:03:58.482Z] defaultState(org.eclipse.egit.github.core.tests.GistFileTest)  Time elapsed: 0 s
18:03:58 [2021-02-03T23:03:58.482Z] updateFields(org.eclipse.egit.github.core.tests.GistPayloadTest)  Time elapsed: 0 s
18:03:58 [2021-02-03T23:03:58.482Z] defaultState(org.eclipse.egit.github.core.tests.GistPayloadTest)  Time elapsed: 0 s
18:03:58 [2021-02-03T23:03:58.482Z] updateFields(org.eclipse.egit.github.core.tests.GistRevisionTest)  Time elapsed: 0 s
18:03:58 [2021-02-03T23:03:58.482Z] defaultState(org.eclipse.egit.github.core.tests.GistRevisionTest)  Time elapsed: 0 s
18:03:58 [2021-02-03T23:03:58.482Z] getCreatedAReferenceMutableObject(org.eclipse.egit.github.core.tests.GistRevisionTest)  Time elapsed: 0 s
18:03:58 [2021-02-03T23:03:58.482Z] starGistNullId(org.eclipse.egit.github.core.tests.GistServiceTest)  Time elapsed: 0.001 s
18:03:58 [2021-02-03T23:03:58.482Z] pageUserGistsEmptyId(org.eclipse.egit.github.core.tests.GistServiceTest)  Time elapsed: 0 s
18:03:58 [2021-02-03T23:03:58.482Z] getGistsNullUser(org.eclipse.egit.github.core.tests.GistServiceTest)  Time elapsed: 0 s
18:03:58 [2021-02-03T23:03:58.482Z] getGistEmptyId(org.eclipse.egit.github.core.tests.GistServiceTest)  Time elapsed: 0 s
18:03:58 [2021-02-03T23:03:58.482Z] unstarGist(org.eclipse.egit.github.core.tests.GistServiceTest)  Time elapsed: 0.001 s
18:03:58 [2021-02-03T23:03:58.482Z] starGistEmptyId(org.eclipse.egit.github.core.tests.GistServiceTest)  Time elapsed: 0 s
18:03:58 [2021-02-03T23:03:58.482Z] updateGistOK(org.eclipse.egit.github.core.tests.GistServiceTest)  Time elapsed: 0 s
18:03:58 [2021-02-03T23:03:58.482Z] getStarredGists(org.eclipse.egit.github.core.tests.GistServiceTest)  Time elapsed: 0 s
18:03:58 [2021-02-03T23:03:58.482Z] editGistComment(org.eclipse.egit.github.core.tests.GistServiceTest)  Time elapsed: 0.001 s
18:03:58 [2021-02-03T23:03:58.482Z] createGistNullOwner(org.eclipse.egit.github.core.tests.GistServiceTest)  Time elapsed: 0 s
18:03:58 [2021-02-03T23:03:58.482Z] isStarredGistNullId(org.eclipse.egit.github.core.tests.GistServiceTest)  Time elapsed: 0 s
18:03:58 [2021-02-03T23:03:58.482Z] deleteGistEmptyId(org.eclipse.egit.github.core.tests.GistServiceTest)  Time elapsed: 0 s
18:03:58 [2021-02-03T23:03:58.482Z] forkGistNullId(org.eclipse.egit.github.core.tests.GistServiceTest)  Time elapsed: 0 s
18:03:58 [2021-02-03T23:03:58.482Z] constructorNullArgument(org.eclipse.egit.github.core.tests.GistServiceTest)  Time elapsed: 0.001 s
18:03:58 [2021-02-03T23:03:58.482Z] editGistCommentNullComment(org.eclipse.egit.github.core.tests.GistServiceTest)  Time elapsed: 0 s
18:03:58 [2021-02-03T23:03:58.482Z] deleteGistNullId(org.eclipse.egit.github.core.tests.GistServiceTest)  Time elapsed: 0 s
18:03:58 [2021-02-03T23:03:58.482Z] isStarredGist(org.eclipse.egit.github.core.tests.GistServiceTest)  Time elapsed: 0 s
18:03:58 [2021-02-03T23:03:58.482Z] updateGistNullId(org.eclipse.egit.github.core.tests.GistServiceTest)  Time elapsed: 0.001 s
18:03:58 [2021-02-03T23:03:58.482Z] getGist(org.eclipse.egit.github.core.tests.GistServiceTest)  Time elapsed: 0 s
18:03:58 [2021-02-03T23:03:58.482Z] isStarredGistEmptyId(org.eclipse.egit.github.core.tests.GistServiceTest)  Time elapsed: 0 s
18:03:58 [2021-02-03T23:03:58.482Z] pagePublicGists(org.eclipse.egit.github.core.tests.GistServiceTest)  Time elapsed: 0 s
18:03:58 [2021-02-03T23:03:58.482Z] pageStarredGists(org.eclipse.egit.github.core.tests.GistServiceTest)  Time elapsed: 0 s
18:03:58 [2021-02-03T23:03:58.482Z] pageUserGists(org.eclipse.egit.github.core.tests.GistServiceTest)  Time elapsed: 0 s
18:03:58 [2021-02-03T23:03:58.482Z] forkGist(org.eclipse.egit.github.core.tests.GistServiceTest)  Time elapsed: 0 s
18:03:58 [2021-02-03T23:03:58.482Z] createGistNullGist(org.eclipse.egit.github.core.tests.GistServiceTest)  Time elapsed: 0 s
18:03:58 [2021-02-03T23:03:58.483Z] createCommentNullGistId(org.eclipse.egit.github.core.tests.GistServiceTest)  Time elapsed: 0 s
18:03:58 [2021-02-03T23:03:58.483Z] getCommentsOK(org.eclipse.egit.github.core.tests.GistServiceTest)  Time elapsed: 0.001 s
18:03:58 [2021-02-03T23:03:58.483Z] getCommentsNullGistId(org.eclipse.egit.github.core.tests.GistServiceTest)  Time elapsed: 0 s
18:03:58 [2021-02-03T23:03:58.483Z] unstarGistNullId(org.eclipse.egit.github.core.tests.GistServiceTest)  Time elapsed: 0 s
18:03:58 [2021-02-03T23:03:58.483Z] pageUserGistsNullId(org.eclipse.egit.github.core.tests.GistServiceTest)  Time elapsed: 0 s
18:03:58 [2021-02-03T23:03:58.483Z] getGistNullId(org.eclipse.egit.github.core.tests.GistServiceTest)  Time elapsed: 0 s
18:03:58 [2021-02-03T23:03:58.483Z] defaultContructor(org.eclipse.egit.github.core.tests.GistServiceTest)  Time elapsed: 0.001 s
18:03:58 [2021-02-03T23:03:58.483Z] getGistComment(org.eclipse.egit.github.core.tests.GistServiceTest)  Time elapsed: 0 s
18:03:58 [2021-02-03T23:03:58.483Z] createCommentNullComment(org.eclipse.egit.github.core.tests.GistServiceTest)  Time elapsed: 0 s
18:03:58 [2021-02-03T23:03:58.483Z] getGistsOK(org.eclipse.egit.github.core.tests.GistServiceTest)  Time elapsed: 0 s
18:03:58 [2021-02-03T23:03:58.483Z] starGist(org.eclipse.egit.github.core.tests.GistServiceTest)  Time elapsed: 0.001 s
18:03:58 [2021-02-03T23:03:58.483Z] createCommentOK(org.eclipse.egit.github.core.tests.GistServiceTest)  Time elapsed: 0 s
18:03:58 [2021-02-03T23:03:58.483Z] forkGistEmptyId(org.eclipse.egit.github.core.tests.GistServiceTest)  Time elapsed: 0 s
18:03:58 [2021-02-03T23:03:58.483Z] deleteGistComment(org.eclipse.egit.github.core.tests.GistServiceTest)  Time elapsed: 0 s
18:03:58 [2021-02-03T23:03:58.483Z] deleteGist(org.eclipse.egit.github.core.tests.GistServiceTest)  Time elapsed: 0 s
18:03:58 [2021-02-03T23:03:58.483Z] updateGistNullGist(org.eclipse.egit.github.core.tests.GistServiceTest)  Time elapsed: 0 s
18:03:58 [2021-02-03T23:03:58.483Z] getGistsEmptyUser(org.eclipse.egit.github.core.tests.GistServiceTest)  Time elapsed: 0.001 s
18:03:58 [2021-02-03T23:03:58.483Z] unstarGistEmptyId(org.eclipse.egit.github.core.tests.GistServiceTest)  Time elapsed: 0 s
18:03:58 [2021-02-03T23:03:58.483Z] updateFields(org.eclipse.egit.github.core.tests.GistTest)  Time elapsed: 0 s
18:03:58 [2021-02-03T23:03:58.483Z] defaultState(org.eclipse.egit.github.core.tests.GistTest)  Time elapsed: 0 s
18:03:58 [2021-02-03T23:03:58.483Z] getCreatedAtReferenceMutableObject(org.eclipse.egit.github.core.tests.GistTest)  Time elapsed: 0 s
18:03:58 [2021-02-03T23:03:58.483Z] getUpdatedAtReferenceMutableObject(org.eclipse.egit.github.core.tests.GistTest)  Time elapsed: 0 s
18:03:58 [2021-02-03T23:03:58.483Z] prefixLocalhost(org.eclipse.egit.github.core.tests.GitHubClientTest)  Time elapsed: 0 s
18:03:58 [2021-02-03T23:03:58.483Z] prefixHostApiV3(org.eclipse.egit.github.core.tests.GitHubClientTest)  Time elapsed: 0 s
18:03:58 [2021-02-03T23:03:58.483Z] updateFields(org.eclipse.egit.github.core.tests.GollumPageTest)  Time elapsed: 0 s
18:03:58 [2021-02-03T23:03:58.483Z] defaultState(org.eclipse.egit.github.core.tests.GollumPageTest)  Time elapsed: 0 s
18:03:58 [2021-02-03T23:03:58.483Z] updateFields(org.eclipse.egit.github.core.tests.GollumPayloadTest)  Time elapsed: 0 s
18:03:58 [2021-02-03T23:03:58.483Z] defaultState(org.eclipse.egit.github.core.tests.GollumPayloadTest)  Time elapsed: 0 s
18:03:58 [2021-02-03T23:03:58.483Z] seriazlizeNulls(org.eclipse.egit.github.core.tests.GsonUtilsTest)  Time elapsed: 0.001 s
18:03:58 [2021-02-03T23:03:58.483Z] noSeriazlizeNulls(org.eclipse.egit.github.core.tests.GsonUtilsTest)  Time elapsed: 0 s
18:03:58 [2021-02-03T23:03:58.483Z] getGson(org.eclipse.egit.github.core.tests.GsonUtilsTest)  Time elapsed: 0 s
18:03:58 [2021-02-03T23:03:58.483Z] createGson(org.eclipse.egit.github.core.tests.GsonUtilsTest)  Time elapsed: 0.002 s
18:03:58 [2021-02-03T23:03:58.483Z] defaultState(org.eclipse.egit.github.core.tests.IdTest)  Time elapsed: 0 s
18:03:58 [2021-02-03T23:03:58.483Z] updateField(org.eclipse.egit.github.core.tests.IdTest)  Time elapsed: 0 s
18:03:58 [2021-02-03T23:03:58.483Z] updateFields(org.eclipse.egit.github.core.tests.IssueCommentPayloadTest)  Time elapsed: 0 s
18:03:58 [2021-02-03T23:03:58.483Z] defaultState(org.eclipse.egit.github.core.tests.IssueCommentPayloadTest)  Time elapsed: 0 s
18:03:58 [2021-02-03T23:03:58.483Z] nonMutableCreatedAt(org.eclipse.egit.github.core.tests.IssueEventTest)  Time elapsed: 0 s
18:03:58 [2021-02-03T23:03:58.483Z] updateFields(org.eclipse.egit.github.core.tests.IssueEventTest)  Time elapsed: 0.001 s
18:03:58 [2021-02-03T23:03:58.483Z] defaultState(org.eclipse.egit.github.core.tests.IssueEventTest)  Time elapsed: 0 s
18:03:58 [2021-02-03T23:03:58.483Z] getCommentsEmptyUser(org.eclipse.egit.github.core.tests.IssueServiceTest)  Time elapsed: 0.001 s
18:03:58 [2021-02-03T23:03:58.483Z] createCommentNullIssueId(org.eclipse.egit.github.core.tests.IssueServiceTest)  Time elapsed: 0 s
18:03:58 [2021-02-03T23:03:58.483Z] createIssueEmptyUser(org.eclipse.egit.github.core.tests.IssueServiceTest)  Time elapsed: 0 s
18:03:58 [2021-02-03T23:03:58.483Z] getIssueComment(org.eclipse.egit.github.core.tests.IssueServiceTest)  Time elapsed: 0 s
18:03:58 [2021-02-03T23:03:58.483Z] pageIssueEvents(org.eclipse.egit.github.core.tests.IssueServiceTest)  Time elapsed: 0.001 s
18:03:58 [2021-02-03T23:03:58.483Z] editIssueNullRepositoryName(org.eclipse.egit.github.core.tests.IssueServiceTest)  Time elapsed: 0 s
18:03:58 [2021-02-03T23:03:58.483Z] deleteCommentNullRepositoryName(org.eclipse.egit.github.core.tests.IssueServiceTest)  Time elapsed: 0.001 s
18:03:58 [2021-02-03T23:03:58.483Z] getIssueNullRepositoryId(org.eclipse.egit.github.core.tests.IssueServiceTest)  Time elapsed: 0 s
18:03:58 [2021-02-03T23:03:58.483Z] deleteCommentWithRepositoryId(org.eclipse.egit.github.core.tests.IssueServiceTest)  Time elapsed: 0 s
18:03:58 [2021-02-03T23:03:58.483Z] deleteCommentNullId(org.eclipse.egit.github.core.tests.IssueServiceTest)  Time elapsed: 0 s
18:03:58 [2021-02-03T23:03:58.483Z] editIssue(org.eclipse.egit.github.core.tests.IssueServiceTest)  Time elapsed: 0 s
18:03:58 [2021-02-03T23:03:58.483Z] createCommentEmptyRepositoryName(org.eclipse.egit.github.core.tests.IssueServiceTest)  Time elapsed: 0 s
18:03:58 [2021-02-03T23:03:58.483Z] getIssueWithRepositoryId(org.eclipse.egit.github.core.tests.IssueServiceTest)  Time elapsed: 0 s
18:03:58 [2021-02-03T23:03:58.483Z] createCommentNullRepositoryName(org.eclipse.egit.github.core.tests.IssueServiceTest)  Time elapsed: 0 s
18:03:58 [2021-02-03T23:03:58.483Z] getIssueNullUser(org.eclipse.egit.github.core.tests.IssueServiceTest)  Time elapsed: 0 s
18:03:58 [2021-02-03T23:03:58.483Z] editIssueEmptyRepositoryName(org.eclipse.egit.github.core.tests.IssueServiceTest)  Time elapsed: 0 s
18:03:58 [2021-02-03T23:03:58.483Z] createIssueNullRepositoryName(org.eclipse.egit.github.core.tests.IssueServiceTest)  Time elapsed: 0.001 s
18:03:58 [2021-02-03T23:03:58.483Z] getCommentsNullRepositoryName(org.eclipse.egit.github.core.tests.IssueServiceTest)  Time elapsed: 0 s
18:03:58 [2021-02-03T23:03:58.483Z] deleteCommentEmptyRepositoryName(org.eclipse.egit.github.core.tests.IssueServiceTest)  Time elapsed: 0 s
18:03:58 [2021-02-03T23:03:58.483Z] getCommentsEmptyRepositoryName(org.eclipse.egit.github.core.tests.IssueServiceTest)  Time elapsed: 0 s
18:03:58 [2021-02-03T23:03:58.483Z] getIssueEmptyUser(org.eclipse.egit.github.core.tests.IssueServiceTest)  Time elapsed: 0 s
18:03:58 [2021-02-03T23:03:58.483Z] createComment(org.eclipse.egit.github.core.tests.IssueServiceTest)  Time elapsed: 0 s
18:03:58 [2021-02-03T23:03:58.483Z] getCommentsNullRepositoryId(org.eclipse.egit.github.core.tests.IssueServiceTest)  Time elapsed: 0 s
18:03:58 [2021-02-03T23:03:58.483Z] getIssuesNullUser(org.eclipse.egit.github.core.tests.IssueServiceTest)  Time elapsed: 0 s
18:03:58 [2021-02-03T23:03:58.483Z] editIssueCommentNullComment(org.eclipse.egit.github.core.tests.IssueServiceTest)  Time elapsed: 0 s
18:03:58 [2021-02-03T23:03:58.483Z] getCommentsWithRepositoryId(org.eclipse.egit.github.core.tests.IssueServiceTest)  Time elapsed: 0.001 s
18:03:58 [2021-02-03T23:03:58.483Z] constructorNullArgument(org.eclipse.egit.github.core.tests.IssueServiceTest)  Time elapsed: 0 s
18:03:58 [2021-02-03T23:03:58.483Z] pageRepsitoryIssuesWithRepositoryId(org.eclipse.egit.github.core.tests.IssueServiceTest)  Time elapsed: 0 s
18:03:58 [2021-02-03T23:03:58.483Z] getCommentsNullId(org.eclipse.egit.github.core.tests.IssueServiceTest)  Time elapsed: 0.001 s
18:03:58 [2021-02-03T23:03:58.483Z] deleteCommentEmptyUser(org.eclipse.egit.github.core.tests.IssueServiceTest)  Time elapsed: 0 s
18:03:58 [2021-02-03T23:03:58.483Z] getCurrentUserIssues(org.eclipse.egit.github.core.tests.IssueServiceTest)  Time elapsed: 0 s
18:03:58 [2021-02-03T23:03:58.483Z] createIssueNullIssueWithRepositoryId(org.eclipse.egit.github.core.tests.IssueServiceTest)  Time elapsed: 0 s
18:03:58 [2021-02-03T23:03:58.483Z] editIssueEmptyUser(org.eclipse.egit.github.core.tests.IssueServiceTest)  Time elapsed: 0.001 s
18:03:58 [2021-02-03T23:03:58.483Z] getIssueNullRepositoryName(org.eclipse.egit.github.core.tests.IssueServiceTest)  Time elapsed: 0 s
18:03:58 [2021-02-03T23:03:58.483Z] defaultConstructor(org.eclipse.egit.github.core.tests.IssueServiceTest)  Time elapsed: 0 s
18:03:58 [2021-02-03T23:03:58.483Z] getIssuesEmptyRepositoryName(org.eclipse.egit.github.core.tests.IssueServiceTest)  Time elapsed: 0 s
18:03:58 [2021-02-03T23:03:58.484Z] getIssueEmptyId(org.eclipse.egit.github.core.tests.IssueServiceTest)  Time elapsed: 0 s
18:03:58 [2021-02-03T23:03:58.484Z] deleteCommentNullUser(org.eclipse.egit.github.core.tests.IssueServiceTest)  Time elapsed: 0 s
18:03:58 [2021-02-03T23:03:58.484Z] createCommentNullUser(org.eclipse.egit.github.core.tests.IssueServiceTest)  Time elapsed: 0 s
18:03:58 [2021-02-03T23:03:58.484Z] createIssueEmptyRepositoryName(org.eclipse.egit.github.core.tests.IssueServiceTest)  Time elapsed: 0.001 s
18:03:58 [2021-02-03T23:03:58.484Z] searchIssues(org.eclipse.egit.github.core.tests.IssueServiceTest)  Time elapsed: 0 s
18:03:58 [2021-02-03T23:03:58.484Z] editIssueWithRepositoryId(org.eclipse.egit.github.core.tests.IssueServiceTest)  Time elapsed: 0 s
18:03:58 [2021-02-03T23:03:58.484Z] searchEscaped(org.eclipse.egit.github.core.tests.IssueServiceTest)  Time elapsed: 0 s
18:03:58 [2021-02-03T23:03:58.484Z] getCommentsEmptyId(org.eclipse.egit.github.core.tests.IssueServiceTest)  Time elapsed: 0.001 s
18:03:58 [2021-02-03T23:03:58.484Z] editIssueComment(org.eclipse.egit.github.core.tests.IssueServiceTest)  Time elapsed: 0 s
18:03:58 [2021-02-03T23:03:58.484Z] createCommentWithRepositoryId(org.eclipse.egit.github.core.tests.IssueServiceTest)  Time elapsed: 0 s
18:03:58 [2021-02-03T23:03:58.484Z] searchIssueEmptyQuery(org.eclipse.egit.github.core.tests.IssueServiceTest)  Time elapsed: 0 s
18:03:58 [2021-02-03T23:03:58.484Z] searchIssueEmptyState(org.eclipse.egit.github.core.tests.IssueServiceTest)  Time elapsed: 0 s
18:03:58 [2021-02-03T23:03:58.484Z] createIssueNullIssue(org.eclipse.egit.github.core.tests.IssueServiceTest)  Time elapsed: 0 s
18:03:58 [2021-02-03T23:03:58.484Z] getIssuesRepositoryId(org.eclipse.egit.github.core.tests.IssueServiceTest)  Time elapsed: 0 s
18:03:58 [2021-02-03T23:03:58.484Z] getIssues(org.eclipse.egit.github.core.tests.IssueServiceTest)  Time elapsed: 0 s
18:03:58 [2021-02-03T23:03:58.484Z] getIssueNullId(org.eclipse.egit.github.core.tests.IssueServiceTest)  Time elapsed: 0 s
18:03:58 [2021-02-03T23:03:58.484Z] editIssueCommentWithRepositoryId(org.eclipse.egit.github.core.tests.IssueServiceTest)  Time elapsed: 0 s
18:03:58 [2021-02-03T23:03:58.484Z] deleteComment(org.eclipse.egit.github.core.tests.IssueServiceTest)  Time elapsed: 0.001 s
18:03:58 [2021-02-03T23:03:58.484Z] pageEvents(org.eclipse.egit.github.core.tests.IssueServiceTest)  Time elapsed: 0 s
18:03:58 [2021-02-03T23:03:58.484Z] editIssueNullUser(org.eclipse.egit.github.core.tests.IssueServiceTest)  Time elapsed: 0 s
18:03:58 [2021-02-03T23:03:58.484Z] createCommentEmptyIssueId(org.eclipse.egit.github.core.tests.IssueServiceTest)  Time elapsed: 0 s
18:03:58 [2021-02-03T23:03:58.484Z] pageIssues(org.eclipse.egit.github.core.tests.IssueServiceTest)  Time elapsed: 0 s
18:03:58 [2021-02-03T23:03:58.484Z] createIssueNullUser(org.eclipse.egit.github.core.tests.IssueServiceTest)  Time elapsed: 0 s
18:03:58 [2021-02-03T23:03:58.484Z] getIssueEvent(org.eclipse.egit.github.core.tests.IssueServiceTest)  Time elapsed: 0.001 s
18:03:58 [2021-02-03T23:03:58.484Z] getIssueEmptyRepositoryName(org.eclipse.egit.github.core.tests.IssueServiceTest)  Time elapsed: 0 s
18:03:58 [2021-02-03T23:03:58.484Z] getIssuesNullRepositoryId(org.eclipse.egit.github.core.tests.IssueServiceTest)  Time elapsed: 0 s
18:03:58 [2021-02-03T23:03:58.484Z] getComments(org.eclipse.egit.github.core.tests.IssueServiceTest)  Time elapsed: 0 s
18:03:58 [2021-02-03T23:03:58.484Z] getIssuesNullRepositoryName(org.eclipse.egit.github.core.tests.IssueServiceTest)  Time elapsed: 0 s
18:03:58 [2021-02-03T23:03:58.484Z] createCommentEmptyUser(org.eclipse.egit.github.core.tests.IssueServiceTest)  Time elapsed: 0 s
18:03:58 [2021-02-03T23:03:58.484Z] deleteCommentEmptyId(org.eclipse.egit.github.core.tests.IssueServiceTest)  Time elapsed: 0.001 s
18:03:58 [2021-02-03T23:03:58.484Z] searchIssuesNullRepository(org.eclipse.egit.github.core.tests.IssueServiceTest)  Time elapsed: 0 s
18:03:58 [2021-02-03T23:03:58.484Z] pageRepsitoryIssues(org.eclipse.egit.github.core.tests.IssueServiceTest)  Time elapsed: 0 s
18:03:58 [2021-02-03T23:03:58.484Z] editIssueNullIssue(org.eclipse.egit.github.core.tests.IssueServiceTest)  Time elapsed: 0 s
18:03:58 [2021-02-03T23:03:58.484Z] getCommentsNullUser(org.eclipse.egit.github.core.tests.IssueServiceTest)  Time elapsed: 0 s
18:03:58 [2021-02-03T23:03:58.484Z] getIssue(org.eclipse.egit.github.core.tests.IssueServiceTest)  Time elapsed: 0 s
18:03:58 [2021-02-03T23:03:58.484Z] searchIssueNullQuery(org.eclipse.egit.github.core.tests.IssueServiceTest)  Time elapsed: 0 s
18:03:58 [2021-02-03T23:03:58.484Z] searchIssueNullState(org.eclipse.egit.github.core.tests.IssueServiceTest)  Time elapsed: 0.001 s
18:03:58 [2021-02-03T23:03:58.484Z] getIssuesEmptyUser(org.eclipse.egit.github.core.tests.IssueServiceTest)  Time elapsed: 0 s
18:03:58 [2021-02-03T23:03:58.484Z] getClosedAtReferenceMutableObject(org.eclipse.egit.github.core.tests.IssueTest)  Time elapsed: 0 s
18:03:58 [2021-02-03T23:03:58.484Z] updateFields(org.eclipse.egit.github.core.tests.IssueTest)  Time elapsed: 0 s
18:03:58 [2021-02-03T23:03:58.484Z] defaultState(org.eclipse.egit.github.core.tests.IssueTest)  Time elapsed: 0 s
18:03:58 [2021-02-03T23:03:58.484Z] getCreatedAtReferenceMutableObject(org.eclipse.egit.github.core.tests.IssueTest)  Time elapsed: 0.001 s
18:03:58 [2021-02-03T23:03:58.484Z] getUpdatedAtReferenceMutableObject(org.eclipse.egit.github.core.tests.IssueTest)  Time elapsed: 0 s
18:03:58 [2021-02-03T23:03:58.484Z] updateFields(org.eclipse.egit.github.core.tests.IssuesPayloadTest)  Time elapsed: 0 s
18:03:58 [2021-02-03T23:03:58.484Z] defaultState(org.eclipse.egit.github.core.tests.IssuesPayloadTest)  Time elapsed: 0 s
18:03:58 [2021-02-03T23:03:58.484Z] updateFields(org.eclipse.egit.github.core.tests.KeyTest)  Time elapsed: 0 s
18:03:58 [2021-02-03T23:03:58.484Z] defaultState(org.eclipse.egit.github.core.tests.KeyTest)  Time elapsed: 0 s
18:03:58 [2021-02-03T23:03:58.484Z] compareLabels(org.eclipse.egit.github.core.tests.LabelComparatorTest)  Time elapsed: 0 s
18:03:58 [2021-02-03T23:03:58.484Z] getLabelsNullUser(org.eclipse.egit.github.core.tests.LabelServiceTest)  Time elapsed: 0 s
18:03:58 [2021-02-03T23:03:58.484Z] setLabelsNullIssueId(org.eclipse.egit.github.core.tests.LabelServiceTest)  Time elapsed: 0.001 s
18:03:58 [2021-02-03T23:03:58.484Z] editLabel(org.eclipse.egit.github.core.tests.LabelServiceTest)  Time elapsed: 0 s
18:03:58 [2021-02-03T23:03:58.484Z] editLabelNullLabelName(org.eclipse.egit.github.core.tests.LabelServiceTest)  Time elapsed: 0 s
18:03:58 [2021-02-03T23:03:58.484Z] getEmptyUser(org.eclipse.egit.github.core.tests.LabelServiceTest)  Time elapsed: 0 s
18:03:58 [2021-02-03T23:03:58.484Z] getEmptyLabel(org.eclipse.egit.github.core.tests.LabelServiceTest)  Time elapsed: 0 s
18:03:58 [2021-02-03T23:03:58.484Z] getLabelWithRepositoryId(org.eclipse.egit.github.core.tests.LabelServiceTest)  Time elapsed: 0 s
18:03:58 [2021-02-03T23:03:58.484Z] deleteLabel(org.eclipse.egit.github.core.tests.LabelServiceTest)  Time elapsed: 0.001 s
18:03:58 [2021-02-03T23:03:58.484Z] getLabelsNullRepositoryName(org.eclipse.egit.github.core.tests.LabelServiceTest)  Time elapsed: 0 s
18:03:58 [2021-02-03T23:03:58.484Z] createLabelNullLabel(org.eclipse.egit.github.core.tests.LabelServiceTest)  Time elapsed: 0 s
18:03:58 [2021-02-03T23:03:58.484Z] constructorNullArgument(org.eclipse.egit.github.core.tests.LabelServiceTest)  Time elapsed: 0 s
18:03:58 [2021-02-03T23:03:58.484Z] deleteEmptyUser(org.eclipse.egit.github.core.tests.LabelServiceTest)  Time elapsed: 0 s
18:03:58 [2021-02-03T23:03:58.484Z] getEmptyRepositoryName(org.eclipse.egit.github.core.tests.LabelServiceTest)  Time elapsed: 0 s
18:03:58 [2021-02-03T23:03:58.484Z] createLabel(org.eclipse.egit.github.core.tests.LabelServiceTest)  Time elapsed: 0.001 s
18:03:58 [2021-02-03T23:03:58.484Z] setLabelsEmptyIssueId(org.eclipse.egit.github.core.tests.LabelServiceTest)  Time elapsed: 0 s
18:03:58 [2021-02-03T23:03:58.484Z] defaultConstuctor(org.eclipse.egit.github.core.tests.LabelServiceTest)  Time elapsed: 0 s
18:03:58 [2021-02-03T23:03:58.484Z] getNullUser(org.eclipse.egit.github.core.tests.LabelServiceTest)  Time elapsed: 0.001 s
18:03:58 [2021-02-03T23:03:58.484Z] setLabelsNullLabels(org.eclipse.egit.github.core.tests.LabelServiceTest)  Time elapsed: 0 s
18:03:58 [2021-02-03T23:03:58.484Z] deleteNullUser(org.eclipse.egit.github.core.tests.LabelServiceTest)  Time elapsed: 0 s
18:03:58 [2021-02-03T23:03:58.484Z] deleteNullRepositoryName(org.eclipse.egit.github.core.tests.LabelServiceTest)  Time elapsed: 0 s
18:03:58 [2021-02-03T23:03:58.484Z] setLabels(org.eclipse.egit.github.core.tests.LabelServiceTest)  Time elapsed: 0.001 s
18:03:58 [2021-02-03T23:03:58.484Z] deleteLabelWithRepositoryId(org.eclipse.egit.github.core.tests.LabelServiceTest)  Time elapsed: 0 s
18:03:58 [2021-02-03T23:03:58.484Z] getLabels(org.eclipse.egit.github.core.tests.LabelServiceTest)  Time elapsed: 0 s
18:03:58 [2021-02-03T23:03:58.484Z] editLabelNullLabel(org.eclipse.egit.github.core.tests.LabelServiceTest)  Time elapsed: 0 s
18:03:58 [2021-02-03T23:03:58.484Z] getNullRepositoryName(org.eclipse.egit.github.core.tests.LabelServiceTest)  Time elapsed: 0.001 s
18:03:58 [2021-02-03T23:03:58.484Z] getLabelsWithRepositoryId(org.eclipse.egit.github.core.tests.LabelServiceTest)  Time elapsed: 0 s
18:03:58 [2021-02-03T23:03:58.484Z] getNullLabel(org.eclipse.egit.github.core.tests.LabelServiceTest)  Time elapsed: 0 s
18:03:58 [2021-02-03T23:03:58.484Z] setLabelsNullUser(org.eclipse.egit.github.core.tests.LabelServiceTest)  Time elapsed: 0 s
18:03:58 [2021-02-03T23:03:58.484Z] editLabelEmptyLabelName(org.eclipse.egit.github.core.tests.LabelServiceTest)  Time elapsed: 0 s
18:03:58 [2021-02-03T23:03:58.485Z] deleteEmptyRepositoryName(org.eclipse.egit.github.core.tests.LabelServiceTest)  Time elapsed: 0 s
18:03:58 [2021-02-03T23:03:58.485Z] createLabelNullRepositoryName(org.eclipse.egit.github.core.tests.LabelServiceTest)  Time elapsed: 0.001 s
18:03:58 [2021-02-03T23:03:58.485Z] deleteEmptyLabel(org.eclipse.egit.github.core.tests.LabelServiceTest)  Time elapsed: 0 s
18:03:58 [2021-02-03T23:03:58.485Z] setLabelsWithRepositoryId(org.eclipse.egit.github.core.tests.LabelServiceTest)  Time elapsed: 0 s
18:03:58 [2021-02-03T23:03:58.485Z] createLabelNullUser(org.eclipse.egit.github.core.tests.LabelServiceTest)  Time elapsed: 0 s
18:03:58 [2021-02-03T23:03:58.485Z] deleteNullLabel(org.eclipse.egit.github.core.tests.LabelServiceTest)  Time elapsed: 0 s
18:03:58 [2021-02-03T23:03:58.485Z] setLabelsNullRepositoryName(org.eclipse.egit.github.core.tests.LabelServiceTest)  Time elapsed: 0 s
18:03:58 [2021-02-03T23:03:58.485Z] createLabelWithRepositoryId(org.eclipse.egit.github.core.tests.LabelServiceTest)  Time elapsed: 0.001 s
18:03:58 [2021-02-03T23:03:58.485Z] getLabel(org.eclipse.egit.github.core.tests.LabelServiceTest)  Time elapsed: 0 s
18:03:58 [2021-02-03T23:03:58.485Z] updateFields(org.eclipse.egit.github.core.tests.LabelTest)  Time elapsed: 0 s
18:03:58 [2021-02-03T23:03:58.485Z] defaultState(org.eclipse.egit.github.core.tests.LabelTest)  Time elapsed: 0 s
18:03:58 [2021-02-03T23:03:58.485Z] equality(org.eclipse.egit.github.core.tests.LabelTest)  Time elapsed: 0 s
18:03:58 [2021-02-03T23:03:58.485Z] languages(org.eclipse.egit.github.core.tests.LanguagesTest)  Time elapsed: 0.004 s
18:03:58 [2021-02-03T23:03:58.485Z] getRepositoryHtml(org.eclipse.egit.github.core.tests.MarkdownServiceTest)  Time elapsed: 0.001 s
18:03:58 [2021-02-03T23:03:58.485Z] getHtml(org.eclipse.egit.github.core.tests.MarkdownServiceTest)  Time elapsed: 0 s
18:03:58 [2021-02-03T23:03:58.485Z] getRepositoryHtmlNullRepository(org.eclipse.egit.github.core.tests.MarkdownServiceTest)  Time elapsed: 0 s
18:03:58 [2021-02-03T23:03:58.485Z] updateFields(org.eclipse.egit.github.core.tests.MemberPayloadTest)  Time elapsed: 0 s
18:03:58 [2021-02-03T23:03:58.485Z] defaultState(org.eclipse.egit.github.core.tests.MemberPayloadTest)  Time elapsed: 0 s
18:03:58 [2021-02-03T23:03:58.485Z] updateFields(org.eclipse.egit.github.core.tests.MergeStatusTest)  Time elapsed: 0 s
18:03:58 [2021-02-03T23:03:58.485Z] defaultState(org.eclipse.egit.github.core.tests.MergeStatusTest)  Time elapsed: 0 s
18:03:58 [2021-02-03T23:03:58.485Z] compareMilestones(org.eclipse.egit.github.core.tests.MilestoneComparatorTest)  Time elapsed: 0 s
18:03:58 [2021-02-03T23:03:58.485Z] deleteMilestoneNullUser(org.eclipse.egit.github.core.tests.MilestoneServiceTest)  Time elapsed: 0.001 s
18:03:58 [2021-02-03T23:03:58.485Z] editMilestoneDescription(org.eclipse.egit.github.core.tests.MilestoneServiceTest)  Time elapsed: 0 s
18:03:58 [2021-02-03T23:03:58.485Z] createMilestoneEmptyRepositoryName(org.eclipse.egit.github.core.tests.MilestoneServiceTest)  Time elapsed: 0.001 s
18:03:58 [2021-02-03T23:03:58.485Z] editMilestoneFull(org.eclipse.egit.github.core.tests.MilestoneServiceTest)  Time elapsed: 0 s
18:03:58 [2021-02-03T23:03:58.485Z] getMilestonesEmptyUser(org.eclipse.egit.github.core.tests.MilestoneServiceTest)  Time elapsed: 0.001 s
18:03:58 [2021-02-03T23:03:58.485Z] createMilestoneEmptyUser(org.eclipse.egit.github.core.tests.MilestoneServiceTest)  Time elapsed: 0 s
18:03:58 [2021-02-03T23:03:58.485Z] createMilestoneFull(org.eclipse.egit.github.core.tests.MilestoneServiceTest)  Time elapsed: 0 s
18:03:58 [2021-02-03T23:03:58.485Z] createMilestoneOpen(org.eclipse.egit.github.core.tests.MilestoneServiceTest)  Time elapsed: 0 s
18:03:58 [2021-02-03T23:03:58.485Z] editMilestoneEmptyMilestone(org.eclipse.egit.github.core.tests.MilestoneServiceTest)  Time elapsed: 0.001 s
18:03:58 [2021-02-03T23:03:58.485Z] createMilestoneNullRepositoryName(org.eclipse.egit.github.core.tests.MilestoneServiceTest)  Time elapsed: 0 s
18:03:58 [2021-02-03T23:03:58.485Z] deleteMilestoneEmptyUser(org.eclipse.egit.github.core.tests.MilestoneServiceTest)  Time elapsed: 0 s
18:03:58 [2021-02-03T23:03:58.485Z] getMilestone(org.eclipse.egit.github.core.tests.MilestoneServiceTest)  Time elapsed: 0 s
18:03:58 [2021-02-03T23:03:58.485Z] createMilestoneEmptyMilestone(org.eclipse.egit.github.core.tests.MilestoneServiceTest)  Time elapsed: 0 s
18:03:58 [2021-02-03T23:03:58.485Z] constructorNullArgument(org.eclipse.egit.github.core.tests.MilestoneServiceTest)  Time elapsed: 0 s
18:03:58 [2021-02-03T23:03:58.485Z] getMilestoneEmptyUser(org.eclipse.egit.github.core.tests.MilestoneServiceTest)  Time elapsed: 0 s
18:03:58 [2021-02-03T23:03:58.485Z] getMilestoneNullRepositoryName(org.eclipse.egit.github.core.tests.MilestoneServiceTest)  Time elapsed: 0 s
18:03:58 [2021-02-03T23:03:58.485Z] getMilestonesEmptyRepositoryName(org.eclipse.egit.github.core.tests.MilestoneServiceTest)  Time elapsed: 0 s
18:03:58 [2021-02-03T23:03:58.485Z] deleteMilestoneNullRepositoryName(org.eclipse.egit.github.core.tests.MilestoneServiceTest)  Time elapsed: 0 s
18:03:58 [2021-02-03T23:03:58.485Z] getMilestonesNullUser(org.eclipse.egit.github.core.tests.MilestoneServiceTest)  Time elapsed: 0.001 s
18:03:58 [2021-02-03T23:03:58.485Z] defaultConstructor(org.eclipse.egit.github.core.tests.MilestoneServiceTest)  Time elapsed: 0 s
18:03:58 [2021-02-03T23:03:58.485Z] deleteMilestone(org.eclipse.egit.github.core.tests.MilestoneServiceTest)  Time elapsed: 0 s
18:03:58 [2021-02-03T23:03:58.485Z] getMilestoneEmptyRepositoryName(org.eclipse.egit.github.core.tests.MilestoneServiceTest)  Time elapsed: 0 s
18:03:58 [2021-02-03T23:03:58.485Z] createMilestoneNullMilestone(org.eclipse.egit.github.core.tests.MilestoneServiceTest)  Time elapsed: 0 s
18:03:58 [2021-02-03T23:03:58.485Z] editMilestone(org.eclipse.egit.github.core.tests.MilestoneServiceTest)  Time elapsed: 0.001 s
18:03:58 [2021-02-03T23:03:58.485Z] createMilestoneNullUser(org.eclipse.egit.github.core.tests.MilestoneServiceTest)  Time elapsed: 0 s
18:03:58 [2021-02-03T23:03:58.485Z] createMilestoneInvalidState(org.eclipse.egit.github.core.tests.MilestoneServiceTest)  Time elapsed: 0 s
18:03:58 [2021-02-03T23:03:58.485Z] getMilestonesNullRepositoryName(org.eclipse.egit.github.core.tests.MilestoneServiceTest)  Time elapsed: 0 s
18:03:58 [2021-02-03T23:03:58.485Z] getMilestonesNullState(org.eclipse.egit.github.core.tests.MilestoneServiceTest)  Time elapsed: 0.001 s
18:03:58 [2021-02-03T23:03:58.485Z] getMilestoneWithRepositoryId(org.eclipse.egit.github.core.tests.MilestoneServiceTest)  Time elapsed: 0 s
18:03:58 [2021-02-03T23:03:58.485Z] getMilestonesOpenStateWithRepositoryId(org.eclipse.egit.github.core.tests.MilestoneServiceTest)  Time elapsed: 0 s
18:03:58 [2021-02-03T23:03:58.485Z] deleteMilestoneNullMilestone(org.eclipse.egit.github.core.tests.MilestoneServiceTest)  Time elapsed: 0 s
18:03:58 [2021-02-03T23:03:58.485Z] getMilestonesOpenState(org.eclipse.egit.github.core.tests.MilestoneServiceTest)  Time elapsed: 0.001 s
18:03:58 [2021-02-03T23:03:58.485Z] deleteMilestoneEmptyMilestone(org.eclipse.egit.github.core.tests.MilestoneServiceTest)  Time elapsed: 0 s
18:03:58 [2021-02-03T23:03:58.485Z] createMilestoneNoTitle(org.eclipse.egit.github.core.tests.MilestoneServiceTest)  Time elapsed: 0 s
18:03:58 [2021-02-03T23:03:58.485Z] createMilestoneClosed(org.eclipse.egit.github.core.tests.MilestoneServiceTest)  Time elapsed: 0 s
18:03:58 [2021-02-03T23:03:58.485Z] getMilestoneNullId(org.eclipse.egit.github.core.tests.MilestoneServiceTest)  Time elapsed: 0 s
18:03:58 [2021-02-03T23:03:58.485Z] createMilestone(org.eclipse.egit.github.core.tests.MilestoneServiceTest)  Time elapsed: 0.001 s
18:03:58 [2021-02-03T23:03:58.485Z] getMilestoneNullUser(org.eclipse.egit.github.core.tests.MilestoneServiceTest)  Time elapsed: 0 s
18:03:58 [2021-02-03T23:03:58.485Z] deleteMilestoneWithRepositoryId(org.eclipse.egit.github.core.tests.MilestoneServiceTest)  Time elapsed: 0 s
18:03:58 [2021-02-03T23:03:58.485Z] deleteMilestoneEmptyRepositoryName(org.eclipse.egit.github.core.tests.MilestoneServiceTest)  Time elapsed: 0 s
18:03:58 [2021-02-03T23:03:58.485Z] getMilestoneEmptyId(org.eclipse.egit.github.core.tests.MilestoneServiceTest)  Time elapsed: 0 s
18:03:58 [2021-02-03T23:03:58.485Z] createMilestoneWithRepositoryId(org.eclipse.egit.github.core.tests.MilestoneServiceTest)  Time elapsed: 0.001 s
18:03:58 [2021-02-03T23:03:58.485Z] editMilestoneNullMilestone(org.eclipse.egit.github.core.tests.MilestoneServiceTest)  Time elapsed: 0 s
18:03:58 [2021-02-03T23:03:58.485Z] setDueOnReferenceMutableObject(org.eclipse.egit.github.core.tests.MilestoneTest)  Time elapsed: 0 s
18:03:58 [2021-02-03T23:03:58.485Z] updateFields(org.eclipse.egit.github.core.tests.MilestoneTest)  Time elapsed: 0 s
18:03:58 [2021-02-03T23:03:58.485Z] getDueOn_ReferenceMutableObject(org.eclipse.egit.github.core.tests.MilestoneTest)  Time elapsed: 0 s
18:03:58 [2021-02-03T23:03:58.485Z] defaultState(org.eclipse.egit.github.core.tests.MilestoneTest)  Time elapsed: 0 s
18:03:58 [2021-02-03T23:03:58.485Z] getCreatedAtReferenceMutableObject(org.eclipse.egit.github.core.tests.MilestoneTest)  Time elapsed: 0 s
18:03:58 [2021-02-03T23:03:58.485Z] deleteAuthorization(org.eclipse.egit.github.core.tests.OAuthServiceTest)  Time elapsed: 0 s
18:03:58 [2021-02-03T23:03:58.485Z] removeScopes(org.eclipse.egit.github.core.tests.OAuthServiceTest)  Time elapsed: 0.001 s
18:03:58 [2021-02-03T23:03:58.485Z] constructorNullArgument(org.eclipse.egit.github.core.tests.OAuthServiceTest)  Time elapsed: 0 s
18:03:58 [2021-02-03T23:03:58.485Z] defaultConstructor(org.eclipse.egit.github.core.tests.OAuthServiceTest)  Time elapsed: 0 s
18:03:58 [2021-02-03T23:03:58.486Z] getAuthorizations(org.eclipse.egit.github.core.tests.OAuthServiceTest)  Time elapsed: 0 s
18:03:58 [2021-02-03T23:03:58.486Z] addScopes(org.eclipse.egit.github.core.tests.OAuthServiceTest)  Time elapsed: 0 s
18:03:58 [2021-02-03T23:03:58.486Z] createAuthorization(org.eclipse.egit.github.core.tests.OAuthServiceTest)  Time elapsed: 0.001 s
18:03:58 [2021-02-03T23:03:58.486Z] setScopes(org.eclipse.egit.github.core.tests.OAuthServiceTest)  Time elapsed: 0 s
18:03:58 [2021-02-03T23:03:58.486Z] getAuthorization(org.eclipse.egit.github.core.tests.OAuthServiceTest)  Time elapsed: 0 s
18:03:58 [2021-02-03T23:03:58.486Z] showMembershipEmptyName(org.eclipse.egit.github.core.tests.OrganizationServiceTest)  Time elapsed: 0 s
18:03:58 [2021-02-03T23:03:58.486Z] showMembershipEmptyUser(org.eclipse.egit.github.core.tests.OrganizationServiceTest)  Time elapsed: 0 s
18:03:58 [2021-02-03T23:03:58.486Z] getMembersAll(org.eclipse.egit.github.core.tests.OrganizationServiceTest)  Time elapsed: 0.001 s
18:03:58 [2021-02-03T23:03:58.486Z] constructor(org.eclipse.egit.github.core.tests.OrganizationServiceTest)  Time elapsed: 0 s
18:03:58 [2021-02-03T23:03:58.486Z] getOrganization(org.eclipse.egit.github.core.tests.OrganizationServiceTest)  Time elapsed: 0 s
18:03:58 [2021-02-03T23:03:58.486Z] removeMemberNullName(org.eclipse.egit.github.core.tests.OrganizationServiceTest)  Time elapsed: 0 s
18:03:58 [2021-02-03T23:03:58.486Z] removeMemberNullUser(org.eclipse.egit.github.core.tests.OrganizationServiceTest)  Time elapsed: 0 s
18:03:58 [2021-02-03T23:03:58.486Z] isMemberEmptyName(org.eclipse.egit.github.core.tests.OrganizationServiceTest)  Time elapsed: 0 s
18:03:58 [2021-02-03T23:03:58.486Z] isMemberEmptyUser(org.eclipse.egit.github.core.tests.OrganizationServiceTest)  Time elapsed: 0 s
18:03:58 [2021-02-03T23:03:58.486Z] hideMembershipNullName(org.eclipse.egit.github.core.tests.OrganizationServiceTest)  Time elapsed: 0.001 s
18:03:58 [2021-02-03T23:03:58.486Z] hideMembershipNullUser(org.eclipse.egit.github.core.tests.OrganizationServiceTest)  Time elapsed: 0 s
18:03:58 [2021-02-03T23:03:58.486Z] getCurrentUserOrganizations(org.eclipse.egit.github.core.tests.OrganizationServiceTest)  Time elapsed: 0 s
18:03:58 [2021-02-03T23:03:58.486Z] getPublicMembersNullName(org.eclipse.egit.github.core.tests.OrganizationServiceTest)  Time elapsed: 0 s
18:03:58 [2021-02-03T23:03:58.486Z] removeMember(org.eclipse.egit.github.core.tests.OrganizationServiceTest)  Time elapsed: 0 s
18:03:58 [2021-02-03T23:03:58.486Z] getMembersEmptyName(org.eclipse.egit.github.core.tests.OrganizationServiceTest)  Time elapsed: 0.001 s
18:03:58 [2021-02-03T23:03:58.486Z] editOrganizationNullOrgName(org.eclipse.egit.github.core.tests.OrganizationServiceTest)  Time elapsed: 0 s
18:03:58 [2021-02-03T23:03:58.486Z] showMembershipNullName(org.eclipse.egit.github.core.tests.OrganizationServiceTest)  Time elapsed: 0 s
18:03:58 [2021-02-03T23:03:58.486Z] showMembershipNullUser(org.eclipse.egit.github.core.tests.OrganizationServiceTest)  Time elapsed: 0 s
18:03:58 [2021-02-03T23:03:58.486Z] getOrganizationNullName(org.eclipse.egit.github.core.tests.OrganizationServiceTest)  Time elapsed: 0 s
18:03:58 [2021-02-03T23:03:58.486Z] isPublicMember(org.eclipse.egit.github.core.tests.OrganizationServiceTest)  Time elapsed: 0 s
18:03:58 [2021-02-03T23:03:58.486Z] isMember(org.eclipse.egit.github.core.tests.OrganizationServiceTest)  Time elapsed: 0 s
18:03:58 [2021-02-03T23:03:58.486Z] getOrganizationsEmptyUser(org.eclipse.egit.github.core.tests.OrganizationServiceTest)  Time elapsed: 0 s
18:03:58 [2021-02-03T23:03:58.486Z] isPublicMemberEmptyName(org.eclipse.egit.github.core.tests.OrganizationServiceTest)  Time elapsed: 0 s
18:03:58 [2021-02-03T23:03:58.486Z] isPublicMemberEmptyUser(org.eclipse.egit.github.core.tests.OrganizationServiceTest)  Time elapsed: 0 s
18:03:58 [2021-02-03T23:03:58.486Z] isPublicMemberNullName(org.eclipse.egit.github.core.tests.OrganizationServiceTest)  Time elapsed: 0 s
18:03:58 [2021-02-03T23:03:58.486Z] isPublicMemberNullUser(org.eclipse.egit.github.core.tests.OrganizationServiceTest)  Time elapsed: 0.001 s
18:03:58 [2021-02-03T23:03:58.486Z] showMembership(org.eclipse.egit.github.core.tests.OrganizationServiceTest)  Time elapsed: 0 s
18:03:58 [2021-02-03T23:03:58.486Z] editOrganizationEmptyOrgName(org.eclipse.egit.github.core.tests.OrganizationServiceTest)  Time elapsed: 0 s
18:03:58 [2021-02-03T23:03:58.486Z] hideMembershipEmptyName(org.eclipse.egit.github.core.tests.OrganizationServiceTest)  Time elapsed: 0 s
18:03:58 [2021-02-03T23:03:58.486Z] hideMembershipEmptyUser(org.eclipse.egit.github.core.tests.OrganizationServiceTest)  Time elapsed: 0 s
18:03:58 [2021-02-03T23:03:58.486Z] editOrganization(org.eclipse.egit.github.core.tests.OrganizationServiceTest)  Time elapsed: 0 s
18:03:58 [2021-02-03T23:03:58.486Z] isMemberNullName(org.eclipse.egit.github.core.tests.OrganizationServiceTest)  Time elapsed: 0.001 s
18:03:58 [2021-02-03T23:03:58.486Z] isMemberNullUser(org.eclipse.egit.github.core.tests.OrganizationServiceTest)  Time elapsed: 0 s
18:03:58 [2021-02-03T23:03:58.486Z] editOrganizationNullOrg(org.eclipse.egit.github.core.tests.OrganizationServiceTest)  Time elapsed: 0 s
18:03:58 [2021-02-03T23:03:58.486Z] getOrganizations(org.eclipse.egit.github.core.tests.OrganizationServiceTest)  Time elapsed: 0 s
18:03:58 [2021-02-03T23:03:58.486Z] getPublicMembers(org.eclipse.egit.github.core.tests.OrganizationServiceTest)  Time elapsed: 0.001 s
18:03:58 [2021-02-03T23:03:58.486Z] getPublicMembersEmptyName(org.eclipse.egit.github.core.tests.OrganizationServiceTest)  Time elapsed: 0 s
18:03:58 [2021-02-03T23:03:58.486Z] removeMemberEmptyName(org.eclipse.egit.github.core.tests.OrganizationServiceTest)  Time elapsed: 0 s
18:03:58 [2021-02-03T23:03:58.486Z] removeMemberEmptyUser(org.eclipse.egit.github.core.tests.OrganizationServiceTest)  Time elapsed: 0 s
18:03:58 [2021-02-03T23:03:58.486Z] getMembersMember(org.eclipse.egit.github.core.tests.OrganizationServiceTest)  Time elapsed: 0 s
18:03:58 [2021-02-03T23:03:58.486Z] getOrganizationEmptyName(org.eclipse.egit.github.core.tests.OrganizationServiceTest)  Time elapsed: 0 s
18:03:58 [2021-02-03T23:03:58.486Z] getOrganizationsNullUser(org.eclipse.egit.github.core.tests.OrganizationServiceTest)  Time elapsed: 0.001 s
18:03:58 [2021-02-03T23:03:58.486Z] getMembers(org.eclipse.egit.github.core.tests.OrganizationServiceTest)  Time elapsed: 0 s
18:03:58 [2021-02-03T23:03:58.486Z] getMembersNullName(org.eclipse.egit.github.core.tests.OrganizationServiceTest)  Time elapsed: 0 s
18:03:58 [2021-02-03T23:03:58.486Z] hideMembership(org.eclipse.egit.github.core.tests.OrganizationServiceTest)  Time elapsed: 0 s
18:03:58 [2021-02-03T23:03:58.486Z] getMembersAdmin(org.eclipse.egit.github.core.tests.OrganizationServiceTest)  Time elapsed: 0 s
18:03:58 [2021-02-03T23:03:58.486Z] defaultState(org.eclipse.egit.github.core.tests.PagedRequestTest)  Time elapsed: 0.001 s
18:03:58 [2021-02-03T23:03:58.486Z] updateFields(org.eclipse.egit.github.core.tests.PullRequestMarkerTest)  Time elapsed: 0 s
18:03:58 [2021-02-03T23:03:58.486Z] defaultState(org.eclipse.egit.github.core.tests.PullRequestMarkerTest)  Time elapsed: 0 s
18:03:58 [2021-02-03T23:03:58.486Z] updateFields(org.eclipse.egit.github.core.tests.PullRequestPayloadTest)  Time elapsed: 0 s
18:03:58 [2021-02-03T23:03:58.486Z] defaultState(org.eclipse.egit.github.core.tests.PullRequestPayloadTest)  Time elapsed: 0 s
18:03:58 [2021-02-03T23:03:58.486Z] updateFields(org.eclipse.egit.github.core.tests.PullRequestReviewCommentPayloadTest)  Time elapsed: 0 s
18:03:58 [2021-02-03T23:03:58.486Z] defaultState(org.eclipse.egit.github.core.tests.PullRequestReviewCommentPayloadTest)  Time elapsed: 0 s
18:03:58 [2021-02-03T23:03:58.486Z] getPullRequestNullRepository(org.eclipse.egit.github.core.tests.PullRequestServiceTest)  Time elapsed: 0 s
18:03:58 [2021-02-03T23:03:58.486Z] replyToComment(org.eclipse.egit.github.core.tests.PullRequestServiceTest)  Time elapsed: 0 s
18:03:58 [2021-02-03T23:03:58.486Z] constructor(org.eclipse.egit.github.core.tests.PullRequestServiceTest)  Time elapsed: 0 s
18:03:58 [2021-02-03T23:03:58.486Z] getPullRequest(org.eclipse.egit.github.core.tests.PullRequestServiceTest)  Time elapsed: 0.011 s
18:03:58 [2021-02-03T23:03:58.486Z] editComment(org.eclipse.egit.github.core.tests.PullRequestServiceTest)  Time elapsed: 0 s
18:03:58 [2021-02-03T23:03:58.486Z] getPullRequestsNullRepository(org.eclipse.egit.github.core.tests.PullRequestServiceTest)  Time elapsed: 0 s
18:03:58 [2021-02-03T23:03:58.486Z] createComment(org.eclipse.egit.github.core.tests.PullRequestServiceTest)  Time elapsed: 0 s
18:03:58 [2021-02-03T23:03:58.486Z] constructorNullArgument(org.eclipse.egit.github.core.tests.PullRequestServiceTest)  Time elapsed: 0 s
18:03:58 [2021-02-03T23:03:58.486Z] editPullRequestNullRequest(org.eclipse.egit.github.core.tests.PullRequestServiceTest)  Time elapsed: 0 s
18:03:58 [2021-02-03T23:03:58.486Z] getPullRequestsNullRepositoryId(org.eclipse.egit.github.core.tests.PullRequestServiceTest)  Time elapsed: 0.001 s
18:03:58 [2021-02-03T23:03:58.486Z] createPullRequestFromIssue(org.eclipse.egit.github.core.tests.PullRequestServiceTest)  Time elapsed: 0 s
18:03:58 [2021-02-03T23:03:58.486Z] isMerged(org.eclipse.egit.github.core.tests.PullRequestServiceTest)  Time elapsed: 0 s
18:03:58 [2021-02-03T23:03:58.486Z] createPullRequest(org.eclipse.egit.github.core.tests.PullRequestServiceTest)  Time elapsed: 0 s
18:03:58 [2021-02-03T23:03:58.486Z] editCommentNullComment(org.eclipse.egit.github.core.tests.PullRequestServiceTest)  Time elapsed: 0 s
18:03:58 [2021-02-03T23:03:58.486Z] merge(org.eclipse.egit.github.core.tests.PullRequestServiceTest)  Time elapsed: 0.001 s
18:03:58 [2021-02-03T23:03:58.487Z] deleteComment(org.eclipse.egit.github.core.tests.PullRequestServiceTest)  Time elapsed: 0 s
18:03:58 [2021-02-03T23:03:58.487Z] editPullRequest(org.eclipse.egit.github.core.tests.PullRequestServiceTest)  Time elapsed: 0 s
18:03:58 [2021-02-03T23:03:58.487Z] getPullRequests(org.eclipse.egit.github.core.tests.PullRequestServiceTest)  Time elapsed: 0.001 s
18:03:58 [2021-02-03T23:03:58.487Z] getComments(org.eclipse.egit.github.core.tests.PullRequestServiceTest)  Time elapsed: 0 s
18:03:58 [2021-02-03T23:03:58.487Z] getFiles(org.eclipse.egit.github.core.tests.PullRequestServiceTest)  Time elapsed: 0 s
18:03:58 [2021-02-03T23:03:58.487Z] getComment(org.eclipse.egit.github.core.tests.PullRequestServiceTest)  Time elapsed: 0.001 s
18:03:58 [2021-02-03T23:03:58.487Z] getCommits(org.eclipse.egit.github.core.tests.PullRequestServiceTest)  Time elapsed: 0 s
18:03:58 [2021-02-03T23:03:58.487Z] getClosedAtReferenceMutableObject(org.eclipse.egit.github.core.tests.PullRequestTest)  Time elapsed: 0 s
18:03:58 [2021-02-03T23:03:58.487Z] getMergedAtReferenceMutableObject(org.eclipse.egit.github.core.tests.PullRequestTest)  Time elapsed: 0 s
18:03:58 [2021-02-03T23:03:58.487Z] updateFields(org.eclipse.egit.github.core.tests.PullRequestTest)  Time elapsed: 0.001 s
18:03:58 [2021-02-03T23:03:58.487Z] defaultState(org.eclipse.egit.github.core.tests.PullRequestTest)  Time elapsed: 0 s
18:03:58 [2021-02-03T23:03:58.487Z] getCreatedAtReferenceMutableObject(org.eclipse.egit.github.core.tests.PullRequestTest)  Time elapsed: 0 s
18:03:58 [2021-02-03T23:03:58.487Z] getUpdatedAtReferenceMutableObject(org.eclipse.egit.github.core.tests.PullRequestTest)  Time elapsed: 0 s
18:03:58 [2021-02-03T23:03:58.487Z] updateFields(org.eclipse.egit.github.core.tests.PushPayloadTest)  Time elapsed: 0 s
18:03:58 [2021-02-03T23:03:58.487Z] defaultState(org.eclipse.egit.github.core.tests.PushPayloadTest)  Time elapsed: 0 s
18:03:58 [2021-02-03T23:03:58.487Z] updateFields(org.eclipse.egit.github.core.tests.ReferenceTest)  Time elapsed: 0 s
18:03:58 [2021-02-03T23:03:58.487Z] defaultState(org.eclipse.egit.github.core.tests.ReferenceTest)  Time elapsed: 0 s
18:03:58 [2021-02-03T23:03:58.487Z] updateFields(org.eclipse.egit.github.core.tests.RepositoryBranchTest)  Time elapsed: 0 s
18:03:58 [2021-02-03T23:03:58.487Z] defaultState(org.eclipse.egit.github.core.tests.RepositoryBranchTest)  Time elapsed: 0 s
18:03:58 [2021-02-03T23:03:58.487Z] updateFields(org.eclipse.egit.github.core.tests.RepositoryCommitCompareTest)  Time elapsed: 0 s
18:03:58 [2021-02-03T23:03:58.487Z] defaultState(org.eclipse.egit.github.core.tests.RepositoryCommitCompareTest)  Time elapsed: 0 s
18:03:58 [2021-02-03T23:03:58.487Z] updateFields(org.eclipse.egit.github.core.tests.RepositoryCommitTest)  Time elapsed: 0 s
18:03:58 [2021-02-03T23:03:58.487Z] defaultState(org.eclipse.egit.github.core.tests.RepositoryCommitTest)  Time elapsed: 0 s
18:03:58 [2021-02-03T23:03:58.487Z] updateFields(org.eclipse.egit.github.core.tests.RepositoryContentsTest)  Time elapsed: 0 s
18:03:58 [2021-02-03T23:03:58.487Z] defaultState(org.eclipse.egit.github.core.tests.RepositoryContentsTest)  Time elapsed: 0 s
18:03:58 [2021-02-03T23:03:58.487Z] updateFields(org.eclipse.egit.github.core.tests.RepositoryHookResponseTest)  Time elapsed: 0 s
18:03:58 [2021-02-03T23:03:58.487Z] defaultState(org.eclipse.egit.github.core.tests.RepositoryHookResponseTest)  Time elapsed: 0 s
18:03:58 [2021-02-03T23:03:58.487Z] updateFields(org.eclipse.egit.github.core.tests.RepositoryHookTest)  Time elapsed: 0.001 s
18:03:58 [2021-02-03T23:03:58.487Z] defaultState(org.eclipse.egit.github.core.tests.RepositoryHookTest)  Time elapsed: 0 s
18:03:58 [2021-02-03T23:03:58.487Z] createFromNullString(org.eclipse.egit.github.core.tests.RepositoryIdTest)  Time elapsed: 0 s
18:03:58 [2021-02-03T23:03:58.487Z] create(org.eclipse.egit.github.core.tests.RepositoryIdTest)  Time elapsed: 0 s
18:03:58 [2021-02-03T23:03:58.487Z] createFromEmptyString(org.eclipse.egit.github.core.tests.RepositoryIdTest)  Time elapsed: 0 s
18:03:58 [2021-02-03T23:03:58.487Z] createFromNullUrl(org.eclipse.egit.github.core.tests.RepositoryIdTest)  Time elapsed: 0 s
18:03:58 [2021-02-03T23:03:58.487Z] createNullName(org.eclipse.egit.github.core.tests.RepositoryIdTest)  Time elapsed: 0 s
18:03:58 [2021-02-03T23:03:58.487Z] createFromStringUrl(org.eclipse.egit.github.core.tests.RepositoryIdTest)  Time elapsed: 0 s
18:03:58 [2021-02-03T23:03:58.487Z] createNullOwner(org.eclipse.egit.github.core.tests.RepositoryIdTest)  Time elapsed: 0 s
18:03:58 [2021-02-03T23:03:58.487Z] createFromString(org.eclipse.egit.github.core.tests.RepositoryIdTest)  Time elapsed: 0 s
18:03:58 [2021-02-03T23:03:58.487Z] createFromMalformedStringUrl(org.eclipse.egit.github.core.tests.RepositoryIdTest)  Time elapsed: 0 s
18:03:58 [2021-02-03T23:03:58.487Z] equality(org.eclipse.egit.github.core.tests.RepositoryIdTest)  Time elapsed: 0 s
18:03:58 [2021-02-03T23:03:58.487Z] createEmptyOwner(org.eclipse.egit.github.core.tests.RepositoryIdTest)  Time elapsed: 0 s
18:03:58 [2021-02-03T23:03:58.487Z] createFromNullStringUrl(org.eclipse.egit.github.core.tests.RepositoryIdTest)  Time elapsed: 0 s
18:03:58 [2021-02-03T23:03:58.487Z] createFromInvalidUrl1(org.eclipse.egit.github.core.tests.RepositoryIdTest)  Time elapsed: 0 s
18:03:58 [2021-02-03T23:03:58.487Z] createFromInvalidUrl2(org.eclipse.egit.github.core.tests.RepositoryIdTest)  Time elapsed: 0 s
18:03:58 [2021-02-03T23:03:58.487Z] createFromInvalidUrl3(org.eclipse.egit.github.core.tests.RepositoryIdTest)  Time elapsed: 0 s
18:03:58 [2021-02-03T23:03:58.487Z] createFromInvalidUrl4(org.eclipse.egit.github.core.tests.RepositoryIdTest)  Time elapsed: 0 s
18:03:58 [2021-02-03T23:03:58.487Z] createEmptyName(org.eclipse.egit.github.core.tests.RepositoryIdTest)  Time elapsed: 0 s
18:03:58 [2021-02-03T23:03:58.487Z] createFromUrl(org.eclipse.egit.github.core.tests.RepositoryIdTest)  Time elapsed: 0 s
18:03:58 [2021-02-03T23:03:58.487Z] updateFields(org.eclipse.egit.github.core.tests.RepositoryIssueTest)  Time elapsed: 0 s
18:03:58 [2021-02-03T23:03:58.487Z] defaultState(org.eclipse.egit.github.core.tests.RepositoryIssueTest)  Time elapsed: 0 s
18:03:58 [2021-02-03T23:03:58.487Z] getPrivateOrgRepositories(org.eclipse.egit.github.core.tests.RepositoryServiceTest)  Time elapsed: 0.001 s
18:03:58 [2021-02-03T23:03:58.487Z] editRepositoryNullRepository(org.eclipse.egit.github.core.tests.RepositoryServiceTest)  Time elapsed: 0.001 s
18:03:58 [2021-02-03T23:03:58.487Z] getRepositoriesNullOrg(org.eclipse.egit.github.core.tests.RepositoryServiceTest)  Time elapsed: 0 s
18:03:58 [2021-02-03T23:03:58.487Z] getPublicRepositories(org.eclipse.egit.github.core.tests.RepositoryServiceTest)  Time elapsed: 0 s
18:03:58 [2021-02-03T23:03:58.487Z] constructor(org.eclipse.egit.github.core.tests.RepositoryServiceTest)  Time elapsed: 0 s
18:03:58 [2021-02-03T23:03:58.487Z] searchRepositoriesEmptyQuery(org.eclipse.egit.github.core.tests.RepositoryServiceTest)  Time elapsed: 0 s
18:03:58 [2021-02-03T23:03:58.487Z] getRepositoriesEmptyUser(org.eclipse.egit.github.core.tests.RepositoryServiceTest)  Time elapsed: 0.001 s
18:03:58 [2021-02-03T23:03:58.487Z] forkRepositoryToOrg(org.eclipse.egit.github.core.tests.RepositoryServiceTest)  Time elapsed: 0 s
18:03:58 [2021-02-03T23:03:58.487Z] getRepositoriesEmptyOrg(org.eclipse.egit.github.core.tests.RepositoryServiceTest)  Time elapsed: 0 s
18:03:58 [2021-02-03T23:03:58.487Z] getContributors(org.eclipse.egit.github.core.tests.RepositoryServiceTest)  Time elapsed: 0 s
18:03:58 [2021-02-03T23:03:58.487Z] searchRepositoriesNullQuery(org.eclipse.egit.github.core.tests.RepositoryServiceTest)  Time elapsed: 0 s
18:03:58 [2021-02-03T23:03:58.487Z] createOrgRepositoryNullRepository(org.eclipse.egit.github.core.tests.RepositoryServiceTest)  Time elapsed: 0.001 s
18:03:58 [2021-02-03T23:03:58.488Z] editRepositoryProviderWithNullFields(org.eclipse.egit.github.core.tests.RepositoryServiceTest)  Time elapsed: 0 s
18:03:58 [2021-02-03T23:03:58.488Z] searchRepositoriesStartingAtPage(org.eclipse.egit.github.core.tests.RepositoryServiceTest)  Time elapsed: 0 s
18:03:58 [2021-02-03T23:03:58.488Z] editRepositoryProviderWithFields(org.eclipse.egit.github.core.tests.RepositoryServiceTest)  Time elapsed: 0 s
18:03:58 [2021-02-03T23:03:58.488Z] editRepository(org.eclipse.egit.github.core.tests.RepositoryServiceTest)  Time elapsed: 0.001 s
18:03:58 [2021-02-03T23:03:58.488Z] createRepositoryNullRepository(org.eclipse.egit.github.core.tests.RepositoryServiceTest)  Time elapsed: 0 s
18:03:58 [2021-02-03T23:03:58.488Z] getRepositories(org.eclipse.egit.github.core.tests.RepositoryServiceTest)  Time elapsed: 0 s
18:03:58 [2021-02-03T23:03:58.488Z] createRepository(org.eclipse.egit.github.core.tests.RepositoryServiceTest)  Time elapsed: 0 s
18:03:58 [2021-02-03T23:03:58.488Z] getOrgRepositories(org.eclipse.egit.github.core.tests.RepositoryServiceTest)  Time elapsed: 0.001 s
18:03:58 [2021-02-03T23:03:58.488Z] getRepositoriesNullUser(org.eclipse.egit.github.core.tests.RepositoryServiceTest)  Time elapsed: 0 s
18:03:58 [2021-02-03T23:03:58.488Z] getContributorsWithAnonymous(org.eclipse.egit.github.core.tests.RepositoryServiceTest)  Time elapsed: 0 s
18:03:58 [2021-02-03T23:03:58.488Z] searchEscaped(org.eclipse.egit.github.core.tests.RepositoryServiceTest)  Time elapsed: 0 s
18:03:58 [2021-02-03T23:03:58.488Z] getUserRepositories(org.eclipse.egit.github.core.tests.RepositoryServiceTest)  Time elapsed: 0.001 s
18:03:58 [2021-02-03T23:03:58.488Z] getHook(org.eclipse.egit.github.core.tests.RepositoryServiceTest)  Time elapsed: 0 s
18:03:58 [2021-02-03T23:03:58.488Z] getTags(org.eclipse.egit.github.core.tests.RepositoryServiceTest)  Time elapsed: 0 s
18:03:58 [2021-02-03T23:03:58.488Z] forkRepository(org.eclipse.egit.github.core.tests.RepositoryServiceTest)  Time elapsed: 0 s
18:03:58 [2021-02-03T23:03:58.488Z] editHookNullHook(org.eclipse.egit.github.core.tests.RepositoryServiceTest)  Time elapsed: 0.001 s
18:03:58 [2021-02-03T23:03:58.488Z] createOrgRepositoryNullOrg(org.eclipse.egit.github.core.tests.RepositoryServiceTest)  Time elapsed: 0 s
18:03:58 [2021-02-03T23:03:58.488Z] pageAllRepositoriesSince(org.eclipse.egit.github.core.tests.RepositoryServiceTest)  Time elapsed: 0 s
18:03:58 [2021-02-03T23:03:58.488Z] createOrgRepositoryEmptyOrg(org.eclipse.egit.github.core.tests.RepositoryServiceTest)  Time elapsed: 0 s
18:03:58 [2021-02-03T23:03:58.488Z] createOrgRepository(org.eclipse.egit.github.core.tests.RepositoryServiceTest)  Time elapsed: 0 s
18:03:58 [2021-02-03T23:03:58.488Z] getRepositoryProvider(org.eclipse.egit.github.core.tests.RepositoryServiceTest)  Time elapsed: 0.001 s
18:03:58 [2021-02-03T23:03:58.488Z] editRepositoryWithNullFields(org.eclipse.egit.github.core.tests.RepositoryServiceTest)  Time elapsed: 0 s
18:03:58 [2021-02-03T23:03:58.488Z] pageAllRepositories(org.eclipse.egit.github.core.tests.RepositoryServiceTest)  Time elapsed: 0 s
18:03:58 [2021-02-03T23:03:58.488Z] runMerge(org.eclipse.egit.github.core.tests.RepositoryServiceTest)  Time elapsed: 0 s
18:03:58 [2021-02-03T23:03:58.488Z] searchRepositoriesMatchingLanguage(org.eclipse.egit.github.core.tests.RepositoryServiceTest)  Time elapsed: 0.001 s
18:03:58 [2021-02-03T23:03:58.488Z] editRepositoryWithFields(org.eclipse.egit.github.core.tests.RepositoryServiceTest)  Time elapsed: 0 s
18:03:58 [2021-02-03T23:03:58.488Z] createHook(org.eclipse.egit.github.core.tests.RepositoryServiceTest)  Time elapsed: 0 s
18:03:58 [2021-02-03T23:03:58.488Z] getLanguages(org.eclipse.egit.github.core.tests.RepositoryServiceTest)  Time elapsed: 0.001 s
18:03:58 [2021-02-03T23:03:58.488Z] runHook(org.eclipse.egit.github.core.tests.RepositoryServiceTest)  Time elapsed: 0 s
18:03:58 [2021-02-03T23:03:58.488Z] editHook(org.eclipse.egit.github.core.tests.RepositoryServiceTest)  Time elapsed: 0 s
18:03:58 [2021-02-03T23:03:58.488Z] searchRepositories(org.eclipse.egit.github.core.tests.RepositoryServiceTest)  Time elapsed: 0 s
18:03:58 [2021-02-03T23:03:58.488Z] getRepository(org.eclipse.egit.github.core.tests.RepositoryServiceTest)  Time elapsed: 0 s
18:03:58 [2021-02-03T23:03:58.488Z] deleteHook(org.eclipse.egit.github.core.tests.RepositoryServiceTest)  Time elapsed: 0 s
18:03:58 [2021-02-03T23:03:58.488Z] getForks(org.eclipse.egit.github.core.tests.RepositoryServiceTest)  Time elapsed: 0 s
18:03:58 [2021-02-03T23:03:58.488Z] getHooks(org.eclipse.egit.github.core.tests.RepositoryServiceTest)  Time elapsed: 0 s
18:03:58 [2021-02-03T23:03:58.488Z] getBranches(org.eclipse.egit.github.core.tests.RepositoryServiceTest)  Time elapsed: 0.001 s
18:03:58 [2021-02-03T23:03:58.488Z] updateFields(org.eclipse.egit.github.core.tests.RepositoryTagTest)  Time elapsed: 0 s
18:03:58 [2021-02-03T23:03:58.488Z] defaultState(org.eclipse.egit.github.core.tests.RepositoryTagTest)  Time elapsed: 0 s
18:03:58 [2021-02-03T23:03:58.488Z] generateIdNullName(org.eclipse.egit.github.core.tests.RepositoryTest)  Time elapsed: 0 s
18:03:58 [2021-02-03T23:03:58.488Z] generateIdEmptyName(org.eclipse.egit.github.core.tests.RepositoryTest)  Time elapsed: 0 s
18:03:58 [2021-02-03T23:03:58.488Z] updateFields(org.eclipse.egit.github.core.tests.RepositoryTest)  Time elapsed: 0 s
18:03:58 [2021-02-03T23:03:58.488Z] fromJson(org.eclipse.egit.github.core.tests.RepositoryTest)  Time elapsed: 0.002 s
18:03:58 [2021-02-03T23:03:58.488Z] defaultState(org.eclipse.egit.github.core.tests.RepositoryTest)  Time elapsed: 0 s
18:03:58 [2021-02-03T23:03:58.488Z] generateIdEmptyOwnerLogin(org.eclipse.egit.github.core.tests.RepositoryTest)  Time elapsed: 0 s
18:03:58 [2021-02-03T23:03:58.488Z] generateId(org.eclipse.egit.github.core.tests.RepositoryTest)  Time elapsed: 0 s
18:03:58 [2021-02-03T23:03:58.488Z] generateIdNullOwner(org.eclipse.egit.github.core.tests.RepositoryTest)  Time elapsed: 0 s
18:03:58 [2021-02-03T23:03:58.488Z] generateIdNullOwnerLogin(org.eclipse.egit.github.core.tests.RepositoryTest)  Time elapsed: 0 s
18:03:58 [2021-02-03T23:03:58.488Z] requestErrorWithMessageField(org.eclipse.egit.github.core.tests.RequestErrorTest)  Time elapsed: 0 s
18:03:58 [2021-02-03T23:03:58.488Z] requestErrorWithErrorAndMessageField(org.eclipse.egit.github.core.tests.RequestErrorTest)  Time elapsed: 0 s
18:03:58 [2021-02-03T23:03:58.488Z] requestErrorWithErrorField(org.eclipse.egit.github.core.tests.RequestErrorTest)  Time elapsed: 0 s
18:03:58 [2021-02-03T23:03:58.488Z] invalidFieldValue(org.eclipse.egit.github.core.tests.RequestExceptionTest)  Time elapsed: 0 s
18:03:58 [2021-02-03T23:03:58.488Z] customCode(org.eclipse.egit.github.core.tests.RequestExceptionTest)  Time elapsed: 0 s
18:03:58 [2021-02-03T23:03:58.488Z] missingField(org.eclipse.egit.github.core.tests.RequestExceptionTest)  Time elapsed: 0 s
18:03:58 [2021-02-03T23:03:58.488Z] invalidField(org.eclipse.egit.github.core.tests.RequestExceptionTest)  Time elapsed: 0 s
18:03:58 [2021-02-03T23:03:58.488Z] existentField(org.eclipse.egit.github.core.tests.RequestExceptionTest)  Time elapsed: 0 s
18:03:58 [2021-02-03T23:03:58.488Z] errorField(org.eclipse.egit.github.core.tests.RequestExceptionTest)  Time elapsed: 0 s
18:03:58 [2021-02-03T23:03:58.488Z] updateFields(org.eclipse.egit.github.core.tests.SearchIssueTest)  Time elapsed: 0 s
18:03:58 [2021-02-03T23:03:58.488Z] defaultState(org.eclipse.egit.github.core.tests.SearchIssueTest)  Time elapsed: 0 s
18:03:58 [2021-02-03T23:03:58.488Z] createNullName(org.eclipse.egit.github.core.tests.SearchRepositoryTest)  Time elapsed: 0.001 s
18:03:58 [2021-02-03T23:03:58.488Z] defaultState(org.eclipse.egit.github.core.tests.SearchRepositoryTest)  Time elapsed: 0 s
18:03:58 [2021-02-03T23:03:58.488Z] createNullOwner(org.eclipse.egit.github.core.tests.SearchRepositoryTest)  Time elapsed: 0 s
18:03:58 [2021-02-03T23:03:58.488Z] equality(org.eclipse.egit.github.core.tests.SearchRepositoryTest)  Time elapsed: 0 s
18:03:58 [2021-02-03T23:03:58.488Z] getCreatedAtReferenceMutableObject(org.eclipse.egit.github.core.tests.SearchRepositoryTest)  Time elapsed: 0 s
18:03:58 [2021-02-03T23:03:58.488Z] createEmptyOwner(org.eclipse.egit.github.core.tests.SearchRepositoryTest)  Time elapsed: 0 s
18:03:58 [2021-02-03T23:03:58.488Z] getPushedAtReferenceMutableObject(org.eclipse.egit.github.core.tests.SearchRepositoryTest)  Time elapsed: 0.001 s
18:03:58 [2021-02-03T23:03:58.488Z] createEmptyName(org.eclipse.egit.github.core.tests.SearchRepositoryTest)  Time elapsed: 0 s
18:03:58 [2021-02-03T23:03:58.488Z] noGeneratedId(org.eclipse.egit.github.core.tests.SearchRepositoryTest)  Time elapsed: 0 s
18:03:58 [2021-02-03T23:03:58.488Z] updateFields(org.eclipse.egit.github.core.tests.ShaResourceTest)  Time elapsed: 0 s
18:03:58 [2021-02-03T23:03:58.488Z] defaultState(org.eclipse.egit.github.core.tests.ShaResourceTest)  Time elapsed: 0 s
18:03:58 [2021-02-03T23:03:58.488Z] getStarredNullName(org.eclipse.egit.github.core.tests.StargazerServiceTest)  Time elapsed: 0 s
18:03:58 [2021-02-03T23:03:58.488Z] constructor(org.eclipse.egit.github.core.tests.StargazerServiceTest)  Time elapsed: 0 s
18:03:58 [2021-02-03T23:03:58.488Z] pageCurrentStarred(org.eclipse.egit.github.core.tests.StargazerServiceTest)  Time elapsed: 0.001 s
18:03:58 [2021-02-03T23:03:58.488Z] getStarred(org.eclipse.egit.github.core.tests.StargazerServiceTest)  Time elapsed: 0 s
18:03:58 [2021-02-03T23:03:58.488Z] unstar(org.eclipse.egit.github.core.tests.StargazerServiceTest)  Time elapsed: 0 s
18:03:58 [2021-02-03T23:03:58.488Z] star(org.eclipse.egit.github.core.tests.StargazerServiceTest)  Time elapsed: 0 s
18:03:58 [2021-02-03T23:03:58.488Z] pageStargazers(org.eclipse.egit.github.core.tests.StargazerServiceTest)  Time elapsed: 0.001 s
18:03:58 [2021-02-03T23:03:58.489Z] getCurrentStarred(org.eclipse.egit.github.core.tests.StargazerServiceTest)  Time elapsed: 0 s
18:03:58 [2021-02-03T23:03:58.489Z] isStarring(org.eclipse.egit.github.core.tests.StargazerServiceTest)  Time elapsed: 0 s
18:03:58 [2021-02-03T23:03:58.489Z] getStarredEmptyName(org.eclipse.egit.github.core.tests.StargazerServiceTest)  Time elapsed: 0 s
18:03:58 [2021-02-03T23:03:58.489Z] pageStarred(org.eclipse.egit.github.core.tests.StargazerServiceTest)  Time elapsed: 0 s
18:03:58 [2021-02-03T23:03:58.489Z] getStargazers(org.eclipse.egit.github.core.tests.StargazerServiceTest)  Time elapsed: 0 s
18:03:58 [2021-02-03T23:03:58.489Z] updateFields(org.eclipse.egit.github.core.tests.TagTest)  Time elapsed: 0 s
18:03:58 [2021-02-03T23:03:58.489Z] defaultState(org.eclipse.egit.github.core.tests.TagTest)  Time elapsed: 0 s
18:03:58 [2021-02-03T23:03:58.489Z] updateFields(org.eclipse.egit.github.core.tests.TeamAddPayloadTest)  Time elapsed: 0 s
18:03:58 [2021-02-03T23:03:58.489Z] defaultState(org.eclipse.egit.github.core.tests.TeamAddPayloadTest)  Time elapsed: 0 s
18:03:58 [2021-02-03T23:03:58.489Z] getMembershipEmptyName(org.eclipse.egit.github.core.tests.TeamServiceTest)  Time elapsed: 0.001 s
18:03:58 [2021-02-03T23:03:58.489Z] getTeamsEmptyName(org.eclipse.egit.github.core.tests.TeamServiceTest)  Time elapsed: 0 s
18:03:58 [2021-02-03T23:03:58.489Z] createTeamWithRepos(org.eclipse.egit.github.core.tests.TeamServiceTest)  Time elapsed: 0 s
18:03:58 [2021-02-03T23:03:58.489Z] getMembership(org.eclipse.egit.github.core.tests.TeamServiceTest)  Time elapsed: 0 s
18:03:58 [2021-02-03T23:03:58.489Z] constructor(org.eclipse.egit.github.core.tests.TeamServiceTest)  Time elapsed: 0 s
18:03:58 [2021-02-03T23:03:58.489Z] removeMemberNullName(org.eclipse.egit.github.core.tests.TeamServiceTest)  Time elapsed: 0.001 s
18:03:58 [2021-02-03T23:03:58.489Z] createTeamEmptyOrg(org.eclipse.egit.github.core.tests.TeamServiceTest)  Time elapsed: 0 s
18:03:58 [2021-02-03T23:03:58.489Z] addMembership(org.eclipse.egit.github.core.tests.TeamServiceTest)  Time elapsed: 0 s
18:03:58 [2021-02-03T23:03:58.489Z] removeRepository(org.eclipse.egit.github.core.tests.TeamServiceTest)  Time elapsed: 0 s
18:03:58 [2021-02-03T23:03:58.489Z] isMemberEmptyName(org.eclipse.egit.github.core.tests.TeamServiceTest)  Time elapsed: 0 s
18:03:58 [2021-02-03T23:03:58.489Z] removeMember(org.eclipse.egit.github.core.tests.TeamServiceTest)  Time elapsed: 0 s
18:03:58 [2021-02-03T23:03:58.489Z] addMembershipEmptyName(org.eclipse.egit.github.core.tests.TeamServiceTest)  Time elapsed: 0 s
18:03:58 [2021-02-03T23:03:58.489Z] getRepositories(org.eclipse.egit.github.core.tests.TeamServiceTest)  Time elapsed: 0.001 s
18:03:58 [2021-02-03T23:03:58.489Z] addMembershipNullName(org.eclipse.egit.github.core.tests.TeamServiceTest)  Time elapsed: 0 s
18:03:58 [2021-02-03T23:03:58.489Z] removeMembershipEmptyName(org.eclipse.egit.github.core.tests.TeamServiceTest)  Time elapsed: 0 s
18:03:58 [2021-02-03T23:03:58.489Z] getAllTeams(org.eclipse.egit.github.core.tests.TeamServiceTest)  Time elapsed: 0.001 s
18:03:58 [2021-02-03T23:03:58.489Z] isMember(org.eclipse.egit.github.core.tests.TeamServiceTest)  Time elapsed: 0 s
18:03:58 [2021-02-03T23:03:58.489Z] removeMembership(org.eclipse.egit.github.core.tests.TeamServiceTest)  Time elapsed: 0 s
18:03:58 [2021-02-03T23:03:58.489Z] getMembershipNullName(org.eclipse.egit.github.core.tests.TeamServiceTest)  Time elapsed: 0 s
18:03:58 [2021-02-03T23:03:58.489Z] createTeamNullTeam(org.eclipse.egit.github.core.tests.TeamServiceTest)  Time elapsed: 0 s
18:03:58 [2021-02-03T23:03:58.489Z] addMember(org.eclipse.egit.github.core.tests.TeamServiceTest)  Time elapsed: 0 s
18:03:58 [2021-02-03T23:03:58.489Z] isRepository(org.eclipse.egit.github.core.tests.TeamServiceTest)  Time elapsed: 0 s
18:03:58 [2021-02-03T23:03:58.489Z] getTeam(org.eclipse.egit.github.core.tests.TeamServiceTest)  Time elapsed: 0 s
18:03:58 [2021-02-03T23:03:58.489Z] addMemberNullName(org.eclipse.egit.github.core.tests.TeamServiceTest)  Time elapsed: 0 s
18:03:58 [2021-02-03T23:03:58.489Z] isMemberNullName(org.eclipse.egit.github.core.tests.TeamServiceTest)  Time elapsed: 0 s
18:03:58 [2021-02-03T23:03:58.489Z] removeMemberEmptyName(org.eclipse.egit.github.core.tests.TeamServiceTest)  Time elapsed: 0 s
18:03:58 [2021-02-03T23:03:58.489Z] createTeam(org.eclipse.egit.github.core.tests.TeamServiceTest)  Time elapsed: 0 s
18:03:58 [2021-02-03T23:03:58.489Z] editTeamNullTeam(org.eclipse.egit.github.core.tests.TeamServiceTest)  Time elapsed: 0 s
18:03:58 [2021-02-03T23:03:58.489Z] createTeamNullOrg(org.eclipse.egit.github.core.tests.TeamServiceTest)  Time elapsed: 0 s
18:03:58 [2021-02-03T23:03:58.489Z] editTeam(org.eclipse.egit.github.core.tests.TeamServiceTest)  Time elapsed: 0.001 s
18:03:58 [2021-02-03T23:03:58.489Z] getRepositoryTeams(org.eclipse.egit.github.core.tests.TeamServiceTest)  Time elapsed: 0 s
18:03:58 [2021-02-03T23:03:58.489Z] addMemberEmptyName(org.eclipse.egit.github.core.tests.TeamServiceTest)  Time elapsed: 0 s
18:03:58 [2021-02-03T23:03:58.489Z] deleteTeam(org.eclipse.egit.github.core.tests.TeamServiceTest)  Time elapsed: 0 s
18:03:58 [2021-02-03T23:03:58.489Z] removeMembershipNullName(org.eclipse.egit.github.core.tests.TeamServiceTest)  Time elapsed: 0 s
18:03:58 [2021-02-03T23:03:58.489Z] getTeamsNullName(org.eclipse.egit.github.core.tests.TeamServiceTest)  Time elapsed: 0 s
18:03:58 [2021-02-03T23:03:58.489Z] getTeams(org.eclipse.egit.github.core.tests.TeamServiceTest)  Time elapsed: 0 s
18:03:58 [2021-02-03T23:03:58.489Z] addRepository(org.eclipse.egit.github.core.tests.TeamServiceTest)  Time elapsed: 0 s
18:03:58 [2021-02-03T23:03:58.489Z] getMembers(org.eclipse.egit.github.core.tests.TeamServiceTest)  Time elapsed: 0 s
18:03:58 [2021-02-03T23:03:58.489Z] updateFields(org.eclipse.egit.github.core.tests.TeamTest)  Time elapsed: 0 s
18:03:58 [2021-02-03T23:03:58.489Z] defaultState(org.eclipse.egit.github.core.tests.TeamTest)  Time elapsed: 0 s
18:03:58 [2021-02-03T23:03:58.489Z] updateFields(org.eclipse.egit.github.core.tests.TreeEntryTest)  Time elapsed: 0 s
18:03:58 [2021-02-03T23:03:58.489Z] defaultState(org.eclipse.egit.github.core.tests.TreeEntryTest)  Time elapsed: 0 s
18:03:58 [2021-02-03T23:03:58.489Z] updateFields(org.eclipse.egit.github.core.tests.TreeTest)  Time elapsed: 0 s
18:03:58 [2021-02-03T23:03:58.489Z] defaultState(org.eclipse.egit.github.core.tests.TreeTest)  Time elapsed: 0 s
18:03:58 [2021-02-03T23:03:58.489Z] updateFields(org.eclipse.egit.github.core.tests.TypedResourceTest)  Time elapsed: 0 s
18:03:58 [2021-02-03T23:03:58.489Z] defaultState(org.eclipse.egit.github.core.tests.TypedResourceTest)  Time elapsed: 0 s
18:03:58 [2021-02-03T23:03:58.489Z] generateSshUrl(org.eclipse.egit.github.core.tests.UrlUtilsTest)  Time elapsed: 0 s
18:03:58 [2021-02-03T23:03:58.489Z] generateReadOnlyUrl(org.eclipse.egit.github.core.tests.UrlUtilsTest)  Time elapsed: 0 s
18:03:58 [2021-02-03T23:03:58.489Z] encode(org.eclipse.egit.github.core.tests.UrlUtilsTest)  Time elapsed: 0 s
18:03:58 [2021-02-03T23:03:58.489Z] generateHttpsUrl(org.eclipse.egit.github.core.tests.UrlUtilsTest)  Time elapsed: 0 s
18:03:58 [2021-02-03T23:03:58.489Z] updateFields(org.eclipse.egit.github.core.tests.UserPlanTest)  Time elapsed: 0 s
18:03:58 [2021-02-03T23:03:58.489Z] defaultState(org.eclipse.egit.github.core.tests.UserPlanTest)  Time elapsed: 0 s
18:03:58 [2021-02-03T23:03:58.489Z] addEmailEmptyEmails(org.eclipse.egit.github.core.tests.UserServiceTest)  Time elapsed: 0 s
18:03:58 [2021-02-03T23:03:58.489Z] removeEmailNullEmails(org.eclipse.egit.github.core.tests.UserServiceTest)  Time elapsed: 0 s
18:03:58 [2021-02-03T23:03:58.489Z] isFollowingEmptyUser(org.eclipse.egit.github.core.tests.UserServiceTest)  Time elapsed: 0 s
18:03:58 [2021-02-03T23:03:58.489Z] editKey(org.eclipse.egit.github.core.tests.UserServiceTest)  Time elapsed: 0 s
18:03:58 [2021-02-03T23:03:58.489Z] unfollowNullUser(org.eclipse.egit.github.core.tests.UserServiceTest)  Time elapsed: 0 s
18:03:58 [2021-02-03T23:03:58.489Z] constructor(org.eclipse.egit.github.core.tests.UserServiceTest)  Time elapsed: 0 s
18:03:58 [2021-02-03T23:03:58.489Z] unfollowEmptyUser(org.eclipse.egit.github.core.tests.UserServiceTest)  Time elapsed: 0 s
18:03:58 [2021-02-03T23:03:58.489Z] addEmailNullEmails(org.eclipse.egit.github.core.tests.UserServiceTest)  Time elapsed: 0 s
18:03:58 [2021-02-03T23:03:58.489Z] follow(org.eclipse.egit.github.core.tests.UserServiceTest)  Time elapsed: 0.001 s
18:03:58 [2021-02-03T23:03:58.489Z] addEmail(org.eclipse.egit.github.core.tests.UserServiceTest)  Time elapsed: 0 s
18:03:58 [2021-02-03T23:03:58.489Z] getKey(org.eclipse.egit.github.core.tests.UserServiceTest)  Time elapsed: 0 s
18:03:58 [2021-02-03T23:03:58.489Z] getFollowingNullName(org.eclipse.egit.github.core.tests.UserServiceTest)  Time elapsed: 0 s
18:03:58 [2021-02-03T23:03:58.489Z] getUserNullName(org.eclipse.egit.github.core.tests.UserServiceTest)  Time elapsed: 0.001 s
18:03:58 [2021-02-03T23:03:58.489Z] getFollowingEmptyName(org.eclipse.egit.github.core.tests.UserServiceTest)  Time elapsed: 0 s
18:03:58 [2021-02-03T23:03:58.489Z] followEmptyUser(org.eclipse.egit.github.core.tests.UserServiceTest)  Time elapsed: 0 s
18:03:58 [2021-02-03T23:03:58.489Z] getUserEmptyName(org.eclipse.egit.github.core.tests.UserServiceTest)  Time elapsed: 0 s
18:03:58 [2021-02-03T23:03:58.489Z] followNullUser(org.eclipse.egit.github.core.tests.UserServiceTest)  Time elapsed: 0 s
18:03:58 [2021-02-03T23:03:58.489Z] unfollow(org.eclipse.egit.github.core.tests.UserServiceTest)  Time elapsed: 0 s
18:03:58 [2021-02-03T23:03:58.489Z] deleteKey(org.eclipse.egit.github.core.tests.UserServiceTest)  Time elapsed: 0 s
18:03:58 [2021-02-03T23:03:58.489Z] removeEmail(org.eclipse.egit.github.core.tests.UserServiceTest)  Time elapsed: 0 s
18:03:58 [2021-02-03T23:03:58.489Z] isFollowingNullUser(org.eclipse.egit.github.core.tests.UserServiceTest)  Time elapsed: 0 s
18:03:58 [2021-02-03T23:03:58.490Z] getKeys(org.eclipse.egit.github.core.tests.UserServiceTest)  Time elapsed: 0.001 s
18:03:58 [2021-02-03T23:03:58.490Z] getUser(org.eclipse.egit.github.core.tests.UserServiceTest)  Time elapsed: 0 s
18:03:58 [2021-02-03T23:03:58.490Z] editKeyNullKey(org.eclipse.egit.github.core.tests.UserServiceTest)  Time elapsed: 0 s
18:03:58 [2021-02-03T23:03:58.490Z] getCurrentUser(org.eclipse.egit.github.core.tests.UserServiceTest)  Time elapsed: 0 s
18:03:58 [2021-02-03T23:03:58.490Z] getEmails(org.eclipse.egit.github.core.tests.UserServiceTest)  Time elapsed: 0 s
18:03:58 [2021-02-03T23:03:58.490Z] getCurrentFollowers(org.eclipse.egit.github.core.tests.UserServiceTest)  Time elapsed: 0.001 s
18:03:58 [2021-02-03T23:03:58.490Z] getCurrentFollowing(org.eclipse.egit.github.core.tests.UserServiceTest)  Time elapsed: 0 s
18:03:58 [2021-02-03T23:03:58.490Z] createKey(org.eclipse.egit.github.core.tests.UserServiceTest)  Time elapsed: 0 s
18:03:58 [2021-02-03T23:03:58.490Z] getFollowersNullName(org.eclipse.egit.github.core.tests.UserServiceTest)  Time elapsed: 0 s
18:03:58 [2021-02-03T23:03:58.490Z] getFollowers(org.eclipse.egit.github.core.tests.UserServiceTest)  Time elapsed: 0 s
18:03:58 [2021-02-03T23:03:58.490Z] getFollowing(org.eclipse.egit.github.core.tests.UserServiceTest)  Time elapsed: 0.001 s
18:03:58 [2021-02-03T23:03:58.490Z] editUserNullUser(org.eclipse.egit.github.core.tests.UserServiceTest)  Time elapsed: 0 s
18:03:58 [2021-02-03T23:03:58.490Z] editUser(org.eclipse.egit.github.core.tests.UserServiceTest)  Time elapsed: 0 s
18:03:58 [2021-02-03T23:03:58.490Z] removeEmailEmptyEmails(org.eclipse.egit.github.core.tests.UserServiceTest)  Time elapsed: 0 s
18:03:58 [2021-02-03T23:03:58.490Z] isFollowing(org.eclipse.egit.github.core.tests.UserServiceTest)  Time elapsed: 0 s
18:03:58 [2021-02-03T23:03:58.490Z] getFollowersEmptyName(org.eclipse.egit.github.core.tests.UserServiceTest)  Time elapsed: 0 s
18:03:58 [2021-02-03T23:03:58.490Z] updateFields(org.eclipse.egit.github.core.tests.UserTest)  Time elapsed: 0 s
18:03:58 [2021-02-03T23:03:58.490Z] defaultState(org.eclipse.egit.github.core.tests.UserTest)  Time elapsed: 0 s
18:03:58 [2021-02-03T23:03:58.490Z] updateFields(org.eclipse.egit.github.core.tests.WatchPayloadTest)  Time elapsed: 0 s
18:03:58 [2021-02-03T23:03:58.490Z] defaultState(org.eclipse.egit.github.core.tests.WatchPayloadTest)  Time elapsed: 0 s
18:03:58 [2021-02-03T23:03:58.490Z] 
18:03:58 [2021-02-03T23:03:58.490Z] Results:
18:03:58 [2021-02-03T23:03:58.490Z] 
18:03:58 [2021-02-03T23:03:58.490Z] Tests run: 787, Failures: 0, Errors: 0, Skipped: 0
18:03:58 [2021-02-03T23:03:58.490Z] 
18:03:59 [2021-02-03T23:03:59.056Z] 23:03:58 [INFO] All tests passed!
18:03:59 [2021-02-03T23:03:59.056Z] 23:03:58 [INFO] 
18:03:59 [2021-02-03T23:03:59.056Z] 23:03:58 [INFO] >>> spotbugs-maven-plugin:3.1.11:check (default) > :spotbugs @ org.eclipse.egit.github.core.tests >>>
18:03:59 [2021-02-03T23:03:59.056Z] 23:03:58 [INFO] 
18:03:59 [2021-02-03T23:03:59.056Z] 23:03:58 [INFO] --- spotbugs-maven-plugin:3.1.11:spotbugs (spotbugs) @ org.eclipse.egit.github.core.tests ---
18:03:59 [2021-02-03T23:03:59.056Z] 23:03:58 [INFO] Fork Value is true
18:04:04 [2021-02-03T23:04:04.338Z]      [java] Warnings generated: 3
18:04:04 [2021-02-03T23:04:04.338Z] 23:04:03 [INFO] Done SpotBugs Analysis....
18:04:04 [2021-02-03T23:04:04.338Z] 23:04:03 [INFO] 
18:04:04 [2021-02-03T23:04:04.338Z] 23:04:03 [INFO] <<< spotbugs-maven-plugin:3.1.11:check (default) < :spotbugs @ org.eclipse.egit.github.core.tests <<<
18:04:04 [2021-02-03T23:04:04.338Z] 23:04:03 [INFO] 
18:04:04 [2021-02-03T23:04:04.338Z] 23:04:03 [INFO] 
18:04:04 [2021-02-03T23:04:04.338Z] 23:04:03 [INFO] --- spotbugs-maven-plugin:3.1.11:check (default) @ org.eclipse.egit.github.core.tests ---
18:04:04 [2021-02-03T23:04:04.338Z] 23:04:03 [INFO] BugInstance size is 3
18:04:04 [2021-02-03T23:04:04.338Z] 23:04:03 [INFO] Error size is 0
18:04:04 [2021-02-03T23:04:04.338Z] 23:04:03 [INFO] Total bugs: 3
18:04:04 [2021-02-03T23:04:04.338Z] 23:04:03 [ERROR] Found reliance on default encoding in org.eclipse.egit.github.core.tests.EncodingUtilsTest.encodeDecode(): new String(byte[]) [org.eclipse.egit.github.core.tests.EncodingUtilsTest] At EncodingUtilsTest.java:[line 40] DM_DEFAULT_ENCODING
18:04:04 [2021-02-03T23:04:04.338Z] 23:04:03 [ERROR] Found reliance on default encoding in org.eclipse.egit.github.core.tests.EncodingUtilsTest.encodeDecode(): String.getBytes() [org.eclipse.egit.github.core.tests.EncodingUtilsTest] At EncodingUtilsTest.java:[line 33] DM_DEFAULT_ENCODING
18:04:04 [2021-02-03T23:04:04.338Z] 23:04:03 [ERROR] Found reliance on default encoding in org.eclipse.egit.github.core.tests.live.CommitTest.readLine(InputStream, int): new java.util.Scanner(InputStream) [org.eclipse.egit.github.core.tests.live.CommitTest] At CommitTest.java:[line 176] DM_DEFAULT_ENCODING
18:04:04 [2021-02-03T23:04:04.338Z] 23:04:03 [INFO] 
18:04:04 [2021-02-03T23:04:04.338Z] 
18:04:04 [2021-02-03T23:04:04.338Z] 
18:04:04 [2021-02-03T23:04:04.338Z] To see bug detail using the Spotbugs GUI, use the following command "mvn spotbugs:gui"
18:04:04 [2021-02-03T23:04:04.338Z] 
18:04:04 [2021-02-03T23:04:04.338Z] 
18:04:04 [2021-02-03T23:04:04.338Z] 
18:04:04 [2021-02-03T23:04:04.338Z] 23:04:03 [INFO] 
18:04:04 [2021-02-03T23:04:04.338Z] 23:04:03 [INFO] >>> maven-pmd-plugin:3.11.0:cpd-check (default) > :cpd @ org.eclipse.egit.github.core.tests >>>
18:04:04 [2021-02-03T23:04:04.338Z] 23:04:03 [INFO] 
18:04:04 [2021-02-03T23:04:04.338Z] 23:04:03 [INFO] --- maven-pmd-plugin:3.11.0:cpd (cpd) @ org.eclipse.egit.github.core.tests ---
18:04:04 [2021-02-03T23:04:04.338Z] 23:04:03 [INFO] 
18:04:04 [2021-02-03T23:04:04.338Z] 23:04:03 [INFO] <<< maven-pmd-plugin:3.11.0:cpd-check (default) < :cpd @ org.eclipse.egit.github.core.tests <<<
18:04:04 [2021-02-03T23:04:04.338Z] 23:04:03 [INFO] 
18:04:04 [2021-02-03T23:04:04.338Z] 23:04:03 [INFO] 
18:04:04 [2021-02-03T23:04:04.338Z] 23:04:03 [INFO] --- maven-pmd-plugin:3.11.0:cpd-check (default) @ org.eclipse.egit.github.core.tests ---
18:04:04 [2021-02-03T23:04:04.338Z] 23:04:03 [INFO] You have 3 CPD duplications. For more details see: /home/jenkins/agent/workspace/egit-github/repo/org.eclipse.egit.github.core.tests/target/cpd.xml
18:04:04 [2021-02-03T23:04:04.338Z] 23:04:03 [INFO] 
18:04:04 [2021-02-03T23:04:04.338Z] 23:04:03 [INFO] --- tycho-pack200a-plugin:1.7.0:normalize (pack200-normalize) @ org.eclipse.egit.github.core.tests ---
18:04:04 [2021-02-03T23:04:04.338Z] 23:04:03 [INFO] Pack200 normalizing jar /home/jenkins/agent/workspace/egit-github/repo/org.eclipse.egit.github.core.tests/target/org.eclipse.egit.github.core.tests-5.11.0-SNAPSHOT.jar
18:04:04 [2021-02-03T23:04:04.338Z] 23:04:03 [INFO] 
18:04:04 [2021-02-03T23:04:04.338Z] 23:04:03 [INFO] --- eclipse-jarsigner-plugin:1.1.5:sign (sign) @ org.eclipse.egit.github.core.tests ---
18:04:04 [2021-02-03T23:04:04.338Z] 23:04:04 [INFO] Signing jar: /home/jenkins/agent/workspace/egit-github/repo/org.eclipse.egit.github.core.tests/target/org.eclipse.egit.github.core.tests-5.11.0-SNAPSHOT.jar
18:04:05 [2021-02-03T23:04:05.709Z] 23:04:05 [INFO] 
18:04:05 [2021-02-03T23:04:05.709Z] 23:04:05 [INFO] --- tycho-pack200b-plugin:1.7.0:pack (pack200-pack) @ org.eclipse.egit.github.core.tests ---
18:04:05 [2021-02-03T23:04:05.709Z] 23:04:05 [INFO] Pack200 packing jar /home/jenkins/agent/workspace/egit-github/repo/org.eclipse.egit.github.core.tests/target/org.eclipse.egit.github.core.tests-5.11.0-SNAPSHOT.jar
18:04:05 [2021-02-03T23:04:05.966Z] 23:04:05 [INFO] 
18:04:05 [2021-02-03T23:04:05.966Z] 23:04:05 [INFO] --- tycho-p2-plugin:1.7.0:p2-metadata (p2-metadata) @ org.eclipse.egit.github.core.tests ---
18:04:05 [2021-02-03T23:04:05.966Z] 23:04:05 [INFO] 
18:04:05 [2021-02-03T23:04:05.966Z] 23:04:05 [INFO] --- maven-install-plugin:2.3.1:install (default-install) @ org.eclipse.egit.github.core.tests ---
18:04:05 [2021-02-03T23:04:05.966Z] 23:04:05 [INFO] Installing /home/jenkins/agent/workspace/egit-github/repo/org.eclipse.egit.github.core.tests/target/org.eclipse.egit.github.core.tests-5.11.0-SNAPSHOT.jar to /home/jenkins/agent/workspace/egit-github/.repository/org/eclipse/mylyn/github/org.eclipse.egit.github.core.tests/5.11.0-SNAPSHOT/org.eclipse.egit.github.core.tests-5.11.0-SNAPSHOT.jar
18:04:05 [2021-02-03T23:04:05.966Z] 23:04:05 [INFO] Installing /home/jenkins/agent/workspace/egit-github/repo/org.eclipse.egit.github.core.tests/pom.xml to /home/jenkins/agent/workspace/egit-github/.repository/org/eclipse/mylyn/github/org.eclipse.egit.github.core.tests/5.11.0-SNAPSHOT/org.eclipse.egit.github.core.tests-5.11.0-SNAPSHOT.pom
18:04:05 [2021-02-03T23:04:05.966Z] 23:04:05 [INFO] Installing /home/jenkins/agent/workspace/egit-github/repo/org.eclipse.egit.github.core.tests/target/org.eclipse.egit.github.core.tests-5.11.0-SNAPSHOT.jar.pack.gz to /home/jenkins/agent/workspace/egit-github/.repository/org/eclipse/mylyn/github/org.eclipse.egit.github.core.tests/5.11.0-SNAPSHOT/org.eclipse.egit.github.core.tests-5.11.0-SNAPSHOT-pack200.jar.pack.gz
18:04:05 [2021-02-03T23:04:05.966Z] 23:04:05 [INFO] Installing /home/jenkins/agent/workspace/egit-github/repo/org.eclipse.egit.github.core.tests/target/p2content.xml to /home/jenkins/agent/workspace/egit-github/.repository/org/eclipse/mylyn/github/org.eclipse.egit.github.core.tests/5.11.0-SNAPSHOT/org.eclipse.egit.github.core.tests-5.11.0-SNAPSHOT-p2metadata.xml
18:04:05 [2021-02-03T23:04:05.966Z] 23:04:05 [INFO] Installing /home/jenkins/agent/workspace/egit-github/repo/org.eclipse.egit.github.core.tests/target/p2artifacts.xml to /home/jenkins/agent/workspace/egit-github/.repository/org/eclipse/mylyn/github/org.eclipse.egit.github.core.tests/5.11.0-SNAPSHOT/org.eclipse.egit.github.core.tests-5.11.0-SNAPSHOT-p2artifacts.xml
18:04:05 [2021-02-03T23:04:05.966Z] 23:04:05 [INFO] 
18:04:05 [2021-02-03T23:04:05.966Z] 23:04:05 [INFO] --- tycho-p2-plugin:1.7.0:update-local-index (default-update-local-index) @ org.eclipse.egit.github.core.tests ---
18:04:05 [2021-02-03T23:04:05.966Z] 23:04:05 [INFO] 
18:04:05 [2021-02-03T23:04:05.966Z] 23:04:05 [INFO] ------< org.eclipse.mylyn.github:org.eclipse.mylyn.github.tests >-------
18:04:05 [2021-02-03T23:04:05.966Z] 23:04:05 [INFO] Building Eclipse EGit Mylyn GitHub Test Plug-in 5.11.0-SNAPSHOT   [9/10]
18:04:05 [2021-02-03T23:04:05.966Z] 23:04:05 [INFO] ------------------------[ eclipse-test-plugin ]-------------------------
18:04:05 [2021-02-03T23:04:05.966Z] 23:04:05 [INFO] 
18:04:05 [2021-02-03T23:04:05.966Z] 23:04:05 [INFO] --- maven-clean-plugin:2.5:clean (default-clean) @ org.eclipse.mylyn.github.tests ---
18:04:05 [2021-02-03T23:04:05.966Z] 23:04:05 [INFO] 
18:04:05 [2021-02-03T23:04:05.966Z] 23:04:05 [INFO] --- tycho-packaging-plugin:1.7.0:build-qualifier (default-build-qualifier) @ org.eclipse.mylyn.github.tests ---
18:04:05 [2021-02-03T23:04:05.966Z] 23:04:05 [INFO] The project's OSGi version is 5.11.0.202102032301
18:04:05 [2021-02-03T23:04:05.966Z] 23:04:05 [INFO] 
18:04:05 [2021-02-03T23:04:05.966Z] 23:04:05 [INFO] --- tycho-packaging-plugin:1.7.0:validate-id (default-validate-id) @ org.eclipse.mylyn.github.tests ---
18:04:05 [2021-02-03T23:04:05.966Z] 23:04:05 [INFO] 
18:04:05 [2021-02-03T23:04:05.966Z] 23:04:05 [INFO] --- tycho-packaging-plugin:1.7.0:validate-version (default-validate-version) @ org.eclipse.mylyn.github.tests ---
18:04:05 [2021-02-03T23:04:05.966Z] 23:04:05 [INFO] 
18:04:05 [2021-02-03T23:04:05.966Z] 23:04:05 [INFO] --- maven-enforcer-plugin:3.0.0-M2:enforce (enforce-maven) @ org.eclipse.mylyn.github.tests ---
18:04:05 [2021-02-03T23:04:05.966Z] 23:04:05 [INFO] 
18:04:05 [2021-02-03T23:04:05.966Z] 23:04:05 [INFO] --- maven-resources-plugin:3.1.0:resources (default-resources) @ org.eclipse.mylyn.github.tests ---
18:04:05 [2021-02-03T23:04:05.966Z] 23:04:05 [INFO] Using 'UTF-8' encoding to copy filtered resources.
18:04:05 [2021-02-03T23:04:05.966Z] 23:04:05 [INFO] skip non existing resourceDirectory /home/jenkins/agent/workspace/egit-github/repo/org.eclipse.mylyn.github.tests/src/main/resources
18:04:05 [2021-02-03T23:04:05.966Z] 23:04:05 [INFO] 
18:04:05 [2021-02-03T23:04:05.966Z] 23:04:05 [INFO] --- tycho-compiler-plugin:1.7.0:compile (default-compile) @ org.eclipse.mylyn.github.tests ---
18:04:05 [2021-02-03T23:04:05.967Z] 23:04:05 [INFO] Compiling 1 source file to /home/jenkins/agent/workspace/egit-github/repo/org.eclipse.mylyn.github.tests/target/classes
18:04:05 [2021-02-03T23:04:05.967Z] 23:04:05 [INFO] 
18:04:05 [2021-02-03T23:04:05.967Z] 23:04:05 [INFO] --- maven-resources-plugin:3.1.0:testResources (default-testResources) @ org.eclipse.mylyn.github.tests ---
18:04:05 [2021-02-03T23:04:05.967Z] 23:04:05 [INFO] Using 'UTF-8' encoding to copy filtered resources.
18:04:05 [2021-02-03T23:04:05.967Z] 23:04:05 [INFO] skip non existing resourceDirectory /home/jenkins/agent/workspace/egit-github/repo/org.eclipse.mylyn.github.tests/src/test/resources
18:04:05 [2021-02-03T23:04:05.967Z] 23:04:05 [INFO] 
18:04:05 [2021-02-03T23:04:05.967Z] 23:04:05 [INFO] --- target-platform-configuration:1.7.0:target-platform (default-target-platform) @ org.eclipse.mylyn.github.tests ---
18:04:05 [2021-02-03T23:04:05.967Z] 23:04:05 [INFO] 
18:04:05 [2021-02-03T23:04:05.967Z] 23:04:05 [INFO] --- tycho-packaging-plugin:1.7.0:package-plugin (default-package-plugin) @ org.eclipse.mylyn.github.tests ---
18:04:05 [2021-02-03T23:04:05.967Z] 23:04:05 [INFO] Building jar: /home/jenkins/agent/workspace/egit-github/repo/org.eclipse.mylyn.github.tests/target/org.eclipse.mylyn.github.tests-5.11.0-SNAPSHOT.jar
18:04:05 [2021-02-03T23:04:05.967Z] 23:04:05 [INFO] 
18:04:05 [2021-02-03T23:04:05.967Z] 23:04:05 [INFO] --- tycho-p2-plugin:1.7.0:p2-metadata-default (default-p2-metadata-default) @ org.eclipse.mylyn.github.tests ---
18:04:05 [2021-02-03T23:04:05.967Z] 23:04:05 [INFO] 
18:04:05 [2021-02-03T23:04:05.967Z] 23:04:05 [INFO] --- tycho-surefire-plugin:1.7.0:test (default-test) @ org.eclipse.mylyn.github.tests ---
18:04:06 [2021-02-03T23:04:06.224Z] 23:04:06 [INFO] Executing Test Runtime with timeout 0, logs (if any) will be placed at: /home/jenkins/agent/workspace/egit-github/repo/org.eclipse.mylyn.github.tests/target/work/data/.metadata/.log
18:04:06 [2021-02-03T23:04:06.224Z] 23:04:06 [INFO] Command line:
18:04:06 [2021-02-03T23:04:06.224Z] 	[/opt/tools/java/adoptopenjdk/hotspot-jdk-8/1.8.0_252-b09/jre/bin/java, -Dosgi.noShutdown=false, -Dosgi.os=linux, -Dosgi.ws=gtk, -Dosgi.arch=x86_64, -Declipse.consoleLog=true, -Xmx1024m, -Dorg.eclipse.swtbot.search.timeout=30000, -Dorg.eclipse.swtbot.screenshots.dir=target/screenshots, -Dosgi.clean=true, -jar, /home/jenkins/agent/workspace/egit-github/.repository/p2/osgi/bundle/org.eclipse.equinox.launcher/1.4.0.v20161219-1356/org.eclipse.equinox.launcher-1.4.0.v20161219-1356.jar, -data, /home/jenkins/agent/workspace/egit-github/repo/org.eclipse.mylyn.github.tests/target/work/data, -install, /home/jenkins/agent/workspace/egit-github/repo/org.eclipse.mylyn.github.tests/target/work, -configuration, /home/jenkins/agent/workspace/egit-github/repo/org.eclipse.mylyn.github.tests/target/work/configuration, -application, org.eclipse.tycho.surefire.osgibooter.uitest, -testproperties, /home/jenkins/agent/workspace/egit-github/repo/org.eclipse.mylyn.github.tests/target/surefire.properties, -testApplication, org.eclipse.ui.ide.workbench, -nouithread]
18:04:07 [2021-02-03T23:04:07.613Z] !SESSION 2021-02-03 23:04:06.270 -----------------------------------------------
18:04:07 [2021-02-03T23:04:07.613Z] eclipse.buildId=unknown
18:04:07 [2021-02-03T23:04:07.613Z] java.version=1.8.0_252
18:04:07 [2021-02-03T23:04:07.613Z] java.vendor=AdoptOpenJDK
18:04:07 [2021-02-03T23:04:07.613Z] BootLoader constants: OS=linux, ARCH=x86_64, WS=gtk, NL=en_US
18:04:07 [2021-02-03T23:04:07.613Z] Framework arguments:  -application org.eclipse.tycho.surefire.osgibooter.uitest -testproperties /home/jenkins/agent/workspace/egit-github/repo/org.eclipse.mylyn.github.tests/target/surefire.properties -testApplication org.eclipse.ui.ide.workbench -nouithread
18:04:07 [2021-02-03T23:04:07.613Z] Command-line arguments:  -data /home/jenkins/agent/workspace/egit-github/repo/org.eclipse.mylyn.github.tests/target/work/data -application org.eclipse.tycho.surefire.osgibooter.uitest -testproperties /home/jenkins/agent/workspace/egit-github/repo/org.eclipse.mylyn.github.tests/target/surefire.properties -testApplication org.eclipse.ui.ide.workbench -nouithread
18:04:07 [2021-02-03T23:04:07.613Z] 
18:04:07 [2021-02-03T23:04:07.613Z] !ENTRY org.eclipse.jdt.launching.macosx 4 0 2021-02-03 23:04:07.608
18:04:07 [2021-02-03T23:04:07.613Z] !MESSAGE FrameworkEvent ERROR
18:04:07 [2021-02-03T23:04:07.613Z] !STACK 0
18:04:07 [2021-02-03T23:04:07.613Z] org.osgi.framework.BundleException: Could not resolve module: org.eclipse.jdt.launching.macosx [270]
18:04:07 [2021-02-03T23:04:07.613Z]   Unresolved requirement: Require-Capability: eclipse.platform; filter:="(osgi.os=macosx)"
18:04:07 [2021-02-03T23:04:07.613Z] 
18:04:07 [2021-02-03T23:04:07.613Z] 	at org.eclipse.osgi.container.Module.start(Module.java:444)
18:04:07 [2021-02-03T23:04:07.613Z] 	at org.eclipse.osgi.container.ModuleContainer$ContainerStartLevel.incStartLevel(ModuleContainer.java:1634)
18:04:07 [2021-02-03T23:04:07.613Z] 	at org.eclipse.osgi.container.ModuleContainer$ContainerStartLevel.incStartLevel(ModuleContainer.java:1613)
18:04:07 [2021-02-03T23:04:07.613Z] 	at org.eclipse.osgi.container.ModuleContainer$ContainerStartLevel.doContainerStartLevel(ModuleContainer.java:1585)
18:04:07 [2021-02-03T23:04:07.613Z] 	at org.eclipse.osgi.container.ModuleContainer$ContainerStartLevel.dispatchEvent(ModuleContainer.java:1528)
18:04:07 [2021-02-03T23:04:07.613Z] 	at org.eclipse.osgi.container.ModuleContainer$ContainerStartLevel.dispatchEvent(ModuleContainer.java:1)
18:04:07 [2021-02-03T23:04:07.613Z] 	at org.eclipse.osgi.framework.eventmgr.EventManager.dispatchEvent(EventManager.java:230)
18:04:07 [2021-02-03T23:04:07.613Z] 	at org.eclipse.osgi.framework.eventmgr.EventManager$EventThread.run(EventManager.java:340)
18:04:07 [2021-02-03T23:04:07.613Z] 
18:04:07 [2021-02-03T23:04:07.613Z] !ENTRY org.eclipse.jdt.launching.ui.macosx 4 0 2021-02-03 23:04:07.608
18:04:07 [2021-02-03T23:04:07.613Z] !MESSAGE FrameworkEvent ERROR
18:04:07 [2021-02-03T23:04:07.613Z] !STACK 0
18:04:07 [2021-02-03T23:04:07.613Z] org.osgi.framework.BundleException: Could not resolve module: org.eclipse.jdt.launching.ui.macosx [271]
18:04:07 [2021-02-03T23:04:07.613Z]   Unresolved requirement: Require-Capability: eclipse.platform; filter:="(osgi.os=macosx)"
18:04:07 [2021-02-03T23:04:07.613Z] 
18:04:07 [2021-02-03T23:04:07.613Z] 	at org.eclipse.osgi.container.Module.start(Module.java:444)
18:04:07 [2021-02-03T23:04:07.614Z] 	at org.eclipse.osgi.container.ModuleContainer$ContainerStartLevel.incStartLevel(ModuleContainer.java:1634)
18:04:07 [2021-02-03T23:04:07.614Z] 	at org.eclipse.osgi.container.ModuleContainer$ContainerStartLevel.incStartLevel(ModuleContainer.java:1613)
18:04:07 [2021-02-03T23:04:07.614Z] 	at org.eclipse.osgi.container.ModuleContainer$ContainerStartLevel.doContainerStartLevel(ModuleContainer.java:1585)
18:04:07 [2021-02-03T23:04:07.614Z] 	at org.eclipse.osgi.container.ModuleContainer$ContainerStartLevel.dispatchEvent(ModuleContainer.java:1528)
18:04:07 [2021-02-03T23:04:07.614Z] 	at org.eclipse.osgi.container.ModuleContainer$ContainerStartLevel.dispatchEvent(ModuleContainer.java:1)
18:04:07 [2021-02-03T23:04:07.614Z] 	at org.eclipse.osgi.framework.eventmgr.EventManager.dispatchEvent(EventManager.java:230)
18:04:07 [2021-02-03T23:04:07.614Z] 	at org.eclipse.osgi.framework.eventmgr.EventManager$EventThread.run(EventManager.java:340)
18:04:07 [2021-02-03T23:04:07.871Z] Launching application org.eclipse.ui.ide.workbench...
18:04:09 [2021-02-03T23:04:09.766Z] SLF4J: Failed to load class "org.slf4j.impl.StaticLoggerBinder".
18:04:09 [2021-02-03T23:04:09.766Z] SLF4J: Defaulting to no-operation (NOP) logger implementation
18:04:09 [2021-02-03T23:04:09.766Z] SLF4J: See http://www.slf4j.org/codes.html#StaticLoggerBinder for further details.
18:04:10 [2021-02-03T23:04:10.331Z] Running org.eclipse.mylyn.github.ui.internal.GitHubRepositoryConnectorUIHeadlessTest
18:04:10 [2021-02-03T23:04:10.589Z] Tests run: 1, Failures: 0, Errors: 0, Skipped: 0, Time elapsed: 0.018 s - in org.eclipse.mylyn.github.ui.internal.GitHubRepositoryConnectorUIHeadlessTest
18:04:10 [2021-02-03T23:04:10.589Z] testFindHyperlinksTaskRepositoryStringIntInt(org.eclipse.mylyn.github.ui.internal.GitHubRepositoryConnectorUIHeadlessTest)  Time elapsed: 0.002 s
18:04:10 [2021-02-03T23:04:10.589Z] 
18:04:10 [2021-02-03T23:04:10.589Z] Results:
18:04:10 [2021-02-03T23:04:10.589Z] 
18:04:10 [2021-02-03T23:04:10.589Z] Tests run: 1, Failures: 0, Errors: 0, Skipped: 0
18:04:10 [2021-02-03T23:04:10.589Z] 
18:04:11 [2021-02-03T23:04:11.522Z] 
18:04:11 [2021-02-03T23:04:11.522Z] (SWT:912): Gtk-WARNING **: 23:04:11.252: Negative content width -1 (allocation 1, extents 1x1) while allocating gadget (node trough, owner GtkProgressBar)
18:04:11 [2021-02-03T23:04:11.522Z] 
18:04:11 [2021-02-03T23:04:11.522Z] (SWT:912): Gtk-WARNING **: 23:04:11.252: Negative content width -1 (allocation 1, extents 1x1) while allocating gadget (node trough, owner GtkProgressBar)
18:04:11 [2021-02-03T23:04:11.779Z] 
18:04:11 [2021-02-03T23:04:11.779Z] !ENTRY org.eclipse.equinox.registry 4 1 2021-02-03 23:04:11.721
18:04:11 [2021-02-03T23:04:11.779Z] !MESSAGE Plug-in "org.eclipse.ui.ide" was unable to instantiate class "org.eclipse.ui.internal.ide.SymlinkDecorator".
18:04:11 [2021-02-03T23:04:11.779Z] !STACK 0
18:04:11 [2021-02-03T23:04:11.779Z] java.lang.ExceptionInInitializerError
18:04:11 [2021-02-03T23:04:11.779Z] 	at sun.reflect.NativeConstructorAccessorImpl.newInstance0(Native Method)
18:04:11 [2021-02-03T23:04:11.779Z] 	at sun.reflect.NativeConstructorAccessorImpl.newInstance(NativeConstructorAccessorImpl.java:62)
18:04:11 [2021-02-03T23:04:11.779Z] 	at sun.reflect.DelegatingConstructorAccessorImpl.newInstance(DelegatingConstructorAccessorImpl.java:45)
18:04:11 [2021-02-03T23:04:11.779Z] 	at java.lang.reflect.Constructor.newInstance(Constructor.java:423)
18:04:11 [2021-02-03T23:04:11.779Z] 	at java.lang.Class.newInstance(Class.java:442)
18:04:11 [2021-02-03T23:04:11.779Z] 	at org.eclipse.core.internal.registry.osgi.RegistryStrategyOSGI.createExecutableExtension(RegistryStrategyOSGI.java:184)
18:04:11 [2021-02-03T23:04:11.779Z] 	at org.eclipse.core.internal.registry.ExtensionRegistry.createExecutableExtension(ExtensionRegistry.java:905)
18:04:11 [2021-02-03T23:04:11.779Z] 	at org.eclipse.core.internal.registry.ConfigurationElement.createExecutableExtension(ConfigurationElement.java:243)
18:04:11 [2021-02-03T23:04:11.779Z] 	at org.eclipse.core.internal.registry.ConfigurationElementHandle.createExecutableExtension(ConfigurationElementHandle.java:55)
18:04:11 [2021-02-03T23:04:11.779Z] 	at org.eclipse.ui.internal.WorkbenchPlugin.createExtension(WorkbenchPlugin.java:281)
18:04:11 [2021-02-03T23:04:11.779Z] 	at org.eclipse.ui.internal.decorators.LightweightDecoratorDefinition$1.run(LightweightDecoratorDefinition.java:125)
18:04:11 [2021-02-03T23:04:11.779Z] 	at org.eclipse.core.runtime.SafeRunner.run(SafeRunner.java:42)
18:04:11 [2021-02-03T23:04:11.779Z] 	at org.eclipse.ui.internal.decorators.LightweightDecoratorDefinition.internalGetDecorator(LightweightDecoratorDefinition.java:120)
18:04:11 [2021-02-03T23:04:11.779Z] 	at org.eclipse.ui.internal.decorators.LightweightDecoratorDefinition.decorate(LightweightDecoratorDefinition.java:242)
18:04:11 [2021-02-03T23:04:11.779Z] 	at org.eclipse.ui.internal.decorators.LightweightDecoratorManager$LightweightRunnable.run(LightweightDecoratorManager.java:104)
18:04:11 [2021-02-03T23:04:11.780Z] 	at org.eclipse.core.runtime.SafeRunner.run(SafeRunner.java:42)
18:04:11 [2021-02-03T23:04:11.780Z] 	at org.eclipse.ui.internal.decorators.LightweightDecoratorManager.decorate(LightweightDecoratorManager.java:377)
18:04:11 [2021-02-03T23:04:11.780Z] 	at org.eclipse.ui.internal.decorators.LightweightDecoratorManager.getDecorations(LightweightDecoratorManager.java:359)
18:04:11 [2021-02-03T23:04:11.780Z] 	at org.eclipse.ui.internal.decorators.DecorationScheduler$1.ensureResultCached(DecorationScheduler.java:347)
18:04:11 [2021-02-03T23:04:11.780Z] 	at org.eclipse.ui.internal.decorators.DecorationScheduler$1.run(DecorationScheduler.java:311)
18:04:11 [2021-02-03T23:04:11.780Z] 	at org.eclipse.core.internal.jobs.Worker.run(Worker.java:56)
18:04:11 [2021-02-03T23:04:11.780Z] Caused by: java.lang.NullPointerException
18:04:11 [2021-02-03T23:04:11.780Z] 	at org.eclipse.ui.plugin.AbstractUIPlugin.imageDescriptorFromPlugin(AbstractUIPlugin.java:664)
18:04:11 [2021-02-03T23:04:11.780Z] 	at org.eclipse.ui.internal.ide.SymlinkDecorator.<clinit>(SymlinkDecorator.java:32)
18:04:11 [2021-02-03T23:04:11.780Z] 	... 21 more
18:04:11 [2021-02-03T23:04:11.780Z] 
18:04:11 [2021-02-03T23:04:11.780Z] !ENTRY org.eclipse.equinox.registry 4 1 2021-02-03 23:04:11.722
18:04:11 [2021-02-03T23:04:11.780Z] !MESSAGE Plug-in "org.eclipse.ui.ide" was unable to instantiate class "org.eclipse.ui.internal.ide.SymlinkDecorator".
18:04:11 [2021-02-03T23:04:11.780Z] !STACK 0
18:04:11 [2021-02-03T23:04:11.780Z] java.lang.ExceptionInInitializerError
18:04:11 [2021-02-03T23:04:11.780Z] 	at sun.reflect.NativeConstructorAccessorImpl.newInstance0(Native Method)
18:04:11 [2021-02-03T23:04:11.780Z] 	at sun.reflect.NativeConstructorAccessorImpl.newInstance(NativeConstructorAccessorImpl.java:62)
18:04:11 [2021-02-03T23:04:11.780Z] 	at sun.reflect.DelegatingConstructorAccessorImpl.newInstance(DelegatingConstructorAccessorImpl.java:45)
18:04:11 [2021-02-03T23:04:11.780Z] 	at java.lang.reflect.Constructor.newInstance(Constructor.java:423)
18:04:11 [2021-02-03T23:04:11.780Z] 	at java.lang.Class.newInstance(Class.java:442)
18:04:11 [2021-02-03T23:04:11.780Z] 	at org.eclipse.core.internal.registry.osgi.RegistryStrategyOSGI.createExecutableExtension(RegistryStrategyOSGI.java:184)
18:04:11 [2021-02-03T23:04:11.780Z] 	at org.eclipse.core.internal.registry.ExtensionRegistry.createExecutableExtension(ExtensionRegistry.java:905)
18:04:11 [2021-02-03T23:04:11.780Z] 	at org.eclipse.core.internal.registry.ConfigurationElement.createExecutableExtension(ConfigurationElement.java:243)
18:04:11 [2021-02-03T23:04:11.780Z] 	at org.eclipse.core.internal.registry.ConfigurationElementHandle.createExecutableExtension(ConfigurationElementHandle.java:55)
18:04:11 [2021-02-03T23:04:11.780Z] 	at org.eclipse.ui.internal.WorkbenchPlugin.createExtension(WorkbenchPlugin.java:281)
18:04:11 [2021-02-03T23:04:11.780Z] 	at org.eclipse.ui.internal.decorators.LightweightDecoratorDefinition$1.run(LightweightDecoratorDefinition.java:125)
18:04:11 [2021-02-03T23:04:11.780Z] 	at org.eclipse.core.runtime.SafeRunner.run(SafeRunner.java:42)
18:04:11 [2021-02-03T23:04:11.780Z] 	at org.eclipse.ui.internal.decorators.LightweightDecoratorDefinition.internalGetDecorator(LightweightDecoratorDefinition.java:120)
18:04:11 [2021-02-03T23:04:11.780Z] 	at org.eclipse.ui.internal.decorators.LightweightDecoratorDefinition.decorate(LightweightDecoratorDefinition.java:242)
18:04:11 [2021-02-03T23:04:11.780Z] 	at org.eclipse.ui.internal.decorators.LightweightDecoratorManager$LightweightRunnable.run(LightweightDecoratorManager.java:104)
18:04:11 [2021-02-03T23:04:11.780Z] 	at org.eclipse.core.runtime.SafeRunner.run(SafeRunner.java:42)
18:04:11 [2021-02-03T23:04:11.780Z] 	at org.eclipse.ui.internal.decorators.LightweightDecoratorManager.decorate(LightweightDecoratorManager.java:377)
18:04:11 [2021-02-03T23:04:11.780Z] 	at org.eclipse.ui.internal.decorators.LightweightDecoratorManager.getDecorations(LightweightDecoratorManager.java:359)
18:04:11 [2021-02-03T23:04:11.780Z] 	at org.eclipse.ui.internal.decorators.DecorationScheduler$1.ensureResultCached(DecorationScheduler.java:347)
18:04:11 [2021-02-03T23:04:11.780Z] 	at org.eclipse.ui.internal.decorators.DecorationScheduler$1.run(DecorationScheduler.java:311)
18:04:11 [2021-02-03T23:04:11.780Z] 	at org.eclipse.core.internal.jobs.Worker.run(Worker.java:56)
18:04:11 [2021-02-03T23:04:11.780Z] Caused by: java.lang.NullPointerException
18:04:11 [2021-02-03T23:04:11.780Z] 	at org.eclipse.ui.plugin.AbstractUIPlugin.imageDescriptorFromPlugin(AbstractUIPlugin.java:664)
18:04:11 [2021-02-03T23:04:11.780Z] 	at org.eclipse.ui.internal.ide.SymlinkDecorator.<clinit>(SymlinkDecorator.java:32)
18:04:11 [2021-02-03T23:04:11.780Z] 	... 21 more
18:04:11 [2021-02-03T23:04:11.780Z] 
18:04:11 [2021-02-03T23:04:11.780Z] !ENTRY org.eclipse.ui 4 0 2021-02-03 23:04:11.723
18:04:11 [2021-02-03T23:04:11.780Z] !MESSAGE Error occurred during status handling
18:04:11 [2021-02-03T23:04:11.780Z] !STACK 0
18:04:11 [2021-02-03T23:04:11.780Z] java.lang.NullPointerException
18:04:11 [2021-02-03T23:04:11.780Z] 	at org.eclipse.ui.internal.statushandlers.StatusHandlerRegistry.<init>(StatusHandlerRegistry.java:71)
18:04:11 [2021-02-03T23:04:11.780Z] 	at org.eclipse.ui.internal.statushandlers.StatusHandlerRegistry.getDefault(StatusHandlerRegistry.java:90)
18:04:11 [2021-02-03T23:04:11.780Z] 	at org.eclipse.ui.statushandlers.StatusManager.getStatusHandler(StatusManager.java:152)
18:04:11 [2021-02-03T23:04:11.780Z] 	at org.eclipse.ui.statushandlers.StatusManager.handle(StatusManager.java:211)
18:04:11 [2021-02-03T23:04:11.780Z] 	at org.eclipse.ui.statushandlers.StatusManager.handle(StatusManager.java:260)
18:04:11 [2021-02-03T23:04:11.780Z] 	at org.eclipse.ui.statushandlers.StatusManager$StatusManagerLogListener.logging(StatusManager.java:331)
18:04:11 [2021-02-03T23:04:11.780Z] 	at org.eclipse.core.internal.runtime.RuntimeLog.logToListeners(RuntimeLog.java:161)
18:04:11 [2021-02-03T23:04:11.780Z] 	at org.eclipse.core.internal.runtime.PlatformLogWriter.logged(PlatformLogWriter.java:103)
18:04:11 [2021-02-03T23:04:11.780Z] 	at org.eclipse.osgi.internal.log.ExtendedLogReaderServiceFactory.safeLogged(ExtendedLogReaderServiceFactory.java:88)
18:04:11 [2021-02-03T23:04:11.780Z] 	at org.eclipse.osgi.internal.log.ExtendedLogReaderServiceFactory.logPrivileged(ExtendedLogReaderServiceFactory.java:217)
18:04:11 [2021-02-03T23:04:11.780Z] 	at org.eclipse.osgi.internal.log.ExtendedLogReaderServiceFactory.log(ExtendedLogReaderServiceFactory.java:189)
18:04:11 [2021-02-03T23:04:11.780Z] 	at org.eclipse.osgi.internal.log.ExtendedLogServiceFactory.log(ExtendedLogServiceFactory.java:65)
18:04:11 [2021-02-03T23:04:11.780Z] 	at org.eclipse.osgi.internal.log.ExtendedLogServiceImpl.log(ExtendedLogServiceImpl.java:87)
18:04:11 [2021-02-03T23:04:11.780Z] 	at org.eclipse.osgi.internal.log.LoggerImpl.log(LoggerImpl.java:54)
18:04:11 [2021-02-03T23:04:11.780Z] 	at org.eclipse.core.internal.runtime.Log.log(Log.java:65)
18:04:11 [2021-02-03T23:04:11.780Z] 	at org.eclipse.ui.internal.WorkbenchPlugin.log(WorkbenchPlugin.java:663)
18:04:11 [2021-02-03T23:04:11.780Z] 	at org.eclipse.ui.internal.decorators.DecoratorDefinition.handleCoreException(DecoratorDefinition.java:266)
18:04:11 [2021-02-03T23:04:11.780Z] 	at org.eclipse.ui.internal.decorators.LightweightDecoratorDefinition.decorate(LightweightDecoratorDefinition.java:263)
18:04:11 [2021-02-03T23:04:11.780Z] 	at org.eclipse.ui.internal.decorators.LightweightDecoratorManager$LightweightRunnable.run(LightweightDecoratorManager.java:104)
18:04:11 [2021-02-03T23:04:11.780Z] 	at org.eclipse.core.runtime.SafeRunner.run(SafeRunner.java:42)
18:04:11 [2021-02-03T23:04:11.780Z] 	at org.eclipse.ui.internal.decorators.LightweightDecoratorManager.decorate(LightweightDecoratorManager.java:377)
18:04:11 [2021-02-03T23:04:11.780Z] 	at org.eclipse.ui.internal.decorators.LightweightDecoratorManager.getDecorations(LightweightDecoratorManager.java:359)
18:04:11 [2021-02-03T23:04:11.780Z] 	at org.eclipse.ui.internal.decorators.DecorationScheduler$1.ensureResultCached(DecorationScheduler.java:347)
18:04:11 [2021-02-03T23:04:11.780Z] 	at org.eclipse.ui.internal.decorators.DecorationScheduler$1.run(DecorationScheduler.java:311)
18:04:11 [2021-02-03T23:04:11.780Z] 	at org.eclipse.core.internal.jobs.Worker.run(Worker.java:56)
18:04:11 [2021-02-03T23:04:11.780Z] 
18:04:11 [2021-02-03T23:04:11.780Z] !ENTRY org.eclipse.equinox.registry 4 1 2021-02-03 23:04:11.723
18:04:11 [2021-02-03T23:04:11.780Z] !MESSAGE Plug-in "org.eclipse.ui.ide" was unable to instantiate class "org.eclipse.ui.internal.ide.LinkedResourceDecorator".
18:04:11 [2021-02-03T23:04:11.780Z] !STACK 0
18:04:11 [2021-02-03T23:04:11.780Z] java.lang.ExceptionInInitializerError
18:04:11 [2021-02-03T23:04:11.780Z] 	at sun.reflect.NativeConstructorAccessorImpl.newInstance0(Native Method)
18:04:11 [2021-02-03T23:04:11.780Z] 	at sun.reflect.NativeConstructorAccessorImpl.newInstance(NativeConstructorAccessorImpl.java:62)
18:04:11 [2021-02-03T23:04:11.781Z] 	at sun.reflect.DelegatingConstructorAccessorImpl.newInstance(DelegatingConstructorAccessorImpl.java:45)
18:04:11 [2021-02-03T23:04:11.781Z] 	at java.lang.reflect.Constructor.newInstance(Constructor.java:423)
18:04:11 [2021-02-03T23:04:11.781Z] 	at java.lang.Class.newInstance(Class.java:442)
18:04:11 [2021-02-03T23:04:11.781Z] 	at org.eclipse.core.internal.registry.osgi.RegistryStrategyOSGI.createExecutableExtension(RegistryStrategyOSGI.java:184)
18:04:11 [2021-02-03T23:04:11.781Z] 	at org.eclipse.core.internal.registry.ExtensionRegistry.createExecutableExtension(ExtensionRegistry.java:905)
18:04:11 [2021-02-03T23:04:11.781Z] 	at org.eclipse.core.internal.registry.ConfigurationElement.createExecutableExtension(ConfigurationElement.java:243)
18:04:11 [2021-02-03T23:04:11.781Z] 	at org.eclipse.core.internal.registry.ConfigurationElementHandle.createExecutableExtension(ConfigurationElementHandle.java:55)
18:04:11 [2021-02-03T23:04:11.781Z] 	at org.eclipse.ui.internal.WorkbenchPlugin.createExtension(WorkbenchPlugin.java:281)
18:04:11 [2021-02-03T23:04:11.781Z] 	at org.eclipse.ui.internal.decorators.LightweightDecoratorDefinition$1.run(LightweightDecoratorDefinition.java:125)
18:04:11 [2021-02-03T23:04:11.781Z] 	at org.eclipse.core.runtime.SafeRunner.run(SafeRunner.java:42)
18:04:11 [2021-02-03T23:04:11.781Z] 	at org.eclipse.ui.internal.decorators.LightweightDecoratorDefinition.internalGetDecorator(LightweightDecoratorDefinition.java:120)
18:04:11 [2021-02-03T23:04:11.781Z] 	at org.eclipse.ui.internal.decorators.LightweightDecoratorDefinition.decorate(LightweightDecoratorDefinition.java:242)
18:04:11 [2021-02-03T23:04:11.781Z] 	at org.eclipse.ui.internal.decorators.LightweightDecoratorManager$LightweightRunnable.run(LightweightDecoratorManager.java:104)
18:04:11 [2021-02-03T23:04:11.781Z] 	at org.eclipse.core.runtime.SafeRunner.run(SafeRunner.java:42)
18:04:11 [2021-02-03T23:04:11.781Z] 	at org.eclipse.ui.internal.decorators.LightweightDecoratorManager.decorate(LightweightDecoratorManager.java:377)
18:04:11 [2021-02-03T23:04:11.781Z] 	at org.eclipse.ui.internal.decorators.LightweightDecoratorManager.getDecorations(LightweightDecoratorManager.java:359)
18:04:11 [2021-02-03T23:04:11.781Z] 	at org.eclipse.ui.internal.decorators.DecorationScheduler$1.ensureResultCached(DecorationScheduler.java:347)
18:04:11 [2021-02-03T23:04:11.781Z] 	at org.eclipse.ui.internal.decorators.DecorationScheduler$1.run(DecorationScheduler.java:311)
18:04:11 [2021-02-03T23:04:11.781Z] 	at org.eclipse.core.internal.jobs.Worker.run(Worker.java:56)
18:04:11 [2021-02-03T23:04:11.781Z] Caused by: java.lang.NullPointerException
18:04:11 [2021-02-03T23:04:11.781Z] 	at org.eclipse.ui.plugin.AbstractUIPlugin.imageDescriptorFromPlugin(AbstractUIPlugin.java:664)
18:04:11 [2021-02-03T23:04:11.781Z] 	at org.eclipse.ui.internal.ide.LinkedResourceDecorator.<clinit>(LinkedResourceDecorator.java:37)
18:04:11 [2021-02-03T23:04:11.781Z] 	... 21 more
18:04:11 [2021-02-03T23:04:11.781Z] 
18:04:11 [2021-02-03T23:04:11.781Z] !ENTRY org.eclipse.equinox.registry 4 1 2021-02-03 23:04:11.724
18:04:11 [2021-02-03T23:04:11.781Z] !MESSAGE Plug-in "org.eclipse.ui.ide" was unable to instantiate class "org.eclipse.ui.internal.ide.LinkedResourceDecorator".
18:04:11 [2021-02-03T23:04:11.781Z] !STACK 0
18:04:11 [2021-02-03T23:04:11.781Z] java.lang.ExceptionInInitializerError
18:04:11 [2021-02-03T23:04:11.781Z] 	at sun.reflect.NativeConstructorAccessorImpl.newInstance0(Native Method)
18:04:11 [2021-02-03T23:04:11.781Z] 	at sun.reflect.NativeConstructorAccessorImpl.newInstance(NativeConstructorAccessorImpl.java:62)
18:04:11 [2021-02-03T23:04:11.781Z] 	at sun.reflect.DelegatingConstructorAccessorImpl.newInstance(DelegatingConstructorAccessorImpl.java:45)
18:04:11 [2021-02-03T23:04:11.781Z] 	at java.lang.reflect.Constructor.newInstance(Constructor.java:423)
18:04:11 [2021-02-03T23:04:11.781Z] 	at java.lang.Class.newInstance(Class.java:442)
18:04:11 [2021-02-03T23:04:11.781Z] 	at org.eclipse.core.internal.registry.osgi.RegistryStrategyOSGI.createExecutableExtension(RegistryStrategyOSGI.java:184)
18:04:11 [2021-02-03T23:04:11.781Z] 	at org.eclipse.core.internal.registry.ExtensionRegistry.createExecutableExtension(ExtensionRegistry.java:905)
18:04:11 [2021-02-03T23:04:11.781Z] 	at org.eclipse.core.internal.registry.ConfigurationElement.createExecutableExtension(ConfigurationElement.java:243)
18:04:11 [2021-02-03T23:04:11.781Z] 	at org.eclipse.core.internal.registry.ConfigurationElementHandle.createExecutableExtension(ConfigurationElementHandle.java:55)
18:04:11 [2021-02-03T23:04:11.781Z] 	at org.eclipse.ui.internal.WorkbenchPlugin.createExtension(WorkbenchPlugin.java:281)
18:04:11 [2021-02-03T23:04:11.781Z] 	at org.eclipse.ui.internal.decorators.LightweightDecoratorDefinition$1.run(LightweightDecoratorDefinition.java:125)
18:04:11 [2021-02-03T23:04:11.781Z] 	at org.eclipse.core.runtime.SafeRunner.run(SafeRunner.java:42)
18:04:11 [2021-02-03T23:04:11.781Z] 	at org.eclipse.ui.internal.decorators.LightweightDecoratorDefinition.internalGetDecorator(LightweightDecoratorDefinition.java:120)
18:04:11 [2021-02-03T23:04:11.781Z] 	at org.eclipse.ui.internal.decorators.LightweightDecoratorDefinition.decorate(LightweightDecoratorDefinition.java:242)
18:04:11 [2021-02-03T23:04:11.781Z] 	at org.eclipse.ui.internal.decorators.LightweightDecoratorManager$LightweightRunnable.run(LightweightDecoratorManager.java:104)
18:04:11 [2021-02-03T23:04:11.781Z] 	at org.eclipse.core.runtime.SafeRunner.run(SafeRunner.java:42)
18:04:11 [2021-02-03T23:04:11.781Z] 	at org.eclipse.ui.internal.decorators.LightweightDecoratorManager.decorate(LightweightDecoratorManager.java:377)
18:04:11 [2021-02-03T23:04:11.781Z] 	at org.eclipse.ui.internal.decorators.LightweightDecoratorManager.getDecorations(LightweightDecoratorManager.java:359)
18:04:11 [2021-02-03T23:04:11.781Z] 	at org.eclipse.ui.internal.decorators.DecorationScheduler$1.ensureResultCached(DecorationScheduler.java:347)
18:04:11 [2021-02-03T23:04:11.781Z] 	at org.eclipse.ui.internal.decorators.DecorationScheduler$1.run(DecorationScheduler.java:311)
18:04:11 [2021-02-03T23:04:11.781Z] 	at org.eclipse.core.internal.jobs.Worker.run(Worker.java:56)
18:04:11 [2021-02-03T23:04:11.781Z] Caused by: java.lang.NullPointerException
18:04:11 [2021-02-03T23:04:11.781Z] 	at org.eclipse.ui.plugin.AbstractUIPlugin.imageDescriptorFromPlugin(AbstractUIPlugin.java:664)
18:04:11 [2021-02-03T23:04:11.781Z] 	at org.eclipse.ui.internal.ide.LinkedResourceDecorator.<clinit>(LinkedResourceDecorator.java:37)
18:04:11 [2021-02-03T23:04:11.781Z] 	... 21 more
18:04:11 [2021-02-03T23:04:11.781Z] 
18:04:11 [2021-02-03T23:04:11.781Z] !ENTRY org.eclipse.ui 4 0 2021-02-03 23:04:11.724
18:04:11 [2021-02-03T23:04:11.781Z] !MESSAGE Error occurred during status handling
18:04:11 [2021-02-03T23:04:11.781Z] !STACK 0
18:04:11 [2021-02-03T23:04:11.781Z] java.lang.NullPointerException
18:04:11 [2021-02-03T23:04:11.781Z] 	at org.eclipse.ui.internal.statushandlers.StatusHandlerRegistry.<init>(StatusHandlerRegistry.java:71)
18:04:11 [2021-02-03T23:04:11.781Z] 	at org.eclipse.ui.internal.statushandlers.StatusHandlerRegistry.getDefault(StatusHandlerRegistry.java:90)
18:04:11 [2021-02-03T23:04:11.781Z] 	at org.eclipse.ui.statushandlers.StatusManager.getStatusHandler(StatusManager.java:152)
18:04:11 [2021-02-03T23:04:11.781Z] 	at org.eclipse.ui.statushandlers.StatusManager.handle(StatusManager.java:211)
18:04:11 [2021-02-03T23:04:11.781Z] 	at org.eclipse.ui.statushandlers.StatusManager.handle(StatusManager.java:260)
18:04:11 [2021-02-03T23:04:11.781Z] 	at org.eclipse.ui.statushandlers.StatusManager$StatusManagerLogListener.logging(StatusManager.java:331)
18:04:11 [2021-02-03T23:04:11.781Z] 	at org.eclipse.core.internal.runtime.RuntimeLog.logToListeners(RuntimeLog.java:161)
18:04:11 [2021-02-03T23:04:11.781Z] 	at org.eclipse.core.internal.runtime.PlatformLogWriter.logged(PlatformLogWriter.java:103)
18:04:11 [2021-02-03T23:04:11.781Z] 	at org.eclipse.osgi.internal.log.ExtendedLogReaderServiceFactory.safeLogged(ExtendedLogReaderServiceFactory.java:88)
18:04:11 [2021-02-03T23:04:11.781Z] 	at org.eclipse.osgi.internal.log.ExtendedLogReaderServiceFactory.logPrivileged(ExtendedLogReaderServiceFactory.java:217)
18:04:11 [2021-02-03T23:04:11.781Z] 	at org.eclipse.osgi.internal.log.ExtendedLogReaderServiceFactory.log(ExtendedLogReaderServiceFactory.java:189)
18:04:11 [2021-02-03T23:04:11.781Z] 	at org.eclipse.osgi.internal.log.ExtendedLogServiceFactory.log(ExtendedLogServiceFactory.java:65)
18:04:11 [2021-02-03T23:04:11.781Z] 	at org.eclipse.osgi.internal.log.ExtendedLogServiceImpl.log(ExtendedLogServiceImpl.java:87)
18:04:11 [2021-02-03T23:04:11.781Z] 	at org.eclipse.osgi.internal.log.LoggerImpl.log(LoggerImpl.java:54)
18:04:11 [2021-02-03T23:04:11.781Z] 	at org.eclipse.core.internal.runtime.Log.log(Log.java:65)
18:04:11 [2021-02-03T23:04:11.781Z] 	at org.eclipse.ui.internal.WorkbenchPlugin.log(WorkbenchPlugin.java:663)
18:04:11 [2021-02-03T23:04:11.781Z] 	at org.eclipse.ui.internal.decorators.DecoratorDefinition.handleCoreException(DecoratorDefinition.java:266)
18:04:11 [2021-02-03T23:04:11.781Z] 	at org.eclipse.ui.internal.decorators.LightweightDecoratorDefinition.decorate(LightweightDecoratorDefinition.java:263)
18:04:11 [2021-02-03T23:04:11.782Z] 	at org.eclipse.ui.internal.decorators.LightweightDecoratorManager$LightweightRunnable.run(LightweightDecoratorManager.java:104)
18:04:11 [2021-02-03T23:04:11.782Z] 	at org.eclipse.core.runtime.SafeRunner.run(SafeRunner.java:42)
18:04:11 [2021-02-03T23:04:11.782Z] 	at org.eclipse.ui.internal.decorators.LightweightDecoratorManager.decorate(LightweightDecoratorManager.java:377)
18:04:11 [2021-02-03T23:04:11.782Z] 	at org.eclipse.ui.internal.decorators.LightweightDecoratorManager.getDecorations(LightweightDecoratorManager.java:359)
18:04:11 [2021-02-03T23:04:11.782Z] 	at org.eclipse.ui.internal.decorators.DecorationScheduler$1.ensureResultCached(DecorationScheduler.java:347)
18:04:11 [2021-02-03T23:04:11.782Z] 	at org.eclipse.ui.internal.decorators.DecorationScheduler$1.run(DecorationScheduler.java:311)
18:04:11 [2021-02-03T23:04:11.782Z] 	at org.eclipse.core.internal.jobs.Worker.run(Worker.java:56)
18:04:11 [2021-02-03T23:04:11.782Z] 
18:04:11 [2021-02-03T23:04:11.782Z] !ENTRY org.eclipse.equinox.registry 4 1 2021-02-03 23:04:11.725
18:04:11 [2021-02-03T23:04:11.782Z] !MESSAGE Plug-in "org.eclipse.ui.ide" was unable to instantiate class "org.eclipse.ui.internal.ide.VirtualResourceDecorator".
18:04:11 [2021-02-03T23:04:11.782Z] !STACK 0
18:04:11 [2021-02-03T23:04:11.782Z] java.lang.ExceptionInInitializerError
18:04:11 [2021-02-03T23:04:11.782Z] 	at sun.reflect.NativeConstructorAccessorImpl.newInstance0(Native Method)
18:04:11 [2021-02-03T23:04:11.782Z] 	at sun.reflect.NativeConstructorAccessorImpl.newInstance(NativeConstructorAccessorImpl.java:62)
18:04:11 [2021-02-03T23:04:11.782Z] 	at sun.reflect.DelegatingConstructorAccessorImpl.newInstance(DelegatingConstructorAccessorImpl.java:45)
18:04:11 [2021-02-03T23:04:11.782Z] 	at java.lang.reflect.Constructor.newInstance(Constructor.java:423)
18:04:11 [2021-02-03T23:04:11.782Z] 	at java.lang.Class.newInstance(Class.java:442)
18:04:11 [2021-02-03T23:04:11.782Z] 	at org.eclipse.core.internal.registry.osgi.RegistryStrategyOSGI.createExecutableExtension(RegistryStrategyOSGI.java:184)
18:04:11 [2021-02-03T23:04:11.782Z] 	at org.eclipse.core.internal.registry.ExtensionRegistry.createExecutableExtension(ExtensionRegistry.java:905)
18:04:11 [2021-02-03T23:04:11.782Z] 	at org.eclipse.core.internal.registry.ConfigurationElement.createExecutableExtension(ConfigurationElement.java:243)
18:04:11 [2021-02-03T23:04:11.782Z] 	at org.eclipse.core.internal.registry.ConfigurationElementHandle.createExecutableExtension(ConfigurationElementHandle.java:55)
18:04:11 [2021-02-03T23:04:11.782Z] 	at org.eclipse.ui.internal.WorkbenchPlugin.createExtension(WorkbenchPlugin.java:281)
18:04:11 [2021-02-03T23:04:11.782Z] 	at org.eclipse.ui.internal.decorators.LightweightDecoratorDefinition$1.run(LightweightDecoratorDefinition.java:125)
18:04:11 [2021-02-03T23:04:11.782Z] 	at org.eclipse.core.runtime.SafeRunner.run(SafeRunner.java:42)
18:04:11 [2021-02-03T23:04:11.782Z] 	at org.eclipse.ui.internal.decorators.LightweightDecoratorDefinition.internalGetDecorator(LightweightDecoratorDefinition.java:120)
18:04:11 [2021-02-03T23:04:11.782Z] 	at org.eclipse.ui.internal.decorators.LightweightDecoratorDefinition.decorate(LightweightDecoratorDefinition.java:242)
18:04:11 [2021-02-03T23:04:11.782Z] 	at org.eclipse.ui.internal.decorators.LightweightDecoratorManager$LightweightRunnable.run(LightweightDecoratorManager.java:104)
18:04:11 [2021-02-03T23:04:11.782Z] 	at org.eclipse.core.runtime.SafeRunner.run(SafeRunner.java:42)
18:04:11 [2021-02-03T23:04:11.782Z] 	at org.eclipse.ui.internal.decorators.LightweightDecoratorManager.decorate(LightweightDecoratorManager.java:377)
18:04:11 [2021-02-03T23:04:11.782Z] 	at org.eclipse.ui.internal.decorators.LightweightDecoratorManager.getDecorations(LightweightDecoratorManager.java:359)
18:04:11 [2021-02-03T23:04:11.782Z] 	at org.eclipse.ui.internal.decorators.DecorationScheduler$1.ensureResultCached(DecorationScheduler.java:347)
18:04:11 [2021-02-03T23:04:11.782Z] 	at org.eclipse.ui.internal.decorators.DecorationScheduler$1.run(DecorationScheduler.java:311)
18:04:11 [2021-02-03T23:04:11.782Z] 	at org.eclipse.core.internal.jobs.Worker.run(Worker.java:56)
18:04:11 [2021-02-03T23:04:11.782Z] Caused by: java.lang.NullPointerException
18:04:11 [2021-02-03T23:04:11.782Z] 	at org.eclipse.ui.plugin.AbstractUIPlugin.imageDescriptorFromPlugin(AbstractUIPlugin.java:664)
18:04:11 [2021-02-03T23:04:11.782Z] 	at org.eclipse.ui.internal.ide.VirtualResourceDecorator.<clinit>(VirtualResourceDecorator.java:30)
18:04:11 [2021-02-03T23:04:11.782Z] 	... 21 more
18:04:11 [2021-02-03T23:04:11.782Z] 
18:04:11 [2021-02-03T23:04:11.782Z] !ENTRY org.eclipse.equinox.registry 4 1 2021-02-03 23:04:11.725
18:04:11 [2021-02-03T23:04:11.782Z] !MESSAGE Plug-in "org.eclipse.ui.ide" was unable to instantiate class "org.eclipse.ui.internal.ide.VirtualResourceDecorator".
18:04:11 [2021-02-03T23:04:11.782Z] !STACK 0
18:04:11 [2021-02-03T23:04:11.782Z] java.lang.ExceptionInInitializerError
18:04:11 [2021-02-03T23:04:11.782Z] 	at sun.reflect.NativeConstructorAccessorImpl.newInstance0(Native Method)
18:04:11 [2021-02-03T23:04:11.782Z] 	at sun.reflect.NativeConstructorAccessorImpl.newInstance(NativeConstructorAccessorImpl.java:62)
18:04:11 [2021-02-03T23:04:11.782Z] 	at sun.reflect.DelegatingConstructorAccessorImpl.newInstance(DelegatingConstructorAccessorImpl.java:45)
18:04:11 [2021-02-03T23:04:11.782Z] 	at java.lang.reflect.Constructor.newInstance(Constructor.java:423)
18:04:11 [2021-02-03T23:04:11.782Z] 	at java.lang.Class.newInstance(Class.java:442)
18:04:11 [2021-02-03T23:04:11.782Z] 	at org.eclipse.core.internal.registry.osgi.RegistryStrategyOSGI.createExecutableExtension(RegistryStrategyOSGI.java:184)
18:04:11 [2021-02-03T23:04:11.782Z] 	at org.eclipse.core.internal.registry.ExtensionRegistry.createExecutableExtension(ExtensionRegistry.java:905)
18:04:11 [2021-02-03T23:04:11.782Z] 	at org.eclipse.core.internal.registry.ConfigurationElement.createExecutableExtension(ConfigurationElement.java:243)
18:04:11 [2021-02-03T23:04:11.782Z] 	at org.eclipse.core.internal.registry.ConfigurationElementHandle.createExecutableExtension(ConfigurationElementHandle.java:55)
18:04:11 [2021-02-03T23:04:11.782Z] 	at org.eclipse.ui.internal.WorkbenchPlugin.createExtension(WorkbenchPlugin.java:281)
18:04:11 [2021-02-03T23:04:11.782Z] 	at org.eclipse.ui.internal.decorators.LightweightDecoratorDefinition$1.run(LightweightDecoratorDefinition.java:125)
18:04:11 [2021-02-03T23:04:11.782Z] 	at org.eclipse.core.runtime.SafeRunner.run(SafeRunner.java:42)
18:04:11 [2021-02-03T23:04:11.782Z] 	at org.eclipse.ui.internal.decorators.LightweightDecoratorDefinition.internalGetDecorator(LightweightDecoratorDefinition.java:120)
18:04:11 [2021-02-03T23:04:11.782Z] 	at org.eclipse.ui.internal.decorators.LightweightDecoratorDefinition.decorate(LightweightDecoratorDefinition.java:242)
18:04:11 [2021-02-03T23:04:11.782Z] 	at org.eclipse.ui.internal.decorators.LightweightDecoratorManager$LightweightRunnable.run(LightweightDecoratorManager.java:104)
18:04:11 [2021-02-03T23:04:11.782Z] 	at org.eclipse.core.runtime.SafeRunner.run(SafeRunner.java:42)
18:04:11 [2021-02-03T23:04:11.782Z] 	at org.eclipse.ui.internal.decorators.LightweightDecoratorManager.decorate(LightweightDecoratorManager.java:377)
18:04:11 [2021-02-03T23:04:11.782Z] 	at org.eclipse.ui.internal.decorators.LightweightDecoratorManager.getDecorations(LightweightDecoratorManager.java:359)
18:04:11 [2021-02-03T23:04:11.782Z] 	at org.eclipse.ui.internal.decorators.DecorationScheduler$1.ensureResultCached(DecorationScheduler.java:347)
18:04:11 [2021-02-03T23:04:11.782Z] 	at org.eclipse.ui.internal.decorators.DecorationScheduler$1.run(DecorationScheduler.java:311)
18:04:11 [2021-02-03T23:04:11.782Z] 	at org.eclipse.core.internal.jobs.Worker.run(Worker.java:56)
18:04:11 [2021-02-03T23:04:11.782Z] Caused by: java.lang.NullPointerException
18:04:11 [2021-02-03T23:04:11.782Z] 	at org.eclipse.ui.plugin.AbstractUIPlugin.imageDescriptorFromPlugin(AbstractUIPlugin.java:664)
18:04:11 [2021-02-03T23:04:11.782Z] 	at org.eclipse.ui.internal.ide.VirtualResourceDecorator.<clinit>(VirtualResourceDecorator.java:30)
18:04:11 [2021-02-03T23:04:11.782Z] 	... 21 more
18:04:11 [2021-02-03T23:04:11.782Z] 
18:04:11 [2021-02-03T23:04:11.782Z] !ENTRY org.eclipse.ui 4 0 2021-02-03 23:04:11.725
18:04:11 [2021-02-03T23:04:11.782Z] !MESSAGE Error occurred during status handling
18:04:11 [2021-02-03T23:04:11.782Z] !STACK 0
18:04:11 [2021-02-03T23:04:11.782Z] java.lang.NullPointerException
18:04:11 [2021-02-03T23:04:11.782Z] 	at org.eclipse.ui.internal.statushandlers.StatusHandlerRegistry.<init>(StatusHandlerRegistry.java:71)
18:04:11 [2021-02-03T23:04:11.783Z] 	at org.eclipse.ui.internal.statushandlers.StatusHandlerRegistry.getDefault(StatusHandlerRegistry.java:90)
18:04:11 [2021-02-03T23:04:11.783Z] 	at org.eclipse.ui.statushandlers.StatusManager.getStatusHandler(StatusManager.java:152)
18:04:11 [2021-02-03T23:04:11.783Z] 	at org.eclipse.ui.statushandlers.StatusManager.handle(StatusManager.java:211)
18:04:11 [2021-02-03T23:04:11.783Z] 	at org.eclipse.ui.statushandlers.StatusManager.handle(StatusManager.java:260)
18:04:11 [2021-02-03T23:04:11.783Z] 	at org.eclipse.ui.statushandlers.StatusManager$StatusManagerLogListener.logging(StatusManager.java:331)
18:04:11 [2021-02-03T23:04:11.783Z] 	at org.eclipse.core.internal.runtime.RuntimeLog.logToListeners(RuntimeLog.java:161)
18:04:11 [2021-02-03T23:04:11.783Z] 	at org.eclipse.core.internal.runtime.PlatformLogWriter.logged(PlatformLogWriter.java:103)
18:04:11 [2021-02-03T23:04:11.783Z] 	at org.eclipse.osgi.internal.log.ExtendedLogReaderServiceFactory.safeLogged(ExtendedLogReaderServiceFactory.java:88)
18:04:11 [2021-02-03T23:04:11.783Z] 	at org.eclipse.osgi.internal.log.ExtendedLogReaderServiceFactory.logPrivileged(ExtendedLogReaderServiceFactory.java:217)
18:04:11 [2021-02-03T23:04:11.783Z] 	at org.eclipse.osgi.internal.log.ExtendedLogReaderServiceFactory.log(ExtendedLogReaderServiceFactory.java:189)
18:04:11 [2021-02-03T23:04:11.783Z] 	at org.eclipse.osgi.internal.log.ExtendedLogServiceFactory.log(ExtendedLogServiceFactory.java:65)
18:04:11 [2021-02-03T23:04:11.783Z] 	at org.eclipse.osgi.internal.log.ExtendedLogServiceImpl.log(ExtendedLogServiceImpl.java:87)
18:04:11 [2021-02-03T23:04:11.783Z] 	at org.eclipse.osgi.internal.log.LoggerImpl.log(LoggerImpl.java:54)
18:04:11 [2021-02-03T23:04:11.783Z] 	at org.eclipse.core.internal.runtime.Log.log(Log.java:65)
18:04:11 [2021-02-03T23:04:11.783Z] 	at org.eclipse.ui.internal.WorkbenchPlugin.log(WorkbenchPlugin.java:663)
18:04:11 [2021-02-03T23:04:11.783Z] 	at org.eclipse.ui.internal.decorators.DecoratorDefinition.handleCoreException(DecoratorDefinition.java:266)
18:04:11 [2021-02-03T23:04:11.783Z] 	at org.eclipse.ui.internal.decorators.LightweightDecoratorDefinition.decorate(LightweightDecoratorDefinition.java:263)
18:04:11 [2021-02-03T23:04:11.783Z] 	at org.eclipse.ui.internal.decorators.LightweightDecoratorManager$LightweightRunnable.run(LightweightDecoratorManager.java:104)
18:04:11 [2021-02-03T23:04:11.783Z] 	at org.eclipse.core.runtime.SafeRunner.run(SafeRunner.java:42)
18:04:11 [2021-02-03T23:04:11.783Z] 	at org.eclipse.ui.internal.decorators.LightweightDecoratorManager.decorate(LightweightDecoratorManager.java:377)
18:04:11 [2021-02-03T23:04:11.783Z] 	at org.eclipse.ui.internal.decorators.LightweightDecoratorManager.getDecorations(LightweightDecoratorManager.java:359)
18:04:11 [2021-02-03T23:04:11.783Z] 	at org.eclipse.ui.internal.decorators.DecorationScheduler$1.ensureResultCached(DecorationScheduler.java:347)
18:04:11 [2021-02-03T23:04:11.783Z] 	at org.eclipse.ui.internal.decorators.DecorationScheduler$1.run(DecorationScheduler.java:311)
18:04:11 [2021-02-03T23:04:11.783Z] 	at org.eclipse.core.internal.jobs.Worker.run(Worker.java:56)
18:04:11 [2021-02-03T23:04:11.783Z] 
18:04:11 [2021-02-03T23:04:11.783Z] !ENTRY org.eclipse.ui.workbench 4 2 2021-02-03 23:04:11.727
18:04:11 [2021-02-03T23:04:11.783Z] !MESSAGE Problems occurred when invoking code from plug-in: "org.eclipse.ui.workbench".
18:04:11 [2021-02-03T23:04:11.783Z] !STACK 0
18:04:11 [2021-02-03T23:04:11.783Z] java.lang.IllegalArgumentException
18:04:11 [2021-02-03T23:04:11.783Z] 	at org.eclipse.core.runtime.ListenerList.add(ListenerList.java:115)
18:04:11 [2021-02-03T23:04:11.783Z] 	at org.eclipse.jdt.internal.ui.AbstractJavaElementLabelDecorator.addListener(AbstractJavaElementLabelDecorator.java:59)
18:04:11 [2021-02-03T23:04:11.783Z] 	at org.eclipse.ui.internal.decorators.LightweightDecoratorDefinition$1.run(LightweightDecoratorDefinition.java:127)
18:04:11 [2021-02-03T23:04:11.783Z] 	at org.eclipse.core.runtime.SafeRunner.run(SafeRunner.java:42)
18:04:11 [2021-02-03T23:04:11.783Z] 	at org.eclipse.ui.internal.decorators.LightweightDecoratorDefinition.internalGetDecorator(LightweightDecoratorDefinition.java:120)
18:04:11 [2021-02-03T23:04:11.783Z] 	at org.eclipse.ui.internal.decorators.LightweightDecoratorDefinition.decorate(LightweightDecoratorDefinition.java:242)
18:04:11 [2021-02-03T23:04:11.783Z] 	at org.eclipse.ui.internal.decorators.LightweightDecoratorManager$LightweightRunnable.run(LightweightDecoratorManager.java:104)
18:04:11 [2021-02-03T23:04:11.783Z] 	at org.eclipse.core.runtime.SafeRunner.run(SafeRunner.java:42)
18:04:11 [2021-02-03T23:04:11.783Z] 	at org.eclipse.ui.internal.decorators.LightweightDecoratorManager.decorate(LightweightDecoratorManager.java:377)
18:04:11 [2021-02-03T23:04:11.783Z] 	at org.eclipse.ui.internal.decorators.LightweightDecoratorManager.getDecorations(LightweightDecoratorManager.java:359)
18:04:11 [2021-02-03T23:04:11.783Z] 	at org.eclipse.ui.internal.decorators.DecorationScheduler$1.ensureResultCached(DecorationScheduler.java:347)
18:04:11 [2021-02-03T23:04:11.783Z] 	at org.eclipse.ui.internal.decorators.DecorationScheduler$1.run(DecorationScheduler.java:311)
18:04:11 [2021-02-03T23:04:11.783Z] 	at org.eclipse.core.internal.jobs.Worker.run(Worker.java:56)
18:04:11 [2021-02-03T23:04:11.783Z] 
18:04:11 [2021-02-03T23:04:11.783Z] !ENTRY org.eclipse.ui.workbench 4 2 2021-02-03 23:04:11.727
18:04:11 [2021-02-03T23:04:11.783Z] !MESSAGE Problems occurred when invoking code from plug-in: "org.eclipse.ui.workbench".
18:04:11 [2021-02-03T23:04:11.783Z] !STACK 0
18:04:11 [2021-02-03T23:04:11.783Z] java.lang.IllegalArgumentException
18:04:11 [2021-02-03T23:04:11.783Z] 	at org.eclipse.core.runtime.ListenerList.add(ListenerList.java:115)
18:04:11 [2021-02-03T23:04:11.783Z] 	at org.eclipse.jdt.internal.ui.AbstractJavaElementLabelDecorator.addListener(AbstractJavaElementLabelDecorator.java:59)
18:04:11 [2021-02-03T23:04:11.783Z] 	at org.eclipse.ui.internal.decorators.LightweightDecoratorDefinition$1.run(LightweightDecoratorDefinition.java:127)
18:04:11 [2021-02-03T23:04:11.783Z] 	at org.eclipse.core.runtime.SafeRunner.run(SafeRunner.java:42)
18:04:11 [2021-02-03T23:04:11.783Z] 	at org.eclipse.ui.internal.decorators.LightweightDecoratorDefinition.internalGetDecorator(LightweightDecoratorDefinition.java:120)
18:04:11 [2021-02-03T23:04:11.783Z] 	at org.eclipse.ui.internal.decorators.LightweightDecoratorDefinition.decorate(LightweightDecoratorDefinition.java:242)
18:04:11 [2021-02-03T23:04:11.783Z] 	at org.eclipse.ui.internal.decorators.LightweightDecoratorManager$LightweightRunnable.run(LightweightDecoratorManager.java:104)
18:04:11 [2021-02-03T23:04:11.783Z] 	at org.eclipse.core.runtime.SafeRunner.run(SafeRunner.java:42)
18:04:11 [2021-02-03T23:04:11.783Z] 	at org.eclipse.ui.internal.decorators.LightweightDecoratorManager.decorate(LightweightDecoratorManager.java:377)
18:04:11 [2021-02-03T23:04:11.783Z] 	at org.eclipse.ui.internal.decorators.LightweightDecoratorManager.getDecorations(LightweightDecoratorManager.java:359)
18:04:11 [2021-02-03T23:04:11.783Z] 	at org.eclipse.ui.internal.decorators.DecorationScheduler$1.ensureResultCached(DecorationScheduler.java:347)
18:04:11 [2021-02-03T23:04:11.783Z] 	at org.eclipse.ui.internal.decorators.DecorationScheduler$1.run(DecorationScheduler.java:311)
18:04:11 [2021-02-03T23:04:11.783Z] 	at org.eclipse.core.internal.jobs.Worker.run(Worker.java:56)
18:04:11 [2021-02-03T23:04:11.783Z] 
18:04:11 [2021-02-03T23:04:11.783Z] !ENTRY org.eclipse.ui 4 0 2021-02-03 23:04:11.727
18:04:11 [2021-02-03T23:04:11.783Z] !MESSAGE Error occurred during status handling
18:04:11 [2021-02-03T23:04:11.783Z] !STACK 0
18:04:11 [2021-02-03T23:04:11.783Z] java.lang.NullPointerException
18:04:11 [2021-02-03T23:04:11.783Z] 	at org.eclipse.ui.internal.statushandlers.StatusHandlerRegistry.<init>(StatusHandlerRegistry.java:71)
18:04:11 [2021-02-03T23:04:11.783Z] 	at org.eclipse.ui.internal.statushandlers.StatusHandlerRegistry.getDefault(StatusHandlerRegistry.java:90)
18:04:11 [2021-02-03T23:04:11.783Z] 	at org.eclipse.ui.statushandlers.StatusManager.getStatusHandler(StatusManager.java:152)
18:04:11 [2021-02-03T23:04:11.783Z] 	at org.eclipse.ui.statushandlers.StatusManager.handle(StatusManager.java:211)
18:04:11 [2021-02-03T23:04:11.783Z] 	at org.eclipse.ui.statushandlers.StatusManager.handle(StatusManager.java:260)
18:04:11 [2021-02-03T23:04:11.783Z] 	at org.eclipse.ui.statushandlers.StatusManager$StatusManagerLogListener.logging(StatusManager.java:331)
18:04:11 [2021-02-03T23:04:11.783Z] 	at org.eclipse.core.internal.runtime.RuntimeLog.logToListeners(RuntimeLog.java:161)
18:04:11 [2021-02-03T23:04:11.783Z] 	at org.eclipse.core.internal.runtime.PlatformLogWriter.logged(PlatformLogWriter.java:103)
18:04:11 [2021-02-03T23:04:11.783Z] 	at org.eclipse.osgi.internal.log.ExtendedLogReaderServiceFactory.safeLogged(ExtendedLogReaderServiceFactory.java:88)
18:04:11 [2021-02-03T23:04:11.783Z] 	at org.eclipse.osgi.internal.log.ExtendedLogReaderServiceFactory.logPrivileged(ExtendedLogReaderServiceFactory.java:217)
18:04:11 [2021-02-03T23:04:11.784Z] 	at org.eclipse.osgi.internal.log.ExtendedLogReaderServiceFactory.log(ExtendedLogReaderServiceFactory.java:189)
18:04:11 [2021-02-03T23:04:11.784Z] 	at org.eclipse.osgi.internal.log.ExtendedLogServiceFactory.log(ExtendedLogServiceFactory.java:65)
18:04:11 [2021-02-03T23:04:11.784Z] 	at org.eclipse.osgi.internal.log.ExtendedLogServiceImpl.log(ExtendedLogServiceImpl.java:87)
18:04:11 [2021-02-03T23:04:11.784Z] 	at org.eclipse.osgi.internal.log.LoggerImpl.log(LoggerImpl.java:54)
18:04:11 [2021-02-03T23:04:11.784Z] 	at org.eclipse.core.internal.runtime.PlatformLogWriter.logging(PlatformLogWriter.java:44)
18:04:11 [2021-02-03T23:04:11.784Z] 	at org.eclipse.core.internal.runtime.RuntimeLog.log(RuntimeLog.java:97)
18:04:11 [2021-02-03T23:04:11.784Z] 	at org.eclipse.core.runtime.SafeRunner.handleException(SafeRunner.java:71)
18:04:11 [2021-02-03T23:04:11.784Z] 	at org.eclipse.core.runtime.SafeRunner.run(SafeRunner.java:44)
18:04:11 [2021-02-03T23:04:11.784Z] 	at org.eclipse.ui.internal.decorators.LightweightDecoratorDefinition.internalGetDecorator(LightweightDecoratorDefinition.java:120)
18:04:11 [2021-02-03T23:04:11.784Z] 	at org.eclipse.ui.internal.decorators.LightweightDecoratorDefinition.decorate(LightweightDecoratorDefinition.java:242)
18:04:11 [2021-02-03T23:04:11.784Z] 	at org.eclipse.ui.internal.decorators.LightweightDecoratorManager$LightweightRunnable.run(LightweightDecoratorManager.java:104)
18:04:11 [2021-02-03T23:04:11.784Z] 	at org.eclipse.core.runtime.SafeRunner.run(SafeRunner.java:42)
18:04:11 [2021-02-03T23:04:11.784Z] 	at org.eclipse.ui.internal.decorators.LightweightDecoratorManager.decorate(LightweightDecoratorManager.java:377)
18:04:11 [2021-02-03T23:04:11.784Z] 	at org.eclipse.ui.internal.decorators.LightweightDecoratorManager.getDecorations(LightweightDecoratorManager.java:359)
18:04:11 [2021-02-03T23:04:11.784Z] 	at org.eclipse.ui.internal.decorators.DecorationScheduler$1.ensureResultCached(DecorationScheduler.java:347)
18:04:11 [2021-02-03T23:04:11.784Z] 	at org.eclipse.ui.internal.decorators.DecorationScheduler$1.run(DecorationScheduler.java:311)
18:04:11 [2021-02-03T23:04:11.784Z] 	at org.eclipse.core.internal.jobs.Worker.run(Worker.java:56)
18:04:12 [2021-02-03T23:04:12.347Z] 
18:04:12 [2021-02-03T23:04:12.347Z] !ENTRY org.eclipse.equinox.registry 4 1 2021-02-03 23:04:12.134
18:04:12 [2021-02-03T23:04:12.347Z] !MESSAGE Plug-in "org.eclipse.egit.ui" was unable to instantiate class "org.eclipse.egit.ui.internal.decorators.GitLightweightDecorator".
18:04:12 [2021-02-03T23:04:12.347Z] !STACK 0
18:04:12 [2021-02-03T23:04:12.347Z] org.eclipse.swt.SWTException: Device is disposed
18:04:12 [2021-02-03T23:04:12.347Z] 	at org.eclipse.swt.SWT.error(SWT.java:4533)
18:04:12 [2021-02-03T23:04:12.347Z] 	at org.eclipse.swt.SWT.error(SWT.java:4448)
18:04:12 [2021-02-03T23:04:12.347Z] 	at org.eclipse.swt.SWT.error(SWT.java:4419)
18:04:12 [2021-02-03T23:04:12.347Z] 	at org.eclipse.swt.widgets.Display.error(Display.java:1289)
18:04:12 [2021-02-03T23:04:12.347Z] 	at org.eclipse.swt.widgets.Display.syncExec(Display.java:5526)
18:04:12 [2021-02-03T23:04:12.347Z] 	at org.eclipse.egit.ui.internal.decorators.GitLightweightDecorator$ChangeTrackingColorsAndFonts.reload(GitLightweightDecorator.java:336)
18:04:12 [2021-02-03T23:04:12.347Z] 	at org.eclipse.egit.ui.internal.decorators.GitLightweightDecorator$ChangeTrackingColorsAndFonts.<init>(GitLightweightDecorator.java:331)
18:04:12 [2021-02-03T23:04:12.347Z] 	at org.eclipse.egit.ui.internal.decorators.GitLightweightDecorator.<init>(GitLightweightDecorator.java:125)
18:04:12 [2021-02-03T23:04:12.347Z] 	at sun.reflect.NativeConstructorAccessorImpl.newInstance0(Native Method)
18:04:12 [2021-02-03T23:04:12.347Z] 	at sun.reflect.NativeConstructorAccessorImpl.newInstance(NativeConstructorAccessorImpl.java:62)
18:04:12 [2021-02-03T23:04:12.347Z] 	at sun.reflect.DelegatingConstructorAccessorImpl.newInstance(DelegatingConstructorAccessorImpl.java:45)
18:04:12 [2021-02-03T23:04:12.347Z] 	at java.lang.reflect.Constructor.newInstance(Constructor.java:423)
18:04:12 [2021-02-03T23:04:12.347Z] 	at java.lang.Class.newInstance(Class.java:442)
18:04:12 [2021-02-03T23:04:12.347Z] 	at org.eclipse.core.internal.registry.osgi.RegistryStrategyOSGI.createExecutableExtension(RegistryStrategyOSGI.java:184)
18:04:12 [2021-02-03T23:04:12.347Z] 	at org.eclipse.core.internal.registry.ExtensionRegistry.createExecutableExtension(ExtensionRegistry.java:905)
18:04:12 [2021-02-03T23:04:12.347Z] 	at org.eclipse.core.internal.registry.ConfigurationElement.createExecutableExtension(ConfigurationElement.java:243)
18:04:12 [2021-02-03T23:04:12.347Z] 	at org.eclipse.core.internal.registry.ConfigurationElementHandle.createExecutableExtension(ConfigurationElementHandle.java:55)
18:04:12 [2021-02-03T23:04:12.347Z] 	at org.eclipse.ui.internal.WorkbenchPlugin.createExtension(WorkbenchPlugin.java:281)
18:04:12 [2021-02-03T23:04:12.347Z] 	at org.eclipse.ui.internal.decorators.LightweightDecoratorDefinition$1.run(LightweightDecoratorDefinition.java:125)
18:04:12 [2021-02-03T23:04:12.347Z] 	at org.eclipse.core.runtime.SafeRunner.run(SafeRunner.java:42)
18:04:12 [2021-02-03T23:04:12.347Z] 	at org.eclipse.ui.internal.decorators.LightweightDecoratorDefinition.internalGetDecorator(LightweightDecoratorDefinition.java:120)
18:04:12 [2021-02-03T23:04:12.347Z] 	at org.eclipse.ui.internal.decorators.LightweightDecoratorDefinition.decorate(LightweightDecoratorDefinition.java:242)
18:04:12 [2021-02-03T23:04:12.347Z] 	at org.eclipse.ui.internal.decorators.LightweightDecoratorManager$LightweightRunnable.run(LightweightDecoratorManager.java:104)
18:04:12 [2021-02-03T23:04:12.347Z] 	at org.eclipse.core.runtime.SafeRunner.run(SafeRunner.java:42)
18:04:12 [2021-02-03T23:04:12.347Z] 	at org.eclipse.ui.internal.decorators.LightweightDecoratorManager.decorate(LightweightDecoratorManager.java:377)
18:04:12 [2021-02-03T23:04:12.347Z] 	at org.eclipse.ui.internal.decorators.LightweightDecoratorManager.getDecorations(LightweightDecoratorManager.java:359)
18:04:12 [2021-02-03T23:04:12.347Z] 	at org.eclipse.ui.internal.decorators.DecorationScheduler$1.ensureResultCached(DecorationScheduler.java:347)
18:04:12 [2021-02-03T23:04:12.347Z] 	at org.eclipse.ui.internal.decorators.DecorationScheduler$1.run(DecorationScheduler.java:311)
18:04:12 [2021-02-03T23:04:12.347Z] 	at org.eclipse.core.internal.jobs.Worker.run(Worker.java:56)
18:04:12 [2021-02-03T23:04:12.347Z] 
18:04:12 [2021-02-03T23:04:12.347Z] !ENTRY org.eclipse.equinox.registry 4 1 2021-02-03 23:04:12.135
18:04:12 [2021-02-03T23:04:12.347Z] !MESSAGE Plug-in "org.eclipse.egit.ui" was unable to instantiate class "org.eclipse.egit.ui.internal.decorators.GitLightweightDecorator".
18:04:12 [2021-02-03T23:04:12.347Z] !STACK 0
18:04:12 [2021-02-03T23:04:12.347Z] org.eclipse.swt.SWTException: Device is disposed
18:04:12 [2021-02-03T23:04:12.348Z] 	at org.eclipse.swt.SWT.error(SWT.java:4533)
18:04:12 [2021-02-03T23:04:12.348Z] 	at org.eclipse.swt.SWT.error(SWT.java:4448)
18:04:12 [2021-02-03T23:04:12.348Z] 	at org.eclipse.swt.SWT.error(SWT.java:4419)
18:04:12 [2021-02-03T23:04:12.348Z] 	at org.eclipse.swt.widgets.Display.error(Display.java:1289)
18:04:12 [2021-02-03T23:04:12.348Z] 	at org.eclipse.swt.widgets.Display.syncExec(Display.java:5526)
18:04:12 [2021-02-03T23:04:12.348Z] 	at org.eclipse.egit.ui.internal.decorators.GitLightweightDecorator$ChangeTrackingColorsAndFonts.reload(GitLightweightDecorator.java:336)
18:04:12 [2021-02-03T23:04:12.348Z] 	at org.eclipse.egit.ui.internal.decorators.GitLightweightDecorator$ChangeTrackingColorsAndFonts.<init>(GitLightweightDecorator.java:331)
18:04:12 [2021-02-03T23:04:12.348Z] 	at org.eclipse.egit.ui.internal.decorators.GitLightweightDecorator.<init>(GitLightweightDecorator.java:125)
18:04:12 [2021-02-03T23:04:12.348Z] 	at sun.reflect.NativeConstructorAccessorImpl.newInstance0(Native Method)
18:04:12 [2021-02-03T23:04:12.348Z] 	at sun.reflect.NativeConstructorAccessorImpl.newInstance(NativeConstructorAccessorImpl.java:62)
18:04:12 [2021-02-03T23:04:12.348Z] 	at sun.reflect.DelegatingConstructorAccessorImpl.newInstance(DelegatingConstructorAccessorImpl.java:45)
18:04:12 [2021-02-03T23:04:12.348Z] 	at java.lang.reflect.Constructor.newInstance(Constructor.java:423)
18:04:12 [2021-02-03T23:04:12.348Z] 	at java.lang.Class.newInstance(Class.java:442)
18:04:12 [2021-02-03T23:04:12.348Z] 	at org.eclipse.core.internal.registry.osgi.RegistryStrategyOSGI.createExecutableExtension(RegistryStrategyOSGI.java:184)
18:04:12 [2021-02-03T23:04:12.348Z] 	at org.eclipse.core.internal.registry.ExtensionRegistry.createExecutableExtension(ExtensionRegistry.java:905)
18:04:12 [2021-02-03T23:04:12.348Z] 	at org.eclipse.core.internal.registry.ConfigurationElement.createExecutableExtension(ConfigurationElement.java:243)
18:04:12 [2021-02-03T23:04:12.348Z] 	at org.eclipse.core.internal.registry.ConfigurationElementHandle.createExecutableExtension(ConfigurationElementHandle.java:55)
18:04:12 [2021-02-03T23:04:12.348Z] 	at org.eclipse.ui.internal.WorkbenchPlugin.createExtension(WorkbenchPlugin.java:281)
18:04:12 [2021-02-03T23:04:12.348Z] 	at org.eclipse.ui.internal.decorators.LightweightDecoratorDefinition$1.run(LightweightDecoratorDefinition.java:125)
18:04:12 [2021-02-03T23:04:12.348Z] 	at org.eclipse.core.runtime.SafeRunner.run(SafeRunner.java:42)
18:04:12 [2021-02-03T23:04:12.348Z] 	at org.eclipse.ui.internal.decorators.LightweightDecoratorDefinition.internalGetDecorator(LightweightDecoratorDefinition.java:120)
18:04:12 [2021-02-03T23:04:12.348Z] 	at org.eclipse.ui.internal.decorators.LightweightDecoratorDefinition.decorate(LightweightDecoratorDefinition.java:242)
18:04:12 [2021-02-03T23:04:12.348Z] 	at org.eclipse.ui.internal.decorators.LightweightDecoratorManager$LightweightRunnable.run(LightweightDecoratorManager.java:104)
18:04:12 [2021-02-03T23:04:12.348Z] 	at org.eclipse.core.runtime.SafeRunner.run(SafeRunner.java:42)
18:04:12 [2021-02-03T23:04:12.348Z] 	at org.eclipse.ui.internal.decorators.LightweightDecoratorManager.decorate(LightweightDecoratorManager.java:377)
18:04:12 [2021-02-03T23:04:12.348Z] 	at org.eclipse.ui.internal.decorators.LightweightDecoratorManager.getDecorations(LightweightDecoratorManager.java:359)
18:04:12 [2021-02-03T23:04:12.348Z] 	at org.eclipse.ui.internal.decorators.DecorationScheduler$1.ensureResultCached(DecorationScheduler.java:347)
18:04:12 [2021-02-03T23:04:12.348Z] 	at org.eclipse.ui.internal.decorators.DecorationScheduler$1.run(DecorationScheduler.java:311)
18:04:12 [2021-02-03T23:04:12.348Z] 	at org.eclipse.core.internal.jobs.Worker.run(Worker.java:56)
18:04:12 [2021-02-03T23:04:12.348Z] 
18:04:12 [2021-02-03T23:04:12.348Z] !ENTRY org.eclipse.ui 4 0 2021-02-03 23:04:12.135
18:04:12 [2021-02-03T23:04:12.348Z] !MESSAGE Error occurred during status handling
18:04:12 [2021-02-03T23:04:12.348Z] !STACK 0
18:04:12 [2021-02-03T23:04:12.348Z] java.lang.NullPointerException
18:04:12 [2021-02-03T23:04:12.348Z] 	at org.eclipse.ui.internal.statushandlers.StatusHandlerRegistry.<init>(StatusHandlerRegistry.java:71)
18:04:12 [2021-02-03T23:04:12.348Z] 	at org.eclipse.ui.internal.statushandlers.StatusHandlerRegistry.getDefault(StatusHandlerRegistry.java:90)
18:04:12 [2021-02-03T23:04:12.348Z] 	at org.eclipse.ui.statushandlers.StatusManager.getStatusHandler(StatusManager.java:152)
18:04:12 [2021-02-03T23:04:12.348Z] 	at org.eclipse.ui.statushandlers.StatusManager.handle(StatusManager.java:211)
18:04:12 [2021-02-03T23:04:12.348Z] 	at org.eclipse.ui.statushandlers.StatusManager.handle(StatusManager.java:260)
18:04:12 [2021-02-03T23:04:12.348Z] 	at org.eclipse.ui.statushandlers.StatusManager$StatusManagerLogListener.logging(StatusManager.java:331)
18:04:12 [2021-02-03T23:04:12.348Z] 	at org.eclipse.core.internal.runtime.RuntimeLog.logToListeners(RuntimeLog.java:161)
18:04:12 [2021-02-03T23:04:12.348Z] 	at org.eclipse.core.internal.runtime.PlatformLogWriter.logged(PlatformLogWriter.java:103)
18:04:12 [2021-02-03T23:04:12.348Z] 	at org.eclipse.osgi.internal.log.ExtendedLogReaderServiceFactory.safeLogged(ExtendedLogReaderServiceFactory.java:88)
18:04:12 [2021-02-03T23:04:12.348Z] 	at org.eclipse.osgi.internal.log.ExtendedLogReaderServiceFactory.logPrivileged(ExtendedLogReaderServiceFactory.java:217)
18:04:12 [2021-02-03T23:04:12.348Z] 	at org.eclipse.osgi.internal.log.ExtendedLogReaderServiceFactory.log(ExtendedLogReaderServiceFactory.java:189)
18:04:12 [2021-02-03T23:04:12.348Z] 	at org.eclipse.osgi.internal.log.ExtendedLogServiceFactory.log(ExtendedLogServiceFactory.java:65)
18:04:12 [2021-02-03T23:04:12.348Z] 	at org.eclipse.osgi.internal.log.ExtendedLogServiceImpl.log(ExtendedLogServiceImpl.java:87)
18:04:12 [2021-02-03T23:04:12.348Z] 	at org.eclipse.osgi.internal.log.LoggerImpl.log(LoggerImpl.java:54)
18:04:12 [2021-02-03T23:04:12.348Z] 	at org.eclipse.core.internal.runtime.Log.log(Log.java:65)
18:04:12 [2021-02-03T23:04:12.348Z] 	at org.eclipse.ui.internal.WorkbenchPlugin.log(WorkbenchPlugin.java:663)
18:04:12 [2021-02-03T23:04:12.348Z] 	at org.eclipse.ui.internal.decorators.DecoratorDefinition.handleCoreException(DecoratorDefinition.java:266)
18:04:12 [2021-02-03T23:04:12.348Z] 	at org.eclipse.ui.internal.decorators.LightweightDecoratorDefinition.decorate(LightweightDecoratorDefinition.java:263)
18:04:12 [2021-02-03T23:04:12.348Z] 	at org.eclipse.ui.internal.decorators.LightweightDecoratorManager$LightweightRunnable.run(LightweightDecoratorManager.java:104)
18:04:12 [2021-02-03T23:04:12.348Z] 	at org.eclipse.core.runtime.SafeRunner.run(SafeRunner.java:42)
18:04:12 [2021-02-03T23:04:12.348Z] 	at org.eclipse.ui.internal.decorators.LightweightDecoratorManager.decorate(LightweightDecoratorManager.java:377)
18:04:12 [2021-02-03T23:04:12.348Z] 	at org.eclipse.ui.internal.decorators.LightweightDecoratorManager.getDecorations(LightweightDecoratorManager.java:359)
18:04:12 [2021-02-03T23:04:12.348Z] 	at org.eclipse.ui.internal.decorators.DecorationScheduler$1.ensureResultCached(DecorationScheduler.java:347)
18:04:12 [2021-02-03T23:04:12.348Z] 	at org.eclipse.ui.internal.decorators.DecorationScheduler$1.run(DecorationScheduler.java:311)
18:04:12 [2021-02-03T23:04:12.348Z] 	at org.eclipse.core.internal.jobs.Worker.run(Worker.java:56)
18:04:13 [2021-02-03T23:04:13.741Z] 23:04:13 [INFO] All tests passed!
18:04:13 [2021-02-03T23:04:13.741Z] 23:04:13 [INFO] 
18:04:13 [2021-02-03T23:04:13.741Z] 23:04:13 [INFO] >>> spotbugs-maven-plugin:3.1.11:check (default) > :spotbugs @ org.eclipse.mylyn.github.tests >>>
18:04:13 [2021-02-03T23:04:13.741Z] 23:04:13 [INFO] 
18:04:13 [2021-02-03T23:04:13.741Z] 23:04:13 [INFO] --- spotbugs-maven-plugin:3.1.11:spotbugs (spotbugs) @ org.eclipse.mylyn.github.tests ---
18:04:13 [2021-02-03T23:04:13.741Z] 23:04:13 [INFO] Fork Value is true
18:04:16 [2021-02-03T23:04:16.271Z] 23:04:15 [INFO] Done SpotBugs Analysis....
18:04:16 [2021-02-03T23:04:16.271Z] 23:04:15 [INFO] 
18:04:16 [2021-02-03T23:04:16.271Z] 23:04:15 [INFO] <<< spotbugs-maven-plugin:3.1.11:check (default) < :spotbugs @ org.eclipse.mylyn.github.tests <<<
18:04:16 [2021-02-03T23:04:16.271Z] 23:04:15 [INFO] 
18:04:16 [2021-02-03T23:04:16.271Z] 23:04:15 [INFO] 
18:04:16 [2021-02-03T23:04:16.271Z] 23:04:15 [INFO] --- spotbugs-maven-plugin:3.1.11:check (default) @ org.eclipse.mylyn.github.tests ---
18:04:16 [2021-02-03T23:04:16.271Z] 23:04:15 [INFO] BugInstance size is 0
18:04:16 [2021-02-03T23:04:16.271Z] 23:04:15 [INFO] Error size is 0
18:04:16 [2021-02-03T23:04:16.271Z] 23:04:15 [INFO] No errors/warnings found
18:04:16 [2021-02-03T23:04:16.271Z] 23:04:15 [INFO] 
18:04:16 [2021-02-03T23:04:16.271Z] 23:04:15 [INFO] >>> maven-pmd-plugin:3.11.0:cpd-check (default) > :cpd @ org.eclipse.mylyn.github.tests >>>
18:04:16 [2021-02-03T23:04:16.271Z] 23:04:15 [INFO] 
18:04:16 [2021-02-03T23:04:16.271Z] 23:04:15 [INFO] --- maven-pmd-plugin:3.11.0:cpd (cpd) @ org.eclipse.mylyn.github.tests ---
18:04:16 [2021-02-03T23:04:16.271Z] 23:04:15 [INFO] 
18:04:16 [2021-02-03T23:04:16.271Z] 23:04:15 [INFO] <<< maven-pmd-plugin:3.11.0:cpd-check (default) < :cpd @ org.eclipse.mylyn.github.tests <<<
18:04:16 [2021-02-03T23:04:16.271Z] 23:04:15 [INFO] 
18:04:16 [2021-02-03T23:04:16.271Z] 23:04:15 [INFO] 
18:04:16 [2021-02-03T23:04:16.271Z] 23:04:15 [INFO] --- maven-pmd-plugin:3.11.0:cpd-check (default) @ org.eclipse.mylyn.github.tests ---
18:04:16 [2021-02-03T23:04:16.271Z] 23:04:15 [INFO] 
18:04:16 [2021-02-03T23:04:16.271Z] 23:04:15 [INFO] 
18:04:16 [2021-02-03T23:04:16.271Z] 23:04:15 [INFO] --- tycho-pack200a-plugin:1.7.0:normalize (pack200-normalize) @ org.eclipse.mylyn.github.tests ---
18:04:16 [2021-02-03T23:04:16.271Z] 23:04:15 [INFO] Pack200 normalizing jar /home/jenkins/agent/workspace/egit-github/repo/org.eclipse.mylyn.github.tests/target/org.eclipse.mylyn.github.tests-5.11.0-SNAPSHOT.jar
18:04:16 [2021-02-03T23:04:16.271Z] 23:04:15 [INFO] 
18:04:16 [2021-02-03T23:04:16.271Z] 23:04:15 [INFO] --- eclipse-jarsigner-plugin:1.1.5:sign (sign) @ org.eclipse.mylyn.github.tests ---
18:04:16 [2021-02-03T23:04:16.271Z] 23:04:15 [INFO] Signing jar: /home/jenkins/agent/workspace/egit-github/repo/org.eclipse.mylyn.github.tests/target/org.eclipse.mylyn.github.tests-5.11.0-SNAPSHOT.jar
18:04:17 [2021-02-03T23:04:17.247Z] 23:04:16 [INFO] 
18:04:17 [2021-02-03T23:04:17.247Z] 23:04:16 [INFO] --- tycho-pack200b-plugin:1.7.0:pack (pack200-pack) @ org.eclipse.mylyn.github.tests ---
18:04:17 [2021-02-03T23:04:17.247Z] 23:04:16 [INFO] Pack200 packing jar /home/jenkins/agent/workspace/egit-github/repo/org.eclipse.mylyn.github.tests/target/org.eclipse.mylyn.github.tests-5.11.0-SNAPSHOT.jar
18:04:17 [2021-02-03T23:04:17.247Z] 23:04:16 [INFO] 
18:04:17 [2021-02-03T23:04:17.247Z] 23:04:16 [INFO] --- tycho-p2-plugin:1.7.0:p2-metadata (p2-metadata) @ org.eclipse.mylyn.github.tests ---
18:04:17 [2021-02-03T23:04:17.247Z] 23:04:16 [INFO] 
18:04:17 [2021-02-03T23:04:17.247Z] 23:04:16 [INFO] --- maven-install-plugin:2.3.1:install (default-install) @ org.eclipse.mylyn.github.tests ---
18:04:17 [2021-02-03T23:04:17.247Z] 23:04:16 [INFO] Installing /home/jenkins/agent/workspace/egit-github/repo/org.eclipse.mylyn.github.tests/target/org.eclipse.mylyn.github.tests-5.11.0-SNAPSHOT.jar to /home/jenkins/agent/workspace/egit-github/.repository/org/eclipse/mylyn/github/org.eclipse.mylyn.github.tests/5.11.0-SNAPSHOT/org.eclipse.mylyn.github.tests-5.11.0-SNAPSHOT.jar
18:04:17 [2021-02-03T23:04:17.247Z] 23:04:16 [INFO] Installing /home/jenkins/agent/workspace/egit-github/repo/org.eclipse.mylyn.github.tests/pom.xml to /home/jenkins/agent/workspace/egit-github/.repository/org/eclipse/mylyn/github/org.eclipse.mylyn.github.tests/5.11.0-SNAPSHOT/org.eclipse.mylyn.github.tests-5.11.0-SNAPSHOT.pom
18:04:17 [2021-02-03T23:04:17.247Z] 23:04:16 [INFO] Installing /home/jenkins/agent/workspace/egit-github/repo/org.eclipse.mylyn.github.tests/target/org.eclipse.mylyn.github.tests-5.11.0-SNAPSHOT.jar.pack.gz to /home/jenkins/agent/workspace/egit-github/.repository/org/eclipse/mylyn/github/org.eclipse.mylyn.github.tests/5.11.0-SNAPSHOT/org.eclipse.mylyn.github.tests-5.11.0-SNAPSHOT-pack200.jar.pack.gz
18:04:17 [2021-02-03T23:04:17.247Z] 23:04:16 [INFO] Installing /home/jenkins/agent/workspace/egit-github/repo/org.eclipse.mylyn.github.tests/target/p2content.xml to /home/jenkins/agent/workspace/egit-github/.repository/org/eclipse/mylyn/github/org.eclipse.mylyn.github.tests/5.11.0-SNAPSHOT/org.eclipse.mylyn.github.tests-5.11.0-SNAPSHOT-p2metadata.xml
18:04:17 [2021-02-03T23:04:17.247Z] 23:04:16 [INFO] Installing /home/jenkins/agent/workspace/egit-github/repo/org.eclipse.mylyn.github.tests/target/p2artifacts.xml to /home/jenkins/agent/workspace/egit-github/.repository/org/eclipse/mylyn/github/org.eclipse.mylyn.github.tests/5.11.0-SNAPSHOT/org.eclipse.mylyn.github.tests-5.11.0-SNAPSHOT-p2artifacts.xml
18:04:17 [2021-02-03T23:04:17.247Z] 23:04:16 [INFO] 
18:04:17 [2021-02-03T23:04:17.247Z] 23:04:16 [INFO] --- tycho-p2-plugin:1.7.0:update-local-index (default-update-local-index) @ org.eclipse.mylyn.github.tests ---
18:04:17 [2021-02-03T23:04:17.247Z] 23:04:16 [INFO] 
18:04:17 [2021-02-03T23:04:17.247Z] 23:04:16 [INFO] -------------< org.eclipse.mylyn.github:github-updatesite >-------------
18:04:17 [2021-02-03T23:04:17.247Z] 23:04:16 [INFO] Building Eclipse EGit Mylyn GitHub Repository 5.11.0-SNAPSHOT    [10/10]
18:04:17 [2021-02-03T23:04:17.247Z] 23:04:16 [INFO] -------------------------[ eclipse-repository ]-------------------------
18:04:17 [2021-02-03T23:04:17.247Z] 23:04:16 [INFO] 
18:04:17 [2021-02-03T23:04:17.247Z] 23:04:16 [INFO] --- maven-clean-plugin:2.5:clean (default-clean) @ github-updatesite ---
18:04:17 [2021-02-03T23:04:17.247Z] 23:04:16 [INFO] 
18:04:17 [2021-02-03T23:04:17.247Z] 23:04:16 [INFO] --- tycho-packaging-plugin:1.7.0:build-qualifier-aggregator (default-build-qualifier-aggregator) @ github-updatesite ---
18:04:17 [2021-02-03T23:04:17.247Z] 23:04:16 [INFO] The project's OSGi version is 5.11.0.202102032301
18:04:17 [2021-02-03T23:04:17.247Z] 23:04:16 [INFO] 
18:04:17 [2021-02-03T23:04:17.247Z] 23:04:16 [INFO] --- maven-enforcer-plugin:3.0.0-M2:enforce (enforce-maven) @ github-updatesite ---
18:04:17 [2021-02-03T23:04:17.247Z] 23:04:16 [INFO] 
18:04:17 [2021-02-03T23:04:17.248Z] 23:04:16 [INFO] --- maven-clean-plugin:2.5:clean (default-clean-1) @ github-updatesite ---
18:04:17 [2021-02-03T23:04:17.248Z] 23:04:16 [INFO] 
18:04:17 [2021-02-03T23:04:17.248Z] 23:04:16 [INFO] --- maven-resources-plugin:3.1.0:resources (default-resources) @ github-updatesite ---
18:04:17 [2021-02-03T23:04:17.248Z] 23:04:16 [INFO] Using 'UTF-8' encoding to copy filtered resources.
18:04:17 [2021-02-03T23:04:17.248Z] 23:04:16 [INFO] skip non existing resourceDirectory /home/jenkins/agent/workspace/egit-github/repo/org.eclipse.mylyn.github-site/src/main/resources
18:04:17 [2021-02-03T23:04:17.248Z] 23:04:16 [INFO] 
18:04:17 [2021-02-03T23:04:17.248Z] 23:04:16 [INFO] --- target-platform-configuration:1.7.0:target-platform (default-target-platform) @ github-updatesite ---
18:04:17 [2021-02-03T23:04:17.248Z] 23:04:16 [INFO] 
18:04:17 [2021-02-03T23:04:17.248Z] 23:04:16 [INFO] --- tycho-p2-publisher-plugin:1.7.0:publish-osgi-ee (default-publish-osgi-ee) @ github-updatesite ---
18:04:17 [2021-02-03T23:04:17.248Z] 23:04:16 [INFO] Published profile IUs: [a.jre.javase 11.0.0, config.a.jre.javase 11.0.0]
18:04:17 [2021-02-03T23:04:17.248Z] 23:04:16 [INFO] Published profile IUs: [a.jre.javase 14.0.0, config.a.jre.javase 14.0.0]
18:04:17 [2021-02-03T23:04:17.248Z] 23:04:16 [INFO] 
18:04:17 [2021-02-03T23:04:17.248Z] 23:04:16 [INFO] --- tycho-p2-publisher-plugin:1.7.0:publish-products (default-publish-products) @ github-updatesite ---
18:04:17 [2021-02-03T23:04:17.248Z] 23:04:16 [INFO] 
18:04:17 [2021-02-03T23:04:17.248Z] 23:04:16 [INFO] --- tycho-p2-publisher-plugin:1.7.0:publish-categories (default-publish-categories) @ github-updatesite ---
18:04:17 [2021-02-03T23:04:17.248Z] 23:04:16 [INFO] 
18:04:17 [2021-02-03T23:04:17.248Z] 23:04:16 [INFO] --- tycho-p2-publisher-plugin:1.7.0:attach-artifacts (default-attach-artifacts) @ github-updatesite ---
18:04:17 [2021-02-03T23:04:17.248Z] 23:04:16 [INFO] 
18:04:17 [2021-02-03T23:04:17.248Z] 23:04:16 [INFO] --- tycho-p2-repository-plugin:1.7.0:assemble-repository (default-assemble-repository) @ github-updatesite ---
18:04:18 [2021-02-03T23:04:18.620Z] 23:04:18 [INFO] 
18:04:18 [2021-02-03T23:04:18.620Z] 23:04:18 [INFO] --- tycho-p2-repository-plugin:1.7.0:archive-repository (default-archive-repository) @ github-updatesite ---
18:04:18 [2021-02-03T23:04:18.620Z] 23:04:18 [INFO] Building zip: /home/jenkins/agent/workspace/egit-github/repo/org.eclipse.mylyn.github-site/target/github-updatesite-5.11.0-SNAPSHOT.zip
18:04:18 [2021-02-03T23:04:18.620Z] 23:04:18 [INFO] 
18:04:18 [2021-02-03T23:04:18.620Z] 23:04:18 [INFO] >>> spotbugs-maven-plugin:3.1.11:check (default) > :spotbugs @ github-updatesite >>>
18:04:18 [2021-02-03T23:04:18.620Z] 23:04:18 [INFO] 
18:04:18 [2021-02-03T23:04:18.620Z] 23:04:18 [INFO] --- spotbugs-maven-plugin:3.1.11:spotbugs (spotbugs) @ github-updatesite ---
18:04:18 [2021-02-03T23:04:18.620Z] 23:04:18 [INFO] 
18:04:18 [2021-02-03T23:04:18.620Z] 23:04:18 [INFO] <<< spotbugs-maven-plugin:3.1.11:check (default) < :spotbugs @ github-updatesite <<<
18:04:18 [2021-02-03T23:04:18.620Z] 23:04:18 [INFO] 
18:04:18 [2021-02-03T23:04:18.620Z] 23:04:18 [INFO] 
18:04:18 [2021-02-03T23:04:18.620Z] 23:04:18 [INFO] --- spotbugs-maven-plugin:3.1.11:check (default) @ github-updatesite ---
18:04:18 [2021-02-03T23:04:18.620Z] 23:04:18 [INFO] 
18:04:18 [2021-02-03T23:04:18.620Z] 23:04:18 [INFO] >>> maven-pmd-plugin:3.11.0:cpd-check (default) > :cpd @ github-updatesite >>>
18:04:18 [2021-02-03T23:04:18.620Z] 23:04:18 [INFO] 
18:04:18 [2021-02-03T23:04:18.620Z] 23:04:18 [INFO] --- maven-pmd-plugin:3.11.0:cpd (cpd) @ github-updatesite ---
18:04:18 [2021-02-03T23:04:18.620Z] 23:04:18 [INFO] 
18:04:18 [2021-02-03T23:04:18.621Z] 23:04:18 [INFO] <<< maven-pmd-plugin:3.11.0:cpd-check (default) < :cpd @ github-updatesite <<<
18:04:18 [2021-02-03T23:04:18.621Z] 23:04:18 [INFO] 
18:04:18 [2021-02-03T23:04:18.621Z] 23:04:18 [INFO] 
18:04:18 [2021-02-03T23:04:18.621Z] 23:04:18 [INFO] --- maven-pmd-plugin:3.11.0:cpd-check (default) @ github-updatesite ---
18:04:18 [2021-02-03T23:04:18.621Z] 23:04:18 [INFO] 
18:04:18 [2021-02-03T23:04:18.621Z] 23:04:18 [INFO] 
18:04:18 [2021-02-03T23:04:18.621Z] 23:04:18 [INFO] --- tycho-pack200a-plugin:1.7.0:normalize (pack200-normalize) @ github-updatesite ---
18:04:18 [2021-02-03T23:04:18.621Z] 23:04:18 [INFO] 
18:04:18 [2021-02-03T23:04:18.621Z] 23:04:18 [INFO] --- eclipse-jarsigner-plugin:1.1.5:sign (sign) @ github-updatesite ---
18:04:18 [2021-02-03T23:04:18.621Z] 23:04:18 [INFO] 
18:04:18 [2021-02-03T23:04:18.621Z] 23:04:18 [INFO] --- tycho-pack200b-plugin:1.7.0:pack (pack200-pack) @ github-updatesite ---
18:04:18 [2021-02-03T23:04:18.621Z] 23:04:18 [INFO] 
18:04:18 [2021-02-03T23:04:18.621Z] 23:04:18 [INFO] --- tycho-p2-plugin:1.7.0:p2-metadata (p2-metadata) @ github-updatesite ---
18:04:18 [2021-02-03T23:04:18.621Z] 23:04:18 [INFO] 
18:04:18 [2021-02-03T23:04:18.621Z] 23:04:18 [INFO] --- maven-install-plugin:2.3.1:install (default-install) @ github-updatesite ---
18:04:18 [2021-02-03T23:04:18.621Z] 23:04:18 [INFO] Installing /home/jenkins/agent/workspace/egit-github/repo/org.eclipse.mylyn.github-site/target/github-updatesite-5.11.0-SNAPSHOT.zip to /home/jenkins/agent/workspace/egit-github/.repository/org/eclipse/mylyn/github/github-updatesite/5.11.0-SNAPSHOT/github-updatesite-5.11.0-SNAPSHOT.zip
18:04:18 [2021-02-03T23:04:18.621Z] 23:04:18 [INFO] Installing /home/jenkins/agent/workspace/egit-github/repo/org.eclipse.mylyn.github-site/pom.xml to /home/jenkins/agent/workspace/egit-github/.repository/org/eclipse/mylyn/github/github-updatesite/5.11.0-SNAPSHOT/github-updatesite-5.11.0-SNAPSHOT.pom
18:04:18 [2021-02-03T23:04:18.621Z] 23:04:18 [INFO] Installing /home/jenkins/agent/workspace/egit-github/repo/org.eclipse.mylyn.github-site/target/p2content.xml to /home/jenkins/agent/workspace/egit-github/.repository/org/eclipse/mylyn/github/github-updatesite/5.11.0-SNAPSHOT/github-updatesite-5.11.0-SNAPSHOT-p2metadata.xml
18:04:18 [2021-02-03T23:04:18.621Z] 23:04:18 [INFO] Installing /home/jenkins/agent/workspace/egit-github/repo/org.eclipse.mylyn.github-site/target/p2artifacts.xml to /home/jenkins/agent/workspace/egit-github/.repository/org/eclipse/mylyn/github/github-updatesite/5.11.0-SNAPSHOT/github-updatesite-5.11.0-SNAPSHOT-p2artifacts.xml
18:04:18 [2021-02-03T23:04:18.621Z] 23:04:18 [INFO] 
18:04:18 [2021-02-03T23:04:18.621Z] 23:04:18 [INFO] --- tycho-p2-plugin:1.7.0:update-local-index (default-update-local-index) @ github-updatesite ---
18:04:18 [2021-02-03T23:04:18.621Z] 23:04:18 [INFO] ------------------------------------------------------------------------
18:04:18 [2021-02-03T23:04:18.621Z] 23:04:18 [INFO] Reactor Summary for Eclipse EGit Mylyn GitHub Connector Parent 5.11.0-SNAPSHOT:
18:04:18 [2021-02-03T23:04:18.621Z] 23:04:18 [INFO] 
18:04:18 [2021-02-03T23:04:18.621Z] 23:04:18 [INFO] Eclipse EGit Mylyn GitHub Connector Parent ......... SUCCESS [ 23.593 s]
18:04:18 [2021-02-03T23:04:18.621Z] 23:04:18 [INFO] EGit GitHub Target Platform Definition ............. SUCCESS [  0.614 s]
18:04:18 [2021-02-03T23:04:18.621Z] 23:04:18 [INFO] Eclipse EGit GitHub API Core ....................... SUCCESS [ 10.474 s]
18:04:18 [2021-02-03T23:04:18.621Z] 23:04:18 [INFO] Eclipse EGit Mylyn GitHub Core ..................... SUCCESS [  5.417 s]
18:04:18 [2021-02-03T23:04:18.621Z] 23:04:18 [INFO] Eclipse EGit Mylyn GitHub UI ....................... SUCCESS [  9.723 s]
18:04:18 [2021-02-03T23:04:18.621Z] 23:04:18 [INFO] Eclipse EGit Mylyn GitHub Documentation ............ SUCCESS [  3.102 s]
18:04:18 [2021-02-03T23:04:18.621Z] 23:04:18 [INFO] Eclipse EGit Mylyn GitHub Feature .................. SUCCESS [  1.151 s]
18:04:18 [2021-02-03T23:04:18.621Z] 23:04:18 [INFO] Eclipse EGit GitHub API Test Plug-in ............... SUCCESS [ 10.379 s]
18:04:18 [2021-02-03T23:04:18.621Z] 23:04:18 [INFO] Eclipse EGit Mylyn GitHub Test Plug-in ............. SUCCESS [ 11.138 s]
18:04:18 [2021-02-03T23:04:18.621Z] 23:04:18 [INFO] Eclipse EGit Mylyn GitHub Repository ............... SUCCESS [  1.565 s]
18:04:18 [2021-02-03T23:04:18.621Z] 23:04:18 [INFO] ------------------------------------------------------------------------
18:04:18 [2021-02-03T23:04:18.621Z] 23:04:18 [INFO] BUILD SUCCESS
18:04:18 [2021-02-03T23:04:18.621Z] 23:04:18 [INFO] ------------------------------------------------------------------------
18:04:18 [2021-02-03T23:04:18.621Z] 23:04:18 [INFO] Total time:  02:50 min
18:04:18 [2021-02-03T23:04:18.621Z] 23:04:18 [INFO] Finished at: 2021-02-03T23:04:18Z
18:04:18 [2021-02-03T23:04:18.621Z] 23:04:18 [INFO] ------------------------------------------------------------------------