FailedConsole Output

Skipping 1,441 KB.. Full Log
0930-r/org.eclipse.egit.core-4.9.2.201712150930-r.jar')
11:05:56 [WARNING] /jobs/genie.egerrit/EGerrit/workspace/org.eclipse.egerrit.ui.tests/src/org/eclipse/egerrit/internal/rcptt/support/ImportProjectService.java:[109] 
11:05:56 	GerritUtil.configurePushRefSpec(remoteConfig, "HEAD:refs/for/master");
11:05:56 	^^^^^^^^^^^^^^^^^^^^^^^^^^^^^^^^^^^^^^^^^^^^^^^^^^^^^^^^^^^^^^^^^^^^^
11:05:56 Discouraged access: The method 'GerritUtil.configurePushRefSpec(RemoteConfig, String)' is not API (restriction on classpath entry '/home/hudson/genie.egerrit/.jenkins/jobs/EGerrit/workspace/.repository/p2/osgi/bundle/org.eclipse.egit.core/4.9.2.201712150930-r/org.eclipse.egit.core-4.9.2.201712150930-r.jar')
11:05:56 [WARNING] /jobs/genie.egerrit/EGerrit/workspace/org.eclipse.egerrit.ui.tests/src/org/eclipse/egerrit/internal/rcptt/support/ImportProjectService.java:[109] 
11:05:56 	GerritUtil.configurePushRefSpec(remoteConfig, "HEAD:refs/for/master");
11:05:56 	                                              ^^^^^^^^^^^^^^^^^^^^^^
11:05:56 Non-externalized string literal; it should be followed by //$NON-NLS-<n>$
11:05:56 [WARNING] /jobs/genie.egerrit/EGerrit/workspace/org.eclipse.egerrit.ui.tests/src/org/eclipse/egerrit/internal/rcptt/support/ImportProjectService.java:[110] 
11:05:56 	GerritUtil.configureFetchNotes(remoteConfig);
11:05:56 	^^^^^^^^^^
11:05:56 Discouraged access: The type 'GerritUtil' is not API (restriction on classpath entry '/home/hudson/genie.egerrit/.jenkins/jobs/EGerrit/workspace/.repository/p2/osgi/bundle/org.eclipse.egit.core/4.9.2.201712150930-r/org.eclipse.egit.core-4.9.2.201712150930-r.jar')
11:05:56 [WARNING] /jobs/genie.egerrit/EGerrit/workspace/org.eclipse.egerrit.ui.tests/src/org/eclipse/egerrit/internal/rcptt/support/ImportProjectService.java:[110] 
11:05:56 	GerritUtil.configureFetchNotes(remoteConfig);
11:05:56 	^^^^^^^^^^^^^^^^^^^^^^^^^^^^^^^^^^^^^^^^^^^^
11:05:56 Discouraged access: The method 'GerritUtil.configureFetchNotes(RemoteConfig)' is not API (restriction on classpath entry '/home/hudson/genie.egerrit/.jenkins/jobs/EGerrit/workspace/.repository/p2/osgi/bundle/org.eclipse.egit.core/4.9.2.201712150930-r/org.eclipse.egit.core-4.9.2.201712150930-r.jar')
11:05:56 [WARNING] /jobs/genie.egerrit/EGerrit/workspace/org.eclipse.egerrit.ui.tests/src/org/eclipse/egerrit/internal/rcptt/support/ReviewFactory.java:[109] 
11:05:56 	String dotProjectContent = "<?xml version=\"1.0\" encoding=\"UTF-8\"?>\n" + "<projectDescription>\n"
11:05:56 	                           ^^^^^^^^^^^^^^^^^^^^^^^^^^^^^^^^^^^^^^^^^^^^^^
11:05:56 Non-externalized string literal; it should be followed by //$NON-NLS-<n>$
11:05:56 [WARNING] /jobs/genie.egerrit/EGerrit/workspace/org.eclipse.egerrit.ui.tests/src/org/eclipse/egerrit/internal/rcptt/support/ReviewFactory.java:[109] 
11:05:56 	String dotProjectContent = "<?xml version=\"1.0\" encoding=\"UTF-8\"?>\n" + "<projectDescription>\n"
11:05:56 	                                                                            ^^^^^^^^^^^^^^^^^^^^^^^^
11:05:56 Non-externalized string literal; it should be followed by //$NON-NLS-<n>$
11:05:56 [WARNING] /jobs/genie.egerrit/EGerrit/workspace/org.eclipse.egerrit.ui.tests/src/org/eclipse/egerrit/internal/rcptt/support/ReviewFactory.java:[110] 
11:05:56 	+ "	<name>Project</name>\n" + "	<comment></comment>\n" + "	<projects>\n" + "	</projects>\n"
11:05:56 	  ^^^^^^^^^^^^^^^^^^^^^^^^^
11:05:56 Non-externalized string literal; it should be followed by //$NON-NLS-<n>$
11:05:56 [WARNING] /jobs/genie.egerrit/EGerrit/workspace/org.eclipse.egerrit.ui.tests/src/org/eclipse/egerrit/internal/rcptt/support/ReviewFactory.java:[110] 
11:05:56 	+ "	<name>Project</name>\n" + "	<comment></comment>\n" + "	<projects>\n" + "	</projects>\n"
11:05:56 	   	                          ^^^^^^^^^^^^^^^^^^^^^^^^
11:05:56 Non-externalized string literal; it should be followed by //$NON-NLS-<n>$
11:05:56 [WARNING] /jobs/genie.egerrit/EGerrit/workspace/org.eclipse.egerrit.ui.tests/src/org/eclipse/egerrit/internal/rcptt/support/ReviewFactory.java:[110] 
11:05:56 	+ "	<name>Project</name>\n" + "	<comment></comment>\n" + "	<projects>\n" + "	</projects>\n"
11:05:56 	   	                           	                         ^^^^^^^^^^^^^^^
11:05:56 Non-externalized string literal; it should be followed by //$NON-NLS-<n>$
11:05:56 [WARNING] /jobs/genie.egerrit/EGerrit/workspace/org.eclipse.egerrit.ui.tests/src/org/eclipse/egerrit/internal/rcptt/support/ReviewFactory.java:[110] 
11:05:56 	+ "	<name>Project</name>\n" + "	<comment></comment>\n" + "	<projects>\n" + "	</projects>\n"
11:05:56 	   	                           	                          	                ^^^^^^^^^^^^^^^^
11:05:56 Non-externalized string literal; it should be followed by //$NON-NLS-<n>$
11:05:56 [WARNING] /jobs/genie.egerrit/EGerrit/workspace/org.eclipse.egerrit.ui.tests/src/org/eclipse/egerrit/internal/rcptt/support/ReviewFactory.java:[111] 
11:05:56 	+ "	<buildSpec>\n" + "	</buildSpec>\n" + "	<natures>\n" + "	</natures>\n" + "</projectDescription>"; //$NON-NLS-5$
11:05:56 	  ^^^^^^^^^^^^^^^^
11:05:56 Non-externalized string literal; it should be followed by //$NON-NLS-<n>$
11:05:56 [WARNING] /jobs/genie.egerrit/EGerrit/workspace/org.eclipse.egerrit.ui.tests/src/org/eclipse/egerrit/internal/rcptt/support/ReviewFactory.java:[111] 
11:05:56 	+ "	<buildSpec>\n" + "	</buildSpec>\n" + "	<natures>\n" + "	</natures>\n" + "</projectDescription>"; //$NON-NLS-5$
11:05:56 	   	                 ^^^^^^^^^^^^^^^^^
11:05:56 Non-externalized string literal; it should be followed by //$NON-NLS-<n>$
11:05:56 [WARNING] /jobs/genie.egerrit/EGerrit/workspace/org.eclipse.egerrit.ui.tests/src/org/eclipse/egerrit/internal/rcptt/support/ReviewFactory.java:[111] 
11:05:56 	+ "	<buildSpec>\n" + "	</buildSpec>\n" + "	<natures>\n" + "	</natures>\n" + "</projectDescription>"; //$NON-NLS-5$
11:05:56 	   	                  	                  ^^^^^^^^^^^^^^
11:05:56 Non-externalized string literal; it should be followed by //$NON-NLS-<n>$
11:05:56 [WARNING] /jobs/genie.egerrit/EGerrit/workspace/org.eclipse.egerrit.ui.tests/src/org/eclipse/egerrit/internal/rcptt/support/ReviewFactory.java:[111] 
11:05:56 	+ "	<buildSpec>\n" + "	</buildSpec>\n" + "	<natures>\n" + "	</natures>\n" + "</projectDescription>"; //$NON-NLS-5$
11:05:56 	   	                  	                   	               ^^^^^^^^^^^^^^^
11:05:56 Non-externalized string literal; it should be followed by //$NON-NLS-<n>$
11:05:56 [WARNING] /jobs/genie.egerrit/EGerrit/workspace/org.eclipse.egerrit.ui.tests/src/org/eclipse/egerrit/internal/rcptt/support/ReviewFactory.java:[112] 
11:05:56 	gitAccess.commitFileInMaster("Project/.project", dotProjectContent);
11:05:56 	                             ^^^^^^^^^^^^^^^^^^
11:05:56 Non-externalized string literal; it should be followed by //$NON-NLS-<n>$
11:05:56 [WARNING] /jobs/genie.egerrit/EGerrit/workspace/org.eclipse.egerrit.ui.tests/src/org/eclipse/egerrit/ui/tests/DashboardCompletionTest.java:[41] 
11:05:56 	EStructuralFeature l = ci.eClass().getEStructuralFeature("labels"); //$NON-NLS-1$
11:05:56 	                   ^
11:05:56 The value of the local variable l is not used
11:05:56 [WARNING] /jobs/genie.egerrit/EGerrit/workspace/org.eclipse.egerrit.ui.tests/src/org/eclipse/egerrit/ui/tests/ChangeIdExtractorTest.java:[17] 
11:05:56 	import org.eclipse.egerrit.internal.dashboard.ui.views.ChangeIdExtractor;
11:05:56 	       ^^^^^^^^^^^^^^^^^^^^^^^^^^^^^^^^^^^^^^^^^^^^^^^^^^^^^^^^^^^^^^^^^
11:05:56 Discouraged access: The type 'ChangeIdExtractor' is not API (restriction on classpath entry '/jobs/genie.egerrit/EGerrit/workspace/org.eclipse.egerrit.dashboard.ui/target/classes')
11:05:56 [WARNING] /jobs/genie.egerrit/EGerrit/workspace/org.eclipse.egerrit.ui.tests/src/org/eclipse/egerrit/ui/tests/ChangeIdExtractorTest.java:[27] 
11:05:56 	assertNull(extractor.getServer());
11:05:56 	           ^^^^^^^^^^^^^^^^^^^^^
11:05:56 Discouraged access: The method 'ChangeIdExtractor.getServer()' is not API (restriction on classpath entry '/jobs/genie.egerrit/EGerrit/workspace/org.eclipse.egerrit.dashboard.ui/target/classes')
11:05:56 [WARNING] /jobs/genie.egerrit/EGerrit/workspace/org.eclipse.egerrit.ui.tests/src/org/eclipse/egerrit/ui/tests/ChangeIdExtractorTest.java:[28] 
11:05:56 	assertNull(extractor.getChangeId());
11:05:56 	           ^^^^^^^^^^^^^^^^^^^^^^^
11:05:56 Discouraged access: The method 'ChangeIdExtractor.getChangeId()' is not API (restriction on classpath entry '/jobs/genie.egerrit/EGerrit/workspace/org.eclipse.egerrit.dashboard.ui/target/classes')
11:05:56 [WARNING] /jobs/genie.egerrit/EGerrit/workspace/org.eclipse.egerrit.ui.tests/src/org/eclipse/egerrit/ui/tests/ChangeIdExtractorTest.java:[34] 
11:05:56 	ChangeIdExtractor extractor = new ChangeIdExtractor("https://git.eclipse.org/r/"); //$NON-NLS-1$
11:05:56 	^^^^^^^^^^^^^^^^^
11:05:56 Discouraged access: The type 'ChangeIdExtractor' is not API (restriction on classpath entry '/jobs/genie.egerrit/EGerrit/workspace/org.eclipse.egerrit.dashboard.ui/target/classes')
11:05:56 [WARNING] /jobs/genie.egerrit/EGerrit/workspace/org.eclipse.egerrit.ui.tests/src/org/eclipse/egerrit/ui/tests/ChangeIdExtractorTest.java:[34] 
11:05:56 	ChangeIdExtractor extractor = new ChangeIdExtractor("https://git.eclipse.org/r/"); //$NON-NLS-1$
11:05:56 	                              ^^^^^^^^^^^^^^^^^^^^^^^^^^^^^^^^^^^^^^^^^^^^^^^^^^^
11:05:56 Discouraged access: The constructor 'ChangeIdExtractor(String)' is not API (restriction on classpath entry '/jobs/genie.egerrit/EGerrit/workspace/org.eclipse.egerrit.dashboard.ui/target/classes')
11:05:56 [WARNING] /jobs/genie.egerrit/EGerrit/workspace/org.eclipse.egerrit.ui.tests/src/org/eclipse/egerrit/ui/tests/ChangeIdExtractorTest.java:[34] 
11:05:56 	ChangeIdExtractor extractor = new ChangeIdExtractor("https://git.eclipse.org/r/"); //$NON-NLS-1$
11:05:56 	                                  ^^^^^^^^^^^^^^^^^
11:05:56 Discouraged access: The type 'ChangeIdExtractor' is not API (restriction on classpath entry '/jobs/genie.egerrit/EGerrit/workspace/org.eclipse.egerrit.dashboard.ui/target/classes')
11:05:56 [WARNING] /jobs/genie.egerrit/EGerrit/workspace/org.eclipse.egerrit.ui.tests/src/org/eclipse/egerrit/ui/tests/ChangeIdExtractorTest.java:[35] 
11:05:56 	assertEquals("https://git.eclipse.org/r", extractor.getServer().getServerURI()); //$NON-NLS-1$
11:05:56 	                                          ^^^^^^^^^^^^^^^^^^^^^
11:05:56 Discouraged access: The method 'ChangeIdExtractor.getServer()' is not API (restriction on classpath entry '/jobs/genie.egerrit/EGerrit/workspace/org.eclipse.egerrit.dashboard.ui/target/classes')
11:05:56 [WARNING] /jobs/genie.egerrit/EGerrit/workspace/org.eclipse.egerrit.ui.tests/src/org/eclipse/egerrit/ui/tests/ChangeIdExtractorTest.java:[36] 
11:05:56 	assertNull(extractor.getChangeId());
11:05:56 	           ^^^^^^^^^^^^^^^^^^^^^^^
11:05:56 Discouraged access: The method 'ChangeIdExtractor.getChangeId()' is not API (restriction on classpath entry '/jobs/genie.egerrit/EGerrit/workspace/org.eclipse.egerrit.dashboard.ui/target/classes')
11:05:56 [WARNING] /jobs/genie.egerrit/EGerrit/workspace/org.eclipse.egerrit.ui.tests/src/org/eclipse/egerrit/ui/tests/ChangeIdExtractorTest.java:[42] 
11:05:56 	ChangeIdExtractor extractor = new ChangeIdExtractor("https://git.eclipse.org/r/#/c/1234"); //$NON-NLS-1$
11:05:56 	^^^^^^^^^^^^^^^^^
11:05:56 Discouraged access: The type 'ChangeIdExtractor' is not API (restriction on classpath entry '/jobs/genie.egerrit/EGerrit/workspace/org.eclipse.egerrit.dashboard.ui/target/classes')
11:05:56 [WARNING] /jobs/genie.egerrit/EGerrit/workspace/org.eclipse.egerrit.ui.tests/src/org/eclipse/egerrit/ui/tests/ChangeIdExtractorTest.java:[42] 
11:05:56 	ChangeIdExtractor extractor = new ChangeIdExtractor("https://git.eclipse.org/r/#/c/1234"); //$NON-NLS-1$
11:05:56 	                              ^^^^^^^^^^^^^^^^^^^^^^^^^^^^^^^^^^^^^^^^^^^^^^^^^^^^^^^^^^^
11:05:56 Discouraged access: The constructor 'ChangeIdExtractor(String)' is not API (restriction on classpath entry '/jobs/genie.egerrit/EGerrit/workspace/org.eclipse.egerrit.dashboard.ui/target/classes')
11:05:56 [WARNING] /jobs/genie.egerrit/EGerrit/workspace/org.eclipse.egerrit.ui.tests/src/org/eclipse/egerrit/ui/tests/ChangeIdExtractorTest.java:[42] 
11:05:56 	ChangeIdExtractor extractor = new ChangeIdExtractor("https://git.eclipse.org/r/#/c/1234"); //$NON-NLS-1$
11:05:56 	                                  ^^^^^^^^^^^^^^^^^
11:05:56 Discouraged access: The type 'ChangeIdExtractor' is not API (restriction on classpath entry '/jobs/genie.egerrit/EGerrit/workspace/org.eclipse.egerrit.dashboard.ui/target/classes')
11:05:56 [WARNING] /jobs/genie.egerrit/EGerrit/workspace/org.eclipse.egerrit.ui.tests/src/org/eclipse/egerrit/ui/tests/ChangeIdExtractorTest.java:[43] 
11:05:56 	assertEquals("https://git.eclipse.org/r", extractor.getServer().getServerURI()); //$NON-NLS-1$
11:05:56 	                                          ^^^^^^^^^^^^^^^^^^^^^
11:05:56 Discouraged access: The method 'ChangeIdExtractor.getServer()' is not API (restriction on classpath entry '/jobs/genie.egerrit/EGerrit/workspace/org.eclipse.egerrit.dashboard.ui/target/classes')
11:05:56 [WARNING] /jobs/genie.egerrit/EGerrit/workspace/org.eclipse.egerrit.ui.tests/src/org/eclipse/egerrit/ui/tests/ChangeIdExtractorTest.java:[44] 
11:05:56 	assertEquals("1234", extractor.getChangeId()); //$NON-NLS-1$
11:05:56 	                     ^^^^^^^^^^^^^^^^^^^^^^^
11:05:56 Discouraged access: The method 'ChangeIdExtractor.getChangeId()' is not API (restriction on classpath entry '/jobs/genie.egerrit/EGerrit/workspace/org.eclipse.egerrit.dashboard.ui/target/classes')
11:05:56 [WARNING] /jobs/genie.egerrit/EGerrit/workspace/org.eclipse.egerrit.ui.tests/src/org/eclipse/egerrit/ui/tests/ChangeIdExtractorTest.java:[46] 
11:05:56 	ChangeIdExtractor extractor2 = new ChangeIdExtractor("https://git.eclipse.org/r/#/c/1234/"); //$NON-NLS-1$
11:05:56 	^^^^^^^^^^^^^^^^^
11:05:56 Discouraged access: The type 'ChangeIdExtractor' is not API (restriction on classpath entry '/jobs/genie.egerrit/EGerrit/workspace/org.eclipse.egerrit.dashboard.ui/target/classes')
11:05:56 [WARNING] /jobs/genie.egerrit/EGerrit/workspace/org.eclipse.egerrit.ui.tests/src/org/eclipse/egerrit/ui/tests/ChangeIdExtractorTest.java:[46] 
11:05:56 	ChangeIdExtractor extractor2 = new ChangeIdExtractor("https://git.eclipse.org/r/#/c/1234/"); //$NON-NLS-1$
11:05:56 	                               ^^^^^^^^^^^^^^^^^^^^^^^^^^^^^^^^^^^^^^^^^^^^^^^^^^^^^^^^^^^^
11:05:56 Discouraged access: The constructor 'ChangeIdExtractor(String)' is not API (restriction on classpath entry '/jobs/genie.egerrit/EGerrit/workspace/org.eclipse.egerrit.dashboard.ui/target/classes')
11:05:56 [WARNING] /jobs/genie.egerrit/EGerrit/workspace/org.eclipse.egerrit.ui.tests/src/org/eclipse/egerrit/ui/tests/ChangeIdExtractorTest.java:[46] 
11:05:56 	ChangeIdExtractor extractor2 = new ChangeIdExtractor("https://git.eclipse.org/r/#/c/1234/"); //$NON-NLS-1$
11:05:56 	                                   ^^^^^^^^^^^^^^^^^
11:05:56 Discouraged access: The type 'ChangeIdExtractor' is not API (restriction on classpath entry '/jobs/genie.egerrit/EGerrit/workspace/org.eclipse.egerrit.dashboard.ui/target/classes')
11:05:56 [WARNING] /jobs/genie.egerrit/EGerrit/workspace/org.eclipse.egerrit.ui.tests/src/org/eclipse/egerrit/ui/tests/ChangeIdExtractorTest.java:[47] 
11:05:56 	assertEquals("https://git.eclipse.org/r", extractor2.getServer().getServerURI()); //$NON-NLS-1$
11:05:56 	                                          ^^^^^^^^^^^^^^^^^^^^^^
11:05:56 Discouraged access: The method 'ChangeIdExtractor.getServer()' is not API (restriction on classpath entry '/jobs/genie.egerrit/EGerrit/workspace/org.eclipse.egerrit.dashboard.ui/target/classes')
11:05:56 [WARNING] /jobs/genie.egerrit/EGerrit/workspace/org.eclipse.egerrit.ui.tests/src/org/eclipse/egerrit/ui/tests/ChangeIdExtractorTest.java:[48] 
11:05:56 	assertEquals("1234", extractor2.getChangeId()); //$NON-NLS-1$
11:05:56 	                     ^^^^^^^^^^^^^^^^^^^^^^^^
11:05:56 Discouraged access: The method 'ChangeIdExtractor.getChangeId()' is not API (restriction on classpath entry '/jobs/genie.egerrit/EGerrit/workspace/org.eclipse.egerrit.dashboard.ui/target/classes')
11:05:56 [WARNING] /jobs/genie.egerrit/EGerrit/workspace/org.eclipse.egerrit.ui.tests/src/org/eclipse/egerrit/ui/tests/ChangeIdExtractorTest.java:[54] 
11:05:56 	ChangeIdExtractor extractor = new ChangeIdExtractor("https://git.eclipse.org/r/#/c/1234/somethingElse"); //$NON-NLS-1$
11:05:56 	^^^^^^^^^^^^^^^^^
11:05:56 Discouraged access: The type 'ChangeIdExtractor' is not API (restriction on classpath entry '/jobs/genie.egerrit/EGerrit/workspace/org.eclipse.egerrit.dashboard.ui/target/classes')
11:05:56 [WARNING] /jobs/genie.egerrit/EGerrit/workspace/org.eclipse.egerrit.ui.tests/src/org/eclipse/egerrit/ui/tests/ChangeIdExtractorTest.java:[54] 
11:05:56 	ChangeIdExtractor extractor = new ChangeIdExtractor("https://git.eclipse.org/r/#/c/1234/somethingElse"); //$NON-NLS-1$
11:05:56 	                              ^^^^^^^^^^^^^^^^^^^^^^^^^^^^^^^^^^^^^^^^^^^^^^^^^^^^^^^^^^^^^^^^^^^^^^^^^
11:05:56 Discouraged access: The constructor 'ChangeIdExtractor(String)' is not API (restriction on classpath entry '/jobs/genie.egerrit/EGerrit/workspace/org.eclipse.egerrit.dashboard.ui/target/classes')
11:05:56 [WARNING] /jobs/genie.egerrit/EGerrit/workspace/org.eclipse.egerrit.ui.tests/src/org/eclipse/egerrit/ui/tests/ChangeIdExtractorTest.java:[54] 
11:05:56 	ChangeIdExtractor extractor = new ChangeIdExtractor("https://git.eclipse.org/r/#/c/1234/somethingElse"); //$NON-NLS-1$
11:05:56 	                                  ^^^^^^^^^^^^^^^^^
11:05:56 Discouraged access: The type 'ChangeIdExtractor' is not API (restriction on classpath entry '/jobs/genie.egerrit/EGerrit/workspace/org.eclipse.egerrit.dashboard.ui/target/classes')
11:05:56 [WARNING] /jobs/genie.egerrit/EGerrit/workspace/org.eclipse.egerrit.ui.tests/src/org/eclipse/egerrit/ui/tests/ChangeIdExtractorTest.java:[55] 
11:05:56 	assertEquals("https://git.eclipse.org/r", extractor.getServer().getServerURI()); //$NON-NLS-1$
11:05:56 	                                          ^^^^^^^^^^^^^^^^^^^^^
11:05:56 Discouraged access: The method 'ChangeIdExtractor.getServer()' is not API (restriction on classpath entry '/jobs/genie.egerrit/EGerrit/workspace/org.eclipse.egerrit.dashboard.ui/target/classes')
11:05:56 [WARNING] /jobs/genie.egerrit/EGerrit/workspace/org.eclipse.egerrit.ui.tests/src/org/eclipse/egerrit/ui/tests/ChangeIdExtractorTest.java:[56] 
11:05:56 	assertEquals("1234", extractor.getChangeId()); //$NON-NLS-1$
11:05:56 	                     ^^^^^^^^^^^^^^^^^^^^^^^
11:05:56 Discouraged access: The method 'ChangeIdExtractor.getChangeId()' is not API (restriction on classpath entry '/jobs/genie.egerrit/EGerrit/workspace/org.eclipse.egerrit.dashboard.ui/target/classes')
11:05:56 84 problems (84 warnings)
11:05:56 [INFO] 
11:05:56 [INFO] --- maven-resources-plugin:2.4.3:testResources (default-testResources) @ org.eclipse.egerrit.ui.tests ---
11:05:56 [INFO] Using 'UTF-8' encoding to copy filtered resources.
11:05:56 [INFO] skip non existing resourceDirectory /jobs/genie.egerrit/EGerrit/workspace/org.eclipse.egerrit.ui.tests/src/test/resources
11:05:56 [INFO] 
11:05:56 [INFO] --- tycho-source-plugin:1.0.0:plugin-source (plugin-source) @ org.eclipse.egerrit.ui.tests ---
11:05:56 [INFO] Building jar: /jobs/genie.egerrit/EGerrit/workspace/org.eclipse.egerrit.ui.tests/target/org.eclipse.egerrit.ui.tests-1.4.0-SNAPSHOT-sources.jar
11:05:56 [INFO] 
11:05:56 [INFO] --- target-platform-configuration:1.0.0:target-platform (default-target-platform) @ org.eclipse.egerrit.ui.tests ---
11:05:56 [INFO] 
11:05:56 [INFO] --- tycho-packaging-plugin:1.0.0:package-plugin (default-package-plugin) @ org.eclipse.egerrit.ui.tests ---
11:05:56 [INFO] Building jar: /jobs/genie.egerrit/EGerrit/workspace/org.eclipse.egerrit.ui.tests/target/org.eclipse.egerrit.ui.tests-1.4.0-SNAPSHOT.jar
11:05:56 [INFO] 
11:05:56 [INFO] --- tycho-p2-plugin:1.0.0:p2-metadata-default (default-p2-metadata-default) @ org.eclipse.egerrit.ui.tests ---
11:05:56 [INFO] 
11:05:56 [INFO] --- tycho-source-feature-plugin:1.0.0:source-feature (source-feature) @ org.eclipse.egerrit.ui.tests ---
11:05:56 [INFO] 
11:05:56 [INFO] --- tycho-pack200a-plugin:1.0.0:normalize (pack200-normalize) @ org.eclipse.egerrit.ui.tests ---
11:05:56 [INFO] Pack200 normalizing jar /jobs/genie.egerrit/EGerrit/workspace/org.eclipse.egerrit.ui.tests/target/org.eclipse.egerrit.ui.tests-1.4.0-SNAPSHOT.jar
11:05:56 [INFO] 
11:05:56 [INFO] --- eclipse-jarsigner-plugin:1.1.4:sign (sign) @ org.eclipse.egerrit.ui.tests ---
11:05:56 [INFO] Signing jar: /jobs/genie.egerrit/EGerrit/workspace/org.eclipse.egerrit.ui.tests/target/org.eclipse.egerrit.ui.tests-1.4.0-SNAPSHOT.jar
11:05:57 [INFO] Signing jar: /jobs/genie.egerrit/EGerrit/workspace/org.eclipse.egerrit.ui.tests/target/org.eclipse.egerrit.ui.tests-1.4.0-SNAPSHOT-sources.jar
11:05:58 [INFO] 
11:05:58 [INFO] --- tycho-pack200b-plugin:1.0.0:pack (pack200-pack) @ org.eclipse.egerrit.ui.tests ---
11:05:58 [INFO] Pack200 packing jar /jobs/genie.egerrit/EGerrit/workspace/org.eclipse.egerrit.ui.tests/target/org.eclipse.egerrit.ui.tests-1.4.0-SNAPSHOT.jar
11:05:58 [INFO] 
11:05:58 [INFO] --- tycho-p2-plugin:1.0.0:p2-metadata (attach-p2-metadata) @ org.eclipse.egerrit.ui.tests ---
11:05:58 [INFO] 
11:05:58 [INFO] --- tycho-surefire-plugin:1.0.0:test (default-test) @ org.eclipse.egerrit.ui.tests ---
11:05:58 [INFO] Skipping tests
11:05:58 [INFO] 
11:05:58 [INFO] --- maven-install-plugin:2.3.1:install (default-install) @ org.eclipse.egerrit.ui.tests ---
11:05:58 [INFO] Installing /jobs/genie.egerrit/EGerrit/workspace/org.eclipse.egerrit.ui.tests/target/org.eclipse.egerrit.ui.tests-1.4.0-SNAPSHOT.jar to /home/hudson/genie.egerrit/.jenkins/jobs/EGerrit/workspace/.repository/org/eclipse/egerrit/org.eclipse.egerrit.ui.tests/1.4.0-SNAPSHOT/org.eclipse.egerrit.ui.tests-1.4.0-SNAPSHOT.jar
11:05:58 [INFO] Installing /jobs/genie.egerrit/EGerrit/workspace/org.eclipse.egerrit.ui.tests/pom.xml to /home/hudson/genie.egerrit/.jenkins/jobs/EGerrit/workspace/.repository/org/eclipse/egerrit/org.eclipse.egerrit.ui.tests/1.4.0-SNAPSHOT/org.eclipse.egerrit.ui.tests-1.4.0-SNAPSHOT.pom
11:05:58 [INFO] Installing /jobs/genie.egerrit/EGerrit/workspace/org.eclipse.egerrit.ui.tests/target/org.eclipse.egerrit.ui.tests-1.4.0-SNAPSHOT-sources.jar to /home/hudson/genie.egerrit/.jenkins/jobs/EGerrit/workspace/.repository/org/eclipse/egerrit/org.eclipse.egerrit.ui.tests/1.4.0-SNAPSHOT/org.eclipse.egerrit.ui.tests-1.4.0-SNAPSHOT-sources.jar
11:05:58 [INFO] Installing /jobs/genie.egerrit/EGerrit/workspace/org.eclipse.egerrit.ui.tests/target/org.eclipse.egerrit.ui.tests-1.4.0-SNAPSHOT.jar.pack.gz to /home/hudson/genie.egerrit/.jenkins/jobs/EGerrit/workspace/.repository/org/eclipse/egerrit/org.eclipse.egerrit.ui.tests/1.4.0-SNAPSHOT/org.eclipse.egerrit.ui.tests-1.4.0-SNAPSHOT-pack200.jar.pack.gz
11:05:58 [INFO] Installing /jobs/genie.egerrit/EGerrit/workspace/org.eclipse.egerrit.ui.tests/target/p2content.xml to /home/hudson/genie.egerrit/.jenkins/jobs/EGerrit/workspace/.repository/org/eclipse/egerrit/org.eclipse.egerrit.ui.tests/1.4.0-SNAPSHOT/org.eclipse.egerrit.ui.tests-1.4.0-SNAPSHOT-p2metadata.xml
11:05:58 [INFO] Installing /jobs/genie.egerrit/EGerrit/workspace/org.eclipse.egerrit.ui.tests/target/p2artifacts.xml to /home/hudson/genie.egerrit/.jenkins/jobs/EGerrit/workspace/.repository/org/eclipse/egerrit/org.eclipse.egerrit.ui.tests/1.4.0-SNAPSHOT/org.eclipse.egerrit.ui.tests-1.4.0-SNAPSHOT-p2artifacts.xml
11:05:58 [INFO] 
11:05:58 [INFO] --- tycho-p2-plugin:1.0.0:update-local-index (default-update-local-index) @ org.eclipse.egerrit.ui.tests ---
11:05:58 [INFO] 
11:05:58 [INFO] ----------< org.eclipse.egerrit:org.eclipse.egerrit.feature >-----------
11:05:58 [INFO] Building EGerrit Feature 1.4.0-SNAPSHOT                          [11/13]
11:05:58 [INFO] --------------------------[ eclipse-feature ]---------------------------
11:05:58 [INFO] 
11:05:58 [INFO] --- maven-clean-plugin:2.5:clean (default-clean) @ org.eclipse.egerrit.feature ---
11:05:58 [INFO] Deleting /jobs/genie.egerrit/EGerrit/workspace/org.eclipse.egerrit.feature/target
11:05:58 [INFO] 
11:05:58 [INFO] --- tycho-packaging-plugin:1.0.0:build-qualifier-aggregator (default-build-qualifier-aggregator) @ org.eclipse.egerrit.feature ---
11:05:58 [INFO] The project's OSGi version is 1.4.0.965
11:05:58 [INFO] 
11:05:58 [INFO] --- tycho-packaging-plugin:1.0.0:validate-id (default-validate-id) @ org.eclipse.egerrit.feature ---
11:05:58 [INFO] 
11:05:58 [INFO] --- tycho-packaging-plugin:1.0.0:validate-version (default-validate-version) @ org.eclipse.egerrit.feature ---
11:05:58 [INFO] 
11:05:58 [INFO] --- maven-enforcer-plugin:1.4.1:enforce (enforce-maven) @ org.eclipse.egerrit.feature ---
11:05:58 [INFO] 
11:05:58 [INFO] --- jacoco-maven-plugin:0.7.4.201502262128:prepare-agent (pre-test) @ org.eclipse.egerrit.feature ---
11:05:58 [INFO] argLine set to -javaagent:/home/hudson/genie.egerrit/.jenkins/jobs/EGerrit/workspace/.repository/org/jacoco/org.jacoco.agent/0.7.4.201502262128/org.jacoco.agent-0.7.4.201502262128-runtime.jar=destfile=/jobs/genie.egerrit/EGerrit/workspace/org.eclipse.egerrit.feature/../target/jacoco.exec,append=true,includes=org.eclipse.egerrit.*
11:05:58 [INFO] 
11:05:58 [INFO] --- tycho-source-plugin:1.0.0:plugin-source (plugin-source) @ org.eclipse.egerrit.feature ---
11:05:58 [INFO] 
11:05:58 [INFO] --- target-platform-configuration:1.0.0:target-platform (default-target-platform) @ org.eclipse.egerrit.feature ---
11:05:58 [INFO] 
11:05:58 [INFO] --- tycho-packaging-plugin:1.0.0:package-feature (default-package-feature) @ org.eclipse.egerrit.feature ---
11:05:58 [INFO] Building jar: /jobs/genie.egerrit/EGerrit/workspace/org.eclipse.egerrit.feature/target/org.eclipse.egerrit.feature-1.4.0-SNAPSHOT.jar
11:05:58 [INFO] 
11:05:58 [INFO] --- tycho-p2-plugin:1.0.0:p2-metadata-default (default-p2-metadata-default) @ org.eclipse.egerrit.feature ---
11:05:58 [INFO] 
11:05:58 [INFO] --- tycho-p2-plugin:1.0.0:feature-p2-metadata (default-feature-p2-metadata) @ org.eclipse.egerrit.feature ---
11:05:58 [INFO] 
11:05:58 [INFO] --- tycho-source-feature-plugin:1.0.0:source-feature (source-feature) @ org.eclipse.egerrit.feature ---
11:05:58 [INFO] Building jar: /jobs/genie.egerrit/EGerrit/workspace/org.eclipse.egerrit.feature/target/org.eclipse.egerrit.feature-1.4.0-SNAPSHOT-sources-feature.jar
11:05:58 [INFO] 
11:05:58 [INFO] --- tycho-pack200a-plugin:1.0.0:normalize (pack200-normalize) @ org.eclipse.egerrit.feature ---
11:05:58 [INFO] 
11:05:58 [INFO] --- eclipse-jarsigner-plugin:1.1.4:sign (sign) @ org.eclipse.egerrit.feature ---
11:05:58 [INFO] Signing jar: /jobs/genie.egerrit/EGerrit/workspace/org.eclipse.egerrit.feature/target/org.eclipse.egerrit.feature-1.4.0-SNAPSHOT.jar
11:05:59 [INFO] Signing jar: /jobs/genie.egerrit/EGerrit/workspace/org.eclipse.egerrit.feature/target/org.eclipse.egerrit.feature-1.4.0-SNAPSHOT-sources-feature.jar
11:06:00 [INFO] 
11:06:00 [INFO] --- tycho-pack200b-plugin:1.0.0:pack (pack200-pack) @ org.eclipse.egerrit.feature ---
11:06:00 [INFO] 
11:06:00 [INFO] --- tycho-p2-plugin:1.0.0:p2-metadata (attach-p2-metadata) @ org.eclipse.egerrit.feature ---
11:06:00 [INFO] 
11:06:00 [INFO] --- maven-install-plugin:2.3.1:install (default-install) @ org.eclipse.egerrit.feature ---
11:06:00 [INFO] Installing /jobs/genie.egerrit/EGerrit/workspace/org.eclipse.egerrit.feature/target/org.eclipse.egerrit.feature-1.4.0-SNAPSHOT.jar to /home/hudson/genie.egerrit/.jenkins/jobs/EGerrit/workspace/.repository/org/eclipse/egerrit/org.eclipse.egerrit.feature/1.4.0-SNAPSHOT/org.eclipse.egerrit.feature-1.4.0-SNAPSHOT.jar
11:06:00 [INFO] Installing /jobs/genie.egerrit/EGerrit/workspace/org.eclipse.egerrit.feature/pom.xml to /home/hudson/genie.egerrit/.jenkins/jobs/EGerrit/workspace/.repository/org/eclipse/egerrit/org.eclipse.egerrit.feature/1.4.0-SNAPSHOT/org.eclipse.egerrit.feature-1.4.0-SNAPSHOT.pom
11:06:00 [INFO] Installing /jobs/genie.egerrit/EGerrit/workspace/org.eclipse.egerrit.feature/target/org.eclipse.egerrit.feature-1.4.0-SNAPSHOT-sources-feature.jar to /home/hudson/genie.egerrit/.jenkins/jobs/EGerrit/workspace/.repository/org/eclipse/egerrit/org.eclipse.egerrit.feature/1.4.0-SNAPSHOT/org.eclipse.egerrit.feature-1.4.0-SNAPSHOT-sources-feature.jar
11:06:00 [INFO] Installing /jobs/genie.egerrit/EGerrit/workspace/org.eclipse.egerrit.feature/target/p2content.xml to /home/hudson/genie.egerrit/.jenkins/jobs/EGerrit/workspace/.repository/org/eclipse/egerrit/org.eclipse.egerrit.feature/1.4.0-SNAPSHOT/org.eclipse.egerrit.feature-1.4.0-SNAPSHOT-p2metadata.xml
11:06:00 [INFO] Installing /jobs/genie.egerrit/EGerrit/workspace/org.eclipse.egerrit.feature/target/p2artifacts.xml to /home/hudson/genie.egerrit/.jenkins/jobs/EGerrit/workspace/.repository/org/eclipse/egerrit/org.eclipse.egerrit.feature/1.4.0-SNAPSHOT/org.eclipse.egerrit.feature-1.4.0-SNAPSHOT-p2artifacts.xml
11:06:00 [INFO] 
11:06:00 [INFO] --- tycho-p2-plugin:1.0.0:update-local-index (default-update-local-index) @ org.eclipse.egerrit.feature ---
11:06:00 [INFO] 
11:06:00 [INFO] ---------< org.eclipse.egerrit:org.eclipse.egerrit.updatesite >---------
11:06:00 [INFO] Building EGerrit Update site 1.4.0-SNAPSHOT                      [12/13]
11:06:00 [INFO] -------------------------[ eclipse-repository ]-------------------------
11:06:00 [INFO] 
11:06:00 [INFO] --- maven-clean-plugin:2.5:clean (default-clean) @ org.eclipse.egerrit.updatesite ---
11:06:00 [INFO] 
11:06:00 [INFO] --- tycho-packaging-plugin:1.0.0:build-qualifier-aggregator (default-build-qualifier-aggregator) @ org.eclipse.egerrit.updatesite ---
11:06:00 [INFO] The project's OSGi version is 1.4.0.965
11:06:00 [INFO] 
11:06:00 [INFO] --- maven-enforcer-plugin:1.4.1:enforce (enforce-maven) @ org.eclipse.egerrit.updatesite ---
11:06:00 [INFO] 
11:06:00 [INFO] --- maven-clean-plugin:2.5:clean (default-clean-1) @ org.eclipse.egerrit.updatesite ---
11:06:00 [INFO] 
11:06:00 [INFO] --- jacoco-maven-plugin:0.7.4.201502262128:prepare-agent (pre-test) @ org.eclipse.egerrit.updatesite ---
11:06:00 [INFO] argLine set to -javaagent:/home/hudson/genie.egerrit/.jenkins/jobs/EGerrit/workspace/.repository/org/jacoco/org.jacoco.agent/0.7.4.201502262128/org.jacoco.agent-0.7.4.201502262128-runtime.jar=destfile=/jobs/genie.egerrit/EGerrit/workspace/org.eclipse.egerrit.updatesite/../target/jacoco.exec,append=true,includes=org.eclipse.egerrit.*
11:06:00 [INFO] 
11:06:00 [INFO] --- maven-resources-plugin:2.4.3:resources (default-resources) @ org.eclipse.egerrit.updatesite ---
11:06:00 [INFO] Using 'UTF-8' encoding to copy filtered resources.
11:06:00 [INFO] skip non existing resourceDirectory /jobs/genie.egerrit/EGerrit/workspace/org.eclipse.egerrit.updatesite/src/main/resources
11:06:00 [INFO] 
11:06:00 [INFO] --- tycho-source-plugin:1.0.0:plugin-source (plugin-source) @ org.eclipse.egerrit.updatesite ---
11:06:00 [INFO] 
11:06:00 [INFO] --- target-platform-configuration:1.0.0:target-platform (default-target-platform) @ org.eclipse.egerrit.updatesite ---
11:06:00 [INFO] 
11:06:00 [INFO] --- tycho-p2-publisher-plugin:1.0.0:publish-products (default-publish-products) @ org.eclipse.egerrit.updatesite ---
11:06:00 [INFO] 
11:06:00 [INFO] --- tycho-p2-publisher-plugin:1.0.0:publish-categories (default-publish-categories) @ org.eclipse.egerrit.updatesite ---
11:06:00 [INFO] 
11:06:00 [INFO] --- tycho-p2-publisher-plugin:1.0.0:attach-artifacts (default-attach-artifacts) @ org.eclipse.egerrit.updatesite ---
11:06:00 [INFO] 
11:06:00 [INFO] --- tycho-p2-repository-plugin:1.0.0:assemble-repository (default-assemble-repository) @ org.eclipse.egerrit.updatesite ---
11:06:02 [INFO] 
11:06:02 [INFO] --- tycho-p2-repository-plugin:1.0.0:archive-repository (default-archive-repository) @ org.eclipse.egerrit.updatesite ---
11:06:02 [INFO] Building zip: /jobs/genie.egerrit/EGerrit/workspace/org.eclipse.egerrit.updatesite/target/org.eclipse.egerrit.updatesite-1.4.0-SNAPSHOT.zip
11:06:02 [INFO] 
11:06:02 [INFO] --- tycho-source-feature-plugin:1.0.0:source-feature (source-feature) @ org.eclipse.egerrit.updatesite ---
11:06:02 [INFO] 
11:06:02 [INFO] --- tycho-pack200a-plugin:1.0.0:normalize (pack200-normalize) @ org.eclipse.egerrit.updatesite ---
11:06:02 [INFO] 
11:06:02 [INFO] --- eclipse-jarsigner-plugin:1.1.4:sign (sign) @ org.eclipse.egerrit.updatesite ---
11:06:02 [INFO] 
11:06:02 [INFO] --- tycho-pack200b-plugin:1.0.0:pack (pack200-pack) @ org.eclipse.egerrit.updatesite ---
11:06:02 [INFO] 
11:06:02 [INFO] --- tycho-p2-plugin:1.0.0:p2-metadata (attach-p2-metadata) @ org.eclipse.egerrit.updatesite ---
11:06:02 [INFO] 
11:06:02 [INFO] --- maven-install-plugin:2.3.1:install (default-install) @ org.eclipse.egerrit.updatesite ---
11:06:02 [INFO] Installing /jobs/genie.egerrit/EGerrit/workspace/org.eclipse.egerrit.updatesite/target/org.eclipse.egerrit.updatesite-1.4.0-SNAPSHOT.zip to /home/hudson/genie.egerrit/.jenkins/jobs/EGerrit/workspace/.repository/org/eclipse/egerrit/org.eclipse.egerrit.updatesite/1.4.0-SNAPSHOT/org.eclipse.egerrit.updatesite-1.4.0-SNAPSHOT.zip
11:06:02 [INFO] Installing /jobs/genie.egerrit/EGerrit/workspace/org.eclipse.egerrit.updatesite/pom.xml to /home/hudson/genie.egerrit/.jenkins/jobs/EGerrit/workspace/.repository/org/eclipse/egerrit/org.eclipse.egerrit.updatesite/1.4.0-SNAPSHOT/org.eclipse.egerrit.updatesite-1.4.0-SNAPSHOT.pom
11:06:02 [INFO] Installing /jobs/genie.egerrit/EGerrit/workspace/org.eclipse.egerrit.updatesite/target/p2content.xml to /home/hudson/genie.egerrit/.jenkins/jobs/EGerrit/workspace/.repository/org/eclipse/egerrit/org.eclipse.egerrit.updatesite/1.4.0-SNAPSHOT/org.eclipse.egerrit.updatesite-1.4.0-SNAPSHOT-p2metadata.xml
11:06:02 [INFO] Installing /jobs/genie.egerrit/EGerrit/workspace/org.eclipse.egerrit.updatesite/target/p2artifacts.xml to /home/hudson/genie.egerrit/.jenkins/jobs/EGerrit/workspace/.repository/org/eclipse/egerrit/org.eclipse.egerrit.updatesite/1.4.0-SNAPSHOT/org.eclipse.egerrit.updatesite-1.4.0-SNAPSHOT-p2artifacts.xml
11:06:02 [INFO] 
11:06:02 [INFO] --- tycho-p2-plugin:1.0.0:update-local-index (default-update-local-index) @ org.eclipse.egerrit.updatesite ---
11:06:02 [INFO] 
11:06:02 [INFO] ------< org.eclipse.egerrit:org.eclipse.egerrit.updatesite.tests >------
11:06:02 [INFO] Building EGerrit Update site for tests 1.4.0-SNAPSHOT            [13/13]
11:06:02 [INFO] -------------------------[ eclipse-repository ]-------------------------
11:06:02 [INFO] 
11:06:02 [INFO] --- maven-clean-plugin:2.5:clean (default-clean) @ org.eclipse.egerrit.updatesite.tests ---
11:06:02 [INFO] 
11:06:02 [INFO] --- tycho-packaging-plugin:1.0.0:build-qualifier-aggregator (default-build-qualifier-aggregator) @ org.eclipse.egerrit.updatesite.tests ---
11:06:02 [INFO] The project's OSGi version is 1.4.0.965
11:06:02 [INFO] 
11:06:02 [INFO] --- maven-enforcer-plugin:1.4.1:enforce (enforce-maven) @ org.eclipse.egerrit.updatesite.tests ---
11:06:02 [INFO] 
11:06:02 [INFO] --- maven-clean-plugin:2.5:clean (default-clean-1) @ org.eclipse.egerrit.updatesite.tests ---
11:06:02 [INFO] 
11:06:02 [INFO] --- jacoco-maven-plugin:0.7.4.201502262128:prepare-agent (pre-test) @ org.eclipse.egerrit.updatesite.tests ---
11:06:02 [INFO] argLine set to -javaagent:/home/hudson/genie.egerrit/.jenkins/jobs/EGerrit/workspace/.repository/org/jacoco/org.jacoco.agent/0.7.4.201502262128/org.jacoco.agent-0.7.4.201502262128-runtime.jar=destfile=/jobs/genie.egerrit/EGerrit/workspace/org.eclipse.egerrit.updatesite.tests/../target/jacoco.exec,append=true,includes=org.eclipse.egerrit.*
11:06:02 [INFO] 
11:06:02 [INFO] --- maven-resources-plugin:2.4.3:resources (default-resources) @ org.eclipse.egerrit.updatesite.tests ---
11:06:02 [INFO] Using 'UTF-8' encoding to copy filtered resources.
11:06:02 [INFO] skip non existing resourceDirectory /jobs/genie.egerrit/EGerrit/workspace/org.eclipse.egerrit.updatesite.tests/src/main/resources
11:06:02 [INFO] 
11:06:02 [INFO] --- tycho-source-plugin:1.0.0:plugin-source (plugin-source) @ org.eclipse.egerrit.updatesite.tests ---
11:06:02 [INFO] 
11:06:02 [INFO] --- target-platform-configuration:1.0.0:target-platform (default-target-platform) @ org.eclipse.egerrit.updatesite.tests ---
11:06:02 [INFO] 
11:06:02 [INFO] --- tycho-p2-publisher-plugin:1.0.0:publish-products (default-publish-products) @ org.eclipse.egerrit.updatesite.tests ---
11:06:02 [INFO] 
11:06:02 [INFO] --- tycho-p2-publisher-plugin:1.0.0:publish-categories (default-publish-categories) @ org.eclipse.egerrit.updatesite.tests ---
11:06:02 [INFO] 
11:06:02 [INFO] --- tycho-p2-publisher-plugin:1.0.0:attach-artifacts (default-attach-artifacts) @ org.eclipse.egerrit.updatesite.tests ---
11:06:02 [INFO] 
11:06:02 [INFO] --- tycho-p2-repository-plugin:1.0.0:assemble-repository (default-assemble-repository) @ org.eclipse.egerrit.updatesite.tests ---
11:06:04 [INFO] 
11:06:04 [INFO] --- tycho-p2-repository-plugin:1.0.0:archive-repository (default-archive-repository) @ org.eclipse.egerrit.updatesite.tests ---
11:06:04 [INFO] Building zip: /jobs/genie.egerrit/EGerrit/workspace/org.eclipse.egerrit.updatesite.tests/target/org.eclipse.egerrit.updatesite.tests-1.4.0-SNAPSHOT.zip
11:06:04 [INFO] 
11:06:04 [INFO] --- tycho-source-feature-plugin:1.0.0:source-feature (source-feature) @ org.eclipse.egerrit.updatesite.tests ---
11:06:04 [INFO] 
11:06:04 [INFO] --- tycho-pack200a-plugin:1.0.0:normalize (pack200-normalize) @ org.eclipse.egerrit.updatesite.tests ---
11:06:04 [INFO] 
11:06:04 [INFO] --- eclipse-jarsigner-plugin:1.1.4:sign (sign) @ org.eclipse.egerrit.updatesite.tests ---
11:06:04 [INFO] 
11:06:04 [INFO] --- tycho-pack200b-plugin:1.0.0:pack (pack200-pack) @ org.eclipse.egerrit.updatesite.tests ---
11:06:04 [INFO] 
11:06:04 [INFO] --- tycho-p2-plugin:1.0.0:p2-metadata (attach-p2-metadata) @ org.eclipse.egerrit.updatesite.tests ---
11:06:04 [INFO] 
11:06:04 [INFO] --- maven-install-plugin:2.3.1:install (default-install) @ org.eclipse.egerrit.updatesite.tests ---
11:06:04 [INFO] Installing /jobs/genie.egerrit/EGerrit/workspace/org.eclipse.egerrit.updatesite.tests/target/org.eclipse.egerrit.updatesite.tests-1.4.0-SNAPSHOT.zip to /home/hudson/genie.egerrit/.jenkins/jobs/EGerrit/workspace/.repository/org/eclipse/egerrit/org.eclipse.egerrit.updatesite.tests/1.4.0-SNAPSHOT/org.eclipse.egerrit.updatesite.tests-1.4.0-SNAPSHOT.zip
11:06:04 [INFO] Installing /jobs/genie.egerrit/EGerrit/workspace/org.eclipse.egerrit.updatesite.tests/pom.xml to /home/hudson/genie.egerrit/.jenkins/jobs/EGerrit/workspace/.repository/org/eclipse/egerrit/org.eclipse.egerrit.updatesite.tests/1.4.0-SNAPSHOT/org.eclipse.egerrit.updatesite.tests-1.4.0-SNAPSHOT.pom
11:06:04 [INFO] Installing /jobs/genie.egerrit/EGerrit/workspace/org.eclipse.egerrit.updatesite.tests/target/p2content.xml to /home/hudson/genie.egerrit/.jenkins/jobs/EGerrit/workspace/.repository/org/eclipse/egerrit/org.eclipse.egerrit.updatesite.tests/1.4.0-SNAPSHOT/org.eclipse.egerrit.updatesite.tests-1.4.0-SNAPSHOT-p2metadata.xml
11:06:04 [INFO] Installing /jobs/genie.egerrit/EGerrit/workspace/org.eclipse.egerrit.updatesite.tests/target/p2artifacts.xml to /home/hudson/genie.egerrit/.jenkins/jobs/EGerrit/workspace/.repository/org/eclipse/egerrit/org.eclipse.egerrit.updatesite.tests/1.4.0-SNAPSHOT/org.eclipse.egerrit.updatesite.tests-1.4.0-SNAPSHOT-p2artifacts.xml
11:06:04 [INFO] 
11:06:04 [INFO] --- tycho-p2-plugin:1.0.0:update-local-index (default-update-local-index) @ org.eclipse.egerrit.updatesite.tests ---
11:06:04 [INFO] ------------------------------------------------------------------------
11:06:04 [INFO] Reactor Summary:
11:06:04 [INFO] 
11:06:04 [INFO] EGerrit Parent 1.4.0-SNAPSHOT ...................... SUCCESS [ 11.716 s]
11:06:04 [INFO] EGerrit Target Platform ............................ SUCCESS [  0.438 s]
11:06:04 [INFO] EGerrit Model Plug-in .............................. SUCCESS [  8.935 s]
11:06:04 [INFO] EGerrit Core Plug-in ............................... SUCCESS [  2.652 s]
11:06:04 [INFO] EGerrit Model Edit Plug-in ......................... SUCCESS [  2.892 s]
11:06:04 [INFO] EGerrit Core Tests Plug-in ......................... SUCCESS [  2.582 s]
11:06:04 [INFO] EGerrit UI Plug-in ................................. SUCCESS [  6.198 s]
11:06:04 [INFO] org.eclipse.egerrit.dashboard.core ................. SUCCESS [  1.937 s]
11:06:04 [INFO] org.eclipse.egerrit.dashboard.ui ................... SUCCESS [  2.812 s]
11:06:04 [INFO] EGerrit UI Tests Plug-in ........................... SUCCESS [  3.016 s]
11:06:04 [INFO] EGerrit Feature .................................... SUCCESS [  1.733 s]
11:06:04 [INFO] EGerrit Update site ................................ SUCCESS [  2.345 s]
11:06:04 [INFO] EGerrit Update site for tests 1.4.0-SNAPSHOT ....... SUCCESS [  1.474 s]
11:06:04 [INFO] ------------------------------------------------------------------------
11:06:04 [INFO] BUILD SUCCESS
11:06:04 [INFO] ------------------------------------------------------------------------
11:06:04 [INFO] Total time: 04:07 min
11:06:04 [INFO] Finished at: 2018-10-05T11:06:04-04:00
11:06:04 [INFO] ------------------------------------------------------------------------
11:06:05 [workspace] $ /shared/common/apache-maven-latest/bin/mvn -f org.eclipse.egerrit.ui.rcptt.tests/pom.xml -DEGerritUseDefinedProxy=true -DEGerritGerritTestServerPort=28115 -DforceContextQualifier=965 -DRCPTTWaitTime=3000 -DEGerritGerritTestServerHost=104.154.18.211 -Dmaven.repo.local=/home/hudson/genie.egerrit/.jenkins/jobs/EGerrit/workspace/.repository clean verify -s org.eclipse.egerrit.releng/settings.xml -Phudson
11:06:05 Picked up JAVA_TOOL_OPTIONS: -Xmx2G -Djava.io.tmpdir=/tmp/genie.egerrit
11:06:07 [INFO] Scanning for projects...
11:06:08 Downloading from rcptt-releases: https://repo.eclipse.org/content/repositories/rcptt-releases/org/eclipse/rcptt/rcptt-maven-plugin/2.1.0/rcptt-maven-plugin-2.1.0.pom
11:06:08 Progress (1): 1.4 kB
                    
Downloaded from rcptt-releases: https://repo.eclipse.org/content/repositories/rcptt-releases/org/eclipse/rcptt/rcptt-maven-plugin/2.1.0/rcptt-maven-plugin-2.1.0.pom (1.4 kB at 4.2 kB/s)
11:06:08 Downloading from rcptt-releases: https://repo.eclipse.org/content/repositories/rcptt-releases/org/eclipse/rcptt/rcptt-maven-modules/2.1.0/rcptt-maven-modules-2.1.0.pom
11:06:08 Progress (1): 1.5 kB
                    
Downloaded from rcptt-releases: https://repo.eclipse.org/content/repositories/rcptt-releases/org/eclipse/rcptt/rcptt-maven-modules/2.1.0/rcptt-maven-modules-2.1.0.pom (1.5 kB at 60 kB/s)
11:06:08 Downloading from rcptt-releases: https://repo.eclipse.org/content/repositories/rcptt-releases/org/eclipse/rcptt/rcptt-maven-util/2.1.0/rcptt-maven-util-2.1.0.pom
11:06:08 Progress (1): 1.1 kB
                    
Downloaded from rcptt-releases: https://repo.eclipse.org/content/repositories/rcptt-releases/org/eclipse/rcptt/rcptt-maven-util/2.1.0/rcptt-maven-util-2.1.0.pom (1.1 kB at 50 kB/s)
11:06:08 Downloading from rcptt-releases: https://repo.eclipse.org/content/repositories/rcptt-releases/org/codehaus/plexus/plexus-archiver/1.2/plexus-archiver-1.2.pom
11:06:08 Downloading from rcptt-snapshots: https://repo.eclipse.org/content/repositories/rcptt-snapshots/org/codehaus/plexus/plexus-archiver/1.2/plexus-archiver-1.2.pom
11:06:08 Downloading from eclipse-cbi-releases: https://repo.eclipse.org/content/groups/cbi/org/codehaus/plexus/plexus-archiver/1.2/plexus-archiver-1.2.pom
11:06:08 Downloading from eclipse-maven-central: https://repo.eclipse.org/content/repositories/maven_central/org/codehaus/plexus/plexus-archiver/1.2/plexus-archiver-1.2.pom
11:06:08 Progress (1): 2.0 kB
                    
Downloaded from eclipse-maven-central: https://repo.eclipse.org/content/repositories/maven_central/org/codehaus/plexus/plexus-archiver/1.2/plexus-archiver-1.2.pom (2.0 kB at 52 kB/s)
11:06:08 Downloading from rcptt-releases: https://repo.eclipse.org/content/repositories/rcptt-releases/org/codehaus/plexus/plexus-io/1.0.1/plexus-io-1.0.1.pom
11:06:08 Downloading from rcptt-snapshots: https://repo.eclipse.org/content/repositories/rcptt-snapshots/org/codehaus/plexus/plexus-io/1.0.1/plexus-io-1.0.1.pom
11:06:08 Downloading from eclipse-cbi-releases: https://repo.eclipse.org/content/groups/cbi/org/codehaus/plexus/plexus-io/1.0.1/plexus-io-1.0.1.pom
11:06:09 Downloading from eclipse-maven-central: https://repo.eclipse.org/content/repositories/maven_central/org/codehaus/plexus/plexus-io/1.0.1/plexus-io-1.0.1.pom
11:06:09 Progress (1): 1.2 kB
                    
Downloaded from eclipse-maven-central: https://repo.eclipse.org/content/repositories/maven_central/org/codehaus/plexus/plexus-io/1.0.1/plexus-io-1.0.1.pom (1.2 kB at 33 kB/s)
11:06:09 Downloading from rcptt-releases: https://repo.eclipse.org/content/repositories/rcptt-releases/org/apache/maven/maven-core/3.2.1/maven-core-3.2.1.pom
11:06:09 Downloading from rcptt-snapshots: https://repo.eclipse.org/content/repositories/rcptt-snapshots/org/apache/maven/maven-core/3.2.1/maven-core-3.2.1.pom
11:06:09 Downloading from eclipse-cbi-releases: https://repo.eclipse.org/content/groups/cbi/org/apache/maven/maven-core/3.2.1/maven-core-3.2.1.pom
11:06:09 Downloading from eclipse-maven-central: https://repo.eclipse.org/content/repositories/maven_central/org/apache/maven/maven-core/3.2.1/maven-core-3.2.1.pom
11:06:09 Progress (1): 4.1/7.6 kB
Progress (1): 7.6 kB    
                    
Downloaded from eclipse-maven-central: https://repo.eclipse.org/content/repositories/maven_central/org/apache/maven/maven-core/3.2.1/maven-core-3.2.1.pom (7.6 kB at 218 kB/s)
11:06:09 Downloading from rcptt-releases: https://repo.eclipse.org/content/repositories/rcptt-releases/org/apache/maven/maven/3.2.1/maven-3.2.1.pom
11:06:09 Downloading from rcptt-snapshots: https://repo.eclipse.org/content/repositories/rcptt-snapshots/org/apache/maven/maven/3.2.1/maven-3.2.1.pom
11:06:09 Downloading from eclipse-cbi-releases: https://repo.eclipse.org/content/groups/cbi/org/apache/maven/maven/3.2.1/maven-3.2.1.pom
11:06:09 Downloading from eclipse-maven-central: https://repo.eclipse.org/content/repositories/maven_central/org/apache/maven/maven/3.2.1/maven-3.2.1.pom
11:06:09 Progress (1): 4.1/23 kB
Progress (1): 7.7/23 kB
Progress (1): 12/23 kB 
Progress (1): 16/23 kB
Progress (1): 20/23 kB
Progress (1): 23 kB   
                   
Downloaded from eclipse-maven-central: https://repo.eclipse.org/content/repositories/maven_central/org/apache/maven/maven/3.2.1/maven-3.2.1.pom (23 kB at 565 kB/s)
11:06:09 Downloading from rcptt-releases: https://repo.eclipse.org/content/repositories/rcptt-releases/org/apache/maven/maven-model/3.2.1/maven-model-3.2.1.pom
11:06:09 Downloading from rcptt-snapshots: https://repo.eclipse.org/content/repositories/rcptt-snapshots/org/apache/maven/maven-model/3.2.1/maven-model-3.2.1.pom
11:06:09 Downloading from eclipse-cbi-releases: https://repo.eclipse.org/content/groups/cbi/org/apache/maven/maven-model/3.2.1/maven-model-3.2.1.pom
11:06:09 Downloading from eclipse-maven-central: https://repo.eclipse.org/content/repositories/maven_central/org/apache/maven/maven-model/3.2.1/maven-model-3.2.1.pom
11:06:09 Progress (1): 4.1/4.1 kB
Progress (1): 4.1 kB    
                    
Downloaded from eclipse-maven-central: https://repo.eclipse.org/content/repositories/maven_central/org/apache/maven/maven-model/3.2.1/maven-model-3.2.1.pom (4.1 kB at 70 kB/s)
11:06:09 Downloading from rcptt-releases: https://repo.eclipse.org/content/repositories/rcptt-releases/org/codehaus/plexus/plexus-utils/3.0.17/plexus-utils-3.0.17.pom
11:06:09 Downloading from rcptt-snapshots: https://repo.eclipse.org/content/repositories/rcptt-snapshots/org/codehaus/plexus/plexus-utils/3.0.17/plexus-utils-3.0.17.pom
11:06:09 Downloading from eclipse-cbi-releases: https://repo.eclipse.org/content/groups/cbi/org/codehaus/plexus/plexus-utils/3.0.17/plexus-utils-3.0.17.pom
11:06:09 Downloading from eclipse-maven-central: https://repo.eclipse.org/content/repositories/maven_central/org/codehaus/plexus/plexus-utils/3.0.17/plexus-utils-3.0.17.pom
11:06:09 Progress (1): 3.4 kB
                    
Downloaded from eclipse-maven-central: https://repo.eclipse.org/content/repositories/maven_central/org/codehaus/plexus/plexus-utils/3.0.17/plexus-utils-3.0.17.pom (3.4 kB at 113 kB/s)
11:06:09 Downloading from rcptt-releases: https://repo.eclipse.org/content/repositories/rcptt-releases/org/apache/maven/maven-settings/3.2.1/maven-settings-3.2.1.pom
11:06:09 Downloading from rcptt-snapshots: https://repo.eclipse.org/content/repositories/rcptt-snapshots/org/apache/maven/maven-settings/3.2.1/maven-settings-3.2.1.pom
11:06:09 Downloading from eclipse-cbi-releases: https://repo.eclipse.org/content/groups/cbi/org/apache/maven/maven-settings/3.2.1/maven-settings-3.2.1.pom
11:06:09 Downloading from eclipse-maven-central: https://repo.eclipse.org/content/repositories/maven_central/org/apache/maven/maven-settings/3.2.1/maven-settings-3.2.1.pom
11:06:09 Progress (1): 2.2 kB
                    
Downloaded from eclipse-maven-central: https://repo.eclipse.org/content/repositories/maven_central/org/apache/maven/maven-settings/3.2.1/maven-settings-3.2.1.pom (2.2 kB at 64 kB/s)
11:06:09 Downloading from rcptt-releases: https://repo.eclipse.org/content/repositories/rcptt-releases/org/apache/maven/maven-settings-builder/3.2.1/maven-settings-builder-3.2.1.pom
11:06:09 Downloading from rcptt-snapshots: https://repo.eclipse.org/content/repositories/rcptt-snapshots/org/apache/maven/maven-settings-builder/3.2.1/maven-settings-builder-3.2.1.pom
11:06:09 Downloading from eclipse-cbi-releases: https://repo.eclipse.org/content/groups/cbi/org/apache/maven/maven-settings-builder/3.2.1/maven-settings-builder-3.2.1.pom
11:06:09 Downloading from eclipse-maven-central: https://repo.eclipse.org/content/repositories/maven_central/org/apache/maven/maven-settings-builder/3.2.1/maven-settings-builder-3.2.1.pom
11:06:09 Progress (1): 2.6 kB
                    
Downloaded from eclipse-maven-central: https://repo.eclipse.org/content/repositories/maven_central/org/apache/maven/maven-settings-builder/3.2.1/maven-settings-builder-3.2.1.pom (2.6 kB at 67 kB/s)
11:06:09 Downloading from rcptt-releases: https://repo.eclipse.org/content/repositories/rcptt-releases/org/codehaus/plexus/plexus-interpolation/1.19/plexus-interpolation-1.19.pom
11:06:09 Downloading from rcptt-snapshots: https://repo.eclipse.org/content/repositories/rcptt-snapshots/org/codehaus/plexus/plexus-interpolation/1.19/plexus-interpolation-1.19.pom
11:06:09 Downloading from eclipse-cbi-releases: https://repo.eclipse.org/content/groups/cbi/org/codehaus/plexus/plexus-interpolation/1.19/plexus-interpolation-1.19.pom
11:06:09 Downloading from eclipse-maven-central: https://repo.eclipse.org/content/repositories/maven_central/org/codehaus/plexus/plexus-interpolation/1.19/plexus-interpolation-1.19.pom
11:06:09 Progress (1): 1.0 kB
                    
Downloaded from eclipse-maven-central: https://repo.eclipse.org/content/repositories/maven_central/org/codehaus/plexus/plexus-interpolation/1.19/plexus-interpolation-1.19.pom (1.0 kB at 29 kB/s)
11:06:09 Downloading from rcptt-releases: https://repo.eclipse.org/content/repositories/rcptt-releases/org/apache/maven/maven-repository-metadata/3.2.1/maven-repository-metadata-3.2.1.pom
11:06:09 Downloading from rcptt-snapshots: https://repo.eclipse.org/content/repositories/rcptt-snapshots/org/apache/maven/maven-repository-metadata/3.2.1/maven-repository-metadata-3.2.1.pom
11:06:09 Downloading from eclipse-cbi-releases: https://repo.eclipse.org/content/groups/cbi/org/apache/maven/maven-repository-metadata/3.2.1/maven-repository-metadata-3.2.1.pom
11:06:09 Downloading from eclipse-maven-central: https://repo.eclipse.org/content/repositories/maven_central/org/apache/maven/maven-repository-metadata/3.2.1/maven-repository-metadata-3.2.1.pom
11:06:09 Progress (1): 2.2 kB
                    
Downloaded from eclipse-maven-central: https://repo.eclipse.org/content/repositories/maven_central/org/apache/maven/maven-repository-metadata/3.2.1/maven-repository-metadata-3.2.1.pom (2.2 kB at 54 kB/s)
11:06:09 Downloading from rcptt-releases: https://repo.eclipse.org/content/repositories/rcptt-releases/org/apache/maven/maven-artifact/3.2.1/maven-artifact-3.2.1.pom
11:06:09 Downloading from rcptt-snapshots: https://repo.eclipse.org/content/repositories/rcptt-snapshots/org/apache/maven/maven-artifact/3.2.1/maven-artifact-3.2.1.pom
11:06:09 Downloading from eclipse-cbi-releases: https://repo.eclipse.org/content/groups/cbi/org/apache/maven/maven-artifact/3.2.1/maven-artifact-3.2.1.pom
11:06:09 Downloading from eclipse-maven-central: https://repo.eclipse.org/content/repositories/maven_central/org/apache/maven/maven-artifact/3.2.1/maven-artifact-3.2.1.pom
11:06:09 Progress (1): 2.0 kB
                    
Downloaded from eclipse-maven-central: https://repo.eclipse.org/content/repositories/maven_central/org/apache/maven/maven-artifact/3.2.1/maven-artifact-3.2.1.pom (2.0 kB at 58 kB/s)
11:06:09 Downloading from rcptt-releases: https://repo.eclipse.org/content/repositories/rcptt-releases/org/apache/maven/maven-plugin-api/3.2.1/maven-plugin-api-3.2.1.pom
11:06:10 Downloading from rcptt-snapshots: https://repo.eclipse.org/content/repositories/rcptt-snapshots/org/apache/maven/maven-plugin-api/3.2.1/maven-plugin-api-3.2.1.pom
11:06:10 Downloading from eclipse-cbi-releases: https://repo.eclipse.org/content/groups/cbi/org/apache/maven/maven-plugin-api/3.2.1/maven-plugin-api-3.2.1.pom
11:06:10 Downloading from eclipse-maven-central: https://repo.eclipse.org/content/repositories/maven_central/org/apache/maven/maven-plugin-api/3.2.1/maven-plugin-api-3.2.1.pom
11:06:10 Progress (1): 3.4 kB
                    
Downloaded from eclipse-maven-central: https://repo.eclipse.org/content/repositories/maven_central/org/apache/maven/maven-plugin-api/3.2.1/maven-plugin-api-3.2.1.pom (3.4 kB at 99 kB/s)
11:06:10 Downloading from rcptt-releases: https://repo.eclipse.org/content/repositories/rcptt-releases/org/eclipse/sisu/org.eclipse.sisu.plexus/0.0.0.M5/org.eclipse.sisu.plexus-0.0.0.M5.pom
11:06:10 Downloading from rcptt-snapshots: https://repo.eclipse.org/content/repositories/rcptt-snapshots/org/eclipse/sisu/org.eclipse.sisu.plexus/0.0.0.M5/org.eclipse.sisu.plexus-0.0.0.M5.pom
11:06:10 Downloading from eclipse-cbi-releases: https://repo.eclipse.org/content/groups/cbi/org/eclipse/sisu/org.eclipse.sisu.plexus/0.0.0.M5/org.eclipse.sisu.plexus-0.0.0.M5.pom
11:06:10 Downloading from eclipse-maven-central: https://repo.eclipse.org/content/repositories/maven_central/org/eclipse/sisu/org.eclipse.sisu.plexus/0.0.0.M5/org.eclipse.sisu.plexus-0.0.0.M5.pom
11:06:10 Progress (1): 4.1/4.8 kB
Progress (1): 4.8 kB    
                    
Downloaded from eclipse-maven-central: https://repo.eclipse.org/content/repositories/maven_central/org/eclipse/sisu/org.eclipse.sisu.plexus/0.0.0.M5/org.eclipse.sisu.plexus-0.0.0.M5.pom (4.8 kB at 134 kB/s)
11:06:10 Downloading from rcptt-releases: https://repo.eclipse.org/content/repositories/rcptt-releases/org/eclipse/sisu/sisu-plexus/0.0.0.M5/sisu-plexus-0.0.0.M5.pom
11:06:10 Downloading from rcptt-snapshots: https://repo.eclipse.org/content/repositories/rcptt-snapshots/org/eclipse/sisu/sisu-plexus/0.0.0.M5/sisu-plexus-0.0.0.M5.pom
11:06:10 Downloading from eclipse-cbi-releases: https://repo.eclipse.org/content/groups/cbi/org/eclipse/sisu/sisu-plexus/0.0.0.M5/sisu-plexus-0.0.0.M5.pom
11:06:10 Downloading from eclipse-maven-central: https://repo.eclipse.org/content/repositories/maven_central/org/eclipse/sisu/sisu-plexus/0.0.0.M5/sisu-plexus-0.0.0.M5.pom
11:06:10 Progress (1): 4.1/13 kB
Progress (1): 7.7/13 kB
Progress (1): 12/13 kB 
Progress (1): 13 kB   
                   
Downloaded from eclipse-maven-central: https://repo.eclipse.org/content/repositories/maven_central/org/eclipse/sisu/sisu-plexus/0.0.0.M5/sisu-plexus-0.0.0.M5.pom (13 kB at 388 kB/s)
11:06:10 Downloading from rcptt-releases: https://repo.eclipse.org/content/repositories/rcptt-releases/com/google/guava/guava/10.0.1/guava-10.0.1.pom
11:06:10 Downloading from rcptt-snapshots: https://repo.eclipse.org/content/repositories/rcptt-snapshots/com/google/guava/guava/10.0.1/guava-10.0.1.pom
11:06:10 Downloading from eclipse-cbi-releases: https://repo.eclipse.org/content/groups/cbi/com/google/guava/guava/10.0.1/guava-10.0.1.pom
11:06:10 Downloading from eclipse-maven-central: https://repo.eclipse.org/content/repositories/maven_central/com/google/guava/guava/10.0.1/guava-10.0.1.pom
11:06:10 Progress (1): 4.1/5.4 kB
Progress (1): 5.4 kB    
                    
Downloaded from eclipse-maven-central: https://repo.eclipse.org/content/repositories/maven_central/com/google/guava/guava/10.0.1/guava-10.0.1.pom (5.4 kB at 158 kB/s)
11:06:10 Downloading from rcptt-releases: https://repo.eclipse.org/content/repositories/rcptt-releases/com/google/guava/guava-parent/10.0.1/guava-parent-10.0.1.pom
11:06:10 Downloading from rcptt-snapshots: https://repo.eclipse.org/content/repositories/rcptt-snapshots/com/google/guava/guava-parent/10.0.1/guava-parent-10.0.1.pom
11:06:10 Downloading from eclipse-cbi-releases: https://repo.eclipse.org/content/groups/cbi/com/google/guava/guava-parent/10.0.1/guava-parent-10.0.1.pom
11:06:10 Downloading from eclipse-maven-central: https://repo.eclipse.org/content/repositories/maven_central/com/google/guava/guava-parent/10.0.1/guava-parent-10.0.1.pom
11:06:10 Progress (1): 2.0 kB
                    
Downloaded from eclipse-maven-central: https://repo.eclipse.org/content/repositories/maven_central/com/google/guava/guava-parent/10.0.1/guava-parent-10.0.1.pom (2.0 kB at 54 kB/s)
11:06:10 Downloading from rcptt-releases: https://repo.eclipse.org/content/repositories/rcptt-releases/com/google/code/findbugs/jsr305/1.3.9/jsr305-1.3.9.pom
11:06:10 Downloading from rcptt-snapshots: https://repo.eclipse.org/content/repositories/rcptt-snapshots/com/google/code/findbugs/jsr305/1.3.9/jsr305-1.3.9.pom
11:06:10 Downloading from eclipse-cbi-releases: https://repo.eclipse.org/content/groups/cbi/com/google/code/findbugs/jsr305/1.3.9/jsr305-1.3.9.pom
11:06:10 Downloading from eclipse-maven-central: https://repo.eclipse.org/content/repositories/maven_central/com/google/code/findbugs/jsr305/1.3.9/jsr305-1.3.9.pom
11:06:10 Progress (1): 965 B
                   
Downloaded from eclipse-maven-central: https://repo.eclipse.org/content/repositories/maven_central/com/google/code/findbugs/jsr305/1.3.9/jsr305-1.3.9.pom (965 B at 29 kB/s)
11:06:10 Downloading from rcptt-releases: https://repo.eclipse.org/content/repositories/rcptt-releases/org/eclipse/sisu/org.eclipse.sisu.inject/0.0.0.M5/org.eclipse.sisu.inject-0.0.0.M5.pom
11:06:10 Downloading from rcptt-snapshots: https://repo.eclipse.org/content/repositories/rcptt-snapshots/org/eclipse/sisu/org.eclipse.sisu.inject/0.0.0.M5/org.eclipse.sisu.inject-0.0.0.M5.pom
11:06:10 Downloading from eclipse-cbi-releases: https://repo.eclipse.org/content/groups/cbi/org/eclipse/sisu/org.eclipse.sisu.inject/0.0.0.M5/org.eclipse.sisu.inject-0.0.0.M5.pom
11:06:10 Downloading from eclipse-maven-central: https://repo.eclipse.org/content/repositories/maven_central/org/eclipse/sisu/org.eclipse.sisu.inject/0.0.0.M5/org.eclipse.sisu.inject-0.0.0.M5.pom
11:06:10 Progress (1): 2.5 kB
                    
Downloaded from eclipse-maven-central: https://repo.eclipse.org/content/repositories/maven_central/org/eclipse/sisu/org.eclipse.sisu.inject/0.0.0.M5/org.eclipse.sisu.inject-0.0.0.M5.pom (2.5 kB at 70 kB/s)
11:06:10 Downloading from rcptt-releases: https://repo.eclipse.org/content/repositories/rcptt-releases/org/eclipse/sisu/sisu-inject/0.0.0.M5/sisu-inject-0.0.0.M5.pom
11:06:10 Downloading from rcptt-snapshots: https://repo.eclipse.org/content/repositories/rcptt-snapshots/org/eclipse/sisu/sisu-inject/0.0.0.M5/sisu-inject-0.0.0.M5.pom
11:06:10 Downloading from eclipse-cbi-releases: https://repo.eclipse.org/content/groups/cbi/org/eclipse/sisu/sisu-inject/0.0.0.M5/sisu-inject-0.0.0.M5.pom
11:06:10 Downloading from eclipse-maven-central: https://repo.eclipse.org/content/repositories/maven_central/org/eclipse/sisu/sisu-inject/0.0.0.M5/sisu-inject-0.0.0.M5.pom
11:06:10 Progress (1): 4.1/14 kB
Progress (1): 7.7/14 kB
Progress (1): 12/14 kB 
Progress (1): 14 kB   
                   
Downloaded from eclipse-maven-central: https://repo.eclipse.org/content/repositories/maven_central/org/eclipse/sisu/sisu-inject/0.0.0.M5/sisu-inject-0.0.0.M5.pom (14 kB at 378 kB/s)
11:06:10 Downloading from rcptt-releases: https://repo.eclipse.org/content/repositories/rcptt-releases/org/apache/maven/maven-model-builder/3.2.1/maven-model-builder-3.2.1.pom
11:06:10 Downloading from rcptt-snapshots: https://repo.eclipse.org/content/repositories/rcptt-snapshots/org/apache/maven/maven-model-builder/3.2.1/maven-model-builder-3.2.1.pom
11:06:10 Downloading from eclipse-cbi-releases: https://repo.eclipse.org/content/groups/cbi/org/apache/maven/maven-model-builder/3.2.1/maven-model-builder-3.2.1.pom
11:06:10 Downloading from eclipse-maven-central: https://repo.eclipse.org/content/repositories/maven_central/org/apache/maven/maven-model-builder/3.2.1/maven-model-builder-3.2.1.pom
11:06:10 Progress (1): 2.8 kB
                    
Downloaded from eclipse-maven-central: https://repo.eclipse.org/content/repositories/maven_central/org/apache/maven/maven-model-builder/3.2.1/maven-model-builder-3.2.1.pom (2.8 kB at 72 kB/s)
11:06:10 Downloading from rcptt-releases: https://repo.eclipse.org/content/repositories/rcptt-releases/org/apache/maven/maven-aether-provider/3.2.1/maven-aether-provider-3.2.1.pom
11:06:10 Downloading from rcptt-snapshots: https://repo.eclipse.org/content/repositories/rcptt-snapshots/org/apache/maven/maven-aether-provider/3.2.1/maven-aether-provider-3.2.1.pom
11:06:10 Downloading from eclipse-cbi-releases: https://repo.eclipse.org/content/groups/cbi/org/apache/maven/maven-aether-provider/3.2.1/maven-aether-provider-3.2.1.pom
11:06:10 Downloading from eclipse-maven-central: https://repo.eclipse.org/content/repositories/maven_central/org/apache/maven/maven-aether-provider/3.2.1/maven-aether-provider-3.2.1.pom
11:06:11 Progress (1): 4.1 kB
                    
Downloaded from eclipse-maven-central: https://repo.eclipse.org/content/repositories/maven_central/org/apache/maven/maven-aether-provider/3.2.1/maven-aether-provider-3.2.1.pom (4.1 kB at 117 kB/s)
11:06:11 Downloading from rcptt-releases: https://repo.eclipse.org/content/repositories/rcptt-releases/org/codehaus/plexus/plexus-classworlds/2.5.1/plexus-classworlds-2.5.1.pom
11:06:11 Downloading from rcptt-snapshots: https://repo.eclipse.org/content/repositories/rcptt-snapshots/org/codehaus/plexus/plexus-classworlds/2.5.1/plexus-classworlds-2.5.1.pom
11:06:11 Downloading from eclipse-cbi-releases: https://repo.eclipse.org/content/groups/cbi/org/codehaus/plexus/plexus-classworlds/2.5.1/plexus-classworlds-2.5.1.pom
11:06:11 Downloading from eclipse-maven-central: https://repo.eclipse.org/content/repositories/maven_central/org/codehaus/plexus/plexus-classworlds/2.5.1/plexus-classworlds-2.5.1.pom
11:06:11 Progress (1): 4.1/5.0 kB
Progress (1): 5.0 kB    
                    
Downloaded from eclipse-maven-central: https://repo.eclipse.org/content/repositories/maven_central/org/codehaus/plexus/plexus-classworlds/2.5.1/plexus-classworlds-2.5.1.pom (5.0 kB at 179 kB/s)
11:06:11 Downloading from rcptt-releases: https://repo.eclipse.org/content/repositories/rcptt-releases/org/eclipse/rcptt/rcptt-maven-plugin/2.1.0/rcptt-maven-plugin-2.1.0.jar
11:06:11 Downloading from rcptt-releases: https://repo.eclipse.org/content/repositories/rcptt-releases/org/eclipse/rcptt/rcptt-maven-util/2.1.0/rcptt-maven-util-2.1.0.jar
11:06:11 Downloading from rcptt-releases: https://repo.eclipse.org/content/repositories/rcptt-releases/org/codehaus/plexus/plexus-io/1.0.1/plexus-io-1.0.1.jar
11:06:11 Downloading from rcptt-releases: https://repo.eclipse.org/content/repositories/rcptt-releases/org/codehaus/plexus/plexus-archiver/1.2/plexus-archiver-1.2.jar
11:06:11 Downloading from rcptt-releases: https://repo.eclipse.org/content/repositories/rcptt-releases/org/apache/maven/maven-core/3.2.1/maven-core-3.2.1.jar
11:06:11 Downloading from rcptt-releases: https://repo.eclipse.org/content/repositories/rcptt-releases/org/apache/maven/maven-model/3.2.1/maven-model-3.2.1.jar
11:06:11 Progress (1): 4.1/32 kB
Progress (1): 7.7/32 kB
Progress (1): 12/32 kB 
Progress (1): 16/32 kB
Progress (1): 20/32 kB
Progress (1): 24/32 kB
Progress (1): 28/32 kB
Progress (1): 32 kB   
                   
Downloading from rcptt-releases: https://repo.eclipse.org/content/repositories/rcptt-releases/org/apache/maven/maven-settings/3.2.1/maven-settings-3.2.1.jar
11:06:11 Downloading from rcptt-releases: https://repo.eclipse.org/content/repositories/rcptt-releases/org/apache/maven/maven-settings-builder/3.2.1/maven-settings-builder-3.2.1.jar
11:06:11 Downloading from rcptt-releases: https://repo.eclipse.org/content/repositories/rcptt-releases/org/apache/maven/maven-repository-metadata/3.2.1/maven-repository-metadata-3.2.1.jar
11:06:11 Downloaded from rcptt-releases: https://repo.eclipse.org/content/repositories/rcptt-releases/org/eclipse/rcptt/rcptt-maven-plugin/2.1.0/rcptt-maven-plugin-2.1.0.jar (32 kB at 752 kB/s)
11:06:11 Downloading from rcptt-releases: https://repo.eclipse.org/content/repositories/rcptt-releases/org/apache/maven/maven-artifact/3.2.1/maven-artifact-3.2.1.jar
11:06:11 Progress (1): 4.1/20 kB
Progress (1): 7.7/20 kB
Progress (1): 12/20 kB 
Progress (1): 16/20 kB
Progress (1): 20 kB   
                   
Downloading from rcptt-releases: https://repo.eclipse.org/content/repositories/rcptt-releases/org/apache/maven/maven-plugin-api/3.2.1/maven-plugin-api-3.2.1.jar
11:06:11 Downloading from rcptt-releases: https://repo.eclipse.org/content/repositories/rcptt-releases/org/apache/maven/maven-model-builder/3.2.1/maven-model-builder-3.2.1.jar
11:06:11 Downloading from rcptt-releases: https://repo.eclipse.org/content/repositories/rcptt-releases/org/apache/maven/maven-aether-provider/3.2.1/maven-aether-provider-3.2.1.jar
11:06:11 Downloading from rcptt-releases: https://repo.eclipse.org/content/repositories/rcptt-releases/org/eclipse/sisu/org.eclipse.sisu.plexus/0.0.0.M5/org.eclipse.sisu.plexus-0.0.0.M5.jar
11:06:11 Downloaded from rcptt-releases: https://repo.eclipse.org/content/repositories/rcptt-releases/org/eclipse/rcptt/rcptt-maven-util/2.1.0/rcptt-maven-util-2.1.0.jar (20 kB at 322 kB/s)
11:06:11 Downloading from rcptt-releases: https://repo.eclipse.org/content/repositories/rcptt-releases/com/google/guava/guava/10.0.1/guava-10.0.1.jar
11:06:11 Downloading from rcptt-releases: https://repo.eclipse.org/content/repositories/rcptt-releases/com/google/code/findbugs/jsr305/1.3.9/jsr305-1.3.9.jar
11:06:11 Downloading from rcptt-releases: https://repo.eclipse.org/content/repositories/rcptt-releases/org/eclipse/sisu/org.eclipse.sisu.inject/0.0.0.M5/org.eclipse.sisu.inject-0.0.0.M5.jar
11:06:11 Downloading from rcptt-releases: https://repo.eclipse.org/content/repositories/rcptt-releases/org/codehaus/plexus/plexus-interpolation/1.19/plexus-interpolation-1.19.jar
11:06:11 Downloading from rcptt-releases: https://repo.eclipse.org/content/repositories/rcptt-releases/org/codehaus/plexus/plexus-classworlds/2.5.1/plexus-classworlds-2.5.1.jar
11:06:11 Downloading from rcptt-snapshots: https://repo.eclipse.org/content/repositories/rcptt-snapshots/org/codehaus/plexus/plexus-archiver/1.2/plexus-archiver-1.2.jar
11:06:11 Downloading from rcptt-snapshots: https://repo.eclipse.org/content/repositories/rcptt-snapshots/org/codehaus/plexus/plexus-io/1.0.1/plexus-io-1.0.1.jar
11:06:11 Downloading from rcptt-snapshots: https://repo.eclipse.org/content/repositories/rcptt-snapshots/org/apache/maven/maven-model/3.2.1/maven-model-3.2.1.jar
11:06:11 Downloading from rcptt-snapshots: https://repo.eclipse.org/content/repositories/rcptt-snapshots/org/apache/maven/maven-core/3.2.1/maven-core-3.2.1.jar
11:06:11 Downloading from rcptt-snapshots: https://repo.eclipse.org/content/repositories/rcptt-snapshots/org/apache/maven/maven-settings/3.2.1/maven-settings-3.2.1.jar
11:06:11 Downloading from rcptt-snapshots: https://repo.eclipse.org/content/repositories/rcptt-snapshots/org/apache/maven/maven-settings-builder/3.2.1/maven-settings-builder-3.2.1.jar
11:06:11 Downloading from rcptt-snapshots: https://repo.eclipse.org/content/repositories/rcptt-snapshots/org/apache/maven/maven-repository-metadata/3.2.1/maven-repository-metadata-3.2.1.jar
11:06:11 Downloading from rcptt-snapshots: https://repo.eclipse.org/content/repositories/rcptt-snapshots/org/apache/maven/maven-artifact/3.2.1/maven-artifact-3.2.1.jar
11:06:11 Downloading from rcptt-snapshots: https://repo.eclipse.org/content/repositories/rcptt-snapshots/org/apache/maven/maven-plugin-api/3.2.1/maven-plugin-api-3.2.1.jar
11:06:11 Downloading from rcptt-snapshots: https://repo.eclipse.org/content/repositories/rcptt-snapshots/org/apache/maven/maven-model-builder/3.2.1/maven-model-builder-3.2.1.jar
11:06:11 Downloading from rcptt-snapshots: https://repo.eclipse.org/content/repositories/rcptt-snapshots/org/apache/maven/maven-aether-provider/3.2.1/maven-aether-provider-3.2.1.jar
11:06:11 Downloading from rcptt-snapshots: https://repo.eclipse.org/content/repositories/rcptt-snapshots/org/eclipse/sisu/org.eclipse.sisu.plexus/0.0.0.M5/org.eclipse.sisu.plexus-0.0.0.M5.jar
11:06:11 Downloading from rcptt-snapshots: https://repo.eclipse.org/content/repositories/rcptt-snapshots/com/google/guava/guava/10.0.1/guava-10.0.1.jar
11:06:11 Downloading from rcptt-snapshots: https://repo.eclipse.org/content/repositories/rcptt-snapshots/com/google/code/findbugs/jsr305/1.3.9/jsr305-1.3.9.jar
11:06:11 Downloading from rcptt-snapshots: https://repo.eclipse.org/content/repositories/rcptt-snapshots/org/eclipse/sisu/org.eclipse.sisu.inject/0.0.0.M5/org.eclipse.sisu.inject-0.0.0.M5.jar
11:06:11 Downloading from rcptt-snapshots: https://repo.eclipse.org/content/repositories/rcptt-snapshots/org/codehaus/plexus/plexus-interpolation/1.19/plexus-interpolation-1.19.jar
11:06:11 Downloading from rcptt-snapshots: https://repo.eclipse.org/content/repositories/rcptt-snapshots/org/codehaus/plexus/plexus-classworlds/2.5.1/plexus-classworlds-2.5.1.jar
11:06:11 Downloading from eclipse-cbi-releases: https://repo.eclipse.org/content/groups/cbi/org/codehaus/plexus/plexus-archiver/1.2/plexus-archiver-1.2.jar
11:06:11 Downloading from eclipse-cbi-releases: https://repo.eclipse.org/content/groups/cbi/org/codehaus/plexus/plexus-io/1.0.1/plexus-io-1.0.1.jar
11:06:11 Downloading from eclipse-cbi-releases: https://repo.eclipse.org/content/groups/cbi/org/apache/maven/maven-model/3.2.1/maven-model-3.2.1.jar
11:06:11 Downloading from eclipse-cbi-releases: https://repo.eclipse.org/content/groups/cbi/org/apache/maven/maven-core/3.2.1/maven-core-3.2.1.jar
11:06:11 Downloading from eclipse-cbi-releases: https://repo.eclipse.org/content/groups/cbi/org/apache/maven/maven-settings/3.2.1/maven-settings-3.2.1.jar
11:06:11 Downloading from eclipse-cbi-releases: https://repo.eclipse.org/content/groups/cbi/org/apache/maven/maven-settings-builder/3.2.1/maven-settings-builder-3.2.1.jar
11:06:11 Downloading from eclipse-cbi-releases: https://repo.eclipse.org/content/groups/cbi/org/apache/maven/maven-repository-metadata/3.2.1/maven-repository-metadata-3.2.1.jar
11:06:11 Downloading from eclipse-cbi-releases: https://repo.eclipse.org/content/groups/cbi/org/apache/maven/maven-artifact/3.2.1/maven-artifact-3.2.1.jar
11:06:11 Downloading from eclipse-cbi-releases: https://repo.eclipse.org/content/groups/cbi/org/apache/maven/maven-plugin-api/3.2.1/maven-plugin-api-3.2.1.jar
11:06:11 Downloading from eclipse-cbi-releases: https://repo.eclipse.org/content/groups/cbi/org/apache/maven/maven-model-builder/3.2.1/maven-model-builder-3.2.1.jar
11:06:11 Downloading from eclipse-cbi-releases: https://repo.eclipse.org/content/groups/cbi/org/apache/maven/maven-aether-provider/3.2.1/maven-aether-provider-3.2.1.jar
11:06:11 Downloading from eclipse-cbi-releases: https://repo.eclipse.org/content/groups/cbi/org/eclipse/sisu/org.eclipse.sisu.plexus/0.0.0.M5/org.eclipse.sisu.plexus-0.0.0.M5.jar
11:06:11 Downloading from eclipse-cbi-releases: https://repo.eclipse.org/content/groups/cbi/com/google/guava/guava/10.0.1/guava-10.0.1.jar
11:06:11 Downloading from eclipse-cbi-releases: https://repo.eclipse.org/content/groups/cbi/com/google/code/findbugs/jsr305/1.3.9/jsr305-1.3.9.jar
11:06:11 Downloading from eclipse-cbi-releases: https://repo.eclipse.org/content/groups/cbi/org/eclipse/sisu/org.eclipse.sisu.inject/0.0.0.M5/org.eclipse.sisu.inject-0.0.0.M5.jar
11:06:11 Downloading from eclipse-cbi-releases: https://repo.eclipse.org/content/groups/cbi/org/codehaus/plexus/plexus-interpolation/1.19/plexus-interpolation-1.19.jar
11:06:11 Downloading from eclipse-cbi-releases: https://repo.eclipse.org/content/groups/cbi/org/codehaus/plexus/plexus-classworlds/2.5.1/plexus-classworlds-2.5.1.jar
11:06:11 Downloading from eclipse-maven-central: https://repo.eclipse.org/content/repositories/maven_central/org/codehaus/plexus/plexus-archiver/1.2/plexus-archiver-1.2.jar
11:06:11 Downloading from eclipse-maven-central: https://repo.eclipse.org/content/repositories/maven_central/org/codehaus/plexus/plexus-io/1.0.1/plexus-io-1.0.1.jar
11:06:11 Downloading from eclipse-maven-central: https://repo.eclipse.org/content/repositories/maven_central/org/apache/maven/maven-model/3.2.1/maven-model-3.2.1.jar
11:06:11 Downloading from eclipse-maven-central: https://repo.eclipse.org/content/repositories/maven_central/org/apache/maven/maven-core/3.2.1/maven-core-3.2.1.jar
11:06:11 Downloading from eclipse-maven-central: https://repo.eclipse.org/content/repositories/maven_central/org/apache/maven/maven-settings/3.2.1/maven-settings-3.2.1.jar
11:06:11 Progress (1): 4.1/160 kB
Progress (2): 4.1/160 kB | 4.1/182 kB
Progress (2): 7.7/160 kB | 4.1/182 kB
Progress (2): 7.7/160 kB | 7.7/182 kB
Progress (2): 12/160 kB | 7.7/182 kB 
Progress (2): 16/160 kB | 7.7/182 kB
Progress (2): 16/160 kB | 12/182 kB 
Progress (3): 16/160 kB | 12/182 kB | 4.1/51 kB
Progress (3): 16/160 kB | 16/182 kB | 4.1/51 kB
Progress (3): 20/160 kB | 16/182 kB | 4.1/51 kB
Progress (3): 20/160 kB | 20/182 kB | 4.1/51 kB
Progress (4): 20/160 kB | 20/182 kB | 4.1/51 kB | 4.1/43 kB
Progress (4): 20/160 kB | 20/182 kB | 7.7/51 kB | 4.1/43 kB
Progress (4): 20/160 kB | 20/182 kB | 7.7/51 kB | 7.7/43 kB
Progress (5): 20/160 kB | 20/182 kB | 7.7/51 kB | 7.7/43 kB | 4.1/575 kB
Progress (5): 20/160 kB | 24/182 kB | 7.7/51 kB | 7.7/43 kB | 4.1/575 kB
Progress (5): 24/160 kB | 24/182 kB | 7.7/51 kB | 7.7/43 kB | 4.1/575 kB
Progress (5): 24/160 kB | 28/182 kB | 7.7/51 kB | 7.7/43 kB | 4.1/575 kB
Progress (5): 24/160 kB | 28/182 kB | 7.7/51 kB | 7.7/43 kB | 7.7/575 kB
Progress (5): 24/160 kB | 28/182 kB | 7.7/51 kB | 12/43 kB | 7.7/575 kB 
Progress (5): 24/160 kB | 28/182 kB | 12/51 kB | 12/43 kB | 7.7/575 kB 
Progress (5): 24/160 kB | 28/182 kB | 12/51 kB | 16/43 kB | 7.7/575 kB
Progress (5): 24/160 kB | 28/182 kB | 12/51 kB | 16/43 kB | 12/575 kB 
Progress (5): 24/160 kB | 32/182 kB | 12/51 kB | 16/43 kB | 12/575 kB
Progress (5): 28/160 kB | 32/182 kB | 12/51 kB | 16/43 kB | 12/575 kB
Progress (5): 28/160 kB | 36/182 kB | 12/51 kB | 16/43 kB | 12/575 kB
Progress (5): 28/160 kB | 36/182 kB | 12/51 kB | 16/43 kB | 16/575 kB
Progress (5): 28/160 kB | 36/182 kB | 12/51 kB | 20/43 kB | 16/575 kB
Progress (5): 28/160 kB | 36/182 kB | 16/51 kB | 20/43 kB | 16/575 kB
Progress (5): 28/160 kB | 36/182 kB | 16/51 kB | 24/43 kB | 16/575 kB
Progress (5): 28/160 kB | 36/182 kB | 16/51 kB | 24/43 kB | 20/575 kB
Progress (5): 28/160 kB | 40/182 kB | 16/51 kB | 24/43 kB | 20/575 kB
Progress (5): 32/160 kB | 40/182 kB | 16/51 kB | 24/43 kB | 20/575 kB
Progress (5): 32/160 kB | 44/182 kB | 16/51 kB | 24/43 kB | 20/575 kB
Progress (5): 32/160 kB | 44/182 kB | 16/51 kB | 24/43 kB | 24/575 kB
Progress (5): 32/160 kB | 44/182 kB | 16/51 kB | 28/43 kB | 24/575 kB
Progress (5): 32/160 kB | 44/182 kB | 20/51 kB | 28/43 kB | 24/575 kB
Progress (5): 32/160 kB | 44/182 kB | 20/51 kB | 32/43 kB | 24/575 kB
Progress (5): 32/160 kB | 44/182 kB | 20/51 kB | 32/43 kB | 28/575 kB
Progress (5): 32/160 kB | 48/182 kB | 20/51 kB | 32/43 kB | 28/575 kB
Progress (5): 36/160 kB | 48/182 kB | 20/51 kB | 32/43 kB | 28/575 kB
Progress (5): 36/160 kB | 52/182 kB | 20/51 kB | 32/43 kB | 28/575 kB
Progress (5): 36/160 kB | 52/182 kB | 20/51 kB | 32/43 kB | 32/575 kB
Progress (5): 36/160 kB | 52/182 kB | 20/51 kB | 36/43 kB | 32/575 kB
Progress (5): 36/160 kB | 52/182 kB | 24/51 kB | 36/43 kB | 32/575 kB
Progress (5): 36/160 kB | 52/182 kB | 24/51 kB | 40/43 kB | 32/575 kB
Progress (5): 36/160 kB | 52/182 kB | 24/51 kB | 40/43 kB | 36/575 kB
Progress (5): 36/160 kB | 56/182 kB | 24/51 kB | 40/43 kB | 36/575 kB
Progress (5): 40/160 kB | 56/182 kB | 24/51 kB | 40/43 kB | 36/575 kB
Progress (5): 40/160 kB | 60/182 kB | 24/51 kB | 40/43 kB | 36/575 kB
Progress (5): 40/160 kB | 60/182 kB | 24/51 kB | 40/43 kB | 40/575 kB
Progress (5): 40/160 kB | 60/182 kB | 24/51 kB | 43 kB | 40/575 kB   
Progress (5): 40/160 kB | 60/182 kB | 28/51 kB | 43 kB | 40/575 kB
Progress (5): 40/160 kB | 60/182 kB | 28/51 kB | 43 kB | 44/575 kB
Progress (5): 40/160 kB | 64/182 kB | 28/51 kB | 43 kB | 44/575 kB
Progress (5): 44/160 kB | 64/182 kB | 28/51 kB | 43 kB | 44/575 kB
Progress (5): 44/160 kB | 68/182 kB | 28/51 kB | 43 kB | 44/575 kB
Progress (5): 44/160 kB | 68/182 kB | 28/51 kB | 43 kB | 48/575 kB
Progress (5): 44/160 kB | 68/182 kB | 32/51 kB | 43 kB | 48/575 kB
Progress (5): 44/160 kB | 68/182 kB | 32/51 kB | 43 kB | 52/575 kB
Progress (5): 44/160 kB | 72/182 kB | 32/51 kB | 43 kB | 52/575 kB
Progress (5): 48/160 kB | 72/182 kB | 32/51 kB | 43 kB | 52/575 kB
Progress (5): 48/160 kB | 76/182 kB | 32/51 kB | 43 kB | 52/575 kB
Progress (5): 48/160 kB | 76/182 kB | 32/51 kB | 43 kB | 56/575 kB
Progress (5): 48/160 kB | 76/182 kB | 36/51 kB | 43 kB | 56/575 kB
Progress (5): 48/160 kB | 76/182 kB | 36/51 kB | 43 kB | 60/575 kB
Progress (5): 48/160 kB | 80/182 kB | 36/51 kB | 43 kB | 60/575 kB
Progress (5): 52/160 kB | 80/182 kB | 36/51 kB | 43 kB | 60/575 kB
Progress (5): 52/160 kB | 84/182 kB | 36/51 kB | 43 kB | 60/575 kB
Progress (5): 52/160 kB | 84/182 kB | 36/51 kB | 43 kB | 64/575 kB
Progress (5): 52/160 kB | 84/182 kB | 40/51 kB | 43 kB | 64/575 kB
Progress (5): 52/160 kB | 84/182 kB | 40/51 kB | 43 kB | 68/575 kB
Progress (5): 52/160 kB | 88/182 kB | 40/51 kB | 43 kB | 68/575 kB
Progress (5): 56/160 kB | 88/182 kB | 40/51 kB | 43 kB | 68/575 kB
Progress (5): 56/160 kB | 88/182 kB | 40/51 kB | 43 kB | 72/575 kB
Progress (5): 56/160 kB | 88/182 kB | 44/51 kB | 43 kB | 72/575 kB
Progress (5): 56/160 kB | 88/182 kB | 44/51 kB | 43 kB | 76/575 kB
Progress (5): 60/160 kB | 88/182 kB | 44/51 kB | 43 kB | 76/575 kB
Progress (5): 60/160 kB | 92/182 kB | 44/51 kB | 43 kB | 76/575 kB
                                                                  
Downloaded from eclipse-maven-central: https://repo.eclipse.org/content/repositories/maven_central/org/apache/maven/maven-settings/3.2.1/maven-settings-3.2.1.jar (43 kB at 659 kB/s)
11:06:11 Downloading from eclipse-maven-central: https://repo.eclipse.org/content/repositories/maven_central/org/apache/maven/maven-settings-builder/3.2.1/maven-settings-builder-3.2.1.jar
11:06:11 Progress (4): 64/160 kB | 92/182 kB | 44/51 kB | 76/575 kB
Progress (4): 64/160 kB | 92/182 kB | 44/51 kB | 80/575 kB
Progress (4): 64/160 kB | 92/182 kB | 48/51 kB | 80/575 kB
Progress (4): 68/160 kB | 92/182 kB | 48/51 kB | 80/575 kB
Progress (4): 68/160 kB | 96/182 kB | 48/51 kB | 80/575 kB
Progress (4): 72/160 kB | 96/182 kB | 48/51 kB | 80/575 kB
Progress (4): 72/160 kB | 96/182 kB | 51 kB | 80/575 kB   
Progress (4): 72/160 kB | 96/182 kB | 51 kB | 84/575 kB
Progress (4): 76/160 kB | 96/182 kB | 51 kB | 84/575 kB
Progress (4): 76/160 kB | 100/182 kB | 51 kB | 84/575 kB
Progress (4): 80/160 kB | 100/182 kB | 51 kB | 84/575 kB
Progress (4): 80/160 kB | 100/182 kB | 51 kB | 88/575 kB
Progress (4): 84/160 kB | 100/182 kB | 51 kB | 88/575 kB
Progress (4): 84/160 kB | 104/182 kB | 51 kB | 88/575 kB
Progress (4): 88/160 kB | 104/182 kB | 51 kB | 88/575 kB
Progress (4): 88/160 kB | 104/182 kB | 51 kB | 92/575 kB
Progress (4): 92/160 kB | 104/182 kB | 51 kB | 92/575 kB
Progress (4): 92/160 kB | 104/182 kB | 51 kB | 96/575 kB
Progress (4): 92/160 kB | 108/182 kB | 51 kB | 96/575 kB
Progress (4): 92/160 kB | 108/182 kB | 51 kB | 100/575 kB
Progress (4): 96/160 kB | 108/182 kB | 51 kB | 100/575 kB
Progress (4): 96/160 kB | 108/182 kB | 51 kB | 104/575 kB
Progress (4): 100/160 kB | 108/182 kB | 51 kB | 104/575 kB
Progress (4): 100/160 kB | 112/182 kB | 51 kB | 104/575 kB
Progress (4): 104/160 kB | 112/182 kB | 51 kB | 104/575 kB
Progress (4): 104/160 kB | 112/182 kB | 51 kB | 108/575 kB
Progress (4): 104/160 kB | 116/182 kB | 51 kB | 108/575 kB
Progress (4): 104/160 kB | 116/182 kB | 51 kB | 112/575 kB
Progress (4): 108/160 kB | 116/182 kB | 51 kB | 112/575 kB
Progress (4): 108/160 kB | 120/182 kB | 51 kB | 112/575 kB
Progress (4): 112/160 kB | 120/182 kB | 51 kB | 112/575 kB
Progress (4): 112/160 kB | 120/182 kB | 51 kB | 116/575 kB
Progress (4): 116/160 kB | 120/182 kB | 51 kB | 116/575 kB
Progress (4): 116/160 kB | 120/182 kB | 51 kB | 120/575 kB
Progress (4): 116/160 kB | 124/182 kB | 51 kB | 120/575 kB
Progress (4): 120/160 kB | 124/182 kB | 51 kB | 120/575 kB
Progress (4): 120/160 kB | 128/182 kB | 51 kB | 120/575 kB
Progress (4): 120/160 kB | 128/182 kB | 51 kB | 124/575 kB
Progress (4): 124/160 kB | 128/182 kB | 51 kB | 124/575 kB
Progress (4): 124/160 kB | 128/182 kB | 51 kB | 128/575 kB
Progress (4): 124/160 kB | 132/182 kB | 51 kB | 128/575 kB
Progress (4): 124/160 kB | 132/182 kB | 51 kB | 132/575 kB
Progress (4): 128/160 kB | 132/182 kB | 51 kB | 132/575 kB
Progress (4): 128/160 kB | 132/182 kB | 51 kB | 136/575 kB
Progress (4): 128/160 kB | 136/182 kB | 51 kB | 136/575 kB
Progress (4): 128/160 kB | 136/182 kB | 51 kB | 140/575 kB
Progress (4): 128/160 kB | 140/182 kB | 51 kB | 140/575 kB
Progress (4): 132/160 kB | 140/182 kB | 51 kB | 140/575 kB
Progress (4): 132/160 kB | 144/182 kB | 51 kB | 140/575 kB
Progress (4): 132/160 kB | 144/182 kB | 51 kB | 144/575 kB
Progress (4): 132/160 kB | 148/182 kB | 51 kB | 144/575 kB
Progress (4): 136/160 kB | 148/182 kB | 51 kB | 144/575 kB
Progress (4): 136/160 kB | 152/182 kB | 51 kB | 144/575 kB
Progress (4): 136/160 kB | 152/182 kB | 51 kB | 148/575 kB
Progress (4): 136/160 kB | 156/182 kB | 51 kB | 148/575 kB
Progress (4): 140/160 kB | 156/182 kB | 51 kB | 148/575 kB
Progress (4): 140/160 kB | 160/182 kB | 51 kB | 148/575 kB
Progress (4): 140/160 kB | 160/182 kB | 51 kB | 152/575 kB
Progress (4): 140/160 kB | 164/182 kB | 51 kB | 152/575 kB
                                                          
Downloaded from eclipse-maven-central: https://repo.eclipse.org/content/repositories/maven_central/org/codehaus/plexus/plexus-io/1.0.1/plexus-io-1.0.1.jar (51 kB at 661 kB/s)
11:06:11 Downloading from eclipse-maven-central: https://repo.eclipse.org/content/repositories/maven_central/org/apache/maven/maven-repository-metadata/3.2.1/maven-repository-metadata-3.2.1.jar
11:06:11 Progress (3): 144/160 kB | 164/182 kB | 152/575 kB
Progress (3): 144/160 kB | 168/182 kB | 152/575 kB
Progress (3): 144/160 kB | 168/182 kB | 156/575 kB
Progress (3): 144/160 kB | 172/182 kB | 156/575 kB
Progress (3): 148/160 kB | 172/182 kB | 156/575 kB
Progress (3): 148/160 kB | 176/182 kB | 156/575 kB
Progress (3): 148/160 kB | 176/182 kB | 160/575 kB
Progress (4): 148/160 kB | 176/182 kB | 160/575 kB | 4.1/43 kB
Progress (4): 148/160 kB | 176/182 kB | 164/575 kB | 4.1/43 kB
Progress (4): 148/160 kB | 180/182 kB | 164/575 kB | 4.1/43 kB
Progress (4): 152/160 kB | 180/182 kB | 164/575 kB | 4.1/43 kB
Progress (4): 152/160 kB | 182 kB | 164/575 kB | 4.1/43 kB    
Progress (4): 152/160 kB | 182 kB | 168/575 kB | 4.1/43 kB
Progress (4): 152/160 kB | 182 kB | 168/575 kB | 7.7/43 kB
Progress (4): 152/160 kB | 182 kB | 172/575 kB | 7.7/43 kB
Progress (4): 156/160 kB | 182 kB | 172/575 kB | 7.7/43 kB
Progress (4): 156/160 kB | 182 kB | 176/575 kB | 7.7/43 kB
Progress (4): 156/160 kB | 182 kB | 176/575 kB | 12/43 kB 
Progress (4): 156/160 kB | 182 kB | 180/575 kB | 12/43 kB
Progress (4): 160/160 kB | 182 kB | 180/575 kB | 12/43 kB
Progress (4): 160/160 kB | 182 kB | 184/575 kB | 12/43 kB
Progress (4): 160/160 kB | 182 kB | 184/575 kB | 16/43 kB
Progress (4): 160/160 kB | 182 kB | 188/575 kB | 16/43 kB
Progress (4): 160 kB | 182 kB | 188/575 kB | 16/43 kB    
Progress (4): 160 kB | 182 kB | 192/575 kB | 16/43 kB
Progress (4): 160 kB | 182 kB | 192/575 kB | 20/43 kB
Progress (4): 160 kB | 182 kB | 196/575 kB | 20/43 kB
Progress (4): 160 kB | 182 kB | 196/575 kB | 24/43 kB
Progress (4): 160 kB | 182 kB | 200/575 kB | 24/43 kB
Progress (4): 160 kB | 182 kB | 200/575 kB | 28/43 kB
Progress (4): 160 kB | 182 kB | 204/575 kB | 28/43 kB
Progress (4): 160 kB | 182 kB | 204/575 kB | 32/43 kB
Progress (4): 160 kB | 182 kB | 208/575 kB | 32/43 kB
Progress (4): 160 kB | 182 kB | 208/575 kB | 36/43 kB
Progress (4): 160 kB | 182 kB | 212/575 kB | 36/43 kB
Progress (4): 160 kB | 182 kB | 212/575 kB | 40/43 kB
Progress (4): 160 kB | 182 kB | 216/575 kB | 40/43 kB
Progress (4): 160 kB | 182 kB | 216/575 kB | 43 kB   
Progress (4): 160 kB | 182 kB | 220/575 kB | 43 kB
Progress (4): 160 kB | 182 kB | 224/575 kB | 43 kB
Progress (4): 160 kB | 182 kB | 228/575 kB | 43 kB
Progress (4): 160 kB | 182 kB | 232/575 kB | 43 kB
Progress (4): 160 kB | 182 kB | 236/575 kB | 43 kB
Progress (4): 160 kB | 182 kB | 240/575 kB | 43 kB
Progress (5): 160 kB | 182 kB | 240/575 kB | 43 kB | 4.1/26 kB
Progress (5): 160 kB | 182 kB | 244/575 kB | 43 kB | 4.1/26 kB
Progress (5): 160 kB | 182 kB | 244/575 kB | 43 kB | 7.7/26 kB
Progress (5): 160 kB | 182 kB | 248/575 kB | 43 kB | 7.7/26 kB
Progress (5): 160 kB | 182 kB | 248/575 kB | 43 kB | 12/26 kB 
Progress (5): 160 kB | 182 kB | 252/575 kB | 43 kB | 12/26 kB
                                                             
Downloaded from eclipse-maven-central: https://repo.eclipse.org/content/repositories/maven_central/org/codehaus/plexus/plexus-archiver/1.2/plexus-archiver-1.2.jar (182 kB at 2.0 MB/s)
11:06:11 Downloaded from eclipse-maven-central: https://repo.eclipse.org/content/repositories/maven_central/org/apache/maven/maven-model/3.2.1/maven-model-3.2.1.jar (160 kB at 1.8 MB/s)
11:06:11 Progress (3): 256/575 kB | 43 kB | 12/26 kB
Progress (3): 256/575 kB | 43 kB | 16/26 kB
Progress (3): 260/575 kB | 43 kB | 16/26 kB
                                           
Downloading from eclipse-maven-central: https://repo.eclipse.org/content/repositories/maven_central/org/apache/maven/maven-plugin-api/3.2.1/maven-plugin-api-3.2.1.jar
11:06:11 Downloading from eclipse-maven-central: https://repo.eclipse.org/content/repositories/maven_central/org/apache/maven/maven-artifact/3.2.1/maven-artifact-3.2.1.jar
11:06:11 Progress (3): 260/575 kB | 43 kB | 20/26 kB
Progress (3): 264/575 kB | 43 kB | 20/26 kB
Progress (3): 264/575 kB | 43 kB | 24/26 kB
Progress (3): 268/575 kB | 43 kB | 24/26 kB
Progress (3): 268/575 kB | 43 kB | 26 kB   
Progress (3): 272/575 kB | 43 kB | 26 kB
Progress (3): 276/575 kB | 43 kB | 26 kB
                                        
Downloaded from eclipse-maven-central: https://repo.eclipse.org/content/repositories/maven_central/org/apache/maven/maven-settings-builder/3.2.1/maven-settings-builder-3.2.1.jar (43 kB at 465 kB/s)
11:06:11 Progress (2): 280/575 kB | 26 kB
                                
Downloading from eclipse-maven-central: https://repo.eclipse.org/content/repositories/maven_central/org/apache/maven/maven-model-builder/3.2.1/maven-model-builder-3.2.1.jar
11:06:11 Progress (2): 284/575 kB | 26 kB
Progress (2): 288/575 kB | 26 kB
Progress (2): 292/575 kB | 26 kB
Progress (2): 296/575 kB | 26 kB
Progress (2): 300/575 kB | 26 kB
Progress (2): 304/575 kB | 26 kB
Progress (2): 308/575 kB | 26 kB
Progress (2): 312/575 kB | 26 kB
Progress (2): 316/575 kB | 26 kB
Progress (2): 320/575 kB | 26 kB
                                
Downloaded from eclipse-maven-central: https://repo.eclipse.org/content/repositories/maven_central/org/apache/maven/maven-repository-metadata/3.2.1/maven-repository-metadata-3.2.1.jar (26 kB at 268 kB/s)
11:06:11 Progress (1): 324/575 kB
                        
Downloading from eclipse-maven-central: https://repo.eclipse.org/content/repositories/maven_central/org/apache/maven/maven-aether-provider/3.2.1/maven-aether-provider-3.2.1.jar
11:06:11 Progress (1): 328/575 kB
Progress (1): 332/575 kB
Progress (1): 336/575 kB
Progress (1): 340/575 kB
Progress (1): 344/575 kB
Progress (1): 348/575 kB
Progress (1): 352/575 kB
Progress (1): 356/575 kB
Progress (1): 360/575 kB
Progress (1): 364/575 kB
Progress (1): 368/575 kB
Progress (1): 372/575 kB
Progress (1): 376/575 kB
Progress (1): 380/575 kB
Progress (1): 384/575 kB
Progress (1): 388/575 kB
Progress (1): 392/575 kB
Progress (1): 396/575 kB
Progress (1): 400/575 kB
Progress (1): 404/575 kB
Progress (1): 408/575 kB
Progress (1): 412/575 kB
Progress (1): 416/575 kB
Progress (1): 420/575 kB
Progress (1): 424/575 kB
Progress (1): 428/575 kB
Progress (1): 432/575 kB
Progress (1): 436/575 kB
Progress (1): 440/575 kB
Progress (1): 444/575 kB
Progress (1): 448/575 kB
Progress (1): 452/575 kB
Progress (1): 456/575 kB
Progress (1): 460/575 kB
Progress (2): 460/575 kB | 4.1/46 kB
Progress (3): 460/575 kB | 4.1/46 kB | 4.1/54 kB
Progress (3): 464/575 kB | 4.1/46 kB | 4.1/54 kB
Progress (3): 464/575 kB | 4.1/46 kB | 7.7/54 kB
Progress (3): 464/575 kB | 7.7/46 kB | 7.7/54 kB
Progress (3): 464/575 kB | 7.7/46 kB | 12/54 kB 
Progress (3): 468/575 kB | 7.7/46 kB | 12/54 kB
Progress (3): 468/575 kB | 7.7/46 kB | 16/54 kB
Progress (3): 468/575 kB | 12/46 kB | 16/54 kB 
Progress (3): 472/575 kB | 12/46 kB | 16/54 kB
Progress (3): 472/575 kB | 16/46 kB | 16/54 kB
Progress (3): 472/575 kB | 16/46 kB | 20/54 kB
Progress (3): 476/575 kB | 16/46 kB | 20/54 kB
Progress (3): 476/575 kB | 16/46 kB | 24/54 kB
Progress (3): 476/575 kB | 20/46 kB | 24/54 kB
Progress (3): 480/575 kB | 20/46 kB | 24/54 kB
Progress (3): 480/575 kB | 24/46 kB | 24/54 kB
Progress (3): 480/575 kB | 24/46 kB | 28/54 kB
Progress (3): 484/575 kB | 24/46 kB | 28/54 kB
Progress (4): 484/575 kB | 24/46 kB | 28/54 kB | 4.1/165 kB
Progress (5): 484/575 kB | 24/46 kB | 28/54 kB | 4.1/165 kB | 4.1/61 kB
Progress (5): 488/575 kB | 24/46 kB | 28/54 kB | 4.1/165 kB | 4.1/61 kB
Progress (5): 488/575 kB | 24/46 kB | 32/54 kB | 4.1/165 kB | 4.1/61 kB
Progress (5): 488/575 kB | 28/46 kB | 32/54 kB | 4.1/165 kB | 4.1/61 kB
Progress (5): 488/575 kB | 28/46 kB | 33/54 kB | 4.1/165 kB | 4.1/61 kB
Progress (5): 492/575 kB | 28/46 kB | 33/54 kB | 4.1/165 kB | 4.1/61 kB
Progress (5): 492/575 kB | 28/46 kB | 33/54 kB | 4.1/165 kB | 7.7/61 kB
Progress (5): 492/575 kB | 28/46 kB | 33/54 kB | 7.7/165 kB | 7.7/61 kB
Progress (5): 492/575 kB | 28/46 kB | 33/54 kB | 7.7/165 kB | 12/61 kB 
Progress (5): 496/575 kB | 28/46 kB | 33/54 kB | 7.7/165 kB | 12/61 kB
Progress (5): 496/575 kB | 28/46 kB | 37/54 kB | 7.7/165 kB | 12/61 kB
Progress (5): 496/575 kB | 32/46 kB | 37/54 kB | 7.7/165 kB | 12/61 kB
Progress (5): 496/575 kB | 32/46 kB | 41/54 kB | 7.7/165 kB | 12/61 kB
Progress (5): 500/575 kB | 32/46 kB | 41/54 kB | 7.7/165 kB | 12/61 kB
Progress (5): 500/575 kB | 32/46 kB | 41/54 kB | 7.7/165 kB | 16/61 kB
Progress (5): 500/575 kB | 32/46 kB | 41/54 kB | 12/165 kB | 16/61 kB 
Progress (5): 500/575 kB | 32/46 kB | 41/54 kB | 12/165 kB | 20/61 kB
Progress (5): 504/575 kB | 32/46 kB | 41/54 kB | 12/165 kB | 20/61 kB
Progress (5): 504/575 kB | 32/46 kB | 45/54 kB | 12/165 kB | 20/61 kB
Progress (5): 504/575 kB | 36/46 kB | 45/54 kB | 12/165 kB | 20/61 kB
Progress (5): 504/575 kB | 36/46 kB | 49/54 kB | 12/165 kB | 20/61 kB
Progress (5): 508/575 kB | 36/46 kB | 49/54 kB | 12/165 kB | 20/61 kB
Progress (5): 508/575 kB | 36/46 kB | 49/54 kB | 12/165 kB | 24/61 kB
Progress (5): 508/575 kB | 36/46 kB | 49/54 kB | 16/165 kB | 24/61 kB
Progress (5): 508/575 kB | 36/46 kB | 49/54 kB | 16/165 kB | 28/61 kB
Progress (5): 512/575 kB | 36/46 kB | 49/54 kB | 16/165 kB | 28/61 kB
Progress (5): 512/575 kB | 36/46 kB | 53/54 kB | 16/165 kB | 28/61 kB
Progress (5): 512/575 kB | 40/46 kB | 53/54 kB | 16/165 kB | 28/61 kB
Progress (5): 512/575 kB | 40/46 kB | 54 kB | 16/165 kB | 28/61 kB   
Progress (5): 516/575 kB | 40/46 kB | 54 kB | 16/165 kB | 28/61 kB
Progress (5): 516/575 kB | 40/46 kB | 54 kB | 16/165 kB | 32/61 kB
Progress (5): 516/575 kB | 40/46 kB | 54 kB | 20/165 kB | 32/61 kB
Progress (5): 516/575 kB | 40/46 kB | 54 kB | 20/165 kB | 36/61 kB
Progress (5): 520/575 kB | 40/46 kB | 54 kB | 20/165 kB | 36/61 kB
Progress (5): 520/575 kB | 44/46 kB | 54 kB | 20/165 kB | 36/61 kB
Progress (5): 524/575 kB | 44/46 kB | 54 kB | 20/165 kB | 36/61 kB
Progress (5): 524/575 kB | 44/46 kB | 54 kB | 20/165 kB | 40/61 kB
Progress (5): 524/575 kB | 44/46 kB | 54 kB | 24/165 kB | 40/61 kB
Progress (5): 524/575 kB | 44/46 kB | 54 kB | 24/165 kB | 44/61 kB
Progress (5): 528/575 kB | 44/46 kB | 54 kB | 24/165 kB | 44/61 kB
Progress (5): 528/575 kB | 46 kB | 54 kB | 24/165 kB | 44/61 kB   
Progress (5): 532/575 kB | 46 kB | 54 kB | 24/165 kB | 44/61 kB
Progress (5): 532/575 kB | 46 kB | 54 kB | 24/165 kB | 48/61 kB
Progress (5): 532/575 kB | 46 kB | 54 kB | 28/165 kB | 48/61 kB
Progress (5): 532/575 kB | 46 kB | 54 kB | 28/165 kB | 52/61 kB
Progress (5): 536/575 kB | 46 kB | 54 kB | 28/165 kB | 52/61 kB
Progress (5): 536/575 kB | 46 kB | 54 kB | 28/165 kB | 56/61 kB
Progress (5): 536/575 kB | 46 kB | 54 kB | 32/165 kB | 56/61 kB
Progress (5): 536/575 kB | 46 kB | 54 kB | 32/165 kB | 60/61 kB
Progress (5): 540/575 kB | 46 kB | 54 kB | 32/165 kB | 60/61 kB
Progress (5): 540/575 kB | 46 kB | 54 kB | 32/165 kB | 61 kB   
Progress (5): 540/575 kB | 46 kB | 54 kB | 33/165 kB | 61 kB
                                                            
Downloaded from eclipse-maven-central: https://repo.eclipse.org/content/repositories/maven_central/org/apache/maven/maven-artifact/3.2.1/maven-artifact-3.2.1.jar (54 kB at 455 kB/s)
11:06:11 Progress (4): 544/575 kB | 46 kB | 33/165 kB | 61 kB
                                                    
Downloading from eclipse-maven-central: https://repo.eclipse.org/content/repositories/maven_central/org/eclipse/sisu/org.eclipse.sisu.plexus/0.0.0.M5/org.eclipse.sisu.plexus-0.0.0.M5.jar
11:06:11 Progress (4): 544/575 kB | 46 kB | 37/165 kB | 61 kB
Progress (4): 548/575 kB | 46 kB | 37/165 kB | 61 kB
Progress (4): 548/575 kB | 46 kB | 41/165 kB | 61 kB
Progress (4): 552/575 kB | 46 kB | 41/165 kB | 61 kB
Progress (4): 552/575 kB | 46 kB | 45/165 kB | 61 kB
Progress (4): 552/575 kB | 46 kB | 49/165 kB | 61 kB
Progress (4): 556/575 kB | 46 kB | 49/165 kB | 61 kB
Progress (4): 556/575 kB | 46 kB | 53/165 kB | 61 kB
                                                    
Downloaded from eclipse-maven-central: https://repo.eclipse.org/content/repositories/maven_central/org/apache/maven/maven-plugin-api/3.2.1/maven-plugin-api-3.2.1.jar (46 kB at 376 kB/s)
11:06:11 Progress (3): 556/575 kB | 57/165 kB | 61 kB
Progress (3): 560/575 kB | 57/165 kB | 61 kB
Progress (3): 560/575 kB | 61/165 kB | 61 kB
                                            
Downloading from eclipse-maven-central: https://repo.eclipse.org/content/repositories/maven_central/com/google/guava/guava/10.0.1/guava-10.0.1.jar
11:06:11 Progress (3): 564/575 kB | 61/165 kB | 61 kB
Progress (3): 564/575 kB | 65/165 kB | 61 kB
Progress (3): 568/575 kB | 65/165 kB | 61 kB
Progress (3): 568/575 kB | 69/165 kB | 61 kB
Progress (3): 572/575 kB | 69/165 kB | 61 kB
Progress (3): 572/575 kB | 73/165 kB | 61 kB
Progress (3): 575 kB | 73/165 kB | 61 kB    
Progress (3): 575 kB | 77/165 kB | 61 kB
                                        
Downloaded from eclipse-maven-central: https://repo.eclipse.org/content/repositories/maven_central/org/apache/maven/maven-aether-provider/3.2.1/maven-aether-provider-3.2.1.jar (61 kB at 487 kB/s)
11:06:11 Progress (2): 575 kB | 81/165 kB
                                
Downloading from eclipse-maven-central: https://repo.eclipse.org/content/repositories/maven_central/com/google/code/findbugs/jsr305/1.3.9/jsr305-1.3.9.jar
11:06:11 Progress (2): 575 kB | 85/165 kB
Progress (2): 575 kB | 89/165 kB
Progress (2): 575 kB | 93/165 kB
Progress (2): 575 kB | 97/165 kB
Progress (2): 575 kB | 101/165 kB
Progress (2): 575 kB | 105/165 kB
Progress (2): 575 kB | 109/165 kB
Progress (2): 575 kB | 113/165 kB
Progress (2): 575 kB | 117/165 kB
Progress (2): 575 kB | 121/165 kB
Progress (2): 575 kB | 125/165 kB
Progress (2): 575 kB | 129/165 kB
Progress (2): 575 kB | 133/165 kB
Progress (2): 575 kB | 137/165 kB
Progress (2): 575 kB | 141/165 kB
Progress (2): 575 kB | 145/165 kB
Progress (2): 575 kB | 149/165 kB
Progress (2): 575 kB | 153/165 kB
Progress (2): 575 kB | 157/165 kB
Progress (2): 575 kB | 161/165 kB
Progress (2): 575 kB | 165/165 kB
Progress (2): 575 kB | 165 kB    
                             
Downloaded from eclipse-maven-central: https://repo.eclipse.org/content/repositories/maven_central/org/apache/maven/maven-core/3.2.1/maven-core-3.2.1.jar (575 kB at 4.3 MB/s)
11:06:11 Downloading from eclipse-maven-central: https://repo.eclipse.org/content/repositories/maven_central/org/eclipse/sisu/org.eclipse.sisu.inject/0.0.0.M5/org.eclipse.sisu.inject-0.0.0.M5.jar
11:06:11 Progress (2): 165 kB | 4.1/197 kB
Progress (2): 165 kB | 7.7/197 kB
Progress (2): 165 kB | 12/197 kB 
Progress (2): 165 kB | 16/197 kB
Progress (2): 165 kB | 20/197 kB
Progress (2): 165 kB | 24/197 kB
Progress (2): 165 kB | 28/197 kB
Progress (2): 165 kB | 32/197 kB
Progress (2): 165 kB | 33/197 kB
Progress (2): 165 kB | 37/197 kB
Progress (2): 165 kB | 41/197 kB
Progress (2): 165 kB | 45/197 kB
Progress (2): 165 kB | 49/197 kB
Progress (2): 165 kB | 53/197 kB
Progress (2): 165 kB | 57/197 kB
Progress (2): 165 kB | 61/197 kB
Progress (2): 165 kB | 65/197 kB
Progress (2): 165 kB | 66/197 kB
                                
Downloaded from eclipse-maven-central: https://repo.eclipse.org/content/repositories/maven_central/org/apache/maven/maven-model-builder/3.2.1/maven-model-builder-3.2.1.jar (165 kB at 1.2 MB/s)
11:06:11 Progress (1): 70/197 kB
                       
Downloading from eclipse-maven-central: https://repo.eclipse.org/content/repositories/maven_central/org/codehaus/plexus/plexus-interpolation/1.19/plexus-interpolation-1.19.jar
11:06:11 Progress (1): 74/197 kB
Progress (1): 78/197 kB
Progress (1): 82/197 kB
Progress (1): 86/197 kB
Progress (1): 90/197 kB
Progress (1): 94/197 kB
Progress (1): 98/197 kB
Progress (1): 98/197 kB
Progress (1): 102/197 kB
Progress (1): 106/197 kB
Progress (1): 110/197 kB
Progress (1): 114/197 kB
Progress (1): 118/197 kB
Progress (1): 122/197 kB
Progress (2): 122/197 kB | 4.1/33 kB
Progress (2): 126/197 kB | 4.1/33 kB
Progress (2): 126/197 kB | 7.7/33 kB
Progress (2): 130/197 kB | 7.7/33 kB
Progress (2): 130/197 kB | 12/33 kB 
Progress (3): 130/197 kB | 12/33 kB | 0/1.5 MB
Progress (3): 134/197 kB | 12/33 kB | 0/1.5 MB
Progress (3): 134/197 kB | 12/33 kB | 0/1.5 MB
Progress (3): 134/197 kB | 16/33 kB | 0/1.5 MB
Progress (3): 134/197 kB | 16/33 kB | 0/1.5 MB
Progress (3): 134/197 kB | 20/33 kB | 0/1.5 MB
Progress (3): 138/197 kB | 20/33 kB | 0/1.5 MB
Progress (3): 138/197 kB | 24/33 kB | 0/1.5 MB
Progress (3): 138/197 kB | 24/33 kB | 0/1.5 MB
Progress (3): 138/197 kB | 28/33 kB | 0/1.5 MB
Progress (3): 142/197 kB | 28/33 kB | 0/1.5 MB
Progress (3): 142/197 kB | 32/33 kB | 0/1.5 MB
Progress (3): 142/197 kB | 32/33 kB | 0/1.5 MB
Progress (3): 142/197 kB | 33/33 kB | 0/1.5 MB
Progress (3): 146/197 kB | 33/33 kB | 0/1.5 MB
Progress (3): 146/197 kB | 33 kB | 0/1.5 MB   
Progress (3): 146/197 kB | 33 kB | 0/1.5 MB
Progress (3): 150/197 kB | 33 kB | 0/1.5 MB
Progress (3): 150/197 kB | 33 kB | 0/1.5 MB
Progress (3): 154/197 kB | 33 kB | 0/1.5 MB
Progress (4): 154/197 kB | 33 kB | 0/1.5 MB | 4.1/291 kB
Progress (4): 154/197 kB | 33 kB | 0/1.5 MB | 4.1/291 kB
Progress (4): 154/197 kB | 33 kB | 0/1.5 MB | 7.7/291 kB
Progress (4): 158/197 kB | 33 kB | 0/1.5 MB | 7.7/291 kB
Progress (4): 158/197 kB | 33 kB | 0/1.5 MB | 12/291 kB 
Progress (4): 158/197 kB | 33 kB | 0/1.5 MB | 12/291 kB
Progress (4): 158/197 kB | 33 kB | 0/1.5 MB | 16/291 kB
Progress (4): 162/197 kB | 33 kB | 0/1.5 MB | 16/291 kB
Progress (4): 162/197 kB | 33 kB | 0/1.5 MB | 16/291 kB
Progress (4): 162/197 kB | 33 kB | 0/1.5 MB | 20/291 kB
Progress (4): 162/197 kB | 33 kB | 0/1.5 MB | 20/291 kB
Progress (4): 166/197 kB | 33 kB | 0/1.5 MB | 20/291 kB
Progress (4): 166/197 kB | 33 kB | 0/1.5 MB | 24/291 kB
Progress (4): 170/197 kB | 33 kB | 0/1.5 MB | 24/291 kB
Progress (4): 170/197 kB | 33 kB | 0/1.5 MB | 24/291 kB
Progress (4): 170/197 kB | 33 kB | 0/1.5 MB | 28/291 kB
Progress (4): 170/197 kB | 33 kB | 0/1.5 MB | 28/291 kB
Progress (4): 174/197 kB | 33 kB | 0/1.5 MB | 28/291 kB
Progress (4): 174/197 kB | 33 kB | 0/1.5 MB | 32/291 kB
Progress (4): 178/197 kB | 33 kB | 0/1.5 MB | 32/291 kB
Progress (4): 178/197 kB | 33 kB | 0.1/1.5 MB | 32/291 kB
Progress (4): 182/197 kB | 33 kB | 0.1/1.5 MB | 32/291 kB
Progress (4): 182/197 kB | 33 kB | 0.1/1.5 MB | 33/291 kB
Progress (4): 186/197 kB | 33 kB | 0.1/1.5 MB | 33/291 kB
Progress (4): 186/197 kB | 33 kB | 0.1/1.5 MB | 37/291 kB
Progress (5): 186/197 kB | 33 kB | 0.1/1.5 MB | 37/291 kB | 4.1/62 kB
Progress (5): 186/197 kB | 33 kB | 0.1/1.5 MB | 37/291 kB | 4.1/62 kB
                                                                     
Downloaded from eclipse-maven-central: https://repo.eclipse.org/content/repositories/maven_central/com/google/code/findbugs/jsr305/1.3.9/jsr305-1.3.9.jar (33 kB at 220 kB/s)
11:06:11 Progress (4): 186/197 kB | 0.1/1.5 MB | 37/291 kB | 4.1/62 kB
Progress (4): 186/197 kB | 0.1/1.5 MB | 37/291 kB | 7.7/62 kB
Progress (4): 186/197 kB | 0.1/1.5 MB | 41/291 kB | 7.7/62 kB
Progress (4): 190/197 kB | 0.1/1.5 MB | 41/291 kB | 7.7/62 kB
Progress (4): 190/197 kB | 0.1/1.5 MB | 45/291 kB | 7.7/62 kB
Progress (4): 190/197 kB | 0.1/1.5 MB | 45/291 kB | 12/62 kB 
Progress (4): 190/197 kB | 0.1/1.5 MB | 45/291 kB | 12/62 kB
                                                            
Downloading from eclipse-maven-central: https://repo.eclipse.org/content/repositories/maven_central/org/codehaus/plexus/plexus-classworlds/2.5.1/plexus-classworlds-2.5.1.jar
11:06:11 Progress (4): 190/197 kB | 0.1/1.5 MB | 45/291 kB | 12/62 kB
Progress (4): 190/197 kB | 0.1/1.5 MB | 45/291 kB | 16/62 kB
Progress (4): 190/197 kB | 0.1/1.5 MB | 49/291 kB | 16/62 kB
Progress (4): 194/197 kB | 0.1/1.5 MB | 49/291 kB | 16/62 kB
Progress (4): 194/197 kB | 0.1/1.5 MB | 49/291 kB | 20/62 kB
Progress (4): 194/197 kB | 0.1/1.5 MB | 49/291 kB | 20/62 kB
Progress (4): 194/197 kB | 0.1/1.5 MB | 49/291 kB | 24/62 kB
Progress (4): 197 kB | 0.1/1.5 MB | 49/291 kB | 24/62 kB    
Progress (4): 197 kB | 0.1/1.5 MB | 53/291 kB | 24/62 kB
Progress (4): 197 kB | 0.1/1.5 MB | 53/291 kB | 28/62 kB
Progress (4): 197 kB | 0.1/1.5 MB | 53/291 kB | 28/62 kB
Progress (4): 197 kB | 0.1/1.5 MB | 53/291 kB | 32/62 kB
Progress (4): 197 kB | 0.1/1.5 MB | 57/291 kB | 32/62 kB
Progress (4): 197 kB | 0.1/1.5 MB | 57/291 kB | 33/62 kB
Progress (4): 197 kB | 0.1/1.5 MB | 57/291 kB | 33/62 kB
Progress (4): 197 kB | 0.1/1.5 MB | 57/291 kB | 37/62 kB
Progress (4): 197 kB | 0.1/1.5 MB | 61/291 kB | 37/62 kB
Progress (4): 197 kB | 0.1/1.5 MB | 61/291 kB | 37/62 kB
Progress (4): 197 kB | 0.1/1.5 MB | 61/291 kB | 41/62 kB
Progress (4): 197 kB | 0.1/1.5 MB | 61/291 kB | 41/62 kB
Progress (4): 197 kB | 0.1/1.5 MB | 65/291 kB | 41/62 kB
Progress (4): 197 kB | 0.1/1.5 MB | 65/291 kB | 45/62 kB
Progress (4): 197 kB | 0.1/1.5 MB | 66/291 kB | 45/62 kB
Progress (4): 197 kB | 0.1/1.5 MB | 66/291 kB | 45/62 kB
Progress (4): 197 kB | 0.1/1.5 MB | 70/291 kB | 45/62 kB
Progress (4): 197 kB | 0.1/1.5 MB | 70/291 kB | 49/62 kB
Progress (4): 197 kB | 0.1/1.5 MB | 74/291 kB | 49/62 kB
Progress (4): 197 kB | 0.1/1.5 MB | 74/291 kB | 53/62 kB
Progress (4): 197 kB | 0.1/1.5 MB | 74/291 kB | 53/62 kB
Progress (4): 197 kB | 0.1/1.5 MB | 74/291 kB | 57/62 kB
Progress (4): 197 kB | 0.1/1.5 MB | 78/291 kB | 57/62 kB
Progress (4): 197 kB | 0.1/1.5 MB | 78/291 kB | 61/62 kB
Progress (4): 197 kB | 0.1/1.5 MB | 78/291 kB | 61/62 kB
Progress (4): 197 kB | 0.1/1.5 MB | 78/291 kB | 62 kB   
Progress (4): 197 kB | 0.1/1.5 MB | 82/291 kB | 62 kB
Progress (4): 197 kB | 0.1/1.5 MB | 82/291 kB | 62 kB
Progress (4): 197 kB | 0.1/1.5 MB | 86/291 kB | 62 kB
Progress (4): 197 kB | 0.1/1.5 MB | 86/291 kB | 62 kB
Progress (4): 197 kB | 0.1/1.5 MB | 90/291 kB | 62 kB
Progress (4): 197 kB | 0.1/1.5 MB | 90/291 kB | 62 kB
Progress (4): 197 kB | 0.1/1.5 MB | 94/291 kB | 62 kB
Progress (4): 197 kB | 0.1/1.5 MB | 94/291 kB | 62 kB
Progress (4): 197 kB | 0.1/1.5 MB | 98/291 kB | 62 kB
Progress (4): 197 kB | 0.1/1.5 MB | 98/291 kB | 62 kB
Progress (4): 197 kB | 0.1/1.5 MB | 98/291 kB | 62 kB
Progress (4): 197 kB | 0.1/1.5 MB | 98/291 kB | 62 kB
Progress (4): 197 kB | 0.1/1.5 MB | 102/291 kB | 62 kB
Progress (4): 197 kB | 0.1/1.5 MB | 102/291 kB | 62 kB
Progress (4): 197 kB | 0.1/1.5 MB | 106/291 kB | 62 kB
Progress (4): 197 kB | 0.1/1.5 MB | 106/291 kB | 62 kB
Progress (4): 197 kB | 0.1/1.5 MB | 110/291 kB | 62 kB
Progress (4): 197 kB | 0.1/1.5 MB | 110/291 kB | 62 kB
Progress (4): 197 kB | 0.1/1.5 MB | 114/291 kB | 62 kB
Progress (4): 197 kB | 0.1/1.5 MB | 114/291 kB | 62 kB
Progress (4): 197 kB | 0.1/1.5 MB | 118/291 kB | 62 kB
Progress (4): 197 kB | 0.1/1.5 MB | 118/291 kB | 62 kB
Progress (4): 197 kB | 0.1/1.5 MB | 122/291 kB | 62 kB
Progress (4): 197 kB | 0.1/1.5 MB | 122/291 kB | 62 kB
Progress (4): 197 kB | 0.1/1.5 MB | 126/291 kB | 62 kB
Progress (4): 197 kB | 0.2/1.5 MB | 126/291 kB | 62 kB
Progress (4): 197 kB | 0.2/1.5 MB | 130/291 kB | 62 kB
Progress (4): 197 kB | 0.2/1.5 MB | 130/291 kB | 62 kB
Progress (4): 197 kB | 0.2/1.5 MB | 134/291 kB | 62 kB
Progress (4): 197 kB | 0.2/1.5 MB | 134/291 kB | 62 kB
Progress (4): 197 kB | 0.2/1.5 MB | 138/291 kB | 62 kB
Progress (4): 197 kB | 0.2/1.5 MB | 138/291 kB | 62 kB
Progress (4): 197 kB | 0.2/1.5 MB | 142/291 kB | 62 kB
Progress (4): 197 kB | 0.2/1.5 MB | 142/291 kB | 62 kB
Progress (4): 197 kB | 0.2/1.5 MB | 146/291 kB | 62 kB
Progress (4): 197 kB | 0.2/1.5 MB | 146/291 kB | 62 kB
Progress (4): 197 kB | 0.2/1.5 MB | 150/291 kB | 62 kB
Progress (4): 197 kB | 0.2/1.5 MB | 150/291 kB | 62 kB
Progress (4): 197 kB | 0.2/1.5 MB | 154/291 kB | 62 kB
Progress (4): 197 kB | 0.2/1.5 MB | 154/291 kB | 62 kB
Progress (4): 197 kB | 0.2/1.5 MB | 158/291 kB | 62 kB
Progress (4): 197 kB | 0.2/1.5 MB | 158/291 kB | 62 kB
Progress (4): 197 kB | 0.2/1.5 MB | 162/291 kB | 62 kB
Progress (4): 197 kB | 0.2/1.5 MB | 162/291 kB | 62 kB
Progress (4): 197 kB | 0.2/1.5 MB | 166/291 kB | 62 kB
Progress (4): 197 kB | 0.2/1.5 MB | 166/291 kB | 62 kB
Progress (4): 197 kB | 0.2/1.5 MB | 170/291 kB | 62 kB
Progress (5): 197 kB | 0.2/1.5 MB | 170/291 kB | 62 kB | 4.1/50 kB
Progress (5): 197 kB | 0.2/1.5 MB | 174/291 kB | 62 kB | 4.1/50 kB
Progress (5): 197 kB | 0.2/1.5 MB | 174/291 kB | 62 kB | 4.1/50 kB
Progress (5): 197 kB | 0.2/1.5 MB | 178/291 kB | 62 kB | 4.1/50 kB
Progress (5): 197 kB | 0.2/1.5 MB | 178/291 kB | 62 kB | 7.7/50 kB
Progress (5): 197 kB | 0.2/1.5 MB | 182/291 kB | 62 kB | 7.7/50 kB
Progress (5): 197 kB | 0.2/1.5 MB | 182/291 kB | 62 kB | 7.7/50 kB
Progress (5): 197 kB | 0.2/1.5 MB | 186/291 kB | 62 kB | 7.7/50 kB
Progress (5): 197 kB | 0.2/1.5 MB | 186/291 kB | 62 kB | 7.7/50 kB
Progress (5): 197 kB | 0.2/1.5 MB | 190/291 kB | 62 kB | 7.7/50 kB
Progress (5): 197 kB | 0.2/1.5 MB | 190/291 kB | 62 kB | 12/50 kB 
Progress (5): 197 kB | 0.2/1.5 MB | 194/291 kB | 62 kB | 12/50 kB
Progress (5): 197 kB | 0.2/1.5 MB | 194/291 kB | 62 kB | 12/50 kB
Progress (5): 197 kB | 0.2/1.5 MB | 198/291 kB | 62 kB | 12/50 kB
Progress (5): 197 kB | 0.2/1.5 MB | 198/291 kB | 62 kB | 12/50 kB
Progress (5): 197 kB | 0.2/1.5 MB | 198/291 kB | 62 kB | 16/50 kB
Progress (5): 197 kB | 0.2/1.5 MB | 198/291 kB | 62 kB | 16/50 kB
Progress (5): 197 kB | 0.2/1.5 MB | 198/291 kB | 62 kB | 20/50 kB
Progress (5): 197 kB | 0.2/1.5 MB | 202/291 kB | 62 kB | 20/50 kB
Progress (5): 197 kB | 0.2/1.5 MB | 202/291 kB | 62 kB | 24/50 kB
Progress (5): 197 kB | 0.2/1.5 MB | 206/291 kB | 62 kB | 24/50 kB
Progress (5): 197 kB | 0.2/1.5 MB | 206/291 kB | 62 kB | 24/50 kB
Progress (5): 197 kB | 0.2/1.5 MB | 210/291 kB | 62 kB | 24/50 kB
                                                                 
Downloaded from eclipse-maven-central: https://repo.eclipse.org/content/repositories/maven_central/org/codehaus/plexus/plexus-interpolation/1.19/plexus-interpolation-1.19.jar (62 kB at 361 kB/s)
11:06:11 Progress (4): 197 kB | 0.2/1.5 MB | 210/291 kB | 28/50 kB
Progress (4): 197 kB | 0.2/1.5 MB | 214/291 kB | 28/50 kB
Progress (4): 197 kB | 0.2/1.5 MB | 214/291 kB | 28/50 kB
Progress (4): 197 kB | 0.2/1.5 MB | 218/291 kB | 28/50 kB
Progress (4): 197 kB | 0.2/1.5 MB | 218/291 kB | 32/50 kB
Progress (4): 197 kB | 0.2/1.5 MB | 222/291 kB | 32/50 kB
Progress (4): 197 kB | 0.2/1.5 MB | 222/291 kB | 32/50 kB
                                                         
Downloaded from eclipse-maven-central: https://repo.eclipse.org/content/repositories/maven_central/org/eclipse/sisu/org.eclipse.sisu.plexus/0.0.0.M5/org.eclipse.sisu.plexus-0.0.0.M5.jar (197 kB at 1.1 MB/s)
11:06:11 Progress (3): 0.2/1.5 MB | 222/291 kB | 32/50 kB
Progress (3): 0.2/1.5 MB | 226/291 kB | 32/50 kB
Progress (3): 0.2/1.5 MB | 226/291 kB | 32/50 kB
Progress (3): 0.2/1.5 MB | 226/291 kB | 36/50 kB
Progress (3): 0.2/1.5 MB | 226/291 kB | 36/50 kB
Progress (3): 0.2/1.5 MB | 230/291 kB | 36/50 kB
Progress (3): 0.2/1.5 MB | 230/291 kB | 40/50 kB
Progress (3): 0.2/1.5 MB | 234/291 kB | 40/50 kB
Progress (3): 0.2/1.5 MB | 234/291 kB | 40/50 kB
Progress (3): 0.2/1.5 MB | 234/291 kB | 44/50 kB
Progress (3): 0.2/1.5 MB | 234/291 kB | 44/50 kB
Progress (3): 0.2/1.5 MB | 238/291 kB | 44/50 kB
Progress (3): 0.2/1.5 MB | 238/291 kB | 48/50 kB
Progress (3): 0.3/1.5 MB | 238/291 kB | 48/50 kB
Progress (3): 0.3/1.5 MB | 242/291 kB | 48/50 kB
Progress (3): 0.3/1.5 MB | 242/291 kB | 48/50 kB
Progress (3): 0.3/1.5 MB | 242/291 kB | 50 kB   
Progress (3): 0.3/1.5 MB | 242/291 kB | 50 kB
Progress (3): 0.3/1.5 MB | 246/291 kB | 50 kB
Progress (3): 0.3/1.5 MB | 246/291 kB | 50 kB
Progress (3): 0.3/1.5 MB | 250/291 kB | 50 kB
Progress (3): 0.3/1.5 MB | 250/291 kB | 50 kB
Progress (3): 0.3/1.5 MB | 254/291 kB | 50 kB
Progress (3): 0.3/1.5 MB | 254/291 kB | 50 kB
Progress (3): 0.3/1.5 MB | 258/291 kB | 50 kB
Progress (3): 0.3/1.5 MB | 258/291 kB | 50 kB
Progress (3): 0.3/1.5 MB | 262/291 kB | 50 kB
Progress (3): 0.3/1.5 MB | 262/291 kB | 50 kB
Progress (3): 0.3/1.5 MB | 266/291 kB | 50 kB
Progress (3): 0.3/1.5 MB | 266/291 kB | 50 kB
Progress (3): 0.3/1.5 MB | 270/291 kB | 50 kB
Progress (3): 0.3/1.5 MB | 270/291 kB | 50 kB
Progress (3): 0.3/1.5 MB | 274/291 kB | 50 kB
Progress (3): 0.3/1.5 MB | 274/291 kB | 50 kB
Progress (3): 0.3/1.5 MB | 278/291 kB | 50 kB
Progress (3): 0.3/1.5 MB | 278/291 kB | 50 kB
Progress (3): 0.3/1.5 MB | 282/291 kB | 50 kB
Progress (3): 0.3/1.5 MB | 282/291 kB | 50 kB
Progress (3): 0.3/1.5 MB | 286/291 kB | 50 kB
Progress (3): 0.3/1.5 MB | 286/291 kB | 50 kB
Progress (3): 0.3/1.5 MB | 290/291 kB | 50 kB
Progress (3): 0.3/1.5 MB | 291 kB | 50 kB    
Progress (3): 0.3/1.5 MB | 291 kB | 50 kB
Progress (3): 0.3/1.5 MB | 291 kB | 50 kB
Progress (3): 0.3/1.5 MB | 291 kB | 50 kB
Progress (3): 0.3/1.5 MB | 291 kB | 50 kB
Progress (3): 0.3/1.5 MB | 291 kB | 50 kB
Progress (3): 0.3/1.5 MB | 291 kB | 50 kB
Progress (3): 0.3/1.5 MB | 291 kB | 50 kB
Progress (3): 0.3/1.5 MB | 291 kB | 50 kB
Progress (3): 0.3/1.5 MB | 291 kB | 50 kB
Progress (3): 0.3/1.5 MB | 291 kB | 50 kB
Progress (3): 0.3/1.5 MB | 291 kB | 50 kB
                                         
Downloaded from eclipse-maven-central: https://repo.eclipse.org/content/repositories/maven_central/org/codehaus/plexus/plexus-classworlds/2.5.1/plexus-classworlds-2.5.1.jar (50 kB at 275 kB/s)
11:06:11 Progress (2): 0.4/1.5 MB | 291 kB
Progress (2): 0.4/1.5 MB | 291 kB
Progress (2): 0.4/1.5 MB | 291 kB
Progress (2): 0.4/1.5 MB | 291 kB
Progress (2): 0.4/1.5 MB | 291 kB
Progress (2): 0.4/1.5 MB | 291 kB
Progress (2): 0.4/1.5 MB | 291 kB
Progress (2): 0.4/1.5 MB | 291 kB
Progress (2): 0.4/1.5 MB | 291 kB
Progress (2): 0.4/1.5 MB | 291 kB
Progress (2): 0.4/1.5 MB | 291 kB
Progress (2): 0.4/1.5 MB | 291 kB
Progress (2): 0.4/1.5 MB | 291 kB
Progress (2): 0.4/1.5 MB | 291 kB
Progress (2): 0.4/1.5 MB | 291 kB
Progress (2): 0.4/1.5 MB | 291 kB
Progress (2): 0.4/1.5 MB | 291 kB
Progress (2): 0.4/1.5 MB | 291 kB
Progress (2): 0.4/1.5 MB | 291 kB
Progress (2): 0.4/1.5 MB | 291 kB
Progress (2): 0.4/1.5 MB | 291 kB
Progress (2): 0.4/1.5 MB | 291 kB
Progress (2): 0.4/1.5 MB | 291 kB
Progress (2): 0.4/1.5 MB | 291 kB
Progress (2): 0.4/1.5 MB | 291 kB
Progress (2): 0.5/1.5 MB | 291 kB
Progress (2): 0.5/1.5 MB | 291 kB
Progress (2): 0.5/1.5 MB | 291 kB
Progress (2): 0.5/1.5 MB | 291 kB
                                 
Downloaded from eclipse-maven-central: https://repo.eclipse.org/content/repositories/maven_central/org/eclipse/sisu/org.eclipse.sisu.inject/0.0.0.M5/org.eclipse.sisu.inject-0.0.0.M5.jar (291 kB at 1.6 MB/s)
11:06:11 Progress (1): 0.5/1.5 MB
Progress (1): 0.5/1.5 MB
Progress (1): 0.5/1.5 MB
Progress (1): 0.5/1.5 MB
Progress (1): 0.5/1.5 MB
Progress (1): 0.5/1.5 MB
Progress (1): 0.5/1.5 MB
Progress (1): 0.5/1.5 MB
Progress (1): 0.5/1.5 MB
Progress (1): 0.5/1.5 MB
Progress (1): 0.5/1.5 MB
Progress (1): 0.5/1.5 MB
Progress (1): 0.5/1.5 MB
Progress (1): 0.5/1.5 MB
Progress (1): 0.5/1.5 MB
Progress (1): 0.5/1.5 MB
Progress (1): 0.5/1.5 MB
Progress (1): 0.5/1.5 MB
Progress (1): 0.5/1.5 MB
Progress (1): 0.5/1.5 MB
Progress (1): 0.5/1.5 MB
Progress (1): 0.6/1.5 MB
Progress (1): 0.6/1.5 MB
Progress (1): 0.6/1.5 MB
Progress (1): 0.6/1.5 MB
Progress (1): 0.6/1.5 MB
Progress (1): 0.6/1.5 MB
Progress (1): 0.6/1.5 MB
Progress (1): 0.6/1.5 MB
Progress (1): 0.6/1.5 MB
Progress (1): 0.6/1.5 MB
Progress (1): 0.6/1.5 MB
Progress (1): 0.6/1.5 MB
Progress (1): 0.6/1.5 MB
Progress (1): 0.6/1.5 MB
Progress (1): 0.6/1.5 MB
Progress (1): 0.6/1.5 MB
Progress (1): 0.6/1.5 MB
Progress (1): 0.6/1.5 MB
Progress (1): 0.6/1.5 MB
Progress (1): 0.6/1.5 MB
Progress (1): 0.6/1.5 MB
Progress (1): 0.6/1.5 MB
Progress (1): 0.6/1.5 MB
Progress (1): 0.6/1.5 MB
Progress (1): 0.6/1.5 MB
Progress (1): 0.7/1.5 MB
Progress (1): 0.7/1.5 MB
Progress (1): 0.7/1.5 MB
Progress (1): 0.7/1.5 MB
Progress (1): 0.7/1.5 MB
Progress (1): 0.7/1.5 MB
Progress (1): 0.7/1.5 MB
Progress (1): 0.7/1.5 MB
Progress (1): 0.7/1.5 MB
Progress (1): 0.7/1.5 MB
Progress (1): 0.7/1.5 MB
Progress (1): 0.7/1.5 MB
Progress (1): 0.7/1.5 MB
Progress (1): 0.7/1.5 MB
Progress (1): 0.7/1.5 MB
Progress (1): 0.7/1.5 MB
Progress (1): 0.7/1.5 MB
Progress (1): 0.7/1.5 MB
Progress (1): 0.7/1.5 MB
Progress (1): 0.7/1.5 MB
Progress (1): 0.7/1.5 MB
Progress (1): 0.7/1.5 MB
Progress (1): 0.7/1.5 MB
Progress (1): 0.7/1.5 MB
Progress (1): 0.7/1.5 MB
Progress (1): 0.8/1.5 MB
Progress (1): 0.8/1.5 MB
Progress (1): 0.8/1.5 MB
Progress (1): 0.8/1.5 MB
Progress (1): 0.8/1.5 MB
Progress (1): 0.8/1.5 MB
Progress (1): 0.8/1.5 MB
Progress (1): 0.8/1.5 MB
Progress (1): 0.8/1.5 MB
Progress (1): 0.8/1.5 MB
Progress (1): 0.8/1.5 MB
Progress (1): 0.8/1.5 MB
Progress (1): 0.8/1.5 MB
Progress (1): 0.8/1.5 MB
Progress (1): 0.8/1.5 MB
Progress (1): 0.8/1.5 MB
Progress (1): 0.8/1.5 MB
Progress (1): 0.8/1.5 MB
Progress (1): 0.8/1.5 MB
Progress (1): 0.8/1.5 MB
Progress (1): 0.8/1.5 MB
Progress (1): 0.8/1.5 MB
Progress (1): 0.8/1.5 MB
Progress (1): 0.8/1.5 MB
Progress (1): 0.8/1.5 MB
Progress (1): 0.9/1.5 MB
Progress (1): 0.9/1.5 MB
Progress (1): 0.9/1.5 MB
Progress (1): 0.9/1.5 MB
Progress (1): 0.9/1.5 MB
Progress (1): 0.9/1.5 MB
Progress (1): 0.9/1.5 MB
Progress (1): 0.9/1.5 MB
Progress (1): 0.9/1.5 MB
Progress (1): 0.9/1.5 MB
Progress (1): 0.9/1.5 MB
Progress (1): 0.9/1.5 MB
Progress (1): 0.9/1.5 MB
Progress (1): 0.9/1.5 MB
Progress (1): 0.9/1.5 MB
Progress (1): 0.9/1.5 MB
Progress (1): 0.9/1.5 MB
Progress (1): 0.9/1.5 MB
Progress (1): 0.9/1.5 MB
Progress (1): 0.9/1.5 MB
Progress (1): 0.9/1.5 MB
Progress (1): 0.9/1.5 MB
Progress (1): 0.9/1.5 MB
Progress (1): 0.9/1.5 MB
Progress (1): 0.9/1.5 MB
Progress (1): 1.0/1.5 MB
Progress (1): 1.0/1.5 MB
Progress (1): 1.0/1.5 MB
Progress (1): 1.0/1.5 MB
Progress (1): 1.0/1.5 MB
Progress (1): 1.0/1.5 MB
Progress (1): 1.0/1.5 MB
Progress (1): 1.0/1.5 MB
Progress (1): 1.0/1.5 MB
Progress (1): 1.0/1.5 MB
Progress (1): 1.0/1.5 MB
Progress (1): 1.0/1.5 MB
Progress (1): 1.0/1.5 MB
Progress (1): 1.0/1.5 MB
Progress (1): 1.0/1.5 MB
Progress (1): 1.0/1.5 MB
Progress (1): 1.0/1.5 MB
Progress (1): 1.0/1.5 MB
Progress (1): 1.0/1.5 MB
Progress (1): 1.0/1.5 MB
Progress (1): 1.0/1.5 MB
Progress (1): 1.0/1.5 MB
Progress (1): 1.0/1.5 MB
Progress (1): 1.0/1.5 MB
Progress (1): 1.0/1.5 MB
Progress (1): 1.1/1.5 MB
Progress (1): 1.1/1.5 MB
Progress (1): 1.1/1.5 MB
Progress (1): 1.1/1.5 MB
Progress (1): 1.1/1.5 MB
Progress (1): 1.1/1.5 MB
Progress (1): 1.1/1.5 MB
Progress (1): 1.1/1.5 MB
Progress (1): 1.1/1.5 MB
Progress (1): 1.1/1.5 MB
Progress (1): 1.1/1.5 MB
Progress (1): 1.1/1.5 MB
Progress (1): 1.1/1.5 MB
Progress (1): 1.1/1.5 MB
Progress (1): 1.1/1.5 MB
Progress (1): 1.1/1.5 MB
Progress (1): 1.1/1.5 MB
Progress (1): 1.1/1.5 MB
Progress (1): 1.1/1.5 MB
Progress (1): 1.1/1.5 MB
Progress (1): 1.1/1.5 MB
Progress (1): 1.1/1.5 MB
Progress (1): 1.1/1.5 MB
Progress (1): 1.1/1.5 MB
Progress (1): 1.1/1.5 MB
Progress (1): 1.2/1.5 MB
Progress (1): 1.2/1.5 MB
Progress (1): 1.2/1.5 MB
Progress (1): 1.2/1.5 MB
Progress (1): 1.2/1.5 MB
Progress (1): 1.2/1.5 MB
Progress (1): 1.2/1.5 MB
Progress (1): 1.2/1.5 MB
Progress (1): 1.2/1.5 MB
Progress (1): 1.2/1.5 MB
Progress (1): 1.2/1.5 MB
Progress (1): 1.2/1.5 MB
Progress (1): 1.2/1.5 MB
Progress (1): 1.2/1.5 MB
Progress (1): 1.2/1.5 MB
Progress (1): 1.2/1.5 MB
Progress (1): 1.2/1.5 MB
Progress (1): 1.2/1.5 MB
Progress (1): 1.2/1.5 MB
Progress (1): 1.2/1.5 MB
Progress (1): 1.2/1.5 MB
Progress (1): 1.2/1.5 MB
Progress (1): 1.2/1.5 MB
Progress (1): 1.2/1.5 MB
Progress (1): 1.2/1.5 MB
Progress (1): 1.3/1.5 MB
Progress (1): 1.3/1.5 MB
Progress (1): 1.3/1.5 MB
Progress (1): 1.3/1.5 MB
Progress (1): 1.3/1.5 MB
Progress (1): 1.3/1.5 MB
Progress (1): 1.3/1.5 MB
Progress (1): 1.3/1.5 MB
Progress (1): 1.3/1.5 MB
Progress (1): 1.3/1.5 MB
Progress (1): 1.3/1.5 MB
Progress (1): 1.3/1.5 MB
Progress (1): 1.3/1.5 MB
Progress (1): 1.3/1.5 MB
Progress (1): 1.3/1.5 MB
Progress (1): 1.3/1.5 MB
Progress (1): 1.3/1.5 MB
Progress (1): 1.3/1.5 MB
Progress (1): 1.3/1.5 MB
Progress (1): 1.3/1.5 MB
Progress (1): 1.3/1.5 MB
Progress (1): 1.3/1.5 MB
Progress (1): 1.3/1.5 MB
Progress (1): 1.3/1.5 MB
Progress (1): 1.3/1.5 MB
Progress (1): 1.4/1.5 MB
Progress (1): 1.4/1.5 MB
Progress (1): 1.4/1.5 MB
Progress (1): 1.4/1.5 MB
Progress (1): 1.4/1.5 MB
Progress (1): 1.4/1.5 MB
Progress (1): 1.4/1.5 MB
Progress (1): 1.4/1.5 MB
Progress (1): 1.4/1.5 MB
Progress (1): 1.4/1.5 MB
Progress (1): 1.4/1.5 MB
Progress (1): 1.4/1.5 MB
Progress (1): 1.4/1.5 MB
Progress (1): 1.4/1.5 MB
Progress (1): 1.4/1.5 MB
Progress (1): 1.4/1.5 MB
Progress (1): 1.4/1.5 MB
Progress (1): 1.4/1.5 MB
Progress (1): 1.4/1.5 MB
Progress (1): 1.4/1.5 MB
Progress (1): 1.4/1.5 MB
Progress (1): 1.4/1.5 MB
Progress (1): 1.4/1.5 MB
Progress (1): 1.4/1.5 MB
Progress (1): 1.4/1.5 MB
Progress (1): 1.5/1.5 MB
Progress (1): 1.5/1.5 MB
Progress (1): 1.5/1.5 MB
Progress (1): 1.5/1.5 MB
Progress (1): 1.5/1.5 MB
Progress (1): 1.5/1.5 MB
Progress (1): 1.5/1.5 MB
Progress (1): 1.5/1.5 MB
Progress (1): 1.5/1.5 MB
Progress (1): 1.5/1.5 MB
Progress (1): 1.5/1.5 MB
Progress (1): 1.5/1.5 MB
Progress (1): 1.5/1.5 MB
Progress (1): 1.5 MB    
                    
Downloaded from eclipse-maven-central: https://repo.eclipse.org/content/repositories/maven_central/com/google/guava/guava/10.0.1/guava-10.0.1.jar (1.5 MB at 6.2 MB/s)
11:06:12 [INFO] 
11:06:12 [INFO] -------< org.eclipse.egerrit:org.eclipse.egerrit.ui.rcptt.tests >-------
11:06:12 [INFO] Building org.eclipse.egerrit.ui.rcptt.tests 1.4.0-SNAPSHOT
11:06:12 [INFO] -----------------------------[ rcpttTest ]------------------------------
11:06:12 Downloading from rcptt-snapshots: https://repo.eclipse.org/content/repositories/rcptt-snapshots/org/apache/maven/plugins/maven-install-plugin/maven-metadata.xml
11:06:12 Downloading from eclipse-maven-central: https://repo.eclipse.org/content/repositories/maven_central/org/apache/maven/plugins/maven-install-plugin/maven-metadata.xml
11:06:12 Downloading from rcptt-releases: https://repo.eclipse.org/content/repositories/rcptt-releases/org/apache/maven/plugins/maven-install-plugin/maven-metadata.xml
11:06:12 Downloading from eclipse-cbi-releases: https://repo.eclipse.org/content/groups/cbi/org/apache/maven/plugins/maven-install-plugin/maven-metadata.xml
11:06:12 Progress (1): 663 B
                   
Downloaded from eclipse-maven-central: https://repo.eclipse.org/content/repositories/maven_central/org/apache/maven/plugins/maven-install-plugin/maven-metadata.xml (663 B at 28 kB/s)
11:06:12 Downloading from rcptt-releases: https://repo.eclipse.org/content/repositories/rcptt-releases/org/apache/maven/plugins/maven-install-plugin/3.0.0-M1/maven-install-plugin-3.0.0-M1.pom
11:06:12 Downloading from rcptt-snapshots: https://repo.eclipse.org/content/repositories/rcptt-snapshots/org/apache/maven/plugins/maven-install-plugin/3.0.0-M1/maven-install-plugin-3.0.0-M1.pom
11:06:12 Downloading from eclipse-cbi-releases: https://repo.eclipse.org/content/groups/cbi/org/apache/maven/plugins/maven-install-plugin/3.0.0-M1/maven-install-plugin-3.0.0-M1.pom
11:06:12 Downloading from eclipse-maven-central: https://repo.eclipse.org/content/repositories/maven_central/org/apache/maven/plugins/maven-install-plugin/3.0.0-M1/maven-install-plugin-3.0.0-M1.pom
11:06:12 Progress (1): 4.1/6.2 kB
Progress (1): 6.2 kB    
                    
Downloaded from eclipse-maven-central: https://repo.eclipse.org/content/repositories/maven_central/org/apache/maven/plugins/maven-install-plugin/3.0.0-M1/maven-install-plugin-3.0.0-M1.pom (6.2 kB at 200 kB/s)
11:06:12 Downloading from rcptt-releases: https://repo.eclipse.org/content/repositories/rcptt-releases/org/apache/maven/plugins/maven-plugins/33/maven-plugins-33.pom
11:06:12 Downloading from rcptt-snapshots: https://repo.eclipse.org/content/repositories/rcptt-snapshots/org/apache/maven/plugins/maven-plugins/33/maven-plugins-33.pom
11:06:12 Downloading from eclipse-cbi-releases: https://repo.eclipse.org/content/groups/cbi/org/apache/maven/plugins/maven-plugins/33/maven-plugins-33.pom
11:06:12 Downloading from eclipse-maven-central: https://repo.eclipse.org/content/repositories/maven_central/org/apache/maven/plugins/maven-plugins/33/maven-plugins-33.pom
11:06:12 Progress (1): 4.1/11 kB
Progress (1): 7.7/11 kB
Progress (1): 11 kB    
                   
Downloaded from eclipse-maven-central: https://repo.eclipse.org/content/repositories/maven_central/org/apache/maven/plugins/maven-plugins/33/maven-plugins-33.pom (11 kB at 314 kB/s)
11:06:12 Downloading from rcptt-releases: https://repo.eclipse.org/content/repositories/rcptt-releases/org/apache/maven/maven-parent/33/maven-parent-33.pom
11:06:12 Downloading from rcptt-snapshots: https://repo.eclipse.org/content/repositories/rcptt-snapshots/org/apache/maven/maven-parent/33/maven-parent-33.pom
11:06:12 Downloading from eclipse-cbi-releases: https://repo.eclipse.org/content/groups/cbi/org/apache/maven/maven-parent/33/maven-parent-33.pom
11:06:12 Downloading from eclipse-maven-central: https://repo.eclipse.org/content/repositories/maven_central/org/apache/maven/maven-parent/33/maven-parent-33.pom
11:06:12 Progress (1): 4.1/44 kB
Progress (1): 7.7/44 kB
Progress (1): 12/44 kB 
Progress (1): 16/44 kB
Progress (1): 20/44 kB
Progress (1): 24/44 kB
Progress (1): 28/44 kB
Progress (1): 32/44 kB
Progress (1): 36/44 kB
Progress (1): 40/44 kB
Progress (1): 44/44 kB
Progress (1): 44 kB   
                   
Downloaded from eclipse-maven-central: https://repo.eclipse.org/content/repositories/maven_central/org/apache/maven/maven-parent/33/maven-parent-33.pom (44 kB at 1.3 MB/s)
11:06:12 Downloading from rcptt-releases: https://repo.eclipse.org/content/repositories/rcptt-releases/org/apache/apache/21/apache-21.pom
11:06:12 Downloading from rcptt-snapshots: https://repo.eclipse.org/content/repositories/rcptt-snapshots/org/apache/apache/21/apache-21.pom
11:06:12 Downloading from eclipse-cbi-releases: https://repo.eclipse.org/content/groups/cbi/org/apache/apache/21/apache-21.pom
11:06:12 Downloading from eclipse-maven-central: https://repo.eclipse.org/content/repositories/maven_central/org/apache/apache/21/apache-21.pom
11:06:12 Progress (1): 4.1/17 kB
Progress (1): 7.7/17 kB
Progress (1): 12/17 kB 
Progress (1): 16/17 kB
Progress (1): 17 kB   
                   
Downloaded from eclipse-maven-central: https://repo.eclipse.org/content/repositories/maven_central/org/apache/apache/21/apache-21.pom (17 kB at 552 kB/s)
11:06:12 Downloading from rcptt-releases: https://repo.eclipse.org/content/repositories/rcptt-releases/org/apache/maven/plugins/maven-install-plugin/3.0.0-M1/maven-install-plugin-3.0.0-M1.jar
11:06:12 Downloading from rcptt-snapshots: https://repo.eclipse.org/content/repositories/rcptt-snapshots/org/apache/maven/plugins/maven-install-plugin/3.0.0-M1/maven-install-plugin-3.0.0-M1.jar
11:06:12 Downloading from eclipse-cbi-releases: https://repo.eclipse.org/content/groups/cbi/org/apache/maven/plugins/maven-install-plugin/3.0.0-M1/maven-install-plugin-3.0.0-M1.jar
11:06:12 Downloading from eclipse-maven-central: https://repo.eclipse.org/content/repositories/maven_central/org/apache/maven/plugins/maven-install-plugin/3.0.0-M1/maven-install-plugin-3.0.0-M1.jar
11:06:12 Progress (1): 4.1/29 kB
Progress (1): 7.7/29 kB
Progress (1): 12/29 kB 
Progress (1): 16/29 kB
Progress (1): 20/29 kB
Progress (1): 24/29 kB
Progress (1): 28/29 kB
Progress (1): 29 kB   
                   
Downloaded from eclipse-maven-central: https://repo.eclipse.org/content/repositories/maven_central/org/apache/maven/plugins/maven-install-plugin/3.0.0-M1/maven-install-plugin-3.0.0-M1.jar (29 kB at 796 kB/s)
11:06:12 Downloading from rcptt-releases: https://repo.eclipse.org/content/repositories/rcptt-releases/org/apache/maven/plugins/maven-deploy-plugin/maven-metadata.xml
11:06:12 Downloading from rcptt-snapshots: https://repo.eclipse.org/content/repositories/rcptt-snapshots/org/apache/maven/plugins/maven-deploy-plugin/maven-metadata.xml
11:06:12 Downloading from eclipse-maven-central: https://repo.eclipse.org/content/repositories/maven_central/org/apache/maven/plugins/maven-deploy-plugin/maven-metadata.xml
11:06:12 Downloading from eclipse-cbi-releases: https://repo.eclipse.org/content/groups/cbi/org/apache/maven/plugins/maven-deploy-plugin/maven-metadata.xml
11:06:12 Progress (1): 749 B
                   
Downloaded from eclipse-maven-central: https://repo.eclipse.org/content/repositories/maven_central/org/apache/maven/plugins/maven-deploy-plugin/maven-metadata.xml (749 B at 19 kB/s)
11:06:12 Downloading from rcptt-releases: https://repo.eclipse.org/content/repositories/rcptt-releases/org/apache/maven/plugins/maven-deploy-plugin/3.0.0-M1/maven-deploy-plugin-3.0.0-M1.pom
11:06:12 Downloading from rcptt-snapshots: https://repo.eclipse.org/content/repositories/rcptt-snapshots/org/apache/maven/plugins/maven-deploy-plugin/3.0.0-M1/maven-deploy-plugin-3.0.0-M1.pom
11:06:12 Downloading from eclipse-cbi-releases: https://repo.eclipse.org/content/groups/cbi/org/apache/maven/plugins/maven-deploy-plugin/3.0.0-M1/maven-deploy-plugin-3.0.0-M1.pom
11:06:12 Downloading from eclipse-maven-central: https://repo.eclipse.org/content/repositories/maven_central/org/apache/maven/plugins/maven-deploy-plugin/3.0.0-M1/maven-deploy-plugin-3.0.0-M1.pom
11:06:12 Progress (1): 4.1/7.8 kB
Progress (1): 7.7/7.8 kB
Progress (1): 7.8 kB    
                    
Downloaded from eclipse-maven-central: https://repo.eclipse.org/content/repositories/maven_central/org/apache/maven/plugins/maven-deploy-plugin/3.0.0-M1/maven-deploy-plugin-3.0.0-M1.pom (7.8 kB at 244 kB/s)
11:06:12 Downloading from rcptt-releases: https://repo.eclipse.org/content/repositories/rcptt-releases/org/apache/maven/plugins/maven-deploy-plugin/3.0.0-M1/maven-deploy-plugin-3.0.0-M1.jar
11:06:12 Downloading from rcptt-snapshots: https://repo.eclipse.org/content/repositories/rcptt-snapshots/org/apache/maven/plugins/maven-deploy-plugin/3.0.0-M1/maven-deploy-plugin-3.0.0-M1.jar
11:06:12 Downloading from eclipse-cbi-releases: https://repo.eclipse.org/content/groups/cbi/org/apache/maven/plugins/maven-deploy-plugin/3.0.0-M1/maven-deploy-plugin-3.0.0-M1.jar
11:06:12 Downloading from eclipse-maven-central: https://repo.eclipse.org/content/repositories/maven_central/org/apache/maven/plugins/maven-deploy-plugin/3.0.0-M1/maven-deploy-plugin-3.0.0-M1.jar
11:06:12 Progress (1): 4.1/34 kB
Progress (1): 7.7/34 kB
Progress (1): 12/34 kB 
Progress (1): 16/34 kB
Progress (1): 20/34 kB
Progress (1): 24/34 kB
Progress (1): 28/34 kB
Progress (1): 32/34 kB
Progress (1): 34 kB   
                   
Downloaded from eclipse-maven-central: https://repo.eclipse.org/content/repositories/maven_central/org/apache/maven/plugins/maven-deploy-plugin/3.0.0-M1/maven-deploy-plugin-3.0.0-M1.jar (34 kB at 1.0 MB/s)
11:06:12 Downloading from rcptt-releases: https://repo.eclipse.org/content/repositories/rcptt-releases/org/apache/maven/plugins/maven-dependency-plugin/2.10/maven-dependency-plugin-2.10.pom
11:06:12 Downloading from rcptt-snapshots: https://repo.eclipse.org/content/repositories/rcptt-snapshots/org/apache/maven/plugins/maven-dependency-plugin/2.10/maven-dependency-plugin-2.10.pom
11:06:12 Downloading from eclipse-cbi-releases: https://repo.eclipse.org/content/groups/cbi/org/apache/maven/plugins/maven-dependency-plugin/2.10/maven-dependency-plugin-2.10.pom
11:06:12 Downloading from eclipse-maven-central: https://repo.eclipse.org/content/repositories/maven_central/org/apache/maven/plugins/maven-dependency-plugin/2.10/maven-dependency-plugin-2.10.pom
11:06:12 Progress (1): 4.1/12 kB
Progress (1): 7.7/12 kB
Progress (1): 12/12 kB 
Progress (1): 12 kB   
                   
Downloaded from eclipse-maven-central: https://repo.eclipse.org/content/repositories/maven_central/org/apache/maven/plugins/maven-dependency-plugin/2.10/maven-dependency-plugin-2.10.pom (12 kB at 285 kB/s)
11:06:12 Downloading from rcptt-releases: https://repo.eclipse.org/content/repositories/rcptt-releases/org/apache/maven/plugins/maven-plugins/27/maven-plugins-27.pom
11:06:12 Downloading from rcptt-snapshots: https://repo.eclipse.org/content/repositories/rcptt-snapshots/org/apache/maven/plugins/maven-plugins/27/maven-plugins-27.pom
11:06:12 Downloading from eclipse-cbi-releases: https://repo.eclipse.org/content/groups/cbi/org/apache/maven/plugins/maven-plugins/27/maven-plugins-27.pom
11:06:12 Downloading from eclipse-maven-central: https://repo.eclipse.org/content/repositories/maven_central/org/apache/maven/plugins/maven-plugins/27/maven-plugins-27.pom
11:06:13 Progress (1): 4.1/11 kB
Progress (1): 7.7/11 kB
Progress (1): 11 kB    
                   
Downloaded from eclipse-maven-central: https://repo.eclipse.org/content/repositories/maven_central/org/apache/maven/plugins/maven-plugins/27/maven-plugins-27.pom (11 kB at 392 kB/s)
11:06:13 Downloading from rcptt-releases: https://repo.eclipse.org/content/repositories/rcptt-releases/org/apache/maven/plugins/maven-dependency-plugin/2.10/maven-dependency-plugin-2.10.jar
11:06:13 Downloading from rcptt-snapshots: https://repo.eclipse.org/content/repositories/rcptt-snapshots/org/apache/maven/plugins/maven-dependency-plugin/2.10/maven-dependency-plugin-2.10.jar
11:06:13 Downloading from eclipse-cbi-releases: https://repo.eclipse.org/content/groups/cbi/org/apache/maven/plugins/maven-dependency-plugin/2.10/maven-dependency-plugin-2.10.jar
11:06:13 Downloading from eclipse-maven-central: https://repo.eclipse.org/content/repositories/maven_central/org/apache/maven/plugins/maven-dependency-plugin/2.10/maven-dependency-plugin-2.10.jar
11:06:13 Progress (1): 4.1/160 kB
Progress (1): 7.7/160 kB
Progress (1): 12/160 kB 
Progress (1): 16/160 kB
Progress (1): 20/160 kB
Progress (1): 24/160 kB
Progress (1): 28/160 kB
Progress (1): 32/160 kB
Progress (1): 36/160 kB
Progress (1): 40/160 kB
Progress (1): 44/160 kB
Progress (1): 48/160 kB
Progress (1): 52/160 kB
Progress (1): 56/160 kB
Progress (1): 60/160 kB
Progress (1): 64/160 kB
Progress (1): 68/160 kB
Progress (1): 72/160 kB
Progress (1): 76/160 kB
Progress (1): 80/160 kB
Progress (1): 84/160 kB
Progress (1): 88/160 kB
Progress (1): 92/160 kB
Progress (1): 96/160 kB
Progress (1): 100/160 kB
Progress (1): 104/160 kB
Progress (1): 108/160 kB
Progress (1): 112/160 kB
Progress (1): 116/160 kB
Progress (1): 120/160 kB
Progress (1): 124/160 kB
Progress (1): 128/160 kB
Progress (1): 132/160 kB
Progress (1): 136/160 kB
Progress (1): 140/160 kB
Progress (1): 144/160 kB
Progress (1): 148/160 kB
Progress (1): 152/160 kB
Progress (1): 156/160 kB
Progress (1): 160/160 kB
Progress (1): 160 kB    
                    
Downloaded from eclipse-maven-central: https://repo.eclipse.org/content/repositories/maven_central/org/apache/maven/plugins/maven-dependency-plugin/2.10/maven-dependency-plugin-2.10.jar (160 kB at 2.2 MB/s)
11:06:13 [INFO] 
11:06:13 [INFO] --- maven-clean-plugin:2.5:clean (default-clean) @ org.eclipse.egerrit.ui.rcptt.tests ---
11:06:13 [INFO] 
11:06:13 [INFO] --- maven-enforcer-plugin:1.4.1:enforce (enforce-maven) @ org.eclipse.egerrit.ui.rcptt.tests ---
11:06:13 [INFO] 
11:06:13 [INFO] --- jacoco-maven-plugin:0.7.4.201502262128:prepare-agent (pre-test) @ org.eclipse.egerrit.ui.rcptt.tests ---
11:06:13 [INFO] argLine set to -javaagent:/home/hudson/genie.egerrit/.jenkins/jobs/EGerrit/workspace/.repository/org/jacoco/org.jacoco.agent/0.7.4.201502262128/org.jacoco.agent-0.7.4.201502262128-runtime.jar=destfile=/jobs/genie.egerrit/EGerrit/workspace/org.eclipse.egerrit.ui.rcptt.tests/../target/jacoco.exec,append=true,includes=org.eclipse.egerrit.*
11:06:13 [INFO] 
11:06:13 [INFO] --- rcptt-maven-plugin:2.1.0:resources (default-resources) @ org.eclipse.egerrit.ui.rcptt.tests ---
11:06:13 [INFO] Downloading artifact from http://download.eclipse.org/eclipse/downloads/drops4/R-4.6.3-201703010400/eclipse-SDK-4.6.3-linux-gtk-x86_64.tar.gz...
11:06:13 [INFO] ------------------------------------------------------------------------
11:06:13 [INFO] BUILD FAILURE
11:06:13 [INFO] ------------------------------------------------------------------------
11:06:13 [INFO] Total time: 6.475 s
11:06:13 [INFO] Finished at: 2018-10-05T11:06:13-04:00
11:06:13 [INFO] ------------------------------------------------------------------------
11:06:13 [ERROR] Failed to execute goal org.eclipse.rcptt:rcptt-maven-plugin:2.1.0:resources (default-resources) on project org.eclipse.egerrit.ui.rcptt.tests: Download failed: http://download.eclipse.org/eclipse/downloads/drops4/R-4.6.3-201703010400/eclipse-SDK-4.6.3-linux-gtk-x86_64.tar.gz -> [Help 1]
11:06:13 [ERROR] 
11:06:13 [ERROR] To see the full stack trace of the errors, re-run Maven with the -e switch.
11:06:13 [ERROR] Re-run Maven using the -X switch to enable full debug logging.
11:06:13 [ERROR] 
11:06:13 [ERROR] For more information about the errors and possible solutions, please read the following articles:
11:06:13 [ERROR] [Help 1] http://cwiki.apache.org/confluence/display/MAVEN/MojoExecutionException
11:06:13 Build step 'Invoke top-level Maven targets' marked build as failure
11:06:13 Terminating xvnc.
11:06:14 Not sending mail to unregistered user lmcbout@gmail.com
11:06:14 Sending e-mails to: lmcbout@gmail.com pascal@rapicorp.com patrick.pollo.guilbert@ericsson.com
11:06:14 Recording test results
11:06:14 Archiving artifacts
11:06:14 Started calculate disk usage of build
11:06:14 Finished Calculation of disk usage of build in 0 seconds
11:06:15 Started calculate disk usage of workspace
11:06:15 Finished Calculation of disk usage of workspace in 0 seconds
11:06:16 Finished: FAILURE