FailedConsole Output

Skipping 1,466 KB.. Full Log
Yx+LCAAAAAAAAP9b85aBtbiIQSWjNKU4P0+vJLE4u1gvPjexLDVPzxdEhicW5WXmpfvll6S2fNly5fzGzauYGBgqihikoFqS8/OK83NS9ZwhNEghAwQwghQWAACwxA+XYgAAAA==[WARNING] /jobs/genie.egerrit/EGerrit/workspace/org.eclipse.egerrit.ui.tests/src/org/eclipse/egerrit/internal/rcptt/support/ImportProjectService.java:[109] 
00:29:14 	GerritUtil.configurePushRefSpec(remoteConfig, "HEAD:refs/for/master");
00:29:14 	                                              ^^^^^^^^^^^^^^^^^^^^^^
00:29:14 Non-externalized string literal; it should be followed by //$NON-NLS-<n>$
00:29:14 [WARNING] /jobs/genie.egerrit/EGerrit/workspace/org.eclipse.egerrit.ui.tests/src/org/eclipse/egerrit/internal/rcptt/support/ImportProjectService.java:[110] 
00:29:14 	GerritUtil.configureFetchNotes(remoteConfig);
00:29:14 	^^^^^^^^^^
00:29:14 Discouraged access: The type 'GerritUtil' is not API (restriction on classpath entry '/home/hudson/genie.egerrit/.jenkins/jobs/EGerrit/workspace/.repository/p2/osgi/bundle/org.eclipse.egit.core/4.9.2.201712150930-r/org.eclipse.egit.core-4.9.2.201712150930-r.jar')
00:29:14 [WARNING] /jobs/genie.egerrit/EGerrit/workspace/org.eclipse.egerrit.ui.tests/src/org/eclipse/egerrit/internal/rcptt/support/ImportProjectService.java:[110] 
00:29:14 	GerritUtil.configureFetchNotes(remoteConfig);
00:29:14 	^^^^^^^^^^^^^^^^^^^^^^^^^^^^^^^^^^^^^^^^^^^^
00:29:14 Discouraged access: The method 'GerritUtil.configureFetchNotes(RemoteConfig)' is not API (restriction on classpath entry '/home/hudson/genie.egerrit/.jenkins/jobs/EGerrit/workspace/.repository/p2/osgi/bundle/org.eclipse.egit.core/4.9.2.201712150930-r/org.eclipse.egit.core-4.9.2.201712150930-r.jar')
00:29:14 [WARNING] /jobs/genie.egerrit/EGerrit/workspace/org.eclipse.egerrit.ui.tests/src/org/eclipse/egerrit/internal/rcptt/support/ReviewFactory.java:[109] 
00:29:14 	String dotProjectContent = "<?xml version=\"1.0\" encoding=\"UTF-8\"?>\n" + "<projectDescription>\n"
00:29:14 	                           ^^^^^^^^^^^^^^^^^^^^^^^^^^^^^^^^^^^^^^^^^^^^^^
00:29:14 Non-externalized string literal; it should be followed by //$NON-NLS-<n>$
00:29:14 [WARNING] /jobs/genie.egerrit/EGerrit/workspace/org.eclipse.egerrit.ui.tests/src/org/eclipse/egerrit/internal/rcptt/support/ReviewFactory.java:[109] 
00:29:14 	String dotProjectContent = "<?xml version=\"1.0\" encoding=\"UTF-8\"?>\n" + "<projectDescription>\n"
00:29:14 	                                                                            ^^^^^^^^^^^^^^^^^^^^^^^^
00:29:14 Non-externalized string literal; it should be followed by //$NON-NLS-<n>$
00:29:14 [WARNING] /jobs/genie.egerrit/EGerrit/workspace/org.eclipse.egerrit.ui.tests/src/org/eclipse/egerrit/internal/rcptt/support/ReviewFactory.java:[110] 
00:29:14 	+ "	<name>Project</name>\n" + "	<comment></comment>\n" + "	<projects>\n" + "	</projects>\n"
00:29:14 	  ^^^^^^^^^^^^^^^^^^^^^^^^^
00:29:14 Non-externalized string literal; it should be followed by //$NON-NLS-<n>$
00:29:14 [WARNING] /jobs/genie.egerrit/EGerrit/workspace/org.eclipse.egerrit.ui.tests/src/org/eclipse/egerrit/internal/rcptt/support/ReviewFactory.java:[110] 
00:29:14 	+ "	<name>Project</name>\n" + "	<comment></comment>\n" + "	<projects>\n" + "	</projects>\n"
00:29:14 	   	                          ^^^^^^^^^^^^^^^^^^^^^^^^
00:29:14 Non-externalized string literal; it should be followed by //$NON-NLS-<n>$
00:29:14 [WARNING] /jobs/genie.egerrit/EGerrit/workspace/org.eclipse.egerrit.ui.tests/src/org/eclipse/egerrit/internal/rcptt/support/ReviewFactory.java:[110] 
00:29:14 	+ "	<name>Project</name>\n" + "	<comment></comment>\n" + "	<projects>\n" + "	</projects>\n"
00:29:14 	   	                           	                         ^^^^^^^^^^^^^^^
00:29:14 Non-externalized string literal; it should be followed by //$NON-NLS-<n>$
00:29:14 [WARNING] /jobs/genie.egerrit/EGerrit/workspace/org.eclipse.egerrit.ui.tests/src/org/eclipse/egerrit/internal/rcptt/support/ReviewFactory.java:[110] 
00:29:14 	+ "	<name>Project</name>\n" + "	<comment></comment>\n" + "	<projects>\n" + "	</projects>\n"
00:29:14 	   	                           	                          	                ^^^^^^^^^^^^^^^^
00:29:14 Non-externalized string literal; it should be followed by //$NON-NLS-<n>$
00:29:14 [WARNING] /jobs/genie.egerrit/EGerrit/workspace/org.eclipse.egerrit.ui.tests/src/org/eclipse/egerrit/internal/rcptt/support/ReviewFactory.java:[111] 
00:29:14 	+ "	<buildSpec>\n" + "	</buildSpec>\n" + "	<natures>\n" + "	</natures>\n" + "</projectDescription>"; //$NON-NLS-5$
00:29:14 	  ^^^^^^^^^^^^^^^^
00:29:14 Non-externalized string literal; it should be followed by //$NON-NLS-<n>$
00:29:14 [WARNING] /jobs/genie.egerrit/EGerrit/workspace/org.eclipse.egerrit.ui.tests/src/org/eclipse/egerrit/internal/rcptt/support/ReviewFactory.java:[111] 
00:29:14 	+ "	<buildSpec>\n" + "	</buildSpec>\n" + "	<natures>\n" + "	</natures>\n" + "</projectDescription>"; //$NON-NLS-5$
00:29:14 	   	                 ^^^^^^^^^^^^^^^^^
00:29:14 Non-externalized string literal; it should be followed by //$NON-NLS-<n>$
00:29:14 [WARNING] /jobs/genie.egerrit/EGerrit/workspace/org.eclipse.egerrit.ui.tests/src/org/eclipse/egerrit/internal/rcptt/support/ReviewFactory.java:[111] 
00:29:14 	+ "	<buildSpec>\n" + "	</buildSpec>\n" + "	<natures>\n" + "	</natures>\n" + "</projectDescription>"; //$NON-NLS-5$
00:29:14 	   	                  	                  ^^^^^^^^^^^^^^
00:29:14 Non-externalized string literal; it should be followed by //$NON-NLS-<n>$
00:29:14 [WARNING] /jobs/genie.egerrit/EGerrit/workspace/org.eclipse.egerrit.ui.tests/src/org/eclipse/egerrit/internal/rcptt/support/ReviewFactory.java:[111] 
00:29:14 	+ "	<buildSpec>\n" + "	</buildSpec>\n" + "	<natures>\n" + "	</natures>\n" + "</projectDescription>"; //$NON-NLS-5$
00:29:14 	   	                  	                   	               ^^^^^^^^^^^^^^^
00:29:14 Non-externalized string literal; it should be followed by //$NON-NLS-<n>$
00:29:14 [WARNING] /jobs/genie.egerrit/EGerrit/workspace/org.eclipse.egerrit.ui.tests/src/org/eclipse/egerrit/internal/rcptt/support/ReviewFactory.java:[112] 
00:29:14 	gitAccess.commitFileInMaster("Project/.project", dotProjectContent);
00:29:14 	                             ^^^^^^^^^^^^^^^^^^
00:29:14 Non-externalized string literal; it should be followed by //$NON-NLS-<n>$
00:29:14 [WARNING] /jobs/genie.egerrit/EGerrit/workspace/org.eclipse.egerrit.ui.tests/src/org/eclipse/egerrit/ui/tests/DashboardCompletionTest.java:[41] 
00:29:14 	EStructuralFeature l = ci.eClass().getEStructuralFeature("labels"); //$NON-NLS-1$
00:29:14 	                   ^
00:29:14 The value of the local variable l is not used
00:29:14 [WARNING] /jobs/genie.egerrit/EGerrit/workspace/org.eclipse.egerrit.ui.tests/src/org/eclipse/egerrit/ui/tests/ChangeIdExtractorTest.java:[17] 
00:29:14 	import org.eclipse.egerrit.internal.dashboard.ui.views.ChangeIdExtractor;
00:29:14 	       ^^^^^^^^^^^^^^^^^^^^^^^^^^^^^^^^^^^^^^^^^^^^^^^^^^^^^^^^^^^^^^^^^
00:29:14 Discouraged access: The type 'ChangeIdExtractor' is not API (restriction on classpath entry '/jobs/genie.egerrit/EGerrit/workspace/org.eclipse.egerrit.dashboard.ui/target/classes')
00:29:14 [WARNING] /jobs/genie.egerrit/EGerrit/workspace/org.eclipse.egerrit.ui.tests/src/org/eclipse/egerrit/ui/tests/ChangeIdExtractorTest.java:[27] 
00:29:14 	assertNull(extractor.getServer());
00:29:14 	           ^^^^^^^^^^^^^^^^^^^^^
00:29:14 Discouraged access: The method 'ChangeIdExtractor.getServer()' is not API (restriction on classpath entry '/jobs/genie.egerrit/EGerrit/workspace/org.eclipse.egerrit.dashboard.ui/target/classes')
00:29:14 [WARNING] /jobs/genie.egerrit/EGerrit/workspace/org.eclipse.egerrit.ui.tests/src/org/eclipse/egerrit/ui/tests/ChangeIdExtractorTest.java:[28] 
00:29:14 	assertNull(extractor.getChangeId());
00:29:14 	           ^^^^^^^^^^^^^^^^^^^^^^^
00:29:14 Discouraged access: The method 'ChangeIdExtractor.getChangeId()' is not API (restriction on classpath entry '/jobs/genie.egerrit/EGerrit/workspace/org.eclipse.egerrit.dashboard.ui/target/classes')
00:29:14 [WARNING] /jobs/genie.egerrit/EGerrit/workspace/org.eclipse.egerrit.ui.tests/src/org/eclipse/egerrit/ui/tests/ChangeIdExtractorTest.java:[34] 
00:29:14 	ChangeIdExtractor extractor = new ChangeIdExtractor("https://git.eclipse.org/r/"); //$NON-NLS-1$
00:29:14 	^^^^^^^^^^^^^^^^^
00:29:14 Discouraged access: The type 'ChangeIdExtractor' is not API (restriction on classpath entry '/jobs/genie.egerrit/EGerrit/workspace/org.eclipse.egerrit.dashboard.ui/target/classes')
00:29:14 [WARNING] /jobs/genie.egerrit/EGerrit/workspace/org.eclipse.egerrit.ui.tests/src/org/eclipse/egerrit/ui/tests/ChangeIdExtractorTest.java:[34] 
00:29:14 	ChangeIdExtractor extractor = new ChangeIdExtractor("https://git.eclipse.org/r/"); //$NON-NLS-1$
00:29:14 	                              ^^^^^^^^^^^^^^^^^^^^^^^^^^^^^^^^^^^^^^^^^^^^^^^^^^^
00:29:14 Discouraged access: The constructor 'ChangeIdExtractor(String)' is not API (restriction on classpath entry '/jobs/genie.egerrit/EGerrit/workspace/org.eclipse.egerrit.dashboard.ui/target/classes')
00:29:14 [WARNING] /jobs/genie.egerrit/EGerrit/workspace/org.eclipse.egerrit.ui.tests/src/org/eclipse/egerrit/ui/tests/ChangeIdExtractorTest.java:[34] 
00:29:14 	ChangeIdExtractor extractor = new ChangeIdExtractor("https://git.eclipse.org/r/"); //$NON-NLS-1$
00:29:14 	                                  ^^^^^^^^^^^^^^^^^
00:29:14 Discouraged access: The type 'ChangeIdExtractor' is not API (restriction on classpath entry '/jobs/genie.egerrit/EGerrit/workspace/org.eclipse.egerrit.dashboard.ui/target/classes')
00:29:14 [WARNING] /jobs/genie.egerrit/EGerrit/workspace/org.eclipse.egerrit.ui.tests/src/org/eclipse/egerrit/ui/tests/ChangeIdExtractorTest.java:[35] 
00:29:14 	assertEquals("https://git.eclipse.org/r", extractor.getServer().getServerURI()); //$NON-NLS-1$
00:29:14 	                                          ^^^^^^^^^^^^^^^^^^^^^
00:29:14 Discouraged access: The method 'ChangeIdExtractor.getServer()' is not API (restriction on classpath entry '/jobs/genie.egerrit/EGerrit/workspace/org.eclipse.egerrit.dashboard.ui/target/classes')
00:29:14 [WARNING] /jobs/genie.egerrit/EGerrit/workspace/org.eclipse.egerrit.ui.tests/src/org/eclipse/egerrit/ui/tests/ChangeIdExtractorTest.java:[36] 
00:29:14 	assertNull(extractor.getChangeId());
00:29:14 	           ^^^^^^^^^^^^^^^^^^^^^^^
00:29:14 Discouraged access: The method 'ChangeIdExtractor.getChangeId()' is not API (restriction on classpath entry '/jobs/genie.egerrit/EGerrit/workspace/org.eclipse.egerrit.dashboard.ui/target/classes')
00:29:14 [WARNING] /jobs/genie.egerrit/EGerrit/workspace/org.eclipse.egerrit.ui.tests/src/org/eclipse/egerrit/ui/tests/ChangeIdExtractorTest.java:[42] 
00:29:14 	ChangeIdExtractor extractor = new ChangeIdExtractor("https://git.eclipse.org/r/#/c/1234"); //$NON-NLS-1$
00:29:14 	^^^^^^^^^^^^^^^^^
00:29:14 Discouraged access: The type 'ChangeIdExtractor' is not API (restriction on classpath entry '/jobs/genie.egerrit/EGerrit/workspace/org.eclipse.egerrit.dashboard.ui/target/classes')
00:29:14 [WARNING] /jobs/genie.egerrit/EGerrit/workspace/org.eclipse.egerrit.ui.tests/src/org/eclipse/egerrit/ui/tests/ChangeIdExtractorTest.java:[42] 
00:29:14 	ChangeIdExtractor extractor = new ChangeIdExtractor("https://git.eclipse.org/r/#/c/1234"); //$NON-NLS-1$
00:29:14 	                              ^^^^^^^^^^^^^^^^^^^^^^^^^^^^^^^^^^^^^^^^^^^^^^^^^^^^^^^^^^^
00:29:14 Discouraged access: The constructor 'ChangeIdExtractor(String)' is not API (restriction on classpath entry '/jobs/genie.egerrit/EGerrit/workspace/org.eclipse.egerrit.dashboard.ui/target/classes')
00:29:14 [WARNING] /jobs/genie.egerrit/EGerrit/workspace/org.eclipse.egerrit.ui.tests/src/org/eclipse/egerrit/ui/tests/ChangeIdExtractorTest.java:[42] 
00:29:14 	ChangeIdExtractor extractor = new ChangeIdExtractor("https://git.eclipse.org/r/#/c/1234"); //$NON-NLS-1$
00:29:14 	                                  ^^^^^^^^^^^^^^^^^
00:29:14 Discouraged access: The type 'ChangeIdExtractor' is not API (restriction on classpath entry '/jobs/genie.egerrit/EGerrit/workspace/org.eclipse.egerrit.dashboard.ui/target/classes')
00:29:14 [WARNING] /jobs/genie.egerrit/EGerrit/workspace/org.eclipse.egerrit.ui.tests/src/org/eclipse/egerrit/ui/tests/ChangeIdExtractorTest.java:[43] 
00:29:14 	assertEquals("https://git.eclipse.org/r", extractor.getServer().getServerURI()); //$NON-NLS-1$
00:29:14 	                                          ^^^^^^^^^^^^^^^^^^^^^
00:29:14 Discouraged access: The method 'ChangeIdExtractor.getServer()' is not API (restriction on classpath entry '/jobs/genie.egerrit/EGerrit/workspace/org.eclipse.egerrit.dashboard.ui/target/classes')
00:29:14 [WARNING] /jobs/genie.egerrit/EGerrit/workspace/org.eclipse.egerrit.ui.tests/src/org/eclipse/egerrit/ui/tests/ChangeIdExtractorTest.java:[44] 
00:29:14 	assertEquals("1234", extractor.getChangeId()); //$NON-NLS-1$
00:29:14 	                     ^^^^^^^^^^^^^^^^^^^^^^^
00:29:14 Discouraged access: The method 'ChangeIdExtractor.getChangeId()' is not API (restriction on classpath entry '/jobs/genie.egerrit/EGerrit/workspace/org.eclipse.egerrit.dashboard.ui/target/classes')
00:29:14 [WARNING] /jobs/genie.egerrit/EGerrit/workspace/org.eclipse.egerrit.ui.tests/src/org/eclipse/egerrit/ui/tests/ChangeIdExtractorTest.java:[46] 
00:29:14 	ChangeIdExtractor extractor2 = new ChangeIdExtractor("https://git.eclipse.org/r/#/c/1234/"); //$NON-NLS-1$
00:29:14 	^^^^^^^^^^^^^^^^^
00:29:14 Discouraged access: The type 'ChangeIdExtractor' is not API (restriction on classpath entry '/jobs/genie.egerrit/EGerrit/workspace/org.eclipse.egerrit.dashboard.ui/target/classes')
00:29:14 [WARNING] /jobs/genie.egerrit/EGerrit/workspace/org.eclipse.egerrit.ui.tests/src/org/eclipse/egerrit/ui/tests/ChangeIdExtractorTest.java:[46] 
00:29:14 	ChangeIdExtractor extractor2 = new ChangeIdExtractor("https://git.eclipse.org/r/#/c/1234/"); //$NON-NLS-1$
00:29:14 	                               ^^^^^^^^^^^^^^^^^^^^^^^^^^^^^^^^^^^^^^^^^^^^^^^^^^^^^^^^^^^^
00:29:14 Discouraged access: The constructor 'ChangeIdExtractor(String)' is not API (restriction on classpath entry '/jobs/genie.egerrit/EGerrit/workspace/org.eclipse.egerrit.dashboard.ui/target/classes')
00:29:14 [WARNING] /jobs/genie.egerrit/EGerrit/workspace/org.eclipse.egerrit.ui.tests/src/org/eclipse/egerrit/ui/tests/ChangeIdExtractorTest.java:[46] 
00:29:14 	ChangeIdExtractor extractor2 = new ChangeIdExtractor("https://git.eclipse.org/r/#/c/1234/"); //$NON-NLS-1$
00:29:14 	                                   ^^^^^^^^^^^^^^^^^
00:29:14 Discouraged access: The type 'ChangeIdExtractor' is not API (restriction on classpath entry '/jobs/genie.egerrit/EGerrit/workspace/org.eclipse.egerrit.dashboard.ui/target/classes')
00:29:14 [WARNING] /jobs/genie.egerrit/EGerrit/workspace/org.eclipse.egerrit.ui.tests/src/org/eclipse/egerrit/ui/tests/ChangeIdExtractorTest.java:[47] 
00:29:14 	assertEquals("https://git.eclipse.org/r", extractor2.getServer().getServerURI()); //$NON-NLS-1$
00:29:14 	                                          ^^^^^^^^^^^^^^^^^^^^^^
00:29:14 Discouraged access: The method 'ChangeIdExtractor.getServer()' is not API (restriction on classpath entry '/jobs/genie.egerrit/EGerrit/workspace/org.eclipse.egerrit.dashboard.ui/target/classes')
00:29:14 [WARNING] /jobs/genie.egerrit/EGerrit/workspace/org.eclipse.egerrit.ui.tests/src/org/eclipse/egerrit/ui/tests/ChangeIdExtractorTest.java:[48] 
00:29:14 	assertEquals("1234", extractor2.getChangeId()); //$NON-NLS-1$
00:29:14 	                     ^^^^^^^^^^^^^^^^^^^^^^^^
00:29:14 Discouraged access: The method 'ChangeIdExtractor.getChangeId()' is not API (restriction on classpath entry '/jobs/genie.egerrit/EGerrit/workspace/org.eclipse.egerrit.dashboard.ui/target/classes')
00:29:14 [WARNING] /jobs/genie.egerrit/EGerrit/workspace/org.eclipse.egerrit.ui.tests/src/org/eclipse/egerrit/ui/tests/ChangeIdExtractorTest.java:[54] 
00:29:14 	ChangeIdExtractor extractor = new ChangeIdExtractor("https://git.eclipse.org/r/#/c/1234/somethingElse"); //$NON-NLS-1$
00:29:14 	^^^^^^^^^^^^^^^^^
00:29:14 Discouraged access: The type 'ChangeIdExtractor' is not API (restriction on classpath entry '/jobs/genie.egerrit/EGerrit/workspace/org.eclipse.egerrit.dashboard.ui/target/classes')
00:29:14 [WARNING] /jobs/genie.egerrit/EGerrit/workspace/org.eclipse.egerrit.ui.tests/src/org/eclipse/egerrit/ui/tests/ChangeIdExtractorTest.java:[54] 
00:29:14 	ChangeIdExtractor extractor = new ChangeIdExtractor("https://git.eclipse.org/r/#/c/1234/somethingElse"); //$NON-NLS-1$
00:29:14 	                              ^^^^^^^^^^^^^^^^^^^^^^^^^^^^^^^^^^^^^^^^^^^^^^^^^^^^^^^^^^^^^^^^^^^^^^^^^
00:29:14 Discouraged access: The constructor 'ChangeIdExtractor(String)' is not API (restriction on classpath entry '/jobs/genie.egerrit/EGerrit/workspace/org.eclipse.egerrit.dashboard.ui/target/classes')
00:29:14 [WARNING] /jobs/genie.egerrit/EGerrit/workspace/org.eclipse.egerrit.ui.tests/src/org/eclipse/egerrit/ui/tests/ChangeIdExtractorTest.java:[54] 
00:29:14 	ChangeIdExtractor extractor = new ChangeIdExtractor("https://git.eclipse.org/r/#/c/1234/somethingElse"); //$NON-NLS-1$
00:29:14 	                                  ^^^^^^^^^^^^^^^^^
00:29:14 Discouraged access: The type 'ChangeIdExtractor' is not API (restriction on classpath entry '/jobs/genie.egerrit/EGerrit/workspace/org.eclipse.egerrit.dashboard.ui/target/classes')
00:29:14 [WARNING] /jobs/genie.egerrit/EGerrit/workspace/org.eclipse.egerrit.ui.tests/src/org/eclipse/egerrit/ui/tests/ChangeIdExtractorTest.java:[55] 
00:29:14 	assertEquals("https://git.eclipse.org/r", extractor.getServer().getServerURI()); //$NON-NLS-1$
00:29:14 	                                          ^^^^^^^^^^^^^^^^^^^^^
00:29:14 Discouraged access: The method 'ChangeIdExtractor.getServer()' is not API (restriction on classpath entry '/jobs/genie.egerrit/EGerrit/workspace/org.eclipse.egerrit.dashboard.ui/target/classes')
00:29:14 [WARNING] /jobs/genie.egerrit/EGerrit/workspace/org.eclipse.egerrit.ui.tests/src/org/eclipse/egerrit/ui/tests/ChangeIdExtractorTest.java:[56] 
00:29:14 	assertEquals("1234", extractor.getChangeId()); //$NON-NLS-1$
00:29:14 	                     ^^^^^^^^^^^^^^^^^^^^^^^
00:29:14 Discouraged access: The method 'ChangeIdExtractor.getChangeId()' is not API (restriction on classpath entry '/jobs/genie.egerrit/EGerrit/workspace/org.eclipse.egerrit.dashboard.ui/target/classes')
00:29:14 84 problems (84 warnings)
00:29:14 [INFO] 
00:29:14 [INFO] --- maven-resources-plugin:2.4.3:testResources (default-testResources) @ org.eclipse.egerrit.ui.tests ---
00:29:14 [INFO] Using 'UTF-8' encoding to copy filtered resources.
00:29:14 [INFO] skip non existing resourceDirectory /jobs/genie.egerrit/EGerrit/workspace/org.eclipse.egerrit.ui.tests/src/test/resources
00:29:14 [INFO] 
00:29:14 [INFO] --- tycho-source-plugin:1.0.0:plugin-source (plugin-source) @ org.eclipse.egerrit.ui.tests ---
00:29:14 [INFO] Building jar: /jobs/genie.egerrit/EGerrit/workspace/org.eclipse.egerrit.ui.tests/target/org.eclipse.egerrit.ui.tests-1.4.0-SNAPSHOT-sources.jar
00:29:14 [INFO] 
00:29:14 [INFO] --- target-platform-configuration:1.0.0:target-platform (default-target-platform) @ org.eclipse.egerrit.ui.tests ---
00:29:14 [INFO] 
00:29:14 [INFO] --- tycho-packaging-plugin:1.0.0:package-plugin (default-package-plugin) @ org.eclipse.egerrit.ui.tests ---
00:29:14 [INFO] Building jar: /jobs/genie.egerrit/EGerrit/workspace/org.eclipse.egerrit.ui.tests/target/org.eclipse.egerrit.ui.tests-1.4.0-SNAPSHOT.jar
00:29:14 [INFO] 
00:29:14 [INFO] --- tycho-p2-plugin:1.0.0:p2-metadata-default (default-p2-metadata-default) @ org.eclipse.egerrit.ui.tests ---
00:29:14 [INFO] 
00:29:14 [INFO] --- tycho-source-feature-plugin:1.0.0:source-feature (source-feature) @ org.eclipse.egerrit.ui.tests ---
00:29:14 [INFO] 
00:29:14 [INFO] --- tycho-pack200a-plugin:1.0.0:normalize (pack200-normalize) @ org.eclipse.egerrit.ui.tests ---
00:29:14 [INFO] Pack200 normalizing jar /jobs/genie.egerrit/EGerrit/workspace/org.eclipse.egerrit.ui.tests/target/org.eclipse.egerrit.ui.tests-1.4.0-SNAPSHOT.jar
00:29:15 [INFO] 
00:29:15 [INFO] --- eclipse-jarsigner-plugin:1.1.4:sign (sign) @ org.eclipse.egerrit.ui.tests ---
00:29:15 [INFO] Signing jar: /jobs/genie.egerrit/EGerrit/workspace/org.eclipse.egerrit.ui.tests/target/org.eclipse.egerrit.ui.tests-1.4.0-SNAPSHOT.jar
00:29:15 [INFO] Signing jar: /jobs/genie.egerrit/EGerrit/workspace/org.eclipse.egerrit.ui.tests/target/org.eclipse.egerrit.ui.tests-1.4.0-SNAPSHOT-sources.jar
00:29:16 [INFO] 
00:29:16 [INFO] --- tycho-pack200b-plugin:1.0.0:pack (pack200-pack) @ org.eclipse.egerrit.ui.tests ---
00:29:16 [INFO] Pack200 packing jar /jobs/genie.egerrit/EGerrit/workspace/org.eclipse.egerrit.ui.tests/target/org.eclipse.egerrit.ui.tests-1.4.0-SNAPSHOT.jar
00:29:16 [INFO] 
00:29:16 [INFO] --- tycho-p2-plugin:1.0.0:p2-metadata (attach-p2-metadata) @ org.eclipse.egerrit.ui.tests ---
00:29:16 [INFO] 
00:29:16 [INFO] --- tycho-surefire-plugin:1.0.0:test (default-test) @ org.eclipse.egerrit.ui.tests ---
00:29:16 [INFO] Skipping tests
00:29:16 [INFO] 
00:29:16 [INFO] --- maven-install-plugin:2.3.1:install (default-install) @ org.eclipse.egerrit.ui.tests ---
00:29:16 [INFO] Installing /jobs/genie.egerrit/EGerrit/workspace/org.eclipse.egerrit.ui.tests/target/org.eclipse.egerrit.ui.tests-1.4.0-SNAPSHOT.jar to /home/hudson/genie.egerrit/.jenkins/jobs/EGerrit/workspace/.repository/org/eclipse/egerrit/org.eclipse.egerrit.ui.tests/1.4.0-SNAPSHOT/org.eclipse.egerrit.ui.tests-1.4.0-SNAPSHOT.jar
00:29:16 [INFO] Installing /jobs/genie.egerrit/EGerrit/workspace/org.eclipse.egerrit.ui.tests/pom.xml to /home/hudson/genie.egerrit/.jenkins/jobs/EGerrit/workspace/.repository/org/eclipse/egerrit/org.eclipse.egerrit.ui.tests/1.4.0-SNAPSHOT/org.eclipse.egerrit.ui.tests-1.4.0-SNAPSHOT.pom
00:29:16 [INFO] Installing /jobs/genie.egerrit/EGerrit/workspace/org.eclipse.egerrit.ui.tests/target/org.eclipse.egerrit.ui.tests-1.4.0-SNAPSHOT-sources.jar to /home/hudson/genie.egerrit/.jenkins/jobs/EGerrit/workspace/.repository/org/eclipse/egerrit/org.eclipse.egerrit.ui.tests/1.4.0-SNAPSHOT/org.eclipse.egerrit.ui.tests-1.4.0-SNAPSHOT-sources.jar
00:29:16 [INFO] Installing /jobs/genie.egerrit/EGerrit/workspace/org.eclipse.egerrit.ui.tests/target/org.eclipse.egerrit.ui.tests-1.4.0-SNAPSHOT.jar.pack.gz to /home/hudson/genie.egerrit/.jenkins/jobs/EGerrit/workspace/.repository/org/eclipse/egerrit/org.eclipse.egerrit.ui.tests/1.4.0-SNAPSHOT/org.eclipse.egerrit.ui.tests-1.4.0-SNAPSHOT-pack200.jar.pack.gz
00:29:16 [INFO] Installing /jobs/genie.egerrit/EGerrit/workspace/org.eclipse.egerrit.ui.tests/target/p2content.xml to /home/hudson/genie.egerrit/.jenkins/jobs/EGerrit/workspace/.repository/org/eclipse/egerrit/org.eclipse.egerrit.ui.tests/1.4.0-SNAPSHOT/org.eclipse.egerrit.ui.tests-1.4.0-SNAPSHOT-p2metadata.xml
00:29:16 [INFO] Installing /jobs/genie.egerrit/EGerrit/workspace/org.eclipse.egerrit.ui.tests/target/p2artifacts.xml to /home/hudson/genie.egerrit/.jenkins/jobs/EGerrit/workspace/.repository/org/eclipse/egerrit/org.eclipse.egerrit.ui.tests/1.4.0-SNAPSHOT/org.eclipse.egerrit.ui.tests-1.4.0-SNAPSHOT-p2artifacts.xml
00:29:16 [INFO] 
00:29:16 [INFO] --- tycho-p2-plugin:1.0.0:update-local-index (default-update-local-index) @ org.eclipse.egerrit.ui.tests ---
00:29:16 [INFO] 
00:29:16 [INFO] ----------< org.eclipse.egerrit:org.eclipse.egerrit.feature >-----------
00:29:16 [INFO] Building EGerrit Feature 1.4.0-SNAPSHOT                          [11/13]
00:29:16 [INFO] --------------------------[ eclipse-feature ]---------------------------
00:29:16 [INFO] 
00:29:16 [INFO] --- maven-clean-plugin:2.5:clean (default-clean) @ org.eclipse.egerrit.feature ---
00:29:16 [INFO] Deleting /jobs/genie.egerrit/EGerrit/workspace/org.eclipse.egerrit.feature/target
00:29:16 [INFO] 
00:29:16 [INFO] --- tycho-packaging-plugin:1.0.0:build-qualifier-aggregator (default-build-qualifier-aggregator) @ org.eclipse.egerrit.feature ---
00:29:16 [INFO] The project's OSGi version is 1.4.0.962
00:29:16 [INFO] 
00:29:16 [INFO] --- tycho-packaging-plugin:1.0.0:validate-id (default-validate-id) @ org.eclipse.egerrit.feature ---
00:29:16 [INFO] 
00:29:16 [INFO] --- tycho-packaging-plugin:1.0.0:validate-version (default-validate-version) @ org.eclipse.egerrit.feature ---
00:29:16 [INFO] 
00:29:16 [INFO] --- maven-enforcer-plugin:1.4.1:enforce (enforce-maven) @ org.eclipse.egerrit.feature ---
00:29:16 [INFO] 
00:29:16 [INFO] --- jacoco-maven-plugin:0.7.4.201502262128:prepare-agent (pre-test) @ org.eclipse.egerrit.feature ---
00:29:16 [INFO] argLine set to -javaagent:/home/hudson/genie.egerrit/.jenkins/jobs/EGerrit/workspace/.repository/org/jacoco/org.jacoco.agent/0.7.4.201502262128/org.jacoco.agent-0.7.4.201502262128-runtime.jar=destfile=/jobs/genie.egerrit/EGerrit/workspace/org.eclipse.egerrit.feature/../target/jacoco.exec,append=true,includes=org.eclipse.egerrit.*
00:29:16 [INFO] 
00:29:16 [INFO] --- tycho-source-plugin:1.0.0:plugin-source (plugin-source) @ org.eclipse.egerrit.feature ---
00:29:16 [INFO] 
00:29:16 [INFO] --- target-platform-configuration:1.0.0:target-platform (default-target-platform) @ org.eclipse.egerrit.feature ---
00:29:16 [INFO] 
00:29:16 [INFO] --- tycho-packaging-plugin:1.0.0:package-feature (default-package-feature) @ org.eclipse.egerrit.feature ---
00:29:16 [INFO] Building jar: /jobs/genie.egerrit/EGerrit/workspace/org.eclipse.egerrit.feature/target/org.eclipse.egerrit.feature-1.4.0-SNAPSHOT.jar
00:29:16 [INFO] 
00:29:16 [INFO] --- tycho-p2-plugin:1.0.0:p2-metadata-default (default-p2-metadata-default) @ org.eclipse.egerrit.feature ---
00:29:16 [INFO] 
00:29:16 [INFO] --- tycho-p2-plugin:1.0.0:feature-p2-metadata (default-feature-p2-metadata) @ org.eclipse.egerrit.feature ---
00:29:16 [INFO] 
00:29:16 [INFO] --- tycho-source-feature-plugin:1.0.0:source-feature (source-feature) @ org.eclipse.egerrit.feature ---
00:29:17 [INFO] Building jar: /jobs/genie.egerrit/EGerrit/workspace/org.eclipse.egerrit.feature/target/org.eclipse.egerrit.feature-1.4.0-SNAPSHOT-sources-feature.jar
00:29:17 [INFO] 
00:29:17 [INFO] --- tycho-pack200a-plugin:1.0.0:normalize (pack200-normalize) @ org.eclipse.egerrit.feature ---
00:29:17 [INFO] 
00:29:17 [INFO] --- eclipse-jarsigner-plugin:1.1.4:sign (sign) @ org.eclipse.egerrit.feature ---
00:29:17 [INFO] Signing jar: /jobs/genie.egerrit/EGerrit/workspace/org.eclipse.egerrit.feature/target/org.eclipse.egerrit.feature-1.4.0-SNAPSHOT.jar
00:29:17 [INFO] Signing jar: /jobs/genie.egerrit/EGerrit/workspace/org.eclipse.egerrit.feature/target/org.eclipse.egerrit.feature-1.4.0-SNAPSHOT-sources-feature.jar
00:29:18 [INFO] 
00:29:18 [INFO] --- tycho-pack200b-plugin:1.0.0:pack (pack200-pack) @ org.eclipse.egerrit.feature ---
00:29:18 [INFO] 
00:29:18 [INFO] --- tycho-p2-plugin:1.0.0:p2-metadata (attach-p2-metadata) @ org.eclipse.egerrit.feature ---
00:29:18 [INFO] 
00:29:18 [INFO] --- maven-install-plugin:2.3.1:install (default-install) @ org.eclipse.egerrit.feature ---
00:29:18 [INFO] Installing /jobs/genie.egerrit/EGerrit/workspace/org.eclipse.egerrit.feature/target/org.eclipse.egerrit.feature-1.4.0-SNAPSHOT.jar to /home/hudson/genie.egerrit/.jenkins/jobs/EGerrit/workspace/.repository/org/eclipse/egerrit/org.eclipse.egerrit.feature/1.4.0-SNAPSHOT/org.eclipse.egerrit.feature-1.4.0-SNAPSHOT.jar
00:29:18 [INFO] Installing /jobs/genie.egerrit/EGerrit/workspace/org.eclipse.egerrit.feature/pom.xml to /home/hudson/genie.egerrit/.jenkins/jobs/EGerrit/workspace/.repository/org/eclipse/egerrit/org.eclipse.egerrit.feature/1.4.0-SNAPSHOT/org.eclipse.egerrit.feature-1.4.0-SNAPSHOT.pom
00:29:18 [INFO] Installing /jobs/genie.egerrit/EGerrit/workspace/org.eclipse.egerrit.feature/target/org.eclipse.egerrit.feature-1.4.0-SNAPSHOT-sources-feature.jar to /home/hudson/genie.egerrit/.jenkins/jobs/EGerrit/workspace/.repository/org/eclipse/egerrit/org.eclipse.egerrit.feature/1.4.0-SNAPSHOT/org.eclipse.egerrit.feature-1.4.0-SNAPSHOT-sources-feature.jar
00:29:18 [INFO] Installing /jobs/genie.egerrit/EGerrit/workspace/org.eclipse.egerrit.feature/target/p2content.xml to /home/hudson/genie.egerrit/.jenkins/jobs/EGerrit/workspace/.repository/org/eclipse/egerrit/org.eclipse.egerrit.feature/1.4.0-SNAPSHOT/org.eclipse.egerrit.feature-1.4.0-SNAPSHOT-p2metadata.xml
00:29:18 [INFO] Installing /jobs/genie.egerrit/EGerrit/workspace/org.eclipse.egerrit.feature/target/p2artifacts.xml to /home/hudson/genie.egerrit/.jenkins/jobs/EGerrit/workspace/.repository/org/eclipse/egerrit/org.eclipse.egerrit.feature/1.4.0-SNAPSHOT/org.eclipse.egerrit.feature-1.4.0-SNAPSHOT-p2artifacts.xml
00:29:18 [INFO] 
00:29:18 [INFO] --- tycho-p2-plugin:1.0.0:update-local-index (default-update-local-index) @ org.eclipse.egerrit.feature ---
00:29:18 [INFO] 
00:29:18 [INFO] ---------< org.eclipse.egerrit:org.eclipse.egerrit.updatesite >---------
00:29:18 [INFO] Building EGerrit Update site 1.4.0-SNAPSHOT                      [12/13]
00:29:18 [INFO] -------------------------[ eclipse-repository ]-------------------------
00:29:18 [INFO] 
00:29:18 [INFO] --- maven-clean-plugin:2.5:clean (default-clean) @ org.eclipse.egerrit.updatesite ---
00:29:18 [INFO] 
00:29:18 [INFO] --- tycho-packaging-plugin:1.0.0:build-qualifier-aggregator (default-build-qualifier-aggregator) @ org.eclipse.egerrit.updatesite ---
00:29:18 [INFO] The project's OSGi version is 1.4.0.962
00:29:18 [INFO] 
00:29:18 [INFO] --- maven-enforcer-plugin:1.4.1:enforce (enforce-maven) @ org.eclipse.egerrit.updatesite ---
00:29:18 [INFO] 
00:29:18 [INFO] --- maven-clean-plugin:2.5:clean (default-clean-1) @ org.eclipse.egerrit.updatesite ---
00:29:18 [INFO] 
00:29:18 [INFO] --- jacoco-maven-plugin:0.7.4.201502262128:prepare-agent (pre-test) @ org.eclipse.egerrit.updatesite ---
00:29:18 [INFO] argLine set to -javaagent:/home/hudson/genie.egerrit/.jenkins/jobs/EGerrit/workspace/.repository/org/jacoco/org.jacoco.agent/0.7.4.201502262128/org.jacoco.agent-0.7.4.201502262128-runtime.jar=destfile=/jobs/genie.egerrit/EGerrit/workspace/org.eclipse.egerrit.updatesite/../target/jacoco.exec,append=true,includes=org.eclipse.egerrit.*
00:29:18 [INFO] 
00:29:18 [INFO] --- maven-resources-plugin:2.4.3:resources (default-resources) @ org.eclipse.egerrit.updatesite ---
00:29:18 [INFO] Using 'UTF-8' encoding to copy filtered resources.
00:29:18 [INFO] skip non existing resourceDirectory /jobs/genie.egerrit/EGerrit/workspace/org.eclipse.egerrit.updatesite/src/main/resources
00:29:18 [INFO] 
00:29:18 [INFO] --- tycho-source-plugin:1.0.0:plugin-source (plugin-source) @ org.eclipse.egerrit.updatesite ---
00:29:18 [INFO] 
00:29:18 [INFO] --- target-platform-configuration:1.0.0:target-platform (default-target-platform) @ org.eclipse.egerrit.updatesite ---
00:29:18 [INFO] 
00:29:18 [INFO] --- tycho-p2-publisher-plugin:1.0.0:publish-products (default-publish-products) @ org.eclipse.egerrit.updatesite ---
00:29:18 [INFO] 
00:29:18 [INFO] --- tycho-p2-publisher-plugin:1.0.0:publish-categories (default-publish-categories) @ org.eclipse.egerrit.updatesite ---
00:29:18 [INFO] 
00:29:18 [INFO] --- tycho-p2-publisher-plugin:1.0.0:attach-artifacts (default-attach-artifacts) @ org.eclipse.egerrit.updatesite ---
00:29:18 [INFO] 
00:29:18 [INFO] --- tycho-p2-repository-plugin:1.0.0:assemble-repository (default-assemble-repository) @ org.eclipse.egerrit.updatesite ---
00:29:20 [INFO] 
00:29:20 [INFO] --- tycho-p2-repository-plugin:1.0.0:archive-repository (default-archive-repository) @ org.eclipse.egerrit.updatesite ---
00:29:20 [INFO] Building zip: /jobs/genie.egerrit/EGerrit/workspace/org.eclipse.egerrit.updatesite/target/org.eclipse.egerrit.updatesite-1.4.0-SNAPSHOT.zip
00:29:20 [INFO] 
00:29:20 [INFO] --- tycho-source-feature-plugin:1.0.0:source-feature (source-feature) @ org.eclipse.egerrit.updatesite ---
00:29:20 [INFO] 
00:29:20 [INFO] --- tycho-pack200a-plugin:1.0.0:normalize (pack200-normalize) @ org.eclipse.egerrit.updatesite ---
00:29:20 [INFO] 
00:29:20 [INFO] --- eclipse-jarsigner-plugin:1.1.4:sign (sign) @ org.eclipse.egerrit.updatesite ---
00:29:20 [INFO] 
00:29:20 [INFO] --- tycho-pack200b-plugin:1.0.0:pack (pack200-pack) @ org.eclipse.egerrit.updatesite ---
00:29:20 [INFO] 
00:29:20 [INFO] --- tycho-p2-plugin:1.0.0:p2-metadata (attach-p2-metadata) @ org.eclipse.egerrit.updatesite ---
00:29:20 [INFO] 
00:29:20 [INFO] --- maven-install-plugin:2.3.1:install (default-install) @ org.eclipse.egerrit.updatesite ---
00:29:20 [INFO] Installing /jobs/genie.egerrit/EGerrit/workspace/org.eclipse.egerrit.updatesite/target/org.eclipse.egerrit.updatesite-1.4.0-SNAPSHOT.zip to /home/hudson/genie.egerrit/.jenkins/jobs/EGerrit/workspace/.repository/org/eclipse/egerrit/org.eclipse.egerrit.updatesite/1.4.0-SNAPSHOT/org.eclipse.egerrit.updatesite-1.4.0-SNAPSHOT.zip
00:29:20 [INFO] Installing /jobs/genie.egerrit/EGerrit/workspace/org.eclipse.egerrit.updatesite/pom.xml to /home/hudson/genie.egerrit/.jenkins/jobs/EGerrit/workspace/.repository/org/eclipse/egerrit/org.eclipse.egerrit.updatesite/1.4.0-SNAPSHOT/org.eclipse.egerrit.updatesite-1.4.0-SNAPSHOT.pom
00:29:20 [INFO] Installing /jobs/genie.egerrit/EGerrit/workspace/org.eclipse.egerrit.updatesite/target/p2content.xml to /home/hudson/genie.egerrit/.jenkins/jobs/EGerrit/workspace/.repository/org/eclipse/egerrit/org.eclipse.egerrit.updatesite/1.4.0-SNAPSHOT/org.eclipse.egerrit.updatesite-1.4.0-SNAPSHOT-p2metadata.xml
00:29:20 [INFO] Installing /jobs/genie.egerrit/EGerrit/workspace/org.eclipse.egerrit.updatesite/target/p2artifacts.xml to /home/hudson/genie.egerrit/.jenkins/jobs/EGerrit/workspace/.repository/org/eclipse/egerrit/org.eclipse.egerrit.updatesite/1.4.0-SNAPSHOT/org.eclipse.egerrit.updatesite-1.4.0-SNAPSHOT-p2artifacts.xml
00:29:20 [INFO] 
00:29:20 [INFO] --- tycho-p2-plugin:1.0.0:update-local-index (default-update-local-index) @ org.eclipse.egerrit.updatesite ---
00:29:20 [INFO] 
00:29:20 [INFO] ------< org.eclipse.egerrit:org.eclipse.egerrit.updatesite.tests >------
00:29:20 [INFO] Building EGerrit Update site for tests 1.4.0-SNAPSHOT            [13/13]
00:29:20 [INFO] -------------------------[ eclipse-repository ]-------------------------
00:29:21 [INFO] 
00:29:21 [INFO] --- maven-clean-plugin:2.5:clean (default-clean) @ org.eclipse.egerrit.updatesite.tests ---
00:29:21 [INFO] 
00:29:21 [INFO] --- tycho-packaging-plugin:1.0.0:build-qualifier-aggregator (default-build-qualifier-aggregator) @ org.eclipse.egerrit.updatesite.tests ---
00:29:21 [INFO] The project's OSGi version is 1.4.0.962
00:29:21 [INFO] 
00:29:21 [INFO] --- maven-enforcer-plugin:1.4.1:enforce (enforce-maven) @ org.eclipse.egerrit.updatesite.tests ---
00:29:21 [INFO] 
00:29:21 [INFO] --- maven-clean-plugin:2.5:clean (default-clean-1) @ org.eclipse.egerrit.updatesite.tests ---
00:29:21 [INFO] 
00:29:21 [INFO] --- jacoco-maven-plugin:0.7.4.201502262128:prepare-agent (pre-test) @ org.eclipse.egerrit.updatesite.tests ---
00:29:21 [INFO] argLine set to -javaagent:/home/hudson/genie.egerrit/.jenkins/jobs/EGerrit/workspace/.repository/org/jacoco/org.jacoco.agent/0.7.4.201502262128/org.jacoco.agent-0.7.4.201502262128-runtime.jar=destfile=/jobs/genie.egerrit/EGerrit/workspace/org.eclipse.egerrit.updatesite.tests/../target/jacoco.exec,append=true,includes=org.eclipse.egerrit.*
00:29:21 [INFO] 
00:29:21 [INFO] --- maven-resources-plugin:2.4.3:resources (default-resources) @ org.eclipse.egerrit.updatesite.tests ---
00:29:21 [INFO] Using 'UTF-8' encoding to copy filtered resources.
00:29:21 [INFO] skip non existing resourceDirectory /jobs/genie.egerrit/EGerrit/workspace/org.eclipse.egerrit.updatesite.tests/src/main/resources
00:29:21 [INFO] 
00:29:21 [INFO] --- tycho-source-plugin:1.0.0:plugin-source (plugin-source) @ org.eclipse.egerrit.updatesite.tests ---
00:29:21 [INFO] 
00:29:21 [INFO] --- target-platform-configuration:1.0.0:target-platform (default-target-platform) @ org.eclipse.egerrit.updatesite.tests ---
00:29:21 [INFO] 
00:29:21 [INFO] --- tycho-p2-publisher-plugin:1.0.0:publish-products (default-publish-products) @ org.eclipse.egerrit.updatesite.tests ---
00:29:21 [INFO] 
00:29:21 [INFO] --- tycho-p2-publisher-plugin:1.0.0:publish-categories (default-publish-categories) @ org.eclipse.egerrit.updatesite.tests ---
00:29:21 [INFO] 
00:29:21 [INFO] --- tycho-p2-publisher-plugin:1.0.0:attach-artifacts (default-attach-artifacts) @ org.eclipse.egerrit.updatesite.tests ---
00:29:21 [INFO] 
00:29:21 [INFO] --- tycho-p2-repository-plugin:1.0.0:assemble-repository (default-assemble-repository) @ org.eclipse.egerrit.updatesite.tests ---
00:29:22 [INFO] 
00:29:23 [INFO] --- tycho-p2-repository-plugin:1.0.0:archive-repository (default-archive-repository) @ org.eclipse.egerrit.updatesite.tests ---
00:29:23 [INFO] Building zip: /jobs/genie.egerrit/EGerrit/workspace/org.eclipse.egerrit.updatesite.tests/target/org.eclipse.egerrit.updatesite.tests-1.4.0-SNAPSHOT.zip
00:29:23 [INFO] 
00:29:23 [INFO] --- tycho-source-feature-plugin:1.0.0:source-feature (source-feature) @ org.eclipse.egerrit.updatesite.tests ---
00:29:23 [INFO] 
00:29:23 [INFO] --- tycho-pack200a-plugin:1.0.0:normalize (pack200-normalize) @ org.eclipse.egerrit.updatesite.tests ---
00:29:23 [INFO] 
00:29:23 [INFO] --- eclipse-jarsigner-plugin:1.1.4:sign (sign) @ org.eclipse.egerrit.updatesite.tests ---
00:29:23 [INFO] 
00:29:23 [INFO] --- tycho-pack200b-plugin:1.0.0:pack (pack200-pack) @ org.eclipse.egerrit.updatesite.tests ---
00:29:23 [INFO] 
00:29:23 [INFO] --- tycho-p2-plugin:1.0.0:p2-metadata (attach-p2-metadata) @ org.eclipse.egerrit.updatesite.tests ---
00:29:23 [INFO] 
00:29:23 [INFO] --- maven-install-plugin:2.3.1:install (default-install) @ org.eclipse.egerrit.updatesite.tests ---
00:29:23 [INFO] Installing /jobs/genie.egerrit/EGerrit/workspace/org.eclipse.egerrit.updatesite.tests/target/org.eclipse.egerrit.updatesite.tests-1.4.0-SNAPSHOT.zip to /home/hudson/genie.egerrit/.jenkins/jobs/EGerrit/workspace/.repository/org/eclipse/egerrit/org.eclipse.egerrit.updatesite.tests/1.4.0-SNAPSHOT/org.eclipse.egerrit.updatesite.tests-1.4.0-SNAPSHOT.zip
00:29:23 [INFO] Installing /jobs/genie.egerrit/EGerrit/workspace/org.eclipse.egerrit.updatesite.tests/pom.xml to /home/hudson/genie.egerrit/.jenkins/jobs/EGerrit/workspace/.repository/org/eclipse/egerrit/org.eclipse.egerrit.updatesite.tests/1.4.0-SNAPSHOT/org.eclipse.egerrit.updatesite.tests-1.4.0-SNAPSHOT.pom
00:29:23 [INFO] Installing /jobs/genie.egerrit/EGerrit/workspace/org.eclipse.egerrit.updatesite.tests/target/p2content.xml to /home/hudson/genie.egerrit/.jenkins/jobs/EGerrit/workspace/.repository/org/eclipse/egerrit/org.eclipse.egerrit.updatesite.tests/1.4.0-SNAPSHOT/org.eclipse.egerrit.updatesite.tests-1.4.0-SNAPSHOT-p2metadata.xml
00:29:23 [INFO] Installing /jobs/genie.egerrit/EGerrit/workspace/org.eclipse.egerrit.updatesite.tests/target/p2artifacts.xml to /home/hudson/genie.egerrit/.jenkins/jobs/EGerrit/workspace/.repository/org/eclipse/egerrit/org.eclipse.egerrit.updatesite.tests/1.4.0-SNAPSHOT/org.eclipse.egerrit.updatesite.tests-1.4.0-SNAPSHOT-p2artifacts.xml
00:29:23 [INFO] 
00:29:23 [INFO] --- tycho-p2-plugin:1.0.0:update-local-index (default-update-local-index) @ org.eclipse.egerrit.updatesite.tests ---
00:29:23 [INFO] ------------------------------------------------------------------------
00:29:23 [INFO] Reactor Summary:
00:29:23 [INFO] 
00:29:23 [INFO] EGerrit Parent 1.4.0-SNAPSHOT ...................... SUCCESS [ 10.447 s]
00:29:23 [INFO] EGerrit Target Platform ............................ SUCCESS [  0.361 s]
00:29:23 [INFO] EGerrit Model Plug-in .............................. SUCCESS [  8.583 s]
00:29:23 [INFO] EGerrit Core Plug-in ............................... SUCCESS [  2.657 s]
00:29:23 [INFO] EGerrit Model Edit Plug-in ......................... SUCCESS [  2.461 s]
00:29:23 [INFO] EGerrit Core Tests Plug-in ......................... SUCCESS [  2.657 s]
00:29:23 [INFO] EGerrit UI Plug-in ................................. SUCCESS [  4.652 s]
00:29:23 [INFO] org.eclipse.egerrit.dashboard.core ................. SUCCESS [  1.811 s]
00:29:23 [INFO] org.eclipse.egerrit.dashboard.ui ................... SUCCESS [  2.709 s]
00:29:23 [INFO] EGerrit UI Tests Plug-in ........................... SUCCESS [  2.738 s]
00:29:23 [INFO] EGerrit Feature .................................... SUCCESS [  1.709 s]
00:29:23 [INFO] EGerrit Update site ................................ SUCCESS [  2.353 s]
00:29:23 [INFO] EGerrit Update site for tests 1.4.0-SNAPSHOT ....... SUCCESS [  1.430 s]
00:29:23 [INFO] ------------------------------------------------------------------------
00:29:23 [INFO] BUILD SUCCESS
00:29:23 [INFO] ------------------------------------------------------------------------
00:29:23 [INFO] Total time: 04:01 min
00:29:23 [INFO] Finished at: 2018-10-05T00:29:22-04:00
00:29:23 [INFO] ------------------------------------------------------------------------
00:29:25 [workspace] $ /shared/common/apache-maven-latest/bin/mvn -f org.eclipse.egerrit.ui.rcptt.tests/pom.xml -DEGerritUseDefinedProxy=true -DEGerritGerritTestServerPort=28115 -DforceContextQualifier=962 -DRCPTTWaitTime=3000 -DEGerritGerritTestServerHost=104.154.18.211 -Dmaven.repo.local=/home/hudson/genie.egerrit/.jenkins/jobs/EGerrit/workspace/.repository clean verify -s org.eclipse.egerrit.releng/settings.xml -Phudson
00:29:25 Picked up JAVA_TOOL_OPTIONS: -Xmx2G -Djava.io.tmpdir=/tmp/genie.egerrit
00:29:26 [INFO] Scanning for projects...
00:29:27 Downloading from rcptt-releases: https://repo.eclipse.org/content/repositories/rcptt-releases/org/eclipse/rcptt/rcptt-maven-plugin/2.1.0/rcptt-maven-plugin-2.1.0.pom
00:29:28 Progress (1): 1.4 kB
                    
Downloaded from rcptt-releases: https://repo.eclipse.org/content/repositories/rcptt-releases/org/eclipse/rcptt/rcptt-maven-plugin/2.1.0/rcptt-maven-plugin-2.1.0.pom (1.4 kB at 3.6 kB/s)
00:29:28 Downloading from rcptt-releases: https://repo.eclipse.org/content/repositories/rcptt-releases/org/eclipse/rcptt/rcptt-maven-modules/2.1.0/rcptt-maven-modules-2.1.0.pom
00:29:28 Progress (1): 1.5 kB
                    
Downloaded from rcptt-releases: https://repo.eclipse.org/content/repositories/rcptt-releases/org/eclipse/rcptt/rcptt-maven-modules/2.1.0/rcptt-maven-modules-2.1.0.pom (1.5 kB at 39 kB/s)
00:29:28 Downloading from rcptt-releases: https://repo.eclipse.org/content/repositories/rcptt-releases/org/eclipse/rcptt/rcptt-maven-util/2.1.0/rcptt-maven-util-2.1.0.pom
00:29:28 Progress (1): 1.1 kB
                    
Downloaded from rcptt-releases: https://repo.eclipse.org/content/repositories/rcptt-releases/org/eclipse/rcptt/rcptt-maven-util/2.1.0/rcptt-maven-util-2.1.0.pom (1.1 kB at 29 kB/s)
00:29:28 Downloading from rcptt-releases: https://repo.eclipse.org/content/repositories/rcptt-releases/org/codehaus/plexus/plexus-archiver/1.2/plexus-archiver-1.2.pom
00:29:28 Downloading from rcptt-snapshots: https://repo.eclipse.org/content/repositories/rcptt-snapshots/org/codehaus/plexus/plexus-archiver/1.2/plexus-archiver-1.2.pom
00:29:28 Downloading from eclipse-cbi-releases: https://repo.eclipse.org/content/groups/cbi/org/codehaus/plexus/plexus-archiver/1.2/plexus-archiver-1.2.pom
00:29:28 Downloading from eclipse-maven-central: https://repo.eclipse.org/content/repositories/maven_central/org/codehaus/plexus/plexus-archiver/1.2/plexus-archiver-1.2.pom
00:29:28 Progress (1): 2.0 kB
                    
Downloaded from eclipse-maven-central: https://repo.eclipse.org/content/repositories/maven_central/org/codehaus/plexus/plexus-archiver/1.2/plexus-archiver-1.2.pom (2.0 kB at 43 kB/s)
00:29:28 Downloading from rcptt-releases: https://repo.eclipse.org/content/repositories/rcptt-releases/org/codehaus/plexus/plexus-io/1.0.1/plexus-io-1.0.1.pom
00:29:28 Downloading from rcptt-snapshots: https://repo.eclipse.org/content/repositories/rcptt-snapshots/org/codehaus/plexus/plexus-io/1.0.1/plexus-io-1.0.1.pom
00:29:28 Downloading from eclipse-cbi-releases: https://repo.eclipse.org/content/groups/cbi/org/codehaus/plexus/plexus-io/1.0.1/plexus-io-1.0.1.pom
00:29:28 Downloading from eclipse-maven-central: https://repo.eclipse.org/content/repositories/maven_central/org/codehaus/plexus/plexus-io/1.0.1/plexus-io-1.0.1.pom
00:29:28 Progress (1): 1.2 kB
                    
Downloaded from eclipse-maven-central: https://repo.eclipse.org/content/repositories/maven_central/org/codehaus/plexus/plexus-io/1.0.1/plexus-io-1.0.1.pom (1.2 kB at 28 kB/s)
00:29:28 Downloading from rcptt-releases: https://repo.eclipse.org/content/repositories/rcptt-releases/org/apache/maven/maven-core/3.2.1/maven-core-3.2.1.pom
00:29:28 Downloading from rcptt-snapshots: https://repo.eclipse.org/content/repositories/rcptt-snapshots/org/apache/maven/maven-core/3.2.1/maven-core-3.2.1.pom
00:29:28 Downloading from eclipse-cbi-releases: https://repo.eclipse.org/content/groups/cbi/org/apache/maven/maven-core/3.2.1/maven-core-3.2.1.pom
00:29:28 Downloading from eclipse-maven-central: https://repo.eclipse.org/content/repositories/maven_central/org/apache/maven/maven-core/3.2.1/maven-core-3.2.1.pom
00:29:28 Progress (1): 4.1/7.6 kB
Progress (1): 7.6 kB    
                    
Downloaded from eclipse-maven-central: https://repo.eclipse.org/content/repositories/maven_central/org/apache/maven/maven-core/3.2.1/maven-core-3.2.1.pom (7.6 kB at 218 kB/s)
00:29:28 Downloading from rcptt-releases: https://repo.eclipse.org/content/repositories/rcptt-releases/org/apache/maven/maven/3.2.1/maven-3.2.1.pom
00:29:28 Downloading from rcptt-snapshots: https://repo.eclipse.org/content/repositories/rcptt-snapshots/org/apache/maven/maven/3.2.1/maven-3.2.1.pom
00:29:28 Downloading from eclipse-cbi-releases: https://repo.eclipse.org/content/groups/cbi/org/apache/maven/maven/3.2.1/maven-3.2.1.pom
00:29:28 Downloading from eclipse-maven-central: https://repo.eclipse.org/content/repositories/maven_central/org/apache/maven/maven/3.2.1/maven-3.2.1.pom
00:29:28 Progress (1): 4.1/23 kB
Progress (1): 7.7/23 kB
Progress (1): 12/23 kB 
Progress (1): 16/23 kB
Progress (1): 20/23 kB
Progress (1): 23 kB   
                   
Downloaded from eclipse-maven-central: https://repo.eclipse.org/content/repositories/maven_central/org/apache/maven/maven/3.2.1/maven-3.2.1.pom (23 kB at 491 kB/s)
00:29:28 Downloading from rcptt-releases: https://repo.eclipse.org/content/repositories/rcptt-releases/org/apache/maven/maven-model/3.2.1/maven-model-3.2.1.pom
00:29:28 Downloading from rcptt-snapshots: https://repo.eclipse.org/content/repositories/rcptt-snapshots/org/apache/maven/maven-model/3.2.1/maven-model-3.2.1.pom
00:29:28 Downloading from eclipse-cbi-releases: https://repo.eclipse.org/content/groups/cbi/org/apache/maven/maven-model/3.2.1/maven-model-3.2.1.pom
00:29:28 Downloading from eclipse-maven-central: https://repo.eclipse.org/content/repositories/maven_central/org/apache/maven/maven-model/3.2.1/maven-model-3.2.1.pom
00:29:28 Progress (1): 4.1/4.1 kB
Progress (1): 4.1 kB    
                    
Downloaded from eclipse-maven-central: https://repo.eclipse.org/content/repositories/maven_central/org/apache/maven/maven-model/3.2.1/maven-model-3.2.1.pom (4.1 kB at 94 kB/s)
00:29:29 Downloading from rcptt-releases: https://repo.eclipse.org/content/repositories/rcptt-releases/org/codehaus/plexus/plexus-utils/3.0.17/plexus-utils-3.0.17.pom
00:29:29 Downloading from rcptt-snapshots: https://repo.eclipse.org/content/repositories/rcptt-snapshots/org/codehaus/plexus/plexus-utils/3.0.17/plexus-utils-3.0.17.pom
00:29:29 Downloading from eclipse-cbi-releases: https://repo.eclipse.org/content/groups/cbi/org/codehaus/plexus/plexus-utils/3.0.17/plexus-utils-3.0.17.pom
00:29:29 Downloading from eclipse-maven-central: https://repo.eclipse.org/content/repositories/maven_central/org/codehaus/plexus/plexus-utils/3.0.17/plexus-utils-3.0.17.pom
00:29:29 Progress (1): 3.4 kB
                    
Downloaded from eclipse-maven-central: https://repo.eclipse.org/content/repositories/maven_central/org/codehaus/plexus/plexus-utils/3.0.17/plexus-utils-3.0.17.pom (3.4 kB at 97 kB/s)
00:29:29 Downloading from rcptt-releases: https://repo.eclipse.org/content/repositories/rcptt-releases/org/apache/maven/maven-settings/3.2.1/maven-settings-3.2.1.pom
00:29:29 Downloading from rcptt-snapshots: https://repo.eclipse.org/content/repositories/rcptt-snapshots/org/apache/maven/maven-settings/3.2.1/maven-settings-3.2.1.pom
00:29:29 Downloading from eclipse-cbi-releases: https://repo.eclipse.org/content/groups/cbi/org/apache/maven/maven-settings/3.2.1/maven-settings-3.2.1.pom
00:29:29 Downloading from eclipse-maven-central: https://repo.eclipse.org/content/repositories/maven_central/org/apache/maven/maven-settings/3.2.1/maven-settings-3.2.1.pom
00:29:29 Progress (1): 2.2 kB
                    
Downloaded from eclipse-maven-central: https://repo.eclipse.org/content/repositories/maven_central/org/apache/maven/maven-settings/3.2.1/maven-settings-3.2.1.pom (2.2 kB at 68 kB/s)
00:29:29 Downloading from rcptt-releases: https://repo.eclipse.org/content/repositories/rcptt-releases/org/apache/maven/maven-settings-builder/3.2.1/maven-settings-builder-3.2.1.pom
00:29:29 Downloading from rcptt-snapshots: https://repo.eclipse.org/content/repositories/rcptt-snapshots/org/apache/maven/maven-settings-builder/3.2.1/maven-settings-builder-3.2.1.pom
00:29:29 Downloading from eclipse-cbi-releases: https://repo.eclipse.org/content/groups/cbi/org/apache/maven/maven-settings-builder/3.2.1/maven-settings-builder-3.2.1.pom
00:29:29 Downloading from eclipse-maven-central: https://repo.eclipse.org/content/repositories/maven_central/org/apache/maven/maven-settings-builder/3.2.1/maven-settings-builder-3.2.1.pom
00:29:29 Progress (1): 2.6 kB
                    
Downloaded from eclipse-maven-central: https://repo.eclipse.org/content/repositories/maven_central/org/apache/maven/maven-settings-builder/3.2.1/maven-settings-builder-3.2.1.pom (2.6 kB at 81 kB/s)
00:29:29 Downloading from rcptt-releases: https://repo.eclipse.org/content/repositories/rcptt-releases/org/codehaus/plexus/plexus-interpolation/1.19/plexus-interpolation-1.19.pom
00:29:29 Downloading from rcptt-snapshots: https://repo.eclipse.org/content/repositories/rcptt-snapshots/org/codehaus/plexus/plexus-interpolation/1.19/plexus-interpolation-1.19.pom
00:29:29 Downloading from eclipse-cbi-releases: https://repo.eclipse.org/content/groups/cbi/org/codehaus/plexus/plexus-interpolation/1.19/plexus-interpolation-1.19.pom
00:29:29 Downloading from eclipse-maven-central: https://repo.eclipse.org/content/repositories/maven_central/org/codehaus/plexus/plexus-interpolation/1.19/plexus-interpolation-1.19.pom
00:29:29 Progress (1): 1.0 kB
                    
Downloaded from eclipse-maven-central: https://repo.eclipse.org/content/repositories/maven_central/org/codehaus/plexus/plexus-interpolation/1.19/plexus-interpolation-1.19.pom (1.0 kB at 27 kB/s)
00:29:29 Downloading from rcptt-releases: https://repo.eclipse.org/content/repositories/rcptt-releases/org/apache/maven/maven-repository-metadata/3.2.1/maven-repository-metadata-3.2.1.pom
00:29:29 Downloading from rcptt-snapshots: https://repo.eclipse.org/content/repositories/rcptt-snapshots/org/apache/maven/maven-repository-metadata/3.2.1/maven-repository-metadata-3.2.1.pom
00:29:29 Downloading from eclipse-cbi-releases: https://repo.eclipse.org/content/groups/cbi/org/apache/maven/maven-repository-metadata/3.2.1/maven-repository-metadata-3.2.1.pom
00:29:29 Downloading from eclipse-maven-central: https://repo.eclipse.org/content/repositories/maven_central/org/apache/maven/maven-repository-metadata/3.2.1/maven-repository-metadata-3.2.1.pom
00:29:29 Progress (1): 2.2 kB
                    
Downloaded from eclipse-maven-central: https://repo.eclipse.org/content/repositories/maven_central/org/apache/maven/maven-repository-metadata/3.2.1/maven-repository-metadata-3.2.1.pom (2.2 kB at 56 kB/s)
00:29:29 Downloading from rcptt-releases: https://repo.eclipse.org/content/repositories/rcptt-releases/org/apache/maven/maven-artifact/3.2.1/maven-artifact-3.2.1.pom
00:29:29 Downloading from rcptt-snapshots: https://repo.eclipse.org/content/repositories/rcptt-snapshots/org/apache/maven/maven-artifact/3.2.1/maven-artifact-3.2.1.pom
00:29:29 Downloading from eclipse-cbi-releases: https://repo.eclipse.org/content/groups/cbi/org/apache/maven/maven-artifact/3.2.1/maven-artifact-3.2.1.pom
00:29:29 Downloading from eclipse-maven-central: https://repo.eclipse.org/content/repositories/maven_central/org/apache/maven/maven-artifact/3.2.1/maven-artifact-3.2.1.pom
00:29:29 Progress (1): 2.0 kB
                    
Downloaded from eclipse-maven-central: https://repo.eclipse.org/content/repositories/maven_central/org/apache/maven/maven-artifact/3.2.1/maven-artifact-3.2.1.pom (2.0 kB at 49 kB/s)
00:29:29 Downloading from rcptt-releases: https://repo.eclipse.org/content/repositories/rcptt-releases/org/apache/maven/maven-plugin-api/3.2.1/maven-plugin-api-3.2.1.pom
00:29:29 Downloading from rcptt-snapshots: https://repo.eclipse.org/content/repositories/rcptt-snapshots/org/apache/maven/maven-plugin-api/3.2.1/maven-plugin-api-3.2.1.pom
00:29:29 Downloading from eclipse-cbi-releases: https://repo.eclipse.org/content/groups/cbi/org/apache/maven/maven-plugin-api/3.2.1/maven-plugin-api-3.2.1.pom
00:29:29 Downloading from eclipse-maven-central: https://repo.eclipse.org/content/repositories/maven_central/org/apache/maven/maven-plugin-api/3.2.1/maven-plugin-api-3.2.1.pom
00:29:29 Progress (1): 3.4 kB
                    
Downloaded from eclipse-maven-central: https://repo.eclipse.org/content/repositories/maven_central/org/apache/maven/maven-plugin-api/3.2.1/maven-plugin-api-3.2.1.pom (3.4 kB at 75 kB/s)
00:29:29 Downloading from rcptt-releases: https://repo.eclipse.org/content/repositories/rcptt-releases/org/eclipse/sisu/org.eclipse.sisu.plexus/0.0.0.M5/org.eclipse.sisu.plexus-0.0.0.M5.pom
00:29:29 Downloading from rcptt-snapshots: https://repo.eclipse.org/content/repositories/rcptt-snapshots/org/eclipse/sisu/org.eclipse.sisu.plexus/0.0.0.M5/org.eclipse.sisu.plexus-0.0.0.M5.pom
00:29:29 Downloading from eclipse-cbi-releases: https://repo.eclipse.org/content/groups/cbi/org/eclipse/sisu/org.eclipse.sisu.plexus/0.0.0.M5/org.eclipse.sisu.plexus-0.0.0.M5.pom
00:29:29 Downloading from eclipse-maven-central: https://repo.eclipse.org/content/repositories/maven_central/org/eclipse/sisu/org.eclipse.sisu.plexus/0.0.0.M5/org.eclipse.sisu.plexus-0.0.0.M5.pom
00:29:29 Progress (1): 4.1/4.8 kB
Progress (1): 4.8 kB    
                    
Downloaded from eclipse-maven-central: https://repo.eclipse.org/content/repositories/maven_central/org/eclipse/sisu/org.eclipse.sisu.plexus/0.0.0.M5/org.eclipse.sisu.plexus-0.0.0.M5.pom (4.8 kB at 127 kB/s)
00:29:29 Downloading from rcptt-releases: https://repo.eclipse.org/content/repositories/rcptt-releases/org/eclipse/sisu/sisu-plexus/0.0.0.M5/sisu-plexus-0.0.0.M5.pom
00:29:29 Downloading from rcptt-snapshots: https://repo.eclipse.org/content/repositories/rcptt-snapshots/org/eclipse/sisu/sisu-plexus/0.0.0.M5/sisu-plexus-0.0.0.M5.pom
00:29:29 Downloading from eclipse-cbi-releases: https://repo.eclipse.org/content/groups/cbi/org/eclipse/sisu/sisu-plexus/0.0.0.M5/sisu-plexus-0.0.0.M5.pom
00:29:29 Downloading from eclipse-maven-central: https://repo.eclipse.org/content/repositories/maven_central/org/eclipse/sisu/sisu-plexus/0.0.0.M5/sisu-plexus-0.0.0.M5.pom
00:29:29 Progress (1): 4.1/13 kB
Progress (1): 7.7/13 kB
Progress (1): 12/13 kB 
Progress (1): 13 kB   
                   
Downloaded from eclipse-maven-central: https://repo.eclipse.org/content/repositories/maven_central/org/eclipse/sisu/sisu-plexus/0.0.0.M5/sisu-plexus-0.0.0.M5.pom (13 kB at 388 kB/s)
00:29:29 Downloading from rcptt-releases: https://repo.eclipse.org/content/repositories/rcptt-releases/com/google/guava/guava/10.0.1/guava-10.0.1.pom
00:29:29 Downloading from rcptt-snapshots: https://repo.eclipse.org/content/repositories/rcptt-snapshots/com/google/guava/guava/10.0.1/guava-10.0.1.pom
00:29:29 Downloading from eclipse-cbi-releases: https://repo.eclipse.org/content/groups/cbi/com/google/guava/guava/10.0.1/guava-10.0.1.pom
00:29:29 Downloading from eclipse-maven-central: https://repo.eclipse.org/content/repositories/maven_central/com/google/guava/guava/10.0.1/guava-10.0.1.pom
00:29:30 Progress (1): 4.1/5.4 kB
Progress (1): 5.4 kB    
                    
Downloaded from eclipse-maven-central: https://repo.eclipse.org/content/repositories/maven_central/com/google/guava/guava/10.0.1/guava-10.0.1.pom (5.4 kB at 158 kB/s)
00:29:30 Downloading from rcptt-releases: https://repo.eclipse.org/content/repositories/rcptt-releases/com/google/guava/guava-parent/10.0.1/guava-parent-10.0.1.pom
00:29:30 Downloading from rcptt-snapshots: https://repo.eclipse.org/content/repositories/rcptt-snapshots/com/google/guava/guava-parent/10.0.1/guava-parent-10.0.1.pom
00:29:30 Downloading from eclipse-cbi-releases: https://repo.eclipse.org/content/groups/cbi/com/google/guava/guava-parent/10.0.1/guava-parent-10.0.1.pom
00:29:30 Downloading from eclipse-maven-central: https://repo.eclipse.org/content/repositories/maven_central/com/google/guava/guava-parent/10.0.1/guava-parent-10.0.1.pom
00:29:30 Progress (1): 2.0 kB
                    
Downloaded from eclipse-maven-central: https://repo.eclipse.org/content/repositories/maven_central/com/google/guava/guava-parent/10.0.1/guava-parent-10.0.1.pom (2.0 kB at 52 kB/s)
00:29:30 Downloading from rcptt-releases: https://repo.eclipse.org/content/repositories/rcptt-releases/com/google/code/findbugs/jsr305/1.3.9/jsr305-1.3.9.pom
00:29:30 Downloading from rcptt-snapshots: https://repo.eclipse.org/content/repositories/rcptt-snapshots/com/google/code/findbugs/jsr305/1.3.9/jsr305-1.3.9.pom
00:29:30 Downloading from eclipse-cbi-releases: https://repo.eclipse.org/content/groups/cbi/com/google/code/findbugs/jsr305/1.3.9/jsr305-1.3.9.pom
00:29:30 Downloading from eclipse-maven-central: https://repo.eclipse.org/content/repositories/maven_central/com/google/code/findbugs/jsr305/1.3.9/jsr305-1.3.9.pom
00:29:30 Progress (1): 965 B
                   
Downloaded from eclipse-maven-central: https://repo.eclipse.org/content/repositories/maven_central/com/google/code/findbugs/jsr305/1.3.9/jsr305-1.3.9.pom (965 B at 28 kB/s)
00:29:30 Downloading from rcptt-releases: https://repo.eclipse.org/content/repositories/rcptt-releases/org/eclipse/sisu/org.eclipse.sisu.inject/0.0.0.M5/org.eclipse.sisu.inject-0.0.0.M5.pom
00:29:30 Downloading from rcptt-snapshots: https://repo.eclipse.org/content/repositories/rcptt-snapshots/org/eclipse/sisu/org.eclipse.sisu.inject/0.0.0.M5/org.eclipse.sisu.inject-0.0.0.M5.pom
00:29:30 Downloading from eclipse-cbi-releases: https://repo.eclipse.org/content/groups/cbi/org/eclipse/sisu/org.eclipse.sisu.inject/0.0.0.M5/org.eclipse.sisu.inject-0.0.0.M5.pom
00:29:30 Downloading from eclipse-maven-central: https://repo.eclipse.org/content/repositories/maven_central/org/eclipse/sisu/org.eclipse.sisu.inject/0.0.0.M5/org.eclipse.sisu.inject-0.0.0.M5.pom
00:29:30 Progress (1): 2.5 kB
                    
Downloaded from eclipse-maven-central: https://repo.eclipse.org/content/repositories/maven_central/org/eclipse/sisu/org.eclipse.sisu.inject/0.0.0.M5/org.eclipse.sisu.inject-0.0.0.M5.pom (2.5 kB at 60 kB/s)
00:29:30 Downloading from rcptt-releases: https://repo.eclipse.org/content/repositories/rcptt-releases/org/eclipse/sisu/sisu-inject/0.0.0.M5/sisu-inject-0.0.0.M5.pom
00:29:30 Downloading from rcptt-snapshots: https://repo.eclipse.org/content/repositories/rcptt-snapshots/org/eclipse/sisu/sisu-inject/0.0.0.M5/sisu-inject-0.0.0.M5.pom
00:29:30 Downloading from eclipse-cbi-releases: https://repo.eclipse.org/content/groups/cbi/org/eclipse/sisu/sisu-inject/0.0.0.M5/sisu-inject-0.0.0.M5.pom
00:29:30 Downloading from eclipse-maven-central: https://repo.eclipse.org/content/repositories/maven_central/org/eclipse/sisu/sisu-inject/0.0.0.M5/sisu-inject-0.0.0.M5.pom
00:29:30 Progress (1): 4.1/14 kB
Progress (1): 7.7/14 kB
Progress (1): 12/14 kB 
Progress (1): 14 kB   
                   
Downloaded from eclipse-maven-central: https://repo.eclipse.org/content/repositories/maven_central/org/eclipse/sisu/sisu-inject/0.0.0.M5/sisu-inject-0.0.0.M5.pom (14 kB at 400 kB/s)
00:29:30 Downloading from rcptt-releases: https://repo.eclipse.org/content/repositories/rcptt-releases/org/apache/maven/maven-model-builder/3.2.1/maven-model-builder-3.2.1.pom
00:29:30 Downloading from rcptt-snapshots: https://repo.eclipse.org/content/repositories/rcptt-snapshots/org/apache/maven/maven-model-builder/3.2.1/maven-model-builder-3.2.1.pom
00:29:30 Downloading from eclipse-cbi-releases: https://repo.eclipse.org/content/groups/cbi/org/apache/maven/maven-model-builder/3.2.1/maven-model-builder-3.2.1.pom
00:29:30 Downloading from eclipse-maven-central: https://repo.eclipse.org/content/repositories/maven_central/org/apache/maven/maven-model-builder/3.2.1/maven-model-builder-3.2.1.pom
00:29:30 Progress (1): 2.8 kB
                    
Downloaded from eclipse-maven-central: https://repo.eclipse.org/content/repositories/maven_central/org/apache/maven/maven-model-builder/3.2.1/maven-model-builder-3.2.1.pom (2.8 kB at 65 kB/s)
00:29:30 Downloading from rcptt-releases: https://repo.eclipse.org/content/repositories/rcptt-releases/org/apache/maven/maven-aether-provider/3.2.1/maven-aether-provider-3.2.1.pom
00:29:30 Downloading from rcptt-snapshots: https://repo.eclipse.org/content/repositories/rcptt-snapshots/org/apache/maven/maven-aether-provider/3.2.1/maven-aether-provider-3.2.1.pom
00:29:30 Downloading from eclipse-cbi-releases: https://repo.eclipse.org/content/groups/cbi/org/apache/maven/maven-aether-provider/3.2.1/maven-aether-provider-3.2.1.pom
00:29:30 Downloading from eclipse-maven-central: https://repo.eclipse.org/content/repositories/maven_central/org/apache/maven/maven-aether-provider/3.2.1/maven-aether-provider-3.2.1.pom
00:29:30 Progress (1): 4.1 kB
                    
Downloaded from eclipse-maven-central: https://repo.eclipse.org/content/repositories/maven_central/org/apache/maven/maven-aether-provider/3.2.1/maven-aether-provider-3.2.1.pom (4.1 kB at 87 kB/s)
00:29:30 Downloading from rcptt-releases: https://repo.eclipse.org/content/repositories/rcptt-releases/org/codehaus/plexus/plexus-classworlds/2.5.1/plexus-classworlds-2.5.1.pom
00:29:30 Downloading from rcptt-snapshots: https://repo.eclipse.org/content/repositories/rcptt-snapshots/org/codehaus/plexus/plexus-classworlds/2.5.1/plexus-classworlds-2.5.1.pom
00:29:30 Downloading from eclipse-cbi-releases: https://repo.eclipse.org/content/groups/cbi/org/codehaus/plexus/plexus-classworlds/2.5.1/plexus-classworlds-2.5.1.pom
00:29:30 Downloading from eclipse-maven-central: https://repo.eclipse.org/content/repositories/maven_central/org/codehaus/plexus/plexus-classworlds/2.5.1/plexus-classworlds-2.5.1.pom
00:29:30 Progress (1): 4.1/5.0 kB
Progress (1): 5.0 kB    
                    
Downloaded from eclipse-maven-central: https://repo.eclipse.org/content/repositories/maven_central/org/codehaus/plexus/plexus-classworlds/2.5.1/plexus-classworlds-2.5.1.pom (5.0 kB at 157 kB/s)
00:29:30 Downloading from rcptt-releases: https://repo.eclipse.org/content/repositories/rcptt-releases/org/eclipse/rcptt/rcptt-maven-plugin/2.1.0/rcptt-maven-plugin-2.1.0.jar
00:29:30 Downloading from rcptt-releases: https://repo.eclipse.org/content/repositories/rcptt-releases/org/eclipse/rcptt/rcptt-maven-util/2.1.0/rcptt-maven-util-2.1.0.jar
00:29:30 Downloading from rcptt-releases: https://repo.eclipse.org/content/repositories/rcptt-releases/org/codehaus/plexus/plexus-io/1.0.1/plexus-io-1.0.1.jar
00:29:30 Downloading from rcptt-releases: https://repo.eclipse.org/content/repositories/rcptt-releases/org/codehaus/plexus/plexus-archiver/1.2/plexus-archiver-1.2.jar
00:29:30 Downloading from rcptt-releases: https://repo.eclipse.org/content/repositories/rcptt-releases/org/apache/maven/maven-core/3.2.1/maven-core-3.2.1.jar
00:29:30 Downloading from rcptt-releases: https://repo.eclipse.org/content/repositories/rcptt-releases/org/apache/maven/maven-model/3.2.1/maven-model-3.2.1.jar
00:29:30 Downloading from rcptt-releases: https://repo.eclipse.org/content/repositories/rcptt-releases/org/apache/maven/maven-settings/3.2.1/maven-settings-3.2.1.jar
00:29:30 Downloading from rcptt-releases: https://repo.eclipse.org/content/repositories/rcptt-releases/org/apache/maven/maven-settings-builder/3.2.1/maven-settings-builder-3.2.1.jar
00:29:30 Progress (1): 4.1/32 kB
Progress (1): 7.7/32 kB
Progress (1): 12/32 kB 
Progress (1): 16/32 kB
Progress (1): 20/32 kB
Progress (1): 24/32 kB
Progress (1): 28/32 kB
Progress (1): 32 kB   
                   
Downloading from rcptt-releases: https://repo.eclipse.org/content/repositories/rcptt-releases/org/apache/maven/maven-repository-metadata/3.2.1/maven-repository-metadata-3.2.1.jar
00:29:30 Downloading from rcptt-releases: https://repo.eclipse.org/content/repositories/rcptt-releases/org/apache/maven/maven-artifact/3.2.1/maven-artifact-3.2.1.jar
00:29:30 Progress (2): 32 kB | 4.1/20 kB
Progress (2): 32 kB | 7.7/20 kB
Progress (2): 32 kB | 12/20 kB 
Progress (2): 32 kB | 16/20 kB
Progress (2): 32 kB | 20 kB   
                           
Downloading from rcptt-releases: https://repo.eclipse.org/content/repositories/rcptt-releases/org/apache/maven/maven-plugin-api/3.2.1/maven-plugin-api-3.2.1.jar
00:29:30 Downloaded from rcptt-releases: https://repo.eclipse.org/content/repositories/rcptt-releases/org/eclipse/rcptt/rcptt-maven-plugin/2.1.0/rcptt-maven-plugin-2.1.0.jar (32 kB at 471 kB/s)
00:29:30 Downloading from rcptt-releases: https://repo.eclipse.org/content/repositories/rcptt-releases/org/apache/maven/maven-model-builder/3.2.1/maven-model-builder-3.2.1.jar
00:29:30 Downloading from rcptt-releases: https://repo.eclipse.org/content/repositories/rcptt-releases/org/apache/maven/maven-aether-provider/3.2.1/maven-aether-provider-3.2.1.jar
00:29:30 Downloading from rcptt-releases: https://repo.eclipse.org/content/repositories/rcptt-releases/org/eclipse/sisu/org.eclipse.sisu.plexus/0.0.0.M5/org.eclipse.sisu.plexus-0.0.0.M5.jar
00:29:30 Downloading from rcptt-releases: https://repo.eclipse.org/content/repositories/rcptt-releases/com/google/guava/guava/10.0.1/guava-10.0.1.jar
00:29:30 Downloading from rcptt-releases: https://repo.eclipse.org/content/repositories/rcptt-releases/com/google/code/findbugs/jsr305/1.3.9/jsr305-1.3.9.jar
00:29:30 Downloading from rcptt-releases: https://repo.eclipse.org/content/repositories/rcptt-releases/org/eclipse/sisu/org.eclipse.sisu.inject/0.0.0.M5/org.eclipse.sisu.inject-0.0.0.M5.jar
00:29:30 Downloading from rcptt-releases: https://repo.eclipse.org/content/repositories/rcptt-releases/org/codehaus/plexus/plexus-interpolation/1.19/plexus-interpolation-1.19.jar
00:29:30 Downloaded from rcptt-releases: https://repo.eclipse.org/content/repositories/rcptt-releases/org/eclipse/rcptt/rcptt-maven-util/2.1.0/rcptt-maven-util-2.1.0.jar (20 kB at 211 kB/s)
00:29:30 Downloading from rcptt-releases: https://repo.eclipse.org/content/repositories/rcptt-releases/org/codehaus/plexus/plexus-classworlds/2.5.1/plexus-classworlds-2.5.1.jar
00:29:30 Downloading from rcptt-snapshots: https://repo.eclipse.org/content/repositories/rcptt-snapshots/org/codehaus/plexus/plexus-archiver/1.2/plexus-archiver-1.2.jar
00:29:30 Downloading from rcptt-snapshots: https://repo.eclipse.org/content/repositories/rcptt-snapshots/org/codehaus/plexus/plexus-io/1.0.1/plexus-io-1.0.1.jar
00:29:30 Downloading from rcptt-snapshots: https://repo.eclipse.org/content/repositories/rcptt-snapshots/org/apache/maven/maven-settings/3.2.1/maven-settings-3.2.1.jar
00:29:30 Downloading from rcptt-snapshots: https://repo.eclipse.org/content/repositories/rcptt-snapshots/org/apache/maven/maven-model/3.2.1/maven-model-3.2.1.jar
00:29:30 Downloading from rcptt-snapshots: https://repo.eclipse.org/content/repositories/rcptt-snapshots/org/apache/maven/maven-core/3.2.1/maven-core-3.2.1.jar
00:29:30 Downloading from rcptt-snapshots: https://repo.eclipse.org/content/repositories/rcptt-snapshots/org/apache/maven/maven-settings-builder/3.2.1/maven-settings-builder-3.2.1.jar
00:29:30 Downloading from rcptt-snapshots: https://repo.eclipse.org/content/repositories/rcptt-snapshots/org/apache/maven/maven-repository-metadata/3.2.1/maven-repository-metadata-3.2.1.jar
00:29:30 Downloading from rcptt-snapshots: https://repo.eclipse.org/content/repositories/rcptt-snapshots/org/apache/maven/maven-artifact/3.2.1/maven-artifact-3.2.1.jar
00:29:30 Downloading from rcptt-snapshots: https://repo.eclipse.org/content/repositories/rcptt-snapshots/org/apache/maven/maven-plugin-api/3.2.1/maven-plugin-api-3.2.1.jar
00:29:30 Downloading from rcptt-snapshots: https://repo.eclipse.org/content/repositories/rcptt-snapshots/org/apache/maven/maven-model-builder/3.2.1/maven-model-builder-3.2.1.jar
00:29:30 Downloading from rcptt-snapshots: https://repo.eclipse.org/content/repositories/rcptt-snapshots/org/apache/maven/maven-aether-provider/3.2.1/maven-aether-provider-3.2.1.jar
00:29:30 Downloading from rcptt-snapshots: https://repo.eclipse.org/content/repositories/rcptt-snapshots/org/eclipse/sisu/org.eclipse.sisu.plexus/0.0.0.M5/org.eclipse.sisu.plexus-0.0.0.M5.jar
00:29:30 Downloading from rcptt-snapshots: https://repo.eclipse.org/content/repositories/rcptt-snapshots/com/google/guava/guava/10.0.1/guava-10.0.1.jar
00:29:30 Downloading from rcptt-snapshots: https://repo.eclipse.org/content/repositories/rcptt-snapshots/com/google/code/findbugs/jsr305/1.3.9/jsr305-1.3.9.jar
00:29:30 Downloading from rcptt-snapshots: https://repo.eclipse.org/content/repositories/rcptt-snapshots/org/eclipse/sisu/org.eclipse.sisu.inject/0.0.0.M5/org.eclipse.sisu.inject-0.0.0.M5.jar
00:29:30 Downloading from rcptt-snapshots: https://repo.eclipse.org/content/repositories/rcptt-snapshots/org/codehaus/plexus/plexus-interpolation/1.19/plexus-interpolation-1.19.jar
00:29:30 Downloading from rcptt-snapshots: https://repo.eclipse.org/content/repositories/rcptt-snapshots/org/codehaus/plexus/plexus-classworlds/2.5.1/plexus-classworlds-2.5.1.jar
00:29:30 Downloading from eclipse-cbi-releases: https://repo.eclipse.org/content/groups/cbi/org/codehaus/plexus/plexus-archiver/1.2/plexus-archiver-1.2.jar
00:29:30 Downloading from eclipse-cbi-releases: https://repo.eclipse.org/content/groups/cbi/org/apache/maven/maven-core/3.2.1/maven-core-3.2.1.jar
00:29:30 Downloading from eclipse-cbi-releases: https://repo.eclipse.org/content/groups/cbi/org/apache/maven/maven-settings/3.2.1/maven-settings-3.2.1.jar
00:29:30 Downloading from eclipse-cbi-releases: https://repo.eclipse.org/content/groups/cbi/org/apache/maven/maven-model/3.2.1/maven-model-3.2.1.jar
00:29:30 Downloading from eclipse-cbi-releases: https://repo.eclipse.org/content/groups/cbi/org/codehaus/plexus/plexus-io/1.0.1/plexus-io-1.0.1.jar
00:29:31 Downloading from eclipse-cbi-releases: https://repo.eclipse.org/content/groups/cbi/org/apache/maven/maven-settings-builder/3.2.1/maven-settings-builder-3.2.1.jar
00:29:31 Downloading from eclipse-cbi-releases: https://repo.eclipse.org/content/groups/cbi/org/apache/maven/maven-repository-metadata/3.2.1/maven-repository-metadata-3.2.1.jar
00:29:31 Downloading from eclipse-cbi-releases: https://repo.eclipse.org/content/groups/cbi/org/apache/maven/maven-artifact/3.2.1/maven-artifact-3.2.1.jar
00:29:31 Downloading from eclipse-cbi-releases: https://repo.eclipse.org/content/groups/cbi/org/apache/maven/maven-plugin-api/3.2.1/maven-plugin-api-3.2.1.jar
00:29:31 Downloading from eclipse-cbi-releases: https://repo.eclipse.org/content/groups/cbi/org/apache/maven/maven-model-builder/3.2.1/maven-model-builder-3.2.1.jar
00:29:31 Downloading from eclipse-cbi-releases: https://repo.eclipse.org/content/groups/cbi/org/apache/maven/maven-aether-provider/3.2.1/maven-aether-provider-3.2.1.jar
00:29:31 Downloading from eclipse-cbi-releases: https://repo.eclipse.org/content/groups/cbi/org/eclipse/sisu/org.eclipse.sisu.plexus/0.0.0.M5/org.eclipse.sisu.plexus-0.0.0.M5.jar
00:29:31 Downloading from eclipse-cbi-releases: https://repo.eclipse.org/content/groups/cbi/com/google/guava/guava/10.0.1/guava-10.0.1.jar
00:29:31 Downloading from eclipse-cbi-releases: https://repo.eclipse.org/content/groups/cbi/com/google/code/findbugs/jsr305/1.3.9/jsr305-1.3.9.jar
00:29:31 Downloading from eclipse-cbi-releases: https://repo.eclipse.org/content/groups/cbi/org/eclipse/sisu/org.eclipse.sisu.inject/0.0.0.M5/org.eclipse.sisu.inject-0.0.0.M5.jar
00:29:31 Downloading from eclipse-cbi-releases: https://repo.eclipse.org/content/groups/cbi/org/codehaus/plexus/plexus-interpolation/1.19/plexus-interpolation-1.19.jar
00:29:31 Downloading from eclipse-cbi-releases: https://repo.eclipse.org/content/groups/cbi/org/codehaus/plexus/plexus-classworlds/2.5.1/plexus-classworlds-2.5.1.jar
00:29:31 Downloading from eclipse-maven-central: https://repo.eclipse.org/content/repositories/maven_central/org/codehaus/plexus/plexus-archiver/1.2/plexus-archiver-1.2.jar
00:29:31 Downloading from eclipse-maven-central: https://repo.eclipse.org/content/repositories/maven_central/org/codehaus/plexus/plexus-io/1.0.1/plexus-io-1.0.1.jar
00:29:31 Downloading from eclipse-maven-central: https://repo.eclipse.org/content/repositories/maven_central/org/apache/maven/maven-model/3.2.1/maven-model-3.2.1.jar
00:29:31 Downloading from eclipse-maven-central: https://repo.eclipse.org/content/repositories/maven_central/org/apache/maven/maven-core/3.2.1/maven-core-3.2.1.jar
00:29:31 Downloading from eclipse-maven-central: https://repo.eclipse.org/content/repositories/maven_central/org/apache/maven/maven-settings/3.2.1/maven-settings-3.2.1.jar
00:29:31 Progress (1): 4.1/575 kB
Progress (1): 7.7/575 kB
Progress (1): 12/575 kB 
Progress (1): 16/575 kB
Progress (1): 20/575 kB
Progress (2): 20/575 kB | 4.1/43 kB
Progress (2): 24/575 kB | 4.1/43 kB
Progress (2): 24/575 kB | 7.7/43 kB
Progress (2): 28/575 kB | 7.7/43 kB
Progress (2): 28/575 kB | 12/43 kB 
Progress (2): 32/575 kB | 12/43 kB
Progress (2): 32/575 kB | 16/43 kB
Progress (2): 36/575 kB | 16/43 kB
Progress (2): 36/575 kB | 20/43 kB
Progress (2): 40/575 kB | 20/43 kB
Progress (2): 40/575 kB | 24/43 kB
Progress (2): 44/575 kB | 24/43 kB
Progress (3): 44/575 kB | 24/43 kB | 4.1/182 kB
Progress (3): 44/575 kB | 28/43 kB | 4.1/182 kB
Progress (3): 44/575 kB | 28/43 kB | 7.7/182 kB
Progress (3): 48/575 kB | 28/43 kB | 7.7/182 kB
Progress (3): 48/575 kB | 28/43 kB | 12/182 kB 
Progress (3): 48/575 kB | 32/43 kB | 12/182 kB
Progress (3): 48/575 kB | 32/43 kB | 16/182 kB
Progress (3): 52/575 kB | 32/43 kB | 16/182 kB
Progress (3): 52/575 kB | 32/43 kB | 20/182 kB
Progress (3): 52/575 kB | 36/43 kB | 20/182 kB
Progress (3): 52/575 kB | 36/43 kB | 24/182 kB
Progress (4): 52/575 kB | 36/43 kB | 24/182 kB | 4.1/160 kB
Progress (4): 56/575 kB | 36/43 kB | 24/182 kB | 4.1/160 kB
Progress (5): 56/575 kB | 36/43 kB | 24/182 kB | 4.1/160 kB | 4.1/51 kB
Progress (5): 56/575 kB | 36/43 kB | 24/182 kB | 7.7/160 kB | 4.1/51 kB
Progress (5): 56/575 kB | 36/43 kB | 28/182 kB | 7.7/160 kB | 4.1/51 kB
Progress (5): 56/575 kB | 40/43 kB | 28/182 kB | 7.7/160 kB | 4.1/51 kB
Progress (5): 56/575 kB | 40/43 kB | 32/182 kB | 7.7/160 kB | 4.1/51 kB
Progress (5): 56/575 kB | 40/43 kB | 32/182 kB | 12/160 kB | 4.1/51 kB 
Progress (5): 56/575 kB | 40/43 kB | 32/182 kB | 12/160 kB | 7.7/51 kB
Progress (5): 60/575 kB | 40/43 kB | 32/182 kB | 12/160 kB | 7.7/51 kB
Progress (5): 60/575 kB | 40/43 kB | 32/182 kB | 12/160 kB | 12/51 kB 
Progress (5): 60/575 kB | 40/43 kB | 32/182 kB | 16/160 kB | 12/51 kB
Progress (5): 60/575 kB | 40/43 kB | 36/182 kB | 16/160 kB | 12/51 kB
Progress (5): 60/575 kB | 43 kB | 36/182 kB | 16/160 kB | 12/51 kB   
Progress (5): 60/575 kB | 43 kB | 40/182 kB | 16/160 kB | 12/51 kB
Progress (5): 60/575 kB | 43 kB | 40/182 kB | 20/160 kB | 12/51 kB
Progress (5): 60/575 kB | 43 kB | 40/182 kB | 20/160 kB | 16/51 kB
Progress (5): 64/575 kB | 43 kB | 40/182 kB | 20/160 kB | 16/51 kB
Progress (5): 64/575 kB | 43 kB | 40/182 kB | 20/160 kB | 20/51 kB
Progress (5): 64/575 kB | 43 kB | 40/182 kB | 24/160 kB | 20/51 kB
Progress (5): 64/575 kB | 43 kB | 44/182 kB | 24/160 kB | 20/51 kB
Progress (5): 64/575 kB | 43 kB | 44/182 kB | 28/160 kB | 20/51 kB
Progress (5): 64/575 kB | 43 kB | 44/182 kB | 28/160 kB | 24/51 kB
Progress (5): 68/575 kB | 43 kB | 44/182 kB | 28/160 kB | 24/51 kB
Progress (5): 68/575 kB | 43 kB | 44/182 kB | 28/160 kB | 28/51 kB
Progress (5): 68/575 kB | 43 kB | 44/182 kB | 32/160 kB | 28/51 kB
Progress (5): 68/575 kB | 43 kB | 48/182 kB | 32/160 kB | 28/51 kB
Progress (5): 68/575 kB | 43 kB | 48/182 kB | 36/160 kB | 28/51 kB
Progress (5): 68/575 kB | 43 kB | 48/182 kB | 36/160 kB | 32/51 kB
Progress (5): 72/575 kB | 43 kB | 48/182 kB | 36/160 kB | 32/51 kB
Progress (5): 72/575 kB | 43 kB | 48/182 kB | 36/160 kB | 36/51 kB
                                                                  
Downloaded from eclipse-maven-central: https://repo.eclipse.org/content/repositories/maven_central/org/apache/maven/maven-settings/3.2.1/maven-settings-3.2.1.jar (43 kB at 764 kB/s)
00:29:31 Progress (4): 72/575 kB | 48/182 kB | 40/160 kB | 36/51 kB
Progress (4): 72/575 kB | 52/182 kB | 40/160 kB | 36/51 kB
Progress (4): 72/575 kB | 52/182 kB | 44/160 kB | 36/51 kB
                                                          
Downloading from eclipse-maven-central: https://repo.eclipse.org/content/repositories/maven_central/org/apache/maven/maven-settings-builder/3.2.1/maven-settings-builder-3.2.1.jar
00:29:31 Progress (4): 72/575 kB | 52/182 kB | 44/160 kB | 40/51 kB
Progress (4): 76/575 kB | 52/182 kB | 44/160 kB | 40/51 kB
Progress (4): 76/575 kB | 52/182 kB | 44/160 kB | 44/51 kB
Progress (4): 76/575 kB | 52/182 kB | 48/160 kB | 44/51 kB
Progress (4): 76/575 kB | 56/182 kB | 48/160 kB | 44/51 kB
Progress (4): 76/575 kB | 56/182 kB | 52/160 kB | 44/51 kB
Progress (4): 76/575 kB | 56/182 kB | 52/160 kB | 48/51 kB
Progress (4): 80/575 kB | 56/182 kB | 52/160 kB | 48/51 kB
Progress (4): 80/575 kB | 56/182 kB | 52/160 kB | 51 kB   
Progress (4): 80/575 kB | 56/182 kB | 56/160 kB | 51 kB
Progress (4): 80/575 kB | 60/182 kB | 56/160 kB | 51 kB
Progress (4): 80/575 kB | 60/182 kB | 60/160 kB | 51 kB
Progress (4): 84/575 kB | 60/182 kB | 60/160 kB | 51 kB
Progress (4): 84/575 kB | 60/182 kB | 64/160 kB | 51 kB
Progress (4): 84/575 kB | 64/182 kB | 64/160 kB | 51 kB
Progress (4): 84/575 kB | 64/182 kB | 66/160 kB | 51 kB
Progress (4): 88/575 kB | 64/182 kB | 66/160 kB | 51 kB
Progress (4): 88/575 kB | 64/182 kB | 70/160 kB | 51 kB
Progress (4): 88/575 kB | 68/182 kB | 70/160 kB | 51 kB
Progress (4): 88/575 kB | 68/182 kB | 74/160 kB | 51 kB
Progress (4): 92/575 kB | 68/182 kB | 74/160 kB | 51 kB
Progress (4): 92/575 kB | 72/182 kB | 74/160 kB | 51 kB
Progress (4): 96/575 kB | 72/182 kB | 74/160 kB | 51 kB
Progress (4): 96/575 kB | 72/182 kB | 78/160 kB | 51 kB
Progress (4): 96/575 kB | 76/182 kB | 78/160 kB | 51 kB
Progress (4): 96/575 kB | 76/182 kB | 82/160 kB | 51 kB
Progress (4): 100/575 kB | 76/182 kB | 82/160 kB | 51 kB
Progress (4): 100/575 kB | 80/182 kB | 82/160 kB | 51 kB
Progress (4): 104/575 kB | 80/182 kB | 82/160 kB | 51 kB
Progress (4): 104/575 kB | 80/182 kB | 86/160 kB | 51 kB
Progress (4): 104/575 kB | 84/182 kB | 86/160 kB | 51 kB
Progress (4): 104/575 kB | 84/182 kB | 90/160 kB | 51 kB
Progress (4): 108/575 kB | 84/182 kB | 90/160 kB | 51 kB
Progress (4): 108/575 kB | 84/182 kB | 94/160 kB | 51 kB
Progress (4): 108/575 kB | 88/182 kB | 94/160 kB | 51 kB
Progress (4): 108/575 kB | 88/182 kB | 98/160 kB | 51 kB
Progress (4): 112/575 kB | 88/182 kB | 98/160 kB | 51 kB
Progress (4): 112/575 kB | 88/182 kB | 102/160 kB | 51 kB
Progress (4): 112/575 kB | 92/182 kB | 102/160 kB | 51 kB
                                                         
Downloaded from eclipse-maven-central: https://repo.eclipse.org/content/repositories/maven_central/org/codehaus/plexus/plexus-io/1.0.1/plexus-io-1.0.1.jar (51 kB at 783 kB/s)
00:29:31 Progress (3): 112/575 kB | 96/182 kB | 102/160 kB
Progress (3): 112/575 kB | 96/182 kB | 106/160 kB
Progress (3): 116/575 kB | 96/182 kB | 106/160 kB
Progress (3): 116/575 kB | 96/182 kB | 110/160 kB
Progress (4): 116/575 kB | 96/182 kB | 110/160 kB | 4.1/43 kB
Progress (4): 116/575 kB | 100/182 kB | 110/160 kB | 4.1/43 kB
                                                              
Downloading from eclipse-maven-central: https://repo.eclipse.org/content/repositories/maven_central/org/apache/maven/maven-repository-metadata/3.2.1/maven-repository-metadata-3.2.1.jar
00:29:31 Progress (4): 116/575 kB | 104/182 kB | 110/160 kB | 4.1/43 kB
Progress (4): 116/575 kB | 104/182 kB | 110/160 kB | 7.7/43 kB
Progress (4): 116/575 kB | 104/182 kB | 114/160 kB | 7.7/43 kB
Progress (4): 120/575 kB | 104/182 kB | 114/160 kB | 7.7/43 kB
Progress (4): 120/575 kB | 104/182 kB | 118/160 kB | 7.7/43 kB
Progress (4): 120/575 kB | 104/182 kB | 118/160 kB | 12/43 kB 
Progress (4): 120/575 kB | 108/182 kB | 118/160 kB | 12/43 kB
Progress (4): 120/575 kB | 108/182 kB | 118/160 kB | 16/43 kB
Progress (4): 120/575 kB | 108/182 kB | 122/160 kB | 16/43 kB
Progress (4): 124/575 kB | 108/182 kB | 122/160 kB | 16/43 kB
Progress (4): 124/575 kB | 108/182 kB | 126/160 kB | 16/43 kB
Progress (4): 124/575 kB | 108/182 kB | 126/160 kB | 20/43 kB
Progress (4): 124/575 kB | 112/182 kB | 126/160 kB | 20/43 kB
Progress (4): 124/575 kB | 112/182 kB | 126/160 kB | 24/43 kB
Progress (4): 124/575 kB | 112/182 kB | 130/160 kB | 24/43 kB
Progress (4): 128/575 kB | 112/182 kB | 130/160 kB | 24/43 kB
Progress (4): 128/575 kB | 112/182 kB | 134/160 kB | 24/43 kB
Progress (4): 128/575 kB | 112/182 kB | 134/160 kB | 28/43 kB
Progress (4): 128/575 kB | 116/182 kB | 134/160 kB | 28/43 kB
Progress (4): 128/575 kB | 116/182 kB | 134/160 kB | 32/43 kB
Progress (4): 128/575 kB | 116/182 kB | 138/160 kB | 32/43 kB
Progress (4): 132/575 kB | 116/182 kB | 138/160 kB | 32/43 kB
Progress (4): 132/575 kB | 116/182 kB | 138/160 kB | 36/43 kB
Progress (4): 132/575 kB | 120/182 kB | 138/160 kB | 36/43 kB
Progress (4): 132/575 kB | 120/182 kB | 138/160 kB | 40/43 kB
Progress (4): 136/575 kB | 120/182 kB | 138/160 kB | 40/43 kB
Progress (4): 136/575 kB | 120/182 kB | 142/160 kB | 40/43 kB
Progress (4): 140/575 kB | 120/182 kB | 142/160 kB | 40/43 kB
Progress (4): 140/575 kB | 120/182 kB | 142/160 kB | 43 kB   
Progress (4): 140/575 kB | 124/182 kB | 142/160 kB | 43 kB
Progress (4): 144/575 kB | 124/182 kB | 142/160 kB | 43 kB
Progress (4): 144/575 kB | 124/182 kB | 146/160 kB | 43 kB
Progress (5): 144/575 kB | 124/182 kB | 146/160 kB | 43 kB | 4.1/26 kB
Progress (5): 144/575 kB | 128/182 kB | 146/160 kB | 43 kB | 4.1/26 kB
Progress (5): 144/575 kB | 128/182 kB | 146/160 kB | 43 kB | 7.7/26 kB
Progress (5): 144/575 kB | 128/182 kB | 150/160 kB | 43 kB | 7.7/26 kB
Progress (5): 148/575 kB | 128/182 kB | 150/160 kB | 43 kB | 7.7/26 kB
Progress (5): 148/575 kB | 128/182 kB | 154/160 kB | 43 kB | 7.7/26 kB
Progress (5): 148/575 kB | 128/182 kB | 154/160 kB | 43 kB | 12/26 kB 
Progress (5): 148/575 kB | 132/182 kB | 154/160 kB | 43 kB | 12/26 kB
Progress (5): 148/575 kB | 132/182 kB | 154/160 kB | 43 kB | 16/26 kB
Progress (5): 148/575 kB | 132/182 kB | 158/160 kB | 43 kB | 16/26 kB
Progress (5): 152/575 kB | 132/182 kB | 158/160 kB | 43 kB | 16/26 kB
Progress (5): 152/575 kB | 132/182 kB | 160 kB | 43 kB | 16/26 kB    
Progress (5): 152/575 kB | 132/182 kB | 160 kB | 43 kB | 20/26 kB
Progress (5): 152/575 kB | 136/182 kB | 160 kB | 43 kB | 20/26 kB
Progress (5): 152/575 kB | 136/182 kB | 160 kB | 43 kB | 24/26 kB
Progress (5): 156/575 kB | 136/182 kB | 160 kB | 43 kB | 24/26 kB
Progress (5): 156/575 kB | 136/182 kB | 160 kB | 43 kB | 26 kB   
Progress (5): 156/575 kB | 140/182 kB | 160 kB | 43 kB | 26 kB
                                                              
Downloaded from eclipse-maven-central: https://repo.eclipse.org/content/repositories/maven_central/org/apache/maven/maven-settings-builder/3.2.1/maven-settings-builder-3.2.1.jar (43 kB at 541 kB/s)
00:29:31 Progress (4): 160/575 kB | 140/182 kB | 160 kB | 26 kB
                                                      
Downloading from eclipse-maven-central: https://repo.eclipse.org/content/repositories/maven_central/org/apache/maven/maven-artifact/3.2.1/maven-artifact-3.2.1.jar
00:29:31 Progress (4): 160/575 kB | 144/182 kB | 160 kB | 26 kB
Progress (4): 164/575 kB | 144/182 kB | 160 kB | 26 kB
Progress (4): 164/575 kB | 148/182 kB | 160 kB | 26 kB
Progress (4): 168/575 kB | 148/182 kB | 160 kB | 26 kB
Progress (4): 168/575 kB | 152/182 kB | 160 kB | 26 kB
Progress (4): 172/575 kB | 152/182 kB | 160 kB | 26 kB
Progress (4): 172/575 kB | 156/182 kB | 160 kB | 26 kB
Progress (4): 176/575 kB | 156/182 kB | 160 kB | 26 kB
Progress (4): 176/575 kB | 160/182 kB | 160 kB | 26 kB
Progress (4): 180/575 kB | 160/182 kB | 160 kB | 26 kB
Progress (4): 180/575 kB | 164/182 kB | 160 kB | 26 kB
Progress (4): 184/575 kB | 164/182 kB | 160 kB | 26 kB
Progress (4): 184/575 kB | 168/182 kB | 160 kB | 26 kB
Progress (4): 188/575 kB | 168/182 kB | 160 kB | 26 kB
Progress (4): 188/575 kB | 172/182 kB | 160 kB | 26 kB
Progress (4): 192/575 kB | 172/182 kB | 160 kB | 26 kB
Progress (4): 192/575 kB | 176/182 kB | 160 kB | 26 kB
Progress (4): 196/575 kB | 176/182 kB | 160 kB | 26 kB
Progress (4): 196/575 kB | 180/182 kB | 160 kB | 26 kB
Progress (4): 200/575 kB | 180/182 kB | 160 kB | 26 kB
Progress (4): 200/575 kB | 182 kB | 160 kB | 26 kB    
Progress (4): 204/575 kB | 182 kB | 160 kB | 26 kB
Progress (4): 208/575 kB | 182 kB | 160 kB | 26 kB
                                                  
Downloaded from eclipse-maven-central: https://repo.eclipse.org/content/repositories/maven_central/org/apache/maven/maven-repository-metadata/3.2.1/maven-repository-metadata-3.2.1.jar (26 kB at 307 kB/s)
00:29:31 Progress (3): 212/575 kB | 182 kB | 160 kB
                                          
Downloading from eclipse-maven-central: https://repo.eclipse.org/content/repositories/maven_central/org/apache/maven/maven-plugin-api/3.2.1/maven-plugin-api-3.2.1.jar
00:29:31 Progress (3): 216/575 kB | 182 kB | 160 kB
Progress (3): 220/575 kB | 182 kB | 160 kB
Progress (3): 224/575 kB | 182 kB | 160 kB
Progress (3): 228/575 kB | 182 kB | 160 kB
Progress (3): 232/575 kB | 182 kB | 160 kB
Progress (3): 236/575 kB | 182 kB | 160 kB
                                          
Downloaded from eclipse-maven-central: https://repo.eclipse.org/content/repositories/maven_central/org/apache/maven/maven-model/3.2.1/maven-model-3.2.1.jar (160 kB at 1.8 MB/s)
00:29:31 Progress (2): 240/575 kB | 182 kB
                                 
Downloading from eclipse-maven-central: https://repo.eclipse.org/content/repositories/maven_central/org/apache/maven/maven-model-builder/3.2.1/maven-model-builder-3.2.1.jar
00:29:31 Progress (2): 244/575 kB | 182 kB
Progress (2): 248/575 kB | 182 kB
Progress (2): 252/575 kB | 182 kB
Progress (2): 256/575 kB | 182 kB
Progress (2): 260/575 kB | 182 kB
Progress (2): 264/575 kB | 182 kB
Progress (2): 268/575 kB | 182 kB
Progress (2): 272/575 kB | 182 kB
Progress (2): 276/575 kB | 182 kB
Progress (2): 280/575 kB | 182 kB
Progress (2): 284/575 kB | 182 kB
Progress (2): 288/575 kB | 182 kB
Progress (2): 292/575 kB | 182 kB
Progress (2): 296/575 kB | 182 kB
Progress (2): 300/575 kB | 182 kB
Progress (2): 304/575 kB | 182 kB
Progress (2): 308/575 kB | 182 kB
Progress (2): 312/575 kB | 182 kB
Progress (2): 316/575 kB | 182 kB
Progress (2): 320/575 kB | 182 kB
Progress (2): 324/575 kB | 182 kB
Progress (2): 328/575 kB | 182 kB
Progress (2): 332/575 kB | 182 kB
Progress (2): 336/575 kB | 182 kB
Progress (2): 340/575 kB | 182 kB
Progress (2): 344/575 kB | 182 kB
Progress (2): 348/575 kB | 182 kB
                                 
Downloaded from eclipse-maven-central: https://repo.eclipse.org/content/repositories/maven_central/org/codehaus/plexus/plexus-archiver/1.2/plexus-archiver-1.2.jar (182 kB at 1.9 MB/s)
00:29:31 Progress (1): 352/575 kB
                        
Downloading from eclipse-maven-central: https://repo.eclipse.org/content/repositories/maven_central/org/apache/maven/maven-aether-provider/3.2.1/maven-aether-provider-3.2.1.jar
00:29:31 Progress (1): 356/575 kB
Progress (1): 360/575 kB
Progress (2): 360/575 kB | 4.1/165 kB
Progress (2): 364/575 kB | 4.1/165 kB
Progress (2): 364/575 kB | 7.7/165 kB
Progress (2): 368/575 kB | 7.7/165 kB
Progress (2): 368/575 kB | 12/165 kB 
Progress (2): 372/575 kB | 12/165 kB
Progress (2): 372/575 kB | 16/165 kB
Progress (2): 376/575 kB | 16/165 kB
Progress (2): 376/575 kB | 20/165 kB
Progress (2): 380/575 kB | 20/165 kB
Progress (2): 380/575 kB | 24/165 kB
Progress (2): 384/575 kB | 24/165 kB
Progress (2): 384/575 kB | 28/165 kB
Progress (2): 388/575 kB | 28/165 kB
Progress (2): 388/575 kB | 32/165 kB
Progress (2): 392/575 kB | 32/165 kB
Progress (2): 392/575 kB | 33/165 kB
Progress (2): 396/575 kB | 33/165 kB
Progress (2): 396/575 kB | 37/165 kB
Progress (2): 400/575 kB | 37/165 kB
Progress (2): 400/575 kB | 41/165 kB
Progress (2): 404/575 kB | 41/165 kB
Progress (2): 404/575 kB | 45/165 kB
Progress (2): 408/575 kB | 45/165 kB
Progress (2): 408/575 kB | 49/165 kB
Progress (2): 412/575 kB | 49/165 kB
Progress (2): 412/575 kB | 53/165 kB
Progress (2): 416/575 kB | 53/165 kB
Progress (2): 416/575 kB | 57/165 kB
Progress (2): 420/575 kB | 57/165 kB
Progress (2): 420/575 kB | 61/165 kB
Progress (2): 424/575 kB | 61/165 kB
Progress (2): 424/575 kB | 65/165 kB
Progress (2): 428/575 kB | 65/165 kB
Progress (2): 428/575 kB | 66/165 kB
Progress (2): 432/575 kB | 66/165 kB
Progress (2): 432/575 kB | 70/165 kB
Progress (2): 436/575 kB | 70/165 kB
Progress (2): 436/575 kB | 74/165 kB
Progress (2): 440/575 kB | 74/165 kB
Progress (2): 440/575 kB | 78/165 kB
Progress (2): 440/575 kB | 82/165 kB
Progress (2): 444/575 kB | 82/165 kB
Progress (2): 444/575 kB | 86/165 kB
Progress (2): 448/575 kB | 86/165 kB
Progress (3): 448/575 kB | 86/165 kB | 4.1/54 kB
Progress (3): 452/575 kB | 86/165 kB | 4.1/54 kB
Progress (3): 452/575 kB | 90/165 kB | 4.1/54 kB
Progress (3): 456/575 kB | 90/165 kB | 4.1/54 kB
Progress (3): 456/575 kB | 90/165 kB | 7.7/54 kB
Progress (3): 460/575 kB | 90/165 kB | 7.7/54 kB
Progress (3): 460/575 kB | 94/165 kB | 7.7/54 kB
Progress (3): 460/575 kB | 94/165 kB | 12/54 kB 
Progress (3): 464/575 kB | 94/165 kB | 12/54 kB
Progress (4): 464/575 kB | 94/165 kB | 12/54 kB | 4.1/46 kB
Progress (4): 464/575 kB | 94/165 kB | 16/54 kB | 4.1/46 kB
Progress (4): 464/575 kB | 98/165 kB | 16/54 kB | 4.1/46 kB
Progress (4): 464/575 kB | 98/165 kB | 20/54 kB | 4.1/46 kB
Progress (4): 464/575 kB | 98/165 kB | 20/54 kB | 4.1/46 kB
Progress (4): 464/575 kB | 98/165 kB | 20/54 kB | 7.7/46 kB
Progress (4): 468/575 kB | 98/165 kB | 20/54 kB | 7.7/46 kB
Progress (4): 468/575 kB | 98/165 kB | 20/54 kB | 12/46 kB 
Progress (4): 468/575 kB | 102/165 kB | 20/54 kB | 12/46 kB
Progress (4): 468/575 kB | 102/165 kB | 24/54 kB | 12/46 kB
Progress (4): 468/575 kB | 106/165 kB | 24/54 kB | 12/46 kB
Progress (4): 468/575 kB | 106/165 kB | 28/54 kB | 12/46 kB
Progress (4): 468/575 kB | 106/165 kB | 28/54 kB | 16/46 kB
Progress (4): 472/575 kB | 106/165 kB | 28/54 kB | 16/46 kB
Progress (4): 472/575 kB | 106/165 kB | 28/54 kB | 20/46 kB
Progress (4): 472/575 kB | 106/165 kB | 32/54 kB | 20/46 kB
Progress (4): 472/575 kB | 110/165 kB | 32/54 kB | 20/46 kB
Progress (4): 472/575 kB | 110/165 kB | 36/54 kB | 20/46 kB
Progress (4): 472/575 kB | 110/165 kB | 36/54 kB | 24/46 kB
Progress (4): 476/575 kB | 110/165 kB | 36/54 kB | 24/46 kB
Progress (4): 476/575 kB | 110/165 kB | 36/54 kB | 28/46 kB
Progress (4): 476/575 kB | 110/165 kB | 40/54 kB | 28/46 kB
Progress (4): 476/575 kB | 114/165 kB | 40/54 kB | 28/46 kB
Progress (4): 476/575 kB | 114/165 kB | 44/54 kB | 28/46 kB
Progress (4): 476/575 kB | 114/165 kB | 44/54 kB | 32/46 kB
Progress (4): 480/575 kB | 114/165 kB | 44/54 kB | 32/46 kB
Progress (4): 480/575 kB | 114/165 kB | 44/54 kB | 36/46 kB
Progress (4): 480/575 kB | 114/165 kB | 48/54 kB | 36/46 kB
Progress (4): 480/575 kB | 118/165 kB | 48/54 kB | 36/46 kB
Progress (4): 480/575 kB | 118/165 kB | 52/54 kB | 36/46 kB
Progress (5): 480/575 kB | 118/165 kB | 52/54 kB | 36/46 kB | 4.1/61 kB
Progress (5): 480/575 kB | 118/165 kB | 52/54 kB | 40/46 kB | 4.1/61 kB
Progress (5): 484/575 kB | 118/165 kB | 52/54 kB | 40/46 kB | 4.1/61 kB
Progress (5): 484/575 kB | 118/165 kB | 52/54 kB | 44/46 kB | 4.1/61 kB
Progress (5): 484/575 kB | 118/165 kB | 52/54 kB | 44/46 kB | 7.7/61 kB
Progress (5): 484/575 kB | 118/165 kB | 54 kB | 44/46 kB | 7.7/61 kB   
Progress (5): 484/575 kB | 122/165 kB | 54 kB | 44/46 kB | 7.7/61 kB
Progress (5): 484/575 kB | 122/165 kB | 54 kB | 44/46 kB | 12/61 kB 
Progress (5): 484/575 kB | 122/165 kB | 54 kB | 46 kB | 12/61 kB   
Progress (5): 488/575 kB | 122/165 kB | 54 kB | 46 kB | 12/61 kB
Progress (5): 488/575 kB | 122/165 kB | 54 kB | 46 kB | 16/61 kB
Progress (5): 492/575 kB | 122/165 kB | 54 kB | 46 kB | 16/61 kB
Progress (5): 492/575 kB | 126/165 kB | 54 kB | 46 kB | 16/61 kB
Progress (5): 496/575 kB | 126/165 kB | 54 kB | 46 kB | 16/61 kB
Progress (5): 496/575 kB | 126/165 kB | 54 kB | 46 kB | 20/61 kB
Progress (5): 500/575 kB | 126/165 kB | 54 kB | 46 kB | 20/61 kB
Progress (5): 500/575 kB | 130/165 kB | 54 kB | 46 kB | 20/61 kB
Progress (5): 504/575 kB | 130/165 kB | 54 kB | 46 kB | 20/61 kB
Progress (5): 504/575 kB | 130/165 kB | 54 kB | 46 kB | 24/61 kB
Progress (5): 508/575 kB | 130/165 kB | 54 kB | 46 kB | 24/61 kB
Progress (5): 508/575 kB | 134/165 kB | 54 kB | 46 kB | 24/61 kB
Progress (5): 512/575 kB | 134/165 kB | 54 kB | 46 kB | 24/61 kB
Progress (5): 512/575 kB | 134/165 kB | 54 kB | 46 kB | 28/61 kB
Progress (5): 516/575 kB | 134/165 kB | 54 kB | 46 kB | 28/61 kB
Progress (5): 516/575 kB | 138/165 kB | 54 kB | 46 kB | 28/61 kB
Progress (5): 520/575 kB | 138/165 kB | 54 kB | 46 kB | 28/61 kB
Progress (5): 520/575 kB | 138/165 kB | 54 kB | 46 kB | 32/61 kB
Progress (5): 524/575 kB | 138/165 kB | 54 kB | 46 kB | 32/61 kB
Progress (5): 524/575 kB | 142/165 kB | 54 kB | 46 kB | 32/61 kB
Progress (5): 528/575 kB | 142/165 kB | 54 kB | 46 kB | 32/61 kB
Progress (5): 528/575 kB | 142/165 kB | 54 kB | 46 kB | 36/61 kB
Progress (5): 532/575 kB | 142/165 kB | 54 kB | 46 kB | 36/61 kB
Progress (5): 532/575 kB | 146/165 kB | 54 kB | 46 kB | 36/61 kB
Progress (5): 536/575 kB | 146/165 kB | 54 kB | 46 kB | 36/61 kB
                                                                
Downloaded from eclipse-maven-central: https://repo.eclipse.org/content/repositories/maven_central/org/apache/maven/maven-artifact/3.2.1/maven-artifact-3.2.1.jar (54 kB at 455 kB/s)
00:29:31 Progress (4): 536/575 kB | 146/165 kB | 46 kB | 40/61 kB
                                                        
Downloading from eclipse-maven-central: https://repo.eclipse.org/content/repositories/maven_central/org/eclipse/sisu/org.eclipse.sisu.plexus/0.0.0.M5/org.eclipse.sisu.plexus-0.0.0.M5.jar
00:29:31 Progress (4): 540/575 kB | 146/165 kB | 46 kB | 40/61 kB
Progress (4): 540/575 kB | 150/165 kB | 46 kB | 40/61 kB
Progress (4): 544/575 kB | 150/165 kB | 46 kB | 40/61 kB
Progress (4): 544/575 kB | 150/165 kB | 46 kB | 44/61 kB
Progress (4): 548/575 kB | 150/165 kB | 46 kB | 44/61 kB
                                                        
Downloaded from eclipse-maven-central: https://repo.eclipse.org/content/repositories/maven_central/org/apache/maven/maven-plugin-api/3.2.1/maven-plugin-api-3.2.1.jar (46 kB at 379 kB/s)
00:29:31 Progress (3): 548/575 kB | 154/165 kB | 44/61 kB
                                                
Downloading from eclipse-maven-central: https://repo.eclipse.org/content/repositories/maven_central/com/google/guava/guava/10.0.1/guava-10.0.1.jar
00:29:31 Progress (3): 548/575 kB | 158/165 kB | 44/61 kB
Progress (3): 552/575 kB | 158/165 kB | 44/61 kB
Progress (3): 552/575 kB | 158/165 kB | 48/61 kB
Progress (3): 556/575 kB | 158/165 kB | 48/61 kB
Progress (3): 556/575 kB | 162/165 kB | 48/61 kB
Progress (3): 560/575 kB | 162/165 kB | 48/61 kB
Progress (3): 560/575 kB | 162/165 kB | 52/61 kB
Progress (3): 564/575 kB | 162/165 kB | 52/61 kB
Progress (3): 564/575 kB | 165 kB | 52/61 kB    
Progress (3): 568/575 kB | 165 kB | 52/61 kB
Progress (3): 568/575 kB | 165 kB | 56/61 kB
Progress (3): 572/575 kB | 165 kB | 56/61 kB
Progress (3): 575 kB | 165 kB | 56/61 kB    
Progress (3): 575 kB | 165 kB | 60/61 kB
Progress (3): 575 kB | 165 kB | 61 kB   
Progress (4): 575 kB | 165 kB | 61 kB | 0/1.5 MB
Progress (4): 575 kB | 165 kB | 61 kB | 0/1.5 MB
                                                
Downloaded from eclipse-maven-central: https://repo.eclipse.org/content/repositories/maven_central/org/apache/maven/maven-model-builder/3.2.1/maven-model-builder-3.2.1.jar (165 kB at 1.2 MB/s)
00:29:31 Progress (3): 575 kB | 61 kB | 0/1.5 MB
                                       
Downloading from eclipse-maven-central: https://repo.eclipse.org/content/repositories/maven_central/com/google/code/findbugs/jsr305/1.3.9/jsr305-1.3.9.jar
00:29:31 Progress (3): 575 kB | 61 kB | 0/1.5 MB
                                       
Downloaded from eclipse-maven-central: https://repo.eclipse.org/content/repositories/maven_central/org/apache/maven/maven-core/3.2.1/maven-core-3.2.1.jar (575 kB at 4.1 MB/s)
00:29:31 Progress (2): 61 kB | 0/1.5 MB
                              
Downloading from eclipse-maven-central: https://repo.eclipse.org/content/repositories/maven_central/org/eclipse/sisu/org.eclipse.sisu.inject/0.0.0.M5/org.eclipse.sisu.inject-0.0.0.M5.jar
00:29:31 Progress (2): 61 kB | 0/1.5 MB
Progress (3): 61 kB | 0/1.5 MB | 4.1/197 kB
Progress (3): 61 kB | 0/1.5 MB | 4.1/197 kB
Progress (3): 61 kB | 0/1.5 MB | 7.7/197 kB
Progress (3): 61 kB | 0/1.5 MB | 7.7/197 kB
Progress (3): 61 kB | 0/1.5 MB | 12/197 kB 
Progress (3): 61 kB | 0/1.5 MB | 12/197 kB
Progress (3): 61 kB | 0/1.5 MB | 16/197 kB
Progress (3): 61 kB | 0/1.5 MB | 16/197 kB
Progress (3): 61 kB | 0/1.5 MB | 16/197 kB
Progress (3): 61 kB | 0/1.5 MB | 20/197 kB
Progress (3): 61 kB | 0/1.5 MB | 20/197 kB
                                          
Downloaded from eclipse-maven-central: https://repo.eclipse.org/content/repositories/maven_central/org/apache/maven/maven-aether-provider/3.2.1/maven-aether-provider-3.2.1.jar (61 kB at 429 kB/s)
00:29:31 Progress (2): 0/1.5 MB | 24/197 kB
                                  
Downloading from eclipse-maven-central: https://repo.eclipse.org/content/repositories/maven_central/org/codehaus/plexus/plexus-interpolation/1.19/plexus-interpolation-1.19.jar
00:29:31 Progress (2): 0/1.5 MB | 24/197 kB
Progress (2): 0/1.5 MB | 28/197 kB
Progress (2): 0.1/1.5 MB | 28/197 kB
Progress (2): 0.1/1.5 MB | 32/197 kB
Progress (2): 0.1/1.5 MB | 32/197 kB
Progress (2): 0.1/1.5 MB | 33/197 kB
Progress (2): 0.1/1.5 MB | 33/197 kB
Progress (2): 0.1/1.5 MB | 33/197 kB
Progress (2): 0.1/1.5 MB | 37/197 kB
Progress (2): 0.1/1.5 MB | 37/197 kB
Progress (2): 0.1/1.5 MB | 41/197 kB
Progress (2): 0.1/1.5 MB | 41/197 kB
Progress (2): 0.1/1.5 MB | 41/197 kB
Progress (2): 0.1/1.5 MB | 45/197 kB
Progress (2): 0.1/1.5 MB | 45/197 kB
Progress (2): 0.1/1.5 MB | 49/197 kB
Progress (2): 0.1/1.5 MB | 49/197 kB
Progress (2): 0.1/1.5 MB | 53/197 kB
Progress (2): 0.1/1.5 MB | 53/197 kB
Progress (2): 0.1/1.5 MB | 57/197 kB
Progress (2): 0.1/1.5 MB | 57/197 kB
Progress (2): 0.1/1.5 MB | 61/197 kB
Progress (2): 0.1/1.5 MB | 61/197 kB
Progress (2): 0.1/1.5 MB | 65/197 kB
Progress (2): 0.1/1.5 MB | 65/197 kB
Progress (2): 0.1/1.5 MB | 66/197 kB
Progress (2): 0.1/1.5 MB | 66/197 kB
Progress (2): 0.1/1.5 MB | 70/197 kB
Progress (2): 0.1/1.5 MB | 70/197 kB
Progress (2): 0.1/1.5 MB | 74/197 kB
Progress (2): 0.1/1.5 MB | 74/197 kB
Progress (2): 0.1/1.5 MB | 78/197 kB
Progress (2): 0.1/1.5 MB | 78/197 kB
Progress (2): 0.1/1.5 MB | 82/197 kB
Progress (2): 0.1/1.5 MB | 82/197 kB
Progress (2): 0.1/1.5 MB | 86/197 kB
Progress (2): 0.1/1.5 MB | 86/197 kB
Progress (2): 0.1/1.5 MB | 90/197 kB
Progress (2): 0.1/1.5 MB | 90/197 kB
Progress (2): 0.1/1.5 MB | 94/197 kB
Progress (2): 0.1/1.5 MB | 94/197 kB
Progress (2): 0.1/1.5 MB | 98/197 kB
Progress (2): 0.1/1.5 MB | 98/197 kB
Progress (2): 0.1/1.5 MB | 98/197 kB
Progress (2): 0.1/1.5 MB | 98/197 kB
Progress (2): 0.1/1.5 MB | 102/197 kB
Progress (2): 0.1/1.5 MB | 102/197 kB
Progress (2): 0.1/1.5 MB | 106/197 kB
Progress (2): 0.1/1.5 MB | 106/197 kB
Progress (2): 0.1/1.5 MB | 106/197 kB
Progress (2): 0.1/1.5 MB | 110/197 kB
Progress (2): 0.2/1.5 MB | 110/197 kB
Progress (2): 0.2/1.5 MB | 114/197 kB
Progress (2): 0.2/1.5 MB | 114/197 kB
Progress (2): 0.2/1.5 MB | 118/197 kB
Progress (2): 0.2/1.5 MB | 118/197 kB
Progress (2): 0.2/1.5 MB | 122/197 kB
Progress (2): 0.2/1.5 MB | 122/197 kB
Progress (3): 0.2/1.5 MB | 122/197 kB | 4.1/33 kB
Progress (3): 0.2/1.5 MB | 122/197 kB | 4.1/33 kB
Progress (3): 0.2/1.5 MB | 126/197 kB | 4.1/33 kB
Progress (3): 0.2/1.5 MB | 126/197 kB | 7.7/33 kB
Progress (3): 0.2/1.5 MB | 126/197 kB | 7.7/33 kB
Progress (3): 0.2/1.5 MB | 130/197 kB | 7.7/33 kB
Progress (3): 0.2/1.5 MB | 130/197 kB | 12/33 kB 
Progress (3): 0.2/1.5 MB | 131/197 kB | 12/33 kB
Progress (3): 0.2/1.5 MB | 131/197 kB | 12/33 kB
Progress (4): 0.2/1.5 MB | 131/197 kB | 12/33 kB | 4.1/62 kB
Progress (4): 0.2/1.5 MB | 131/197 kB | 16/33 kB | 4.1/62 kB
Progress (4): 0.2/1.5 MB | 131/197 kB | 16/33 kB | 7.7/62 kB
Progress (4): 0.2/1.5 MB | 131/197 kB | 16/33 kB | 7.7/62 kB
Progress (4): 0.2/1.5 MB | 135/197 kB | 16/33 kB | 7.7/62 kB
Progress (4): 0.2/1.5 MB | 135/197 kB | 16/33 kB | 12/62 kB 
Progress (5): 0.2/1.5 MB | 135/197 kB | 16/33 kB | 12/62 kB | 4.1/291 kB
Progress (5): 0.2/1.5 MB | 135/197 kB | 20/33 kB | 12/62 kB | 4.1/291 kB
Progress (5): 0.2/1.5 MB | 135/197 kB | 20/33 kB | 12/62 kB | 7.7/291 kB
Progress (5): 0.2/1.5 MB | 135/197 kB | 20/33 kB | 16/62 kB | 7.7/291 kB
Progress (5): 0.2/1.5 MB | 135/197 kB | 20/33 kB | 16/62 kB | 7.7/291 kB
Progress (5): 0.2/1.5 MB | 139/197 kB | 20/33 kB | 16/62 kB | 7.7/291 kB
Progress (5): 0.2/1.5 MB | 139/197 kB | 20/33 kB | 16/62 kB | 7.7/291 kB
Progress (5): 0.2/1.5 MB | 139/197 kB | 20/33 kB | 20/62 kB | 7.7/291 kB
Progress (5): 0.2/1.5 MB | 139/197 kB | 20/33 kB | 20/62 kB | 12/291 kB 
Progress (5): 0.2/1.5 MB | 139/197 kB | 24/33 kB | 20/62 kB | 12/291 kB
Progress (5): 0.2/1.5 MB | 139/197 kB | 24/33 kB | 20/62 kB | 16/291 kB
Progress (5): 0.2/1.5 MB | 139/197 kB | 24/33 kB | 24/62 kB | 16/291 kB
Progress (5): 0.2/1.5 MB | 139/197 kB | 24/33 kB | 24/62 kB | 16/291 kB
Progress (5): 0.2/1.5 MB | 143/197 kB | 24/33 kB | 24/62 kB | 16/291 kB
Progress (5): 0.2/1.5 MB | 143/197 kB | 24/33 kB | 24/62 kB | 16/291 kB
Progress (5): 0.2/1.5 MB | 143/197 kB | 24/33 kB | 28/62 kB | 16/291 kB
Progress (5): 0.2/1.5 MB | 143/197 kB | 24/33 kB | 28/62 kB | 20/291 kB
Progress (5): 0.2/1.5 MB | 143/197 kB | 28/33 kB | 28/62 kB | 20/291 kB
Progress (5): 0.2/1.5 MB | 143/197 kB | 28/33 kB | 28/62 kB | 24/291 kB
Progress (5): 0.2/1.5 MB | 143/197 kB | 28/33 kB | 32/62 kB | 24/291 kB
Progress (5): 0.2/1.5 MB | 143/197 kB | 28/33 kB | 32/62 kB | 24/291 kB
Progress (5): 0.2/1.5 MB | 147/197 kB | 28/33 kB | 32/62 kB | 24/291 kB
Progress (5): 0.2/1.5 MB | 147/197 kB | 28/33 kB | 32/62 kB | 24/291 kB
Progress (5): 0.2/1.5 MB | 151/197 kB | 28/33 kB | 32/62 kB | 24/291 kB
Progress (5): 0.2/1.5 MB | 151/197 kB | 28/33 kB | 33/62 kB | 24/291 kB
Progress (5): 0.2/1.5 MB | 151/197 kB | 28/33 kB | 33/62 kB | 28/291 kB
Progress (5): 0.2/1.5 MB | 151/197 kB | 32/33 kB | 33/62 kB | 28/291 kB
Progress (5): 0.2/1.5 MB | 151/197 kB | 32/33 kB | 33/62 kB | 32/291 kB
Progress (5): 0.2/1.5 MB | 151/197 kB | 32/33 kB | 37/62 kB | 32/291 kB
Progress (5): 0.2/1.5 MB | 155/197 kB | 32/33 kB | 37/62 kB | 32/291 kB
Progress (5): 0.2/1.5 MB | 155/197 kB | 32/33 kB | 37/62 kB | 32/291 kB
Progress (5): 0.2/1.5 MB | 159/197 kB | 32/33 kB | 37/62 kB | 32/291 kB
Progress (5): 0.2/1.5 MB | 159/197 kB | 32/33 kB | 41/62 kB | 32/291 kB
Progress (5): 0.2/1.5 MB | 159/197 kB | 32/33 kB | 41/62 kB | 33/291 kB
Progress (5): 0.2/1.5 MB | 159/197 kB | 33 kB | 41/62 kB | 33/291 kB   
Progress (5): 0.2/1.5 MB | 159/197 kB | 33 kB | 41/62 kB | 37/291 kB
Progress (5): 0.2/1.5 MB | 159/197 kB | 33 kB | 45/62 kB | 37/291 kB
Progress (5): 0.2/1.5 MB | 163/197 kB | 33 kB | 45/62 kB | 37/291 kB
Progress (5): 0.2/1.5 MB | 163/197 kB | 33 kB | 45/62 kB | 37/291 kB
Progress (5): 0.2/1.5 MB | 167/197 kB | 33 kB | 45/62 kB | 37/291 kB
Progress (5): 0.2/1.5 MB | 167/197 kB | 33 kB | 49/62 kB | 37/291 kB
Progress (5): 0.2/1.5 MB | 167/197 kB | 33 kB | 49/62 kB | 41/291 kB
Progress (5): 0.2/1.5 MB | 167/197 kB | 33 kB | 53/62 kB | 41/291 kB
Progress (5): 0.2/1.5 MB | 171/197 kB | 33 kB | 53/62 kB | 41/291 kB
Progress (5): 0.2/1.5 MB | 171/197 kB | 33 kB | 53/62 kB | 41/291 kB
Progress (5): 0.2/1.5 MB | 175/197 kB | 33 kB | 53/62 kB | 41/291 kB
Progress (5): 0.2/1.5 MB | 175/197 kB | 33 kB | 57/62 kB | 41/291 kB
Progress (5): 0.2/1.5 MB | 175/197 kB | 33 kB | 57/62 kB | 45/291 kB
Progress (5): 0.2/1.5 MB | 175/197 kB | 33 kB | 61/62 kB | 45/291 kB
Progress (5): 0.2/1.5 MB | 179/197 kB | 33 kB | 61/62 kB | 45/291 kB
Progress (5): 0.2/1.5 MB | 179/197 kB | 33 kB | 61/62 kB | 45/291 kB
Progress (5): 0.2/1.5 MB | 183/197 kB | 33 kB | 61/62 kB | 45/291 kB
Progress (5): 0.2/1.5 MB | 183/197 kB | 33 kB | 62 kB | 45/291 kB   
Progress (5): 0.2/1.5 MB | 183/197 kB | 33 kB | 62 kB | 49/291 kB
Progress (5): 0.2/1.5 MB | 187/197 kB | 33 kB | 62 kB | 49/291 kB
Progress (5): 0.2/1.5 MB | 187/197 kB | 33 kB | 62 kB | 49/291 kB
Progress (5): 0.2/1.5 MB | 191/197 kB | 33 kB | 62 kB | 49/291 kB
Progress (5): 0.2/1.5 MB | 191/197 kB | 33 kB | 62 kB | 53/291 kB
Progress (5): 0.2/1.5 MB | 195/197 kB | 33 kB | 62 kB | 53/291 kB
Progress (5): 0.2/1.5 MB | 195/197 kB | 33 kB | 62 kB | 53/291 kB
Progress (5): 0.2/1.5 MB | 197 kB | 33 kB | 62 kB | 53/291 kB    
Progress (5): 0.2/1.5 MB | 197 kB | 33 kB | 62 kB | 57/291 kB
Progress (5): 0.2/1.5 MB | 197 kB | 33 kB | 62 kB | 57/291 kB
                                                             
Downloaded from eclipse-maven-central: https://repo.eclipse.org/content/repositories/maven_central/com/google/code/findbugs/jsr305/1.3.9/jsr305-1.3.9.jar (33 kB at 194 kB/s)
00:29:31 Progress (4): 0.2/1.5 MB | 197 kB | 62 kB | 57/291 kB
Progress (4): 0.2/1.5 MB | 197 kB | 62 kB | 61/291 kB
                                                     
Downloading from eclipse-maven-central: https://repo.eclipse.org/content/repositories/maven_central/org/codehaus/plexus/plexus-classworlds/2.5.1/plexus-classworlds-2.5.1.jar
00:29:31 Progress (4): 0.2/1.5 MB | 197 kB | 62 kB | 65/291 kB
Progress (4): 0.2/1.5 MB | 197 kB | 62 kB | 65/291 kB
Progress (4): 0.2/1.5 MB | 197 kB | 62 kB | 66/291 kB
Progress (4): 0.2/1.5 MB | 197 kB | 62 kB | 66/291 kB
Progress (4): 0.2/1.5 MB | 197 kB | 62 kB | 70/291 kB
Progress (4): 0.2/1.5 MB | 197 kB | 62 kB | 70/291 kB
Progress (4): 0.2/1.5 MB | 197 kB | 62 kB | 74/291 kB
Progress (4): 0.3/1.5 MB | 197 kB | 62 kB | 74/291 kB
Progress (4): 0.3/1.5 MB | 197 kB | 62 kB | 78/291 kB
                                                     
Downloaded from eclipse-maven-central: https://repo.eclipse.org/content/repositories/maven_central/org/codehaus/plexus/plexus-interpolation/1.19/plexus-interpolation-1.19.jar (62 kB at 357 kB/s)
00:29:31 Progress (3): 0.3/1.5 MB | 197 kB | 82/291 kB
Progress (3): 0.3/1.5 MB | 197 kB | 82/291 kB
Progress (3): 0.3/1.5 MB | 197 kB | 86/291 kB
Progress (3): 0.3/1.5 MB | 197 kB | 86/291 kB
Progress (3): 0.3/1.5 MB | 197 kB | 90/291 kB
Progress (3): 0.3/1.5 MB | 197 kB | 90/291 kB
Progress (3): 0.3/1.5 MB | 197 kB | 94/291 kB
Progress (3): 0.3/1.5 MB | 197 kB | 94/291 kB
Progress (3): 0.3/1.5 MB | 197 kB | 98/291 kB
Progress (3): 0.3/1.5 MB | 197 kB | 98/291 kB
Progress (3): 0.3/1.5 MB | 197 kB | 98/291 kB
Progress (3): 0.3/1.5 MB | 197 kB | 102/291 kB
Progress (3): 0.3/1.5 MB | 197 kB | 102/291 kB
Progress (3): 0.3/1.5 MB | 197 kB | 106/291 kB
                                              
Downloaded from eclipse-maven-central: https://repo.eclipse.org/content/repositories/maven_central/org/eclipse/sisu/org.eclipse.sisu.plexus/0.0.0.M5/org.eclipse.sisu.plexus-0.0.0.M5.jar (197 kB at 1.1 MB/s)
00:29:31 Progress (2): 0.3/1.5 MB | 110/291 kB
Progress (2): 0.3/1.5 MB | 110/291 kB
Progress (2): 0.3/1.5 MB | 114/291 kB
Progress (2): 0.3/1.5 MB | 114/291 kB
Progress (2): 0.3/1.5 MB | 118/291 kB
Progress (2): 0.3/1.5 MB | 118/291 kB
Progress (2): 0.3/1.5 MB | 122/291 kB
Progress (2): 0.3/1.5 MB | 122/291 kB
Progress (2): 0.3/1.5 MB | 126/291 kB
Progress (2): 0.3/1.5 MB | 126/291 kB
Progress (2): 0.3/1.5 MB | 130/291 kB
Progress (2): 0.3/1.5 MB | 130/291 kB
Progress (3): 0.3/1.5 MB | 130/291 kB | 4.1/50 kB
Progress (3): 0.3/1.5 MB | 130/291 kB | 4.1/50 kB
Progress (3): 0.3/1.5 MB | 134/291 kB | 4.1/50 kB
Progress (3): 0.3/1.5 MB | 134/291 kB | 4.1/50 kB
Progress (3): 0.3/1.5 MB | 134/291 kB | 7.7/50 kB
Progress (3): 0.3/1.5 MB | 138/291 kB | 7.7/50 kB
Progress (3): 0.3/1.5 MB | 138/291 kB | 7.7/50 kB
Progress (3): 0.3/1.5 MB | 138/291 kB | 12/50 kB 
Progress (3): 0.3/1.5 MB | 142/291 kB | 12/50 kB
Progress (3): 0.3/1.5 MB | 142/291 kB | 12/50 kB
Progress (3): 0.3/1.5 MB | 146/291 kB | 12/50 kB
Progress (3): 0.3/1.5 MB | 146/291 kB | 16/50 kB
Progress (3): 0.3/1.5 MB | 146/291 kB | 16/50 kB
Progress (3): 0.3/1.5 MB | 150/291 kB | 16/50 kB
Progress (3): 0.3/1.5 MB | 150/291 kB | 16/50 kB
Progress (3): 0.3/1.5 MB | 150/291 kB | 20/50 kB
Progress (3): 0.3/1.5 MB | 150/291 kB | 20/50 kB
Progress (3): 0.3/1.5 MB | 154/291 kB | 20/50 kB
Progress (3): 0.3/1.5 MB | 154/291 kB | 20/50 kB
Progress (3): 0.3/1.5 MB | 154/291 kB | 24/50 kB
Progress (3): 0.3/1.5 MB | 158/291 kB | 24/50 kB
Progress (3): 0.3/1.5 MB | 158/291 kB | 28/50 kB
Progress (3): 0.3/1.5 MB | 158/291 kB | 28/50 kB
Progress (3): 0.3/1.5 MB | 158/291 kB | 32/50 kB
Progress (3): 0.3/1.5 MB | 162/291 kB | 32/50 kB
Progress (3): 0.3/1.5 MB | 162/291 kB | 33/50 kB
Progress (3): 0.3/1.5 MB | 162/291 kB | 33/50 kB
Progress (3): 0.3/1.5 MB | 166/291 kB | 33/50 kB
Progress (3): 0.3/1.5 MB | 166/291 kB | 37/50 kB
Progress (3): 0.3/1.5 MB | 170/291 kB | 37/50 kB
Progress (3): 0.3/1.5 MB | 170/291 kB | 37/50 kB
Progress (3): 0.3/1.5 MB | 170/291 kB | 41/50 kB
Progress (3): 0.3/1.5 MB | 174/291 kB | 41/50 kB
Progress (3): 0.3/1.5 MB | 174/291 kB | 41/50 kB
Progress (3): 0.3/1.5 MB | 178/291 kB | 41/50 kB
Progress (3): 0.3/1.5 MB | 178/291 kB | 45/50 kB
Progress (3): 0.4/1.5 MB | 178/291 kB | 45/50 kB
Progress (3): 0.4/1.5 MB | 178/291 kB | 49/50 kB
Progress (3): 0.4/1.5 MB | 182/291 kB | 49/50 kB
Progress (3): 0.4/1.5 MB | 182/291 kB | 50 kB   
Progress (3): 0.4/1.5 MB | 182/291 kB | 50 kB
Progress (3): 0.4/1.5 MB | 186/291 kB | 50 kB
Progress (3): 0.4/1.5 MB | 186/291 kB | 50 kB
Progress (3): 0.4/1.5 MB | 190/291 kB | 50 kB
Progress (3): 0.4/1.5 MB | 190/291 kB | 50 kB
Progress (3): 0.4/1.5 MB | 194/291 kB | 50 kB
Progress (3): 0.4/1.5 MB | 194/291 kB | 50 kB
Progress (3): 0.4/1.5 MB | 198/291 kB | 50 kB
Progress (3): 0.4/1.5 MB | 198/291 kB | 50 kB
Progress (3): 0.4/1.5 MB | 202/291 kB | 50 kB
Progress (3): 0.4/1.5 MB | 202/291 kB | 50 kB
Progress (3): 0.4/1.5 MB | 206/291 kB | 50 kB
Progress (3): 0.4/1.5 MB | 206/291 kB | 50 kB
Progress (3): 0.4/1.5 MB | 210/291 kB | 50 kB
Progress (3): 0.4/1.5 MB | 210/291 kB | 50 kB
Progress (3): 0.4/1.5 MB | 214/291 kB | 50 kB
Progress (3): 0.4/1.5 MB | 214/291 kB | 50 kB
Progress (3): 0.4/1.5 MB | 218/291 kB | 50 kB
Progress (3): 0.4/1.5 MB | 218/291 kB | 50 kB
Progress (3): 0.4/1.5 MB | 218/291 kB | 50 kB
Progress (3): 0.4/1.5 MB | 222/291 kB | 50 kB
Progress (3): 0.4/1.5 MB | 222/291 kB | 50 kB
Progress (3): 0.4/1.5 MB | 226/291 kB | 50 kB
Progress (3): 0.4/1.5 MB | 226/291 kB | 50 kB
Progress (3): 0.4/1.5 MB | 230/291 kB | 50 kB
Progress (3): 0.4/1.5 MB | 230/291 kB | 50 kB
Progress (3): 0.4/1.5 MB | 234/291 kB | 50 kB
Progress (3): 0.4/1.5 MB | 234/291 kB | 50 kB
Progress (3): 0.4/1.5 MB | 238/291 kB | 50 kB
Progress (3): 0.4/1.5 MB | 238/291 kB | 50 kB
Progress (3): 0.4/1.5 MB | 242/291 kB | 50 kB
Progress (3): 0.4/1.5 MB | 242/291 kB | 50 kB
Progress (3): 0.4/1.5 MB | 246/291 kB | 50 kB
Progress (3): 0.4/1.5 MB | 246/291 kB | 50 kB
Progress (3): 0.4/1.5 MB | 250/291 kB | 50 kB
Progress (3): 0.4/1.5 MB | 250/291 kB | 50 kB
Progress (3): 0.4/1.5 MB | 254/291 kB | 50 kB
Progress (3): 0.4/1.5 MB | 254/291 kB | 50 kB
Progress (3): 0.4/1.5 MB | 258/291 kB | 50 kB
Progress (3): 0.4/1.5 MB | 258/291 kB | 50 kB
Progress (3): 0.4/1.5 MB | 262/291 kB | 50 kB
Progress (3): 0.4/1.5 MB | 262/291 kB | 50 kB
Progress (3): 0.4/1.5 MB | 266/291 kB | 50 kB
Progress (3): 0.4/1.5 MB | 266/291 kB | 50 kB
Progress (3): 0.4/1.5 MB | 270/291 kB | 50 kB
Progress (3): 0.4/1.5 MB | 270/291 kB | 50 kB
Progress (3): 0.4/1.5 MB | 274/291 kB | 50 kB
Progress (3): 0.5/1.5 MB | 274/291 kB | 50 kB
Progress (3): 0.5/1.5 MB | 278/291 kB | 50 kB
Progress (3): 0.5/1.5 MB | 278/291 kB | 50 kB
Progress (3): 0.5/1.5 MB | 282/291 kB | 50 kB
                                             
Downloaded from eclipse-maven-central: https://repo.eclipse.org/content/repositories/maven_central/org/codehaus/plexus/plexus-classworlds/2.5.1/plexus-classworlds-2.5.1.jar (50 kB at 259 kB/s)
00:29:31 Progress (2): 0.5/1.5 MB | 282/291 kB
Progress (2): 0.5/1.5 MB | 286/291 kB
Progress (2): 0.5/1.5 MB | 286/291 kB
Progress (2): 0.5/1.5 MB | 290/291 kB
Progress (2): 0.5/1.5 MB | 290/291 kB
Progress (2): 0.5/1.5 MB | 291 kB    
Progress (2): 0.5/1.5 MB | 291 kB
Progress (2): 0.5/1.5 MB | 291 kB
Progress (2): 0.5/1.5 MB | 291 kB
Progress (2): 0.5/1.5 MB | 291 kB
Progress (2): 0.5/1.5 MB | 291 kB
Progress (2): 0.5/1.5 MB | 291 kB
Progress (2): 0.5/1.5 MB | 291 kB
Progress (2): 0.5/1.5 MB | 291 kB
Progress (2): 0.5/1.5 MB | 291 kB
Progress (2): 0.5/1.5 MB | 291 kB
Progress (2): 0.5/1.5 MB | 291 kB
Progress (2): 0.5/1.5 MB | 291 kB
Progress (2): 0.5/1.5 MB | 291 kB
Progress (2): 0.5/1.5 MB | 291 kB
Progress (2): 0.5/1.5 MB | 291 kB
Progress (2): 0.5/1.5 MB | 291 kB
Progress (2): 0.5/1.5 MB | 291 kB
Progress (2): 0.5/1.5 MB | 291 kB
Progress (2): 0.5/1.5 MB | 291 kB
Progress (2): 0.5/1.5 MB | 291 kB
Progress (2): 0.6/1.5 MB | 291 kB
Progress (2): 0.6/1.5 MB | 291 kB
Progress (2): 0.6/1.5 MB | 291 kB
Progress (2): 0.6/1.5 MB | 291 kB
Progress (2): 0.6/1.5 MB | 291 kB
Progress (2): 0.6/1.5 MB | 291 kB
Progress (2): 0.6/1.5 MB | 291 kB
Progress (2): 0.6/1.5 MB | 291 kB
Progress (2): 0.6/1.5 MB | 291 kB
Progress (2): 0.6/1.5 MB | 291 kB
Progress (2): 0.6/1.5 MB | 291 kB
Progress (2): 0.6/1.5 MB | 291 kB
Progress (2): 0.6/1.5 MB | 291 kB
Progress (2): 0.6/1.5 MB | 291 kB
Progress (2): 0.6/1.5 MB | 291 kB
Progress (2): 0.6/1.5 MB | 291 kB
Progress (2): 0.6/1.5 MB | 291 kB
Progress (2): 0.6/1.5 MB | 291 kB
Progress (2): 0.6/1.5 MB | 291 kB
Progress (2): 0.6/1.5 MB | 291 kB
                                 
Downloaded from eclipse-maven-central: https://repo.eclipse.org/content/repositories/maven_central/org/eclipse/sisu/org.eclipse.sisu.inject/0.0.0.M5/org.eclipse.sisu.inject-0.0.0.M5.jar (291 kB at 1.4 MB/s)
00:29:31 Progress (1): 0.6/1.5 MB
Progress (1): 0.6/1.5 MB
Progress (1): 0.6/1.5 MB
Progress (1): 0.6/1.5 MB
Progress (1): 0.6/1.5 MB
Progress (1): 0.7/1.5 MB
Progress (1): 0.7/1.5 MB
Progress (1): 0.7/1.5 MB
Progress (1): 0.7/1.5 MB
Progress (1): 0.7/1.5 MB
Progress (1): 0.7/1.5 MB
Progress (1): 0.7/1.5 MB
Progress (1): 0.7/1.5 MB
Progress (1): 0.7/1.5 MB
Progress (1): 0.7/1.5 MB
Progress (1): 0.7/1.5 MB
Progress (1): 0.7/1.5 MB
Progress (1): 0.7/1.5 MB
Progress (1): 0.7/1.5 MB
Progress (1): 0.7/1.5 MB
Progress (1): 0.7/1.5 MB
Progress (1): 0.7/1.5 MB
Progress (1): 0.7/1.5 MB
Progress (1): 0.7/1.5 MB
Progress (1): 0.7/1.5 MB
Progress (1): 0.7/1.5 MB
Progress (1): 0.7/1.5 MB
Progress (1): 0.7/1.5 MB
Progress (1): 0.7/1.5 MB
Progress (1): 0.7/1.5 MB
Progress (1): 0.8/1.5 MB
Progress (1): 0.8/1.5 MB
Progress (1): 0.8/1.5 MB
Progress (1): 0.8/1.5 MB
Progress (1): 0.8/1.5 MB
Progress (1): 0.8/1.5 MB
Progress (1): 0.8/1.5 MB
Progress (1): 0.8/1.5 MB
Progress (1): 0.8/1.5 MB
Progress (1): 0.8/1.5 MB
Progress (1): 0.8/1.5 MB
Progress (1): 0.8/1.5 MB
Progress (1): 0.8/1.5 MB
Progress (1): 0.8/1.5 MB
Progress (1): 0.8/1.5 MB
Progress (1): 0.8/1.5 MB
Progress (1): 0.8/1.5 MB
Progress (1): 0.8/1.5 MB
Progress (1): 0.8/1.5 MB
Progress (1): 0.8/1.5 MB
Progress (1): 0.8/1.5 MB
Progress (1): 0.8/1.5 MB
Progress (1): 0.8/1.5 MB
Progress (1): 0.8/1.5 MB
Progress (1): 0.8/1.5 MB
Progress (1): 0.9/1.5 MB
Progress (1): 0.9/1.5 MB
Progress (1): 0.9/1.5 MB
Progress (1): 0.9/1.5 MB
Progress (1): 0.9/1.5 MB
Progress (1): 0.9/1.5 MB
Progress (1): 0.9/1.5 MB
Progress (1): 0.9/1.5 MB
Progress (1): 0.9/1.5 MB
Progress (1): 0.9/1.5 MB
Progress (1): 0.9/1.5 MB
Progress (1): 0.9/1.5 MB
Progress (1): 0.9/1.5 MB
Progress (1): 0.9/1.5 MB
Progress (1): 0.9/1.5 MB
Progress (1): 0.9/1.5 MB
Progress (1): 0.9/1.5 MB
Progress (1): 0.9/1.5 MB
Progress (1): 0.9/1.5 MB
Progress (1): 0.9/1.5 MB
Progress (1): 0.9/1.5 MB
Progress (1): 0.9/1.5 MB
Progress (1): 0.9/1.5 MB
Progress (1): 0.9/1.5 MB
Progress (1): 0.9/1.5 MB
Progress (1): 1.0/1.5 MB
Progress (1): 1.0/1.5 MB
Progress (1): 1.0/1.5 MB
Progress (1): 1.0/1.5 MB
Progress (1): 1.0/1.5 MB
Progress (1): 1.0/1.5 MB
Progress (1): 1.0/1.5 MB
Progress (1): 1.0/1.5 MB
Progress (1): 1.0/1.5 MB
Progress (1): 1.0/1.5 MB
Progress (1): 1.0/1.5 MB
Progress (1): 1.0/1.5 MB
Progress (1): 1.0/1.5 MB
Progress (1): 1.0/1.5 MB
Progress (1): 1.0/1.5 MB
Progress (1): 1.0/1.5 MB
Progress (1): 1.0/1.5 MB
Progress (1): 1.0/1.5 MB
Progress (1): 1.0/1.5 MB
Progress (1): 1.0/1.5 MB
Progress (1): 1.0/1.5 MB
Progress (1): 1.0/1.5 MB
Progress (1): 1.0/1.5 MB
Progress (1): 1.0/1.5 MB
Progress (1): 1.0/1.5 MB
Progress (1): 1.1/1.5 MB
Progress (1): 1.1/1.5 MB
Progress (1): 1.1/1.5 MB
Progress (1): 1.1/1.5 MB
Progress (1): 1.1/1.5 MB
Progress (1): 1.1/1.5 MB
Progress (1): 1.1/1.5 MB
Progress (1): 1.1/1.5 MB
Progress (1): 1.1/1.5 MB
Progress (1): 1.1/1.5 MB
Progress (1): 1.1/1.5 MB
Progress (1): 1.1/1.5 MB
Progress (1): 1.1/1.5 MB
Progress (1): 1.1/1.5 MB
Progress (1): 1.1/1.5 MB
Progress (1): 1.1/1.5 MB
Progress (1): 1.1/1.5 MB
Progress (1): 1.1/1.5 MB
Progress (1): 1.1/1.5 MB
Progress (1): 1.1/1.5 MB
Progress (1): 1.1/1.5 MB
Progress (1): 1.1/1.5 MB
Progress (1): 1.1/1.5 MB
Progress (1): 1.1/1.5 MB
Progress (1): 1.1/1.5 MB
Progress (1): 1.2/1.5 MB
Progress (1): 1.2/1.5 MB
Progress (1): 1.2/1.5 MB
Progress (1): 1.2/1.5 MB
Progress (1): 1.2/1.5 MB
Progress (1): 1.2/1.5 MB
Progress (1): 1.2/1.5 MB
Progress (1): 1.2/1.5 MB
Progress (1): 1.2/1.5 MB
Progress (1): 1.2/1.5 MB
Progress (1): 1.2/1.5 MB
Progress (1): 1.2/1.5 MB
Progress (1): 1.2/1.5 MB
Progress (1): 1.2/1.5 MB
Progress (1): 1.2/1.5 MB
Progress (1): 1.2/1.5 MB
Progress (1): 1.2/1.5 MB
Progress (1): 1.2/1.5 MB
Progress (1): 1.2/1.5 MB
Progress (1): 1.2/1.5 MB
Progress (1): 1.2/1.5 MB
Progress (1): 1.2/1.5 MB
Progress (1): 1.2/1.5 MB
Progress (1): 1.2/1.5 MB
Progress (1): 1.2/1.5 MB
Progress (1): 1.3/1.5 MB
Progress (1): 1.3/1.5 MB
Progress (1): 1.3/1.5 MB
Progress (1): 1.3/1.5 MB
Progress (1): 1.3/1.5 MB
Progress (1): 1.3/1.5 MB
Progress (1): 1.3/1.5 MB
Progress (1): 1.3/1.5 MB
Progress (1): 1.3/1.5 MB
Progress (1): 1.3/1.5 MB
Progress (1): 1.3/1.5 MB
Progress (1): 1.3/1.5 MB
Progress (1): 1.3/1.5 MB
Progress (1): 1.3/1.5 MB
Progress (1): 1.3/1.5 MB
Progress (1): 1.3/1.5 MB
Progress (1): 1.3/1.5 MB
Progress (1): 1.3/1.5 MB
Progress (1): 1.3/1.5 MB
Progress (1): 1.3/1.5 MB
Progress (1): 1.3/1.5 MB
Progress (1): 1.3/1.5 MB
Progress (1): 1.3/1.5 MB
Progress (1): 1.3/1.5 MB
Progress (1): 1.3/1.5 MB
Progress (1): 1.4/1.5 MB
Progress (1): 1.4/1.5 MB
Progress (1): 1.4/1.5 MB
Progress (1): 1.4/1.5 MB
Progress (1): 1.4/1.5 MB
Progress (1): 1.4/1.5 MB
Progress (1): 1.4/1.5 MB
Progress (1): 1.4/1.5 MB
Progress (1): 1.4/1.5 MB
Progress (1): 1.4/1.5 MB
Progress (1): 1.4/1.5 MB
Progress (1): 1.4/1.5 MB
Progress (1): 1.4/1.5 MB
Progress (1): 1.4/1.5 MB
Progress (1): 1.4/1.5 MB
Progress (1): 1.4/1.5 MB
Progress (1): 1.4/1.5 MB
Progress (1): 1.4/1.5 MB
Progress (1): 1.4/1.5 MB
Progress (1): 1.4/1.5 MB
Progress (1): 1.4/1.5 MB
Progress (1): 1.4/1.5 MB
Progress (1): 1.4/1.5 MB
Progress (1): 1.4/1.5 MB
Progress (1): 1.4/1.5 MB
Progress (1): 1.5/1.5 MB
Progress (1): 1.5/1.5 MB
Progress (1): 1.5/1.5 MB
Progress (1): 1.5/1.5 MB
Progress (1): 1.5/1.5 MB
Progress (1): 1.5/1.5 MB
Progress (1): 1.5/1.5 MB
Progress (1): 1.5/1.5 MB
Progress (1): 1.5/1.5 MB
Progress (1): 1.5/1.5 MB
Progress (1): 1.5/1.5 MB
Progress (1): 1.5/1.5 MB
Progress (1): 1.5/1.5 MB
Progress (1): 1.5 MB    
                    
Downloaded from eclipse-maven-central: https://repo.eclipse.org/content/repositories/maven_central/com/google/guava/guava/10.0.1/guava-10.0.1.jar (1.5 MB at 6.1 MB/s)
00:29:31 [INFO] 
00:29:31 [INFO] -------< org.eclipse.egerrit:org.eclipse.egerrit.ui.rcptt.tests >-------
00:29:31 [INFO] Building org.eclipse.egerrit.ui.rcptt.tests 1.4.0-SNAPSHOT
00:29:31 [INFO] -----------------------------[ rcpttTest ]------------------------------
00:29:31 Downloading from eclipse-cbi-releases: https://repo.eclipse.org/content/groups/cbi/org/apache/maven/plugins/maven-install-plugin/maven-metadata.xml
00:29:31 Downloading from rcptt-releases: https://repo.eclipse.org/content/repositories/rcptt-releases/org/apache/maven/plugins/maven-install-plugin/maven-metadata.xml
00:29:31 Downloading from eclipse-maven-central: https://repo.eclipse.org/content/repositories/maven_central/org/apache/maven/plugins/maven-install-plugin/maven-metadata.xml
00:29:31 Downloading from rcptt-snapshots: https://repo.eclipse.org/content/repositories/rcptt-snapshots/org/apache/maven/plugins/maven-install-plugin/maven-metadata.xml
00:29:31 Progress (1): 663 B
                   
Downloaded from eclipse-maven-central: https://repo.eclipse.org/content/repositories/maven_central/org/apache/maven/plugins/maven-install-plugin/maven-metadata.xml (663 B at 29 kB/s)
00:29:31 Downloading from rcptt-releases: https://repo.eclipse.org/content/repositories/rcptt-releases/org/apache/maven/plugins/maven-install-plugin/3.0.0-M1/maven-install-plugin-3.0.0-M1.pom
00:29:31 Downloading from rcptt-snapshots: https://repo.eclipse.org/content/repositories/rcptt-snapshots/org/apache/maven/plugins/maven-install-plugin/3.0.0-M1/maven-install-plugin-3.0.0-M1.pom
00:29:31 Downloading from eclipse-cbi-releases: https://repo.eclipse.org/content/groups/cbi/org/apache/maven/plugins/maven-install-plugin/3.0.0-M1/maven-install-plugin-3.0.0-M1.pom
00:29:31 Downloading from eclipse-maven-central: https://repo.eclipse.org/content/repositories/maven_central/org/apache/maven/plugins/maven-install-plugin/3.0.0-M1/maven-install-plugin-3.0.0-M1.pom
00:29:31 Progress (1): 4.1/6.2 kB
Progress (1): 6.2 kB    
                    
Downloaded from eclipse-maven-central: https://repo.eclipse.org/content/repositories/maven_central/org/apache/maven/plugins/maven-install-plugin/3.0.0-M1/maven-install-plugin-3.0.0-M1.pom (6.2 kB at 147 kB/s)
00:29:31 Downloading from rcptt-releases: https://repo.eclipse.org/content/repositories/rcptt-releases/org/apache/maven/plugins/maven-plugins/33/maven-plugins-33.pom
00:29:31 Downloading from rcptt-snapshots: https://repo.eclipse.org/content/repositories/rcptt-snapshots/org/apache/maven/plugins/maven-plugins/33/maven-plugins-33.pom
00:29:31 Downloading from eclipse-cbi-releases: https://repo.eclipse.org/content/groups/cbi/org/apache/maven/plugins/maven-plugins/33/maven-plugins-33.pom
00:29:31 Downloading from eclipse-maven-central: https://repo.eclipse.org/content/repositories/maven_central/org/apache/maven/plugins/maven-plugins/33/maven-plugins-33.pom
00:29:31 Progress (1): 4.1/11 kB
Progress (1): 7.7/11 kB
Progress (1): 11 kB    
                   
Downloaded from eclipse-maven-central: https://repo.eclipse.org/content/repositories/maven_central/org/apache/maven/plugins/maven-plugins/33/maven-plugins-33.pom (11 kB at 254 kB/s)
00:29:31 Downloading from rcptt-releases: https://repo.eclipse.org/content/repositories/rcptt-releases/org/apache/maven/maven-parent/33/maven-parent-33.pom
00:29:31 Downloading from rcptt-snapshots: https://repo.eclipse.org/content/repositories/rcptt-snapshots/org/apache/maven/maven-parent/33/maven-parent-33.pom
00:29:31 Downloading from eclipse-cbi-releases: https://repo.eclipse.org/content/groups/cbi/org/apache/maven/maven-parent/33/maven-parent-33.pom
00:29:31 Downloading from eclipse-maven-central: https://repo.eclipse.org/content/repositories/maven_central/org/apache/maven/maven-parent/33/maven-parent-33.pom
00:29:32 Progress (1): 4.1/44 kB
Progress (1): 7.7/44 kB
Progress (1): 12/44 kB 
Progress (1): 16/44 kB
Progress (1): 20/44 kB
Progress (1): 24/44 kB
Progress (1): 28/44 kB
Progress (1): 32/44 kB
Progress (1): 36/44 kB
Progress (1): 40/44 kB
Progress (1): 44/44 kB
Progress (1): 44 kB   
                   
Downloaded from eclipse-maven-central: https://repo.eclipse.org/content/repositories/maven_central/org/apache/maven/maven-parent/33/maven-parent-33.pom (44 kB at 1.0 MB/s)
00:29:32 Downloading from rcptt-releases: https://repo.eclipse.org/content/repositories/rcptt-releases/org/apache/apache/21/apache-21.pom
00:29:32 Downloading from rcptt-snapshots: https://repo.eclipse.org/content/repositories/rcptt-snapshots/org/apache/apache/21/apache-21.pom
00:29:32 Downloading from eclipse-cbi-releases: https://repo.eclipse.org/content/groups/cbi/org/apache/apache/21/apache-21.pom
00:29:32 Downloading from eclipse-maven-central: https://repo.eclipse.org/content/repositories/maven_central/org/apache/apache/21/apache-21.pom
00:29:32 Progress (1): 4.1/17 kB
Progress (1): 7.7/17 kB
Progress (1): 12/17 kB 
Progress (1): 16/17 kB
Progress (1): 17 kB   
                   
Downloaded from eclipse-maven-central: https://repo.eclipse.org/content/repositories/maven_central/org/apache/apache/21/apache-21.pom (17 kB at 349 kB/s)
00:29:32 Downloading from rcptt-releases: https://repo.eclipse.org/content/repositories/rcptt-releases/org/apache/maven/plugins/maven-install-plugin/3.0.0-M1/maven-install-plugin-3.0.0-M1.jar
00:29:32 Downloading from rcptt-snapshots: https://repo.eclipse.org/content/repositories/rcptt-snapshots/org/apache/maven/plugins/maven-install-plugin/3.0.0-M1/maven-install-plugin-3.0.0-M1.jar
00:29:32 Downloading from eclipse-cbi-releases: https://repo.eclipse.org/content/groups/cbi/org/apache/maven/plugins/maven-install-plugin/3.0.0-M1/maven-install-plugin-3.0.0-M1.jar
00:29:32 Downloading from eclipse-maven-central: https://repo.eclipse.org/content/repositories/maven_central/org/apache/maven/plugins/maven-install-plugin/3.0.0-M1/maven-install-plugin-3.0.0-M1.jar
00:29:32 Progress (1): 4.1/29 kB
Progress (1): 7.7/29 kB
Progress (1): 12/29 kB 
Progress (1): 16/29 kB
Progress (1): 20/29 kB
Progress (1): 24/29 kB
Progress (1): 28/29 kB
Progress (1): 29 kB   
                   
Downloaded from eclipse-maven-central: https://repo.eclipse.org/content/repositories/maven_central/org/apache/maven/plugins/maven-install-plugin/3.0.0-M1/maven-install-plugin-3.0.0-M1.jar (29 kB at 718 kB/s)
00:29:32 Downloading from rcptt-releases: https://repo.eclipse.org/content/repositories/rcptt-releases/org/apache/maven/plugins/maven-deploy-plugin/maven-metadata.xml
00:29:32 Downloading from eclipse-cbi-releases: https://repo.eclipse.org/content/groups/cbi/org/apache/maven/plugins/maven-deploy-plugin/maven-metadata.xml
00:29:32 Downloading from eclipse-maven-central: https://repo.eclipse.org/content/repositories/maven_central/org/apache/maven/plugins/maven-deploy-plugin/maven-metadata.xml
00:29:32 Downloading from rcptt-snapshots: https://repo.eclipse.org/content/repositories/rcptt-snapshots/org/apache/maven/plugins/maven-deploy-plugin/maven-metadata.xml
00:29:32 Progress (1): 749 B
                   
Downloaded from eclipse-maven-central: https://repo.eclipse.org/content/repositories/maven_central/org/apache/maven/plugins/maven-deploy-plugin/maven-metadata.xml (749 B at 18 kB/s)
00:29:32 Downloading from rcptt-releases: https://repo.eclipse.org/content/repositories/rcptt-releases/org/apache/maven/plugins/maven-deploy-plugin/3.0.0-M1/maven-deploy-plugin-3.0.0-M1.pom
00:29:32 Downloading from rcptt-snapshots: https://repo.eclipse.org/content/repositories/rcptt-snapshots/org/apache/maven/plugins/maven-deploy-plugin/3.0.0-M1/maven-deploy-plugin-3.0.0-M1.pom
00:29:32 Downloading from eclipse-cbi-releases: https://repo.eclipse.org/content/groups/cbi/org/apache/maven/plugins/maven-deploy-plugin/3.0.0-M1/maven-deploy-plugin-3.0.0-M1.pom
00:29:32 Downloading from eclipse-maven-central: https://repo.eclipse.org/content/repositories/maven_central/org/apache/maven/plugins/maven-deploy-plugin/3.0.0-M1/maven-deploy-plugin-3.0.0-M1.pom
00:29:32 Progress (1): 4.1/7.8 kB
Progress (1): 7.7/7.8 kB
Progress (1): 7.8 kB    
                    
Downloaded from eclipse-maven-central: https://repo.eclipse.org/content/repositories/maven_central/org/apache/maven/plugins/maven-deploy-plugin/3.0.0-M1/maven-deploy-plugin-3.0.0-M1.pom (7.8 kB at 191 kB/s)
00:29:32 Downloading from rcptt-releases: https://repo.eclipse.org/content/repositories/rcptt-releases/org/apache/maven/plugins/maven-deploy-plugin/3.0.0-M1/maven-deploy-plugin-3.0.0-M1.jar
00:29:32 Downloading from rcptt-snapshots: https://repo.eclipse.org/content/repositories/rcptt-snapshots/org/apache/maven/plugins/maven-deploy-plugin/3.0.0-M1/maven-deploy-plugin-3.0.0-M1.jar
00:29:32 Downloading from eclipse-cbi-releases: https://repo.eclipse.org/content/groups/cbi/org/apache/maven/plugins/maven-deploy-plugin/3.0.0-M1/maven-deploy-plugin-3.0.0-M1.jar
00:29:32 Downloading from eclipse-maven-central: https://repo.eclipse.org/content/repositories/maven_central/org/apache/maven/plugins/maven-deploy-plugin/3.0.0-M1/maven-deploy-plugin-3.0.0-M1.jar
00:29:32 Progress (1): 4.1/34 kB
Progress (1): 7.7/34 kB
Progress (1): 12/34 kB 
Progress (1): 16/34 kB
Progress (1): 20/34 kB
Progress (1): 24/34 kB
Progress (1): 28/34 kB
Progress (1): 32/34 kB
Progress (1): 34 kB   
                   
Downloaded from eclipse-maven-central: https://repo.eclipse.org/content/repositories/maven_central/org/apache/maven/plugins/maven-deploy-plugin/3.0.0-M1/maven-deploy-plugin-3.0.0-M1.jar (34 kB at 857 kB/s)
00:29:32 Downloading from rcptt-releases: https://repo.eclipse.org/content/repositories/rcptt-releases/org/apache/maven/plugins/maven-dependency-plugin/2.10/maven-dependency-plugin-2.10.pom
00:29:32 Downloading from rcptt-snapshots: https://repo.eclipse.org/content/repositories/rcptt-snapshots/org/apache/maven/plugins/maven-dependency-plugin/2.10/maven-dependency-plugin-2.10.pom
00:29:32 Downloading from eclipse-cbi-releases: https://repo.eclipse.org/content/groups/cbi/org/apache/maven/plugins/maven-dependency-plugin/2.10/maven-dependency-plugin-2.10.pom
00:29:32 Downloading from eclipse-maven-central: https://repo.eclipse.org/content/repositories/maven_central/org/apache/maven/plugins/maven-dependency-plugin/2.10/maven-dependency-plugin-2.10.pom
00:29:32 Progress (1): 4.1/12 kB
Progress (1): 7.7/12 kB
Progress (1): 12/12 kB 
Progress (1): 12 kB   
                   
Downloaded from eclipse-maven-central: https://repo.eclipse.org/content/repositories/maven_central/org/apache/maven/plugins/maven-dependency-plugin/2.10/maven-dependency-plugin-2.10.pom (12 kB at 387 kB/s)
00:29:32 Downloading from rcptt-releases: https://repo.eclipse.org/content/repositories/rcptt-releases/org/apache/maven/plugins/maven-plugins/27/maven-plugins-27.pom
00:29:32 Downloading from rcptt-snapshots: https://repo.eclipse.org/content/repositories/rcptt-snapshots/org/apache/maven/plugins/maven-plugins/27/maven-plugins-27.pom
00:29:32 Downloading from eclipse-cbi-releases: https://repo.eclipse.org/content/groups/cbi/org/apache/maven/plugins/maven-plugins/27/maven-plugins-27.pom
00:29:32 Downloading from eclipse-maven-central: https://repo.eclipse.org/content/repositories/maven_central/org/apache/maven/plugins/maven-plugins/27/maven-plugins-27.pom
00:29:32 Progress (1): 4.1/11 kB
Progress (1): 7.7/11 kB
Progress (1): 11 kB    
                   
Downloaded from eclipse-maven-central: https://repo.eclipse.org/content/repositories/maven_central/org/apache/maven/plugins/maven-plugins/27/maven-plugins-27.pom (11 kB at 379 kB/s)
00:29:32 Downloading from rcptt-releases: https://repo.eclipse.org/content/repositories/rcptt-releases/org/apache/maven/plugins/maven-dependency-plugin/2.10/maven-dependency-plugin-2.10.jar
00:29:32 Downloading from rcptt-snapshots: https://repo.eclipse.org/content/repositories/rcptt-snapshots/org/apache/maven/plugins/maven-dependency-plugin/2.10/maven-dependency-plugin-2.10.jar
00:29:32 Downloading from eclipse-cbi-releases: https://repo.eclipse.org/content/groups/cbi/org/apache/maven/plugins/maven-dependency-plugin/2.10/maven-dependency-plugin-2.10.jar
00:29:32 Downloading from eclipse-maven-central: https://repo.eclipse.org/content/repositories/maven_central/org/apache/maven/plugins/maven-dependency-plugin/2.10/maven-dependency-plugin-2.10.jar
00:29:32 Progress (1): 4.1/160 kB
Progress (1): 7.7/160 kB
Progress (1): 12/160 kB 
Progress (1): 16/160 kB
Progress (1): 20/160 kB
Progress (1): 24/160 kB
Progress (1): 28/160 kB
Progress (1): 32/160 kB
Progress (1): 36/160 kB
Progress (1): 40/160 kB
Progress (1): 44/160 kB
Progress (1): 48/160 kB
Progress (1): 52/160 kB
Progress (1): 56/160 kB
Progress (1): 60/160 kB
Progress (1): 64/160 kB
Progress (1): 68/160 kB
Progress (1): 72/160 kB
Progress (1): 76/160 kB
Progress (1): 80/160 kB
Progress (1): 84/160 kB
Progress (1): 88/160 kB
Progress (1): 92/160 kB
Progress (1): 96/160 kB
Progress (1): 100/160 kB
Progress (1): 104/160 kB
Progress (1): 108/160 kB
Progress (1): 112/160 kB
Progress (1): 116/160 kB
Progress (1): 120/160 kB
Progress (1): 124/160 kB
Progress (1): 128/160 kB
Progress (1): 132/160 kB
Progress (1): 136/160 kB
Progress (1): 140/160 kB
Progress (1): 144/160 kB
Progress (1): 148/160 kB
Progress (1): 152/160 kB
Progress (1): 156/160 kB
Progress (1): 160/160 kB
Progress (1): 160 kB    
                    
Downloaded from eclipse-maven-central: https://repo.eclipse.org/content/repositories/maven_central/org/apache/maven/plugins/maven-dependency-plugin/2.10/maven-dependency-plugin-2.10.jar (160 kB at 4.2 MB/s)
00:29:32 [INFO] 
00:29:32 [INFO] --- maven-clean-plugin:2.5:clean (default-clean) @ org.eclipse.egerrit.ui.rcptt.tests ---
00:29:32 [INFO] 
00:29:32 [INFO] --- maven-enforcer-plugin:1.4.1:enforce (enforce-maven) @ org.eclipse.egerrit.ui.rcptt.tests ---
00:29:33 [INFO] 
00:29:33 [INFO] --- jacoco-maven-plugin:0.7.4.201502262128:prepare-agent (pre-test) @ org.eclipse.egerrit.ui.rcptt.tests ---
00:29:33 [INFO] argLine set to -javaagent:/home/hudson/genie.egerrit/.jenkins/jobs/EGerrit/workspace/.repository/org/jacoco/org.jacoco.agent/0.7.4.201502262128/org.jacoco.agent-0.7.4.201502262128-runtime.jar=destfile=/jobs/genie.egerrit/EGerrit/workspace/org.eclipse.egerrit.ui.rcptt.tests/../target/jacoco.exec,append=true,includes=org.eclipse.egerrit.*
00:29:33 [INFO] 
00:29:33 [INFO] --- rcptt-maven-plugin:2.1.0:resources (default-resources) @ org.eclipse.egerrit.ui.rcptt.tests ---
00:29:33 [INFO] Downloading artifact from http://download.eclipse.org/eclipse/downloads/drops4/R-4.6.3-201703010400/eclipse-SDK-4.6.3-linux-gtk-x86_64.tar.gz...
00:29:33 [INFO] ------------------------------------------------------------------------
00:29:33 [INFO] BUILD FAILURE
00:29:33 [INFO] ------------------------------------------------------------------------
00:29:33 [INFO] Total time: 6.466 s
00:29:33 [INFO] Finished at: 2018-10-05T00:29:33-04:00
00:29:33 [INFO] ------------------------------------------------------------------------
00:29:33 [ERROR] Failed to execute goal org.eclipse.rcptt:rcptt-maven-plugin:2.1.0:resources (default-resources) on project org.eclipse.egerrit.ui.rcptt.tests: Download failed: http://download.eclipse.org/eclipse/downloads/drops4/R-4.6.3-201703010400/eclipse-SDK-4.6.3-linux-gtk-x86_64.tar.gz -> [Help 1]
00:29:33 [ERROR] 
00:29:33 [ERROR] To see the full stack trace of the errors, re-run Maven with the -e switch.
00:29:33 [ERROR] Re-run Maven using the -X switch to enable full debug logging.
00:29:33 [ERROR] 
00:29:33 [ERROR] For more information about the errors and possible solutions, please read the following articles:
00:29:33 [ERROR] [Help 1] http://cwiki.apache.org/confluence/display/MAVEN/MojoExecutionException
00:29:33 Build step 'Invoke top-level Maven targets' marked build as failure
00:29:33 Terminating xvnc.
00:29:33 Not sending mail to unregistered user lmcbout@gmail.com
00:29:33 Sending e-mails to: lmcbout@gmail.com pascal@rapicorp.com patrick.pollo.guilbert@ericsson.com
00:29:34 Recording test results
00:29:34 ERROR: Step ‘Publish JUnit test result report’ failed: No test report files were found. Configuration error?
00:29:34 Archiving artifacts
00:29:34 Started calculate disk usage of build
00:29:34 Finished Calculation of disk usage of build in 0 seconds
00:29:35 Started calculate disk usage of workspace
00:29:35 Finished Calculation of disk usage of workspace in 0 seconds
00:29:36 Finished: FAILURE