FailedConsole Output

Skipping 1,246 KB.. Full Log
/egerrit7670029676480572743.tmp
00:22:56 org.eclipse.jgit.api.errors.TransportException: http://104.154.18.211:28115/egerrit/test: error occurred during unpacking on the remote end: error No space left on device
00:22:56 Tests run: 1, Failures: 1, Errors: 0, Skipped: 0, Time elapsed: 0.697 sec <<< FAILURE! - in org.eclipse.egerrit.core.command.tests.SubmitCommandTest
00:22:56 testCall(org.eclipse.egerrit.core.command.tests.SubmitCommandTest)  Time elapsed: 0.696 sec  <<< FAILURE!
00:22:56 java.lang.AssertionError: http://104.154.18.211:28115/egerrit/test: error occurred during unpacking on the remote end: error No space left on device
00:22:56 	at org.junit.Assert.fail(Assert.java:88)
00:22:56 	at org.eclipse.egerrit.core.command.tests.CommandTest.createReviewWithSimpleFile(CommandTest.java:111)
00:22:56 	at org.eclipse.egerrit.core.command.tests.CommandTestWithSimpleReview.createReview(CommandTestWithSimpleReview.java:19)
00:22:56 	at sun.reflect.GeneratedMethodAccessor9.invoke(Unknown Source)
00:22:56 	at sun.reflect.DelegatingMethodAccessorImpl.invoke(DelegatingMethodAccessorImpl.java:43)
00:22:56 	at java.lang.reflect.Method.invoke(Method.java:498)
00:22:56 	at org.junit.runners.model.FrameworkMethod$1.runReflectiveCall(FrameworkMethod.java:50)
00:22:56 	at org.junit.internal.runners.model.ReflectiveCallable.run(ReflectiveCallable.java:12)
00:22:56 	at org.junit.runners.model.FrameworkMethod.invokeExplosively(FrameworkMethod.java:47)
00:22:56 	at org.junit.internal.runners.statements.RunBefores.evaluate(RunBefores.java:24)
00:22:56 	at org.junit.internal.runners.statements.RunAfters.evaluate(RunAfters.java:27)
00:22:56 	at org.junit.runners.ParentRunner.runLeaf(ParentRunner.java:325)
00:22:56 	at org.junit.runners.BlockJUnit4ClassRunner.runChild(BlockJUnit4ClassRunner.java:78)
00:22:56 	at org.junit.runners.BlockJUnit4ClassRunner.runChild(BlockJUnit4ClassRunner.java:57)
00:22:56 	at org.junit.runners.ParentRunner$3.run(ParentRunner.java:290)
00:22:56 	at org.junit.runners.ParentRunner$1.schedule(ParentRunner.java:71)
00:22:56 	at org.junit.runners.ParentRunner.runChildren(ParentRunner.java:288)
00:22:56 	at org.junit.runners.ParentRunner.access$000(ParentRunner.java:58)
00:22:56 	at org.junit.runners.ParentRunner$2.evaluate(ParentRunner.java:268)
00:22:56 	at org.junit.runners.ParentRunner.run(ParentRunner.java:363)
00:22:56 	at org.apache.maven.surefire.junit4.JUnit4Provider.execute(JUnit4Provider.java:264)
00:22:56 	at org.apache.maven.surefire.junit4.JUnit4Provider.executeTestSet(JUnit4Provider.java:153)
00:22:56 	at org.apache.maven.surefire.junit4.JUnit4Provider.invoke(JUnit4Provider.java:124)
00:22:56 	at sun.reflect.NativeMethodAccessorImpl.invoke0(Native Method)
00:22:56 	at sun.reflect.NativeMethodAccessorImpl.invoke(NativeMethodAccessorImpl.java:62)
00:22:56 	at sun.reflect.DelegatingMethodAccessorImpl.invoke(DelegatingMethodAccessorImpl.java:43)
00:22:56 	at java.lang.reflect.Method.invoke(Method.java:498)
00:22:56 	at org.apache.maven.surefire.util.ReflectionUtils.invokeMethodWithArray2(ReflectionUtils.java:208)
00:22:56 	at org.apache.maven.surefire.booter.ProviderFactory$ProviderProxy.invoke(ProviderFactory.java:156)
00:22:56 	at org.apache.maven.surefire.booter.ProviderFactory.invokeProvider(ProviderFactory.java:82)
00:22:56 	at org.eclipse.tycho.surefire.osgibooter.OsgiSurefireBooter.run(OsgiSurefireBooter.java:95)
00:22:56 	at org.eclipse.tycho.surefire.osgibooter.HeadlessTestApplication.run(HeadlessTestApplication.java:21)
00:22:56 	at sun.reflect.NativeMethodAccessorImpl.invoke0(Native Method)
00:22:56 	at sun.reflect.NativeMethodAccessorImpl.invoke(NativeMethodAccessorImpl.java:62)
00:22:56 	at sun.reflect.DelegatingMethodAccessorImpl.invoke(DelegatingMethodAccessorImpl.java:43)
00:22:56 	at java.lang.reflect.Method.invoke(Method.java:498)
00:22:56 	at org.eclipse.equinox.internal.app.EclipseAppContainer.callMethodWithException(EclipseAppContainer.java:587)
00:22:56 	at org.eclipse.equinox.internal.app.EclipseAppHandle.run(EclipseAppHandle.java:198)
00:22:56 	at org.eclipse.core.runtime.internal.adaptor.EclipseAppLauncher.runApplication(EclipseAppLauncher.java:134)
00:22:56 	at org.eclipse.core.runtime.internal.adaptor.EclipseAppLauncher.start(EclipseAppLauncher.java:104)
00:22:56 	at org.eclipse.core.runtime.adaptor.EclipseStarter.run(EclipseStarter.java:388)
00:22:56 	at org.eclipse.core.runtime.adaptor.EclipseStarter.run(EclipseStarter.java:243)
00:22:56 	at sun.reflect.NativeMethodAccessorImpl.invoke0(Native Method)
00:22:56 	at sun.reflect.NativeMethodAccessorImpl.invoke(NativeMethodAccessorImpl.java:62)
00:22:56 	at sun.reflect.DelegatingMethodAccessorImpl.invoke(DelegatingMethodAccessorImpl.java:43)
00:22:56 	at java.lang.reflect.Method.invoke(Method.java:498)
00:22:56 	at org.eclipse.equinox.launcher.Main.invokeFramework(Main.java:653)
00:22:56 	at org.eclipse.equinox.launcher.Main.basicRun(Main.java:590)
00:22:56 	at org.eclipse.equinox.launcher.Main.run(Main.java:1499)
00:22:56 	at org.eclipse.equinox.launcher.Main.main(Main.java:1472)
00:22:56 
00:22:56 Running org.eclipse.egerrit.core.command.tests.GetRevisionActionsCommandTest
00:22:56 Checking out http://104.154.18.211:28115/egerrit/test into /tmp/genie.egerrit/egerrit4638585478231254028.tmp
00:22:57 org.eclipse.jgit.api.errors.TransportException: http://104.154.18.211:28115/egerrit/test: error occurred during unpacking on the remote end: error No space left on device
00:22:57 Tests run: 1, Failures: 1, Errors: 0, Skipped: 0, Time elapsed: 0.733 sec <<< FAILURE! - in org.eclipse.egerrit.core.command.tests.GetRevisionActionsCommandTest
00:22:57 testCall(org.eclipse.egerrit.core.command.tests.GetRevisionActionsCommandTest)  Time elapsed: 0.731 sec  <<< FAILURE!
00:22:57 java.lang.AssertionError: http://104.154.18.211:28115/egerrit/test: error occurred during unpacking on the remote end: error No space left on device
00:22:57 	at org.junit.Assert.fail(Assert.java:88)
00:22:57 	at org.eclipse.egerrit.core.command.tests.CommandTest.createReviewWithSimpleFile(CommandTest.java:111)
00:22:57 	at org.eclipse.egerrit.core.command.tests.CommandTestWithSimpleReview.createReview(CommandTestWithSimpleReview.java:19)
00:22:57 	at sun.reflect.GeneratedMethodAccessor9.invoke(Unknown Source)
00:22:57 	at sun.reflect.DelegatingMethodAccessorImpl.invoke(DelegatingMethodAccessorImpl.java:43)
00:22:57 	at java.lang.reflect.Method.invoke(Method.java:498)
00:22:57 	at org.junit.runners.model.FrameworkMethod$1.runReflectiveCall(FrameworkMethod.java:50)
00:22:57 	at org.junit.internal.runners.model.ReflectiveCallable.run(ReflectiveCallable.java:12)
00:22:57 	at org.junit.runners.model.FrameworkMethod.invokeExplosively(FrameworkMethod.java:47)
00:22:57 	at org.junit.internal.runners.statements.RunBefores.evaluate(RunBefores.java:24)
00:22:57 	at org.junit.internal.runners.statements.RunAfters.evaluate(RunAfters.java:27)
00:22:57 	at org.junit.runners.ParentRunner.runLeaf(ParentRunner.java:325)
00:22:57 	at org.junit.runners.BlockJUnit4ClassRunner.runChild(BlockJUnit4ClassRunner.java:78)
00:22:57 	at org.junit.runners.BlockJUnit4ClassRunner.runChild(BlockJUnit4ClassRunner.java:57)
00:22:57 	at org.junit.runners.ParentRunner$3.run(ParentRunner.java:290)
00:22:57 	at org.junit.runners.ParentRunner$1.schedule(ParentRunner.java:71)
00:22:57 	at org.junit.runners.ParentRunner.runChildren(ParentRunner.java:288)
00:22:57 	at org.junit.runners.ParentRunner.access$000(ParentRunner.java:58)
00:22:57 	at org.junit.runners.ParentRunner$2.evaluate(ParentRunner.java:268)
00:22:57 	at org.junit.runners.ParentRunner.run(ParentRunner.java:363)
00:22:57 	at org.apache.maven.surefire.junit4.JUnit4Provider.execute(JUnit4Provider.java:264)
00:22:57 	at org.apache.maven.surefire.junit4.JUnit4Provider.executeTestSet(JUnit4Provider.java:153)
00:22:57 	at org.apache.maven.surefire.junit4.JUnit4Provider.invoke(JUnit4Provider.java:124)
00:22:57 	at sun.reflect.NativeMethodAccessorImpl.invoke0(Native Method)
00:22:57 	at sun.reflect.NativeMethodAccessorImpl.invoke(NativeMethodAccessorImpl.java:62)
00:22:57 	at sun.reflect.DelegatingMethodAccessorImpl.invoke(DelegatingMethodAccessorImpl.java:43)
00:22:57 	at java.lang.reflect.Method.invoke(Method.java:498)
00:22:57 	at org.apache.maven.surefire.util.ReflectionUtils.invokeMethodWithArray2(ReflectionUtils.java:208)
00:22:57 	at org.apache.maven.surefire.booter.ProviderFactory$ProviderProxy.invoke(ProviderFactory.java:156)
00:22:57 	at org.apache.maven.surefire.booter.ProviderFactory.invokeProvider(ProviderFactory.java:82)
00:22:57 	at org.eclipse.tycho.surefire.osgibooter.OsgiSurefireBooter.run(OsgiSurefireBooter.java:95)
00:22:57 	at org.eclipse.tycho.surefire.osgibooter.HeadlessTestApplication.run(HeadlessTestApplication.java:21)
00:22:57 	at sun.reflect.NativeMethodAccessorImpl.invoke0(Native Method)
00:22:57 	at sun.reflect.NativeMethodAccessorImpl.invoke(NativeMethodAccessorImpl.java:62)
00:22:57 	at sun.reflect.DelegatingMethodAccessorImpl.invoke(DelegatingMethodAccessorImpl.java:43)
00:22:57 	at java.lang.reflect.Method.invoke(Method.java:498)
00:22:57 	at org.eclipse.equinox.internal.app.EclipseAppContainer.callMethodWithException(EclipseAppContainer.java:587)
00:22:57 	at org.eclipse.equinox.internal.app.EclipseAppHandle.run(EclipseAppHandle.java:198)
00:22:57 	at org.eclipse.core.runtime.internal.adaptor.EclipseAppLauncher.runApplication(EclipseAppLauncher.java:134)
00:22:57 	at org.eclipse.core.runtime.internal.adaptor.EclipseAppLauncher.start(EclipseAppLauncher.java:104)
00:22:57 	at org.eclipse.core.runtime.adaptor.EclipseStarter.run(EclipseStarter.java:388)
00:22:57 	at org.eclipse.core.runtime.adaptor.EclipseStarter.run(EclipseStarter.java:243)
00:22:57 	at sun.reflect.NativeMethodAccessorImpl.invoke0(Native Method)
00:22:57 	at sun.reflect.NativeMethodAccessorImpl.invoke(NativeMethodAccessorImpl.java:62)
00:22:57 	at sun.reflect.DelegatingMethodAccessorImpl.invoke(DelegatingMethodAccessorImpl.java:43)
00:22:57 	at java.lang.reflect.Method.invoke(Method.java:498)
00:22:57 	at org.eclipse.equinox.launcher.Main.invokeFramework(Main.java:653)
00:22:57 	at org.eclipse.equinox.launcher.Main.basicRun(Main.java:590)
00:22:57 	at org.eclipse.equinox.launcher.Main.run(Main.java:1499)
00:22:57 	at org.eclipse.equinox.launcher.Main.main(Main.java:1472)
00:22:57 
00:22:57 Running org.eclipse.egerrit.core.command.tests.RevertCommandTest
00:22:57 Checking out http://104.154.18.211:28115/egerrit/test into /tmp/genie.egerrit/egerrit9024987832728489212.tmp
00:22:58 org.eclipse.jgit.api.errors.TransportException: http://104.154.18.211:28115/egerrit/test: error occurred during unpacking on the remote end: error No space left on device
00:22:58 Tests run: 1, Failures: 1, Errors: 0, Skipped: 0, Time elapsed: 0.746 sec <<< FAILURE! - in org.eclipse.egerrit.core.command.tests.RevertCommandTest
00:22:58 testCall(org.eclipse.egerrit.core.command.tests.RevertCommandTest)  Time elapsed: 0.745 sec  <<< FAILURE!
00:22:58 java.lang.AssertionError: http://104.154.18.211:28115/egerrit/test: error occurred during unpacking on the remote end: error No space left on device
00:22:58 	at org.junit.Assert.fail(Assert.java:88)
00:22:58 	at org.eclipse.egerrit.core.command.tests.CommandTest.createReviewWithSimpleFile(CommandTest.java:111)
00:22:58 	at org.eclipse.egerrit.core.command.tests.CommandTestWithSimpleReview.createReview(CommandTestWithSimpleReview.java:19)
00:22:58 	at sun.reflect.GeneratedMethodAccessor9.invoke(Unknown Source)
00:22:58 	at sun.reflect.DelegatingMethodAccessorImpl.invoke(DelegatingMethodAccessorImpl.java:43)
00:22:58 	at java.lang.reflect.Method.invoke(Method.java:498)
00:22:58 	at org.junit.runners.model.FrameworkMethod$1.runReflectiveCall(FrameworkMethod.java:50)
00:22:58 	at org.junit.internal.runners.model.ReflectiveCallable.run(ReflectiveCallable.java:12)
00:22:58 	at org.junit.runners.model.FrameworkMethod.invokeExplosively(FrameworkMethod.java:47)
00:22:58 	at org.junit.internal.runners.statements.RunBefores.evaluate(RunBefores.java:24)
00:22:58 	at org.junit.internal.runners.statements.RunAfters.evaluate(RunAfters.java:27)
00:22:58 	at org.junit.runners.ParentRunner.runLeaf(ParentRunner.java:325)
00:22:58 	at org.junit.runners.BlockJUnit4ClassRunner.runChild(BlockJUnit4ClassRunner.java:78)
00:22:58 	at org.junit.runners.BlockJUnit4ClassRunner.runChild(BlockJUnit4ClassRunner.java:57)
00:22:58 	at org.junit.runners.ParentRunner$3.run(ParentRunner.java:290)
00:22:58 	at org.junit.runners.ParentRunner$1.schedule(ParentRunner.java:71)
00:22:58 	at org.junit.runners.ParentRunner.runChildren(ParentRunner.java:288)
00:22:58 	at org.junit.runners.ParentRunner.access$000(ParentRunner.java:58)
00:22:58 	at org.junit.runners.ParentRunner$2.evaluate(ParentRunner.java:268)
00:22:58 	at org.junit.runners.ParentRunner.run(ParentRunner.java:363)
00:22:58 	at org.apache.maven.surefire.junit4.JUnit4Provider.execute(JUnit4Provider.java:264)
00:22:58 	at org.apache.maven.surefire.junit4.JUnit4Provider.executeTestSet(JUnit4Provider.java:153)
00:22:58 	at org.apache.maven.surefire.junit4.JUnit4Provider.invoke(JUnit4Provider.java:124)
00:22:58 	at sun.reflect.NativeMethodAccessorImpl.invoke0(Native Method)
00:22:58 	at sun.reflect.NativeMethodAccessorImpl.invoke(NativeMethodAccessorImpl.java:62)
00:22:58 	at sun.reflect.DelegatingMethodAccessorImpl.invoke(DelegatingMethodAccessorImpl.java:43)
00:22:58 	at java.lang.reflect.Method.invoke(Method.java:498)
00:22:58 	at org.apache.maven.surefire.util.ReflectionUtils.invokeMethodWithArray2(ReflectionUtils.java:208)
00:22:58 	at org.apache.maven.surefire.booter.ProviderFactory$ProviderProxy.invoke(ProviderFactory.java:156)
00:22:58 	at org.apache.maven.surefire.booter.ProviderFactory.invokeProvider(ProviderFactory.java:82)
00:22:58 	at org.eclipse.tycho.surefire.osgibooter.OsgiSurefireBooter.run(OsgiSurefireBooter.java:95)
00:22:58 	at org.eclipse.tycho.surefire.osgibooter.HeadlessTestApplication.run(HeadlessTestApplication.java:21)
00:22:58 	at sun.reflect.NativeMethodAccessorImpl.invoke0(Native Method)
00:22:58 	at sun.reflect.NativeMethodAccessorImpl.invoke(NativeMethodAccessorImpl.java:62)
00:22:58 	at sun.reflect.DelegatingMethodAccessorImpl.invoke(DelegatingMethodAccessorImpl.java:43)
00:22:58 	at java.lang.reflect.Method.invoke(Method.java:498)
00:22:58 	at org.eclipse.equinox.internal.app.EclipseAppContainer.callMethodWithException(EclipseAppContainer.java:587)
00:22:58 	at org.eclipse.equinox.internal.app.EclipseAppHandle.run(EclipseAppHandle.java:198)
00:22:58 	at org.eclipse.core.runtime.internal.adaptor.EclipseAppLauncher.runApplication(EclipseAppLauncher.java:134)
00:22:58 	at org.eclipse.core.runtime.internal.adaptor.EclipseAppLauncher.start(EclipseAppLauncher.java:104)
00:22:58 	at org.eclipse.core.runtime.adaptor.EclipseStarter.run(EclipseStarter.java:388)
00:22:58 	at org.eclipse.core.runtime.adaptor.EclipseStarter.run(EclipseStarter.java:243)
00:22:58 	at sun.reflect.NativeMethodAccessorImpl.invoke0(Native Method)
00:22:58 	at sun.reflect.NativeMethodAccessorImpl.invoke(NativeMethodAccessorImpl.java:62)
00:22:58 	at sun.reflect.DelegatingMethodAccessorImpl.invoke(DelegatingMethodAccessorImpl.java:43)
00:22:58 	at java.lang.reflect.Method.invoke(Method.java:498)
00:22:58 	at org.eclipse.equinox.launcher.Main.invokeFramework(Main.java:653)
00:22:58 	at org.eclipse.equinox.launcher.Main.basicRun(Main.java:590)
00:22:58 	at org.eclipse.equinox.launcher.Main.run(Main.java:1499)
00:22:58 	at org.eclipse.equinox.launcher.Main.main(Main.java:1472)
00:22:58 
00:22:58 Running org.eclipse.egerrit.core.command.tests.UnstarCommandTest
00:22:58 Checking out http://104.154.18.211:28115/egerrit/test into /tmp/genie.egerrit/egerrit2253237992257369143.tmp
00:22:58 org.eclipse.jgit.api.errors.TransportException: http://104.154.18.211:28115/egerrit/test: error occurred during unpacking on the remote end: error No space left on device
00:22:58 Tests run: 1, Failures: 1, Errors: 0, Skipped: 0, Time elapsed: 0.617 sec <<< FAILURE! - in org.eclipse.egerrit.core.command.tests.UnstarCommandTest
00:22:58 testCall(org.eclipse.egerrit.core.command.tests.UnstarCommandTest)  Time elapsed: 0.617 sec  <<< FAILURE!
00:22:58 java.lang.AssertionError: http://104.154.18.211:28115/egerrit/test: error occurred during unpacking on the remote end: error No space left on device
00:22:58 	at org.junit.Assert.fail(Assert.java:88)
00:22:58 	at org.eclipse.egerrit.core.command.tests.CommandTest.createReviewWithSimpleFile(CommandTest.java:111)
00:22:58 	at org.eclipse.egerrit.core.command.tests.CommandTestWithSimpleReview.createReview(CommandTestWithSimpleReview.java:19)
00:22:58 	at sun.reflect.GeneratedMethodAccessor9.invoke(Unknown Source)
00:22:58 	at sun.reflect.DelegatingMethodAccessorImpl.invoke(DelegatingMethodAccessorImpl.java:43)
00:22:58 	at java.lang.reflect.Method.invoke(Method.java:498)
00:22:58 	at org.junit.runners.model.FrameworkMethod$1.runReflectiveCall(FrameworkMethod.java:50)
00:22:58 	at org.junit.internal.runners.model.ReflectiveCallable.run(ReflectiveCallable.java:12)
00:22:58 	at org.junit.runners.model.FrameworkMethod.invokeExplosively(FrameworkMethod.java:47)
00:22:58 	at org.junit.internal.runners.statements.RunBefores.evaluate(RunBefores.java:24)
00:22:58 	at org.junit.internal.runners.statements.RunAfters.evaluate(RunAfters.java:27)
00:22:58 	at org.junit.runners.ParentRunner.runLeaf(ParentRunner.java:325)
00:22:58 	at org.junit.runners.BlockJUnit4ClassRunner.runChild(BlockJUnit4ClassRunner.java:78)
00:22:58 	at org.junit.runners.BlockJUnit4ClassRunner.runChild(BlockJUnit4ClassRunner.java:57)
00:22:58 	at org.junit.runners.ParentRunner$3.run(ParentRunner.java:290)
00:22:58 	at org.junit.runners.ParentRunner$1.schedule(ParentRunner.java:71)
00:22:58 	at org.junit.runners.ParentRunner.runChildren(ParentRunner.java:288)
00:22:58 	at org.junit.runners.ParentRunner.access$000(ParentRunner.java:58)
00:22:58 	at org.junit.runners.ParentRunner$2.evaluate(ParentRunner.java:268)
00:22:58 	at org.junit.runners.ParentRunner.run(ParentRunner.java:363)
00:22:58 	at org.apache.maven.surefire.junit4.JUnit4Provider.execute(JUnit4Provider.java:264)
00:22:58 	at org.apache.maven.surefire.junit4.JUnit4Provider.executeTestSet(JUnit4Provider.java:153)
00:22:58 	at org.apache.maven.surefire.junit4.JUnit4Provider.invoke(JUnit4Provider.java:124)
00:22:58 	at sun.reflect.NativeMethodAccessorImpl.invoke0(Native Method)
00:22:58 	at sun.reflect.NativeMethodAccessorImpl.invoke(NativeMethodAccessorImpl.java:62)
00:22:58 	at sun.reflect.DelegatingMethodAccessorImpl.invoke(DelegatingMethodAccessorImpl.java:43)
00:22:58 	at java.lang.reflect.Method.invoke(Method.java:498)
00:22:58 	at org.apache.maven.surefire.util.ReflectionUtils.invokeMethodWithArray2(ReflectionUtils.java:208)
00:22:58 	at org.apache.maven.surefire.booter.ProviderFactory$ProviderProxy.invoke(ProviderFactory.java:156)
00:22:58 	at org.apache.maven.surefire.booter.ProviderFactory.invokeProvider(ProviderFactory.java:82)
00:22:58 	at org.eclipse.tycho.surefire.osgibooter.OsgiSurefireBooter.run(OsgiSurefireBooter.java:95)
00:22:58 	at org.eclipse.tycho.surefire.osgibooter.HeadlessTestApplication.run(HeadlessTestApplication.java:21)
00:22:58 	at sun.reflect.NativeMethodAccessorImpl.invoke0(Native Method)
00:22:58 	at sun.reflect.NativeMethodAccessorImpl.invoke(NativeMethodAccessorImpl.java:62)
00:22:58 	at sun.reflect.DelegatingMethodAccessorImpl.invoke(DelegatingMethodAccessorImpl.java:43)
00:22:58 	at java.lang.reflect.Method.invoke(Method.java:498)
00:22:58 	at org.eclipse.equinox.internal.app.EclipseAppContainer.callMethodWithException(EclipseAppContainer.java:587)
00:22:58 	at org.eclipse.equinox.internal.app.EclipseAppHandle.run(EclipseAppHandle.java:198)
00:22:58 	at org.eclipse.core.runtime.internal.adaptor.EclipseAppLauncher.runApplication(EclipseAppLauncher.java:134)
00:22:58 	at org.eclipse.core.runtime.internal.adaptor.EclipseAppLauncher.start(EclipseAppLauncher.java:104)
00:22:58 	at org.eclipse.core.runtime.adaptor.EclipseStarter.run(EclipseStarter.java:388)
00:22:58 	at org.eclipse.core.runtime.adaptor.EclipseStarter.run(EclipseStarter.java:243)
00:22:58 	at sun.reflect.NativeMethodAccessorImpl.invoke0(Native Method)
00:22:58 	at sun.reflect.NativeMethodAccessorImpl.invoke(NativeMethodAccessorImpl.java:62)
00:22:58 	at sun.reflect.DelegatingMethodAccessorImpl.invoke(DelegatingMethodAccessorImpl.java:43)
00:22:58 	at java.lang.reflect.Method.invoke(Method.java:498)
00:22:58 	at org.eclipse.equinox.launcher.Main.invokeFramework(Main.java:653)
00:22:58 	at org.eclipse.equinox.launcher.Main.basicRun(Main.java:590)
00:22:58 	at org.eclipse.equinox.launcher.Main.run(Main.java:1499)
00:22:58 	at org.eclipse.equinox.launcher.Main.main(Main.java:1472)
00:22:58 
00:22:58 Running org.eclipse.egerrit.core.command.tests.AddReviewerCommandTest
00:22:58 Checking out http://104.154.18.211:28115/egerrit/test into /tmp/genie.egerrit/egerrit7541829817955063798.tmp
00:22:59 org.eclipse.jgit.api.errors.TransportException: http://104.154.18.211:28115/egerrit/test: error occurred during unpacking on the remote end: error No space left on device
00:22:59 Checking out http://104.154.18.211:28115/egerrit/test into /tmp/genie.egerrit/egerrit5406223642831978217.tmp
00:23:00 org.eclipse.jgit.api.errors.TransportException: http://104.154.18.211:28115/egerrit/test: error occurred during unpacking on the remote end: error No space left on device
00:23:00 Checking out http://104.154.18.211:28115/egerrit/test into /tmp/genie.egerrit/egerrit6436217555401192532.tmp
00:23:00 org.eclipse.jgit.api.errors.TransportException: http://104.154.18.211:28115/egerrit/test: error occurred during unpacking on the remote end: error No space left on device
00:23:00 Tests run: 3, Failures: 3, Errors: 0, Skipped: 0, Time elapsed: 2.267 sec <<< FAILURE! - in org.eclipse.egerrit.core.command.tests.AddReviewerCommandTest
00:23:00 testCall(org.eclipse.egerrit.core.command.tests.AddReviewerCommandTest)  Time elapsed: 0.769 sec  <<< FAILURE!
00:23:00 java.lang.AssertionError: http://104.154.18.211:28115/egerrit/test: error occurred during unpacking on the remote end: error No space left on device
00:23:00 	at org.junit.Assert.fail(Assert.java:88)
00:23:00 	at org.eclipse.egerrit.core.command.tests.CommandTest.createReviewWithSimpleFile(CommandTest.java:111)
00:23:00 	at org.eclipse.egerrit.core.command.tests.CommandTestWithSimpleReview.createReview(CommandTestWithSimpleReview.java:19)
00:23:00 	at sun.reflect.GeneratedMethodAccessor9.invoke(Unknown Source)
00:23:00 	at sun.reflect.DelegatingMethodAccessorImpl.invoke(DelegatingMethodAccessorImpl.java:43)
00:23:00 	at java.lang.reflect.Method.invoke(Method.java:498)
00:23:00 	at org.junit.runners.model.FrameworkMethod$1.runReflectiveCall(FrameworkMethod.java:50)
00:23:00 	at org.junit.internal.runners.model.ReflectiveCallable.run(ReflectiveCallable.java:12)
00:23:00 	at org.junit.runners.model.FrameworkMethod.invokeExplosively(FrameworkMethod.java:47)
00:23:00 	at org.junit.internal.runners.statements.RunBefores.evaluate(RunBefores.java:24)
00:23:00 	at org.junit.internal.runners.statements.RunAfters.evaluate(RunAfters.java:27)
00:23:00 	at org.junit.runners.ParentRunner.runLeaf(ParentRunner.java:325)
00:23:00 	at org.junit.runners.BlockJUnit4ClassRunner.runChild(BlockJUnit4ClassRunner.java:78)
00:23:00 	at org.junit.runners.BlockJUnit4ClassRunner.runChild(BlockJUnit4ClassRunner.java:57)
00:23:00 	at org.junit.runners.ParentRunner$3.run(ParentRunner.java:290)
00:23:00 	at org.junit.runners.ParentRunner$1.schedule(ParentRunner.java:71)
00:23:00 	at org.junit.runners.ParentRunner.runChildren(ParentRunner.java:288)
00:23:00 	at org.junit.runners.ParentRunner.access$000(ParentRunner.java:58)
00:23:00 	at org.junit.runners.ParentRunner$2.evaluate(ParentRunner.java:268)
00:23:00 	at org.junit.runners.ParentRunner.run(ParentRunner.java:363)
00:23:00 	at org.apache.maven.surefire.junit4.JUnit4Provider.execute(JUnit4Provider.java:264)
00:23:00 	at org.apache.maven.surefire.junit4.JUnit4Provider.executeTestSet(JUnit4Provider.java:153)
00:23:00 	at org.apache.maven.surefire.junit4.JUnit4Provider.invoke(JUnit4Provider.java:124)
00:23:00 	at sun.reflect.NativeMethodAccessorImpl.invoke0(Native Method)
00:23:00 	at sun.reflect.NativeMethodAccessorImpl.invoke(NativeMethodAccessorImpl.java:62)
00:23:00 	at sun.reflect.DelegatingMethodAccessorImpl.invoke(DelegatingMethodAccessorImpl.java:43)
00:23:00 	at java.lang.reflect.Method.invoke(Method.java:498)
00:23:00 	at org.apache.maven.surefire.util.ReflectionUtils.invokeMethodWithArray2(ReflectionUtils.java:208)
00:23:00 	at org.apache.maven.surefire.booter.ProviderFactory$ProviderProxy.invoke(ProviderFactory.java:156)
00:23:00 	at org.apache.maven.surefire.booter.ProviderFactory.invokeProvider(ProviderFactory.java:82)
00:23:00 	at org.eclipse.tycho.surefire.osgibooter.OsgiSurefireBooter.run(OsgiSurefireBooter.java:95)
00:23:00 	at org.eclipse.tycho.surefire.osgibooter.HeadlessTestApplication.run(HeadlessTestApplication.java:21)
00:23:00 	at sun.reflect.NativeMethodAccessorImpl.invoke0(Native Method)
00:23:00 	at sun.reflect.NativeMethodAccessorImpl.invoke(NativeMethodAccessorImpl.java:62)
00:23:00 	at sun.reflect.DelegatingMethodAccessorImpl.invoke(DelegatingMethodAccessorImpl.java:43)
00:23:00 	at java.lang.reflect.Method.invoke(Method.java:498)
00:23:00 	at org.eclipse.equinox.internal.app.EclipseAppContainer.callMethodWithException(EclipseAppContainer.java:587)
00:23:00 	at org.eclipse.equinox.internal.app.EclipseAppHandle.run(EclipseAppHandle.java:198)
00:23:00 	at org.eclipse.core.runtime.internal.adaptor.EclipseAppLauncher.runApplication(EclipseAppLauncher.java:134)
00:23:00 	at org.eclipse.core.runtime.internal.adaptor.EclipseAppLauncher.start(EclipseAppLauncher.java:104)
00:23:00 	at org.eclipse.core.runtime.adaptor.EclipseStarter.run(EclipseStarter.java:388)
00:23:00 	at org.eclipse.core.runtime.adaptor.EclipseStarter.run(EclipseStarter.java:243)
00:23:00 	at sun.reflect.NativeMethodAccessorImpl.invoke0(Native Method)
00:23:00 	at sun.reflect.NativeMethodAccessorImpl.invoke(NativeMethodAccessorImpl.java:62)
00:23:00 	at sun.reflect.DelegatingMethodAccessorImpl.invoke(DelegatingMethodAccessorImpl.java:43)
00:23:00 	at java.lang.reflect.Method.invoke(Method.java:498)
00:23:00 	at org.eclipse.equinox.launcher.Main.invokeFramework(Main.java:653)
00:23:00 	at org.eclipse.equinox.launcher.Main.basicRun(Main.java:590)
00:23:00 	at org.eclipse.equinox.launcher.Main.run(Main.java:1499)
00:23:00 	at org.eclipse.equinox.launcher.Main.main(Main.java:1472)
00:23:00 
00:23:00 testAddGroupCall(org.eclipse.egerrit.core.command.tests.AddReviewerCommandTest)  Time elapsed: 0.665 sec  <<< FAILURE!
00:23:00 java.lang.AssertionError: http://104.154.18.211:28115/egerrit/test: error occurred during unpacking on the remote end: error No space left on device
00:23:00 	at org.junit.Assert.fail(Assert.java:88)
00:23:00 	at org.eclipse.egerrit.core.command.tests.CommandTest.createReviewWithSimpleFile(CommandTest.java:111)
00:23:00 	at org.eclipse.egerrit.core.command.tests.CommandTestWithSimpleReview.createReview(CommandTestWithSimpleReview.java:19)
00:23:00 	at sun.reflect.GeneratedMethodAccessor9.invoke(Unknown Source)
00:23:00 	at sun.reflect.DelegatingMethodAccessorImpl.invoke(DelegatingMethodAccessorImpl.java:43)
00:23:00 	at java.lang.reflect.Method.invoke(Method.java:498)
00:23:00 	at org.junit.runners.model.FrameworkMethod$1.runReflectiveCall(FrameworkMethod.java:50)
00:23:00 	at org.junit.internal.runners.model.ReflectiveCallable.run(ReflectiveCallable.java:12)
00:23:00 	at org.junit.runners.model.FrameworkMethod.invokeExplosively(FrameworkMethod.java:47)
00:23:00 	at org.junit.internal.runners.statements.RunBefores.evaluate(RunBefores.java:24)
00:23:00 	at org.junit.internal.runners.statements.RunAfters.evaluate(RunAfters.java:27)
00:23:00 	at org.junit.runners.ParentRunner.runLeaf(ParentRunner.java:325)
00:23:00 	at org.junit.runners.BlockJUnit4ClassRunner.runChild(BlockJUnit4ClassRunner.java:78)
00:23:00 	at org.junit.runners.BlockJUnit4ClassRunner.runChild(BlockJUnit4ClassRunner.java:57)
00:23:00 	at org.junit.runners.ParentRunner$3.run(ParentRunner.java:290)
00:23:00 	at org.junit.runners.ParentRunner$1.schedule(ParentRunner.java:71)
00:23:00 	at org.junit.runners.ParentRunner.runChildren(ParentRunner.java:288)
00:23:00 	at org.junit.runners.ParentRunner.access$000(ParentRunner.java:58)
00:23:00 	at org.junit.runners.ParentRunner$2.evaluate(ParentRunner.java:268)
00:23:00 	at org.junit.runners.ParentRunner.run(ParentRunner.java:363)
00:23:00 	at org.apache.maven.surefire.junit4.JUnit4Provider.execute(JUnit4Provider.java:264)
00:23:00 	at org.apache.maven.surefire.junit4.JUnit4Provider.executeTestSet(JUnit4Provider.java:153)
00:23:00 	at org.apache.maven.surefire.junit4.JUnit4Provider.invoke(JUnit4Provider.java:124)
00:23:00 	at sun.reflect.NativeMethodAccessorImpl.invoke0(Native Method)
00:23:00 	at sun.reflect.NativeMethodAccessorImpl.invoke(NativeMethodAccessorImpl.java:62)
00:23:00 	at sun.reflect.DelegatingMethodAccessorImpl.invoke(DelegatingMethodAccessorImpl.java:43)
00:23:00 	at java.lang.reflect.Method.invoke(Method.java:498)
00:23:00 	at org.apache.maven.surefire.util.ReflectionUtils.invokeMethodWithArray2(ReflectionUtils.java:208)
00:23:00 	at org.apache.maven.surefire.booter.ProviderFactory$ProviderProxy.invoke(ProviderFactory.java:156)
00:23:00 	at org.apache.maven.surefire.booter.ProviderFactory.invokeProvider(ProviderFactory.java:82)
00:23:00 	at org.eclipse.tycho.surefire.osgibooter.OsgiSurefireBooter.run(OsgiSurefireBooter.java:95)
00:23:00 	at org.eclipse.tycho.surefire.osgibooter.HeadlessTestApplication.run(HeadlessTestApplication.java:21)
00:23:00 	at sun.reflect.NativeMethodAccessorImpl.invoke0(Native Method)
00:23:00 	at sun.reflect.NativeMethodAccessorImpl.invoke(NativeMethodAccessorImpl.java:62)
00:23:00 	at sun.reflect.DelegatingMethodAccessorImpl.invoke(DelegatingMethodAccessorImpl.java:43)
00:23:00 	at java.lang.reflect.Method.invoke(Method.java:498)
00:23:00 	at org.eclipse.equinox.internal.app.EclipseAppContainer.callMethodWithException(EclipseAppContainer.java:587)
00:23:00 	at org.eclipse.equinox.internal.app.EclipseAppHandle.run(EclipseAppHandle.java:198)
00:23:00 	at org.eclipse.core.runtime.internal.adaptor.EclipseAppLauncher.runApplication(EclipseAppLauncher.java:134)
00:23:00 	at org.eclipse.core.runtime.internal.adaptor.EclipseAppLauncher.start(EclipseAppLauncher.java:104)
00:23:00 	at org.eclipse.core.runtime.adaptor.EclipseStarter.run(EclipseStarter.java:388)
00:23:00 	at org.eclipse.core.runtime.adaptor.EclipseStarter.run(EclipseStarter.java:243)
00:23:00 	at sun.reflect.NativeMethodAccessorImpl.invoke0(Native Method)
00:23:00 	at sun.reflect.NativeMethodAccessorImpl.invoke(NativeMethodAccessorImpl.java:62)
00:23:00 	at sun.reflect.DelegatingMethodAccessorImpl.invoke(DelegatingMethodAccessorImpl.java:43)
00:23:00 	at java.lang.reflect.Method.invoke(Method.java:498)
00:23:00 	at org.eclipse.equinox.launcher.Main.invokeFramework(Main.java:653)
00:23:00 	at org.eclipse.equinox.launcher.Main.basicRun(Main.java:590)
00:23:00 	at org.eclipse.equinox.launcher.Main.run(Main.java:1499)
00:23:00 	at org.eclipse.equinox.launcher.Main.main(Main.java:1472)
00:23:00 
00:23:00 testAddUndefinedReviewerCall(org.eclipse.egerrit.core.command.tests.AddReviewerCommandTest)  Time elapsed: 0.829 sec  <<< FAILURE!
00:23:00 java.lang.AssertionError: http://104.154.18.211:28115/egerrit/test: error occurred during unpacking on the remote end: error No space left on device
00:23:00 	at org.junit.Assert.fail(Assert.java:88)
00:23:00 	at org.eclipse.egerrit.core.command.tests.CommandTest.createReviewWithSimpleFile(CommandTest.java:111)
00:23:00 	at org.eclipse.egerrit.core.command.tests.CommandTestWithSimpleReview.createReview(CommandTestWithSimpleReview.java:19)
00:23:00 	at sun.reflect.GeneratedMethodAccessor9.invoke(Unknown Source)
00:23:00 	at sun.reflect.DelegatingMethodAccessorImpl.invoke(DelegatingMethodAccessorImpl.java:43)
00:23:00 	at java.lang.reflect.Method.invoke(Method.java:498)
00:23:00 	at org.junit.runners.model.FrameworkMethod$1.runReflectiveCall(FrameworkMethod.java:50)
00:23:00 	at org.junit.internal.runners.model.ReflectiveCallable.run(ReflectiveCallable.java:12)
00:23:00 	at org.junit.runners.model.FrameworkMethod.invokeExplosively(FrameworkMethod.java:47)
00:23:00 	at org.junit.internal.runners.statements.RunBefores.evaluate(RunBefores.java:24)
00:23:00 	at org.junit.internal.runners.statements.RunAfters.evaluate(RunAfters.java:27)
00:23:00 	at org.junit.runners.ParentRunner.runLeaf(ParentRunner.java:325)
00:23:00 	at org.junit.runners.BlockJUnit4ClassRunner.runChild(BlockJUnit4ClassRunner.java:78)
00:23:00 	at org.junit.runners.BlockJUnit4ClassRunner.runChild(BlockJUnit4ClassRunner.java:57)
00:23:00 	at org.junit.runners.ParentRunner$3.run(ParentRunner.java:290)
00:23:00 	at org.junit.runners.ParentRunner$1.schedule(ParentRunner.java:71)
00:23:00 	at org.junit.runners.ParentRunner.runChildren(ParentRunner.java:288)
00:23:00 	at org.junit.runners.ParentRunner.access$000(ParentRunner.java:58)
00:23:00 	at org.junit.runners.ParentRunner$2.evaluate(ParentRunner.java:268)
00:23:00 	at org.junit.runners.ParentRunner.run(ParentRunner.java:363)
00:23:00 	at org.apache.maven.surefire.junit4.JUnit4Provider.execute(JUnit4Provider.java:264)
00:23:00 	at org.apache.maven.surefire.junit4.JUnit4Provider.executeTestSet(JUnit4Provider.java:153)
00:23:00 	at org.apache.maven.surefire.junit4.JUnit4Provider.invoke(JUnit4Provider.java:124)
00:23:00 	at sun.reflect.NativeMethodAccessorImpl.invoke0(Native Method)
00:23:00 	at sun.reflect.NativeMethodAccessorImpl.invoke(NativeMethodAccessorImpl.java:62)
00:23:00 	at sun.reflect.DelegatingMethodAccessorImpl.invoke(DelegatingMethodAccessorImpl.java:43)
00:23:00 	at java.lang.reflect.Method.invoke(Method.java:498)
00:23:00 	at org.apache.maven.surefire.util.ReflectionUtils.invokeMethodWithArray2(ReflectionUtils.java:208)
00:23:00 	at org.apache.maven.surefire.booter.ProviderFactory$ProviderProxy.invoke(ProviderFactory.java:156)
00:23:00 	at org.apache.maven.surefire.booter.ProviderFactory.invokeProvider(ProviderFactory.java:82)
00:23:00 	at org.eclipse.tycho.surefire.osgibooter.OsgiSurefireBooter.run(OsgiSurefireBooter.java:95)
00:23:00 	at org.eclipse.tycho.surefire.osgibooter.HeadlessTestApplication.run(HeadlessTestApplication.java:21)
00:23:00 	at sun.reflect.NativeMethodAccessorImpl.invoke0(Native Method)
00:23:00 	at sun.reflect.NativeMethodAccessorImpl.invoke(NativeMethodAccessorImpl.java:62)
00:23:00 	at sun.reflect.DelegatingMethodAccessorImpl.invoke(DelegatingMethodAccessorImpl.java:43)
00:23:00 	at java.lang.reflect.Method.invoke(Method.java:498)
00:23:00 	at org.eclipse.equinox.internal.app.EclipseAppContainer.callMethodWithException(EclipseAppContainer.java:587)
00:23:00 	at org.eclipse.equinox.internal.app.EclipseAppHandle.run(EclipseAppHandle.java:198)
00:23:00 	at org.eclipse.core.runtime.internal.adaptor.EclipseAppLauncher.runApplication(EclipseAppLauncher.java:134)
00:23:00 	at org.eclipse.core.runtime.internal.adaptor.EclipseAppLauncher.start(EclipseAppLauncher.java:104)
00:23:00 	at org.eclipse.core.runtime.adaptor.EclipseStarter.run(EclipseStarter.java:388)
00:23:00 	at org.eclipse.core.runtime.adaptor.EclipseStarter.run(EclipseStarter.java:243)
00:23:00 	at sun.reflect.NativeMethodAccessorImpl.invoke0(Native Method)
00:23:00 	at sun.reflect.NativeMethodAccessorImpl.invoke(NativeMethodAccessorImpl.java:62)
00:23:00 	at sun.reflect.DelegatingMethodAccessorImpl.invoke(DelegatingMethodAccessorImpl.java:43)
00:23:00 	at java.lang.reflect.Method.invoke(Method.java:498)
00:23:00 	at org.eclipse.equinox.launcher.Main.invokeFramework(Main.java:653)
00:23:00 	at org.eclipse.equinox.launcher.Main.basicRun(Main.java:590)
00:23:00 	at org.eclipse.equinox.launcher.Main.run(Main.java:1499)
00:23:00 	at org.eclipse.equinox.launcher.Main.main(Main.java:1472)
00:23:00 
00:23:00 Running org.eclipse.egerrit.core.command.tests.RestoreCommandTest
00:23:01 Checking out http://104.154.18.211:28115/egerrit/test into /tmp/genie.egerrit/egerrit9204616523214628043.tmp
00:23:03 org.eclipse.jgit.api.errors.TransportException: http://104.154.18.211:28115/egerrit/test: error occurred during unpacking on the remote end: error No space left on device
00:23:03 Tests run: 1, Failures: 1, Errors: 0, Skipped: 0, Time elapsed: 2.589 sec <<< FAILURE! - in org.eclipse.egerrit.core.command.tests.RestoreCommandTest
00:23:03 testCall(org.eclipse.egerrit.core.command.tests.RestoreCommandTest)  Time elapsed: 2.587 sec  <<< FAILURE!
00:23:03 java.lang.AssertionError: http://104.154.18.211:28115/egerrit/test: error occurred during unpacking on the remote end: error No space left on device
00:23:03 	at org.junit.Assert.fail(Assert.java:88)
00:23:03 	at org.eclipse.egerrit.core.command.tests.CommandTest.createReviewWithSimpleFile(CommandTest.java:111)
00:23:03 	at org.eclipse.egerrit.core.command.tests.CommandTestWithSimpleReview.createReview(CommandTestWithSimpleReview.java:19)
00:23:03 	at sun.reflect.GeneratedMethodAccessor9.invoke(Unknown Source)
00:23:03 	at sun.reflect.DelegatingMethodAccessorImpl.invoke(DelegatingMethodAccessorImpl.java:43)
00:23:03 	at java.lang.reflect.Method.invoke(Method.java:498)
00:23:03 	at org.junit.runners.model.FrameworkMethod$1.runReflectiveCall(FrameworkMethod.java:50)
00:23:03 	at org.junit.internal.runners.model.ReflectiveCallable.run(ReflectiveCallable.java:12)
00:23:03 	at org.junit.runners.model.FrameworkMethod.invokeExplosively(FrameworkMethod.java:47)
00:23:03 	at org.junit.internal.runners.statements.RunBefores.evaluate(RunBefores.java:24)
00:23:03 	at org.junit.internal.runners.statements.RunAfters.evaluate(RunAfters.java:27)
00:23:03 	at org.junit.runners.ParentRunner.runLeaf(ParentRunner.java:325)
00:23:03 	at org.junit.runners.BlockJUnit4ClassRunner.runChild(BlockJUnit4ClassRunner.java:78)
00:23:03 	at org.junit.runners.BlockJUnit4ClassRunner.runChild(BlockJUnit4ClassRunner.java:57)
00:23:03 	at org.junit.runners.ParentRunner$3.run(ParentRunner.java:290)
00:23:03 	at org.junit.runners.ParentRunner$1.schedule(ParentRunner.java:71)
00:23:03 	at org.junit.runners.ParentRunner.runChildren(ParentRunner.java:288)
00:23:03 	at org.junit.runners.ParentRunner.access$000(ParentRunner.java:58)
00:23:03 	at org.junit.runners.ParentRunner$2.evaluate(ParentRunner.java:268)
00:23:03 	at org.junit.runners.ParentRunner.run(ParentRunner.java:363)
00:23:03 	at org.apache.maven.surefire.junit4.JUnit4Provider.execute(JUnit4Provider.java:264)
00:23:03 	at org.apache.maven.surefire.junit4.JUnit4Provider.executeTestSet(JUnit4Provider.java:153)
00:23:03 	at org.apache.maven.surefire.junit4.JUnit4Provider.invoke(JUnit4Provider.java:124)
00:23:03 	at sun.reflect.NativeMethodAccessorImpl.invoke0(Native Method)
00:23:03 	at sun.reflect.NativeMethodAccessorImpl.invoke(NativeMethodAccessorImpl.java:62)
00:23:03 	at sun.reflect.DelegatingMethodAccessorImpl.invoke(DelegatingMethodAccessorImpl.java:43)
00:23:03 	at java.lang.reflect.Method.invoke(Method.java:498)
00:23:03 	at org.apache.maven.surefire.util.ReflectionUtils.invokeMethodWithArray2(ReflectionUtils.java:208)
00:23:03 	at org.apache.maven.surefire.booter.ProviderFactory$ProviderProxy.invoke(ProviderFactory.java:156)
00:23:03 	at org.apache.maven.surefire.booter.ProviderFactory.invokeProvider(ProviderFactory.java:82)
00:23:03 	at org.eclipse.tycho.surefire.osgibooter.OsgiSurefireBooter.run(OsgiSurefireBooter.java:95)
00:23:03 	at org.eclipse.tycho.surefire.osgibooter.HeadlessTestApplication.run(HeadlessTestApplication.java:21)
00:23:03 	at sun.reflect.NativeMethodAccessorImpl.invoke0(Native Method)
00:23:03 	at sun.reflect.NativeMethodAccessorImpl.invoke(NativeMethodAccessorImpl.java:62)
00:23:03 	at sun.reflect.DelegatingMethodAccessorImpl.invoke(DelegatingMethodAccessorImpl.java:43)
00:23:03 	at java.lang.reflect.Method.invoke(Method.java:498)
00:23:03 	at org.eclipse.equinox.internal.app.EclipseAppContainer.callMethodWithException(EclipseAppContainer.java:587)
00:23:03 	at org.eclipse.equinox.internal.app.EclipseAppHandle.run(EclipseAppHandle.java:198)
00:23:03 	at org.eclipse.core.runtime.internal.adaptor.EclipseAppLauncher.runApplication(EclipseAppLauncher.java:134)
00:23:03 	at org.eclipse.core.runtime.internal.adaptor.EclipseAppLauncher.start(EclipseAppLauncher.java:104)
00:23:03 	at org.eclipse.core.runtime.adaptor.EclipseStarter.run(EclipseStarter.java:388)
00:23:03 	at org.eclipse.core.runtime.adaptor.EclipseStarter.run(EclipseStarter.java:243)
00:23:03 	at sun.reflect.NativeMethodAccessorImpl.invoke0(Native Method)
00:23:03 	at sun.reflect.NativeMethodAccessorImpl.invoke(NativeMethodAccessorImpl.java:62)
00:23:03 	at sun.reflect.DelegatingMethodAccessorImpl.invoke(DelegatingMethodAccessorImpl.java:43)
00:23:03 	at java.lang.reflect.Method.invoke(Method.java:498)
00:23:03 	at org.eclipse.equinox.launcher.Main.invokeFramework(Main.java:653)
00:23:03 	at org.eclipse.equinox.launcher.Main.basicRun(Main.java:590)
00:23:03 	at org.eclipse.equinox.launcher.Main.run(Main.java:1499)
00:23:03 	at org.eclipse.equinox.launcher.Main.main(Main.java:1472)
00:23:03 
00:23:03 Running org.eclipse.egerrit.core.command.tests.DeleteDraftRevisionCommandTest
00:23:03 Checking out http://104.154.18.211:28115/egerrit/test into /tmp/genie.egerrit/egerrit7229832176594893854.tmp
00:23:04 org.eclipse.jgit.api.errors.TransportException: http://104.154.18.211:28115/egerrit/test: error occurred during unpacking on the remote end: error No space left on device
00:23:04 Tests run: 1, Failures: 1, Errors: 0, Skipped: 0, Time elapsed: 0.701 sec <<< FAILURE! - in org.eclipse.egerrit.core.command.tests.DeleteDraftRevisionCommandTest
00:23:04 testCall(org.eclipse.egerrit.core.command.tests.DeleteDraftRevisionCommandTest)  Time elapsed: 0.699 sec  <<< FAILURE!
00:23:04 java.lang.AssertionError: http://104.154.18.211:28115/egerrit/test: error occurred during unpacking on the remote end: error No space left on device
00:23:04 	at org.junit.Assert.fail(Assert.java:88)
00:23:04 	at org.eclipse.egerrit.core.command.tests.CommandTest.createReviewWithSimpleFile(CommandTest.java:111)
00:23:04 	at org.eclipse.egerrit.core.command.tests.CommandTestWithSimpleReview.createReview(CommandTestWithSimpleReview.java:19)
00:23:04 	at sun.reflect.GeneratedMethodAccessor9.invoke(Unknown Source)
00:23:04 	at sun.reflect.DelegatingMethodAccessorImpl.invoke(DelegatingMethodAccessorImpl.java:43)
00:23:04 	at java.lang.reflect.Method.invoke(Method.java:498)
00:23:04 	at org.junit.runners.model.FrameworkMethod$1.runReflectiveCall(FrameworkMethod.java:50)
00:23:04 	at org.junit.internal.runners.model.ReflectiveCallable.run(ReflectiveCallable.java:12)
00:23:04 	at org.junit.runners.model.FrameworkMethod.invokeExplosively(FrameworkMethod.java:47)
00:23:04 	at org.junit.internal.runners.statements.RunBefores.evaluate(RunBefores.java:24)
00:23:04 	at org.junit.internal.runners.statements.RunAfters.evaluate(RunAfters.java:27)
00:23:04 	at org.junit.runners.ParentRunner.runLeaf(ParentRunner.java:325)
00:23:04 	at org.junit.runners.BlockJUnit4ClassRunner.runChild(BlockJUnit4ClassRunner.java:78)
00:23:04 	at org.junit.runners.BlockJUnit4ClassRunner.runChild(BlockJUnit4ClassRunner.java:57)
00:23:04 	at org.junit.runners.ParentRunner$3.run(ParentRunner.java:290)
00:23:04 	at org.junit.runners.ParentRunner$1.schedule(ParentRunner.java:71)
00:23:04 	at org.junit.runners.ParentRunner.runChildren(ParentRunner.java:288)
00:23:04 	at org.junit.runners.ParentRunner.access$000(ParentRunner.java:58)
00:23:04 	at org.junit.runners.ParentRunner$2.evaluate(ParentRunner.java:268)
00:23:04 	at org.junit.runners.ParentRunner.run(ParentRunner.java:363)
00:23:04 	at org.apache.maven.surefire.junit4.JUnit4Provider.execute(JUnit4Provider.java:264)
00:23:04 	at org.apache.maven.surefire.junit4.JUnit4Provider.executeTestSet(JUnit4Provider.java:153)
00:23:04 	at org.apache.maven.surefire.junit4.JUnit4Provider.invoke(JUnit4Provider.java:124)
00:23:04 	at sun.reflect.NativeMethodAccessorImpl.invoke0(Native Method)
00:23:04 	at sun.reflect.NativeMethodAccessorImpl.invoke(NativeMethodAccessorImpl.java:62)
00:23:04 	at sun.reflect.DelegatingMethodAccessorImpl.invoke(DelegatingMethodAccessorImpl.java:43)
00:23:04 	at java.lang.reflect.Method.invoke(Method.java:498)
00:23:04 	at org.apache.maven.surefire.util.ReflectionUtils.invokeMethodWithArray2(ReflectionUtils.java:208)
00:23:04 	at org.apache.maven.surefire.booter.ProviderFactory$ProviderProxy.invoke(ProviderFactory.java:156)
00:23:04 	at org.apache.maven.surefire.booter.ProviderFactory.invokeProvider(ProviderFactory.java:82)
00:23:04 	at org.eclipse.tycho.surefire.osgibooter.OsgiSurefireBooter.run(OsgiSurefireBooter.java:95)
00:23:04 	at org.eclipse.tycho.surefire.osgibooter.HeadlessTestApplication.run(HeadlessTestApplication.java:21)
00:23:04 	at sun.reflect.NativeMethodAccessorImpl.invoke0(Native Method)
00:23:04 	at sun.reflect.NativeMethodAccessorImpl.invoke(NativeMethodAccessorImpl.java:62)
00:23:04 	at sun.reflect.DelegatingMethodAccessorImpl.invoke(DelegatingMethodAccessorImpl.java:43)
00:23:04 	at java.lang.reflect.Method.invoke(Method.java:498)
00:23:04 	at org.eclipse.equinox.internal.app.EclipseAppContainer.callMethodWithException(EclipseAppContainer.java:587)
00:23:04 	at org.eclipse.equinox.internal.app.EclipseAppHandle.run(EclipseAppHandle.java:198)
00:23:04 	at org.eclipse.core.runtime.internal.adaptor.EclipseAppLauncher.runApplication(EclipseAppLauncher.java:134)
00:23:04 	at org.eclipse.core.runtime.internal.adaptor.EclipseAppLauncher.start(EclipseAppLauncher.java:104)
00:23:04 	at org.eclipse.core.runtime.adaptor.EclipseStarter.run(EclipseStarter.java:388)
00:23:04 	at org.eclipse.core.runtime.adaptor.EclipseStarter.run(EclipseStarter.java:243)
00:23:04 	at sun.reflect.NativeMethodAccessorImpl.invoke0(Native Method)
00:23:04 	at sun.reflect.NativeMethodAccessorImpl.invoke(NativeMethodAccessorImpl.java:62)
00:23:04 	at sun.reflect.DelegatingMethodAccessorImpl.invoke(DelegatingMethodAccessorImpl.java:43)
00:23:04 	at java.lang.reflect.Method.invoke(Method.java:498)
00:23:04 	at org.eclipse.equinox.launcher.Main.invokeFramework(Main.java:653)
00:23:04 	at org.eclipse.equinox.launcher.Main.basicRun(Main.java:590)
00:23:04 	at org.eclipse.equinox.launcher.Main.run(Main.java:1499)
00:23:04 	at org.eclipse.equinox.launcher.Main.main(Main.java:1472)
00:23:04 
00:23:04 Running org.eclipse.egerrit.core.command.tests.ChangeCommitMsgCommandTest
00:23:04 Checking out http://104.154.18.211:28115/egerrit/test into /tmp/genie.egerrit/egerrit244174353446473705.tmp
00:23:04 org.eclipse.jgit.api.errors.TransportException: http://104.154.18.211:28115/egerrit/test: error occurred during unpacking on the remote end: error No space left on device
00:23:04 Tests run: 1, Failures: 1, Errors: 0, Skipped: 0, Time elapsed: 0.686 sec <<< FAILURE! - in org.eclipse.egerrit.core.command.tests.ChangeCommitMsgCommandTest
00:23:04 testCall(org.eclipse.egerrit.core.command.tests.ChangeCommitMsgCommandTest)  Time elapsed: 0.684 sec  <<< FAILURE!
00:23:04 java.lang.AssertionError: http://104.154.18.211:28115/egerrit/test: error occurred during unpacking on the remote end: error No space left on device
00:23:04 	at org.junit.Assert.fail(Assert.java:88)
00:23:04 	at org.eclipse.egerrit.core.command.tests.CommandTest.createReviewWithSimpleFile(CommandTest.java:111)
00:23:04 	at org.eclipse.egerrit.core.command.tests.CommandTestWithSimpleReview.createReview(CommandTestWithSimpleReview.java:19)
00:23:04 	at sun.reflect.GeneratedMethodAccessor9.invoke(Unknown Source)
00:23:04 	at sun.reflect.DelegatingMethodAccessorImpl.invoke(DelegatingMethodAccessorImpl.java:43)
00:23:04 	at java.lang.reflect.Method.invoke(Method.java:498)
00:23:04 	at org.junit.runners.model.FrameworkMethod$1.runReflectiveCall(FrameworkMethod.java:50)
00:23:04 	at org.junit.internal.runners.model.ReflectiveCallable.run(ReflectiveCallable.java:12)
00:23:04 	at org.junit.runners.model.FrameworkMethod.invokeExplosively(FrameworkMethod.java:47)
00:23:04 	at org.junit.internal.runners.statements.RunBefores.evaluate(RunBefores.java:24)
00:23:04 	at org.junit.internal.runners.statements.RunAfters.evaluate(RunAfters.java:27)
00:23:04 	at org.junit.runners.ParentRunner.runLeaf(ParentRunner.java:325)
00:23:04 	at org.junit.runners.BlockJUnit4ClassRunner.runChild(BlockJUnit4ClassRunner.java:78)
00:23:04 	at org.junit.runners.BlockJUnit4ClassRunner.runChild(BlockJUnit4ClassRunner.java:57)
00:23:04 	at org.junit.runners.ParentRunner$3.run(ParentRunner.java:290)
00:23:04 	at org.junit.runners.ParentRunner$1.schedule(ParentRunner.java:71)
00:23:04 	at org.junit.runners.ParentRunner.runChildren(ParentRunner.java:288)
00:23:04 	at org.junit.runners.ParentRunner.access$000(ParentRunner.java:58)
00:23:04 	at org.junit.runners.ParentRunner$2.evaluate(ParentRunner.java:268)
00:23:04 	at org.junit.runners.ParentRunner.run(ParentRunner.java:363)
00:23:04 	at org.apache.maven.surefire.junit4.JUnit4Provider.execute(JUnit4Provider.java:264)
00:23:04 	at org.apache.maven.surefire.junit4.JUnit4Provider.executeTestSet(JUnit4Provider.java:153)
00:23:04 	at org.apache.maven.surefire.junit4.JUnit4Provider.invoke(JUnit4Provider.java:124)
00:23:04 	at sun.reflect.NativeMethodAccessorImpl.invoke0(Native Method)
00:23:04 	at sun.reflect.NativeMethodAccessorImpl.invoke(NativeMethodAccessorImpl.java:62)
00:23:04 	at sun.reflect.DelegatingMethodAccessorImpl.invoke(DelegatingMethodAccessorImpl.java:43)
00:23:04 	at java.lang.reflect.Method.invoke(Method.java:498)
00:23:04 	at org.apache.maven.surefire.util.ReflectionUtils.invokeMethodWithArray2(ReflectionUtils.java:208)
00:23:04 	at org.apache.maven.surefire.booter.ProviderFactory$ProviderProxy.invoke(ProviderFactory.java:156)
00:23:04 	at org.apache.maven.surefire.booter.ProviderFactory.invokeProvider(ProviderFactory.java:82)
00:23:04 	at org.eclipse.tycho.surefire.osgibooter.OsgiSurefireBooter.run(OsgiSurefireBooter.java:95)
00:23:04 	at org.eclipse.tycho.surefire.osgibooter.HeadlessTestApplication.run(HeadlessTestApplication.java:21)
00:23:04 	at sun.reflect.NativeMethodAccessorImpl.invoke0(Native Method)
00:23:04 	at sun.reflect.NativeMethodAccessorImpl.invoke(NativeMethodAccessorImpl.java:62)
00:23:04 	at sun.reflect.DelegatingMethodAccessorImpl.invoke(DelegatingMethodAccessorImpl.java:43)
00:23:04 	at java.lang.reflect.Method.invoke(Method.java:498)
00:23:04 	at org.eclipse.equinox.internal.app.EclipseAppContainer.callMethodWithException(EclipseAppContainer.java:587)
00:23:04 	at org.eclipse.equinox.internal.app.EclipseAppHandle.run(EclipseAppHandle.java:198)
00:23:04 	at org.eclipse.core.runtime.internal.adaptor.EclipseAppLauncher.runApplication(EclipseAppLauncher.java:134)
00:23:04 	at org.eclipse.core.runtime.internal.adaptor.EclipseAppLauncher.start(EclipseAppLauncher.java:104)
00:23:04 	at org.eclipse.core.runtime.adaptor.EclipseStarter.run(EclipseStarter.java:388)
00:23:04 	at org.eclipse.core.runtime.adaptor.EclipseStarter.run(EclipseStarter.java:243)
00:23:04 	at sun.reflect.NativeMethodAccessorImpl.invoke0(Native Method)
00:23:04 	at sun.reflect.NativeMethodAccessorImpl.invoke(NativeMethodAccessorImpl.java:62)
00:23:04 	at sun.reflect.DelegatingMethodAccessorImpl.invoke(DelegatingMethodAccessorImpl.java:43)
00:23:04 	at java.lang.reflect.Method.invoke(Method.java:498)
00:23:04 	at org.eclipse.equinox.launcher.Main.invokeFramework(Main.java:653)
00:23:04 	at org.eclipse.equinox.launcher.Main.basicRun(Main.java:590)
00:23:04 	at org.eclipse.equinox.launcher.Main.run(Main.java:1499)
00:23:04 	at org.eclipse.equinox.launcher.Main.main(Main.java:1472)
00:23:04 
00:23:04 Running org.eclipse.egerrit.core.command.tests.ListReviewersCommandTest
00:23:05 Checking out http://104.154.18.211:28115/egerrit/test into /tmp/genie.egerrit/egerrit5931205649915029175.tmp
00:23:05 org.eclipse.jgit.api.errors.TransportException: http://104.154.18.211:28115/egerrit/test: error occurred during unpacking on the remote end: error No space left on device
00:23:05 Tests run: 1, Failures: 1, Errors: 0, Skipped: 0, Time elapsed: 0.855 sec <<< FAILURE! - in org.eclipse.egerrit.core.command.tests.ListReviewersCommandTest
00:23:05 testCall(org.eclipse.egerrit.core.command.tests.ListReviewersCommandTest)  Time elapsed: 0.853 sec  <<< FAILURE!
00:23:05 java.lang.AssertionError: http://104.154.18.211:28115/egerrit/test: error occurred during unpacking on the remote end: error No space left on device
00:23:05 	at org.junit.Assert.fail(Assert.java:88)
00:23:05 	at org.eclipse.egerrit.core.command.tests.CommandTest.createReviewWithSimpleFile(CommandTest.java:111)
00:23:05 	at org.eclipse.egerrit.core.command.tests.CommandTestWithSimpleReview.createReview(CommandTestWithSimpleReview.java:19)
00:23:05 	at sun.reflect.GeneratedMethodAccessor9.invoke(Unknown Source)
00:23:05 	at sun.reflect.DelegatingMethodAccessorImpl.invoke(DelegatingMethodAccessorImpl.java:43)
00:23:05 	at java.lang.reflect.Method.invoke(Method.java:498)
00:23:05 	at org.junit.runners.model.FrameworkMethod$1.runReflectiveCall(FrameworkMethod.java:50)
00:23:05 	at org.junit.internal.runners.model.ReflectiveCallable.run(ReflectiveCallable.java:12)
00:23:05 	at org.junit.runners.model.FrameworkMethod.invokeExplosively(FrameworkMethod.java:47)
00:23:05 	at org.junit.internal.runners.statements.RunBefores.evaluate(RunBefores.java:24)
00:23:05 	at org.junit.internal.runners.statements.RunAfters.evaluate(RunAfters.java:27)
00:23:05 	at org.junit.runners.ParentRunner.runLeaf(ParentRunner.java:325)
00:23:05 	at org.junit.runners.BlockJUnit4ClassRunner.runChild(BlockJUnit4ClassRunner.java:78)
00:23:05 	at org.junit.runners.BlockJUnit4ClassRunner.runChild(BlockJUnit4ClassRunner.java:57)
00:23:05 	at org.junit.runners.ParentRunner$3.run(ParentRunner.java:290)
00:23:05 	at org.junit.runners.ParentRunner$1.schedule(ParentRunner.java:71)
00:23:05 	at org.junit.runners.ParentRunner.runChildren(ParentRunner.java:288)
00:23:05 	at org.junit.runners.ParentRunner.access$000(ParentRunner.java:58)
00:23:05 	at org.junit.runners.ParentRunner$2.evaluate(ParentRunner.java:268)
00:23:05 	at org.junit.runners.ParentRunner.run(ParentRunner.java:363)
00:23:05 	at org.apache.maven.surefire.junit4.JUnit4Provider.execute(JUnit4Provider.java:264)
00:23:05 	at org.apache.maven.surefire.junit4.JUnit4Provider.executeTestSet(JUnit4Provider.java:153)
00:23:05 	at org.apache.maven.surefire.junit4.JUnit4Provider.invoke(JUnit4Provider.java:124)
00:23:05 	at sun.reflect.NativeMethodAccessorImpl.invoke0(Native Method)
00:23:05 	at sun.reflect.NativeMethodAccessorImpl.invoke(NativeMethodAccessorImpl.java:62)
00:23:05 	at sun.reflect.DelegatingMethodAccessorImpl.invoke(DelegatingMethodAccessorImpl.java:43)
00:23:05 	at java.lang.reflect.Method.invoke(Method.java:498)
00:23:05 	at org.apache.maven.surefire.util.ReflectionUtils.invokeMethodWithArray2(ReflectionUtils.java:208)
00:23:05 	at org.apache.maven.surefire.booter.ProviderFactory$ProviderProxy.invoke(ProviderFactory.java:156)
00:23:05 	at org.apache.maven.surefire.booter.ProviderFactory.invokeProvider(ProviderFactory.java:82)
00:23:05 	at org.eclipse.tycho.surefire.osgibooter.OsgiSurefireBooter.run(OsgiSurefireBooter.java:95)
00:23:05 	at org.eclipse.tycho.surefire.osgibooter.HeadlessTestApplication.run(HeadlessTestApplication.java:21)
00:23:05 	at sun.reflect.NativeMethodAccessorImpl.invoke0(Native Method)
00:23:05 	at sun.reflect.NativeMethodAccessorImpl.invoke(NativeMethodAccessorImpl.java:62)
00:23:05 	at sun.reflect.DelegatingMethodAccessorImpl.invoke(DelegatingMethodAccessorImpl.java:43)
00:23:05 	at java.lang.reflect.Method.invoke(Method.java:498)
00:23:05 	at org.eclipse.equinox.internal.app.EclipseAppContainer.callMethodWithException(EclipseAppContainer.java:587)
00:23:05 	at org.eclipse.equinox.internal.app.EclipseAppHandle.run(EclipseAppHandle.java:198)
00:23:05 	at org.eclipse.core.runtime.internal.adaptor.EclipseAppLauncher.runApplication(EclipseAppLauncher.java:134)
00:23:05 	at org.eclipse.core.runtime.internal.adaptor.EclipseAppLauncher.start(EclipseAppLauncher.java:104)
00:23:05 	at org.eclipse.core.runtime.adaptor.EclipseStarter.run(EclipseStarter.java:388)
00:23:05 	at org.eclipse.core.runtime.adaptor.EclipseStarter.run(EclipseStarter.java:243)
00:23:05 	at sun.reflect.NativeMethodAccessorImpl.invoke0(Native Method)
00:23:05 	at sun.reflect.NativeMethodAccessorImpl.invoke(NativeMethodAccessorImpl.java:62)
00:23:05 	at sun.reflect.DelegatingMethodAccessorImpl.invoke(DelegatingMethodAccessorImpl.java:43)
00:23:05 	at java.lang.reflect.Method.invoke(Method.java:498)
00:23:05 	at org.eclipse.equinox.launcher.Main.invokeFramework(Main.java:653)
00:23:05 	at org.eclipse.equinox.launcher.Main.basicRun(Main.java:590)
00:23:05 	at org.eclipse.equinox.launcher.Main.run(Main.java:1499)
00:23:05 	at org.eclipse.equinox.launcher.Main.main(Main.java:1472)
00:23:05 
00:23:05 Running org.eclipse.egerrit.core.command.tests.GetDiffCommandTest
00:23:05 Checking out http://104.154.18.211:28115/egerrit/test into /tmp/genie.egerrit/egerrit2488526276018814010.tmp
00:23:06 org.eclipse.jgit.api.errors.TransportException: http://104.154.18.211:28115/egerrit/test: error occurred during unpacking on the remote end: error No space left on device
00:23:06 Checking out http://104.154.18.211:28115/egerrit/test into /tmp/genie.egerrit/egerrit2773220816186108755.tmp
00:23:07 org.eclipse.jgit.api.errors.TransportException: http://104.154.18.211:28115/egerrit/test: error occurred during unpacking on the remote end: error No space left on device
00:23:07 Tests run: 2, Failures: 2, Errors: 0, Skipped: 0, Time elapsed: 1.496 sec <<< FAILURE! - in org.eclipse.egerrit.core.command.tests.GetDiffCommandTest
00:23:07 testCallFromBase(org.eclipse.egerrit.core.command.tests.GetDiffCommandTest)  Time elapsed: 0.625 sec  <<< FAILURE!
00:23:07 java.lang.AssertionError: http://104.154.18.211:28115/egerrit/test: error occurred during unpacking on the remote end: error No space left on device
00:23:07 	at org.junit.Assert.fail(Assert.java:88)
00:23:07 	at org.eclipse.egerrit.core.command.tests.CommandTest.createReviewWithSimpleFile(CommandTest.java:111)
00:23:07 	at org.eclipse.egerrit.core.command.tests.CommandTestWithSimpleReview.createReview(CommandTestWithSimpleReview.java:19)
00:23:07 	at sun.reflect.GeneratedMethodAccessor9.invoke(Unknown Source)
00:23:07 	at sun.reflect.DelegatingMethodAccessorImpl.invoke(DelegatingMethodAccessorImpl.java:43)
00:23:07 	at java.lang.reflect.Method.invoke(Method.java:498)
00:23:07 	at org.junit.runners.model.FrameworkMethod$1.runReflectiveCall(FrameworkMethod.java:50)
00:23:07 	at org.junit.internal.runners.model.ReflectiveCallable.run(ReflectiveCallable.java:12)
00:23:07 	at org.junit.runners.model.FrameworkMethod.invokeExplosively(FrameworkMethod.java:47)
00:23:07 	at org.junit.internal.runners.statements.RunBefores.evaluate(RunBefores.java:24)
00:23:07 	at org.junit.internal.runners.statements.RunAfters.evaluate(RunAfters.java:27)
00:23:07 	at org.junit.runners.ParentRunner.runLeaf(ParentRunner.java:325)
00:23:07 	at org.junit.runners.BlockJUnit4ClassRunner.runChild(BlockJUnit4ClassRunner.java:78)
00:23:07 	at org.junit.runners.BlockJUnit4ClassRunner.runChild(BlockJUnit4ClassRunner.java:57)
00:23:07 	at org.junit.runners.ParentRunner$3.run(ParentRunner.java:290)
00:23:07 	at org.junit.runners.ParentRunner$1.schedule(ParentRunner.java:71)
00:23:07 	at org.junit.runners.ParentRunner.runChildren(ParentRunner.java:288)
00:23:07 	at org.junit.runners.ParentRunner.access$000(ParentRunner.java:58)
00:23:07 	at org.junit.runners.ParentRunner$2.evaluate(ParentRunner.java:268)
00:23:07 	at org.junit.runners.ParentRunner.run(ParentRunner.java:363)
00:23:07 	at org.apache.maven.surefire.junit4.JUnit4Provider.execute(JUnit4Provider.java:264)
00:23:07 	at org.apache.maven.surefire.junit4.JUnit4Provider.executeTestSet(JUnit4Provider.java:153)
00:23:07 	at org.apache.maven.surefire.junit4.JUnit4Provider.invoke(JUnit4Provider.java:124)
00:23:07 	at sun.reflect.NativeMethodAccessorImpl.invoke0(Native Method)
00:23:07 	at sun.reflect.NativeMethodAccessorImpl.invoke(NativeMethodAccessorImpl.java:62)
00:23:07 	at sun.reflect.DelegatingMethodAccessorImpl.invoke(DelegatingMethodAccessorImpl.java:43)
00:23:07 	at java.lang.reflect.Method.invoke(Method.java:498)
00:23:07 	at org.apache.maven.surefire.util.ReflectionUtils.invokeMethodWithArray2(ReflectionUtils.java:208)
00:23:07 	at org.apache.maven.surefire.booter.ProviderFactory$ProviderProxy.invoke(ProviderFactory.java:156)
00:23:07 	at org.apache.maven.surefire.booter.ProviderFactory.invokeProvider(ProviderFactory.java:82)
00:23:07 	at org.eclipse.tycho.surefire.osgibooter.OsgiSurefireBooter.run(OsgiSurefireBooter.java:95)
00:23:07 	at org.eclipse.tycho.surefire.osgibooter.HeadlessTestApplication.run(HeadlessTestApplication.java:21)
00:23:07 	at sun.reflect.NativeMethodAccessorImpl.invoke0(Native Method)
00:23:07 	at sun.reflect.NativeMethodAccessorImpl.invoke(NativeMethodAccessorImpl.java:62)
00:23:07 	at sun.reflect.DelegatingMethodAccessorImpl.invoke(DelegatingMethodAccessorImpl.java:43)
00:23:07 	at java.lang.reflect.Method.invoke(Method.java:498)
00:23:07 	at org.eclipse.equinox.internal.app.EclipseAppContainer.callMethodWithException(EclipseAppContainer.java:587)
00:23:07 	at org.eclipse.equinox.internal.app.EclipseAppHandle.run(EclipseAppHandle.java:198)
00:23:07 	at org.eclipse.core.runtime.internal.adaptor.EclipseAppLauncher.runApplication(EclipseAppLauncher.java:134)
00:23:07 	at org.eclipse.core.runtime.internal.adaptor.EclipseAppLauncher.start(EclipseAppLauncher.java:104)
00:23:07 	at org.eclipse.core.runtime.adaptor.EclipseStarter.run(EclipseStarter.java:388)
00:23:07 	at org.eclipse.core.runtime.adaptor.EclipseStarter.run(EclipseStarter.java:243)
00:23:07 	at sun.reflect.NativeMethodAccessorImpl.invoke0(Native Method)
00:23:07 	at sun.reflect.NativeMethodAccessorImpl.invoke(NativeMethodAccessorImpl.java:62)
00:23:07 	at sun.reflect.DelegatingMethodAccessorImpl.invoke(DelegatingMethodAccessorImpl.java:43)
00:23:07 	at java.lang.reflect.Method.invoke(Method.java:498)
00:23:07 	at org.eclipse.equinox.launcher.Main.invokeFramework(Main.java:653)
00:23:07 	at org.eclipse.equinox.launcher.Main.basicRun(Main.java:590)
00:23:07 	at org.eclipse.equinox.launcher.Main.run(Main.java:1499)
00:23:07 	at org.eclipse.equinox.launcher.Main.main(Main.java:1472)
00:23:07 
00:23:07 testCallRevision(org.eclipse.egerrit.core.command.tests.GetDiffCommandTest)  Time elapsed: 0.87 sec  <<< FAILURE!
00:23:07 java.lang.AssertionError: http://104.154.18.211:28115/egerrit/test: error occurred during unpacking on the remote end: error No space left on device
00:23:07 	at org.junit.Assert.fail(Assert.java:88)
00:23:07 	at org.eclipse.egerrit.core.command.tests.CommandTest.createReviewWithSimpleFile(CommandTest.java:111)
00:23:07 	at org.eclipse.egerrit.core.command.tests.CommandTestWithSimpleReview.createReview(CommandTestWithSimpleReview.java:19)
00:23:07 	at sun.reflect.GeneratedMethodAccessor9.invoke(Unknown Source)
00:23:07 	at sun.reflect.DelegatingMethodAccessorImpl.invoke(DelegatingMethodAccessorImpl.java:43)
00:23:07 	at java.lang.reflect.Method.invoke(Method.java:498)
00:23:07 	at org.junit.runners.model.FrameworkMethod$1.runReflectiveCall(FrameworkMethod.java:50)
00:23:07 	at org.junit.internal.runners.model.ReflectiveCallable.run(ReflectiveCallable.java:12)
00:23:07 	at org.junit.runners.model.FrameworkMethod.invokeExplosively(FrameworkMethod.java:47)
00:23:07 	at org.junit.internal.runners.statements.RunBefores.evaluate(RunBefores.java:24)
00:23:07 	at org.junit.internal.runners.statements.RunAfters.evaluate(RunAfters.java:27)
00:23:07 	at org.junit.runners.ParentRunner.runLeaf(ParentRunner.java:325)
00:23:07 	at org.junit.runners.BlockJUnit4ClassRunner.runChild(BlockJUnit4ClassRunner.java:78)
00:23:07 	at org.junit.runners.BlockJUnit4ClassRunner.runChild(BlockJUnit4ClassRunner.java:57)
00:23:07 	at org.junit.runners.ParentRunner$3.run(ParentRunner.java:290)
00:23:07 	at org.junit.runners.ParentRunner$1.schedule(ParentRunner.java:71)
00:23:07 	at org.junit.runners.ParentRunner.runChildren(ParentRunner.java:288)
00:23:07 	at org.junit.runners.ParentRunner.access$000(ParentRunner.java:58)
00:23:07 	at org.junit.runners.ParentRunner$2.evaluate(ParentRunner.java:268)
00:23:07 	at org.junit.runners.ParentRunner.run(ParentRunner.java:363)
00:23:07 	at org.apache.maven.surefire.junit4.JUnit4Provider.execute(JUnit4Provider.java:264)
00:23:07 	at org.apache.maven.surefire.junit4.JUnit4Provider.executeTestSet(JUnit4Provider.java:153)
00:23:07 	at org.apache.maven.surefire.junit4.JUnit4Provider.invoke(JUnit4Provider.java:124)
00:23:07 	at sun.reflect.NativeMethodAccessorImpl.invoke0(Native Method)
00:23:07 	at sun.reflect.NativeMethodAccessorImpl.invoke(NativeMethodAccessorImpl.java:62)
00:23:07 	at sun.reflect.DelegatingMethodAccessorImpl.invoke(DelegatingMethodAccessorImpl.java:43)
00:23:07 	at java.lang.reflect.Method.invoke(Method.java:498)
00:23:07 	at org.apache.maven.surefire.util.ReflectionUtils.invokeMethodWithArray2(ReflectionUtils.java:208)
00:23:07 	at org.apache.maven.surefire.booter.ProviderFactory$ProviderProxy.invoke(ProviderFactory.java:156)
00:23:07 	at org.apache.maven.surefire.booter.ProviderFactory.invokeProvider(ProviderFactory.java:82)
00:23:07 	at org.eclipse.tycho.surefire.osgibooter.OsgiSurefireBooter.run(OsgiSurefireBooter.java:95)
00:23:07 	at org.eclipse.tycho.surefire.osgibooter.HeadlessTestApplication.run(HeadlessTestApplication.java:21)
00:23:07 	at sun.reflect.NativeMethodAccessorImpl.invoke0(Native Method)
00:23:07 	at sun.reflect.NativeMethodAccessorImpl.invoke(NativeMethodAccessorImpl.java:62)
00:23:07 	at sun.reflect.DelegatingMethodAccessorImpl.invoke(DelegatingMethodAccessorImpl.java:43)
00:23:07 	at java.lang.reflect.Method.invoke(Method.java:498)
00:23:07 	at org.eclipse.equinox.internal.app.EclipseAppContainer.callMethodWithException(EclipseAppContainer.java:587)
00:23:07 	at org.eclipse.equinox.internal.app.EclipseAppHandle.run(EclipseAppHandle.java:198)
00:23:07 	at org.eclipse.core.runtime.internal.adaptor.EclipseAppLauncher.runApplication(EclipseAppLauncher.java:134)
00:23:07 	at org.eclipse.core.runtime.internal.adaptor.EclipseAppLauncher.start(EclipseAppLauncher.java:104)
00:23:07 	at org.eclipse.core.runtime.adaptor.EclipseStarter.run(EclipseStarter.java:388)
00:23:07 	at org.eclipse.core.runtime.adaptor.EclipseStarter.run(EclipseStarter.java:243)
00:23:07 	at sun.reflect.NativeMethodAccessorImpl.invoke0(Native Method)
00:23:07 	at sun.reflect.NativeMethodAccessorImpl.invoke(NativeMethodAccessorImpl.java:62)
00:23:07 	at sun.reflect.DelegatingMethodAccessorImpl.invoke(DelegatingMethodAccessorImpl.java:43)
00:23:07 	at java.lang.reflect.Method.invoke(Method.java:498)
00:23:07 	at org.eclipse.equinox.launcher.Main.invokeFramework(Main.java:653)
00:23:07 	at org.eclipse.equinox.launcher.Main.basicRun(Main.java:590)
00:23:07 	at org.eclipse.equinox.launcher.Main.run(Main.java:1499)
00:23:07 	at org.eclipse.equinox.launcher.Main.main(Main.java:1472)
00:23:07 
00:23:07 Running org.eclipse.egerrit.core.command.tests.GetChangeCommandTest
00:23:07 Checking out http://104.154.18.211:28115/egerrit/test into /tmp/genie.egerrit/egerrit3803551747979696427.tmp
00:23:08 org.eclipse.jgit.api.errors.TransportException: http://104.154.18.211:28115/egerrit/test: error occurred during unpacking on the remote end: error No space left on device
00:23:08 Checking out http://104.154.18.211:28115/egerrit/test into /tmp/genie.egerrit/egerrit6395433292453670640.tmp
00:23:08 org.eclipse.jgit.api.errors.TransportException: http://104.154.18.211:28115/egerrit/test: error occurred during unpacking on the remote end: error No space left on device
00:23:08 Tests run: 2, Failures: 2, Errors: 0, Skipped: 0, Time elapsed: 1.482 sec <<< FAILURE! - in org.eclipse.egerrit.core.command.tests.GetChangeCommandTest
00:23:08 testCall(org.eclipse.egerrit.core.command.tests.GetChangeCommandTest)  Time elapsed: 0.88 sec  <<< FAILURE!
00:23:08 java.lang.AssertionError: http://104.154.18.211:28115/egerrit/test: error occurred during unpacking on the remote end: error No space left on device
00:23:08 	at org.junit.Assert.fail(Assert.java:88)
00:23:08 	at org.eclipse.egerrit.core.command.tests.CommandTest.createReviewWithSimpleFile(CommandTest.java:111)
00:23:08 	at org.eclipse.egerrit.core.command.tests.CommandTestWithSimpleReview.createReview(CommandTestWithSimpleReview.java:19)
00:23:08 	at sun.reflect.GeneratedMethodAccessor9.invoke(Unknown Source)
00:23:08 	at sun.reflect.DelegatingMethodAccessorImpl.invoke(DelegatingMethodAccessorImpl.java:43)
00:23:08 	at java.lang.reflect.Method.invoke(Method.java:498)
00:23:08 	at org.junit.runners.model.FrameworkMethod$1.runReflectiveCall(FrameworkMethod.java:50)
00:23:08 	at org.junit.internal.runners.model.ReflectiveCallable.run(ReflectiveCallable.java:12)
00:23:08 	at org.junit.runners.model.FrameworkMethod.invokeExplosively(FrameworkMethod.java:47)
00:23:08 	at org.junit.internal.runners.statements.RunBefores.evaluate(RunBefores.java:24)
00:23:08 	at org.junit.internal.runners.statements.RunAfters.evaluate(RunAfters.java:27)
00:23:08 	at org.junit.runners.ParentRunner.runLeaf(ParentRunner.java:325)
00:23:08 	at org.junit.runners.BlockJUnit4ClassRunner.runChild(BlockJUnit4ClassRunner.java:78)
00:23:08 	at org.junit.runners.BlockJUnit4ClassRunner.runChild(BlockJUnit4ClassRunner.java:57)
00:23:08 	at org.junit.runners.ParentRunner$3.run(ParentRunner.java:290)
00:23:08 	at org.junit.runners.ParentRunner$1.schedule(ParentRunner.java:71)
00:23:08 	at org.junit.runners.ParentRunner.runChildren(ParentRunner.java:288)
00:23:08 	at org.junit.runners.ParentRunner.access$000(ParentRunner.java:58)
00:23:08 	at org.junit.runners.ParentRunner$2.evaluate(ParentRunner.java:268)
00:23:08 	at org.junit.runners.ParentRunner.run(ParentRunner.java:363)
00:23:08 	at org.apache.maven.surefire.junit4.JUnit4Provider.execute(JUnit4Provider.java:264)
00:23:08 	at org.apache.maven.surefire.junit4.JUnit4Provider.executeTestSet(JUnit4Provider.java:153)
00:23:08 	at org.apache.maven.surefire.junit4.JUnit4Provider.invoke(JUnit4Provider.java:124)
00:23:08 	at sun.reflect.NativeMethodAccessorImpl.invoke0(Native Method)
00:23:08 	at sun.reflect.NativeMethodAccessorImpl.invoke(NativeMethodAccessorImpl.java:62)
00:23:08 	at sun.reflect.DelegatingMethodAccessorImpl.invoke(DelegatingMethodAccessorImpl.java:43)
00:23:08 	at java.lang.reflect.Method.invoke(Method.java:498)
00:23:08 	at org.apache.maven.surefire.util.ReflectionUtils.invokeMethodWithArray2(ReflectionUtils.java:208)
00:23:08 	at org.apache.maven.surefire.booter.ProviderFactory$ProviderProxy.invoke(ProviderFactory.java:156)
00:23:08 	at org.apache.maven.surefire.booter.ProviderFactory.invokeProvider(ProviderFactory.java:82)
00:23:08 	at org.eclipse.tycho.surefire.osgibooter.OsgiSurefireBooter.run(OsgiSurefireBooter.java:95)
00:23:08 	at org.eclipse.tycho.surefire.osgibooter.HeadlessTestApplication.run(HeadlessTestApplication.java:21)
00:23:08 	at sun.reflect.NativeMethodAccessorImpl.invoke0(Native Method)
00:23:08 	at sun.reflect.NativeMethodAccessorImpl.invoke(NativeMethodAccessorImpl.java:62)
00:23:08 	at sun.reflect.DelegatingMethodAccessorImpl.invoke(DelegatingMethodAccessorImpl.java:43)
00:23:08 	at java.lang.reflect.Method.invoke(Method.java:498)
00:23:08 	at org.eclipse.equinox.internal.app.EclipseAppContainer.callMethodWithException(EclipseAppContainer.java:587)
00:23:08 	at org.eclipse.equinox.internal.app.EclipseAppHandle.run(EclipseAppHandle.java:198)
00:23:08 	at org.eclipse.core.runtime.internal.adaptor.EclipseAppLauncher.runApplication(EclipseAppLauncher.java:134)
00:23:08 	at org.eclipse.core.runtime.internal.adaptor.EclipseAppLauncher.start(EclipseAppLauncher.java:104)
00:23:08 	at org.eclipse.core.runtime.adaptor.EclipseStarter.run(EclipseStarter.java:388)
00:23:08 	at org.eclipse.core.runtime.adaptor.EclipseStarter.run(EclipseStarter.java:243)
00:23:08 	at sun.reflect.NativeMethodAccessorImpl.invoke0(Native Method)
00:23:08 	at sun.reflect.NativeMethodAccessorImpl.invoke(NativeMethodAccessorImpl.java:62)
00:23:08 	at sun.reflect.DelegatingMethodAccessorImpl.invoke(DelegatingMethodAccessorImpl.java:43)
00:23:08 	at java.lang.reflect.Method.invoke(Method.java:498)
00:23:08 	at org.eclipse.equinox.launcher.Main.invokeFramework(Main.java:653)
00:23:08 	at org.eclipse.equinox.launcher.Main.basicRun(Main.java:590)
00:23:08 	at org.eclipse.equinox.launcher.Main.run(Main.java:1499)
00:23:08 	at org.eclipse.equinox.launcher.Main.main(Main.java:1472)
00:23:08 
00:23:08 testWithRevisions(org.eclipse.egerrit.core.command.tests.GetChangeCommandTest)  Time elapsed: 0.6 sec  <<< FAILURE!
00:23:08 java.lang.AssertionError: http://104.154.18.211:28115/egerrit/test: error occurred during unpacking on the remote end: error No space left on device
00:23:08 	at org.junit.Assert.fail(Assert.java:88)
00:23:08 	at org.eclipse.egerrit.core.command.tests.CommandTest.createReviewWithSimpleFile(CommandTest.java:111)
00:23:08 	at org.eclipse.egerrit.core.command.tests.CommandTestWithSimpleReview.createReview(CommandTestWithSimpleReview.java:19)
00:23:08 	at sun.reflect.GeneratedMethodAccessor9.invoke(Unknown Source)
00:23:08 	at sun.reflect.DelegatingMethodAccessorImpl.invoke(DelegatingMethodAccessorImpl.java:43)
00:23:08 	at java.lang.reflect.Method.invoke(Method.java:498)
00:23:08 	at org.junit.runners.model.FrameworkMethod$1.runReflectiveCall(FrameworkMethod.java:50)
00:23:08 	at org.junit.internal.runners.model.ReflectiveCallable.run(ReflectiveCallable.java:12)
00:23:08 	at org.junit.runners.model.FrameworkMethod.invokeExplosively(FrameworkMethod.java:47)
00:23:08 	at org.junit.internal.runners.statements.RunBefores.evaluate(RunBefores.java:24)
00:23:08 	at org.junit.internal.runners.statements.RunAfters.evaluate(RunAfters.java:27)
00:23:08 	at org.junit.runners.ParentRunner.runLeaf(ParentRunner.java:325)
00:23:08 	at org.junit.runners.BlockJUnit4ClassRunner.runChild(BlockJUnit4ClassRunner.java:78)
00:23:08 	at org.junit.runners.BlockJUnit4ClassRunner.runChild(BlockJUnit4ClassRunner.java:57)
00:23:08 	at org.junit.runners.ParentRunner$3.run(ParentRunner.java:290)
00:23:08 	at org.junit.runners.ParentRunner$1.schedule(ParentRunner.java:71)
00:23:08 	at org.junit.runners.ParentRunner.runChildren(ParentRunner.java:288)
00:23:08 	at org.junit.runners.ParentRunner.access$000(ParentRunner.java:58)
00:23:08 	at org.junit.runners.ParentRunner$2.evaluate(ParentRunner.java:268)
00:23:08 	at org.junit.runners.ParentRunner.run(ParentRunner.java:363)
00:23:08 	at org.apache.maven.surefire.junit4.JUnit4Provider.execute(JUnit4Provider.java:264)
00:23:08 	at org.apache.maven.surefire.junit4.JUnit4Provider.executeTestSet(JUnit4Provider.java:153)
00:23:08 	at org.apache.maven.surefire.junit4.JUnit4Provider.invoke(JUnit4Provider.java:124)
00:23:08 	at sun.reflect.NativeMethodAccessorImpl.invoke0(Native Method)
00:23:08 	at sun.reflect.NativeMethodAccessorImpl.invoke(NativeMethodAccessorImpl.java:62)
00:23:08 	at sun.reflect.DelegatingMethodAccessorImpl.invoke(DelegatingMethodAccessorImpl.java:43)
00:23:08 	at java.lang.reflect.Method.invoke(Method.java:498)
00:23:08 	at org.apache.maven.surefire.util.ReflectionUtils.invokeMethodWithArray2(ReflectionUtils.java:208)
00:23:08 	at org.apache.maven.surefire.booter.ProviderFactory$ProviderProxy.invoke(ProviderFactory.java:156)
00:23:08 	at org.apache.maven.surefire.booter.ProviderFactory.invokeProvider(ProviderFactory.java:82)
00:23:08 	at org.eclipse.tycho.surefire.osgibooter.OsgiSurefireBooter.run(OsgiSurefireBooter.java:95)
00:23:08 	at org.eclipse.tycho.surefire.osgibooter.HeadlessTestApplication.run(HeadlessTestApplication.java:21)
00:23:08 	at sun.reflect.NativeMethodAccessorImpl.invoke0(Native Method)
00:23:08 	at sun.reflect.NativeMethodAccessorImpl.invoke(NativeMethodAccessorImpl.java:62)
00:23:08 	at sun.reflect.DelegatingMethodAccessorImpl.invoke(DelegatingMethodAccessorImpl.java:43)
00:23:08 	at java.lang.reflect.Method.invoke(Method.java:498)
00:23:08 	at org.eclipse.equinox.internal.app.EclipseAppContainer.callMethodWithException(EclipseAppContainer.java:587)
00:23:08 	at org.eclipse.equinox.internal.app.EclipseAppHandle.run(EclipseAppHandle.java:198)
00:23:08 	at org.eclipse.core.runtime.internal.adaptor.EclipseAppLauncher.runApplication(EclipseAppLauncher.java:134)
00:23:08 	at org.eclipse.core.runtime.internal.adaptor.EclipseAppLauncher.start(EclipseAppLauncher.java:104)
00:23:08 	at org.eclipse.core.runtime.adaptor.EclipseStarter.run(EclipseStarter.java:388)
00:23:08 	at org.eclipse.core.runtime.adaptor.EclipseStarter.run(EclipseStarter.java:243)
00:23:08 	at sun.reflect.NativeMethodAccessorImpl.invoke0(Native Method)
00:23:08 	at sun.reflect.NativeMethodAccessorImpl.invoke(NativeMethodAccessorImpl.java:62)
00:23:08 	at sun.reflect.DelegatingMethodAccessorImpl.invoke(DelegatingMethodAccessorImpl.java:43)
00:23:08 	at java.lang.reflect.Method.invoke(Method.java:498)
00:23:08 	at org.eclipse.equinox.launcher.Main.invokeFramework(Main.java:653)
00:23:08 	at org.eclipse.equinox.launcher.Main.basicRun(Main.java:590)
00:23:08 	at org.eclipse.equinox.launcher.Main.run(Main.java:1499)
00:23:08 	at org.eclipse.equinox.launcher.Main.main(Main.java:1472)
00:23:08 
00:23:08 Running org.eclipse.egerrit.core.command.tests.CreateDraftCommandTest
00:23:08 Checking out http://104.154.18.211:28115/egerrit/test into /tmp/genie.egerrit/egerrit7815539187786102687.tmp
00:23:09 org.eclipse.jgit.api.errors.TransportException: http://104.154.18.211:28115/egerrit/test: error occurred during unpacking on the remote end: error No space left on device
00:23:09 Checking out http://104.154.18.211:28115/egerrit/test into /tmp/genie.egerrit/egerrit966154108523573480.tmp
00:23:10 org.eclipse.jgit.api.errors.TransportException: http://104.154.18.211:28115/egerrit/test: error occurred during unpacking on the remote end: error No space left on device
00:23:10 Tests run: 2, Failures: 2, Errors: 0, Skipped: 0, Time elapsed: 1.274 sec <<< FAILURE! - in org.eclipse.egerrit.core.command.tests.CreateDraftCommandTest
00:23:10 testCall(org.eclipse.egerrit.core.command.tests.CreateDraftCommandTest)  Time elapsed: 0.629 sec  <<< FAILURE!
00:23:10 java.lang.AssertionError: http://104.154.18.211:28115/egerrit/test: error occurred during unpacking on the remote end: error No space left on device
00:23:10 	at org.junit.Assert.fail(Assert.java:88)
00:23:10 	at org.eclipse.egerrit.core.command.tests.CommandTest.createReviewWithSimpleFile(CommandTest.java:111)
00:23:10 	at org.eclipse.egerrit.core.command.tests.CommandTestWithSimpleReview.createReview(CommandTestWithSimpleReview.java:19)
00:23:10 	at sun.reflect.GeneratedMethodAccessor9.invoke(Unknown Source)
00:23:10 	at sun.reflect.DelegatingMethodAccessorImpl.invoke(DelegatingMethodAccessorImpl.java:43)
00:23:10 	at java.lang.reflect.Method.invoke(Method.java:498)
00:23:10 	at org.junit.runners.model.FrameworkMethod$1.runReflectiveCall(FrameworkMethod.java:50)
00:23:10 	at org.junit.internal.runners.model.ReflectiveCallable.run(ReflectiveCallable.java:12)
00:23:10 	at org.junit.runners.model.FrameworkMethod.invokeExplosively(FrameworkMethod.java:47)
00:23:10 	at org.junit.internal.runners.statements.RunBefores.evaluate(RunBefores.java:24)
00:23:10 	at org.junit.internal.runners.statements.RunAfters.evaluate(RunAfters.java:27)
00:23:10 	at org.junit.runners.ParentRunner.runLeaf(ParentRunner.java:325)
00:23:10 	at org.junit.runners.BlockJUnit4ClassRunner.runChild(BlockJUnit4ClassRunner.java:78)
00:23:10 	at org.junit.runners.BlockJUnit4ClassRunner.runChild(BlockJUnit4ClassRunner.java:57)
00:23:10 	at org.junit.runners.ParentRunner$3.run(ParentRunner.java:290)
00:23:10 	at org.junit.runners.ParentRunner$1.schedule(ParentRunner.java:71)
00:23:10 	at org.junit.runners.ParentRunner.runChildren(ParentRunner.java:288)
00:23:10 	at org.junit.runners.ParentRunner.access$000(ParentRunner.java:58)
00:23:10 	at org.junit.runners.ParentRunner$2.evaluate(ParentRunner.java:268)
00:23:10 	at org.junit.runners.ParentRunner.run(ParentRunner.java:363)
00:23:10 	at org.apache.maven.surefire.junit4.JUnit4Provider.execute(JUnit4Provider.java:264)
00:23:10 	at org.apache.maven.surefire.junit4.JUnit4Provider.executeTestSet(JUnit4Provider.java:153)
00:23:10 	at org.apache.maven.surefire.junit4.JUnit4Provider.invoke(JUnit4Provider.java:124)
00:23:10 	at sun.reflect.NativeMethodAccessorImpl.invoke0(Native Method)
00:23:10 	at sun.reflect.NativeMethodAccessorImpl.invoke(NativeMethodAccessorImpl.java:62)
00:23:10 	at sun.reflect.DelegatingMethodAccessorImpl.invoke(DelegatingMethodAccessorImpl.java:43)
00:23:10 	at java.lang.reflect.Method.invoke(Method.java:498)
00:23:10 	at org.apache.maven.surefire.util.ReflectionUtils.invokeMethodWithArray2(ReflectionUtils.java:208)
00:23:10 	at org.apache.maven.surefire.booter.ProviderFactory$ProviderProxy.invoke(ProviderFactory.java:156)
00:23:10 	at org.apache.maven.surefire.booter.ProviderFactory.invokeProvider(ProviderFactory.java:82)
00:23:10 	at org.eclipse.tycho.surefire.osgibooter.OsgiSurefireBooter.run(OsgiSurefireBooter.java:95)
00:23:10 	at org.eclipse.tycho.surefire.osgibooter.HeadlessTestApplication.run(HeadlessTestApplication.java:21)
00:23:10 	at sun.reflect.NativeMethodAccessorImpl.invoke0(Native Method)
00:23:10 	at sun.reflect.NativeMethodAccessorImpl.invoke(NativeMethodAccessorImpl.java:62)
00:23:10 	at sun.reflect.DelegatingMethodAccessorImpl.invoke(DelegatingMethodAccessorImpl.java:43)
00:23:10 	at java.lang.reflect.Method.invoke(Method.java:498)
00:23:10 	at org.eclipse.equinox.internal.app.EclipseAppContainer.callMethodWithException(EclipseAppContainer.java:587)
00:23:10 	at org.eclipse.equinox.internal.app.EclipseAppHandle.run(EclipseAppHandle.java:198)
00:23:10 	at org.eclipse.core.runtime.internal.adaptor.EclipseAppLauncher.runApplication(EclipseAppLauncher.java:134)
00:23:10 	at org.eclipse.core.runtime.internal.adaptor.EclipseAppLauncher.start(EclipseAppLauncher.java:104)
00:23:10 	at org.eclipse.core.runtime.adaptor.EclipseStarter.run(EclipseStarter.java:388)
00:23:10 	at org.eclipse.core.runtime.adaptor.EclipseStarter.run(EclipseStarter.java:243)
00:23:10 	at sun.reflect.NativeMethodAccessorImpl.invoke0(Native Method)
00:23:10 	at sun.reflect.NativeMethodAccessorImpl.invoke(NativeMethodAccessorImpl.java:62)
00:23:10 	at sun.reflect.DelegatingMethodAccessorImpl.invoke(DelegatingMethodAccessorImpl.java:43)
00:23:10 	at java.lang.reflect.Method.invoke(Method.java:498)
00:23:10 	at org.eclipse.equinox.launcher.Main.invokeFramework(Main.java:653)
00:23:10 	at org.eclipse.equinox.launcher.Main.basicRun(Main.java:590)
00:23:10 	at org.eclipse.equinox.launcher.Main.run(Main.java:1499)
00:23:10 	at org.eclipse.equinox.launcher.Main.main(Main.java:1472)
00:23:10 
00:23:10 testCreateCommentOnLine0(org.eclipse.egerrit.core.command.tests.CreateDraftCommandTest)  Time elapsed: 0.643 sec  <<< FAILURE!
00:23:10 java.lang.AssertionError: http://104.154.18.211:28115/egerrit/test: error occurred during unpacking on the remote end: error No space left on device
00:23:10 	at org.junit.Assert.fail(Assert.java:88)
00:23:10 	at org.eclipse.egerrit.core.command.tests.CommandTest.createReviewWithSimpleFile(CommandTest.java:111)
00:23:10 	at org.eclipse.egerrit.core.command.tests.CommandTestWithSimpleReview.createReview(CommandTestWithSimpleReview.java:19)
00:23:10 	at sun.reflect.GeneratedMethodAccessor9.invoke(Unknown Source)
00:23:10 	at sun.reflect.DelegatingMethodAccessorImpl.invoke(DelegatingMethodAccessorImpl.java:43)
00:23:10 	at java.lang.reflect.Method.invoke(Method.java:498)
00:23:10 	at org.junit.runners.model.FrameworkMethod$1.runReflectiveCall(FrameworkMethod.java:50)
00:23:10 	at org.junit.internal.runners.model.ReflectiveCallable.run(ReflectiveCallable.java:12)
00:23:10 	at org.junit.runners.model.FrameworkMethod.invokeExplosively(FrameworkMethod.java:47)
00:23:10 	at org.junit.internal.runners.statements.RunBefores.evaluate(RunBefores.java:24)
00:23:10 	at org.junit.internal.runners.statements.RunAfters.evaluate(RunAfters.java:27)
00:23:10 	at org.junit.runners.ParentRunner.runLeaf(ParentRunner.java:325)
00:23:10 	at org.junit.runners.BlockJUnit4ClassRunner.runChild(BlockJUnit4ClassRunner.java:78)
00:23:10 	at org.junit.runners.BlockJUnit4ClassRunner.runChild(BlockJUnit4ClassRunner.java:57)
00:23:10 	at org.junit.runners.ParentRunner$3.run(ParentRunner.java:290)
00:23:10 	at org.junit.runners.ParentRunner$1.schedule(ParentRunner.java:71)
00:23:10 	at org.junit.runners.ParentRunner.runChildren(ParentRunner.java:288)
00:23:10 	at org.junit.runners.ParentRunner.access$000(ParentRunner.java:58)
00:23:10 	at org.junit.runners.ParentRunner$2.evaluate(ParentRunner.java:268)
00:23:10 	at org.junit.runners.ParentRunner.run(ParentRunner.java:363)
00:23:10 	at org.apache.maven.surefire.junit4.JUnit4Provider.execute(JUnit4Provider.java:264)
00:23:10 	at org.apache.maven.surefire.junit4.JUnit4Provider.executeTestSet(JUnit4Provider.java:153)
00:23:10 	at org.apache.maven.surefire.junit4.JUnit4Provider.invoke(JUnit4Provider.java:124)
00:23:10 	at sun.reflect.NativeMethodAccessorImpl.invoke0(Native Method)
00:23:10 	at sun.reflect.NativeMethodAccessorImpl.invoke(NativeMethodAccessorImpl.java:62)
00:23:10 	at sun.reflect.DelegatingMethodAccessorImpl.invoke(DelegatingMethodAccessorImpl.java:43)
00:23:10 	at java.lang.reflect.Method.invoke(Method.java:498)
00:23:10 	at org.apache.maven.surefire.util.ReflectionUtils.invokeMethodWithArray2(ReflectionUtils.java:208)
00:23:10 	at org.apache.maven.surefire.booter.ProviderFactory$ProviderProxy.invoke(ProviderFactory.java:156)
00:23:10 	at org.apache.maven.surefire.booter.ProviderFactory.invokeProvider(ProviderFactory.java:82)
00:23:10 	at org.eclipse.tycho.surefire.osgibooter.OsgiSurefireBooter.run(OsgiSurefireBooter.java:95)
00:23:10 	at org.eclipse.tycho.surefire.osgibooter.HeadlessTestApplication.run(HeadlessTestApplication.java:21)
00:23:10 	at sun.reflect.NativeMethodAccessorImpl.invoke0(Native Method)
00:23:10 	at sun.reflect.NativeMethodAccessorImpl.invoke(NativeMethodAccessorImpl.java:62)
00:23:10 	at sun.reflect.DelegatingMethodAccessorImpl.invoke(DelegatingMethodAccessorImpl.java:43)
00:23:10 	at java.lang.reflect.Method.invoke(Method.java:498)
00:23:10 	at org.eclipse.equinox.internal.app.EclipseAppContainer.callMethodWithException(EclipseAppContainer.java:587)
00:23:10 	at org.eclipse.equinox.internal.app.EclipseAppHandle.run(EclipseAppHandle.java:198)
00:23:10 	at org.eclipse.core.runtime.internal.adaptor.EclipseAppLauncher.runApplication(EclipseAppLauncher.java:134)
00:23:10 	at org.eclipse.core.runtime.internal.adaptor.EclipseAppLauncher.start(EclipseAppLauncher.java:104)
00:23:10 	at org.eclipse.core.runtime.adaptor.EclipseStarter.run(EclipseStarter.java:388)
00:23:10 	at org.eclipse.core.runtime.adaptor.EclipseStarter.run(EclipseStarter.java:243)
00:23:10 	at sun.reflect.NativeMethodAccessorImpl.invoke0(Native Method)
00:23:10 	at sun.reflect.NativeMethodAccessorImpl.invoke(NativeMethodAccessorImpl.java:62)
00:23:10 	at sun.reflect.DelegatingMethodAccessorImpl.invoke(DelegatingMethodAccessorImpl.java:43)
00:23:10 	at java.lang.reflect.Method.invoke(Method.java:498)
00:23:10 	at org.eclipse.equinox.launcher.Main.invokeFramework(Main.java:653)
00:23:10 	at org.eclipse.equinox.launcher.Main.basicRun(Main.java:590)
00:23:10 	at org.eclipse.equinox.launcher.Main.run(Main.java:1499)
00:23:10 	at org.eclipse.equinox.launcher.Main.main(Main.java:1472)
00:23:10 
00:23:10 Running org.eclipse.egerrit.core.command.tests.SuggestReviewersCommandTest
00:23:10 Checking out http://104.154.18.211:28115/egerrit/test into /tmp/genie.egerrit/egerrit9095927481154947355.tmp
00:23:10 org.eclipse.jgit.api.errors.TransportException: http://104.154.18.211:28115/egerrit/test: error occurred during unpacking on the remote end: error No space left on device
00:23:10 Tests run: 1, Failures: 1, Errors: 0, Skipped: 0, Time elapsed: 0.76 sec <<< FAILURE! - in org.eclipse.egerrit.core.command.tests.SuggestReviewersCommandTest
00:23:10 testCall(org.eclipse.egerrit.core.command.tests.SuggestReviewersCommandTest)  Time elapsed: 0.758 sec  <<< FAILURE!
00:23:10 java.lang.AssertionError: http://104.154.18.211:28115/egerrit/test: error occurred during unpacking on the remote end: error No space left on device
00:23:10 	at org.junit.Assert.fail(Assert.java:88)
00:23:10 	at org.eclipse.egerrit.core.command.tests.CommandTest.createReviewWithSimpleFile(CommandTest.java:111)
00:23:10 	at org.eclipse.egerrit.core.command.tests.CommandTestWithSimpleReview.createReview(CommandTestWithSimpleReview.java:19)
00:23:10 	at sun.reflect.GeneratedMethodAccessor9.invoke(Unknown Source)
00:23:10 	at sun.reflect.DelegatingMethodAccessorImpl.invoke(DelegatingMethodAccessorImpl.java:43)
00:23:10 	at java.lang.reflect.Method.invoke(Method.java:498)
00:23:10 	at org.junit.runners.model.FrameworkMethod$1.runReflectiveCall(FrameworkMethod.java:50)
00:23:10 	at org.junit.internal.runners.model.ReflectiveCallable.run(ReflectiveCallable.java:12)
00:23:10 	at org.junit.runners.model.FrameworkMethod.invokeExplosively(FrameworkMethod.java:47)
00:23:10 	at org.junit.internal.runners.statements.RunBefores.evaluate(RunBefores.java:24)
00:23:10 	at org.junit.internal.runners.statements.RunAfters.evaluate(RunAfters.java:27)
00:23:10 	at org.junit.runners.ParentRunner.runLeaf(ParentRunner.java:325)
00:23:10 	at org.junit.runners.BlockJUnit4ClassRunner.runChild(BlockJUnit4ClassRunner.java:78)
00:23:10 	at org.junit.runners.BlockJUnit4ClassRunner.runChild(BlockJUnit4ClassRunner.java:57)
00:23:10 	at org.junit.runners.ParentRunner$3.run(ParentRunner.java:290)
00:23:10 	at org.junit.runners.ParentRunner$1.schedule(ParentRunner.java:71)
00:23:10 	at org.junit.runners.ParentRunner.runChildren(ParentRunner.java:288)
00:23:10 	at org.junit.runners.ParentRunner.access$000(ParentRunner.java:58)
00:23:10 	at org.junit.runners.ParentRunner$2.evaluate(ParentRunner.java:268)
00:23:10 	at org.junit.runners.ParentRunner.run(ParentRunner.java:363)
00:23:10 	at org.apache.maven.surefire.junit4.JUnit4Provider.execute(JUnit4Provider.java:264)
00:23:10 	at org.apache.maven.surefire.junit4.JUnit4Provider.executeTestSet(JUnit4Provider.java:153)
00:23:10 	at org.apache.maven.surefire.junit4.JUnit4Provider.invoke(JUnit4Provider.java:124)
00:23:10 	at sun.reflect.NativeMethodAccessorImpl.invoke0(Native Method)
00:23:10 	at sun.reflect.NativeMethodAccessorImpl.invoke(NativeMethodAccessorImpl.java:62)
00:23:10 	at sun.reflect.DelegatingMethodAccessorImpl.invoke(DelegatingMethodAccessorImpl.java:43)
00:23:10 	at java.lang.reflect.Method.invoke(Method.java:498)
00:23:10 	at org.apache.maven.surefire.util.ReflectionUtils.invokeMethodWithArray2(ReflectionUtils.java:208)
00:23:10 	at org.apache.maven.surefire.booter.ProviderFactory$ProviderProxy.invoke(ProviderFactory.java:156)
00:23:10 	at org.apache.maven.surefire.booter.ProviderFactory.invokeProvider(ProviderFactory.java:82)
00:23:10 	at org.eclipse.tycho.surefire.osgibooter.OsgiSurefireBooter.run(OsgiSurefireBooter.java:95)
00:23:10 	at org.eclipse.tycho.surefire.osgibooter.HeadlessTestApplication.run(HeadlessTestApplication.java:21)
00:23:10 	at sun.reflect.NativeMethodAccessorImpl.invoke0(Native Method)
00:23:10 	at sun.reflect.NativeMethodAccessorImpl.invoke(NativeMethodAccessorImpl.java:62)
00:23:10 	at sun.reflect.DelegatingMethodAccessorImpl.invoke(DelegatingMethodAccessorImpl.java:43)
00:23:10 	at java.lang.reflect.Method.invoke(Method.java:498)
00:23:10 	at org.eclipse.equinox.internal.app.EclipseAppContainer.callMethodWithException(EclipseAppContainer.java:587)
00:23:10 	at org.eclipse.equinox.internal.app.EclipseAppHandle.run(EclipseAppHandle.java:198)
00:23:10 	at org.eclipse.core.runtime.internal.adaptor.EclipseAppLauncher.runApplication(EclipseAppLauncher.java:134)
00:23:10 	at org.eclipse.core.runtime.internal.adaptor.EclipseAppLauncher.start(EclipseAppLauncher.java:104)
00:23:10 	at org.eclipse.core.runtime.adaptor.EclipseStarter.run(EclipseStarter.java:388)
00:23:10 	at org.eclipse.core.runtime.adaptor.EclipseStarter.run(EclipseStarter.java:243)
00:23:10 	at sun.reflect.NativeMethodAccessorImpl.invoke0(Native Method)
00:23:10 	at sun.reflect.NativeMethodAccessorImpl.invoke(NativeMethodAccessorImpl.java:62)
00:23:10 	at sun.reflect.DelegatingMethodAccessorImpl.invoke(DelegatingMethodAccessorImpl.java:43)
00:23:10 	at java.lang.reflect.Method.invoke(Method.java:498)
00:23:10 	at org.eclipse.equinox.launcher.Main.invokeFramework(Main.java:653)
00:23:10 	at org.eclipse.equinox.launcher.Main.basicRun(Main.java:590)
00:23:10 	at org.eclipse.equinox.launcher.Main.run(Main.java:1499)
00:23:10 	at org.eclipse.equinox.launcher.Main.main(Main.java:1472)
00:23:10 
00:23:10 Running org.eclipse.egerrit.core.command.tests.DeleteTopicCommandTest
00:23:10 Checking out http://104.154.18.211:28115/egerrit/test into /tmp/genie.egerrit/egerrit1832311955341904633.tmp
00:23:11 org.eclipse.jgit.api.errors.TransportException: http://104.154.18.211:28115/egerrit/test: error occurred during unpacking on the remote end: error No space left on device
00:23:11 Tests run: 1, Failures: 1, Errors: 0, Skipped: 0, Time elapsed: 0.597 sec <<< FAILURE! - in org.eclipse.egerrit.core.command.tests.DeleteTopicCommandTest
00:23:11 testCall(org.eclipse.egerrit.core.command.tests.DeleteTopicCommandTest)  Time elapsed: 0.595 sec  <<< FAILURE!
00:23:11 java.lang.AssertionError: http://104.154.18.211:28115/egerrit/test: error occurred during unpacking on the remote end: error No space left on device
00:23:11 	at org.junit.Assert.fail(Assert.java:88)
00:23:11 	at org.eclipse.egerrit.core.command.tests.CommandTest.createReviewWithSimpleFile(CommandTest.java:111)
00:23:11 	at org.eclipse.egerrit.core.command.tests.CommandTestWithSimpleReview.createReview(CommandTestWithSimpleReview.java:19)
00:23:11 	at sun.reflect.GeneratedMethodAccessor9.invoke(Unknown Source)
00:23:11 	at sun.reflect.DelegatingMethodAccessorImpl.invoke(DelegatingMethodAccessorImpl.java:43)
00:23:11 	at java.lang.reflect.Method.invoke(Method.java:498)
00:23:11 	at org.junit.runners.model.FrameworkMethod$1.runReflectiveCall(FrameworkMethod.java:50)
00:23:11 	at org.junit.internal.runners.model.ReflectiveCallable.run(ReflectiveCallable.java:12)
00:23:11 	at org.junit.runners.model.FrameworkMethod.invokeExplosively(FrameworkMethod.java:47)
00:23:11 	at org.junit.internal.runners.statements.RunBefores.evaluate(RunBefores.java:24)
00:23:11 	at org.junit.internal.runners.statements.RunAfters.evaluate(RunAfters.java:27)
00:23:11 	at org.junit.runners.ParentRunner.runLeaf(ParentRunner.java:325)
00:23:11 	at org.junit.runners.BlockJUnit4ClassRunner.runChild(BlockJUnit4ClassRunner.java:78)
00:23:11 	at org.junit.runners.BlockJUnit4ClassRunner.runChild(BlockJUnit4ClassRunner.java:57)
00:23:11 	at org.junit.runners.ParentRunner$3.run(ParentRunner.java:290)
00:23:11 	at org.junit.runners.ParentRunner$1.schedule(ParentRunner.java:71)
00:23:11 	at org.junit.runners.ParentRunner.runChildren(ParentRunner.java:288)
00:23:11 	at org.junit.runners.ParentRunner.access$000(ParentRunner.java:58)
00:23:11 	at org.junit.runners.ParentRunner$2.evaluate(ParentRunner.java:268)
00:23:11 	at org.junit.runners.ParentRunner.run(ParentRunner.java:363)
00:23:11 	at org.apache.maven.surefire.junit4.JUnit4Provider.execute(JUnit4Provider.java:264)
00:23:11 	at org.apache.maven.surefire.junit4.JUnit4Provider.executeTestSet(JUnit4Provider.java:153)
00:23:11 	at org.apache.maven.surefire.junit4.JUnit4Provider.invoke(JUnit4Provider.java:124)
00:23:11 	at sun.reflect.NativeMethodAccessorImpl.invoke0(Native Method)
00:23:11 	at sun.reflect.NativeMethodAccessorImpl.invoke(NativeMethodAccessorImpl.java:62)
00:23:11 	at sun.reflect.DelegatingMethodAccessorImpl.invoke(DelegatingMethodAccessorImpl.java:43)
00:23:11 	at java.lang.reflect.Method.invoke(Method.java:498)
00:23:11 	at org.apache.maven.surefire.util.ReflectionUtils.invokeMethodWithArray2(ReflectionUtils.java:208)
00:23:11 	at org.apache.maven.surefire.booter.ProviderFactory$ProviderProxy.invoke(ProviderFactory.java:156)
00:23:11 	at org.apache.maven.surefire.booter.ProviderFactory.invokeProvider(ProviderFactory.java:82)
00:23:11 	at org.eclipse.tycho.surefire.osgibooter.OsgiSurefireBooter.run(OsgiSurefireBooter.java:95)
00:23:11 	at org.eclipse.tycho.surefire.osgibooter.HeadlessTestApplication.run(HeadlessTestApplication.java:21)
00:23:11 	at sun.reflect.NativeMethodAccessorImpl.invoke0(Native Method)
00:23:11 	at sun.reflect.NativeMethodAccessorImpl.invoke(NativeMethodAccessorImpl.java:62)
00:23:11 	at sun.reflect.DelegatingMethodAccessorImpl.invoke(DelegatingMethodAccessorImpl.java:43)
00:23:11 	at java.lang.reflect.Method.invoke(Method.java:498)
00:23:11 	at org.eclipse.equinox.internal.app.EclipseAppContainer.callMethodWithException(EclipseAppContainer.java:587)
00:23:11 	at org.eclipse.equinox.internal.app.EclipseAppHandle.run(EclipseAppHandle.java:198)
00:23:11 	at org.eclipse.core.runtime.internal.adaptor.EclipseAppLauncher.runApplication(EclipseAppLauncher.java:134)
00:23:11 	at org.eclipse.core.runtime.internal.adaptor.EclipseAppLauncher.start(EclipseAppLauncher.java:104)
00:23:11 	at org.eclipse.core.runtime.adaptor.EclipseStarter.run(EclipseStarter.java:388)
00:23:11 	at org.eclipse.core.runtime.adaptor.EclipseStarter.run(EclipseStarter.java:243)
00:23:11 	at sun.reflect.NativeMethodAccessorImpl.invoke0(Native Method)
00:23:11 	at sun.reflect.NativeMethodAccessorImpl.invoke(NativeMethodAccessorImpl.java:62)
00:23:11 	at sun.reflect.DelegatingMethodAccessorImpl.invoke(DelegatingMethodAccessorImpl.java:43)
00:23:11 	at java.lang.reflect.Method.invoke(Method.java:498)
00:23:11 	at org.eclipse.equinox.launcher.Main.invokeFramework(Main.java:653)
00:23:11 	at org.eclipse.equinox.launcher.Main.basicRun(Main.java:590)
00:23:11 	at org.eclipse.equinox.launcher.Main.run(Main.java:1499)
00:23:11 	at org.eclipse.equinox.launcher.Main.main(Main.java:1472)
00:23:11 
00:23:11 Running org.eclipse.egerrit.core.command.tests.GetCommitMsgCommandTest
00:23:11 Checking out http://104.154.18.211:28115/egerrit/test into /tmp/genie.egerrit/egerrit7931511226653469088.tmp
00:23:12 org.eclipse.jgit.api.errors.TransportException: http://104.154.18.211:28115/egerrit/test: error occurred during unpacking on the remote end: error No space left on device
00:23:12 Tests run: 1, Failures: 1, Errors: 0, Skipped: 0, Time elapsed: 0.731 sec <<< FAILURE! - in org.eclipse.egerrit.core.command.tests.GetCommitMsgCommandTest
00:23:12 testCall(org.eclipse.egerrit.core.command.tests.GetCommitMsgCommandTest)  Time elapsed: 0.729 sec  <<< FAILURE!
00:23:12 java.lang.AssertionError: http://104.154.18.211:28115/egerrit/test: error occurred during unpacking on the remote end: error No space left on device
00:23:12 	at org.junit.Assert.fail(Assert.java:88)
00:23:12 	at org.eclipse.egerrit.core.command.tests.CommandTest.createReviewWithSimpleFile(CommandTest.java:111)
00:23:12 	at org.eclipse.egerrit.core.command.tests.CommandTestWithSimpleReview.createReview(CommandTestWithSimpleReview.java:19)
00:23:12 	at sun.reflect.GeneratedMethodAccessor9.invoke(Unknown Source)
00:23:12 	at sun.reflect.DelegatingMethodAccessorImpl.invoke(DelegatingMethodAccessorImpl.java:43)
00:23:12 	at java.lang.reflect.Method.invoke(Method.java:498)
00:23:12 	at org.junit.runners.model.FrameworkMethod$1.runReflectiveCall(FrameworkMethod.java:50)
00:23:12 	at org.junit.internal.runners.model.ReflectiveCallable.run(ReflectiveCallable.java:12)
00:23:12 	at org.junit.runners.model.FrameworkMethod.invokeExplosively(FrameworkMethod.java:47)
00:23:12 	at org.junit.internal.runners.statements.RunBefores.evaluate(RunBefores.java:24)
00:23:12 	at org.junit.internal.runners.statements.RunAfters.evaluate(RunAfters.java:27)
00:23:12 	at org.junit.runners.ParentRunner.runLeaf(ParentRunner.java:325)
00:23:12 	at org.junit.runners.BlockJUnit4ClassRunner.runChild(BlockJUnit4ClassRunner.java:78)
00:23:12 	at org.junit.runners.BlockJUnit4ClassRunner.runChild(BlockJUnit4ClassRunner.java:57)
00:23:12 	at org.junit.runners.ParentRunner$3.run(ParentRunner.java:290)
00:23:12 	at org.junit.runners.ParentRunner$1.schedule(ParentRunner.java:71)
00:23:12 	at org.junit.runners.ParentRunner.runChildren(ParentRunner.java:288)
00:23:12 	at org.junit.runners.ParentRunner.access$000(ParentRunner.java:58)
00:23:12 	at org.junit.runners.ParentRunner$2.evaluate(ParentRunner.java:268)
00:23:12 	at org.junit.runners.ParentRunner.run(ParentRunner.java:363)
00:23:12 	at org.apache.maven.surefire.junit4.JUnit4Provider.execute(JUnit4Provider.java:264)
00:23:12 	at org.apache.maven.surefire.junit4.JUnit4Provider.executeTestSet(JUnit4Provider.java:153)
00:23:12 	at org.apache.maven.surefire.junit4.JUnit4Provider.invoke(JUnit4Provider.java:124)
00:23:12 	at sun.reflect.NativeMethodAccessorImpl.invoke0(Native Method)
00:23:12 	at sun.reflect.NativeMethodAccessorImpl.invoke(NativeMethodAccessorImpl.java:62)
00:23:12 	at sun.reflect.DelegatingMethodAccessorImpl.invoke(DelegatingMethodAccessorImpl.java:43)
00:23:12 	at java.lang.reflect.Method.invoke(Method.java:498)
00:23:12 	at org.apache.maven.surefire.util.ReflectionUtils.invokeMethodWithArray2(ReflectionUtils.java:208)
00:23:12 	at org.apache.maven.surefire.booter.ProviderFactory$ProviderProxy.invoke(ProviderFactory.java:156)
00:23:12 	at org.apache.maven.surefire.booter.ProviderFactory.invokeProvider(ProviderFactory.java:82)
00:23:12 	at org.eclipse.tycho.surefire.osgibooter.OsgiSurefireBooter.run(OsgiSurefireBooter.java:95)
00:23:12 	at org.eclipse.tycho.surefire.osgibooter.HeadlessTestApplication.run(HeadlessTestApplication.java:21)
00:23:12 	at sun.reflect.NativeMethodAccessorImpl.invoke0(Native Method)
00:23:12 	at sun.reflect.NativeMethodAccessorImpl.invoke(NativeMethodAccessorImpl.java:62)
00:23:12 	at sun.reflect.DelegatingMethodAccessorImpl.invoke(DelegatingMethodAccessorImpl.java:43)
00:23:12 	at java.lang.reflect.Method.invoke(Method.java:498)
00:23:12 	at org.eclipse.equinox.internal.app.EclipseAppContainer.callMethodWithException(EclipseAppContainer.java:587)
00:23:12 	at org.eclipse.equinox.internal.app.EclipseAppHandle.run(EclipseAppHandle.java:198)
00:23:12 	at org.eclipse.core.runtime.internal.adaptor.EclipseAppLauncher.runApplication(EclipseAppLauncher.java:134)
00:23:12 	at org.eclipse.core.runtime.internal.adaptor.EclipseAppLauncher.start(EclipseAppLauncher.java:104)
00:23:12 	at org.eclipse.core.runtime.adaptor.EclipseStarter.run(EclipseStarter.java:388)
00:23:12 	at org.eclipse.core.runtime.adaptor.EclipseStarter.run(EclipseStarter.java:243)
00:23:12 	at sun.reflect.NativeMethodAccessorImpl.invoke0(Native Method)
00:23:12 	at sun.reflect.NativeMethodAccessorImpl.invoke(NativeMethodAccessorImpl.java:62)
00:23:12 	at sun.reflect.DelegatingMethodAccessorImpl.invoke(DelegatingMethodAccessorImpl.java:43)
00:23:12 	at java.lang.reflect.Method.invoke(Method.java:498)
00:23:12 	at org.eclipse.equinox.launcher.Main.invokeFramework(Main.java:653)
00:23:12 	at org.eclipse.equinox.launcher.Main.basicRun(Main.java:590)
00:23:12 	at org.eclipse.equinox.launcher.Main.run(Main.java:1499)
00:23:12 	at org.eclipse.equinox.launcher.Main.main(Main.java:1472)
00:23:12 
00:23:12 Running org.eclipse.egerrit.core.command.tests.DeleteReviewedCommandTest
00:23:12 Checking out http://104.154.18.211:28115/egerrit/test into /tmp/genie.egerrit/egerrit8379117148011075612.tmp
00:23:12 org.eclipse.jgit.api.errors.TransportException: http://104.154.18.211:28115/egerrit/test: error occurred during unpacking on the remote end: error No space left on device
00:23:12 Tests run: 1, Failures: 1, Errors: 0, Skipped: 0, Time elapsed: 0.652 sec <<< FAILURE! - in org.eclipse.egerrit.core.command.tests.DeleteReviewedCommandTest
00:23:12 testCall(org.eclipse.egerrit.core.command.tests.DeleteReviewedCommandTest)  Time elapsed: 0.65 sec  <<< FAILURE!
00:23:12 java.lang.AssertionError: http://104.154.18.211:28115/egerrit/test: error occurred during unpacking on the remote end: error No space left on device
00:23:12 	at org.junit.Assert.fail(Assert.java:88)
00:23:12 	at org.eclipse.egerrit.core.command.tests.CommandTest.createReviewWithSimpleFile(CommandTest.java:111)
00:23:12 	at org.eclipse.egerrit.core.command.tests.CommandTestWithSimpleReview.createReview(CommandTestWithSimpleReview.java:19)
00:23:12 	at sun.reflect.GeneratedMethodAccessor9.invoke(Unknown Source)
00:23:12 	at sun.reflect.DelegatingMethodAccessorImpl.invoke(DelegatingMethodAccessorImpl.java:43)
00:23:12 	at java.lang.reflect.Method.invoke(Method.java:498)
00:23:12 	at org.junit.runners.model.FrameworkMethod$1.runReflectiveCall(FrameworkMethod.java:50)
00:23:12 	at org.junit.internal.runners.model.ReflectiveCallable.run(ReflectiveCallable.java:12)
00:23:12 	at org.junit.runners.model.FrameworkMethod.invokeExplosively(FrameworkMethod.java:47)
00:23:12 	at org.junit.internal.runners.statements.RunBefores.evaluate(RunBefores.java:24)
00:23:12 	at org.junit.internal.runners.statements.RunAfters.evaluate(RunAfters.java:27)
00:23:12 	at org.junit.runners.ParentRunner.runLeaf(ParentRunner.java:325)
00:23:12 	at org.junit.runners.BlockJUnit4ClassRunner.runChild(BlockJUnit4ClassRunner.java:78)
00:23:12 	at org.junit.runners.BlockJUnit4ClassRunner.runChild(BlockJUnit4ClassRunner.java:57)
00:23:12 	at org.junit.runners.ParentRunner$3.run(ParentRunner.java:290)
00:23:12 	at org.junit.runners.ParentRunner$1.schedule(ParentRunner.java:71)
00:23:12 	at org.junit.runners.ParentRunner.runChildren(ParentRunner.java:288)
00:23:12 	at org.junit.runners.ParentRunner.access$000(ParentRunner.java:58)
00:23:12 	at org.junit.runners.ParentRunner$2.evaluate(ParentRunner.java:268)
00:23:12 	at org.junit.runners.ParentRunner.run(ParentRunner.java:363)
00:23:12 	at org.apache.maven.surefire.junit4.JUnit4Provider.execute(JUnit4Provider.java:264)
00:23:12 	at org.apache.maven.surefire.junit4.JUnit4Provider.executeTestSet(JUnit4Provider.java:153)
00:23:12 	at org.apache.maven.surefire.junit4.JUnit4Provider.invoke(JUnit4Provider.java:124)
00:23:12 	at sun.reflect.NativeMethodAccessorImpl.invoke0(Native Method)
00:23:12 	at sun.reflect.NativeMethodAccessorImpl.invoke(NativeMethodAccessorImpl.java:62)
00:23:12 	at sun.reflect.DelegatingMethodAccessorImpl.invoke(DelegatingMethodAccessorImpl.java:43)
00:23:12 	at java.lang.reflect.Method.invoke(Method.java:498)
00:23:12 	at org.apache.maven.surefire.util.ReflectionUtils.invokeMethodWithArray2(ReflectionUtils.java:208)
00:23:12 	at org.apache.maven.surefire.booter.ProviderFactory$ProviderProxy.invoke(ProviderFactory.java:156)
00:23:12 	at org.apache.maven.surefire.booter.ProviderFactory.invokeProvider(ProviderFactory.java:82)
00:23:12 	at org.eclipse.tycho.surefire.osgibooter.OsgiSurefireBooter.run(OsgiSurefireBooter.java:95)
00:23:12 	at org.eclipse.tycho.surefire.osgibooter.HeadlessTestApplication.run(HeadlessTestApplication.java:21)
00:23:12 	at sun.reflect.NativeMethodAccessorImpl.invoke0(Native Method)
00:23:12 	at sun.reflect.NativeMethodAccessorImpl.invoke(NativeMethodAccessorImpl.java:62)
00:23:12 	at sun.reflect.DelegatingMethodAccessorImpl.invoke(DelegatingMethodAccessorImpl.java:43)
00:23:12 	at java.lang.reflect.Method.invoke(Method.java:498)
00:23:12 	at org.eclipse.equinox.internal.app.EclipseAppContainer.callMethodWithException(EclipseAppContainer.java:587)
00:23:12 	at org.eclipse.equinox.internal.app.EclipseAppHandle.run(EclipseAppHandle.java:198)
00:23:12 	at org.eclipse.core.runtime.internal.adaptor.EclipseAppLauncher.runApplication(EclipseAppLauncher.java:134)
00:23:12 	at org.eclipse.core.runtime.internal.adaptor.EclipseAppLauncher.start(EclipseAppLauncher.java:104)
00:23:12 	at org.eclipse.core.runtime.adaptor.EclipseStarter.run(EclipseStarter.java:388)
00:23:12 	at org.eclipse.core.runtime.adaptor.EclipseStarter.run(EclipseStarter.java:243)
00:23:12 	at sun.reflect.NativeMethodAccessorImpl.invoke0(Native Method)
00:23:12 	at sun.reflect.NativeMethodAccessorImpl.invoke(NativeMethodAccessorImpl.java:62)
00:23:12 	at sun.reflect.DelegatingMethodAccessorImpl.invoke(DelegatingMethodAccessorImpl.java:43)
00:23:12 	at java.lang.reflect.Method.invoke(Method.java:498)
00:23:12 	at org.eclipse.equinox.launcher.Main.invokeFramework(Main.java:653)
00:23:12 	at org.eclipse.equinox.launcher.Main.basicRun(Main.java:590)
00:23:12 	at org.eclipse.equinox.launcher.Main.run(Main.java:1499)
00:23:12 	at org.eclipse.equinox.launcher.Main.main(Main.java:1472)
00:23:12 
00:23:12 Running org.eclipse.egerrit.core.command.tests.ListDraftsCommandTest
00:23:12 Checking out http://104.154.18.211:28115/egerrit/test into /tmp/genie.egerrit/egerrit166993915529969019.tmp
00:23:13 org.eclipse.jgit.api.errors.TransportException: http://104.154.18.211:28115/egerrit/test: error occurred during unpacking on the remote end: error No space left on device
00:23:13 Tests run: 1, Failures: 1, Errors: 0, Skipped: 0, Time elapsed: 0.69 sec <<< FAILURE! - in org.eclipse.egerrit.core.command.tests.ListDraftsCommandTest
00:23:13 testCall(org.eclipse.egerrit.core.command.tests.ListDraftsCommandTest)  Time elapsed: 0.689 sec  <<< FAILURE!
00:23:13 java.lang.AssertionError: http://104.154.18.211:28115/egerrit/test: error occurred during unpacking on the remote end: error No space left on device
00:23:13 	at org.junit.Assert.fail(Assert.java:88)
00:23:13 	at org.eclipse.egerrit.core.command.tests.CommandTest.createReviewWithSimpleFile(CommandTest.java:111)
00:23:13 	at org.eclipse.egerrit.core.command.tests.CommandTestWithSimpleReview.createReview(CommandTestWithSimpleReview.java:19)
00:23:13 	at sun.reflect.GeneratedMethodAccessor9.invoke(Unknown Source)
00:23:13 	at sun.reflect.DelegatingMethodAccessorImpl.invoke(DelegatingMethodAccessorImpl.java:43)
00:23:13 	at java.lang.reflect.Method.invoke(Method.java:498)
00:23:13 	at org.junit.runners.model.FrameworkMethod$1.runReflectiveCall(FrameworkMethod.java:50)
00:23:13 	at org.junit.internal.runners.model.ReflectiveCallable.run(ReflectiveCallable.java:12)
00:23:13 	at org.junit.runners.model.FrameworkMethod.invokeExplosively(FrameworkMethod.java:47)
00:23:13 	at org.junit.internal.runners.statements.RunBefores.evaluate(RunBefores.java:24)
00:23:13 	at org.junit.internal.runners.statements.RunAfters.evaluate(RunAfters.java:27)
00:23:13 	at org.junit.runners.ParentRunner.runLeaf(ParentRunner.java:325)
00:23:13 	at org.junit.runners.BlockJUnit4ClassRunner.runChild(BlockJUnit4ClassRunner.java:78)
00:23:13 	at org.junit.runners.BlockJUnit4ClassRunner.runChild(BlockJUnit4ClassRunner.java:57)
00:23:13 	at org.junit.runners.ParentRunner$3.run(ParentRunner.java:290)
00:23:13 	at org.junit.runners.ParentRunner$1.schedule(ParentRunner.java:71)
00:23:13 	at org.junit.runners.ParentRunner.runChildren(ParentRunner.java:288)
00:23:13 	at org.junit.runners.ParentRunner.access$000(ParentRunner.java:58)
00:23:13 	at org.junit.runners.ParentRunner$2.evaluate(ParentRunner.java:268)
00:23:13 	at org.junit.runners.ParentRunner.run(ParentRunner.java:363)
00:23:13 	at org.apache.maven.surefire.junit4.JUnit4Provider.execute(JUnit4Provider.java:264)
00:23:13 	at org.apache.maven.surefire.junit4.JUnit4Provider.executeTestSet(JUnit4Provider.java:153)
00:23:13 	at org.apache.maven.surefire.junit4.JUnit4Provider.invoke(JUnit4Provider.java:124)
00:23:13 	at sun.reflect.NativeMethodAccessorImpl.invoke0(Native Method)
00:23:13 	at sun.reflect.NativeMethodAccessorImpl.invoke(NativeMethodAccessorImpl.java:62)
00:23:13 	at sun.reflect.DelegatingMethodAccessorImpl.invoke(DelegatingMethodAccessorImpl.java:43)
00:23:13 	at java.lang.reflect.Method.invoke(Method.java:498)
00:23:13 	at org.apache.maven.surefire.util.ReflectionUtils.invokeMethodWithArray2(ReflectionUtils.java:208)
00:23:13 	at org.apache.maven.surefire.booter.ProviderFactory$ProviderProxy.invoke(ProviderFactory.java:156)
00:23:13 	at org.apache.maven.surefire.booter.ProviderFactory.invokeProvider(ProviderFactory.java:82)
00:23:13 	at org.eclipse.tycho.surefire.osgibooter.OsgiSurefireBooter.run(OsgiSurefireBooter.java:95)
00:23:13 	at org.eclipse.tycho.surefire.osgibooter.HeadlessTestApplication.run(HeadlessTestApplication.java:21)
00:23:13 	at sun.reflect.NativeMethodAccessorImpl.invoke0(Native Method)
00:23:13 	at sun.reflect.NativeMethodAccessorImpl.invoke(NativeMethodAccessorImpl.java:62)
00:23:13 	at sun.reflect.DelegatingMethodAccessorImpl.invoke(DelegatingMethodAccessorImpl.java:43)
00:23:13 	at java.lang.reflect.Method.invoke(Method.java:498)
00:23:13 	at org.eclipse.equinox.internal.app.EclipseAppContainer.callMethodWithException(EclipseAppContainer.java:587)
00:23:13 	at org.eclipse.equinox.internal.app.EclipseAppHandle.run(EclipseAppHandle.java:198)
00:23:13 	at org.eclipse.core.runtime.internal.adaptor.EclipseAppLauncher.runApplication(EclipseAppLauncher.java:134)
00:23:13 	at org.eclipse.core.runtime.internal.adaptor.EclipseAppLauncher.start(EclipseAppLauncher.java:104)
00:23:13 	at org.eclipse.core.runtime.adaptor.EclipseStarter.run(EclipseStarter.java:388)
00:23:13 	at org.eclipse.core.runtime.adaptor.EclipseStarter.run(EclipseStarter.java:243)
00:23:13 	at sun.reflect.NativeMethodAccessorImpl.invoke0(Native Method)
00:23:13 	at sun.reflect.NativeMethodAccessorImpl.invoke(NativeMethodAccessorImpl.java:62)
00:23:13 	at sun.reflect.DelegatingMethodAccessorImpl.invoke(DelegatingMethodAccessorImpl.java:43)
00:23:13 	at java.lang.reflect.Method.invoke(Method.java:498)
00:23:13 	at org.eclipse.equinox.launcher.Main.invokeFramework(Main.java:653)
00:23:13 	at org.eclipse.equinox.launcher.Main.basicRun(Main.java:590)
00:23:13 	at org.eclipse.equinox.launcher.Main.run(Main.java:1499)
00:23:13 	at org.eclipse.equinox.launcher.Main.main(Main.java:1472)
00:23:13 
00:23:13 Running org.eclipse.egerrit.core.command.tests.GetModifiedFilesCommandTest
00:23:13 Checking out http://104.154.18.211:28115/egerrit/test into /tmp/genie.egerrit/egerrit6639027536300692600.tmp
00:23:14 org.eclipse.jgit.api.errors.TransportException: http://104.154.18.211:28115/egerrit/test: error occurred during unpacking on the remote end: error No space left on device
00:23:14 Tests run: 1, Failures: 1, Errors: 0, Skipped: 0, Time elapsed: 0.628 sec <<< FAILURE! - in org.eclipse.egerrit.core.command.tests.GetModifiedFilesCommandTest
00:23:14 testCommand(org.eclipse.egerrit.core.command.tests.GetModifiedFilesCommandTest)  Time elapsed: 0.627 sec  <<< FAILURE!
00:23:14 java.lang.AssertionError: http://104.154.18.211:28115/egerrit/test: error occurred during unpacking on the remote end: error No space left on device
00:23:14 	at org.junit.Assert.fail(Assert.java:88)
00:23:14 	at org.eclipse.egerrit.core.command.tests.CommandTest.createReviewWithSimpleFile(CommandTest.java:111)
00:23:14 	at org.eclipse.egerrit.core.command.tests.CommandTestWithSimpleReview.createReview(CommandTestWithSimpleReview.java:19)
00:23:14 	at sun.reflect.GeneratedMethodAccessor9.invoke(Unknown Source)
00:23:14 	at sun.reflect.DelegatingMethodAccessorImpl.invoke(DelegatingMethodAccessorImpl.java:43)
00:23:14 	at java.lang.reflect.Method.invoke(Method.java:498)
00:23:14 	at org.junit.runners.model.FrameworkMethod$1.runReflectiveCall(FrameworkMethod.java:50)
00:23:14 	at org.junit.internal.runners.model.ReflectiveCallable.run(ReflectiveCallable.java:12)
00:23:14 	at org.junit.runners.model.FrameworkMethod.invokeExplosively(FrameworkMethod.java:47)
00:23:14 	at org.junit.internal.runners.statements.RunBefores.evaluate(RunBefores.java:24)
00:23:14 	at org.junit.internal.runners.statements.RunAfters.evaluate(RunAfters.java:27)
00:23:14 	at org.junit.runners.ParentRunner.runLeaf(ParentRunner.java:325)
00:23:14 	at org.junit.runners.BlockJUnit4ClassRunner.runChild(BlockJUnit4ClassRunner.java:78)
00:23:14 	at org.junit.runners.BlockJUnit4ClassRunner.runChild(BlockJUnit4ClassRunner.java:57)
00:23:14 	at org.junit.runners.ParentRunner$3.run(ParentRunner.java:290)
00:23:14 	at org.junit.runners.ParentRunner$1.schedule(ParentRunner.java:71)
00:23:14 	at org.junit.runners.ParentRunner.runChildren(ParentRunner.java:288)
00:23:14 	at org.junit.runners.ParentRunner.access$000(ParentRunner.java:58)
00:23:14 	at org.junit.runners.ParentRunner$2.evaluate(ParentRunner.java:268)
00:23:14 	at org.junit.runners.ParentRunner.run(ParentRunner.java:363)
00:23:14 	at org.apache.maven.surefire.junit4.JUnit4Provider.execute(JUnit4Provider.java:264)
00:23:14 	at org.apache.maven.surefire.junit4.JUnit4Provider.executeTestSet(JUnit4Provider.java:153)
00:23:14 	at org.apache.maven.surefire.junit4.JUnit4Provider.invoke(JUnit4Provider.java:124)
00:23:14 	at sun.reflect.NativeMethodAccessorImpl.invoke0(Native Method)
00:23:14 	at sun.reflect.NativeMethodAccessorImpl.invoke(NativeMethodAccessorImpl.java:62)
00:23:14 	at sun.reflect.DelegatingMethodAccessorImpl.invoke(DelegatingMethodAccessorImpl.java:43)
00:23:14 	at java.lang.reflect.Method.invoke(Method.java:498)
00:23:14 	at org.apache.maven.surefire.util.ReflectionUtils.invokeMethodWithArray2(ReflectionUtils.java:208)
00:23:14 	at org.apache.maven.surefire.booter.ProviderFactory$ProviderProxy.invoke(ProviderFactory.java:156)
00:23:14 	at org.apache.maven.surefire.booter.ProviderFactory.invokeProvider(ProviderFactory.java:82)
00:23:14 	at org.eclipse.tycho.surefire.osgibooter.OsgiSurefireBooter.run(OsgiSurefireBooter.java:95)
00:23:14 	at org.eclipse.tycho.surefire.osgibooter.HeadlessTestApplication.run(HeadlessTestApplication.java:21)
00:23:14 	at sun.reflect.NativeMethodAccessorImpl.invoke0(Native Method)
00:23:14 	at sun.reflect.NativeMethodAccessorImpl.invoke(NativeMethodAccessorImpl.java:62)
00:23:14 	at sun.reflect.DelegatingMethodAccessorImpl.invoke(DelegatingMethodAccessorImpl.java:43)
00:23:14 	at java.lang.reflect.Method.invoke(Method.java:498)
00:23:14 	at org.eclipse.equinox.internal.app.EclipseAppContainer.callMethodWithException(EclipseAppContainer.java:587)
00:23:14 	at org.eclipse.equinox.internal.app.EclipseAppHandle.run(EclipseAppHandle.java:198)
00:23:14 	at org.eclipse.core.runtime.internal.adaptor.EclipseAppLauncher.runApplication(EclipseAppLauncher.java:134)
00:23:14 	at org.eclipse.core.runtime.internal.adaptor.EclipseAppLauncher.start(EclipseAppLauncher.java:104)
00:23:14 	at org.eclipse.core.runtime.adaptor.EclipseStarter.run(EclipseStarter.java:388)
00:23:14 	at org.eclipse.core.runtime.adaptor.EclipseStarter.run(EclipseStarter.java:243)
00:23:14 	at sun.reflect.NativeMethodAccessorImpl.invoke0(Native Method)
00:23:14 	at sun.reflect.NativeMethodAccessorImpl.invoke(NativeMethodAccessorImpl.java:62)
00:23:14 	at sun.reflect.DelegatingMethodAccessorImpl.invoke(DelegatingMethodAccessorImpl.java:43)
00:23:14 	at java.lang.reflect.Method.invoke(Method.java:498)
00:23:14 	at org.eclipse.equinox.launcher.Main.invokeFramework(Main.java:653)
00:23:14 	at org.eclipse.equinox.launcher.Main.basicRun(Main.java:590)
00:23:14 	at org.eclipse.equinox.launcher.Main.run(Main.java:1499)
00:23:14 	at org.eclipse.equinox.launcher.Main.main(Main.java:1472)
00:23:14 
00:23:14 Running org.eclipse.egerrit.core.command.tests.SetReviewedCommandTest
00:23:14 Checking out http://104.154.18.211:28115/egerrit/test into /tmp/genie.egerrit/egerrit8370000054973251943.tmp
00:23:14 org.eclipse.jgit.api.errors.TransportException: http://104.154.18.211:28115/egerrit/test: error occurred during unpacking on the remote end: error No space left on device
00:23:14 Tests run: 1, Failures: 1, Errors: 0, Skipped: 0, Time elapsed: 0.659 sec <<< FAILURE! - in org.eclipse.egerrit.core.command.tests.SetReviewedCommandTest
00:23:14 testCall(org.eclipse.egerrit.core.command.tests.SetReviewedCommandTest)  Time elapsed: 0.657 sec  <<< FAILURE!
00:23:14 java.lang.AssertionError: http://104.154.18.211:28115/egerrit/test: error occurred during unpacking on the remote end: error No space left on device
00:23:14 	at org.junit.Assert.fail(Assert.java:88)
00:23:14 	at org.eclipse.egerrit.core.command.tests.CommandTest.createReviewWithSimpleFile(CommandTest.java:111)
00:23:14 	at org.eclipse.egerrit.core.command.tests.CommandTestWithSimpleReview.createReview(CommandTestWithSimpleReview.java:19)
00:23:14 	at sun.reflect.GeneratedMethodAccessor9.invoke(Unknown Source)
00:23:14 	at sun.reflect.DelegatingMethodAccessorImpl.invoke(DelegatingMethodAccessorImpl.java:43)
00:23:14 	at java.lang.reflect.Method.invoke(Method.java:498)
00:23:14 	at org.junit.runners.model.FrameworkMethod$1.runReflectiveCall(FrameworkMethod.java:50)
00:23:14 	at org.junit.internal.runners.model.ReflectiveCallable.run(ReflectiveCallable.java:12)
00:23:14 	at org.junit.runners.model.FrameworkMethod.invokeExplosively(FrameworkMethod.java:47)
00:23:14 	at org.junit.internal.runners.statements.RunBefores.evaluate(RunBefores.java:24)
00:23:14 	at org.junit.internal.runners.statements.RunAfters.evaluate(RunAfters.java:27)
00:23:14 	at org.junit.runners.ParentRunner.runLeaf(ParentRunner.java:325)
00:23:14 	at org.junit.runners.BlockJUnit4ClassRunner.runChild(BlockJUnit4ClassRunner.java:78)
00:23:14 	at org.junit.runners.BlockJUnit4ClassRunner.runChild(BlockJUnit4ClassRunner.java:57)
00:23:14 	at org.junit.runners.ParentRunner$3.run(ParentRunner.java:290)
00:23:14 	at org.junit.runners.ParentRunner$1.schedule(ParentRunner.java:71)
00:23:14 	at org.junit.runners.ParentRunner.runChildren(ParentRunner.java:288)
00:23:14 	at org.junit.runners.ParentRunner.access$000(ParentRunner.java:58)
00:23:14 	at org.junit.runners.ParentRunner$2.evaluate(ParentRunner.java:268)
00:23:14 	at org.junit.runners.ParentRunner.run(ParentRunner.java:363)
00:23:14 	at org.apache.maven.surefire.junit4.JUnit4Provider.execute(JUnit4Provider.java:264)
00:23:14 	at org.apache.maven.surefire.junit4.JUnit4Provider.executeTestSet(JUnit4Provider.java:153)
00:23:14 	at org.apache.maven.surefire.junit4.JUnit4Provider.invoke(JUnit4Provider.java:124)
00:23:14 	at sun.reflect.NativeMethodAccessorImpl.invoke0(Native Method)
00:23:14 	at sun.reflect.NativeMethodAccessorImpl.invoke(NativeMethodAccessorImpl.java:62)
00:23:14 	at sun.reflect.DelegatingMethodAccessorImpl.invoke(DelegatingMethodAccessorImpl.java:43)
00:23:14 	at java.lang.reflect.Method.invoke(Method.java:498)
00:23:14 	at org.apache.maven.surefire.util.ReflectionUtils.invokeMethodWithArray2(ReflectionUtils.java:208)
00:23:14 	at org.apache.maven.surefire.booter.ProviderFactory$ProviderProxy.invoke(ProviderFactory.java:156)
00:23:14 	at org.apache.maven.surefire.booter.ProviderFactory.invokeProvider(ProviderFactory.java:82)
00:23:14 	at org.eclipse.tycho.surefire.osgibooter.OsgiSurefireBooter.run(OsgiSurefireBooter.java:95)
00:23:14 	at org.eclipse.tycho.surefire.osgibooter.HeadlessTestApplication.run(HeadlessTestApplication.java:21)
00:23:14 	at sun.reflect.NativeMethodAccessorImpl.invoke0(Native Method)
00:23:14 	at sun.reflect.NativeMethodAccessorImpl.invoke(NativeMethodAccessorImpl.java:62)
00:23:14 	at sun.reflect.DelegatingMethodAccessorImpl.invoke(DelegatingMethodAccessorImpl.java:43)
00:23:14 	at java.lang.reflect.Method.invoke(Method.java:498)
00:23:14 	at org.eclipse.equinox.internal.app.EclipseAppContainer.callMethodWithException(EclipseAppContainer.java:587)
00:23:14 	at org.eclipse.equinox.internal.app.EclipseAppHandle.run(EclipseAppHandle.java:198)
00:23:14 	at org.eclipse.core.runtime.internal.adaptor.EclipseAppLauncher.runApplication(EclipseAppLauncher.java:134)
00:23:14 	at org.eclipse.core.runtime.internal.adaptor.EclipseAppLauncher.start(EclipseAppLauncher.java:104)
00:23:14 	at org.eclipse.core.runtime.adaptor.EclipseStarter.run(EclipseStarter.java:388)
00:23:14 	at org.eclipse.core.runtime.adaptor.EclipseStarter.run(EclipseStarter.java:243)
00:23:14 	at sun.reflect.NativeMethodAccessorImpl.invoke0(Native Method)
00:23:14 	at sun.reflect.NativeMethodAccessorImpl.invoke(NativeMethodAccessorImpl.java:62)
00:23:14 	at sun.reflect.DelegatingMethodAccessorImpl.invoke(DelegatingMethodAccessorImpl.java:43)
00:23:14 	at java.lang.reflect.Method.invoke(Method.java:498)
00:23:14 	at org.eclipse.equinox.launcher.Main.invokeFramework(Main.java:653)
00:23:14 	at org.eclipse.equinox.launcher.Main.basicRun(Main.java:590)
00:23:14 	at org.eclipse.equinox.launcher.Main.run(Main.java:1499)
00:23:14 	at org.eclipse.equinox.launcher.Main.main(Main.java:1472)
00:23:14 
00:23:14 Running org.eclipse.egerrit.core.command.tests.DeleteReviewerCommandTest
00:23:14 Checking out http://104.154.18.211:28115/egerrit/test into /tmp/genie.egerrit/egerrit6826242789441145908.tmp
00:23:15 org.eclipse.jgit.api.errors.TransportException: http://104.154.18.211:28115/egerrit/test: error occurred during unpacking on the remote end: error No space left on device
00:23:15 Tests run: 1, Failures: 1, Errors: 0, Skipped: 0, Time elapsed: 0.77 sec <<< FAILURE! - in org.eclipse.egerrit.core.command.tests.DeleteReviewerCommandTest
00:23:15 testCall(org.eclipse.egerrit.core.command.tests.DeleteReviewerCommandTest)  Time elapsed: 0.768 sec  <<< FAILURE!
00:23:15 java.lang.AssertionError: http://104.154.18.211:28115/egerrit/test: error occurred during unpacking on the remote end: error No space left on device
00:23:15 	at org.junit.Assert.fail(Assert.java:88)
00:23:15 	at org.eclipse.egerrit.core.command.tests.CommandTest.createReviewWithSimpleFile(CommandTest.java:111)
00:23:15 	at org.eclipse.egerrit.core.command.tests.CommandTestWithSimpleReview.createReview(CommandTestWithSimpleReview.java:19)
00:23:15 	at sun.reflect.GeneratedMethodAccessor9.invoke(Unknown Source)
00:23:15 	at sun.reflect.DelegatingMethodAccessorImpl.invoke(DelegatingMethodAccessorImpl.java:43)
00:23:15 	at java.lang.reflect.Method.invoke(Method.java:498)
00:23:15 	at org.junit.runners.model.FrameworkMethod$1.runReflectiveCall(FrameworkMethod.java:50)
00:23:15 	at org.junit.internal.runners.model.ReflectiveCallable.run(ReflectiveCallable.java:12)
00:23:15 	at org.junit.runners.model.FrameworkMethod.invokeExplosively(FrameworkMethod.java:47)
00:23:15 	at org.junit.internal.runners.statements.RunBefores.evaluate(RunBefores.java:24)
00:23:15 	at org.junit.internal.runners.statements.RunAfters.evaluate(RunAfters.java:27)
00:23:15 	at org.junit.runners.ParentRunner.runLeaf(ParentRunner.java:325)
00:23:15 	at org.junit.runners.BlockJUnit4ClassRunner.runChild(BlockJUnit4ClassRunner.java:78)
00:23:15 	at org.junit.runners.BlockJUnit4ClassRunner.runChild(BlockJUnit4ClassRunner.java:57)
00:23:15 	at org.junit.runners.ParentRunner$3.run(ParentRunner.java:290)
00:23:15 	at org.junit.runners.ParentRunner$1.schedule(ParentRunner.java:71)
00:23:15 	at org.junit.runners.ParentRunner.runChildren(ParentRunner.java:288)
00:23:15 	at org.junit.runners.ParentRunner.access$000(ParentRunner.java:58)
00:23:15 	at org.junit.runners.ParentRunner$2.evaluate(ParentRunner.java:268)
00:23:15 	at org.junit.runners.ParentRunner.run(ParentRunner.java:363)
00:23:15 	at org.apache.maven.surefire.junit4.JUnit4Provider.execute(JUnit4Provider.java:264)
00:23:15 	at org.apache.maven.surefire.junit4.JUnit4Provider.executeTestSet(JUnit4Provider.java:153)
00:23:15 	at org.apache.maven.surefire.junit4.JUnit4Provider.invoke(JUnit4Provider.java:124)
00:23:15 	at sun.reflect.NativeMethodAccessorImpl.invoke0(Native Method)
00:23:15 	at sun.reflect.NativeMethodAccessorImpl.invoke(NativeMethodAccessorImpl.java:62)
00:23:15 	at sun.reflect.DelegatingMethodAccessorImpl.invoke(DelegatingMethodAccessorImpl.java:43)
00:23:15 	at java.lang.reflect.Method.invoke(Method.java:498)
00:23:15 	at org.apache.maven.surefire.util.ReflectionUtils.invokeMethodWithArray2(ReflectionUtils.java:208)
00:23:15 	at org.apache.maven.surefire.booter.ProviderFactory$ProviderProxy.invoke(ProviderFactory.java:156)
00:23:15 	at org.apache.maven.surefire.booter.ProviderFactory.invokeProvider(ProviderFactory.java:82)
00:23:15 	at org.eclipse.tycho.surefire.osgibooter.OsgiSurefireBooter.run(OsgiSurefireBooter.java:95)
00:23:15 	at org.eclipse.tycho.surefire.osgibooter.HeadlessTestApplication.run(HeadlessTestApplication.java:21)
00:23:15 	at sun.reflect.NativeMethodAccessorImpl.invoke0(Native Method)
00:23:15 	at sun.reflect.NativeMethodAccessorImpl.invoke(NativeMethodAccessorImpl.java:62)
00:23:15 	at sun.reflect.DelegatingMethodAccessorImpl.invoke(DelegatingMethodAccessorImpl.java:43)
00:23:15 	at java.lang.reflect.Method.invoke(Method.java:498)
00:23:15 	at org.eclipse.equinox.internal.app.EclipseAppContainer.callMethodWithException(EclipseAppContainer.java:587)
00:23:15 	at org.eclipse.equinox.internal.app.EclipseAppHandle.run(EclipseAppHandle.java:198)
00:23:15 	at org.eclipse.core.runtime.internal.adaptor.EclipseAppLauncher.runApplication(EclipseAppLauncher.java:134)
00:23:15 	at org.eclipse.core.runtime.internal.adaptor.EclipseAppLauncher.start(EclipseAppLauncher.java:104)
00:23:15 	at org.eclipse.core.runtime.adaptor.EclipseStarter.run(EclipseStarter.java:388)
00:23:15 	at org.eclipse.core.runtime.adaptor.EclipseStarter.run(EclipseStarter.java:243)
00:23:15 	at sun.reflect.NativeMethodAccessorImpl.invoke0(Native Method)
00:23:15 	at sun.reflect.NativeMethodAccessorImpl.invoke(NativeMethodAccessorImpl.java:62)
00:23:15 	at sun.reflect.DelegatingMethodAccessorImpl.invoke(DelegatingMethodAccessorImpl.java:43)
00:23:15 	at java.lang.reflect.Method.invoke(Method.java:498)
00:23:15 	at org.eclipse.equinox.launcher.Main.invokeFramework(Main.java:653)
00:23:15 	at org.eclipse.equinox.launcher.Main.basicRun(Main.java:590)
00:23:15 	at org.eclipse.equinox.launcher.Main.run(Main.java:1499)
00:23:15 	at org.eclipse.equinox.launcher.Main.main(Main.java:1472)
00:23:15 
00:23:15 Running org.eclipse.egerrit.core.command.tests.UpdateDraftCommandTest
00:23:15 Checking out http://104.154.18.211:28115/egerrit/test into /tmp/genie.egerrit/egerrit7702618590594971096.tmp
00:23:16 org.eclipse.jgit.api.errors.TransportException: http://104.154.18.211:28115/egerrit/test: error occurred during unpacking on the remote end: error No space left on device
00:23:16 Checking out http://104.154.18.211:28115/egerrit/test into /tmp/genie.egerrit/egerrit3328311727513258553.tmp
00:23:16 org.eclipse.jgit.api.errors.TransportException: http://104.154.18.211:28115/egerrit/test: error occurred during unpacking on the remote end: error No space left on device
00:23:16 Tests run: 2, Failures: 2, Errors: 0, Skipped: 0, Time elapsed: 1.341 sec <<< FAILURE! - in org.eclipse.egerrit.core.command.tests.UpdateDraftCommandTest
00:23:16 testCall(org.eclipse.egerrit.core.command.tests.UpdateDraftCommandTest)  Time elapsed: 0.655 sec  <<< FAILURE!
00:23:16 java.lang.AssertionError: http://104.154.18.211:28115/egerrit/test: error occurred during unpacking on the remote end: error No space left on device
00:23:16 	at org.junit.Assert.fail(Assert.java:88)
00:23:16 	at org.eclipse.egerrit.core.command.tests.CommandTest.createReviewWithSimpleFile(CommandTest.java:111)
00:23:16 	at org.eclipse.egerrit.core.command.tests.CommandTestWithSimpleReview.createReview(CommandTestWithSimpleReview.java:19)
00:23:16 	at sun.reflect.GeneratedMethodAccessor9.invoke(Unknown Source)
00:23:16 	at sun.reflect.DelegatingMethodAccessorImpl.invoke(DelegatingMethodAccessorImpl.java:43)
00:23:16 	at java.lang.reflect.Method.invoke(Method.java:498)
00:23:16 	at org.junit.runners.model.FrameworkMethod$1.runReflectiveCall(FrameworkMethod.java:50)
00:23:16 	at org.junit.internal.runners.model.ReflectiveCallable.run(ReflectiveCallable.java:12)
00:23:16 	at org.junit.runners.model.FrameworkMethod.invokeExplosively(FrameworkMethod.java:47)
00:23:16 	at org.junit.internal.runners.statements.RunBefores.evaluate(RunBefores.java:24)
00:23:16 	at org.junit.internal.runners.statements.RunAfters.evaluate(RunAfters.java:27)
00:23:16 	at org.junit.runners.ParentRunner.runLeaf(ParentRunner.java:325)
00:23:16 	at org.junit.runners.BlockJUnit4ClassRunner.runChild(BlockJUnit4ClassRunner.java:78)
00:23:16 	at org.junit.runners.BlockJUnit4ClassRunner.runChild(BlockJUnit4ClassRunner.java:57)
00:23:16 	at org.junit.runners.ParentRunner$3.run(ParentRunner.java:290)
00:23:16 	at org.junit.runners.ParentRunner$1.schedule(ParentRunner.java:71)
00:23:16 	at org.junit.runners.ParentRunner.runChildren(ParentRunner.java:288)
00:23:16 	at org.junit.runners.ParentRunner.access$000(ParentRunner.java:58)
00:23:16 	at org.junit.runners.ParentRunner$2.evaluate(ParentRunner.java:268)
00:23:16 	at org.junit.runners.ParentRunner.run(ParentRunner.java:363)
00:23:16 	at org.apache.maven.surefire.junit4.JUnit4Provider.execute(JUnit4Provider.java:264)
00:23:16 	at org.apache.maven.surefire.junit4.JUnit4Provider.executeTestSet(JUnit4Provider.java:153)
00:23:16 	at org.apache.maven.surefire.junit4.JUnit4Provider.invoke(JUnit4Provider.java:124)
00:23:16 	at sun.reflect.NativeMethodAccessorImpl.invoke0(Native Method)
00:23:16 	at sun.reflect.NativeMethodAccessorImpl.invoke(NativeMethodAccessorImpl.java:62)
00:23:16 	at sun.reflect.DelegatingMethodAccessorImpl.invoke(DelegatingMethodAccessorImpl.java:43)
00:23:16 	at java.lang.reflect.Method.invoke(Method.java:498)
00:23:16 	at org.apache.maven.surefire.util.ReflectionUtils.invokeMethodWithArray2(ReflectionUtils.java:208)
00:23:16 	at org.apache.maven.surefire.booter.ProviderFactory$ProviderProxy.invoke(ProviderFactory.java:156)
00:23:16 	at org.apache.maven.surefire.booter.ProviderFactory.invokeProvider(ProviderFactory.java:82)
00:23:16 	at org.eclipse.tycho.surefire.osgibooter.OsgiSurefireBooter.run(OsgiSurefireBooter.java:95)
00:23:16 	at org.eclipse.tycho.surefire.osgibooter.HeadlessTestApplication.run(HeadlessTestApplication.java:21)
00:23:16 	at sun.reflect.NativeMethodAccessorImpl.invoke0(Native Method)
00:23:16 	at sun.reflect.NativeMethodAccessorImpl.invoke(NativeMethodAccessorImpl.java:62)
00:23:16 	at sun.reflect.DelegatingMethodAccessorImpl.invoke(DelegatingMethodAccessorImpl.java:43)
00:23:16 	at java.lang.reflect.Method.invoke(Method.java:498)
00:23:16 	at org.eclipse.equinox.internal.app.EclipseAppContainer.callMethodWithException(EclipseAppContainer.java:587)
00:23:16 	at org.eclipse.equinox.internal.app.EclipseAppHandle.run(EclipseAppHandle.java:198)
00:23:16 	at org.eclipse.core.runtime.internal.adaptor.EclipseAppLauncher.runApplication(EclipseAppLauncher.java:134)
00:23:16 	at org.eclipse.core.runtime.internal.adaptor.EclipseAppLauncher.start(EclipseAppLauncher.java:104)
00:23:16 	at org.eclipse.core.runtime.adaptor.EclipseStarter.run(EclipseStarter.java:388)
00:23:16 	at org.eclipse.core.runtime.adaptor.EclipseStarter.run(EclipseStarter.java:243)
00:23:16 	at sun.reflect.NativeMethodAccessorImpl.invoke0(Native Method)
00:23:16 	at sun.reflect.NativeMethodAccessorImpl.invoke(NativeMethodAccessorImpl.java:62)
00:23:16 	at sun.reflect.DelegatingMethodAccessorImpl.invoke(DelegatingMethodAccessorImpl.java:43)
00:23:16 	at java.lang.reflect.Method.invoke(Method.java:498)
00:23:16 	at org.eclipse.equinox.launcher.Main.invokeFramework(Main.java:653)
00:23:16 	at org.eclipse.equinox.launcher.Main.basicRun(Main.java:590)
00:23:16 	at org.eclipse.equinox.launcher.Main.run(Main.java:1499)
00:23:16 	at org.eclipse.equinox.launcher.Main.main(Main.java:1472)
00:23:16 
00:23:16 testUpdate(org.eclipse.egerrit.core.command.tests.UpdateDraftCommandTest)  Time elapsed: 0.684 sec  <<< FAILURE!
00:23:16 java.lang.AssertionError: http://104.154.18.211:28115/egerrit/test: error occurred during unpacking on the remote end: error No space left on device
00:23:16 	at org.junit.Assert.fail(Assert.java:88)
00:23:16 	at org.eclipse.egerrit.core.command.tests.CommandTest.createReviewWithSimpleFile(CommandTest.java:111)
00:23:16 	at org.eclipse.egerrit.core.command.tests.CommandTestWithSimpleReview.createReview(CommandTestWithSimpleReview.java:19)
00:23:16 	at sun.reflect.GeneratedMethodAccessor9.invoke(Unknown Source)
00:23:16 	at sun.reflect.DelegatingMethodAccessorImpl.invoke(DelegatingMethodAccessorImpl.java:43)
00:23:16 	at java.lang.reflect.Method.invoke(Method.java:498)
00:23:16 	at org.junit.runners.model.FrameworkMethod$1.runReflectiveCall(FrameworkMethod.java:50)
00:23:16 	at org.junit.internal.runners.model.ReflectiveCallable.run(ReflectiveCallable.java:12)
00:23:16 	at org.junit.runners.model.FrameworkMethod.invokeExplosively(FrameworkMethod.java:47)
00:23:16 	at org.junit.internal.runners.statements.RunBefores.evaluate(RunBefores.java:24)
00:23:16 	at org.junit.internal.runners.statements.RunAfters.evaluate(RunAfters.java:27)
00:23:16 	at org.junit.runners.ParentRunner.runLeaf(ParentRunner.java:325)
00:23:16 	at org.junit.runners.BlockJUnit4ClassRunner.runChild(BlockJUnit4ClassRunner.java:78)
00:23:16 	at org.junit.runners.BlockJUnit4ClassRunner.runChild(BlockJUnit4ClassRunner.java:57)
00:23:16 	at org.junit.runners.ParentRunner$3.run(ParentRunner.java:290)
00:23:16 	at org.junit.runners.ParentRunner$1.schedule(ParentRunner.java:71)
00:23:16 	at org.junit.runners.ParentRunner.runChildren(ParentRunner.java:288)
00:23:16 	at org.junit.runners.ParentRunner.access$000(ParentRunner.java:58)
00:23:16 	at org.junit.runners.ParentRunner$2.evaluate(ParentRunner.java:268)
00:23:16 	at org.junit.runners.ParentRunner.run(ParentRunner.java:363)
00:23:16 	at org.apache.maven.surefire.junit4.JUnit4Provider.execute(JUnit4Provider.java:264)
00:23:16 	at org.apache.maven.surefire.junit4.JUnit4Provider.executeTestSet(JUnit4Provider.java:153)
00:23:16 	at org.apache.maven.surefire.junit4.JUnit4Provider.invoke(JUnit4Provider.java:124)
00:23:16 	at sun.reflect.NativeMethodAccessorImpl.invoke0(Native Method)
00:23:16 	at sun.reflect.NativeMethodAccessorImpl.invoke(NativeMethodAccessorImpl.java:62)
00:23:16 	at sun.reflect.DelegatingMethodAccessorImpl.invoke(DelegatingMethodAccessorImpl.java:43)
00:23:16 	at java.lang.reflect.Method.invoke(Method.java:498)
00:23:16 	at org.apache.maven.surefire.util.ReflectionUtils.invokeMethodWithArray2(ReflectionUtils.java:208)
00:23:16 	at org.apache.maven.surefire.booter.ProviderFactory$ProviderProxy.invoke(ProviderFactory.java:156)
00:23:16 	at org.apache.maven.surefire.booter.ProviderFactory.invokeProvider(ProviderFactory.java:82)
00:23:16 	at org.eclipse.tycho.surefire.osgibooter.OsgiSurefireBooter.run(OsgiSurefireBooter.java:95)
00:23:16 	at org.eclipse.tycho.surefire.osgibooter.HeadlessTestApplication.run(HeadlessTestApplication.java:21)
00:23:16 	at sun.reflect.NativeMethodAccessorImpl.invoke0(Native Method)
00:23:16 	at sun.reflect.NativeMethodAccessorImpl.invoke(NativeMethodAccessorImpl.java:62)
00:23:16 	at sun.reflect.DelegatingMethodAccessorImpl.invoke(DelegatingMethodAccessorImpl.java:43)
00:23:16 	at java.lang.reflect.Method.invoke(Method.java:498)
00:23:16 	at org.eclipse.equinox.internal.app.EclipseAppContainer.callMethodWithException(EclipseAppContainer.java:587)
00:23:16 	at org.eclipse.equinox.internal.app.EclipseAppHandle.run(EclipseAppHandle.java:198)
00:23:16 	at org.eclipse.core.runtime.internal.adaptor.EclipseAppLauncher.runApplication(EclipseAppLauncher.java:134)
00:23:16 	at org.eclipse.core.runtime.internal.adaptor.EclipseAppLauncher.start(EclipseAppLauncher.java:104)
00:23:16 	at org.eclipse.core.runtime.adaptor.EclipseStarter.run(EclipseStarter.java:388)
00:23:16 	at org.eclipse.core.runtime.adaptor.EclipseStarter.run(EclipseStarter.java:243)
00:23:16 	at sun.reflect.NativeMethodAccessorImpl.invoke0(Native Method)
00:23:16 	at sun.reflect.NativeMethodAccessorImpl.invoke(NativeMethodAccessorImpl.java:62)
00:23:16 	at sun.reflect.DelegatingMethodAccessorImpl.invoke(DelegatingMethodAccessorImpl.java:43)
00:23:16 	at java.lang.reflect.Method.invoke(Method.java:498)
00:23:16 	at org.eclipse.equinox.launcher.Main.invokeFramework(Main.java:653)
00:23:16 	at org.eclipse.equinox.launcher.Main.basicRun(Main.java:590)
00:23:16 	at org.eclipse.equinox.launcher.Main.run(Main.java:1499)
00:23:16 	at org.eclipse.equinox.launcher.Main.main(Main.java:1472)
00:23:16 
00:23:16 Running org.eclipse.egerrit.core.command.tests.CherryPickRevisionCommandTest
00:23:16 Checking out http://104.154.18.211:28115/egerrit/test into /tmp/genie.egerrit/egerrit7886110698062935184.tmp
00:23:17 org.eclipse.jgit.api.errors.TransportException: http://104.154.18.211:28115/egerrit/test: error occurred during unpacking on the remote end: error No space left on device
00:23:17 Tests run: 1, Failures: 1, Errors: 0, Skipped: 0, Time elapsed: 0.644 sec <<< FAILURE! - in org.eclipse.egerrit.core.command.tests.CherryPickRevisionCommandTest
00:23:17 testCall(org.eclipse.egerrit.core.command.tests.CherryPickRevisionCommandTest)  Time elapsed: 0.642 sec  <<< FAILURE!
00:23:17 java.lang.AssertionError: http://104.154.18.211:28115/egerrit/test: error occurred during unpacking on the remote end: error No space left on device
00:23:17 	at org.junit.Assert.fail(Assert.java:88)
00:23:17 	at org.eclipse.egerrit.core.command.tests.CommandTest.createReviewWithSimpleFile(CommandTest.java:111)
00:23:17 	at org.eclipse.egerrit.core.command.tests.CommandTestWithSimpleReview.createReview(CommandTestWithSimpleReview.java:19)
00:23:17 	at sun.reflect.GeneratedMethodAccessor9.invoke(Unknown Source)
00:23:17 	at sun.reflect.DelegatingMethodAccessorImpl.invoke(DelegatingMethodAccessorImpl.java:43)
00:23:17 	at java.lang.reflect.Method.invoke(Method.java:498)
00:23:17 	at org.junit.runners.model.FrameworkMethod$1.runReflectiveCall(FrameworkMethod.java:50)
00:23:17 	at org.junit.internal.runners.model.ReflectiveCallable.run(ReflectiveCallable.java:12)
00:23:17 	at org.junit.runners.model.FrameworkMethod.invokeExplosively(FrameworkMethod.java:47)
00:23:17 	at org.junit.internal.runners.statements.RunBefores.evaluate(RunBefores.java:24)
00:23:17 	at org.junit.internal.runners.statements.RunAfters.evaluate(RunAfters.java:27)
00:23:17 	at org.junit.runners.ParentRunner.runLeaf(ParentRunner.java:325)
00:23:17 	at org.junit.runners.BlockJUnit4ClassRunner.runChild(BlockJUnit4ClassRunner.java:78)
00:23:17 	at org.junit.runners.BlockJUnit4ClassRunner.runChild(BlockJUnit4ClassRunner.java:57)
00:23:17 	at org.junit.runners.ParentRunner$3.run(ParentRunner.java:290)
00:23:17 	at org.junit.runners.ParentRunner$1.schedule(ParentRunner.java:71)
00:23:17 	at org.junit.runners.ParentRunner.runChildren(ParentRunner.java:288)
00:23:17 	at org.junit.runners.ParentRunner.access$000(ParentRunner.java:58)
00:23:17 	at org.junit.runners.ParentRunner$2.evaluate(ParentRunner.java:268)
00:23:17 	at org.junit.runners.ParentRunner.run(ParentRunner.java:363)
00:23:17 	at org.apache.maven.surefire.junit4.JUnit4Provider.execute(JUnit4Provider.java:264)
00:23:17 	at org.apache.maven.surefire.junit4.JUnit4Provider.executeTestSet(JUnit4Provider.java:153)
00:23:17 	at org.apache.maven.surefire.junit4.JUnit4Provider.invoke(JUnit4Provider.java:124)
00:23:17 	at sun.reflect.NativeMethodAccessorImpl.invoke0(Native Method)
00:23:17 	at sun.reflect.NativeMethodAccessorImpl.invoke(NativeMethodAccessorImpl.java:62)
00:23:17 	at sun.reflect.DelegatingMethodAccessorImpl.invoke(DelegatingMethodAccessorImpl.java:43)
00:23:17 	at java.lang.reflect.Method.invoke(Method.java:498)
00:23:17 	at org.apache.maven.surefire.util.ReflectionUtils.invokeMethodWithArray2(ReflectionUtils.java:208)
00:23:17 	at org.apache.maven.surefire.booter.ProviderFactory$ProviderProxy.invoke(ProviderFactory.java:156)
00:23:17 	at org.apache.maven.surefire.booter.ProviderFactory.invokeProvider(ProviderFactory.java:82)
00:23:17 	at org.eclipse.tycho.surefire.osgibooter.OsgiSurefireBooter.run(OsgiSurefireBooter.java:95)
00:23:17 	at org.eclipse.tycho.surefire.osgibooter.HeadlessTestApplication.run(HeadlessTestApplication.java:21)
00:23:17 	at sun.reflect.NativeMethodAccessorImpl.invoke0(Native Method)
00:23:17 	at sun.reflect.NativeMethodAccessorImpl.invoke(NativeMethodAccessorImpl.java:62)
00:23:17 	at sun.reflect.DelegatingMethodAccessorImpl.invoke(DelegatingMethodAccessorImpl.java:43)
00:23:17 	at java.lang.reflect.Method.invoke(Method.java:498)
00:23:17 	at org.eclipse.equinox.internal.app.EclipseAppContainer.callMethodWithException(EclipseAppContainer.java:587)
00:23:17 	at org.eclipse.equinox.internal.app.EclipseAppHandle.run(EclipseAppHandle.java:198)
00:23:17 	at org.eclipse.core.runtime.internal.adaptor.EclipseAppLauncher.runApplication(EclipseAppLauncher.java:134)
00:23:17 	at org.eclipse.core.runtime.internal.adaptor.EclipseAppLauncher.start(EclipseAppLauncher.java:104)
00:23:17 	at org.eclipse.core.runtime.adaptor.EclipseStarter.run(EclipseStarter.java:388)
00:23:17 	at org.eclipse.core.runtime.adaptor.EclipseStarter.run(EclipseStarter.java:243)
00:23:17 	at sun.reflect.NativeMethodAccessorImpl.invoke0(Native Method)
00:23:17 	at sun.reflect.NativeMethodAccessorImpl.invoke(NativeMethodAccessorImpl.java:62)
00:23:17 	at sun.reflect.DelegatingMethodAccessorImpl.invoke(DelegatingMethodAccessorImpl.java:43)
00:23:17 	at java.lang.reflect.Method.invoke(Method.java:498)
00:23:17 	at org.eclipse.equinox.launcher.Main.invokeFramework(Main.java:653)
00:23:17 	at org.eclipse.equinox.launcher.Main.basicRun(Main.java:590)
00:23:17 	at org.eclipse.equinox.launcher.Main.run(Main.java:1499)
00:23:17 	at org.eclipse.equinox.launcher.Main.main(Main.java:1472)
00:23:17 
00:23:17 Running org.eclipse.egerrit.core.command.tests.AbandonCommandTest
00:23:17 Checking out http://104.154.18.211:28115/egerrit/test into /tmp/genie.egerrit/egerrit3372904366879732364.tmp
00:23:18 org.eclipse.jgit.api.errors.TransportException: http://104.154.18.211:28115/egerrit/test: error occurred during unpacking on the remote end: error No space left on device
00:23:18 Tests run: 1, Failures: 1, Errors: 0, Skipped: 0, Time elapsed: 0.594 sec <<< FAILURE! - in org.eclipse.egerrit.core.command.tests.AbandonCommandTest
00:23:18 testCall(org.eclipse.egerrit.core.command.tests.AbandonCommandTest)  Time elapsed: 0.593 sec  <<< FAILURE!
00:23:18 java.lang.AssertionError: http://104.154.18.211:28115/egerrit/test: error occurred during unpacking on the remote end: error No space left on device
00:23:18 	at org.junit.Assert.fail(Assert.java:88)
00:23:18 	at org.eclipse.egerrit.core.command.tests.CommandTest.createReviewWithSimpleFile(CommandTest.java:111)
00:23:18 	at org.eclipse.egerrit.core.command.tests.CommandTestWithSimpleReview.createReview(CommandTestWithSimpleReview.java:19)
00:23:18 	at sun.reflect.GeneratedMethodAccessor9.invoke(Unknown Source)
00:23:18 	at sun.reflect.DelegatingMethodAccessorImpl.invoke(DelegatingMethodAccessorImpl.java:43)
00:23:18 	at java.lang.reflect.Method.invoke(Method.java:498)
00:23:18 	at org.junit.runners.model.FrameworkMethod$1.runReflectiveCall(FrameworkMethod.java:50)
00:23:18 	at org.junit.internal.runners.model.ReflectiveCallable.run(ReflectiveCallable.java:12)
00:23:18 	at org.junit.runners.model.FrameworkMethod.invokeExplosively(FrameworkMethod.java:47)
00:23:18 	at org.junit.internal.runners.statements.RunBefores.evaluate(RunBefores.java:24)
00:23:18 	at org.junit.internal.runners.statements.RunAfters.evaluate(RunAfters.java:27)
00:23:18 	at org.junit.runners.ParentRunner.runLeaf(ParentRunner.java:325)
00:23:18 	at org.junit.runners.BlockJUnit4ClassRunner.runChild(BlockJUnit4ClassRunner.java:78)
00:23:18 	at org.junit.runners.BlockJUnit4ClassRunner.runChild(BlockJUnit4ClassRunner.java:57)
00:23:18 	at org.junit.runners.ParentRunner$3.run(ParentRunner.java:290)
00:23:18 	at org.junit.runners.ParentRunner$1.schedule(ParentRunner.java:71)
00:23:18 	at org.junit.runners.ParentRunner.runChildren(ParentRunner.java:288)
00:23:18 	at org.junit.runners.ParentRunner.access$000(ParentRunner.java:58)
00:23:18 	at org.junit.runners.ParentRunner$2.evaluate(ParentRunner.java:268)
00:23:18 	at org.junit.runners.ParentRunner.run(ParentRunner.java:363)
00:23:18 	at org.apache.maven.surefire.junit4.JUnit4Provider.execute(JUnit4Provider.java:264)
00:23:18 	at org.apache.maven.surefire.junit4.JUnit4Provider.executeTestSet(JUnit4Provider.java:153)
00:23:18 	at org.apache.maven.surefire.junit4.JUnit4Provider.invoke(JUnit4Provider.java:124)
00:23:18 	at sun.reflect.NativeMethodAccessorImpl.invoke0(Native Method)
00:23:18 	at sun.reflect.NativeMethodAccessorImpl.invoke(NativeMethodAccessorImpl.java:62)
00:23:18 	at sun.reflect.DelegatingMethodAccessorImpl.invoke(DelegatingMethodAccessorImpl.java:43)
00:23:18 	at java.lang.reflect.Method.invoke(Method.java:498)
00:23:18 	at org.apache.maven.surefire.util.ReflectionUtils.invokeMethodWithArray2(ReflectionUtils.java:208)
00:23:18 	at org.apache.maven.surefire.booter.ProviderFactory$ProviderProxy.invoke(ProviderFactory.java:156)
00:23:18 	at org.apache.maven.surefire.booter.ProviderFactory.invokeProvider(ProviderFactory.java:82)
00:23:18 	at org.eclipse.tycho.surefire.osgibooter.OsgiSurefireBooter.run(OsgiSurefireBooter.java:95)
00:23:18 	at org.eclipse.tycho.surefire.osgibooter.HeadlessTestApplication.run(HeadlessTestApplication.java:21)
00:23:18 	at sun.reflect.NativeMethodAccessorImpl.invoke0(Native Method)
00:23:18 	at sun.reflect.NativeMethodAccessorImpl.invoke(NativeMethodAccessorImpl.java:62)
00:23:18 	at sun.reflect.DelegatingMethodAccessorImpl.invoke(DelegatingMethodAccessorImpl.java:43)
00:23:18 	at java.lang.reflect.Method.invoke(Method.java:498)
00:23:18 	at org.eclipse.equinox.internal.app.EclipseAppContainer.callMethodWithException(EclipseAppContainer.java:587)
00:23:18 	at org.eclipse.equinox.internal.app.EclipseAppHandle.run(EclipseAppHandle.java:198)
00:23:18 	at org.eclipse.core.runtime.internal.adaptor.EclipseAppLauncher.runApplication(EclipseAppLauncher.java:134)
00:23:18 	at org.eclipse.core.runtime.internal.adaptor.EclipseAppLauncher.start(EclipseAppLauncher.java:104)
00:23:18 	at org.eclipse.core.runtime.adaptor.EclipseStarter.run(EclipseStarter.java:388)
00:23:18 	at org.eclipse.core.runtime.adaptor.EclipseStarter.run(EclipseStarter.java:243)
00:23:18 	at sun.reflect.NativeMethodAccessorImpl.invoke0(Native Method)
00:23:18 	at sun.reflect.NativeMethodAccessorImpl.invoke(NativeMethodAccessorImpl.java:62)
00:23:18 	at sun.reflect.DelegatingMethodAccessorImpl.invoke(DelegatingMethodAccessorImpl.java:43)
00:23:18 	at java.lang.reflect.Method.invoke(Method.java:498)
00:23:18 	at org.eclipse.equinox.launcher.Main.invokeFramework(Main.java:653)
00:23:18 	at org.eclipse.equinox.launcher.Main.basicRun(Main.java:590)
00:23:18 	at org.eclipse.equinox.launcher.Main.run(Main.java:1499)
00:23:18 	at org.eclipse.equinox.launcher.Main.main(Main.java:1472)
00:23:18 
00:23:18 
00:23:18 Results :
00:23:18 
00:23:18 Failed tests: 
00:23:18   DeleteDraftChangeCommandTest.createDraftReview:35->CommandTest.createReviewWithSimpleFile:111 http://104.154.18.211:28115/egerrit/test: error occurred during unpacking on the remote end: error No space left on device
00:23:18   GetMergeableCommandTest>CommandTestWithSimpleReview.createReview:19->CommandTest.createReviewWithSimpleFile:111 http://104.154.18.211:28115/egerrit/test: error occurred during unpacking on the remote end: error No space left on device
00:23:18   SetTopicCommandTest>CommandTestWithSimpleReview.createReview:19->CommandTest.createReviewWithSimpleFile:111 http://104.154.18.211:28115/egerrit/test: error occurred during unpacking on the remote end: error No space left on device
00:23:18   StarCommandTest>CommandTestWithSimpleReview.createReview:19->CommandTest.createReviewWithSimpleFile:111 http://104.154.18.211:28115/egerrit/test: error occurred during unpacking on the remote end: error No space left on device
00:23:18   ListCommentsCommandTest>CommandTestWithSimpleReview.createReview:19->CommandTest.createReviewWithSimpleFile:111 http://104.154.18.211:28115/egerrit/test: error occurred during unpacking on the remote end: error No space left on device
00:23:18   QueryChangesCommandTest>CommandTestWithSimpleReview.createReview:19->CommandTest.createReviewWithSimpleFile:111 http://104.154.18.211:28115/egerrit/test: error occurred during unpacking on the remote end: error No space left on device
00:23:18   QueryChangesCommandTest>CommandTestWithSimpleReview.createReview:19->CommandTest.createReviewWithSimpleFile:111 http://104.154.18.211:28115/egerrit/test: error occurred during unpacking on the remote end: error No space left on device
00:23:18   QueryChangesCommandTest>CommandTestWithSimpleReview.createReview:19->CommandTest.createReviewWithSimpleFile:111 http://104.154.18.211:28115/egerrit/test: error occurred during unpacking on the remote end: error No space left on device
00:23:18   QueryChangesCommandTest>CommandTestWithSimpleReview.createReview:19->CommandTest.createReviewWithSimpleFile:111 http://104.154.18.211:28115/egerrit/test: error occurred during unpacking on the remote end: error No space left on device
00:23:18   QueryChangesCommandTest>CommandTestWithSimpleReview.createReview:19->CommandTest.createReviewWithSimpleFile:111 http://104.154.18.211:28115/egerrit/test: error occurred during unpacking on the remote end: error No space left on device
00:23:18   QueryChangesCommandTest>CommandTestWithSimpleReview.createReview:19->CommandTest.createReviewWithSimpleFile:111 http://104.154.18.211:28115/egerrit/test: error occurred during unpacking on the remote end: error No space left on device
00:23:18   ListProjectsCommandTest>CommandTestWithSimpleReview.createReview:19->CommandTest.createReviewWithSimpleFile:111 http://104.154.18.211:28115/egerrit/test: error occurred during unpacking on the remote end: error No space left on device
00:23:18   SuggestAccountCommandTest>CommandTestWithSimpleReview.createReview:19->CommandTest.createReviewWithSimpleFile:111 http://104.154.18.211:28115/egerrit/test: error occurred during unpacking on the remote end: error No space left on device
00:23:18   GetReviewedCommandTest>CommandTestWithSimpleReview.createReview:19->CommandTest.createReviewWithSimpleFile:111 http://104.154.18.211:28115/egerrit/test: error occurred during unpacking on the remote end: error No space left on device
00:23:18   SetReviewCommandTest>CommandTestWithSimpleReview.createReview:19->CommandTest.createReviewWithSimpleFile:111 http://104.154.18.211:28115/egerrit/test: error occurred during unpacking on the remote end: error No space left on device
00:23:18   GetContentCommandTest>CommandTestWithSimpleReview.createReview:19->CommandTest.createReviewWithSimpleFile:111 http://104.154.18.211:28115/egerrit/test: error occurred during unpacking on the remote end: error No space left on device
00:23:18   RebaseRevisionCommandTest>CommandTestWithSimpleReview.createReview:19->CommandTest.createReviewWithSimpleFile:111 http://104.154.18.211:28115/egerrit/test: error occurred during unpacking on the remote end: error No space left on device
00:23:18   DeleteDraftCommandTest>CommandTestWithSimpleReview.createReview:19->CommandTest.createReviewWithSimpleFile:111 http://104.154.18.211:28115/egerrit/test: error occurred during unpacking on the remote end: error No space left on device
00:23:18   GetIncludedInCommandTest>CommandTestWithSimpleReview.createReview:19->CommandTest.createReviewWithSimpleFile:111 http://104.154.18.211:28115/egerrit/test: error occurred during unpacking on the remote end: error No space left on device
00:23:18   PublishDraftChangeCommandTest.createDraftReview:35->CommandTest.createReviewWithSimpleFile:111 http://104.154.18.211:28115/egerrit/test: error occurred during unpacking on the remote end: error No space left on device
00:23:18   GetContentFromCommitCommandTest>CommandTestWithSimpleReview.createReview:19->CommandTest.createReviewWithSimpleFile:111 http://104.154.18.211:28115/egerrit/test: error occurred during unpacking on the remote end: error No space left on device
00:23:18   ListBranchesCommandTest>CommandTestWithSimpleReview.createReview:19->CommandTest.createReviewWithSimpleFile:111 http://104.154.18.211:28115/egerrit/test: error occurred during unpacking on the remote end: error No space left on device
00:23:18   GetRelatedChangesCommandTest>CommandTestWithSimpleReview.createReview:19->CommandTest.createReviewWithSimpleFile:111 http://104.154.18.211:28115/egerrit/test: error occurred during unpacking on the remote end: error No space left on device
00:23:18   SubmitCommandTest>CommandTestWithSimpleReview.createReview:19->CommandTest.createReviewWithSimpleFile:111 http://104.154.18.211:28115/egerrit/test: error occurred during unpacking on the remote end: error No space left on device
00:23:18   GetRevisionActionsCommandTest>CommandTestWithSimpleReview.createReview:19->CommandTest.createReviewWithSimpleFile:111 http://104.154.18.211:28115/egerrit/test: error occurred during unpacking on the remote end: error No space left on device
00:23:18   RevertCommandTest>CommandTestWithSimpleReview.createReview:19->CommandTest.createReviewWithSimpleFile:111 http://104.154.18.211:28115/egerrit/test: error occurred during unpacking on the remote end: error No space left on device
00:23:18   UnstarCommandTest>CommandTestWithSimpleReview.createReview:19->CommandTest.createReviewWithSimpleFile:111 http://104.154.18.211:28115/egerrit/test: error occurred during unpacking on the remote end: error No space left on device
00:23:18   AddReviewerCommandTest>CommandTestWithSimpleReview.createReview:19->CommandTest.createReviewWithSimpleFile:111 http://104.154.18.211:28115/egerrit/test: error occurred during unpacking on the remote end: error No space left on device
00:23:18   AddReviewerCommandTest>CommandTestWithSimpleReview.createReview:19->CommandTest.createReviewWithSimpleFile:111 http://104.154.18.211:28115/egerrit/test: error occurred during unpacking on the remote end: error No space left on device
00:23:18   AddReviewerCommandTest>CommandTestWithSimpleReview.createReview:19->CommandTest.createReviewWithSimpleFile:111 http://104.154.18.211:28115/egerrit/test: error occurred during unpacking on the remote end: error No space left on device
00:23:18   RestoreCommandTest>CommandTestWithSimpleReview.createReview:19->CommandTest.createReviewWithSimpleFile:111 http://104.154.18.211:28115/egerrit/test: error occurred during unpacking on the remote end: error No space left on device
00:23:18   DeleteDraftRevisionCommandTest>CommandTestWithSimpleReview.createReview:19->CommandTest.createReviewWithSimpleFile:111 http://104.154.18.211:28115/egerrit/test: error occurred during unpacking on the remote end: error No space left on device
00:23:18   ChangeCommitMsgCommandTest>CommandTestWithSimpleReview.createReview:19->CommandTest.createReviewWithSimpleFile:111 http://104.154.18.211:28115/egerrit/test: error occurred during unpacking on the remote end: error No space left on device
00:23:18   ListReviewersCommandTest>CommandTestWithSimpleReview.createReview:19->CommandTest.createReviewWithSimpleFile:111 http://104.154.18.211:28115/egerrit/test: error occurred during unpacking on the remote end: error No space left on device
00:23:18   GetDiffCommandTest>CommandTestWithSimpleReview.createReview:19->CommandTest.createReviewWithSimpleFile:111 http://104.154.18.211:28115/egerrit/test: error occurred during unpacking on the remote end: error No space left on device
00:23:18   GetDiffCommandTest>CommandTestWithSimpleReview.createReview:19->CommandTest.createReviewWithSimpleFile:111 http://104.154.18.211:28115/egerrit/test: error occurred during unpacking on the remote end: error No space left on device
00:23:18   GetChangeCommandTest>CommandTestWithSimpleReview.createReview:19->CommandTest.createReviewWithSimpleFile:111 http://104.154.18.211:28115/egerrit/test: error occurred during unpacking on the remote end: error No space left on device
00:23:18   GetChangeCommandTest>CommandTestWithSimpleReview.createReview:19->CommandTest.createReviewWithSimpleFile:111 http://104.154.18.211:28115/egerrit/test: error occurred during unpacking on the remote end: error No space left on device
00:23:18   CreateDraftCommandTest>CommandTestWithSimpleReview.createReview:19->CommandTest.createReviewWithSimpleFile:111 http://104.154.18.211:28115/egerrit/test: error occurred during unpacking on the remote end: error No space left on device
00:23:18   CreateDraftCommandTest>CommandTestWithSimpleReview.createReview:19->CommandTest.createReviewWithSimpleFile:111 http://104.154.18.211:28115/egerrit/test: error occurred during unpacking on the remote end: error No space left on device
00:23:18   SuggestReviewersCommandTest>CommandTestWithSimpleReview.createReview:19->CommandTest.createReviewWithSimpleFile:111 http://104.154.18.211:28115/egerrit/test: error occurred during unpacking on the remote end: error No space left on device
00:23:18   DeleteTopicCommandTest>CommandTestWithSimpleReview.createReview:19->CommandTest.createReviewWithSimpleFile:111 http://104.154.18.211:28115/egerrit/test: error occurred during unpacking on the remote end: error No space left on device
00:23:18   GetCommitMsgCommandTest>CommandTestWithSimpleReview.createReview:19->CommandTest.createReviewWithSimpleFile:111 http://104.154.18.211:28115/egerrit/test: error occurred during unpacking on the remote end: error No space left on device
00:23:18   DeleteReviewedCommandTest>CommandTestWithSimpleReview.createReview:19->CommandTest.createReviewWithSimpleFile:111 http://104.154.18.211:28115/egerrit/test: error occurred during unpacking on the remote end: error No space left on device
00:23:18   ListDraftsCommandTest>CommandTestWithSimpleReview.createReview:19->CommandTest.createReviewWithSimpleFile:111 http://104.154.18.211:28115/egerrit/test: error occurred during unpacking on the remote end: error No space left on device
00:23:18   GetModifiedFilesCommandTest>CommandTestWithSimpleReview.createReview:19->CommandTest.createReviewWithSimpleFile:111 http://104.154.18.211:28115/egerrit/test: error occurred during unpacking on the remote end: error No space left on device
00:23:18   SetReviewedCommandTest>CommandTestWithSimpleReview.createReview:19->CommandTest.createReviewWithSimpleFile:111 http://104.154.18.211:28115/egerrit/test: error occurred during unpacking on the remote end: error No space left on device
00:23:18   DeleteReviewerCommandTest>CommandTestWithSimpleReview.createReview:19->CommandTest.createReviewWithSimpleFile:111 http://104.154.18.211:28115/egerrit/test: error occurred during unpacking on the remote end: error No space left on device
00:23:18   UpdateDraftCommandTest>CommandTestWithSimpleReview.createReview:19->CommandTest.createReviewWithSimpleFile:111 http://104.154.18.211:28115/egerrit/test: error occurred during unpacking on the remote end: error No space left on device
00:23:18   UpdateDraftCommandTest>CommandTestWithSimpleReview.createReview:19->CommandTest.createReviewWithSimpleFile:111 http://104.154.18.211:28115/egerrit/test: error occurred during unpacking on the remote end: error No space left on device
00:23:18   CherryPickRevisionCommandTest>CommandTestWithSimpleReview.createReview:19->CommandTest.createReviewWithSimpleFile:111 http://104.154.18.211:28115/egerrit/test: error occurred during unpacking on the remote end: error No space left on device
00:23:18   AbandonCommandTest>CommandTestWithSimpleReview.createReview:19->CommandTest.createReviewWithSimpleFile:111 http://104.154.18.211:28115/egerrit/test: error occurred during unpacking on the remote end: error No space left on device
00:23:18 
00:23:18 Tests run: 73, Failures: 52, Errors: 0, Skipped: 0
00:23:18 
00:23:18 [INFO] ------------------------------------------------------------------------
00:23:18 [INFO] Reactor Summary:
00:23:18 [INFO] 
00:23:18 [INFO] EGerrit Parent 1.4.0-SNAPSHOT ...................... SUCCESS [ 10.703 s]
00:23:18 [INFO] EGerrit Target Platform ............................ SUCCESS [  0.384 s]
00:23:18 [INFO] EGerrit Model Plug-in .............................. SUCCESS [  7.932 s]
00:23:18 [INFO] EGerrit Core Plug-in ............................... SUCCESS [  3.540 s]
00:23:18 [INFO] EGerrit Model Edit Plug-in ......................... SUCCESS [  2.354 s]
00:23:18 [INFO] EGerrit Core Tests Plug-in ......................... FAILURE [ 48.199 s]
00:23:18 [INFO] EGerrit UI Plug-in ................................. SKIPPED
00:23:18 [INFO] org.eclipse.egerrit.dashboard.core ................. SKIPPED
00:23:18 [INFO] org.eclipse.egerrit.dashboard.ui ................... SKIPPED
00:23:18 [INFO] EGerrit UI Tests Plug-in ........................... SKIPPED
00:23:18 [INFO] EGerrit Feature .................................... SKIPPED
00:23:18 [INFO] EGerrit Update site ................................ SKIPPED
00:23:18 [INFO] EGerrit Update site for tests 1.4.0-SNAPSHOT ....... SKIPPED
00:23:18 [INFO] ------------------------------------------------------------------------
00:23:18 [INFO] BUILD FAILURE
00:23:18 [INFO] ------------------------------------------------------------------------
00:23:18 [INFO] Total time: 04:34 min
00:23:18 [INFO] Finished at: 2018-10-05T00:23:18-04:00
00:23:18 [INFO] ------------------------------------------------------------------------
00:23:18 [ERROR] Failed to execute goal org.eclipse.tycho:tycho-surefire-plugin:1.0.0:test (default-test) on project org.eclipse.egerrit.core.tests: There are test failures.
00:23:18 [ERROR] 
00:23:18 [ERROR] Please refer to /jobs/genie.egerrit/EGerrit/workspace/org.eclipse.egerrit.core.tests/target/surefire-reports for the individual test results.
00:23:18 [ERROR] -> [Help 1]
00:23:18 [ERROR] 
00:23:18 [ERROR] To see the full stack trace of the errors, re-run Maven with the -e switch.
00:23:18 [ERROR] Re-run Maven using the -X switch to enable full debug logging.
00:23:18 [ERROR] 
00:23:18 [ERROR] For more information about the errors and possible solutions, please read the following articles:
00:23:18 [ERROR] [Help 1] http://cwiki.apache.org/confluence/display/MAVEN/MojoFailureException
00:23:18 [ERROR] 
00:23:18 [ERROR] After correcting the problems, you can resume the build with the command
00:23:18 [ERROR]   mvn <goals> -rf :org.eclipse.egerrit.core.tests
00:23:20 Build step 'Invoke top-level Maven targets' marked build as failure
00:23:20 Terminating xvnc.
00:23:20 Not sending mail to unregistered user lmcbout@gmail.com
00:23:20 Sending e-mails to: lmcbout@gmail.com pascal@rapicorp.com patrick.pollo.guilbert@ericsson.com
00:23:20 Recording test results
00:23:21 Archiving artifacts
00:23:21 Started calculate disk usage of build
00:23:21 Finished Calculation of disk usage of build in 0 seconds
00:23:23 Started calculate disk usage of workspace
00:23:23 Finished Calculation of disk usage of workspace in 0 seconds
00:23:24 Finished: FAILURE