FailedConsole Output

Skipping 1,244 KB.. Full Log
egerrit/egerrit3142617727637984225.tmp
09:59:37 org.eclipse.jgit.api.errors.TransportException: http://104.154.18.211:28115/egerrit/test: error occurred during unpacking on the remote end: error No space left on device
09:59:37 Tests run: 1, Failures: 1, Errors: 0, Skipped: 0, Time elapsed: 0.7 sec <<< FAILURE! - in org.eclipse.egerrit.core.command.tests.SubmitCommandTest
09:59:37 testCall(org.eclipse.egerrit.core.command.tests.SubmitCommandTest)  Time elapsed: 0.698 sec  <<< FAILURE!
09:59:37 java.lang.AssertionError: http://104.154.18.211:28115/egerrit/test: error occurred during unpacking on the remote end: error No space left on device
09:59:37 	at org.junit.Assert.fail(Assert.java:88)
09:59:37 	at org.eclipse.egerrit.core.command.tests.CommandTest.createReviewWithSimpleFile(CommandTest.java:111)
09:59:37 	at org.eclipse.egerrit.core.command.tests.CommandTestWithSimpleReview.createReview(CommandTestWithSimpleReview.java:19)
09:59:37 	at sun.reflect.GeneratedMethodAccessor9.invoke(Unknown Source)
09:59:37 	at sun.reflect.DelegatingMethodAccessorImpl.invoke(DelegatingMethodAccessorImpl.java:43)
09:59:37 	at java.lang.reflect.Method.invoke(Method.java:498)
09:59:37 	at org.junit.runners.model.FrameworkMethod$1.runReflectiveCall(FrameworkMethod.java:50)
09:59:37 	at org.junit.internal.runners.model.ReflectiveCallable.run(ReflectiveCallable.java:12)
09:59:37 	at org.junit.runners.model.FrameworkMethod.invokeExplosively(FrameworkMethod.java:47)
09:59:37 	at org.junit.internal.runners.statements.RunBefores.evaluate(RunBefores.java:24)
09:59:37 	at org.junit.internal.runners.statements.RunAfters.evaluate(RunAfters.java:27)
09:59:37 	at org.junit.runners.ParentRunner.runLeaf(ParentRunner.java:325)
09:59:37 	at org.junit.runners.BlockJUnit4ClassRunner.runChild(BlockJUnit4ClassRunner.java:78)
09:59:37 	at org.junit.runners.BlockJUnit4ClassRunner.runChild(BlockJUnit4ClassRunner.java:57)
09:59:37 	at org.junit.runners.ParentRunner$3.run(ParentRunner.java:290)
09:59:37 	at org.junit.runners.ParentRunner$1.schedule(ParentRunner.java:71)
09:59:37 	at org.junit.runners.ParentRunner.runChildren(ParentRunner.java:288)
09:59:37 	at org.junit.runners.ParentRunner.access$000(ParentRunner.java:58)
09:59:37 	at org.junit.runners.ParentRunner$2.evaluate(ParentRunner.java:268)
09:59:37 	at org.junit.runners.ParentRunner.run(ParentRunner.java:363)
09:59:37 	at org.apache.maven.surefire.junit4.JUnit4Provider.execute(JUnit4Provider.java:264)
09:59:37 	at org.apache.maven.surefire.junit4.JUnit4Provider.executeTestSet(JUnit4Provider.java:153)
09:59:37 	at org.apache.maven.surefire.junit4.JUnit4Provider.invoke(JUnit4Provider.java:124)
09:59:37 	at sun.reflect.NativeMethodAccessorImpl.invoke0(Native Method)
09:59:37 	at sun.reflect.NativeMethodAccessorImpl.invoke(NativeMethodAccessorImpl.java:62)
09:59:37 	at sun.reflect.DelegatingMethodAccessorImpl.invoke(DelegatingMethodAccessorImpl.java:43)
09:59:37 	at java.lang.reflect.Method.invoke(Method.java:498)
09:59:37 	at org.apache.maven.surefire.util.ReflectionUtils.invokeMethodWithArray2(ReflectionUtils.java:208)
09:59:37 	at org.apache.maven.surefire.booter.ProviderFactory$ProviderProxy.invoke(ProviderFactory.java:156)
09:59:37 	at org.apache.maven.surefire.booter.ProviderFactory.invokeProvider(ProviderFactory.java:82)
09:59:37 	at org.eclipse.tycho.surefire.osgibooter.OsgiSurefireBooter.run(OsgiSurefireBooter.java:95)
09:59:37 	at org.eclipse.tycho.surefire.osgibooter.HeadlessTestApplication.run(HeadlessTestApplication.java:21)
09:59:37 	at sun.reflect.NativeMethodAccessorImpl.invoke0(Native Method)
09:59:37 	at sun.reflect.NativeMethodAccessorImpl.invoke(NativeMethodAccessorImpl.java:62)
09:59:37 	at sun.reflect.DelegatingMethodAccessorImpl.invoke(DelegatingMethodAccessorImpl.java:43)
09:59:37 	at java.lang.reflect.Method.invoke(Method.java:498)
09:59:37 	at org.eclipse.equinox.internal.app.EclipseAppContainer.callMethodWithException(EclipseAppContainer.java:587)
09:59:37 	at org.eclipse.equinox.internal.app.EclipseAppHandle.run(EclipseAppHandle.java:198)
09:59:37 	at org.eclipse.core.runtime.internal.adaptor.EclipseAppLauncher.runApplication(EclipseAppLauncher.java:134)
09:59:37 	at org.eclipse.core.runtime.internal.adaptor.EclipseAppLauncher.start(EclipseAppLauncher.java:104)
09:59:37 	at org.eclipse.core.runtime.adaptor.EclipseStarter.run(EclipseStarter.java:388)
09:59:37 	at org.eclipse.core.runtime.adaptor.EclipseStarter.run(EclipseStarter.java:243)
09:59:37 	at sun.reflect.NativeMethodAccessorImpl.invoke0(Native Method)
09:59:37 	at sun.reflect.NativeMethodAccessorImpl.invoke(NativeMethodAccessorImpl.java:62)
09:59:37 	at sun.reflect.DelegatingMethodAccessorImpl.invoke(DelegatingMethodAccessorImpl.java:43)
09:59:37 	at java.lang.reflect.Method.invoke(Method.java:498)
09:59:37 	at org.eclipse.equinox.launcher.Main.invokeFramework(Main.java:653)
09:59:37 	at org.eclipse.equinox.launcher.Main.basicRun(Main.java:590)
09:59:37 	at org.eclipse.equinox.launcher.Main.run(Main.java:1499)
09:59:37 	at org.eclipse.equinox.launcher.Main.main(Main.java:1472)
09:59:37 
09:59:37 Running org.eclipse.egerrit.core.command.tests.GetRevisionActionsCommandTest
09:59:37 Checking out http://104.154.18.211:28115/egerrit/test into /tmp/genie.egerrit/egerrit3805760938860124798.tmp
09:59:37 org.eclipse.jgit.api.errors.TransportException: http://104.154.18.211:28115/egerrit/test: error occurred during unpacking on the remote end: error No space left on device
09:59:37 Tests run: 1, Failures: 1, Errors: 0, Skipped: 0, Time elapsed: 0.635 sec <<< FAILURE! - in org.eclipse.egerrit.core.command.tests.GetRevisionActionsCommandTest
09:59:37 testCall(org.eclipse.egerrit.core.command.tests.GetRevisionActionsCommandTest)  Time elapsed: 0.633 sec  <<< FAILURE!
09:59:37 java.lang.AssertionError: http://104.154.18.211:28115/egerrit/test: error occurred during unpacking on the remote end: error No space left on device
09:59:37 	at org.junit.Assert.fail(Assert.java:88)
09:59:37 	at org.eclipse.egerrit.core.command.tests.CommandTest.createReviewWithSimpleFile(CommandTest.java:111)
09:59:37 	at org.eclipse.egerrit.core.command.tests.CommandTestWithSimpleReview.createReview(CommandTestWithSimpleReview.java:19)
09:59:37 	at sun.reflect.GeneratedMethodAccessor9.invoke(Unknown Source)
09:59:37 	at sun.reflect.DelegatingMethodAccessorImpl.invoke(DelegatingMethodAccessorImpl.java:43)
09:59:37 	at java.lang.reflect.Method.invoke(Method.java:498)
09:59:37 	at org.junit.runners.model.FrameworkMethod$1.runReflectiveCall(FrameworkMethod.java:50)
09:59:37 	at org.junit.internal.runners.model.ReflectiveCallable.run(ReflectiveCallable.java:12)
09:59:37 	at org.junit.runners.model.FrameworkMethod.invokeExplosively(FrameworkMethod.java:47)
09:59:37 	at org.junit.internal.runners.statements.RunBefores.evaluate(RunBefores.java:24)
09:59:37 	at org.junit.internal.runners.statements.RunAfters.evaluate(RunAfters.java:27)
09:59:37 	at org.junit.runners.ParentRunner.runLeaf(ParentRunner.java:325)
09:59:37 	at org.junit.runners.BlockJUnit4ClassRunner.runChild(BlockJUnit4ClassRunner.java:78)
09:59:37 	at org.junit.runners.BlockJUnit4ClassRunner.runChild(BlockJUnit4ClassRunner.java:57)
09:59:37 	at org.junit.runners.ParentRunner$3.run(ParentRunner.java:290)
09:59:37 	at org.junit.runners.ParentRunner$1.schedule(ParentRunner.java:71)
09:59:37 	at org.junit.runners.ParentRunner.runChildren(ParentRunner.java:288)
09:59:37 	at org.junit.runners.ParentRunner.access$000(ParentRunner.java:58)
09:59:37 	at org.junit.runners.ParentRunner$2.evaluate(ParentRunner.java:268)
09:59:37 	at org.junit.runners.ParentRunner.run(ParentRunner.java:363)
09:59:37 	at org.apache.maven.surefire.junit4.JUnit4Provider.execute(JUnit4Provider.java:264)
09:59:37 	at org.apache.maven.surefire.junit4.JUnit4Provider.executeTestSet(JUnit4Provider.java:153)
09:59:37 	at org.apache.maven.surefire.junit4.JUnit4Provider.invoke(JUnit4Provider.java:124)
09:59:37 	at sun.reflect.NativeMethodAccessorImpl.invoke0(Native Method)
09:59:37 	at sun.reflect.NativeMethodAccessorImpl.invoke(NativeMethodAccessorImpl.java:62)
09:59:37 	at sun.reflect.DelegatingMethodAccessorImpl.invoke(DelegatingMethodAccessorImpl.java:43)
09:59:37 	at java.lang.reflect.Method.invoke(Method.java:498)
09:59:37 	at org.apache.maven.surefire.util.ReflectionUtils.invokeMethodWithArray2(ReflectionUtils.java:208)
09:59:37 	at org.apache.maven.surefire.booter.ProviderFactory$ProviderProxy.invoke(ProviderFactory.java:156)
09:59:37 	at org.apache.maven.surefire.booter.ProviderFactory.invokeProvider(ProviderFactory.java:82)
09:59:37 	at org.eclipse.tycho.surefire.osgibooter.OsgiSurefireBooter.run(OsgiSurefireBooter.java:95)
09:59:37 	at org.eclipse.tycho.surefire.osgibooter.HeadlessTestApplication.run(HeadlessTestApplication.java:21)
09:59:37 	at sun.reflect.NativeMethodAccessorImpl.invoke0(Native Method)
09:59:37 	at sun.reflect.NativeMethodAccessorImpl.invoke(NativeMethodAccessorImpl.java:62)
09:59:37 	at sun.reflect.DelegatingMethodAccessorImpl.invoke(DelegatingMethodAccessorImpl.java:43)
09:59:37 	at java.lang.reflect.Method.invoke(Method.java:498)
09:59:37 	at org.eclipse.equinox.internal.app.EclipseAppContainer.callMethodWithException(EclipseAppContainer.java:587)
09:59:37 	at org.eclipse.equinox.internal.app.EclipseAppHandle.run(EclipseAppHandle.java:198)
09:59:37 	at org.eclipse.core.runtime.internal.adaptor.EclipseAppLauncher.runApplication(EclipseAppLauncher.java:134)
09:59:37 	at org.eclipse.core.runtime.internal.adaptor.EclipseAppLauncher.start(EclipseAppLauncher.java:104)
09:59:37 	at org.eclipse.core.runtime.adaptor.EclipseStarter.run(EclipseStarter.java:388)
09:59:37 	at org.eclipse.core.runtime.adaptor.EclipseStarter.run(EclipseStarter.java:243)
09:59:37 	at sun.reflect.NativeMethodAccessorImpl.invoke0(Native Method)
09:59:37 	at sun.reflect.NativeMethodAccessorImpl.invoke(NativeMethodAccessorImpl.java:62)
09:59:37 	at sun.reflect.DelegatingMethodAccessorImpl.invoke(DelegatingMethodAccessorImpl.java:43)
09:59:37 	at java.lang.reflect.Method.invoke(Method.java:498)
09:59:37 	at org.eclipse.equinox.launcher.Main.invokeFramework(Main.java:653)
09:59:37 	at org.eclipse.equinox.launcher.Main.basicRun(Main.java:590)
09:59:37 	at org.eclipse.equinox.launcher.Main.run(Main.java:1499)
09:59:37 	at org.eclipse.equinox.launcher.Main.main(Main.java:1472)
09:59:37 
09:59:37 Running org.eclipse.egerrit.core.command.tests.RevertCommandTest
09:59:37 Checking out http://104.154.18.211:28115/egerrit/test into /tmp/genie.egerrit/egerrit817499472597679202.tmp
09:59:38 org.eclipse.jgit.api.errors.TransportException: http://104.154.18.211:28115/egerrit/test: error occurred during unpacking on the remote end: error No space left on device
09:59:38 Tests run: 1, Failures: 1, Errors: 0, Skipped: 0, Time elapsed: 0.705 sec <<< FAILURE! - in org.eclipse.egerrit.core.command.tests.RevertCommandTest
09:59:38 testCall(org.eclipse.egerrit.core.command.tests.RevertCommandTest)  Time elapsed: 0.704 sec  <<< FAILURE!
09:59:38 java.lang.AssertionError: http://104.154.18.211:28115/egerrit/test: error occurred during unpacking on the remote end: error No space left on device
09:59:38 	at org.junit.Assert.fail(Assert.java:88)
09:59:38 	at org.eclipse.egerrit.core.command.tests.CommandTest.createReviewWithSimpleFile(CommandTest.java:111)
09:59:38 	at org.eclipse.egerrit.core.command.tests.CommandTestWithSimpleReview.createReview(CommandTestWithSimpleReview.java:19)
09:59:38 	at sun.reflect.GeneratedMethodAccessor9.invoke(Unknown Source)
09:59:38 	at sun.reflect.DelegatingMethodAccessorImpl.invoke(DelegatingMethodAccessorImpl.java:43)
09:59:38 	at java.lang.reflect.Method.invoke(Method.java:498)
09:59:38 	at org.junit.runners.model.FrameworkMethod$1.runReflectiveCall(FrameworkMethod.java:50)
09:59:38 	at org.junit.internal.runners.model.ReflectiveCallable.run(ReflectiveCallable.java:12)
09:59:38 	at org.junit.runners.model.FrameworkMethod.invokeExplosively(FrameworkMethod.java:47)
09:59:38 	at org.junit.internal.runners.statements.RunBefores.evaluate(RunBefores.java:24)
09:59:38 	at org.junit.internal.runners.statements.RunAfters.evaluate(RunAfters.java:27)
09:59:38 	at org.junit.runners.ParentRunner.runLeaf(ParentRunner.java:325)
09:59:38 	at org.junit.runners.BlockJUnit4ClassRunner.runChild(BlockJUnit4ClassRunner.java:78)
09:59:38 	at org.junit.runners.BlockJUnit4ClassRunner.runChild(BlockJUnit4ClassRunner.java:57)
09:59:38 	at org.junit.runners.ParentRunner$3.run(ParentRunner.java:290)
09:59:38 	at org.junit.runners.ParentRunner$1.schedule(ParentRunner.java:71)
09:59:38 	at org.junit.runners.ParentRunner.runChildren(ParentRunner.java:288)
09:59:38 	at org.junit.runners.ParentRunner.access$000(ParentRunner.java:58)
09:59:38 	at org.junit.runners.ParentRunner$2.evaluate(ParentRunner.java:268)
09:59:38 	at org.junit.runners.ParentRunner.run(ParentRunner.java:363)
09:59:38 	at org.apache.maven.surefire.junit4.JUnit4Provider.execute(JUnit4Provider.java:264)
09:59:38 	at org.apache.maven.surefire.junit4.JUnit4Provider.executeTestSet(JUnit4Provider.java:153)
09:59:38 	at org.apache.maven.surefire.junit4.JUnit4Provider.invoke(JUnit4Provider.java:124)
09:59:38 	at sun.reflect.NativeMethodAccessorImpl.invoke0(Native Method)
09:59:38 	at sun.reflect.NativeMethodAccessorImpl.invoke(NativeMethodAccessorImpl.java:62)
09:59:38 	at sun.reflect.DelegatingMethodAccessorImpl.invoke(DelegatingMethodAccessorImpl.java:43)
09:59:38 	at java.lang.reflect.Method.invoke(Method.java:498)
09:59:38 	at org.apache.maven.surefire.util.ReflectionUtils.invokeMethodWithArray2(ReflectionUtils.java:208)
09:59:38 	at org.apache.maven.surefire.booter.ProviderFactory$ProviderProxy.invoke(ProviderFactory.java:156)
09:59:38 	at org.apache.maven.surefire.booter.ProviderFactory.invokeProvider(ProviderFactory.java:82)
09:59:38 	at org.eclipse.tycho.surefire.osgibooter.OsgiSurefireBooter.run(OsgiSurefireBooter.java:95)
09:59:38 	at org.eclipse.tycho.surefire.osgibooter.HeadlessTestApplication.run(HeadlessTestApplication.java:21)
09:59:38 	at sun.reflect.NativeMethodAccessorImpl.invoke0(Native Method)
09:59:38 	at sun.reflect.NativeMethodAccessorImpl.invoke(NativeMethodAccessorImpl.java:62)
09:59:38 	at sun.reflect.DelegatingMethodAccessorImpl.invoke(DelegatingMethodAccessorImpl.java:43)
09:59:38 	at java.lang.reflect.Method.invoke(Method.java:498)
09:59:38 	at org.eclipse.equinox.internal.app.EclipseAppContainer.callMethodWithException(EclipseAppContainer.java:587)
09:59:38 	at org.eclipse.equinox.internal.app.EclipseAppHandle.run(EclipseAppHandle.java:198)
09:59:38 	at org.eclipse.core.runtime.internal.adaptor.EclipseAppLauncher.runApplication(EclipseAppLauncher.java:134)
09:59:38 	at org.eclipse.core.runtime.internal.adaptor.EclipseAppLauncher.start(EclipseAppLauncher.java:104)
09:59:38 	at org.eclipse.core.runtime.adaptor.EclipseStarter.run(EclipseStarter.java:388)
09:59:38 	at org.eclipse.core.runtime.adaptor.EclipseStarter.run(EclipseStarter.java:243)
09:59:38 	at sun.reflect.NativeMethodAccessorImpl.invoke0(Native Method)
09:59:38 	at sun.reflect.NativeMethodAccessorImpl.invoke(NativeMethodAccessorImpl.java:62)
09:59:38 	at sun.reflect.DelegatingMethodAccessorImpl.invoke(DelegatingMethodAccessorImpl.java:43)
09:59:38 	at java.lang.reflect.Method.invoke(Method.java:498)
09:59:38 	at org.eclipse.equinox.launcher.Main.invokeFramework(Main.java:653)
09:59:38 	at org.eclipse.equinox.launcher.Main.basicRun(Main.java:590)
09:59:38 	at org.eclipse.equinox.launcher.Main.run(Main.java:1499)
09:59:38 	at org.eclipse.equinox.launcher.Main.main(Main.java:1472)
09:59:38 
09:59:38 Running org.eclipse.egerrit.core.command.tests.UnstarCommandTest
09:59:38 Checking out http://104.154.18.211:28115/egerrit/test into /tmp/genie.egerrit/egerrit5366025875095996409.tmp
09:59:39 org.eclipse.jgit.api.errors.TransportException: http://104.154.18.211:28115/egerrit/test: error occurred during unpacking on the remote end: error No space left on device
09:59:39 Tests run: 1, Failures: 1, Errors: 0, Skipped: 0, Time elapsed: 0.618 sec <<< FAILURE! - in org.eclipse.egerrit.core.command.tests.UnstarCommandTest
09:59:39 testCall(org.eclipse.egerrit.core.command.tests.UnstarCommandTest)  Time elapsed: 0.617 sec  <<< FAILURE!
09:59:39 java.lang.AssertionError: http://104.154.18.211:28115/egerrit/test: error occurred during unpacking on the remote end: error No space left on device
09:59:39 	at org.junit.Assert.fail(Assert.java:88)
09:59:39 	at org.eclipse.egerrit.core.command.tests.CommandTest.createReviewWithSimpleFile(CommandTest.java:111)
09:59:39 	at org.eclipse.egerrit.core.command.tests.CommandTestWithSimpleReview.createReview(CommandTestWithSimpleReview.java:19)
09:59:39 	at sun.reflect.GeneratedMethodAccessor9.invoke(Unknown Source)
09:59:39 	at sun.reflect.DelegatingMethodAccessorImpl.invoke(DelegatingMethodAccessorImpl.java:43)
09:59:39 	at java.lang.reflect.Method.invoke(Method.java:498)
09:59:39 	at org.junit.runners.model.FrameworkMethod$1.runReflectiveCall(FrameworkMethod.java:50)
09:59:39 	at org.junit.internal.runners.model.ReflectiveCallable.run(ReflectiveCallable.java:12)
09:59:39 	at org.junit.runners.model.FrameworkMethod.invokeExplosively(FrameworkMethod.java:47)
09:59:39 	at org.junit.internal.runners.statements.RunBefores.evaluate(RunBefores.java:24)
09:59:39 	at org.junit.internal.runners.statements.RunAfters.evaluate(RunAfters.java:27)
09:59:39 	at org.junit.runners.ParentRunner.runLeaf(ParentRunner.java:325)
09:59:39 	at org.junit.runners.BlockJUnit4ClassRunner.runChild(BlockJUnit4ClassRunner.java:78)
09:59:39 	at org.junit.runners.BlockJUnit4ClassRunner.runChild(BlockJUnit4ClassRunner.java:57)
09:59:39 	at org.junit.runners.ParentRunner$3.run(ParentRunner.java:290)
09:59:39 	at org.junit.runners.ParentRunner$1.schedule(ParentRunner.java:71)
09:59:39 	at org.junit.runners.ParentRunner.runChildren(ParentRunner.java:288)
09:59:39 	at org.junit.runners.ParentRunner.access$000(ParentRunner.java:58)
09:59:39 	at org.junit.runners.ParentRunner$2.evaluate(ParentRunner.java:268)
09:59:39 	at org.junit.runners.ParentRunner.run(ParentRunner.java:363)
09:59:39 	at org.apache.maven.surefire.junit4.JUnit4Provider.execute(JUnit4Provider.java:264)
09:59:39 	at org.apache.maven.surefire.junit4.JUnit4Provider.executeTestSet(JUnit4Provider.java:153)
09:59:39 	at org.apache.maven.surefire.junit4.JUnit4Provider.invoke(JUnit4Provider.java:124)
09:59:39 	at sun.reflect.NativeMethodAccessorImpl.invoke0(Native Method)
09:59:39 	at sun.reflect.NativeMethodAccessorImpl.invoke(NativeMethodAccessorImpl.java:62)
09:59:39 	at sun.reflect.DelegatingMethodAccessorImpl.invoke(DelegatingMethodAccessorImpl.java:43)
09:59:39 	at java.lang.reflect.Method.invoke(Method.java:498)
09:59:39 	at org.apache.maven.surefire.util.ReflectionUtils.invokeMethodWithArray2(ReflectionUtils.java:208)
09:59:39 	at org.apache.maven.surefire.booter.ProviderFactory$ProviderProxy.invoke(ProviderFactory.java:156)
09:59:39 	at org.apache.maven.surefire.booter.ProviderFactory.invokeProvider(ProviderFactory.java:82)
09:59:39 	at org.eclipse.tycho.surefire.osgibooter.OsgiSurefireBooter.run(OsgiSurefireBooter.java:95)
09:59:39 	at org.eclipse.tycho.surefire.osgibooter.HeadlessTestApplication.run(HeadlessTestApplication.java:21)
09:59:39 	at sun.reflect.NativeMethodAccessorImpl.invoke0(Native Method)
09:59:39 	at sun.reflect.NativeMethodAccessorImpl.invoke(NativeMethodAccessorImpl.java:62)
09:59:39 	at sun.reflect.DelegatingMethodAccessorImpl.invoke(DelegatingMethodAccessorImpl.java:43)
09:59:39 	at java.lang.reflect.Method.invoke(Method.java:498)
09:59:39 	at org.eclipse.equinox.internal.app.EclipseAppContainer.callMethodWithException(EclipseAppContainer.java:587)
09:59:39 	at org.eclipse.equinox.internal.app.EclipseAppHandle.run(EclipseAppHandle.java:198)
09:59:39 	at org.eclipse.core.runtime.internal.adaptor.EclipseAppLauncher.runApplication(EclipseAppLauncher.java:134)
09:59:39 	at org.eclipse.core.runtime.internal.adaptor.EclipseAppLauncher.start(EclipseAppLauncher.java:104)
09:59:39 	at org.eclipse.core.runtime.adaptor.EclipseStarter.run(EclipseStarter.java:388)
09:59:39 	at org.eclipse.core.runtime.adaptor.EclipseStarter.run(EclipseStarter.java:243)
09:59:39 	at sun.reflect.NativeMethodAccessorImpl.invoke0(Native Method)
09:59:39 	at sun.reflect.NativeMethodAccessorImpl.invoke(NativeMethodAccessorImpl.java:62)
09:59:39 	at sun.reflect.DelegatingMethodAccessorImpl.invoke(DelegatingMethodAccessorImpl.java:43)
09:59:39 	at java.lang.reflect.Method.invoke(Method.java:498)
09:59:39 	at org.eclipse.equinox.launcher.Main.invokeFramework(Main.java:653)
09:59:39 	at org.eclipse.equinox.launcher.Main.basicRun(Main.java:590)
09:59:39 	at org.eclipse.equinox.launcher.Main.run(Main.java:1499)
09:59:39 	at org.eclipse.equinox.launcher.Main.main(Main.java:1472)
09:59:39 
09:59:39 Running org.eclipse.egerrit.core.command.tests.AddReviewerCommandTest
09:59:39 Checking out http://104.154.18.211:28115/egerrit/test into /tmp/genie.egerrit/egerrit6818194373210286670.tmp
09:59:39 org.eclipse.jgit.api.errors.TransportException: http://104.154.18.211:28115/egerrit/test: error occurred during unpacking on the remote end: error No space left on device
09:59:39 Checking out http://104.154.18.211:28115/egerrit/test into /tmp/genie.egerrit/egerrit7137468534117214395.tmp
09:59:40 org.eclipse.jgit.api.errors.TransportException: http://104.154.18.211:28115/egerrit/test: error occurred during unpacking on the remote end: error No space left on device
09:59:40 Checking out http://104.154.18.211:28115/egerrit/test into /tmp/genie.egerrit/egerrit6158360886836994353.tmp
09:59:41 org.eclipse.jgit.api.errors.TransportException: http://104.154.18.211:28115/egerrit/test: error occurred during unpacking on the remote end: error No space left on device
09:59:41 Tests run: 3, Failures: 3, Errors: 0, Skipped: 0, Time elapsed: 1.955 sec <<< FAILURE! - in org.eclipse.egerrit.core.command.tests.AddReviewerCommandTest
09:59:41 testCall(org.eclipse.egerrit.core.command.tests.AddReviewerCommandTest)  Time elapsed: 0.643 sec  <<< FAILURE!
09:59:41 java.lang.AssertionError: http://104.154.18.211:28115/egerrit/test: error occurred during unpacking on the remote end: error No space left on device
09:59:41 	at org.junit.Assert.fail(Assert.java:88)
09:59:41 	at org.eclipse.egerrit.core.command.tests.CommandTest.createReviewWithSimpleFile(CommandTest.java:111)
09:59:41 	at org.eclipse.egerrit.core.command.tests.CommandTestWithSimpleReview.createReview(CommandTestWithSimpleReview.java:19)
09:59:41 	at sun.reflect.GeneratedMethodAccessor9.invoke(Unknown Source)
09:59:41 	at sun.reflect.DelegatingMethodAccessorImpl.invoke(DelegatingMethodAccessorImpl.java:43)
09:59:41 	at java.lang.reflect.Method.invoke(Method.java:498)
09:59:41 	at org.junit.runners.model.FrameworkMethod$1.runReflectiveCall(FrameworkMethod.java:50)
09:59:41 	at org.junit.internal.runners.model.ReflectiveCallable.run(ReflectiveCallable.java:12)
09:59:41 	at org.junit.runners.model.FrameworkMethod.invokeExplosively(FrameworkMethod.java:47)
09:59:41 	at org.junit.internal.runners.statements.RunBefores.evaluate(RunBefores.java:24)
09:59:41 	at org.junit.internal.runners.statements.RunAfters.evaluate(RunAfters.java:27)
09:59:41 	at org.junit.runners.ParentRunner.runLeaf(ParentRunner.java:325)
09:59:41 	at org.junit.runners.BlockJUnit4ClassRunner.runChild(BlockJUnit4ClassRunner.java:78)
09:59:41 	at org.junit.runners.BlockJUnit4ClassRunner.runChild(BlockJUnit4ClassRunner.java:57)
09:59:41 	at org.junit.runners.ParentRunner$3.run(ParentRunner.java:290)
09:59:41 	at org.junit.runners.ParentRunner$1.schedule(ParentRunner.java:71)
09:59:41 	at org.junit.runners.ParentRunner.runChildren(ParentRunner.java:288)
09:59:41 	at org.junit.runners.ParentRunner.access$000(ParentRunner.java:58)
09:59:41 	at org.junit.runners.ParentRunner$2.evaluate(ParentRunner.java:268)
09:59:41 	at org.junit.runners.ParentRunner.run(ParentRunner.java:363)
09:59:41 	at org.apache.maven.surefire.junit4.JUnit4Provider.execute(JUnit4Provider.java:264)
09:59:41 	at org.apache.maven.surefire.junit4.JUnit4Provider.executeTestSet(JUnit4Provider.java:153)
09:59:41 	at org.apache.maven.surefire.junit4.JUnit4Provider.invoke(JUnit4Provider.java:124)
09:59:41 	at sun.reflect.NativeMethodAccessorImpl.invoke0(Native Method)
09:59:41 	at sun.reflect.NativeMethodAccessorImpl.invoke(NativeMethodAccessorImpl.java:62)
09:59:41 	at sun.reflect.DelegatingMethodAccessorImpl.invoke(DelegatingMethodAccessorImpl.java:43)
09:59:41 	at java.lang.reflect.Method.invoke(Method.java:498)
09:59:41 	at org.apache.maven.surefire.util.ReflectionUtils.invokeMethodWithArray2(ReflectionUtils.java:208)
09:59:41 	at org.apache.maven.surefire.booter.ProviderFactory$ProviderProxy.invoke(ProviderFactory.java:156)
09:59:41 	at org.apache.maven.surefire.booter.ProviderFactory.invokeProvider(ProviderFactory.java:82)
09:59:41 	at org.eclipse.tycho.surefire.osgibooter.OsgiSurefireBooter.run(OsgiSurefireBooter.java:95)
09:59:41 	at org.eclipse.tycho.surefire.osgibooter.HeadlessTestApplication.run(HeadlessTestApplication.java:21)
09:59:41 	at sun.reflect.NativeMethodAccessorImpl.invoke0(Native Method)
09:59:41 	at sun.reflect.NativeMethodAccessorImpl.invoke(NativeMethodAccessorImpl.java:62)
09:59:41 	at sun.reflect.DelegatingMethodAccessorImpl.invoke(DelegatingMethodAccessorImpl.java:43)
09:59:41 	at java.lang.reflect.Method.invoke(Method.java:498)
09:59:41 	at org.eclipse.equinox.internal.app.EclipseAppContainer.callMethodWithException(EclipseAppContainer.java:587)
09:59:41 	at org.eclipse.equinox.internal.app.EclipseAppHandle.run(EclipseAppHandle.java:198)
09:59:41 	at org.eclipse.core.runtime.internal.adaptor.EclipseAppLauncher.runApplication(EclipseAppLauncher.java:134)
09:59:41 	at org.eclipse.core.runtime.internal.adaptor.EclipseAppLauncher.start(EclipseAppLauncher.java:104)
09:59:41 	at org.eclipse.core.runtime.adaptor.EclipseStarter.run(EclipseStarter.java:388)
09:59:41 	at org.eclipse.core.runtime.adaptor.EclipseStarter.run(EclipseStarter.java:243)
09:59:41 	at sun.reflect.NativeMethodAccessorImpl.invoke0(Native Method)
09:59:41 	at sun.reflect.NativeMethodAccessorImpl.invoke(NativeMethodAccessorImpl.java:62)
09:59:41 	at sun.reflect.DelegatingMethodAccessorImpl.invoke(DelegatingMethodAccessorImpl.java:43)
09:59:41 	at java.lang.reflect.Method.invoke(Method.java:498)
09:59:41 	at org.eclipse.equinox.launcher.Main.invokeFramework(Main.java:653)
09:59:41 	at org.eclipse.equinox.launcher.Main.basicRun(Main.java:590)
09:59:41 	at org.eclipse.equinox.launcher.Main.run(Main.java:1499)
09:59:41 	at org.eclipse.equinox.launcher.Main.main(Main.java:1472)
09:59:41 
09:59:41 testAddGroupCall(org.eclipse.egerrit.core.command.tests.AddReviewerCommandTest)  Time elapsed: 0.679 sec  <<< FAILURE!
09:59:41 java.lang.AssertionError: http://104.154.18.211:28115/egerrit/test: error occurred during unpacking on the remote end: error No space left on device
09:59:41 	at org.junit.Assert.fail(Assert.java:88)
09:59:41 	at org.eclipse.egerrit.core.command.tests.CommandTest.createReviewWithSimpleFile(CommandTest.java:111)
09:59:41 	at org.eclipse.egerrit.core.command.tests.CommandTestWithSimpleReview.createReview(CommandTestWithSimpleReview.java:19)
09:59:41 	at sun.reflect.GeneratedMethodAccessor9.invoke(Unknown Source)
09:59:41 	at sun.reflect.DelegatingMethodAccessorImpl.invoke(DelegatingMethodAccessorImpl.java:43)
09:59:41 	at java.lang.reflect.Method.invoke(Method.java:498)
09:59:41 	at org.junit.runners.model.FrameworkMethod$1.runReflectiveCall(FrameworkMethod.java:50)
09:59:41 	at org.junit.internal.runners.model.ReflectiveCallable.run(ReflectiveCallable.java:12)
09:59:41 	at org.junit.runners.model.FrameworkMethod.invokeExplosively(FrameworkMethod.java:47)
09:59:41 	at org.junit.internal.runners.statements.RunBefores.evaluate(RunBefores.java:24)
09:59:41 	at org.junit.internal.runners.statements.RunAfters.evaluate(RunAfters.java:27)
09:59:41 	at org.junit.runners.ParentRunner.runLeaf(ParentRunner.java:325)
09:59:41 	at org.junit.runners.BlockJUnit4ClassRunner.runChild(BlockJUnit4ClassRunner.java:78)
09:59:41 	at org.junit.runners.BlockJUnit4ClassRunner.runChild(BlockJUnit4ClassRunner.java:57)
09:59:41 	at org.junit.runners.ParentRunner$3.run(ParentRunner.java:290)
09:59:41 	at org.junit.runners.ParentRunner$1.schedule(ParentRunner.java:71)
09:59:41 	at org.junit.runners.ParentRunner.runChildren(ParentRunner.java:288)
09:59:41 	at org.junit.runners.ParentRunner.access$000(ParentRunner.java:58)
09:59:41 	at org.junit.runners.ParentRunner$2.evaluate(ParentRunner.java:268)
09:59:41 	at org.junit.runners.ParentRunner.run(ParentRunner.java:363)
09:59:41 	at org.apache.maven.surefire.junit4.JUnit4Provider.execute(JUnit4Provider.java:264)
09:59:41 	at org.apache.maven.surefire.junit4.JUnit4Provider.executeTestSet(JUnit4Provider.java:153)
09:59:41 	at org.apache.maven.surefire.junit4.JUnit4Provider.invoke(JUnit4Provider.java:124)
09:59:41 	at sun.reflect.NativeMethodAccessorImpl.invoke0(Native Method)
09:59:41 	at sun.reflect.NativeMethodAccessorImpl.invoke(NativeMethodAccessorImpl.java:62)
09:59:41 	at sun.reflect.DelegatingMethodAccessorImpl.invoke(DelegatingMethodAccessorImpl.java:43)
09:59:41 	at java.lang.reflect.Method.invoke(Method.java:498)
09:59:41 	at org.apache.maven.surefire.util.ReflectionUtils.invokeMethodWithArray2(ReflectionUtils.java:208)
09:59:41 	at org.apache.maven.surefire.booter.ProviderFactory$ProviderProxy.invoke(ProviderFactory.java:156)
09:59:41 	at org.apache.maven.surefire.booter.ProviderFactory.invokeProvider(ProviderFactory.java:82)
09:59:41 	at org.eclipse.tycho.surefire.osgibooter.OsgiSurefireBooter.run(OsgiSurefireBooter.java:95)
09:59:41 	at org.eclipse.tycho.surefire.osgibooter.HeadlessTestApplication.run(HeadlessTestApplication.java:21)
09:59:41 	at sun.reflect.NativeMethodAccessorImpl.invoke0(Native Method)
09:59:41 	at sun.reflect.NativeMethodAccessorImpl.invoke(NativeMethodAccessorImpl.java:62)
09:59:41 	at sun.reflect.DelegatingMethodAccessorImpl.invoke(DelegatingMethodAccessorImpl.java:43)
09:59:41 	at java.lang.reflect.Method.invoke(Method.java:498)
09:59:41 	at org.eclipse.equinox.internal.app.EclipseAppContainer.callMethodWithException(EclipseAppContainer.java:587)
09:59:41 	at org.eclipse.equinox.internal.app.EclipseAppHandle.run(EclipseAppHandle.java:198)
09:59:41 	at org.eclipse.core.runtime.internal.adaptor.EclipseAppLauncher.runApplication(EclipseAppLauncher.java:134)
09:59:41 	at org.eclipse.core.runtime.internal.adaptor.EclipseAppLauncher.start(EclipseAppLauncher.java:104)
09:59:41 	at org.eclipse.core.runtime.adaptor.EclipseStarter.run(EclipseStarter.java:388)
09:59:41 	at org.eclipse.core.runtime.adaptor.EclipseStarter.run(EclipseStarter.java:243)
09:59:41 	at sun.reflect.NativeMethodAccessorImpl.invoke0(Native Method)
09:59:41 	at sun.reflect.NativeMethodAccessorImpl.invoke(NativeMethodAccessorImpl.java:62)
09:59:41 	at sun.reflect.DelegatingMethodAccessorImpl.invoke(DelegatingMethodAccessorImpl.java:43)
09:59:41 	at java.lang.reflect.Method.invoke(Method.java:498)
09:59:41 	at org.eclipse.equinox.launcher.Main.invokeFramework(Main.java:653)
09:59:41 	at org.eclipse.equinox.launcher.Main.basicRun(Main.java:590)
09:59:41 	at org.eclipse.equinox.launcher.Main.run(Main.java:1499)
09:59:41 	at org.eclipse.equinox.launcher.Main.main(Main.java:1472)
09:59:41 
09:59:41 testAddUndefinedReviewerCall(org.eclipse.egerrit.core.command.tests.AddReviewerCommandTest)  Time elapsed: 0.63 sec  <<< FAILURE!
09:59:41 java.lang.AssertionError: http://104.154.18.211:28115/egerrit/test: error occurred during unpacking on the remote end: error No space left on device
09:59:41 	at org.junit.Assert.fail(Assert.java:88)
09:59:41 	at org.eclipse.egerrit.core.command.tests.CommandTest.createReviewWithSimpleFile(CommandTest.java:111)
09:59:41 	at org.eclipse.egerrit.core.command.tests.CommandTestWithSimpleReview.createReview(CommandTestWithSimpleReview.java:19)
09:59:41 	at sun.reflect.GeneratedMethodAccessor9.invoke(Unknown Source)
09:59:41 	at sun.reflect.DelegatingMethodAccessorImpl.invoke(DelegatingMethodAccessorImpl.java:43)
09:59:41 	at java.lang.reflect.Method.invoke(Method.java:498)
09:59:41 	at org.junit.runners.model.FrameworkMethod$1.runReflectiveCall(FrameworkMethod.java:50)
09:59:41 	at org.junit.internal.runners.model.ReflectiveCallable.run(ReflectiveCallable.java:12)
09:59:41 	at org.junit.runners.model.FrameworkMethod.invokeExplosively(FrameworkMethod.java:47)
09:59:41 	at org.junit.internal.runners.statements.RunBefores.evaluate(RunBefores.java:24)
09:59:41 	at org.junit.internal.runners.statements.RunAfters.evaluate(RunAfters.java:27)
09:59:41 	at org.junit.runners.ParentRunner.runLeaf(ParentRunner.java:325)
09:59:41 	at org.junit.runners.BlockJUnit4ClassRunner.runChild(BlockJUnit4ClassRunner.java:78)
09:59:41 	at org.junit.runners.BlockJUnit4ClassRunner.runChild(BlockJUnit4ClassRunner.java:57)
09:59:41 	at org.junit.runners.ParentRunner$3.run(ParentRunner.java:290)
09:59:41 	at org.junit.runners.ParentRunner$1.schedule(ParentRunner.java:71)
09:59:41 	at org.junit.runners.ParentRunner.runChildren(ParentRunner.java:288)
09:59:41 	at org.junit.runners.ParentRunner.access$000(ParentRunner.java:58)
09:59:41 	at org.junit.runners.ParentRunner$2.evaluate(ParentRunner.java:268)
09:59:41 	at org.junit.runners.ParentRunner.run(ParentRunner.java:363)
09:59:41 	at org.apache.maven.surefire.junit4.JUnit4Provider.execute(JUnit4Provider.java:264)
09:59:41 	at org.apache.maven.surefire.junit4.JUnit4Provider.executeTestSet(JUnit4Provider.java:153)
09:59:41 	at org.apache.maven.surefire.junit4.JUnit4Provider.invoke(JUnit4Provider.java:124)
09:59:41 	at sun.reflect.NativeMethodAccessorImpl.invoke0(Native Method)
09:59:41 	at sun.reflect.NativeMethodAccessorImpl.invoke(NativeMethodAccessorImpl.java:62)
09:59:41 	at sun.reflect.DelegatingMethodAccessorImpl.invoke(DelegatingMethodAccessorImpl.java:43)
09:59:41 	at java.lang.reflect.Method.invoke(Method.java:498)
09:59:41 	at org.apache.maven.surefire.util.ReflectionUtils.invokeMethodWithArray2(ReflectionUtils.java:208)
09:59:41 	at org.apache.maven.surefire.booter.ProviderFactory$ProviderProxy.invoke(ProviderFactory.java:156)
09:59:41 	at org.apache.maven.surefire.booter.ProviderFactory.invokeProvider(ProviderFactory.java:82)
09:59:41 	at org.eclipse.tycho.surefire.osgibooter.OsgiSurefireBooter.run(OsgiSurefireBooter.java:95)
09:59:41 	at org.eclipse.tycho.surefire.osgibooter.HeadlessTestApplication.run(HeadlessTestApplication.java:21)
09:59:41 	at sun.reflect.NativeMethodAccessorImpl.invoke0(Native Method)
09:59:41 	at sun.reflect.NativeMethodAccessorImpl.invoke(NativeMethodAccessorImpl.java:62)
09:59:41 	at sun.reflect.DelegatingMethodAccessorImpl.invoke(DelegatingMethodAccessorImpl.java:43)
09:59:41 	at java.lang.reflect.Method.invoke(Method.java:498)
09:59:41 	at org.eclipse.equinox.internal.app.EclipseAppContainer.callMethodWithException(EclipseAppContainer.java:587)
09:59:41 	at org.eclipse.equinox.internal.app.EclipseAppHandle.run(EclipseAppHandle.java:198)
09:59:41 	at org.eclipse.core.runtime.internal.adaptor.EclipseAppLauncher.runApplication(EclipseAppLauncher.java:134)
09:59:41 	at org.eclipse.core.runtime.internal.adaptor.EclipseAppLauncher.start(EclipseAppLauncher.java:104)
09:59:41 	at org.eclipse.core.runtime.adaptor.EclipseStarter.run(EclipseStarter.java:388)
09:59:41 	at org.eclipse.core.runtime.adaptor.EclipseStarter.run(EclipseStarter.java:243)
09:59:41 	at sun.reflect.NativeMethodAccessorImpl.invoke0(Native Method)
09:59:41 	at sun.reflect.NativeMethodAccessorImpl.invoke(NativeMethodAccessorImpl.java:62)
09:59:41 	at sun.reflect.DelegatingMethodAccessorImpl.invoke(DelegatingMethodAccessorImpl.java:43)
09:59:41 	at java.lang.reflect.Method.invoke(Method.java:498)
09:59:41 	at org.eclipse.equinox.launcher.Main.invokeFramework(Main.java:653)
09:59:41 	at org.eclipse.equinox.launcher.Main.basicRun(Main.java:590)
09:59:41 	at org.eclipse.equinox.launcher.Main.run(Main.java:1499)
09:59:41 	at org.eclipse.equinox.launcher.Main.main(Main.java:1472)
09:59:41 
09:59:41 Running org.eclipse.egerrit.core.command.tests.RestoreCommandTest
09:59:41 Checking out http://104.154.18.211:28115/egerrit/test into /tmp/genie.egerrit/egerrit2556042318795645416.tmp
09:59:41 org.eclipse.jgit.api.errors.TransportException: http://104.154.18.211:28115/egerrit/test: error occurred during unpacking on the remote end: error No space left on device
09:59:41 Tests run: 1, Failures: 1, Errors: 0, Skipped: 0, Time elapsed: 0.616 sec <<< FAILURE! - in org.eclipse.egerrit.core.command.tests.RestoreCommandTest
09:59:41 testCall(org.eclipse.egerrit.core.command.tests.RestoreCommandTest)  Time elapsed: 0.614 sec  <<< FAILURE!
09:59:41 java.lang.AssertionError: http://104.154.18.211:28115/egerrit/test: error occurred during unpacking on the remote end: error No space left on device
09:59:41 	at org.junit.Assert.fail(Assert.java:88)
09:59:41 	at org.eclipse.egerrit.core.command.tests.CommandTest.createReviewWithSimpleFile(CommandTest.java:111)
09:59:41 	at org.eclipse.egerrit.core.command.tests.CommandTestWithSimpleReview.createReview(CommandTestWithSimpleReview.java:19)
09:59:41 	at sun.reflect.GeneratedMethodAccessor9.invoke(Unknown Source)
09:59:41 	at sun.reflect.DelegatingMethodAccessorImpl.invoke(DelegatingMethodAccessorImpl.java:43)
09:59:41 	at java.lang.reflect.Method.invoke(Method.java:498)
09:59:41 	at org.junit.runners.model.FrameworkMethod$1.runReflectiveCall(FrameworkMethod.java:50)
09:59:41 	at org.junit.internal.runners.model.ReflectiveCallable.run(ReflectiveCallable.java:12)
09:59:41 	at org.junit.runners.model.FrameworkMethod.invokeExplosively(FrameworkMethod.java:47)
09:59:41 	at org.junit.internal.runners.statements.RunBefores.evaluate(RunBefores.java:24)
09:59:41 	at org.junit.internal.runners.statements.RunAfters.evaluate(RunAfters.java:27)
09:59:41 	at org.junit.runners.ParentRunner.runLeaf(ParentRunner.java:325)
09:59:41 	at org.junit.runners.BlockJUnit4ClassRunner.runChild(BlockJUnit4ClassRunner.java:78)
09:59:41 	at org.junit.runners.BlockJUnit4ClassRunner.runChild(BlockJUnit4ClassRunner.java:57)
09:59:41 	at org.junit.runners.ParentRunner$3.run(ParentRunner.java:290)
09:59:41 	at org.junit.runners.ParentRunner$1.schedule(ParentRunner.java:71)
09:59:41 	at org.junit.runners.ParentRunner.runChildren(ParentRunner.java:288)
09:59:41 	at org.junit.runners.ParentRunner.access$000(ParentRunner.java:58)
09:59:41 	at org.junit.runners.ParentRunner$2.evaluate(ParentRunner.java:268)
09:59:41 	at org.junit.runners.ParentRunner.run(ParentRunner.java:363)
09:59:41 	at org.apache.maven.surefire.junit4.JUnit4Provider.execute(JUnit4Provider.java:264)
09:59:41 	at org.apache.maven.surefire.junit4.JUnit4Provider.executeTestSet(JUnit4Provider.java:153)
09:59:41 	at org.apache.maven.surefire.junit4.JUnit4Provider.invoke(JUnit4Provider.java:124)
09:59:41 	at sun.reflect.NativeMethodAccessorImpl.invoke0(Native Method)
09:59:41 	at sun.reflect.NativeMethodAccessorImpl.invoke(NativeMethodAccessorImpl.java:62)
09:59:41 	at sun.reflect.DelegatingMethodAccessorImpl.invoke(DelegatingMethodAccessorImpl.java:43)
09:59:41 	at java.lang.reflect.Method.invoke(Method.java:498)
09:59:41 	at org.apache.maven.surefire.util.ReflectionUtils.invokeMethodWithArray2(ReflectionUtils.java:208)
09:59:41 	at org.apache.maven.surefire.booter.ProviderFactory$ProviderProxy.invoke(ProviderFactory.java:156)
09:59:41 	at org.apache.maven.surefire.booter.ProviderFactory.invokeProvider(ProviderFactory.java:82)
09:59:41 	at org.eclipse.tycho.surefire.osgibooter.OsgiSurefireBooter.run(OsgiSurefireBooter.java:95)
09:59:41 	at org.eclipse.tycho.surefire.osgibooter.HeadlessTestApplication.run(HeadlessTestApplication.java:21)
09:59:41 	at sun.reflect.NativeMethodAccessorImpl.invoke0(Native Method)
09:59:41 	at sun.reflect.NativeMethodAccessorImpl.invoke(NativeMethodAccessorImpl.java:62)
09:59:41 	at sun.reflect.DelegatingMethodAccessorImpl.invoke(DelegatingMethodAccessorImpl.java:43)
09:59:41 	at java.lang.reflect.Method.invoke(Method.java:498)
09:59:41 	at org.eclipse.equinox.internal.app.EclipseAppContainer.callMethodWithException(EclipseAppContainer.java:587)
09:59:41 	at org.eclipse.equinox.internal.app.EclipseAppHandle.run(EclipseAppHandle.java:198)
09:59:41 	at org.eclipse.core.runtime.internal.adaptor.EclipseAppLauncher.runApplication(EclipseAppLauncher.java:134)
09:59:41 	at org.eclipse.core.runtime.internal.adaptor.EclipseAppLauncher.start(EclipseAppLauncher.java:104)
09:59:41 	at org.eclipse.core.runtime.adaptor.EclipseStarter.run(EclipseStarter.java:388)
09:59:41 	at org.eclipse.core.runtime.adaptor.EclipseStarter.run(EclipseStarter.java:243)
09:59:41 	at sun.reflect.NativeMethodAccessorImpl.invoke0(Native Method)
09:59:41 	at sun.reflect.NativeMethodAccessorImpl.invoke(NativeMethodAccessorImpl.java:62)
09:59:41 	at sun.reflect.DelegatingMethodAccessorImpl.invoke(DelegatingMethodAccessorImpl.java:43)
09:59:41 	at java.lang.reflect.Method.invoke(Method.java:498)
09:59:41 	at org.eclipse.equinox.launcher.Main.invokeFramework(Main.java:653)
09:59:41 	at org.eclipse.equinox.launcher.Main.basicRun(Main.java:590)
09:59:41 	at org.eclipse.equinox.launcher.Main.run(Main.java:1499)
09:59:41 	at org.eclipse.equinox.launcher.Main.main(Main.java:1472)
09:59:41 
09:59:41 Running org.eclipse.egerrit.core.command.tests.DeleteDraftRevisionCommandTest
09:59:41 Checking out http://104.154.18.211:28115/egerrit/test into /tmp/genie.egerrit/egerrit1159465056926301279.tmp
09:59:42 org.eclipse.jgit.api.errors.TransportException: http://104.154.18.211:28115/egerrit/test: error occurred during unpacking on the remote end: error No space left on device
09:59:42 Tests run: 1, Failures: 1, Errors: 0, Skipped: 0, Time elapsed: 0.624 sec <<< FAILURE! - in org.eclipse.egerrit.core.command.tests.DeleteDraftRevisionCommandTest
09:59:42 testCall(org.eclipse.egerrit.core.command.tests.DeleteDraftRevisionCommandTest)  Time elapsed: 0.622 sec  <<< FAILURE!
09:59:42 java.lang.AssertionError: http://104.154.18.211:28115/egerrit/test: error occurred during unpacking on the remote end: error No space left on device
09:59:42 	at org.junit.Assert.fail(Assert.java:88)
09:59:42 	at org.eclipse.egerrit.core.command.tests.CommandTest.createReviewWithSimpleFile(CommandTest.java:111)
09:59:42 	at org.eclipse.egerrit.core.command.tests.CommandTestWithSimpleReview.createReview(CommandTestWithSimpleReview.java:19)
09:59:42 	at sun.reflect.GeneratedMethodAccessor9.invoke(Unknown Source)
09:59:42 	at sun.reflect.DelegatingMethodAccessorImpl.invoke(DelegatingMethodAccessorImpl.java:43)
09:59:42 	at java.lang.reflect.Method.invoke(Method.java:498)
09:59:42 	at org.junit.runners.model.FrameworkMethod$1.runReflectiveCall(FrameworkMethod.java:50)
09:59:42 	at org.junit.internal.runners.model.ReflectiveCallable.run(ReflectiveCallable.java:12)
09:59:42 	at org.junit.runners.model.FrameworkMethod.invokeExplosively(FrameworkMethod.java:47)
09:59:42 	at org.junit.internal.runners.statements.RunBefores.evaluate(RunBefores.java:24)
09:59:42 	at org.junit.internal.runners.statements.RunAfters.evaluate(RunAfters.java:27)
09:59:42 	at org.junit.runners.ParentRunner.runLeaf(ParentRunner.java:325)
09:59:42 	at org.junit.runners.BlockJUnit4ClassRunner.runChild(BlockJUnit4ClassRunner.java:78)
09:59:42 	at org.junit.runners.BlockJUnit4ClassRunner.runChild(BlockJUnit4ClassRunner.java:57)
09:59:42 	at org.junit.runners.ParentRunner$3.run(ParentRunner.java:290)
09:59:42 	at org.junit.runners.ParentRunner$1.schedule(ParentRunner.java:71)
09:59:42 	at org.junit.runners.ParentRunner.runChildren(ParentRunner.java:288)
09:59:42 	at org.junit.runners.ParentRunner.access$000(ParentRunner.java:58)
09:59:42 	at org.junit.runners.ParentRunner$2.evaluate(ParentRunner.java:268)
09:59:42 	at org.junit.runners.ParentRunner.run(ParentRunner.java:363)
09:59:42 	at org.apache.maven.surefire.junit4.JUnit4Provider.execute(JUnit4Provider.java:264)
09:59:42 	at org.apache.maven.surefire.junit4.JUnit4Provider.executeTestSet(JUnit4Provider.java:153)
09:59:42 	at org.apache.maven.surefire.junit4.JUnit4Provider.invoke(JUnit4Provider.java:124)
09:59:42 	at sun.reflect.NativeMethodAccessorImpl.invoke0(Native Method)
09:59:42 	at sun.reflect.NativeMethodAccessorImpl.invoke(NativeMethodAccessorImpl.java:62)
09:59:42 	at sun.reflect.DelegatingMethodAccessorImpl.invoke(DelegatingMethodAccessorImpl.java:43)
09:59:42 	at java.lang.reflect.Method.invoke(Method.java:498)
09:59:42 	at org.apache.maven.surefire.util.ReflectionUtils.invokeMethodWithArray2(ReflectionUtils.java:208)
09:59:42 	at org.apache.maven.surefire.booter.ProviderFactory$ProviderProxy.invoke(ProviderFactory.java:156)
09:59:42 	at org.apache.maven.surefire.booter.ProviderFactory.invokeProvider(ProviderFactory.java:82)
09:59:42 	at org.eclipse.tycho.surefire.osgibooter.OsgiSurefireBooter.run(OsgiSurefireBooter.java:95)
09:59:42 	at org.eclipse.tycho.surefire.osgibooter.HeadlessTestApplication.run(HeadlessTestApplication.java:21)
09:59:42 	at sun.reflect.NativeMethodAccessorImpl.invoke0(Native Method)
09:59:42 	at sun.reflect.NativeMethodAccessorImpl.invoke(NativeMethodAccessorImpl.java:62)
09:59:42 	at sun.reflect.DelegatingMethodAccessorImpl.invoke(DelegatingMethodAccessorImpl.java:43)
09:59:42 	at java.lang.reflect.Method.invoke(Method.java:498)
09:59:42 	at org.eclipse.equinox.internal.app.EclipseAppContainer.callMethodWithException(EclipseAppContainer.java:587)
09:59:42 	at org.eclipse.equinox.internal.app.EclipseAppHandle.run(EclipseAppHandle.java:198)
09:59:42 	at org.eclipse.core.runtime.internal.adaptor.EclipseAppLauncher.runApplication(EclipseAppLauncher.java:134)
09:59:42 	at org.eclipse.core.runtime.internal.adaptor.EclipseAppLauncher.start(EclipseAppLauncher.java:104)
09:59:42 	at org.eclipse.core.runtime.adaptor.EclipseStarter.run(EclipseStarter.java:388)
09:59:42 	at org.eclipse.core.runtime.adaptor.EclipseStarter.run(EclipseStarter.java:243)
09:59:42 	at sun.reflect.NativeMethodAccessorImpl.invoke0(Native Method)
09:59:42 	at sun.reflect.NativeMethodAccessorImpl.invoke(NativeMethodAccessorImpl.java:62)
09:59:42 	at sun.reflect.DelegatingMethodAccessorImpl.invoke(DelegatingMethodAccessorImpl.java:43)
09:59:42 	at java.lang.reflect.Method.invoke(Method.java:498)
09:59:42 	at org.eclipse.equinox.launcher.Main.invokeFramework(Main.java:653)
09:59:42 	at org.eclipse.equinox.launcher.Main.basicRun(Main.java:590)
09:59:42 	at org.eclipse.equinox.launcher.Main.run(Main.java:1499)
09:59:42 	at org.eclipse.equinox.launcher.Main.main(Main.java:1472)
09:59:42 
09:59:42 Running org.eclipse.egerrit.core.command.tests.ChangeCommitMsgCommandTest
09:59:42 Checking out http://104.154.18.211:28115/egerrit/test into /tmp/genie.egerrit/egerrit5537348472161026945.tmp
09:59:42 org.eclipse.jgit.api.errors.TransportException: http://104.154.18.211:28115/egerrit/test: error occurred during unpacking on the remote end: error No space left on device
09:59:42 Tests run: 1, Failures: 1, Errors: 0, Skipped: 0, Time elapsed: 0.629 sec <<< FAILURE! - in org.eclipse.egerrit.core.command.tests.ChangeCommitMsgCommandTest
09:59:42 testCall(org.eclipse.egerrit.core.command.tests.ChangeCommitMsgCommandTest)  Time elapsed: 0.627 sec  <<< FAILURE!
09:59:42 java.lang.AssertionError: http://104.154.18.211:28115/egerrit/test: error occurred during unpacking on the remote end: error No space left on device
09:59:42 	at org.junit.Assert.fail(Assert.java:88)
09:59:42 	at org.eclipse.egerrit.core.command.tests.CommandTest.createReviewWithSimpleFile(CommandTest.java:111)
09:59:42 	at org.eclipse.egerrit.core.command.tests.CommandTestWithSimpleReview.createReview(CommandTestWithSimpleReview.java:19)
09:59:42 	at sun.reflect.GeneratedMethodAccessor9.invoke(Unknown Source)
09:59:42 	at sun.reflect.DelegatingMethodAccessorImpl.invoke(DelegatingMethodAccessorImpl.java:43)
09:59:42 	at java.lang.reflect.Method.invoke(Method.java:498)
09:59:42 	at org.junit.runners.model.FrameworkMethod$1.runReflectiveCall(FrameworkMethod.java:50)
09:59:42 	at org.junit.internal.runners.model.ReflectiveCallable.run(ReflectiveCallable.java:12)
09:59:42 	at org.junit.runners.model.FrameworkMethod.invokeExplosively(FrameworkMethod.java:47)
09:59:42 	at org.junit.internal.runners.statements.RunBefores.evaluate(RunBefores.java:24)
09:59:42 	at org.junit.internal.runners.statements.RunAfters.evaluate(RunAfters.java:27)
09:59:42 	at org.junit.runners.ParentRunner.runLeaf(ParentRunner.java:325)
09:59:42 	at org.junit.runners.BlockJUnit4ClassRunner.runChild(BlockJUnit4ClassRunner.java:78)
09:59:42 	at org.junit.runners.BlockJUnit4ClassRunner.runChild(BlockJUnit4ClassRunner.java:57)
09:59:42 	at org.junit.runners.ParentRunner$3.run(ParentRunner.java:290)
09:59:42 	at org.junit.runners.ParentRunner$1.schedule(ParentRunner.java:71)
09:59:42 	at org.junit.runners.ParentRunner.runChildren(ParentRunner.java:288)
09:59:42 	at org.junit.runners.ParentRunner.access$000(ParentRunner.java:58)
09:59:42 	at org.junit.runners.ParentRunner$2.evaluate(ParentRunner.java:268)
09:59:42 	at org.junit.runners.ParentRunner.run(ParentRunner.java:363)
09:59:42 	at org.apache.maven.surefire.junit4.JUnit4Provider.execute(JUnit4Provider.java:264)
09:59:42 	at org.apache.maven.surefire.junit4.JUnit4Provider.executeTestSet(JUnit4Provider.java:153)
09:59:42 	at org.apache.maven.surefire.junit4.JUnit4Provider.invoke(JUnit4Provider.java:124)
09:59:42 	at sun.reflect.NativeMethodAccessorImpl.invoke0(Native Method)
09:59:42 	at sun.reflect.NativeMethodAccessorImpl.invoke(NativeMethodAccessorImpl.java:62)
09:59:42 	at sun.reflect.DelegatingMethodAccessorImpl.invoke(DelegatingMethodAccessorImpl.java:43)
09:59:42 	at java.lang.reflect.Method.invoke(Method.java:498)
09:59:42 	at org.apache.maven.surefire.util.ReflectionUtils.invokeMethodWithArray2(ReflectionUtils.java:208)
09:59:42 	at org.apache.maven.surefire.booter.ProviderFactory$ProviderProxy.invoke(ProviderFactory.java:156)
09:59:42 	at org.apache.maven.surefire.booter.ProviderFactory.invokeProvider(ProviderFactory.java:82)
09:59:42 	at org.eclipse.tycho.surefire.osgibooter.OsgiSurefireBooter.run(OsgiSurefireBooter.java:95)
09:59:42 	at org.eclipse.tycho.surefire.osgibooter.HeadlessTestApplication.run(HeadlessTestApplication.java:21)
09:59:42 	at sun.reflect.NativeMethodAccessorImpl.invoke0(Native Method)
09:59:42 	at sun.reflect.NativeMethodAccessorImpl.invoke(NativeMethodAccessorImpl.java:62)
09:59:42 	at sun.reflect.DelegatingMethodAccessorImpl.invoke(DelegatingMethodAccessorImpl.java:43)
09:59:42 	at java.lang.reflect.Method.invoke(Method.java:498)
09:59:42 	at org.eclipse.equinox.internal.app.EclipseAppContainer.callMethodWithException(EclipseAppContainer.java:587)
09:59:42 	at org.eclipse.equinox.internal.app.EclipseAppHandle.run(EclipseAppHandle.java:198)
09:59:42 	at org.eclipse.core.runtime.internal.adaptor.EclipseAppLauncher.runApplication(EclipseAppLauncher.java:134)
09:59:42 	at org.eclipse.core.runtime.internal.adaptor.EclipseAppLauncher.start(EclipseAppLauncher.java:104)
09:59:42 	at org.eclipse.core.runtime.adaptor.EclipseStarter.run(EclipseStarter.java:388)
09:59:42 	at org.eclipse.core.runtime.adaptor.EclipseStarter.run(EclipseStarter.java:243)
09:59:42 	at sun.reflect.NativeMethodAccessorImpl.invoke0(Native Method)
09:59:42 	at sun.reflect.NativeMethodAccessorImpl.invoke(NativeMethodAccessorImpl.java:62)
09:59:42 	at sun.reflect.DelegatingMethodAccessorImpl.invoke(DelegatingMethodAccessorImpl.java:43)
09:59:42 	at java.lang.reflect.Method.invoke(Method.java:498)
09:59:42 	at org.eclipse.equinox.launcher.Main.invokeFramework(Main.java:653)
09:59:42 	at org.eclipse.equinox.launcher.Main.basicRun(Main.java:590)
09:59:42 	at org.eclipse.equinox.launcher.Main.run(Main.java:1499)
09:59:42 	at org.eclipse.equinox.launcher.Main.main(Main.java:1472)
09:59:42 
09:59:42 Running org.eclipse.egerrit.core.command.tests.ListReviewersCommandTest
09:59:43 Checking out http://104.154.18.211:28115/egerrit/test into /tmp/genie.egerrit/egerrit7786538230408414702.tmp
09:59:43 org.eclipse.jgit.api.errors.TransportException: http://104.154.18.211:28115/egerrit/test: error occurred during unpacking on the remote end: error No space left on device
09:59:43 Tests run: 1, Failures: 1, Errors: 0, Skipped: 0, Time elapsed: 0.814 sec <<< FAILURE! - in org.eclipse.egerrit.core.command.tests.ListReviewersCommandTest
09:59:43 testCall(org.eclipse.egerrit.core.command.tests.ListReviewersCommandTest)  Time elapsed: 0.812 sec  <<< FAILURE!
09:59:43 java.lang.AssertionError: http://104.154.18.211:28115/egerrit/test: error occurred during unpacking on the remote end: error No space left on device
09:59:43 	at org.junit.Assert.fail(Assert.java:88)
09:59:43 	at org.eclipse.egerrit.core.command.tests.CommandTest.createReviewWithSimpleFile(CommandTest.java:111)
09:59:43 	at org.eclipse.egerrit.core.command.tests.CommandTestWithSimpleReview.createReview(CommandTestWithSimpleReview.java:19)
09:59:43 	at sun.reflect.GeneratedMethodAccessor9.invoke(Unknown Source)
09:59:43 	at sun.reflect.DelegatingMethodAccessorImpl.invoke(DelegatingMethodAccessorImpl.java:43)
09:59:43 	at java.lang.reflect.Method.invoke(Method.java:498)
09:59:43 	at org.junit.runners.model.FrameworkMethod$1.runReflectiveCall(FrameworkMethod.java:50)
09:59:43 	at org.junit.internal.runners.model.ReflectiveCallable.run(ReflectiveCallable.java:12)
09:59:43 	at org.junit.runners.model.FrameworkMethod.invokeExplosively(FrameworkMethod.java:47)
09:59:43 	at org.junit.internal.runners.statements.RunBefores.evaluate(RunBefores.java:24)
09:59:43 	at org.junit.internal.runners.statements.RunAfters.evaluate(RunAfters.java:27)
09:59:43 	at org.junit.runners.ParentRunner.runLeaf(ParentRunner.java:325)
09:59:43 	at org.junit.runners.BlockJUnit4ClassRunner.runChild(BlockJUnit4ClassRunner.java:78)
09:59:43 	at org.junit.runners.BlockJUnit4ClassRunner.runChild(BlockJUnit4ClassRunner.java:57)
09:59:43 	at org.junit.runners.ParentRunner$3.run(ParentRunner.java:290)
09:59:43 	at org.junit.runners.ParentRunner$1.schedule(ParentRunner.java:71)
09:59:43 	at org.junit.runners.ParentRunner.runChildren(ParentRunner.java:288)
09:59:43 	at org.junit.runners.ParentRunner.access$000(ParentRunner.java:58)
09:59:43 	at org.junit.runners.ParentRunner$2.evaluate(ParentRunner.java:268)
09:59:43 	at org.junit.runners.ParentRunner.run(ParentRunner.java:363)
09:59:43 	at org.apache.maven.surefire.junit4.JUnit4Provider.execute(JUnit4Provider.java:264)
09:59:43 	at org.apache.maven.surefire.junit4.JUnit4Provider.executeTestSet(JUnit4Provider.java:153)
09:59:43 	at org.apache.maven.surefire.junit4.JUnit4Provider.invoke(JUnit4Provider.java:124)
09:59:43 	at sun.reflect.NativeMethodAccessorImpl.invoke0(Native Method)
09:59:43 	at sun.reflect.NativeMethodAccessorImpl.invoke(NativeMethodAccessorImpl.java:62)
09:59:43 	at sun.reflect.DelegatingMethodAccessorImpl.invoke(DelegatingMethodAccessorImpl.java:43)
09:59:43 	at java.lang.reflect.Method.invoke(Method.java:498)
09:59:43 	at org.apache.maven.surefire.util.ReflectionUtils.invokeMethodWithArray2(ReflectionUtils.java:208)
09:59:43 	at org.apache.maven.surefire.booter.ProviderFactory$ProviderProxy.invoke(ProviderFactory.java:156)
09:59:43 	at org.apache.maven.surefire.booter.ProviderFactory.invokeProvider(ProviderFactory.java:82)
09:59:43 	at org.eclipse.tycho.surefire.osgibooter.OsgiSurefireBooter.run(OsgiSurefireBooter.java:95)
09:59:43 	at org.eclipse.tycho.surefire.osgibooter.HeadlessTestApplication.run(HeadlessTestApplication.java:21)
09:59:43 	at sun.reflect.NativeMethodAccessorImpl.invoke0(Native Method)
09:59:43 	at sun.reflect.NativeMethodAccessorImpl.invoke(NativeMethodAccessorImpl.java:62)
09:59:43 	at sun.reflect.DelegatingMethodAccessorImpl.invoke(DelegatingMethodAccessorImpl.java:43)
09:59:43 	at java.lang.reflect.Method.invoke(Method.java:498)
09:59:43 	at org.eclipse.equinox.internal.app.EclipseAppContainer.callMethodWithException(EclipseAppContainer.java:587)
09:59:43 	at org.eclipse.equinox.internal.app.EclipseAppHandle.run(EclipseAppHandle.java:198)
09:59:43 	at org.eclipse.core.runtime.internal.adaptor.EclipseAppLauncher.runApplication(EclipseAppLauncher.java:134)
09:59:43 	at org.eclipse.core.runtime.internal.adaptor.EclipseAppLauncher.start(EclipseAppLauncher.java:104)
09:59:43 	at org.eclipse.core.runtime.adaptor.EclipseStarter.run(EclipseStarter.java:388)
09:59:43 	at org.eclipse.core.runtime.adaptor.EclipseStarter.run(EclipseStarter.java:243)
09:59:43 	at sun.reflect.NativeMethodAccessorImpl.invoke0(Native Method)
09:59:43 	at sun.reflect.NativeMethodAccessorImpl.invoke(NativeMethodAccessorImpl.java:62)
09:59:43 	at sun.reflect.DelegatingMethodAccessorImpl.invoke(DelegatingMethodAccessorImpl.java:43)
09:59:43 	at java.lang.reflect.Method.invoke(Method.java:498)
09:59:43 	at org.eclipse.equinox.launcher.Main.invokeFramework(Main.java:653)
09:59:43 	at org.eclipse.equinox.launcher.Main.basicRun(Main.java:590)
09:59:43 	at org.eclipse.equinox.launcher.Main.run(Main.java:1499)
09:59:43 	at org.eclipse.equinox.launcher.Main.main(Main.java:1472)
09:59:43 
09:59:43 Running org.eclipse.egerrit.core.command.tests.GetDiffCommandTest
09:59:43 Checking out http://104.154.18.211:28115/egerrit/test into /tmp/genie.egerrit/egerrit7043684277967693554.tmp
09:59:44 org.eclipse.jgit.api.errors.TransportException: http://104.154.18.211:28115/egerrit/test: error occurred during unpacking on the remote end: error No space left on device
09:59:44 Checking out http://104.154.18.211:28115/egerrit/test into /tmp/genie.egerrit/egerrit22203440800680277.tmp
09:59:45 org.eclipse.jgit.api.errors.TransportException: http://104.154.18.211:28115/egerrit/test: error occurred during unpacking on the remote end: error No space left on device
09:59:45 Tests run: 2, Failures: 2, Errors: 0, Skipped: 0, Time elapsed: 1.312 sec <<< FAILURE! - in org.eclipse.egerrit.core.command.tests.GetDiffCommandTest
09:59:45 testCallFromBase(org.eclipse.egerrit.core.command.tests.GetDiffCommandTest)  Time elapsed: 0.704 sec  <<< FAILURE!
09:59:45 java.lang.AssertionError: http://104.154.18.211:28115/egerrit/test: error occurred during unpacking on the remote end: error No space left on device
09:59:45 	at org.junit.Assert.fail(Assert.java:88)
09:59:45 	at org.eclipse.egerrit.core.command.tests.CommandTest.createReviewWithSimpleFile(CommandTest.java:111)
09:59:45 	at org.eclipse.egerrit.core.command.tests.CommandTestWithSimpleReview.createReview(CommandTestWithSimpleReview.java:19)
09:59:45 	at sun.reflect.GeneratedMethodAccessor9.invoke(Unknown Source)
09:59:45 	at sun.reflect.DelegatingMethodAccessorImpl.invoke(DelegatingMethodAccessorImpl.java:43)
09:59:45 	at java.lang.reflect.Method.invoke(Method.java:498)
09:59:45 	at org.junit.runners.model.FrameworkMethod$1.runReflectiveCall(FrameworkMethod.java:50)
09:59:45 	at org.junit.internal.runners.model.ReflectiveCallable.run(ReflectiveCallable.java:12)
09:59:45 	at org.junit.runners.model.FrameworkMethod.invokeExplosively(FrameworkMethod.java:47)
09:59:45 	at org.junit.internal.runners.statements.RunBefores.evaluate(RunBefores.java:24)
09:59:45 	at org.junit.internal.runners.statements.RunAfters.evaluate(RunAfters.java:27)
09:59:45 	at org.junit.runners.ParentRunner.runLeaf(ParentRunner.java:325)
09:59:45 	at org.junit.runners.BlockJUnit4ClassRunner.runChild(BlockJUnit4ClassRunner.java:78)
09:59:45 	at org.junit.runners.BlockJUnit4ClassRunner.runChild(BlockJUnit4ClassRunner.java:57)
09:59:45 	at org.junit.runners.ParentRunner$3.run(ParentRunner.java:290)
09:59:45 	at org.junit.runners.ParentRunner$1.schedule(ParentRunner.java:71)
09:59:45 	at org.junit.runners.ParentRunner.runChildren(ParentRunner.java:288)
09:59:45 	at org.junit.runners.ParentRunner.access$000(ParentRunner.java:58)
09:59:45 	at org.junit.runners.ParentRunner$2.evaluate(ParentRunner.java:268)
09:59:45 	at org.junit.runners.ParentRunner.run(ParentRunner.java:363)
09:59:45 	at org.apache.maven.surefire.junit4.JUnit4Provider.execute(JUnit4Provider.java:264)
09:59:45 	at org.apache.maven.surefire.junit4.JUnit4Provider.executeTestSet(JUnit4Provider.java:153)
09:59:45 	at org.apache.maven.surefire.junit4.JUnit4Provider.invoke(JUnit4Provider.java:124)
09:59:45 	at sun.reflect.NativeMethodAccessorImpl.invoke0(Native Method)
09:59:45 	at sun.reflect.NativeMethodAccessorImpl.invoke(NativeMethodAccessorImpl.java:62)
09:59:45 	at sun.reflect.DelegatingMethodAccessorImpl.invoke(DelegatingMethodAccessorImpl.java:43)
09:59:45 	at java.lang.reflect.Method.invoke(Method.java:498)
09:59:45 	at org.apache.maven.surefire.util.ReflectionUtils.invokeMethodWithArray2(ReflectionUtils.java:208)
09:59:45 	at org.apache.maven.surefire.booter.ProviderFactory$ProviderProxy.invoke(ProviderFactory.java:156)
09:59:45 	at org.apache.maven.surefire.booter.ProviderFactory.invokeProvider(ProviderFactory.java:82)
09:59:45 	at org.eclipse.tycho.surefire.osgibooter.OsgiSurefireBooter.run(OsgiSurefireBooter.java:95)
09:59:45 	at org.eclipse.tycho.surefire.osgibooter.HeadlessTestApplication.run(HeadlessTestApplication.java:21)
09:59:45 	at sun.reflect.NativeMethodAccessorImpl.invoke0(Native Method)
09:59:45 	at sun.reflect.NativeMethodAccessorImpl.invoke(NativeMethodAccessorImpl.java:62)
09:59:45 	at sun.reflect.DelegatingMethodAccessorImpl.invoke(DelegatingMethodAccessorImpl.java:43)
09:59:45 	at java.lang.reflect.Method.invoke(Method.java:498)
09:59:45 	at org.eclipse.equinox.internal.app.EclipseAppContainer.callMethodWithException(EclipseAppContainer.java:587)
09:59:45 	at org.eclipse.equinox.internal.app.EclipseAppHandle.run(EclipseAppHandle.java:198)
09:59:45 	at org.eclipse.core.runtime.internal.adaptor.EclipseAppLauncher.runApplication(EclipseAppLauncher.java:134)
09:59:45 	at org.eclipse.core.runtime.internal.adaptor.EclipseAppLauncher.start(EclipseAppLauncher.java:104)
09:59:45 	at org.eclipse.core.runtime.adaptor.EclipseStarter.run(EclipseStarter.java:388)
09:59:45 	at org.eclipse.core.runtime.adaptor.EclipseStarter.run(EclipseStarter.java:243)
09:59:45 	at sun.reflect.NativeMethodAccessorImpl.invoke0(Native Method)
09:59:45 	at sun.reflect.NativeMethodAccessorImpl.invoke(NativeMethodAccessorImpl.java:62)
09:59:45 	at sun.reflect.DelegatingMethodAccessorImpl.invoke(DelegatingMethodAccessorImpl.java:43)
09:59:45 	at java.lang.reflect.Method.invoke(Method.java:498)
09:59:45 	at org.eclipse.equinox.launcher.Main.invokeFramework(Main.java:653)
09:59:45 	at org.eclipse.equinox.launcher.Main.basicRun(Main.java:590)
09:59:45 	at org.eclipse.equinox.launcher.Main.run(Main.java:1499)
09:59:45 	at org.eclipse.equinox.launcher.Main.main(Main.java:1472)
09:59:45 
09:59:45 testCallRevision(org.eclipse.egerrit.core.command.tests.GetDiffCommandTest)  Time elapsed: 0.606 sec  <<< FAILURE!
09:59:45 java.lang.AssertionError: http://104.154.18.211:28115/egerrit/test: error occurred during unpacking on the remote end: error No space left on device
09:59:45 	at org.junit.Assert.fail(Assert.java:88)
09:59:45 	at org.eclipse.egerrit.core.command.tests.CommandTest.createReviewWithSimpleFile(CommandTest.java:111)
09:59:45 	at org.eclipse.egerrit.core.command.tests.CommandTestWithSimpleReview.createReview(CommandTestWithSimpleReview.java:19)
09:59:45 	at sun.reflect.GeneratedMethodAccessor9.invoke(Unknown Source)
09:59:45 	at sun.reflect.DelegatingMethodAccessorImpl.invoke(DelegatingMethodAccessorImpl.java:43)
09:59:45 	at java.lang.reflect.Method.invoke(Method.java:498)
09:59:45 	at org.junit.runners.model.FrameworkMethod$1.runReflectiveCall(FrameworkMethod.java:50)
09:59:45 	at org.junit.internal.runners.model.ReflectiveCallable.run(ReflectiveCallable.java:12)
09:59:45 	at org.junit.runners.model.FrameworkMethod.invokeExplosively(FrameworkMethod.java:47)
09:59:45 	at org.junit.internal.runners.statements.RunBefores.evaluate(RunBefores.java:24)
09:59:45 	at org.junit.internal.runners.statements.RunAfters.evaluate(RunAfters.java:27)
09:59:45 	at org.junit.runners.ParentRunner.runLeaf(ParentRunner.java:325)
09:59:45 	at org.junit.runners.BlockJUnit4ClassRunner.runChild(BlockJUnit4ClassRunner.java:78)
09:59:45 	at org.junit.runners.BlockJUnit4ClassRunner.runChild(BlockJUnit4ClassRunner.java:57)
09:59:45 	at org.junit.runners.ParentRunner$3.run(ParentRunner.java:290)
09:59:45 	at org.junit.runners.ParentRunner$1.schedule(ParentRunner.java:71)
09:59:45 	at org.junit.runners.ParentRunner.runChildren(ParentRunner.java:288)
09:59:45 	at org.junit.runners.ParentRunner.access$000(ParentRunner.java:58)
09:59:45 	at org.junit.runners.ParentRunner$2.evaluate(ParentRunner.java:268)
09:59:45 	at org.junit.runners.ParentRunner.run(ParentRunner.java:363)
09:59:45 	at org.apache.maven.surefire.junit4.JUnit4Provider.execute(JUnit4Provider.java:264)
09:59:45 	at org.apache.maven.surefire.junit4.JUnit4Provider.executeTestSet(JUnit4Provider.java:153)
09:59:45 	at org.apache.maven.surefire.junit4.JUnit4Provider.invoke(JUnit4Provider.java:124)
09:59:45 	at sun.reflect.NativeMethodAccessorImpl.invoke0(Native Method)
09:59:45 	at sun.reflect.NativeMethodAccessorImpl.invoke(NativeMethodAccessorImpl.java:62)
09:59:45 	at sun.reflect.DelegatingMethodAccessorImpl.invoke(DelegatingMethodAccessorImpl.java:43)
09:59:45 	at java.lang.reflect.Method.invoke(Method.java:498)
09:59:45 	at org.apache.maven.surefire.util.ReflectionUtils.invokeMethodWithArray2(ReflectionUtils.java:208)
09:59:45 	at org.apache.maven.surefire.booter.ProviderFactory$ProviderProxy.invoke(ProviderFactory.java:156)
09:59:45 	at org.apache.maven.surefire.booter.ProviderFactory.invokeProvider(ProviderFactory.java:82)
09:59:45 	at org.eclipse.tycho.surefire.osgibooter.OsgiSurefireBooter.run(OsgiSurefireBooter.java:95)
09:59:45 	at org.eclipse.tycho.surefire.osgibooter.HeadlessTestApplication.run(HeadlessTestApplication.java:21)
09:59:45 	at sun.reflect.NativeMethodAccessorImpl.invoke0(Native Method)
09:59:45 	at sun.reflect.NativeMethodAccessorImpl.invoke(NativeMethodAccessorImpl.java:62)
09:59:45 	at sun.reflect.DelegatingMethodAccessorImpl.invoke(DelegatingMethodAccessorImpl.java:43)
09:59:45 	at java.lang.reflect.Method.invoke(Method.java:498)
09:59:45 	at org.eclipse.equinox.internal.app.EclipseAppContainer.callMethodWithException(EclipseAppContainer.java:587)
09:59:45 	at org.eclipse.equinox.internal.app.EclipseAppHandle.run(EclipseAppHandle.java:198)
09:59:45 	at org.eclipse.core.runtime.internal.adaptor.EclipseAppLauncher.runApplication(EclipseAppLauncher.java:134)
09:59:45 	at org.eclipse.core.runtime.internal.adaptor.EclipseAppLauncher.start(EclipseAppLauncher.java:104)
09:59:45 	at org.eclipse.core.runtime.adaptor.EclipseStarter.run(EclipseStarter.java:388)
09:59:45 	at org.eclipse.core.runtime.adaptor.EclipseStarter.run(EclipseStarter.java:243)
09:59:45 	at sun.reflect.NativeMethodAccessorImpl.invoke0(Native Method)
09:59:45 	at sun.reflect.NativeMethodAccessorImpl.invoke(NativeMethodAccessorImpl.java:62)
09:59:45 	at sun.reflect.DelegatingMethodAccessorImpl.invoke(DelegatingMethodAccessorImpl.java:43)
09:59:45 	at java.lang.reflect.Method.invoke(Method.java:498)
09:59:45 	at org.eclipse.equinox.launcher.Main.invokeFramework(Main.java:653)
09:59:45 	at org.eclipse.equinox.launcher.Main.basicRun(Main.java:590)
09:59:45 	at org.eclipse.equinox.launcher.Main.run(Main.java:1499)
09:59:45 	at org.eclipse.equinox.launcher.Main.main(Main.java:1472)
09:59:45 
09:59:45 Running org.eclipse.egerrit.core.command.tests.GetChangeCommandTest
09:59:45 Checking out http://104.154.18.211:28115/egerrit/test into /tmp/genie.egerrit/egerrit8865318326075033578.tmp
09:59:45 org.eclipse.jgit.api.errors.TransportException: http://104.154.18.211:28115/egerrit/test: error occurred during unpacking on the remote end: error No space left on device
09:59:45 Checking out http://104.154.18.211:28115/egerrit/test into /tmp/genie.egerrit/egerrit1020650489503097255.tmp
09:59:46 org.eclipse.jgit.api.errors.TransportException: http://104.154.18.211:28115/egerrit/test: error occurred during unpacking on the remote end: error No space left on device
09:59:46 Tests run: 2, Failures: 2, Errors: 0, Skipped: 0, Time elapsed: 1.317 sec <<< FAILURE! - in org.eclipse.egerrit.core.command.tests.GetChangeCommandTest
09:59:46 testCall(org.eclipse.egerrit.core.command.tests.GetChangeCommandTest)  Time elapsed: 0.639 sec  <<< FAILURE!
09:59:46 java.lang.AssertionError: http://104.154.18.211:28115/egerrit/test: error occurred during unpacking on the remote end: error No space left on device
09:59:46 	at org.junit.Assert.fail(Assert.java:88)
09:59:46 	at org.eclipse.egerrit.core.command.tests.CommandTest.createReviewWithSimpleFile(CommandTest.java:111)
09:59:46 	at org.eclipse.egerrit.core.command.tests.CommandTestWithSimpleReview.createReview(CommandTestWithSimpleReview.java:19)
09:59:46 	at sun.reflect.GeneratedMethodAccessor9.invoke(Unknown Source)
09:59:46 	at sun.reflect.DelegatingMethodAccessorImpl.invoke(DelegatingMethodAccessorImpl.java:43)
09:59:46 	at java.lang.reflect.Method.invoke(Method.java:498)
09:59:46 	at org.junit.runners.model.FrameworkMethod$1.runReflectiveCall(FrameworkMethod.java:50)
09:59:46 	at org.junit.internal.runners.model.ReflectiveCallable.run(ReflectiveCallable.java:12)
09:59:46 	at org.junit.runners.model.FrameworkMethod.invokeExplosively(FrameworkMethod.java:47)
09:59:46 	at org.junit.internal.runners.statements.RunBefores.evaluate(RunBefores.java:24)
09:59:46 	at org.junit.internal.runners.statements.RunAfters.evaluate(RunAfters.java:27)
09:59:46 	at org.junit.runners.ParentRunner.runLeaf(ParentRunner.java:325)
09:59:46 	at org.junit.runners.BlockJUnit4ClassRunner.runChild(BlockJUnit4ClassRunner.java:78)
09:59:46 	at org.junit.runners.BlockJUnit4ClassRunner.runChild(BlockJUnit4ClassRunner.java:57)
09:59:46 	at org.junit.runners.ParentRunner$3.run(ParentRunner.java:290)
09:59:46 	at org.junit.runners.ParentRunner$1.schedule(ParentRunner.java:71)
09:59:46 	at org.junit.runners.ParentRunner.runChildren(ParentRunner.java:288)
09:59:46 	at org.junit.runners.ParentRunner.access$000(ParentRunner.java:58)
09:59:46 	at org.junit.runners.ParentRunner$2.evaluate(ParentRunner.java:268)
09:59:46 	at org.junit.runners.ParentRunner.run(ParentRunner.java:363)
09:59:46 	at org.apache.maven.surefire.junit4.JUnit4Provider.execute(JUnit4Provider.java:264)
09:59:46 	at org.apache.maven.surefire.junit4.JUnit4Provider.executeTestSet(JUnit4Provider.java:153)
09:59:46 	at org.apache.maven.surefire.junit4.JUnit4Provider.invoke(JUnit4Provider.java:124)
09:59:46 	at sun.reflect.NativeMethodAccessorImpl.invoke0(Native Method)
09:59:46 	at sun.reflect.NativeMethodAccessorImpl.invoke(NativeMethodAccessorImpl.java:62)
09:59:46 	at sun.reflect.DelegatingMethodAccessorImpl.invoke(DelegatingMethodAccessorImpl.java:43)
09:59:46 	at java.lang.reflect.Method.invoke(Method.java:498)
09:59:46 	at org.apache.maven.surefire.util.ReflectionUtils.invokeMethodWithArray2(ReflectionUtils.java:208)
09:59:46 	at org.apache.maven.surefire.booter.ProviderFactory$ProviderProxy.invoke(ProviderFactory.java:156)
09:59:46 	at org.apache.maven.surefire.booter.ProviderFactory.invokeProvider(ProviderFactory.java:82)
09:59:46 	at org.eclipse.tycho.surefire.osgibooter.OsgiSurefireBooter.run(OsgiSurefireBooter.java:95)
09:59:46 	at org.eclipse.tycho.surefire.osgibooter.HeadlessTestApplication.run(HeadlessTestApplication.java:21)
09:59:46 	at sun.reflect.NativeMethodAccessorImpl.invoke0(Native Method)
09:59:46 	at sun.reflect.NativeMethodAccessorImpl.invoke(NativeMethodAccessorImpl.java:62)
09:59:46 	at sun.reflect.DelegatingMethodAccessorImpl.invoke(DelegatingMethodAccessorImpl.java:43)
09:59:46 	at java.lang.reflect.Method.invoke(Method.java:498)
09:59:46 	at org.eclipse.equinox.internal.app.EclipseAppContainer.callMethodWithException(EclipseAppContainer.java:587)
09:59:46 	at org.eclipse.equinox.internal.app.EclipseAppHandle.run(EclipseAppHandle.java:198)
09:59:46 	at org.eclipse.core.runtime.internal.adaptor.EclipseAppLauncher.runApplication(EclipseAppLauncher.java:134)
09:59:46 	at org.eclipse.core.runtime.internal.adaptor.EclipseAppLauncher.start(EclipseAppLauncher.java:104)
09:59:46 	at org.eclipse.core.runtime.adaptor.EclipseStarter.run(EclipseStarter.java:388)
09:59:46 	at org.eclipse.core.runtime.adaptor.EclipseStarter.run(EclipseStarter.java:243)
09:59:46 	at sun.reflect.NativeMethodAccessorImpl.invoke0(Native Method)
09:59:46 	at sun.reflect.NativeMethodAccessorImpl.invoke(NativeMethodAccessorImpl.java:62)
09:59:46 	at sun.reflect.DelegatingMethodAccessorImpl.invoke(DelegatingMethodAccessorImpl.java:43)
09:59:46 	at java.lang.reflect.Method.invoke(Method.java:498)
09:59:46 	at org.eclipse.equinox.launcher.Main.invokeFramework(Main.java:653)
09:59:46 	at org.eclipse.equinox.launcher.Main.basicRun(Main.java:590)
09:59:46 	at org.eclipse.equinox.launcher.Main.run(Main.java:1499)
09:59:46 	at org.eclipse.equinox.launcher.Main.main(Main.java:1472)
09:59:46 
09:59:46 testWithRevisions(org.eclipse.egerrit.core.command.tests.GetChangeCommandTest)  Time elapsed: 0.676 sec  <<< FAILURE!
09:59:46 java.lang.AssertionError: http://104.154.18.211:28115/egerrit/test: error occurred during unpacking on the remote end: error No space left on device
09:59:46 	at org.junit.Assert.fail(Assert.java:88)
09:59:46 	at org.eclipse.egerrit.core.command.tests.CommandTest.createReviewWithSimpleFile(CommandTest.java:111)
09:59:46 	at org.eclipse.egerrit.core.command.tests.CommandTestWithSimpleReview.createReview(CommandTestWithSimpleReview.java:19)
09:59:46 	at sun.reflect.GeneratedMethodAccessor9.invoke(Unknown Source)
09:59:46 	at sun.reflect.DelegatingMethodAccessorImpl.invoke(DelegatingMethodAccessorImpl.java:43)
09:59:46 	at java.lang.reflect.Method.invoke(Method.java:498)
09:59:46 	at org.junit.runners.model.FrameworkMethod$1.runReflectiveCall(FrameworkMethod.java:50)
09:59:46 	at org.junit.internal.runners.model.ReflectiveCallable.run(ReflectiveCallable.java:12)
09:59:46 	at org.junit.runners.model.FrameworkMethod.invokeExplosively(FrameworkMethod.java:47)
09:59:46 	at org.junit.internal.runners.statements.RunBefores.evaluate(RunBefores.java:24)
09:59:46 	at org.junit.internal.runners.statements.RunAfters.evaluate(RunAfters.java:27)
09:59:46 	at org.junit.runners.ParentRunner.runLeaf(ParentRunner.java:325)
09:59:46 	at org.junit.runners.BlockJUnit4ClassRunner.runChild(BlockJUnit4ClassRunner.java:78)
09:59:46 	at org.junit.runners.BlockJUnit4ClassRunner.runChild(BlockJUnit4ClassRunner.java:57)
09:59:46 	at org.junit.runners.ParentRunner$3.run(ParentRunner.java:290)
09:59:46 	at org.junit.runners.ParentRunner$1.schedule(ParentRunner.java:71)
09:59:46 	at org.junit.runners.ParentRunner.runChildren(ParentRunner.java:288)
09:59:46 	at org.junit.runners.ParentRunner.access$000(ParentRunner.java:58)
09:59:46 	at org.junit.runners.ParentRunner$2.evaluate(ParentRunner.java:268)
09:59:46 	at org.junit.runners.ParentRunner.run(ParentRunner.java:363)
09:59:46 	at org.apache.maven.surefire.junit4.JUnit4Provider.execute(JUnit4Provider.java:264)
09:59:46 	at org.apache.maven.surefire.junit4.JUnit4Provider.executeTestSet(JUnit4Provider.java:153)
09:59:46 	at org.apache.maven.surefire.junit4.JUnit4Provider.invoke(JUnit4Provider.java:124)
09:59:46 	at sun.reflect.NativeMethodAccessorImpl.invoke0(Native Method)
09:59:46 	at sun.reflect.NativeMethodAccessorImpl.invoke(NativeMethodAccessorImpl.java:62)
09:59:46 	at sun.reflect.DelegatingMethodAccessorImpl.invoke(DelegatingMethodAccessorImpl.java:43)
09:59:46 	at java.lang.reflect.Method.invoke(Method.java:498)
09:59:46 	at org.apache.maven.surefire.util.ReflectionUtils.invokeMethodWithArray2(ReflectionUtils.java:208)
09:59:46 	at org.apache.maven.surefire.booter.ProviderFactory$ProviderProxy.invoke(ProviderFactory.java:156)
09:59:46 	at org.apache.maven.surefire.booter.ProviderFactory.invokeProvider(ProviderFactory.java:82)
09:59:46 	at org.eclipse.tycho.surefire.osgibooter.OsgiSurefireBooter.run(OsgiSurefireBooter.java:95)
09:59:46 	at org.eclipse.tycho.surefire.osgibooter.HeadlessTestApplication.run(HeadlessTestApplication.java:21)
09:59:46 	at sun.reflect.NativeMethodAccessorImpl.invoke0(Native Method)
09:59:46 	at sun.reflect.NativeMethodAccessorImpl.invoke(NativeMethodAccessorImpl.java:62)
09:59:46 	at sun.reflect.DelegatingMethodAccessorImpl.invoke(DelegatingMethodAccessorImpl.java:43)
09:59:46 	at java.lang.reflect.Method.invoke(Method.java:498)
09:59:46 	at org.eclipse.equinox.internal.app.EclipseAppContainer.callMethodWithException(EclipseAppContainer.java:587)
09:59:46 	at org.eclipse.equinox.internal.app.EclipseAppHandle.run(EclipseAppHandle.java:198)
09:59:46 	at org.eclipse.core.runtime.internal.adaptor.EclipseAppLauncher.runApplication(EclipseAppLauncher.java:134)
09:59:46 	at org.eclipse.core.runtime.internal.adaptor.EclipseAppLauncher.start(EclipseAppLauncher.java:104)
09:59:46 	at org.eclipse.core.runtime.adaptor.EclipseStarter.run(EclipseStarter.java:388)
09:59:46 	at org.eclipse.core.runtime.adaptor.EclipseStarter.run(EclipseStarter.java:243)
09:59:46 	at sun.reflect.NativeMethodAccessorImpl.invoke0(Native Method)
09:59:46 	at sun.reflect.NativeMethodAccessorImpl.invoke(NativeMethodAccessorImpl.java:62)
09:59:46 	at sun.reflect.DelegatingMethodAccessorImpl.invoke(DelegatingMethodAccessorImpl.java:43)
09:59:46 	at java.lang.reflect.Method.invoke(Method.java:498)
09:59:46 	at org.eclipse.equinox.launcher.Main.invokeFramework(Main.java:653)
09:59:46 	at org.eclipse.equinox.launcher.Main.basicRun(Main.java:590)
09:59:46 	at org.eclipse.equinox.launcher.Main.run(Main.java:1499)
09:59:46 	at org.eclipse.equinox.launcher.Main.main(Main.java:1472)
09:59:46 
09:59:46 Running org.eclipse.egerrit.core.command.tests.CreateDraftCommandTest
09:59:46 Checking out http://104.154.18.211:28115/egerrit/test into /tmp/genie.egerrit/egerrit7172946898514169173.tmp
09:59:47 org.eclipse.jgit.api.errors.TransportException: http://104.154.18.211:28115/egerrit/test: error occurred during unpacking on the remote end: error No space left on device
09:59:47 Checking out http://104.154.18.211:28115/egerrit/test into /tmp/genie.egerrit/egerrit4597113552963446980.tmp
09:59:47 org.eclipse.jgit.api.errors.TransportException: http://104.154.18.211:28115/egerrit/test: error occurred during unpacking on the remote end: error No space left on device
09:59:47 Tests run: 2, Failures: 2, Errors: 0, Skipped: 0, Time elapsed: 1.354 sec <<< FAILURE! - in org.eclipse.egerrit.core.command.tests.CreateDraftCommandTest
09:59:47 testCall(org.eclipse.egerrit.core.command.tests.CreateDraftCommandTest)  Time elapsed: 0.675 sec  <<< FAILURE!
09:59:47 java.lang.AssertionError: http://104.154.18.211:28115/egerrit/test: error occurred during unpacking on the remote end: error No space left on device
09:59:47 	at org.junit.Assert.fail(Assert.java:88)
09:59:47 	at org.eclipse.egerrit.core.command.tests.CommandTest.createReviewWithSimpleFile(CommandTest.java:111)
09:59:47 	at org.eclipse.egerrit.core.command.tests.CommandTestWithSimpleReview.createReview(CommandTestWithSimpleReview.java:19)
09:59:47 	at sun.reflect.GeneratedMethodAccessor9.invoke(Unknown Source)
09:59:47 	at sun.reflect.DelegatingMethodAccessorImpl.invoke(DelegatingMethodAccessorImpl.java:43)
09:59:47 	at java.lang.reflect.Method.invoke(Method.java:498)
09:59:47 	at org.junit.runners.model.FrameworkMethod$1.runReflectiveCall(FrameworkMethod.java:50)
09:59:47 	at org.junit.internal.runners.model.ReflectiveCallable.run(ReflectiveCallable.java:12)
09:59:47 	at org.junit.runners.model.FrameworkMethod.invokeExplosively(FrameworkMethod.java:47)
09:59:47 	at org.junit.internal.runners.statements.RunBefores.evaluate(RunBefores.java:24)
09:59:47 	at org.junit.internal.runners.statements.RunAfters.evaluate(RunAfters.java:27)
09:59:47 	at org.junit.runners.ParentRunner.runLeaf(ParentRunner.java:325)
09:59:47 	at org.junit.runners.BlockJUnit4ClassRunner.runChild(BlockJUnit4ClassRunner.java:78)
09:59:47 	at org.junit.runners.BlockJUnit4ClassRunner.runChild(BlockJUnit4ClassRunner.java:57)
09:59:47 	at org.junit.runners.ParentRunner$3.run(ParentRunner.java:290)
09:59:47 	at org.junit.runners.ParentRunner$1.schedule(ParentRunner.java:71)
09:59:47 	at org.junit.runners.ParentRunner.runChildren(ParentRunner.java:288)
09:59:47 	at org.junit.runners.ParentRunner.access$000(ParentRunner.java:58)
09:59:47 	at org.junit.runners.ParentRunner$2.evaluate(ParentRunner.java:268)
09:59:47 	at org.junit.runners.ParentRunner.run(ParentRunner.java:363)
09:59:47 	at org.apache.maven.surefire.junit4.JUnit4Provider.execute(JUnit4Provider.java:264)
09:59:47 	at org.apache.maven.surefire.junit4.JUnit4Provider.executeTestSet(JUnit4Provider.java:153)
09:59:47 	at org.apache.maven.surefire.junit4.JUnit4Provider.invoke(JUnit4Provider.java:124)
09:59:47 	at sun.reflect.NativeMethodAccessorImpl.invoke0(Native Method)
09:59:47 	at sun.reflect.NativeMethodAccessorImpl.invoke(NativeMethodAccessorImpl.java:62)
09:59:47 	at sun.reflect.DelegatingMethodAccessorImpl.invoke(DelegatingMethodAccessorImpl.java:43)
09:59:47 	at java.lang.reflect.Method.invoke(Method.java:498)
09:59:47 	at org.apache.maven.surefire.util.ReflectionUtils.invokeMethodWithArray2(ReflectionUtils.java:208)
09:59:47 	at org.apache.maven.surefire.booter.ProviderFactory$ProviderProxy.invoke(ProviderFactory.java:156)
09:59:47 	at org.apache.maven.surefire.booter.ProviderFactory.invokeProvider(ProviderFactory.java:82)
09:59:47 	at org.eclipse.tycho.surefire.osgibooter.OsgiSurefireBooter.run(OsgiSurefireBooter.java:95)
09:59:47 	at org.eclipse.tycho.surefire.osgibooter.HeadlessTestApplication.run(HeadlessTestApplication.java:21)
09:59:47 	at sun.reflect.NativeMethodAccessorImpl.invoke0(Native Method)
09:59:47 	at sun.reflect.NativeMethodAccessorImpl.invoke(NativeMethodAccessorImpl.java:62)
09:59:47 	at sun.reflect.DelegatingMethodAccessorImpl.invoke(DelegatingMethodAccessorImpl.java:43)
09:59:47 	at java.lang.reflect.Method.invoke(Method.java:498)
09:59:47 	at org.eclipse.equinox.internal.app.EclipseAppContainer.callMethodWithException(EclipseAppContainer.java:587)
09:59:47 	at org.eclipse.equinox.internal.app.EclipseAppHandle.run(EclipseAppHandle.java:198)
09:59:47 	at org.eclipse.core.runtime.internal.adaptor.EclipseAppLauncher.runApplication(EclipseAppLauncher.java:134)
09:59:47 	at org.eclipse.core.runtime.internal.adaptor.EclipseAppLauncher.start(EclipseAppLauncher.java:104)
09:59:47 	at org.eclipse.core.runtime.adaptor.EclipseStarter.run(EclipseStarter.java:388)
09:59:47 	at org.eclipse.core.runtime.adaptor.EclipseStarter.run(EclipseStarter.java:243)
09:59:47 	at sun.reflect.NativeMethodAccessorImpl.invoke0(Native Method)
09:59:47 	at sun.reflect.NativeMethodAccessorImpl.invoke(NativeMethodAccessorImpl.java:62)
09:59:47 	at sun.reflect.DelegatingMethodAccessorImpl.invoke(DelegatingMethodAccessorImpl.java:43)
09:59:47 	at java.lang.reflect.Method.invoke(Method.java:498)
09:59:47 	at org.eclipse.equinox.launcher.Main.invokeFramework(Main.java:653)
09:59:47 	at org.eclipse.equinox.launcher.Main.basicRun(Main.java:590)
09:59:47 	at org.eclipse.equinox.launcher.Main.run(Main.java:1499)
09:59:47 	at org.eclipse.equinox.launcher.Main.main(Main.java:1472)
09:59:47 
09:59:47 testCreateCommentOnLine0(org.eclipse.egerrit.core.command.tests.CreateDraftCommandTest)  Time elapsed: 0.677 sec  <<< FAILURE!
09:59:47 java.lang.AssertionError: http://104.154.18.211:28115/egerrit/test: error occurred during unpacking on the remote end: error No space left on device
09:59:47 	at org.junit.Assert.fail(Assert.java:88)
09:59:47 	at org.eclipse.egerrit.core.command.tests.CommandTest.createReviewWithSimpleFile(CommandTest.java:111)
09:59:47 	at org.eclipse.egerrit.core.command.tests.CommandTestWithSimpleReview.createReview(CommandTestWithSimpleReview.java:19)
09:59:47 	at sun.reflect.GeneratedMethodAccessor9.invoke(Unknown Source)
09:59:47 	at sun.reflect.DelegatingMethodAccessorImpl.invoke(DelegatingMethodAccessorImpl.java:43)
09:59:47 	at java.lang.reflect.Method.invoke(Method.java:498)
09:59:47 	at org.junit.runners.model.FrameworkMethod$1.runReflectiveCall(FrameworkMethod.java:50)
09:59:47 	at org.junit.internal.runners.model.ReflectiveCallable.run(ReflectiveCallable.java:12)
09:59:47 	at org.junit.runners.model.FrameworkMethod.invokeExplosively(FrameworkMethod.java:47)
09:59:47 	at org.junit.internal.runners.statements.RunBefores.evaluate(RunBefores.java:24)
09:59:47 	at org.junit.internal.runners.statements.RunAfters.evaluate(RunAfters.java:27)
09:59:47 	at org.junit.runners.ParentRunner.runLeaf(ParentRunner.java:325)
09:59:47 	at org.junit.runners.BlockJUnit4ClassRunner.runChild(BlockJUnit4ClassRunner.java:78)
09:59:47 	at org.junit.runners.BlockJUnit4ClassRunner.runChild(BlockJUnit4ClassRunner.java:57)
09:59:47 	at org.junit.runners.ParentRunner$3.run(ParentRunner.java:290)
09:59:47 	at org.junit.runners.ParentRunner$1.schedule(ParentRunner.java:71)
09:59:47 	at org.junit.runners.ParentRunner.runChildren(ParentRunner.java:288)
09:59:47 	at org.junit.runners.ParentRunner.access$000(ParentRunner.java:58)
09:59:47 	at org.junit.runners.ParentRunner$2.evaluate(ParentRunner.java:268)
09:59:47 	at org.junit.runners.ParentRunner.run(ParentRunner.java:363)
09:59:47 	at org.apache.maven.surefire.junit4.JUnit4Provider.execute(JUnit4Provider.java:264)
09:59:47 	at org.apache.maven.surefire.junit4.JUnit4Provider.executeTestSet(JUnit4Provider.java:153)
09:59:47 	at org.apache.maven.surefire.junit4.JUnit4Provider.invoke(JUnit4Provider.java:124)
09:59:47 	at sun.reflect.NativeMethodAccessorImpl.invoke0(Native Method)
09:59:47 	at sun.reflect.NativeMethodAccessorImpl.invoke(NativeMethodAccessorImpl.java:62)
09:59:47 	at sun.reflect.DelegatingMethodAccessorImpl.invoke(DelegatingMethodAccessorImpl.java:43)
09:59:47 	at java.lang.reflect.Method.invoke(Method.java:498)
09:59:47 	at org.apache.maven.surefire.util.ReflectionUtils.invokeMethodWithArray2(ReflectionUtils.java:208)
09:59:47 	at org.apache.maven.surefire.booter.ProviderFactory$ProviderProxy.invoke(ProviderFactory.java:156)
09:59:47 	at org.apache.maven.surefire.booter.ProviderFactory.invokeProvider(ProviderFactory.java:82)
09:59:47 	at org.eclipse.tycho.surefire.osgibooter.OsgiSurefireBooter.run(OsgiSurefireBooter.java:95)
09:59:47 	at org.eclipse.tycho.surefire.osgibooter.HeadlessTestApplication.run(HeadlessTestApplication.java:21)
09:59:47 	at sun.reflect.NativeMethodAccessorImpl.invoke0(Native Method)
09:59:47 	at sun.reflect.NativeMethodAccessorImpl.invoke(NativeMethodAccessorImpl.java:62)
09:59:47 	at sun.reflect.DelegatingMethodAccessorImpl.invoke(DelegatingMethodAccessorImpl.java:43)
09:59:47 	at java.lang.reflect.Method.invoke(Method.java:498)
09:59:47 	at org.eclipse.equinox.internal.app.EclipseAppContainer.callMethodWithException(EclipseAppContainer.java:587)
09:59:47 	at org.eclipse.equinox.internal.app.EclipseAppHandle.run(EclipseAppHandle.java:198)
09:59:47 	at org.eclipse.core.runtime.internal.adaptor.EclipseAppLauncher.runApplication(EclipseAppLauncher.java:134)
09:59:47 	at org.eclipse.core.runtime.internal.adaptor.EclipseAppLauncher.start(EclipseAppLauncher.java:104)
09:59:47 	at org.eclipse.core.runtime.adaptor.EclipseStarter.run(EclipseStarter.java:388)
09:59:47 	at org.eclipse.core.runtime.adaptor.EclipseStarter.run(EclipseStarter.java:243)
09:59:47 	at sun.reflect.NativeMethodAccessorImpl.invoke0(Native Method)
09:59:47 	at sun.reflect.NativeMethodAccessorImpl.invoke(NativeMethodAccessorImpl.java:62)
09:59:47 	at sun.reflect.DelegatingMethodAccessorImpl.invoke(DelegatingMethodAccessorImpl.java:43)
09:59:47 	at java.lang.reflect.Method.invoke(Method.java:498)
09:59:47 	at org.eclipse.equinox.launcher.Main.invokeFramework(Main.java:653)
09:59:47 	at org.eclipse.equinox.launcher.Main.basicRun(Main.java:590)
09:59:47 	at org.eclipse.equinox.launcher.Main.run(Main.java:1499)
09:59:47 	at org.eclipse.equinox.launcher.Main.main(Main.java:1472)
09:59:47 
09:59:47 Running org.eclipse.egerrit.core.command.tests.SuggestReviewersCommandTest
09:59:47 Checking out http://104.154.18.211:28115/egerrit/test into /tmp/genie.egerrit/egerrit537467560374706866.tmp
09:59:48 org.eclipse.jgit.api.errors.TransportException: http://104.154.18.211:28115/egerrit/test: error occurred during unpacking on the remote end: error No space left on device
09:59:48 Tests run: 1, Failures: 1, Errors: 0, Skipped: 0, Time elapsed: 0.602 sec <<< FAILURE! - in org.eclipse.egerrit.core.command.tests.SuggestReviewersCommandTest
09:59:48 testCall(org.eclipse.egerrit.core.command.tests.SuggestReviewersCommandTest)  Time elapsed: 0.6 sec  <<< FAILURE!
09:59:48 java.lang.AssertionError: http://104.154.18.211:28115/egerrit/test: error occurred during unpacking on the remote end: error No space left on device
09:59:48 	at org.junit.Assert.fail(Assert.java:88)
09:59:48 	at org.eclipse.egerrit.core.command.tests.CommandTest.createReviewWithSimpleFile(CommandTest.java:111)
09:59:48 	at org.eclipse.egerrit.core.command.tests.CommandTestWithSimpleReview.createReview(CommandTestWithSimpleReview.java:19)
09:59:48 	at sun.reflect.GeneratedMethodAccessor9.invoke(Unknown Source)
09:59:48 	at sun.reflect.DelegatingMethodAccessorImpl.invoke(DelegatingMethodAccessorImpl.java:43)
09:59:48 	at java.lang.reflect.Method.invoke(Method.java:498)
09:59:48 	at org.junit.runners.model.FrameworkMethod$1.runReflectiveCall(FrameworkMethod.java:50)
09:59:48 	at org.junit.internal.runners.model.ReflectiveCallable.run(ReflectiveCallable.java:12)
09:59:48 	at org.junit.runners.model.FrameworkMethod.invokeExplosively(FrameworkMethod.java:47)
09:59:48 	at org.junit.internal.runners.statements.RunBefores.evaluate(RunBefores.java:24)
09:59:48 	at org.junit.internal.runners.statements.RunAfters.evaluate(RunAfters.java:27)
09:59:48 	at org.junit.runners.ParentRunner.runLeaf(ParentRunner.java:325)
09:59:48 	at org.junit.runners.BlockJUnit4ClassRunner.runChild(BlockJUnit4ClassRunner.java:78)
09:59:48 	at org.junit.runners.BlockJUnit4ClassRunner.runChild(BlockJUnit4ClassRunner.java:57)
09:59:48 	at org.junit.runners.ParentRunner$3.run(ParentRunner.java:290)
09:59:48 	at org.junit.runners.ParentRunner$1.schedule(ParentRunner.java:71)
09:59:48 	at org.junit.runners.ParentRunner.runChildren(ParentRunner.java:288)
09:59:48 	at org.junit.runners.ParentRunner.access$000(ParentRunner.java:58)
09:59:48 	at org.junit.runners.ParentRunner$2.evaluate(ParentRunner.java:268)
09:59:48 	at org.junit.runners.ParentRunner.run(ParentRunner.java:363)
09:59:48 	at org.apache.maven.surefire.junit4.JUnit4Provider.execute(JUnit4Provider.java:264)
09:59:48 	at org.apache.maven.surefire.junit4.JUnit4Provider.executeTestSet(JUnit4Provider.java:153)
09:59:48 	at org.apache.maven.surefire.junit4.JUnit4Provider.invoke(JUnit4Provider.java:124)
09:59:48 	at sun.reflect.NativeMethodAccessorImpl.invoke0(Native Method)
09:59:48 	at sun.reflect.NativeMethodAccessorImpl.invoke(NativeMethodAccessorImpl.java:62)
09:59:48 	at sun.reflect.DelegatingMethodAccessorImpl.invoke(DelegatingMethodAccessorImpl.java:43)
09:59:48 	at java.lang.reflect.Method.invoke(Method.java:498)
09:59:48 	at org.apache.maven.surefire.util.ReflectionUtils.invokeMethodWithArray2(ReflectionUtils.java:208)
09:59:48 	at org.apache.maven.surefire.booter.ProviderFactory$ProviderProxy.invoke(ProviderFactory.java:156)
09:59:48 	at org.apache.maven.surefire.booter.ProviderFactory.invokeProvider(ProviderFactory.java:82)
09:59:48 	at org.eclipse.tycho.surefire.osgibooter.OsgiSurefireBooter.run(OsgiSurefireBooter.java:95)
09:59:48 	at org.eclipse.tycho.surefire.osgibooter.HeadlessTestApplication.run(HeadlessTestApplication.java:21)
09:59:48 	at sun.reflect.NativeMethodAccessorImpl.invoke0(Native Method)
09:59:48 	at sun.reflect.NativeMethodAccessorImpl.invoke(NativeMethodAccessorImpl.java:62)
09:59:48 	at sun.reflect.DelegatingMethodAccessorImpl.invoke(DelegatingMethodAccessorImpl.java:43)
09:59:48 	at java.lang.reflect.Method.invoke(Method.java:498)
09:59:48 	at org.eclipse.equinox.internal.app.EclipseAppContainer.callMethodWithException(EclipseAppContainer.java:587)
09:59:48 	at org.eclipse.equinox.internal.app.EclipseAppHandle.run(EclipseAppHandle.java:198)
09:59:48 	at org.eclipse.core.runtime.internal.adaptor.EclipseAppLauncher.runApplication(EclipseAppLauncher.java:134)
09:59:48 	at org.eclipse.core.runtime.internal.adaptor.EclipseAppLauncher.start(EclipseAppLauncher.java:104)
09:59:48 	at org.eclipse.core.runtime.adaptor.EclipseStarter.run(EclipseStarter.java:388)
09:59:48 	at org.eclipse.core.runtime.adaptor.EclipseStarter.run(EclipseStarter.java:243)
09:59:48 	at sun.reflect.NativeMethodAccessorImpl.invoke0(Native Method)
09:59:48 	at sun.reflect.NativeMethodAccessorImpl.invoke(NativeMethodAccessorImpl.java:62)
09:59:48 	at sun.reflect.DelegatingMethodAccessorImpl.invoke(DelegatingMethodAccessorImpl.java:43)
09:59:48 	at java.lang.reflect.Method.invoke(Method.java:498)
09:59:48 	at org.eclipse.equinox.launcher.Main.invokeFramework(Main.java:653)
09:59:48 	at org.eclipse.equinox.launcher.Main.basicRun(Main.java:590)
09:59:48 	at org.eclipse.equinox.launcher.Main.run(Main.java:1499)
09:59:48 	at org.eclipse.equinox.launcher.Main.main(Main.java:1472)
09:59:48 
09:59:48 Running org.eclipse.egerrit.core.command.tests.DeleteTopicCommandTest
09:59:48 Checking out http://104.154.18.211:28115/egerrit/test into /tmp/genie.egerrit/egerrit6722518732964230054.tmp
09:59:49 org.eclipse.jgit.api.errors.TransportException: http://104.154.18.211:28115/egerrit/test: error occurred during unpacking on the remote end: error No space left on device
09:59:49 Tests run: 1, Failures: 1, Errors: 0, Skipped: 0, Time elapsed: 0.642 sec <<< FAILURE! - in org.eclipse.egerrit.core.command.tests.DeleteTopicCommandTest
09:59:49 testCall(org.eclipse.egerrit.core.command.tests.DeleteTopicCommandTest)  Time elapsed: 0.64 sec  <<< FAILURE!
09:59:49 java.lang.AssertionError: http://104.154.18.211:28115/egerrit/test: error occurred during unpacking on the remote end: error No space left on device
09:59:49 	at org.junit.Assert.fail(Assert.java:88)
09:59:49 	at org.eclipse.egerrit.core.command.tests.CommandTest.createReviewWithSimpleFile(CommandTest.java:111)
09:59:49 	at org.eclipse.egerrit.core.command.tests.CommandTestWithSimpleReview.createReview(CommandTestWithSimpleReview.java:19)
09:59:49 	at sun.reflect.GeneratedMethodAccessor9.invoke(Unknown Source)
09:59:49 	at sun.reflect.DelegatingMethodAccessorImpl.invoke(DelegatingMethodAccessorImpl.java:43)
09:59:49 	at java.lang.reflect.Method.invoke(Method.java:498)
09:59:49 	at org.junit.runners.model.FrameworkMethod$1.runReflectiveCall(FrameworkMethod.java:50)
09:59:49 	at org.junit.internal.runners.model.ReflectiveCallable.run(ReflectiveCallable.java:12)
09:59:49 	at org.junit.runners.model.FrameworkMethod.invokeExplosively(FrameworkMethod.java:47)
09:59:49 	at org.junit.internal.runners.statements.RunBefores.evaluate(RunBefores.java:24)
09:59:49 	at org.junit.internal.runners.statements.RunAfters.evaluate(RunAfters.java:27)
09:59:49 	at org.junit.runners.ParentRunner.runLeaf(ParentRunner.java:325)
09:59:49 	at org.junit.runners.BlockJUnit4ClassRunner.runChild(BlockJUnit4ClassRunner.java:78)
09:59:49 	at org.junit.runners.BlockJUnit4ClassRunner.runChild(BlockJUnit4ClassRunner.java:57)
09:59:49 	at org.junit.runners.ParentRunner$3.run(ParentRunner.java:290)
09:59:49 	at org.junit.runners.ParentRunner$1.schedule(ParentRunner.java:71)
09:59:49 	at org.junit.runners.ParentRunner.runChildren(ParentRunner.java:288)
09:59:49 	at org.junit.runners.ParentRunner.access$000(ParentRunner.java:58)
09:59:49 	at org.junit.runners.ParentRunner$2.evaluate(ParentRunner.java:268)
09:59:49 	at org.junit.runners.ParentRunner.run(ParentRunner.java:363)
09:59:49 	at org.apache.maven.surefire.junit4.JUnit4Provider.execute(JUnit4Provider.java:264)
09:59:49 	at org.apache.maven.surefire.junit4.JUnit4Provider.executeTestSet(JUnit4Provider.java:153)
09:59:49 	at org.apache.maven.surefire.junit4.JUnit4Provider.invoke(JUnit4Provider.java:124)
09:59:49 	at sun.reflect.NativeMethodAccessorImpl.invoke0(Native Method)
09:59:49 	at sun.reflect.NativeMethodAccessorImpl.invoke(NativeMethodAccessorImpl.java:62)
09:59:49 	at sun.reflect.DelegatingMethodAccessorImpl.invoke(DelegatingMethodAccessorImpl.java:43)
09:59:49 	at java.lang.reflect.Method.invoke(Method.java:498)
09:59:49 	at org.apache.maven.surefire.util.ReflectionUtils.invokeMethodWithArray2(ReflectionUtils.java:208)
09:59:49 	at org.apache.maven.surefire.booter.ProviderFactory$ProviderProxy.invoke(ProviderFactory.java:156)
09:59:49 	at org.apache.maven.surefire.booter.ProviderFactory.invokeProvider(ProviderFactory.java:82)
09:59:49 	at org.eclipse.tycho.surefire.osgibooter.OsgiSurefireBooter.run(OsgiSurefireBooter.java:95)
09:59:49 	at org.eclipse.tycho.surefire.osgibooter.HeadlessTestApplication.run(HeadlessTestApplication.java:21)
09:59:49 	at sun.reflect.NativeMethodAccessorImpl.invoke0(Native Method)
09:59:49 	at sun.reflect.NativeMethodAccessorImpl.invoke(NativeMethodAccessorImpl.java:62)
09:59:49 	at sun.reflect.DelegatingMethodAccessorImpl.invoke(DelegatingMethodAccessorImpl.java:43)
09:59:49 	at java.lang.reflect.Method.invoke(Method.java:498)
09:59:49 	at org.eclipse.equinox.internal.app.EclipseAppContainer.callMethodWithException(EclipseAppContainer.java:587)
09:59:49 	at org.eclipse.equinox.internal.app.EclipseAppHandle.run(EclipseAppHandle.java:198)
09:59:49 	at org.eclipse.core.runtime.internal.adaptor.EclipseAppLauncher.runApplication(EclipseAppLauncher.java:134)
09:59:49 	at org.eclipse.core.runtime.internal.adaptor.EclipseAppLauncher.start(EclipseAppLauncher.java:104)
09:59:49 	at org.eclipse.core.runtime.adaptor.EclipseStarter.run(EclipseStarter.java:388)
09:59:49 	at org.eclipse.core.runtime.adaptor.EclipseStarter.run(EclipseStarter.java:243)
09:59:49 	at sun.reflect.NativeMethodAccessorImpl.invoke0(Native Method)
09:59:49 	at sun.reflect.NativeMethodAccessorImpl.invoke(NativeMethodAccessorImpl.java:62)
09:59:49 	at sun.reflect.DelegatingMethodAccessorImpl.invoke(DelegatingMethodAccessorImpl.java:43)
09:59:49 	at java.lang.reflect.Method.invoke(Method.java:498)
09:59:49 	at org.eclipse.equinox.launcher.Main.invokeFramework(Main.java:653)
09:59:49 	at org.eclipse.equinox.launcher.Main.basicRun(Main.java:590)
09:59:49 	at org.eclipse.equinox.launcher.Main.run(Main.java:1499)
09:59:49 	at org.eclipse.equinox.launcher.Main.main(Main.java:1472)
09:59:49 
09:59:49 Running org.eclipse.egerrit.core.command.tests.GetCommitMsgCommandTest
09:59:49 Checking out http://104.154.18.211:28115/egerrit/test into /tmp/genie.egerrit/egerrit811378315347387202.tmp
09:59:49 org.eclipse.jgit.api.errors.TransportException: http://104.154.18.211:28115/egerrit/test: error occurred during unpacking on the remote end: error No space left on device
09:59:49 Tests run: 1, Failures: 1, Errors: 0, Skipped: 0, Time elapsed: 0.66 sec <<< FAILURE! - in org.eclipse.egerrit.core.command.tests.GetCommitMsgCommandTest
09:59:49 testCall(org.eclipse.egerrit.core.command.tests.GetCommitMsgCommandTest)  Time elapsed: 0.658 sec  <<< FAILURE!
09:59:49 java.lang.AssertionError: http://104.154.18.211:28115/egerrit/test: error occurred during unpacking on the remote end: error No space left on device
09:59:49 	at org.junit.Assert.fail(Assert.java:88)
09:59:49 	at org.eclipse.egerrit.core.command.tests.CommandTest.createReviewWithSimpleFile(CommandTest.java:111)
09:59:49 	at org.eclipse.egerrit.core.command.tests.CommandTestWithSimpleReview.createReview(CommandTestWithSimpleReview.java:19)
09:59:49 	at sun.reflect.GeneratedMethodAccessor9.invoke(Unknown Source)
09:59:49 	at sun.reflect.DelegatingMethodAccessorImpl.invoke(DelegatingMethodAccessorImpl.java:43)
09:59:49 	at java.lang.reflect.Method.invoke(Method.java:498)
09:59:49 	at org.junit.runners.model.FrameworkMethod$1.runReflectiveCall(FrameworkMethod.java:50)
09:59:49 	at org.junit.internal.runners.model.ReflectiveCallable.run(ReflectiveCallable.java:12)
09:59:49 	at org.junit.runners.model.FrameworkMethod.invokeExplosively(FrameworkMethod.java:47)
09:59:49 	at org.junit.internal.runners.statements.RunBefores.evaluate(RunBefores.java:24)
09:59:49 	at org.junit.internal.runners.statements.RunAfters.evaluate(RunAfters.java:27)
09:59:49 	at org.junit.runners.ParentRunner.runLeaf(ParentRunner.java:325)
09:59:49 	at org.junit.runners.BlockJUnit4ClassRunner.runChild(BlockJUnit4ClassRunner.java:78)
09:59:49 	at org.junit.runners.BlockJUnit4ClassRunner.runChild(BlockJUnit4ClassRunner.java:57)
09:59:49 	at org.junit.runners.ParentRunner$3.run(ParentRunner.java:290)
09:59:49 	at org.junit.runners.ParentRunner$1.schedule(ParentRunner.java:71)
09:59:49 	at org.junit.runners.ParentRunner.runChildren(ParentRunner.java:288)
09:59:49 	at org.junit.runners.ParentRunner.access$000(ParentRunner.java:58)
09:59:49 	at org.junit.runners.ParentRunner$2.evaluate(ParentRunner.java:268)
09:59:49 	at org.junit.runners.ParentRunner.run(ParentRunner.java:363)
09:59:49 	at org.apache.maven.surefire.junit4.JUnit4Provider.execute(JUnit4Provider.java:264)
09:59:49 	at org.apache.maven.surefire.junit4.JUnit4Provider.executeTestSet(JUnit4Provider.java:153)
09:59:49 	at org.apache.maven.surefire.junit4.JUnit4Provider.invoke(JUnit4Provider.java:124)
09:59:49 	at sun.reflect.NativeMethodAccessorImpl.invoke0(Native Method)
09:59:49 	at sun.reflect.NativeMethodAccessorImpl.invoke(NativeMethodAccessorImpl.java:62)
09:59:49 	at sun.reflect.DelegatingMethodAccessorImpl.invoke(DelegatingMethodAccessorImpl.java:43)
09:59:49 	at java.lang.reflect.Method.invoke(Method.java:498)
09:59:49 	at org.apache.maven.surefire.util.ReflectionUtils.invokeMethodWithArray2(ReflectionUtils.java:208)
09:59:49 	at org.apache.maven.surefire.booter.ProviderFactory$ProviderProxy.invoke(ProviderFactory.java:156)
09:59:49 	at org.apache.maven.surefire.booter.ProviderFactory.invokeProvider(ProviderFactory.java:82)
09:59:49 	at org.eclipse.tycho.surefire.osgibooter.OsgiSurefireBooter.run(OsgiSurefireBooter.java:95)
09:59:49 	at org.eclipse.tycho.surefire.osgibooter.HeadlessTestApplication.run(HeadlessTestApplication.java:21)
09:59:49 	at sun.reflect.NativeMethodAccessorImpl.invoke0(Native Method)
09:59:49 	at sun.reflect.NativeMethodAccessorImpl.invoke(NativeMethodAccessorImpl.java:62)
09:59:49 	at sun.reflect.DelegatingMethodAccessorImpl.invoke(DelegatingMethodAccessorImpl.java:43)
09:59:49 	at java.lang.reflect.Method.invoke(Method.java:498)
09:59:49 	at org.eclipse.equinox.internal.app.EclipseAppContainer.callMethodWithException(EclipseAppContainer.java:587)
09:59:49 	at org.eclipse.equinox.internal.app.EclipseAppHandle.run(EclipseAppHandle.java:198)
09:59:49 	at org.eclipse.core.runtime.internal.adaptor.EclipseAppLauncher.runApplication(EclipseAppLauncher.java:134)
09:59:49 	at org.eclipse.core.runtime.internal.adaptor.EclipseAppLauncher.start(EclipseAppLauncher.java:104)
09:59:49 	at org.eclipse.core.runtime.adaptor.EclipseStarter.run(EclipseStarter.java:388)
09:59:49 	at org.eclipse.core.runtime.adaptor.EclipseStarter.run(EclipseStarter.java:243)
09:59:49 	at sun.reflect.NativeMethodAccessorImpl.invoke0(Native Method)
09:59:49 	at sun.reflect.NativeMethodAccessorImpl.invoke(NativeMethodAccessorImpl.java:62)
09:59:49 	at sun.reflect.DelegatingMethodAccessorImpl.invoke(DelegatingMethodAccessorImpl.java:43)
09:59:49 	at java.lang.reflect.Method.invoke(Method.java:498)
09:59:49 	at org.eclipse.equinox.launcher.Main.invokeFramework(Main.java:653)
09:59:49 	at org.eclipse.equinox.launcher.Main.basicRun(Main.java:590)
09:59:49 	at org.eclipse.equinox.launcher.Main.run(Main.java:1499)
09:59:49 	at org.eclipse.equinox.launcher.Main.main(Main.java:1472)
09:59:49 
09:59:49 Running org.eclipse.egerrit.core.command.tests.DeleteReviewedCommandTest
09:59:49 Checking out http://104.154.18.211:28115/egerrit/test into /tmp/genie.egerrit/egerrit993414970102688632.tmp
09:59:50 org.eclipse.jgit.api.errors.TransportException: http://104.154.18.211:28115/egerrit/test: error occurred during unpacking on the remote end: error No space left on device
09:59:50 Tests run: 1, Failures: 1, Errors: 0, Skipped: 0, Time elapsed: 0.75 sec <<< FAILURE! - in org.eclipse.egerrit.core.command.tests.DeleteReviewedCommandTest
09:59:50 testCall(org.eclipse.egerrit.core.command.tests.DeleteReviewedCommandTest)  Time elapsed: 0.749 sec  <<< FAILURE!
09:59:50 java.lang.AssertionError: http://104.154.18.211:28115/egerrit/test: error occurred during unpacking on the remote end: error No space left on device
09:59:50 	at org.junit.Assert.fail(Assert.java:88)
09:59:50 	at org.eclipse.egerrit.core.command.tests.CommandTest.createReviewWithSimpleFile(CommandTest.java:111)
09:59:50 	at org.eclipse.egerrit.core.command.tests.CommandTestWithSimpleReview.createReview(CommandTestWithSimpleReview.java:19)
09:59:50 	at sun.reflect.GeneratedMethodAccessor9.invoke(Unknown Source)
09:59:50 	at sun.reflect.DelegatingMethodAccessorImpl.invoke(DelegatingMethodAccessorImpl.java:43)
09:59:50 	at java.lang.reflect.Method.invoke(Method.java:498)
09:59:50 	at org.junit.runners.model.FrameworkMethod$1.runReflectiveCall(FrameworkMethod.java:50)
09:59:50 	at org.junit.internal.runners.model.ReflectiveCallable.run(ReflectiveCallable.java:12)
09:59:50 	at org.junit.runners.model.FrameworkMethod.invokeExplosively(FrameworkMethod.java:47)
09:59:50 	at org.junit.internal.runners.statements.RunBefores.evaluate(RunBefores.java:24)
09:59:50 	at org.junit.internal.runners.statements.RunAfters.evaluate(RunAfters.java:27)
09:59:50 	at org.junit.runners.ParentRunner.runLeaf(ParentRunner.java:325)
09:59:50 	at org.junit.runners.BlockJUnit4ClassRunner.runChild(BlockJUnit4ClassRunner.java:78)
09:59:50 	at org.junit.runners.BlockJUnit4ClassRunner.runChild(BlockJUnit4ClassRunner.java:57)
09:59:50 	at org.junit.runners.ParentRunner$3.run(ParentRunner.java:290)
09:59:50 	at org.junit.runners.ParentRunner$1.schedule(ParentRunner.java:71)
09:59:50 	at org.junit.runners.ParentRunner.runChildren(ParentRunner.java:288)
09:59:50 	at org.junit.runners.ParentRunner.access$000(ParentRunner.java:58)
09:59:50 	at org.junit.runners.ParentRunner$2.evaluate(ParentRunner.java:268)
09:59:50 	at org.junit.runners.ParentRunner.run(ParentRunner.java:363)
09:59:50 	at org.apache.maven.surefire.junit4.JUnit4Provider.execute(JUnit4Provider.java:264)
09:59:50 	at org.apache.maven.surefire.junit4.JUnit4Provider.executeTestSet(JUnit4Provider.java:153)
09:59:50 	at org.apache.maven.surefire.junit4.JUnit4Provider.invoke(JUnit4Provider.java:124)
09:59:50 	at sun.reflect.NativeMethodAccessorImpl.invoke0(Native Method)
09:59:50 	at sun.reflect.NativeMethodAccessorImpl.invoke(NativeMethodAccessorImpl.java:62)
09:59:50 	at sun.reflect.DelegatingMethodAccessorImpl.invoke(DelegatingMethodAccessorImpl.java:43)
09:59:50 	at java.lang.reflect.Method.invoke(Method.java:498)
09:59:50 	at org.apache.maven.surefire.util.ReflectionUtils.invokeMethodWithArray2(ReflectionUtils.java:208)
09:59:50 	at org.apache.maven.surefire.booter.ProviderFactory$ProviderProxy.invoke(ProviderFactory.java:156)
09:59:50 	at org.apache.maven.surefire.booter.ProviderFactory.invokeProvider(ProviderFactory.java:82)
09:59:50 	at org.eclipse.tycho.surefire.osgibooter.OsgiSurefireBooter.run(OsgiSurefireBooter.java:95)
09:59:50 	at org.eclipse.tycho.surefire.osgibooter.HeadlessTestApplication.run(HeadlessTestApplication.java:21)
09:59:50 	at sun.reflect.NativeMethodAccessorImpl.invoke0(Native Method)
09:59:50 	at sun.reflect.NativeMethodAccessorImpl.invoke(NativeMethodAccessorImpl.java:62)
09:59:50 	at sun.reflect.DelegatingMethodAccessorImpl.invoke(DelegatingMethodAccessorImpl.java:43)
09:59:50 	at java.lang.reflect.Method.invoke(Method.java:498)
09:59:50 	at org.eclipse.equinox.internal.app.EclipseAppContainer.callMethodWithException(EclipseAppContainer.java:587)
09:59:50 	at org.eclipse.equinox.internal.app.EclipseAppHandle.run(EclipseAppHandle.java:198)
09:59:50 	at org.eclipse.core.runtime.internal.adaptor.EclipseAppLauncher.runApplication(EclipseAppLauncher.java:134)
09:59:50 	at org.eclipse.core.runtime.internal.adaptor.EclipseAppLauncher.start(EclipseAppLauncher.java:104)
09:59:50 	at org.eclipse.core.runtime.adaptor.EclipseStarter.run(EclipseStarter.java:388)
09:59:50 	at org.eclipse.core.runtime.adaptor.EclipseStarter.run(EclipseStarter.java:243)
09:59:50 	at sun.reflect.NativeMethodAccessorImpl.invoke0(Native Method)
09:59:50 	at sun.reflect.NativeMethodAccessorImpl.invoke(NativeMethodAccessorImpl.java:62)
09:59:50 	at sun.reflect.DelegatingMethodAccessorImpl.invoke(DelegatingMethodAccessorImpl.java:43)
09:59:50 	at java.lang.reflect.Method.invoke(Method.java:498)
09:59:50 	at org.eclipse.equinox.launcher.Main.invokeFramework(Main.java:653)
09:59:50 	at org.eclipse.equinox.launcher.Main.basicRun(Main.java:590)
09:59:50 	at org.eclipse.equinox.launcher.Main.run(Main.java:1499)
09:59:50 	at org.eclipse.equinox.launcher.Main.main(Main.java:1472)
09:59:50 
09:59:50 Running org.eclipse.egerrit.core.command.tests.ListDraftsCommandTest
09:59:50 Checking out http://104.154.18.211:28115/egerrit/test into /tmp/genie.egerrit/egerrit1997347477341946703.tmp
09:59:51 org.eclipse.jgit.api.errors.TransportException: http://104.154.18.211:28115/egerrit/test: error occurred during unpacking on the remote end: error No space left on device
09:59:51 Tests run: 1, Failures: 1, Errors: 0, Skipped: 0, Time elapsed: 0.703 sec <<< FAILURE! - in org.eclipse.egerrit.core.command.tests.ListDraftsCommandTest
09:59:51 testCall(org.eclipse.egerrit.core.command.tests.ListDraftsCommandTest)  Time elapsed: 0.701 sec  <<< FAILURE!
09:59:51 java.lang.AssertionError: http://104.154.18.211:28115/egerrit/test: error occurred during unpacking on the remote end: error No space left on device
09:59:51 	at org.junit.Assert.fail(Assert.java:88)
09:59:51 	at org.eclipse.egerrit.core.command.tests.CommandTest.createReviewWithSimpleFile(CommandTest.java:111)
09:59:51 	at org.eclipse.egerrit.core.command.tests.CommandTestWithSimpleReview.createReview(CommandTestWithSimpleReview.java:19)
09:59:51 	at sun.reflect.GeneratedMethodAccessor9.invoke(Unknown Source)
09:59:51 	at sun.reflect.DelegatingMethodAccessorImpl.invoke(DelegatingMethodAccessorImpl.java:43)
09:59:51 	at java.lang.reflect.Method.invoke(Method.java:498)
09:59:51 	at org.junit.runners.model.FrameworkMethod$1.runReflectiveCall(FrameworkMethod.java:50)
09:59:51 	at org.junit.internal.runners.model.ReflectiveCallable.run(ReflectiveCallable.java:12)
09:59:51 	at org.junit.runners.model.FrameworkMethod.invokeExplosively(FrameworkMethod.java:47)
09:59:51 	at org.junit.internal.runners.statements.RunBefores.evaluate(RunBefores.java:24)
09:59:51 	at org.junit.internal.runners.statements.RunAfters.evaluate(RunAfters.java:27)
09:59:51 	at org.junit.runners.ParentRunner.runLeaf(ParentRunner.java:325)
09:59:51 	at org.junit.runners.BlockJUnit4ClassRunner.runChild(BlockJUnit4ClassRunner.java:78)
09:59:51 	at org.junit.runners.BlockJUnit4ClassRunner.runChild(BlockJUnit4ClassRunner.java:57)
09:59:51 	at org.junit.runners.ParentRunner$3.run(ParentRunner.java:290)
09:59:51 	at org.junit.runners.ParentRunner$1.schedule(ParentRunner.java:71)
09:59:51 	at org.junit.runners.ParentRunner.runChildren(ParentRunner.java:288)
09:59:51 	at org.junit.runners.ParentRunner.access$000(ParentRunner.java:58)
09:59:51 	at org.junit.runners.ParentRunner$2.evaluate(ParentRunner.java:268)
09:59:51 	at org.junit.runners.ParentRunner.run(ParentRunner.java:363)
09:59:51 	at org.apache.maven.surefire.junit4.JUnit4Provider.execute(JUnit4Provider.java:264)
09:59:51 	at org.apache.maven.surefire.junit4.JUnit4Provider.executeTestSet(JUnit4Provider.java:153)
09:59:51 	at org.apache.maven.surefire.junit4.JUnit4Provider.invoke(JUnit4Provider.java:124)
09:59:51 	at sun.reflect.NativeMethodAccessorImpl.invoke0(Native Method)
09:59:51 	at sun.reflect.NativeMethodAccessorImpl.invoke(NativeMethodAccessorImpl.java:62)
09:59:51 	at sun.reflect.DelegatingMethodAccessorImpl.invoke(DelegatingMethodAccessorImpl.java:43)
09:59:51 	at java.lang.reflect.Method.invoke(Method.java:498)
09:59:51 	at org.apache.maven.surefire.util.ReflectionUtils.invokeMethodWithArray2(ReflectionUtils.java:208)
09:59:51 	at org.apache.maven.surefire.booter.ProviderFactory$ProviderProxy.invoke(ProviderFactory.java:156)
09:59:51 	at org.apache.maven.surefire.booter.ProviderFactory.invokeProvider(ProviderFactory.java:82)
09:59:51 	at org.eclipse.tycho.surefire.osgibooter.OsgiSurefireBooter.run(OsgiSurefireBooter.java:95)
09:59:51 	at org.eclipse.tycho.surefire.osgibooter.HeadlessTestApplication.run(HeadlessTestApplication.java:21)
09:59:51 	at sun.reflect.NativeMethodAccessorImpl.invoke0(Native Method)
09:59:51 	at sun.reflect.NativeMethodAccessorImpl.invoke(NativeMethodAccessorImpl.java:62)
09:59:51 	at sun.reflect.DelegatingMethodAccessorImpl.invoke(DelegatingMethodAccessorImpl.java:43)
09:59:51 	at java.lang.reflect.Method.invoke(Method.java:498)
09:59:51 	at org.eclipse.equinox.internal.app.EclipseAppContainer.callMethodWithException(EclipseAppContainer.java:587)
09:59:51 	at org.eclipse.equinox.internal.app.EclipseAppHandle.run(EclipseAppHandle.java:198)
09:59:51 	at org.eclipse.core.runtime.internal.adaptor.EclipseAppLauncher.runApplication(EclipseAppLauncher.java:134)
09:59:51 	at org.eclipse.core.runtime.internal.adaptor.EclipseAppLauncher.start(EclipseAppLauncher.java:104)
09:59:51 	at org.eclipse.core.runtime.adaptor.EclipseStarter.run(EclipseStarter.java:388)
09:59:51 	at org.eclipse.core.runtime.adaptor.EclipseStarter.run(EclipseStarter.java:243)
09:59:51 	at sun.reflect.NativeMethodAccessorImpl.invoke0(Native Method)
09:59:51 	at sun.reflect.NativeMethodAccessorImpl.invoke(NativeMethodAccessorImpl.java:62)
09:59:51 	at sun.reflect.DelegatingMethodAccessorImpl.invoke(DelegatingMethodAccessorImpl.java:43)
09:59:51 	at java.lang.reflect.Method.invoke(Method.java:498)
09:59:51 	at org.eclipse.equinox.launcher.Main.invokeFramework(Main.java:653)
09:59:51 	at org.eclipse.equinox.launcher.Main.basicRun(Main.java:590)
09:59:51 	at org.eclipse.equinox.launcher.Main.run(Main.java:1499)
09:59:51 	at org.eclipse.equinox.launcher.Main.main(Main.java:1472)
09:59:51 
09:59:51 Running org.eclipse.egerrit.core.command.tests.GetModifiedFilesCommandTest
09:59:51 Checking out http://104.154.18.211:28115/egerrit/test into /tmp/genie.egerrit/egerrit4169858621457471962.tmp
09:59:51 org.eclipse.jgit.api.errors.TransportException: http://104.154.18.211:28115/egerrit/test: error occurred during unpacking on the remote end: error No space left on device
09:59:51 Tests run: 1, Failures: 1, Errors: 0, Skipped: 0, Time elapsed: 0.762 sec <<< FAILURE! - in org.eclipse.egerrit.core.command.tests.GetModifiedFilesCommandTest
09:59:51 testCommand(org.eclipse.egerrit.core.command.tests.GetModifiedFilesCommandTest)  Time elapsed: 0.761 sec  <<< FAILURE!
09:59:51 java.lang.AssertionError: http://104.154.18.211:28115/egerrit/test: error occurred during unpacking on the remote end: error No space left on device
09:59:51 	at org.junit.Assert.fail(Assert.java:88)
09:59:51 	at org.eclipse.egerrit.core.command.tests.CommandTest.createReviewWithSimpleFile(CommandTest.java:111)
09:59:51 	at org.eclipse.egerrit.core.command.tests.CommandTestWithSimpleReview.createReview(CommandTestWithSimpleReview.java:19)
09:59:51 	at sun.reflect.GeneratedMethodAccessor9.invoke(Unknown Source)
09:59:51 	at sun.reflect.DelegatingMethodAccessorImpl.invoke(DelegatingMethodAccessorImpl.java:43)
09:59:51 	at java.lang.reflect.Method.invoke(Method.java:498)
09:59:51 	at org.junit.runners.model.FrameworkMethod$1.runReflectiveCall(FrameworkMethod.java:50)
09:59:51 	at org.junit.internal.runners.model.ReflectiveCallable.run(ReflectiveCallable.java:12)
09:59:51 	at org.junit.runners.model.FrameworkMethod.invokeExplosively(FrameworkMethod.java:47)
09:59:51 	at org.junit.internal.runners.statements.RunBefores.evaluate(RunBefores.java:24)
09:59:51 	at org.junit.internal.runners.statements.RunAfters.evaluate(RunAfters.java:27)
09:59:51 	at org.junit.runners.ParentRunner.runLeaf(ParentRunner.java:325)
09:59:51 	at org.junit.runners.BlockJUnit4ClassRunner.runChild(BlockJUnit4ClassRunner.java:78)
09:59:51 	at org.junit.runners.BlockJUnit4ClassRunner.runChild(BlockJUnit4ClassRunner.java:57)
09:59:51 	at org.junit.runners.ParentRunner$3.run(ParentRunner.java:290)
09:59:51 	at org.junit.runners.ParentRunner$1.schedule(ParentRunner.java:71)
09:59:51 	at org.junit.runners.ParentRunner.runChildren(ParentRunner.java:288)
09:59:51 	at org.junit.runners.ParentRunner.access$000(ParentRunner.java:58)
09:59:51 	at org.junit.runners.ParentRunner$2.evaluate(ParentRunner.java:268)
09:59:51 	at org.junit.runners.ParentRunner.run(ParentRunner.java:363)
09:59:51 	at org.apache.maven.surefire.junit4.JUnit4Provider.execute(JUnit4Provider.java:264)
09:59:51 	at org.apache.maven.surefire.junit4.JUnit4Provider.executeTestSet(JUnit4Provider.java:153)
09:59:51 	at org.apache.maven.surefire.junit4.JUnit4Provider.invoke(JUnit4Provider.java:124)
09:59:51 	at sun.reflect.NativeMethodAccessorImpl.invoke0(Native Method)
09:59:51 	at sun.reflect.NativeMethodAccessorImpl.invoke(NativeMethodAccessorImpl.java:62)
09:59:51 	at sun.reflect.DelegatingMethodAccessorImpl.invoke(DelegatingMethodAccessorImpl.java:43)
09:59:51 	at java.lang.reflect.Method.invoke(Method.java:498)
09:59:51 	at org.apache.maven.surefire.util.ReflectionUtils.invokeMethodWithArray2(ReflectionUtils.java:208)
09:59:51 	at org.apache.maven.surefire.booter.ProviderFactory$ProviderProxy.invoke(ProviderFactory.java:156)
09:59:51 	at org.apache.maven.surefire.booter.ProviderFactory.invokeProvider(ProviderFactory.java:82)
09:59:51 	at org.eclipse.tycho.surefire.osgibooter.OsgiSurefireBooter.run(OsgiSurefireBooter.java:95)
09:59:51 	at org.eclipse.tycho.surefire.osgibooter.HeadlessTestApplication.run(HeadlessTestApplication.java:21)
09:59:51 	at sun.reflect.NativeMethodAccessorImpl.invoke0(Native Method)
09:59:51 	at sun.reflect.NativeMethodAccessorImpl.invoke(NativeMethodAccessorImpl.java:62)
09:59:51 	at sun.reflect.DelegatingMethodAccessorImpl.invoke(DelegatingMethodAccessorImpl.java:43)
09:59:51 	at java.lang.reflect.Method.invoke(Method.java:498)
09:59:51 	at org.eclipse.equinox.internal.app.EclipseAppContainer.callMethodWithException(EclipseAppContainer.java:587)
09:59:51 	at org.eclipse.equinox.internal.app.EclipseAppHandle.run(EclipseAppHandle.java:198)
09:59:51 	at org.eclipse.core.runtime.internal.adaptor.EclipseAppLauncher.runApplication(EclipseAppLauncher.java:134)
09:59:51 	at org.eclipse.core.runtime.internal.adaptor.EclipseAppLauncher.start(EclipseAppLauncher.java:104)
09:59:51 	at org.eclipse.core.runtime.adaptor.EclipseStarter.run(EclipseStarter.java:388)
09:59:51 	at org.eclipse.core.runtime.adaptor.EclipseStarter.run(EclipseStarter.java:243)
09:59:51 	at sun.reflect.NativeMethodAccessorImpl.invoke0(Native Method)
09:59:51 	at sun.reflect.NativeMethodAccessorImpl.invoke(NativeMethodAccessorImpl.java:62)
09:59:51 	at sun.reflect.DelegatingMethodAccessorImpl.invoke(DelegatingMethodAccessorImpl.java:43)
09:59:51 	at java.lang.reflect.Method.invoke(Method.java:498)
09:59:51 	at org.eclipse.equinox.launcher.Main.invokeFramework(Main.java:653)
09:59:51 	at org.eclipse.equinox.launcher.Main.basicRun(Main.java:590)
09:59:51 	at org.eclipse.equinox.launcher.Main.run(Main.java:1499)
09:59:51 	at org.eclipse.equinox.launcher.Main.main(Main.java:1472)
09:59:51 
09:59:51 Running org.eclipse.egerrit.core.command.tests.SetReviewedCommandTest
09:59:51 Checking out http://104.154.18.211:28115/egerrit/test into /tmp/genie.egerrit/egerrit38842781894721978.tmp
09:59:52 org.eclipse.jgit.api.errors.TransportException: http://104.154.18.211:28115/egerrit/test: error occurred during unpacking on the remote end: error No space left on device
09:59:52 Tests run: 1, Failures: 1, Errors: 0, Skipped: 0, Time elapsed: 0.599 sec <<< FAILURE! - in org.eclipse.egerrit.core.command.tests.SetReviewedCommandTest
09:59:52 testCall(org.eclipse.egerrit.core.command.tests.SetReviewedCommandTest)  Time elapsed: 0.599 sec  <<< FAILURE!
09:59:52 java.lang.AssertionError: http://104.154.18.211:28115/egerrit/test: error occurred during unpacking on the remote end: error No space left on device
09:59:52 	at org.junit.Assert.fail(Assert.java:88)
09:59:52 	at org.eclipse.egerrit.core.command.tests.CommandTest.createReviewWithSimpleFile(CommandTest.java:111)
09:59:52 	at org.eclipse.egerrit.core.command.tests.CommandTestWithSimpleReview.createReview(CommandTestWithSimpleReview.java:19)
09:59:52 	at sun.reflect.GeneratedMethodAccessor9.invoke(Unknown Source)
09:59:52 	at sun.reflect.DelegatingMethodAccessorImpl.invoke(DelegatingMethodAccessorImpl.java:43)
09:59:52 	at java.lang.reflect.Method.invoke(Method.java:498)
09:59:52 	at org.junit.runners.model.FrameworkMethod$1.runReflectiveCall(FrameworkMethod.java:50)
09:59:52 	at org.junit.internal.runners.model.ReflectiveCallable.run(ReflectiveCallable.java:12)
09:59:52 	at org.junit.runners.model.FrameworkMethod.invokeExplosively(FrameworkMethod.java:47)
09:59:52 	at org.junit.internal.runners.statements.RunBefores.evaluate(RunBefores.java:24)
09:59:52 	at org.junit.internal.runners.statements.RunAfters.evaluate(RunAfters.java:27)
09:59:52 	at org.junit.runners.ParentRunner.runLeaf(ParentRunner.java:325)
09:59:52 	at org.junit.runners.BlockJUnit4ClassRunner.runChild(BlockJUnit4ClassRunner.java:78)
09:59:52 	at org.junit.runners.BlockJUnit4ClassRunner.runChild(BlockJUnit4ClassRunner.java:57)
09:59:52 	at org.junit.runners.ParentRunner$3.run(ParentRunner.java:290)
09:59:52 	at org.junit.runners.ParentRunner$1.schedule(ParentRunner.java:71)
09:59:52 	at org.junit.runners.ParentRunner.runChildren(ParentRunner.java:288)
09:59:52 	at org.junit.runners.ParentRunner.access$000(ParentRunner.java:58)
09:59:52 	at org.junit.runners.ParentRunner$2.evaluate(ParentRunner.java:268)
09:59:52 	at org.junit.runners.ParentRunner.run(ParentRunner.java:363)
09:59:52 	at org.apache.maven.surefire.junit4.JUnit4Provider.execute(JUnit4Provider.java:264)
09:59:52 	at org.apache.maven.surefire.junit4.JUnit4Provider.executeTestSet(JUnit4Provider.java:153)
09:59:52 	at org.apache.maven.surefire.junit4.JUnit4Provider.invoke(JUnit4Provider.java:124)
09:59:52 	at sun.reflect.NativeMethodAccessorImpl.invoke0(Native Method)
09:59:52 	at sun.reflect.NativeMethodAccessorImpl.invoke(NativeMethodAccessorImpl.java:62)
09:59:52 	at sun.reflect.DelegatingMethodAccessorImpl.invoke(DelegatingMethodAccessorImpl.java:43)
09:59:52 	at java.lang.reflect.Method.invoke(Method.java:498)
09:59:52 	at org.apache.maven.surefire.util.ReflectionUtils.invokeMethodWithArray2(ReflectionUtils.java:208)
09:59:52 	at org.apache.maven.surefire.booter.ProviderFactory$ProviderProxy.invoke(ProviderFactory.java:156)
09:59:52 	at org.apache.maven.surefire.booter.ProviderFactory.invokeProvider(ProviderFactory.java:82)
09:59:52 	at org.eclipse.tycho.surefire.osgibooter.OsgiSurefireBooter.run(OsgiSurefireBooter.java:95)
09:59:52 	at org.eclipse.tycho.surefire.osgibooter.HeadlessTestApplication.run(HeadlessTestApplication.java:21)
09:59:52 	at sun.reflect.NativeMethodAccessorImpl.invoke0(Native Method)
09:59:52 	at sun.reflect.NativeMethodAccessorImpl.invoke(NativeMethodAccessorImpl.java:62)
09:59:52 	at sun.reflect.DelegatingMethodAccessorImpl.invoke(DelegatingMethodAccessorImpl.java:43)
09:59:52 	at java.lang.reflect.Method.invoke(Method.java:498)
09:59:52 	at org.eclipse.equinox.internal.app.EclipseAppContainer.callMethodWithException(EclipseAppContainer.java:587)
09:59:52 	at org.eclipse.equinox.internal.app.EclipseAppHandle.run(EclipseAppHandle.java:198)
09:59:52 	at org.eclipse.core.runtime.internal.adaptor.EclipseAppLauncher.runApplication(EclipseAppLauncher.java:134)
09:59:52 	at org.eclipse.core.runtime.internal.adaptor.EclipseAppLauncher.start(EclipseAppLauncher.java:104)
09:59:52 	at org.eclipse.core.runtime.adaptor.EclipseStarter.run(EclipseStarter.java:388)
09:59:52 	at org.eclipse.core.runtime.adaptor.EclipseStarter.run(EclipseStarter.java:243)
09:59:52 	at sun.reflect.NativeMethodAccessorImpl.invoke0(Native Method)
09:59:52 	at sun.reflect.NativeMethodAccessorImpl.invoke(NativeMethodAccessorImpl.java:62)
09:59:52 	at sun.reflect.DelegatingMethodAccessorImpl.invoke(DelegatingMethodAccessorImpl.java:43)
09:59:52 	at java.lang.reflect.Method.invoke(Method.java:498)
09:59:52 	at org.eclipse.equinox.launcher.Main.invokeFramework(Main.java:653)
09:59:52 	at org.eclipse.equinox.launcher.Main.basicRun(Main.java:590)
09:59:52 	at org.eclipse.equinox.launcher.Main.run(Main.java:1499)
09:59:52 	at org.eclipse.equinox.launcher.Main.main(Main.java:1472)
09:59:52 
09:59:52 Running org.eclipse.egerrit.core.command.tests.DeleteReviewerCommandTest
09:59:52 Checking out http://104.154.18.211:28115/egerrit/test into /tmp/genie.egerrit/egerrit7717759441581676826.tmp
09:59:53 org.eclipse.jgit.api.errors.TransportException: http://104.154.18.211:28115/egerrit/test: error occurred during unpacking on the remote end: error No space left on device
09:59:53 Tests run: 1, Failures: 1, Errors: 0, Skipped: 0, Time elapsed: 0.671 sec <<< FAILURE! - in org.eclipse.egerrit.core.command.tests.DeleteReviewerCommandTest
09:59:53 testCall(org.eclipse.egerrit.core.command.tests.DeleteReviewerCommandTest)  Time elapsed: 0.67 sec  <<< FAILURE!
09:59:53 java.lang.AssertionError: http://104.154.18.211:28115/egerrit/test: error occurred during unpacking on the remote end: error No space left on device
09:59:53 	at org.junit.Assert.fail(Assert.java:88)
09:59:53 	at org.eclipse.egerrit.core.command.tests.CommandTest.createReviewWithSimpleFile(CommandTest.java:111)
09:59:53 	at org.eclipse.egerrit.core.command.tests.CommandTestWithSimpleReview.createReview(CommandTestWithSimpleReview.java:19)
09:59:53 	at sun.reflect.GeneratedMethodAccessor9.invoke(Unknown Source)
09:59:53 	at sun.reflect.DelegatingMethodAccessorImpl.invoke(DelegatingMethodAccessorImpl.java:43)
09:59:53 	at java.lang.reflect.Method.invoke(Method.java:498)
09:59:53 	at org.junit.runners.model.FrameworkMethod$1.runReflectiveCall(FrameworkMethod.java:50)
09:59:53 	at org.junit.internal.runners.model.ReflectiveCallable.run(ReflectiveCallable.java:12)
09:59:53 	at org.junit.runners.model.FrameworkMethod.invokeExplosively(FrameworkMethod.java:47)
09:59:53 	at org.junit.internal.runners.statements.RunBefores.evaluate(RunBefores.java:24)
09:59:53 	at org.junit.internal.runners.statements.RunAfters.evaluate(RunAfters.java:27)
09:59:53 	at org.junit.runners.ParentRunner.runLeaf(ParentRunner.java:325)
09:59:53 	at org.junit.runners.BlockJUnit4ClassRunner.runChild(BlockJUnit4ClassRunner.java:78)
09:59:53 	at org.junit.runners.BlockJUnit4ClassRunner.runChild(BlockJUnit4ClassRunner.java:57)
09:59:53 	at org.junit.runners.ParentRunner$3.run(ParentRunner.java:290)
09:59:53 	at org.junit.runners.ParentRunner$1.schedule(ParentRunner.java:71)
09:59:53 	at org.junit.runners.ParentRunner.runChildren(ParentRunner.java:288)
09:59:53 	at org.junit.runners.ParentRunner.access$000(ParentRunner.java:58)
09:59:53 	at org.junit.runners.ParentRunner$2.evaluate(ParentRunner.java:268)
09:59:53 	at org.junit.runners.ParentRunner.run(ParentRunner.java:363)
09:59:53 	at org.apache.maven.surefire.junit4.JUnit4Provider.execute(JUnit4Provider.java:264)
09:59:53 	at org.apache.maven.surefire.junit4.JUnit4Provider.executeTestSet(JUnit4Provider.java:153)
09:59:53 	at org.apache.maven.surefire.junit4.JUnit4Provider.invoke(JUnit4Provider.java:124)
09:59:53 	at sun.reflect.NativeMethodAccessorImpl.invoke0(Native Method)
09:59:53 	at sun.reflect.NativeMethodAccessorImpl.invoke(NativeMethodAccessorImpl.java:62)
09:59:53 	at sun.reflect.DelegatingMethodAccessorImpl.invoke(DelegatingMethodAccessorImpl.java:43)
09:59:53 	at java.lang.reflect.Method.invoke(Method.java:498)
09:59:53 	at org.apache.maven.surefire.util.ReflectionUtils.invokeMethodWithArray2(ReflectionUtils.java:208)
09:59:53 	at org.apache.maven.surefire.booter.ProviderFactory$ProviderProxy.invoke(ProviderFactory.java:156)
09:59:53 	at org.apache.maven.surefire.booter.ProviderFactory.invokeProvider(ProviderFactory.java:82)
09:59:53 	at org.eclipse.tycho.surefire.osgibooter.OsgiSurefireBooter.run(OsgiSurefireBooter.java:95)
09:59:53 	at org.eclipse.tycho.surefire.osgibooter.HeadlessTestApplication.run(HeadlessTestApplication.java:21)
09:59:53 	at sun.reflect.NativeMethodAccessorImpl.invoke0(Native Method)
09:59:53 	at sun.reflect.NativeMethodAccessorImpl.invoke(NativeMethodAccessorImpl.java:62)
09:59:53 	at sun.reflect.DelegatingMethodAccessorImpl.invoke(DelegatingMethodAccessorImpl.java:43)
09:59:53 	at java.lang.reflect.Method.invoke(Method.java:498)
09:59:53 	at org.eclipse.equinox.internal.app.EclipseAppContainer.callMethodWithException(EclipseAppContainer.java:587)
09:59:53 	at org.eclipse.equinox.internal.app.EclipseAppHandle.run(EclipseAppHandle.java:198)
09:59:53 	at org.eclipse.core.runtime.internal.adaptor.EclipseAppLauncher.runApplication(EclipseAppLauncher.java:134)
09:59:53 	at org.eclipse.core.runtime.internal.adaptor.EclipseAppLauncher.start(EclipseAppLauncher.java:104)
09:59:53 	at org.eclipse.core.runtime.adaptor.EclipseStarter.run(EclipseStarter.java:388)
09:59:53 	at org.eclipse.core.runtime.adaptor.EclipseStarter.run(EclipseStarter.java:243)
09:59:53 	at sun.reflect.NativeMethodAccessorImpl.invoke0(Native Method)
09:59:53 	at sun.reflect.NativeMethodAccessorImpl.invoke(NativeMethodAccessorImpl.java:62)
09:59:53 	at sun.reflect.DelegatingMethodAccessorImpl.invoke(DelegatingMethodAccessorImpl.java:43)
09:59:53 	at java.lang.reflect.Method.invoke(Method.java:498)
09:59:53 	at org.eclipse.equinox.launcher.Main.invokeFramework(Main.java:653)
09:59:53 	at org.eclipse.equinox.launcher.Main.basicRun(Main.java:590)
09:59:53 	at org.eclipse.equinox.launcher.Main.run(Main.java:1499)
09:59:53 	at org.eclipse.equinox.launcher.Main.main(Main.java:1472)
09:59:53 
09:59:53 Running org.eclipse.egerrit.core.command.tests.UpdateDraftCommandTest
09:59:53 Checking out http://104.154.18.211:28115/egerrit/test into /tmp/genie.egerrit/egerrit2088136157518036713.tmp
09:59:53 org.eclipse.jgit.api.errors.TransportException: http://104.154.18.211:28115/egerrit/test: error occurred during unpacking on the remote end: error No space left on device
09:59:53 Checking out http://104.154.18.211:28115/egerrit/test into /tmp/genie.egerrit/egerrit4551204973772174393.tmp
09:59:54 org.eclipse.jgit.api.errors.TransportException: http://104.154.18.211:28115/egerrit/test: error occurred during unpacking on the remote end: error No space left on device
09:59:54 Tests run: 2, Failures: 2, Errors: 0, Skipped: 0, Time elapsed: 1.422 sec <<< FAILURE! - in org.eclipse.egerrit.core.command.tests.UpdateDraftCommandTest
09:59:54 testCall(org.eclipse.egerrit.core.command.tests.UpdateDraftCommandTest)  Time elapsed: 0.716 sec  <<< FAILURE!
09:59:54 java.lang.AssertionError: http://104.154.18.211:28115/egerrit/test: error occurred during unpacking on the remote end: error No space left on device
09:59:54 	at org.junit.Assert.fail(Assert.java:88)
09:59:54 	at org.eclipse.egerrit.core.command.tests.CommandTest.createReviewWithSimpleFile(CommandTest.java:111)
09:59:54 	at org.eclipse.egerrit.core.command.tests.CommandTestWithSimpleReview.createReview(CommandTestWithSimpleReview.java:19)
09:59:54 	at sun.reflect.GeneratedMethodAccessor9.invoke(Unknown Source)
09:59:54 	at sun.reflect.DelegatingMethodAccessorImpl.invoke(DelegatingMethodAccessorImpl.java:43)
09:59:54 	at java.lang.reflect.Method.invoke(Method.java:498)
09:59:54 	at org.junit.runners.model.FrameworkMethod$1.runReflectiveCall(FrameworkMethod.java:50)
09:59:54 	at org.junit.internal.runners.model.ReflectiveCallable.run(ReflectiveCallable.java:12)
09:59:54 	at org.junit.runners.model.FrameworkMethod.invokeExplosively(FrameworkMethod.java:47)
09:59:54 	at org.junit.internal.runners.statements.RunBefores.evaluate(RunBefores.java:24)
09:59:54 	at org.junit.internal.runners.statements.RunAfters.evaluate(RunAfters.java:27)
09:59:54 	at org.junit.runners.ParentRunner.runLeaf(ParentRunner.java:325)
09:59:54 	at org.junit.runners.BlockJUnit4ClassRunner.runChild(BlockJUnit4ClassRunner.java:78)
09:59:54 	at org.junit.runners.BlockJUnit4ClassRunner.runChild(BlockJUnit4ClassRunner.java:57)
09:59:54 	at org.junit.runners.ParentRunner$3.run(ParentRunner.java:290)
09:59:54 	at org.junit.runners.ParentRunner$1.schedule(ParentRunner.java:71)
09:59:54 	at org.junit.runners.ParentRunner.runChildren(ParentRunner.java:288)
09:59:54 	at org.junit.runners.ParentRunner.access$000(ParentRunner.java:58)
09:59:54 	at org.junit.runners.ParentRunner$2.evaluate(ParentRunner.java:268)
09:59:54 	at org.junit.runners.ParentRunner.run(ParentRunner.java:363)
09:59:54 	at org.apache.maven.surefire.junit4.JUnit4Provider.execute(JUnit4Provider.java:264)
09:59:54 	at org.apache.maven.surefire.junit4.JUnit4Provider.executeTestSet(JUnit4Provider.java:153)
09:59:54 	at org.apache.maven.surefire.junit4.JUnit4Provider.invoke(JUnit4Provider.java:124)
09:59:54 	at sun.reflect.NativeMethodAccessorImpl.invoke0(Native Method)
09:59:54 	at sun.reflect.NativeMethodAccessorImpl.invoke(NativeMethodAccessorImpl.java:62)
09:59:54 	at sun.reflect.DelegatingMethodAccessorImpl.invoke(DelegatingMethodAccessorImpl.java:43)
09:59:54 	at java.lang.reflect.Method.invoke(Method.java:498)
09:59:54 	at org.apache.maven.surefire.util.ReflectionUtils.invokeMethodWithArray2(ReflectionUtils.java:208)
09:59:54 	at org.apache.maven.surefire.booter.ProviderFactory$ProviderProxy.invoke(ProviderFactory.java:156)
09:59:54 	at org.apache.maven.surefire.booter.ProviderFactory.invokeProvider(ProviderFactory.java:82)
09:59:54 	at org.eclipse.tycho.surefire.osgibooter.OsgiSurefireBooter.run(OsgiSurefireBooter.java:95)
09:59:54 	at org.eclipse.tycho.surefire.osgibooter.HeadlessTestApplication.run(HeadlessTestApplication.java:21)
09:59:54 	at sun.reflect.NativeMethodAccessorImpl.invoke0(Native Method)
09:59:54 	at sun.reflect.NativeMethodAccessorImpl.invoke(NativeMethodAccessorImpl.java:62)
09:59:54 	at sun.reflect.DelegatingMethodAccessorImpl.invoke(DelegatingMethodAccessorImpl.java:43)
09:59:54 	at java.lang.reflect.Method.invoke(Method.java:498)
09:59:54 	at org.eclipse.equinox.internal.app.EclipseAppContainer.callMethodWithException(EclipseAppContainer.java:587)
09:59:54 	at org.eclipse.equinox.internal.app.EclipseAppHandle.run(EclipseAppHandle.java:198)
09:59:54 	at org.eclipse.core.runtime.internal.adaptor.EclipseAppLauncher.runApplication(EclipseAppLauncher.java:134)
09:59:54 	at org.eclipse.core.runtime.internal.adaptor.EclipseAppLauncher.start(EclipseAppLauncher.java:104)
09:59:54 	at org.eclipse.core.runtime.adaptor.EclipseStarter.run(EclipseStarter.java:388)
09:59:54 	at org.eclipse.core.runtime.adaptor.EclipseStarter.run(EclipseStarter.java:243)
09:59:54 	at sun.reflect.NativeMethodAccessorImpl.invoke0(Native Method)
09:59:54 	at sun.reflect.NativeMethodAccessorImpl.invoke(NativeMethodAccessorImpl.java:62)
09:59:54 	at sun.reflect.DelegatingMethodAccessorImpl.invoke(DelegatingMethodAccessorImpl.java:43)
09:59:54 	at java.lang.reflect.Method.invoke(Method.java:498)
09:59:54 	at org.eclipse.equinox.launcher.Main.invokeFramework(Main.java:653)
09:59:54 	at org.eclipse.equinox.launcher.Main.basicRun(Main.java:590)
09:59:54 	at org.eclipse.equinox.launcher.Main.run(Main.java:1499)
09:59:54 	at org.eclipse.equinox.launcher.Main.main(Main.java:1472)
09:59:54 
09:59:54 testUpdate(org.eclipse.egerrit.core.command.tests.UpdateDraftCommandTest)  Time elapsed: 0.703 sec  <<< FAILURE!
09:59:54 java.lang.AssertionError: http://104.154.18.211:28115/egerrit/test: error occurred during unpacking on the remote end: error No space left on device
09:59:54 	at org.junit.Assert.fail(Assert.java:88)
09:59:54 	at org.eclipse.egerrit.core.command.tests.CommandTest.createReviewWithSimpleFile(CommandTest.java:111)
09:59:54 	at org.eclipse.egerrit.core.command.tests.CommandTestWithSimpleReview.createReview(CommandTestWithSimpleReview.java:19)
09:59:54 	at sun.reflect.GeneratedMethodAccessor9.invoke(Unknown Source)
09:59:54 	at sun.reflect.DelegatingMethodAccessorImpl.invoke(DelegatingMethodAccessorImpl.java:43)
09:59:54 	at java.lang.reflect.Method.invoke(Method.java:498)
09:59:54 	at org.junit.runners.model.FrameworkMethod$1.runReflectiveCall(FrameworkMethod.java:50)
09:59:54 	at org.junit.internal.runners.model.ReflectiveCallable.run(ReflectiveCallable.java:12)
09:59:54 	at org.junit.runners.model.FrameworkMethod.invokeExplosively(FrameworkMethod.java:47)
09:59:54 	at org.junit.internal.runners.statements.RunBefores.evaluate(RunBefores.java:24)
09:59:54 	at org.junit.internal.runners.statements.RunAfters.evaluate(RunAfters.java:27)
09:59:54 	at org.junit.runners.ParentRunner.runLeaf(ParentRunner.java:325)
09:59:54 	at org.junit.runners.BlockJUnit4ClassRunner.runChild(BlockJUnit4ClassRunner.java:78)
09:59:54 	at org.junit.runners.BlockJUnit4ClassRunner.runChild(BlockJUnit4ClassRunner.java:57)
09:59:54 	at org.junit.runners.ParentRunner$3.run(ParentRunner.java:290)
09:59:54 	at org.junit.runners.ParentRunner$1.schedule(ParentRunner.java:71)
09:59:54 	at org.junit.runners.ParentRunner.runChildren(ParentRunner.java:288)
09:59:54 	at org.junit.runners.ParentRunner.access$000(ParentRunner.java:58)
09:59:54 	at org.junit.runners.ParentRunner$2.evaluate(ParentRunner.java:268)
09:59:54 	at org.junit.runners.ParentRunner.run(ParentRunner.java:363)
09:59:54 	at org.apache.maven.surefire.junit4.JUnit4Provider.execute(JUnit4Provider.java:264)
09:59:54 	at org.apache.maven.surefire.junit4.JUnit4Provider.executeTestSet(JUnit4Provider.java:153)
09:59:54 	at org.apache.maven.surefire.junit4.JUnit4Provider.invoke(JUnit4Provider.java:124)
09:59:54 	at sun.reflect.NativeMethodAccessorImpl.invoke0(Native Method)
09:59:54 	at sun.reflect.NativeMethodAccessorImpl.invoke(NativeMethodAccessorImpl.java:62)
09:59:54 	at sun.reflect.DelegatingMethodAccessorImpl.invoke(DelegatingMethodAccessorImpl.java:43)
09:59:54 	at java.lang.reflect.Method.invoke(Method.java:498)
09:59:54 	at org.apache.maven.surefire.util.ReflectionUtils.invokeMethodWithArray2(ReflectionUtils.java:208)
09:59:54 	at org.apache.maven.surefire.booter.ProviderFactory$ProviderProxy.invoke(ProviderFactory.java:156)
09:59:54 	at org.apache.maven.surefire.booter.ProviderFactory.invokeProvider(ProviderFactory.java:82)
09:59:54 	at org.eclipse.tycho.surefire.osgibooter.OsgiSurefireBooter.run(OsgiSurefireBooter.java:95)
09:59:54 	at org.eclipse.tycho.surefire.osgibooter.HeadlessTestApplication.run(HeadlessTestApplication.java:21)
09:59:54 	at sun.reflect.NativeMethodAccessorImpl.invoke0(Native Method)
09:59:54 	at sun.reflect.NativeMethodAccessorImpl.invoke(NativeMethodAccessorImpl.java:62)
09:59:54 	at sun.reflect.DelegatingMethodAccessorImpl.invoke(DelegatingMethodAccessorImpl.java:43)
09:59:54 	at java.lang.reflect.Method.invoke(Method.java:498)
09:59:54 	at org.eclipse.equinox.internal.app.EclipseAppContainer.callMethodWithException(EclipseAppContainer.java:587)
09:59:54 	at org.eclipse.equinox.internal.app.EclipseAppHandle.run(EclipseAppHandle.java:198)
09:59:54 	at org.eclipse.core.runtime.internal.adaptor.EclipseAppLauncher.runApplication(EclipseAppLauncher.java:134)
09:59:54 	at org.eclipse.core.runtime.internal.adaptor.EclipseAppLauncher.start(EclipseAppLauncher.java:104)
09:59:54 	at org.eclipse.core.runtime.adaptor.EclipseStarter.run(EclipseStarter.java:388)
09:59:54 	at org.eclipse.core.runtime.adaptor.EclipseStarter.run(EclipseStarter.java:243)
09:59:54 	at sun.reflect.NativeMethodAccessorImpl.invoke0(Native Method)
09:59:54 	at sun.reflect.NativeMethodAccessorImpl.invoke(NativeMethodAccessorImpl.java:62)
09:59:54 	at sun.reflect.DelegatingMethodAccessorImpl.invoke(DelegatingMethodAccessorImpl.java:43)
09:59:54 	at java.lang.reflect.Method.invoke(Method.java:498)
09:59:54 	at org.eclipse.equinox.launcher.Main.invokeFramework(Main.java:653)
09:59:54 	at org.eclipse.equinox.launcher.Main.basicRun(Main.java:590)
09:59:54 	at org.eclipse.equinox.launcher.Main.run(Main.java:1499)
09:59:54 	at org.eclipse.equinox.launcher.Main.main(Main.java:1472)
09:59:54 
09:59:54 Running org.eclipse.egerrit.core.command.tests.CherryPickRevisionCommandTest
09:59:54 Checking out http://104.154.18.211:28115/egerrit/test into /tmp/genie.egerrit/egerrit5161444182428946036.tmp
09:59:55 org.eclipse.jgit.api.errors.TransportException: http://104.154.18.211:28115/egerrit/test: error occurred during unpacking on the remote end: error No space left on device
09:59:55 Tests run: 1, Failures: 1, Errors: 0, Skipped: 0, Time elapsed: 0.652 sec <<< FAILURE! - in org.eclipse.egerrit.core.command.tests.CherryPickRevisionCommandTest
09:59:55 testCall(org.eclipse.egerrit.core.command.tests.CherryPickRevisionCommandTest)  Time elapsed: 0.65 sec  <<< FAILURE!
09:59:55 java.lang.AssertionError: http://104.154.18.211:28115/egerrit/test: error occurred during unpacking on the remote end: error No space left on device
09:59:55 	at org.junit.Assert.fail(Assert.java:88)
09:59:55 	at org.eclipse.egerrit.core.command.tests.CommandTest.createReviewWithSimpleFile(CommandTest.java:111)
09:59:55 	at org.eclipse.egerrit.core.command.tests.CommandTestWithSimpleReview.createReview(CommandTestWithSimpleReview.java:19)
09:59:55 	at sun.reflect.GeneratedMethodAccessor9.invoke(Unknown Source)
09:59:55 	at sun.reflect.DelegatingMethodAccessorImpl.invoke(DelegatingMethodAccessorImpl.java:43)
09:59:55 	at java.lang.reflect.Method.invoke(Method.java:498)
09:59:55 	at org.junit.runners.model.FrameworkMethod$1.runReflectiveCall(FrameworkMethod.java:50)
09:59:55 	at org.junit.internal.runners.model.ReflectiveCallable.run(ReflectiveCallable.java:12)
09:59:55 	at org.junit.runners.model.FrameworkMethod.invokeExplosively(FrameworkMethod.java:47)
09:59:55 	at org.junit.internal.runners.statements.RunBefores.evaluate(RunBefores.java:24)
09:59:55 	at org.junit.internal.runners.statements.RunAfters.evaluate(RunAfters.java:27)
09:59:55 	at org.junit.runners.ParentRunner.runLeaf(ParentRunner.java:325)
09:59:55 	at org.junit.runners.BlockJUnit4ClassRunner.runChild(BlockJUnit4ClassRunner.java:78)
09:59:55 	at org.junit.runners.BlockJUnit4ClassRunner.runChild(BlockJUnit4ClassRunner.java:57)
09:59:55 	at org.junit.runners.ParentRunner$3.run(ParentRunner.java:290)
09:59:55 	at org.junit.runners.ParentRunner$1.schedule(ParentRunner.java:71)
09:59:55 	at org.junit.runners.ParentRunner.runChildren(ParentRunner.java:288)
09:59:55 	at org.junit.runners.ParentRunner.access$000(ParentRunner.java:58)
09:59:55 	at org.junit.runners.ParentRunner$2.evaluate(ParentRunner.java:268)
09:59:55 	at org.junit.runners.ParentRunner.run(ParentRunner.java:363)
09:59:55 	at org.apache.maven.surefire.junit4.JUnit4Provider.execute(JUnit4Provider.java:264)
09:59:55 	at org.apache.maven.surefire.junit4.JUnit4Provider.executeTestSet(JUnit4Provider.java:153)
09:59:55 	at org.apache.maven.surefire.junit4.JUnit4Provider.invoke(JUnit4Provider.java:124)
09:59:55 	at sun.reflect.NativeMethodAccessorImpl.invoke0(Native Method)
09:59:55 	at sun.reflect.NativeMethodAccessorImpl.invoke(NativeMethodAccessorImpl.java:62)
09:59:55 	at sun.reflect.DelegatingMethodAccessorImpl.invoke(DelegatingMethodAccessorImpl.java:43)
09:59:55 	at java.lang.reflect.Method.invoke(Method.java:498)
09:59:55 	at org.apache.maven.surefire.util.ReflectionUtils.invokeMethodWithArray2(ReflectionUtils.java:208)
09:59:55 	at org.apache.maven.surefire.booter.ProviderFactory$ProviderProxy.invoke(ProviderFactory.java:156)
09:59:55 	at org.apache.maven.surefire.booter.ProviderFactory.invokeProvider(ProviderFactory.java:82)
09:59:55 	at org.eclipse.tycho.surefire.osgibooter.OsgiSurefireBooter.run(OsgiSurefireBooter.java:95)
09:59:55 	at org.eclipse.tycho.surefire.osgibooter.HeadlessTestApplication.run(HeadlessTestApplication.java:21)
09:59:55 	at sun.reflect.NativeMethodAccessorImpl.invoke0(Native Method)
09:59:55 	at sun.reflect.NativeMethodAccessorImpl.invoke(NativeMethodAccessorImpl.java:62)
09:59:55 	at sun.reflect.DelegatingMethodAccessorImpl.invoke(DelegatingMethodAccessorImpl.java:43)
09:59:55 	at java.lang.reflect.Method.invoke(Method.java:498)
09:59:55 	at org.eclipse.equinox.internal.app.EclipseAppContainer.callMethodWithException(EclipseAppContainer.java:587)
09:59:55 	at org.eclipse.equinox.internal.app.EclipseAppHandle.run(EclipseAppHandle.java:198)
09:59:55 	at org.eclipse.core.runtime.internal.adaptor.EclipseAppLauncher.runApplication(EclipseAppLauncher.java:134)
09:59:55 	at org.eclipse.core.runtime.internal.adaptor.EclipseAppLauncher.start(EclipseAppLauncher.java:104)
09:59:55 	at org.eclipse.core.runtime.adaptor.EclipseStarter.run(EclipseStarter.java:388)
09:59:55 	at org.eclipse.core.runtime.adaptor.EclipseStarter.run(EclipseStarter.java:243)
09:59:55 	at sun.reflect.NativeMethodAccessorImpl.invoke0(Native Method)
09:59:55 	at sun.reflect.NativeMethodAccessorImpl.invoke(NativeMethodAccessorImpl.java:62)
09:59:55 	at sun.reflect.DelegatingMethodAccessorImpl.invoke(DelegatingMethodAccessorImpl.java:43)
09:59:55 	at java.lang.reflect.Method.invoke(Method.java:498)
09:59:55 	at org.eclipse.equinox.launcher.Main.invokeFramework(Main.java:653)
09:59:55 	at org.eclipse.equinox.launcher.Main.basicRun(Main.java:590)
09:59:55 	at org.eclipse.equinox.launcher.Main.run(Main.java:1499)
09:59:55 	at org.eclipse.equinox.launcher.Main.main(Main.java:1472)
09:59:55 
09:59:55 Running org.eclipse.egerrit.core.command.tests.AbandonCommandTest
09:59:55 Checking out http://104.154.18.211:28115/egerrit/test into /tmp/genie.egerrit/egerrit7013484291494048834.tmp
09:59:55 org.eclipse.jgit.api.errors.TransportException: http://104.154.18.211:28115/egerrit/test: error occurred during unpacking on the remote end: error No space left on device
09:59:55 Tests run: 1, Failures: 1, Errors: 0, Skipped: 0, Time elapsed: 0.658 sec <<< FAILURE! - in org.eclipse.egerrit.core.command.tests.AbandonCommandTest
09:59:55 testCall(org.eclipse.egerrit.core.command.tests.AbandonCommandTest)  Time elapsed: 0.656 sec  <<< FAILURE!
09:59:55 java.lang.AssertionError: http://104.154.18.211:28115/egerrit/test: error occurred during unpacking on the remote end: error No space left on device
09:59:55 	at org.junit.Assert.fail(Assert.java:88)
09:59:55 	at org.eclipse.egerrit.core.command.tests.CommandTest.createReviewWithSimpleFile(CommandTest.java:111)
09:59:55 	at org.eclipse.egerrit.core.command.tests.CommandTestWithSimpleReview.createReview(CommandTestWithSimpleReview.java:19)
09:59:55 	at sun.reflect.GeneratedMethodAccessor9.invoke(Unknown Source)
09:59:55 	at sun.reflect.DelegatingMethodAccessorImpl.invoke(DelegatingMethodAccessorImpl.java:43)
09:59:55 	at java.lang.reflect.Method.invoke(Method.java:498)
09:59:55 	at org.junit.runners.model.FrameworkMethod$1.runReflectiveCall(FrameworkMethod.java:50)
09:59:55 	at org.junit.internal.runners.model.ReflectiveCallable.run(ReflectiveCallable.java:12)
09:59:55 	at org.junit.runners.model.FrameworkMethod.invokeExplosively(FrameworkMethod.java:47)
09:59:55 	at org.junit.internal.runners.statements.RunBefores.evaluate(RunBefores.java:24)
09:59:55 	at org.junit.internal.runners.statements.RunAfters.evaluate(RunAfters.java:27)
09:59:55 	at org.junit.runners.ParentRunner.runLeaf(ParentRunner.java:325)
09:59:55 	at org.junit.runners.BlockJUnit4ClassRunner.runChild(BlockJUnit4ClassRunner.java:78)
09:59:55 	at org.junit.runners.BlockJUnit4ClassRunner.runChild(BlockJUnit4ClassRunner.java:57)
09:59:55 	at org.junit.runners.ParentRunner$3.run(ParentRunner.java:290)
09:59:55 	at org.junit.runners.ParentRunner$1.schedule(ParentRunner.java:71)
09:59:55 	at org.junit.runners.ParentRunner.runChildren(ParentRunner.java:288)
09:59:55 	at org.junit.runners.ParentRunner.access$000(ParentRunner.java:58)
09:59:55 	at org.junit.runners.ParentRunner$2.evaluate(ParentRunner.java:268)
09:59:55 	at org.junit.runners.ParentRunner.run(ParentRunner.java:363)
09:59:55 	at org.apache.maven.surefire.junit4.JUnit4Provider.execute(JUnit4Provider.java:264)
09:59:55 	at org.apache.maven.surefire.junit4.JUnit4Provider.executeTestSet(JUnit4Provider.java:153)
09:59:55 	at org.apache.maven.surefire.junit4.JUnit4Provider.invoke(JUnit4Provider.java:124)
09:59:55 	at sun.reflect.NativeMethodAccessorImpl.invoke0(Native Method)
09:59:55 	at sun.reflect.NativeMethodAccessorImpl.invoke(NativeMethodAccessorImpl.java:62)
09:59:55 	at sun.reflect.DelegatingMethodAccessorImpl.invoke(DelegatingMethodAccessorImpl.java:43)
09:59:55 	at java.lang.reflect.Method.invoke(Method.java:498)
09:59:55 	at org.apache.maven.surefire.util.ReflectionUtils.invokeMethodWithArray2(ReflectionUtils.java:208)
09:59:55 	at org.apache.maven.surefire.booter.ProviderFactory$ProviderProxy.invoke(ProviderFactory.java:156)
09:59:55 	at org.apache.maven.surefire.booter.ProviderFactory.invokeProvider(ProviderFactory.java:82)
09:59:55 	at org.eclipse.tycho.surefire.osgibooter.OsgiSurefireBooter.run(OsgiSurefireBooter.java:95)
09:59:55 	at org.eclipse.tycho.surefire.osgibooter.HeadlessTestApplication.run(HeadlessTestApplication.java:21)
09:59:55 	at sun.reflect.NativeMethodAccessorImpl.invoke0(Native Method)
09:59:55 	at sun.reflect.NativeMethodAccessorImpl.invoke(NativeMethodAccessorImpl.java:62)
09:59:55 	at sun.reflect.DelegatingMethodAccessorImpl.invoke(DelegatingMethodAccessorImpl.java:43)
09:59:55 	at java.lang.reflect.Method.invoke(Method.java:498)
09:59:55 	at org.eclipse.equinox.internal.app.EclipseAppContainer.callMethodWithException(EclipseAppContainer.java:587)
09:59:55 	at org.eclipse.equinox.internal.app.EclipseAppHandle.run(EclipseAppHandle.java:198)
09:59:55 	at org.eclipse.core.runtime.internal.adaptor.EclipseAppLauncher.runApplication(EclipseAppLauncher.java:134)
09:59:55 	at org.eclipse.core.runtime.internal.adaptor.EclipseAppLauncher.start(EclipseAppLauncher.java:104)
09:59:55 	at org.eclipse.core.runtime.adaptor.EclipseStarter.run(EclipseStarter.java:388)
09:59:55 	at org.eclipse.core.runtime.adaptor.EclipseStarter.run(EclipseStarter.java:243)
09:59:55 	at sun.reflect.NativeMethodAccessorImpl.invoke0(Native Method)
09:59:55 	at sun.reflect.NativeMethodAccessorImpl.invoke(NativeMethodAccessorImpl.java:62)
09:59:55 	at sun.reflect.DelegatingMethodAccessorImpl.invoke(DelegatingMethodAccessorImpl.java:43)
09:59:55 	at java.lang.reflect.Method.invoke(Method.java:498)
09:59:55 	at org.eclipse.equinox.launcher.Main.invokeFramework(Main.java:653)
09:59:55 	at org.eclipse.equinox.launcher.Main.basicRun(Main.java:590)
09:59:55 	at org.eclipse.equinox.launcher.Main.run(Main.java:1499)
09:59:55 	at org.eclipse.equinox.launcher.Main.main(Main.java:1472)
09:59:55 
09:59:55 
09:59:55 Results :
09:59:55 
09:59:55 Failed tests: 
09:59:55   DeleteDraftChangeCommandTest.createDraftReview:35->CommandTest.createReviewWithSimpleFile:111 http://104.154.18.211:28115/egerrit/test: error occurred during unpacking on the remote end: error No space left on device
09:59:55   GetMergeableCommandTest>CommandTestWithSimpleReview.createReview:19->CommandTest.createReviewWithSimpleFile:111 http://104.154.18.211:28115/egerrit/test: error occurred during unpacking on the remote end: error No space left on device
09:59:55   SetTopicCommandTest>CommandTestWithSimpleReview.createReview:19->CommandTest.createReviewWithSimpleFile:111 http://104.154.18.211:28115/egerrit/test: error occurred during unpacking on the remote end: error No space left on device
09:59:55   StarCommandTest>CommandTestWithSimpleReview.createReview:19->CommandTest.createReviewWithSimpleFile:111 http://104.154.18.211:28115/egerrit/test: error occurred during unpacking on the remote end: error No space left on device
09:59:55   ListCommentsCommandTest>CommandTestWithSimpleReview.createReview:19->CommandTest.createReviewWithSimpleFile:111 http://104.154.18.211:28115/egerrit/test: error occurred during unpacking on the remote end: error No space left on device
09:59:55   QueryChangesCommandTest>CommandTestWithSimpleReview.createReview:19->CommandTest.createReviewWithSimpleFile:111 http://104.154.18.211:28115/egerrit/test: error occurred during unpacking on the remote end: error No space left on device
09:59:55   QueryChangesCommandTest>CommandTestWithSimpleReview.createReview:19->CommandTest.createReviewWithSimpleFile:111 http://104.154.18.211:28115/egerrit/test: error occurred during unpacking on the remote end: error No space left on device
09:59:55   QueryChangesCommandTest>CommandTestWithSimpleReview.createReview:19->CommandTest.createReviewWithSimpleFile:111 http://104.154.18.211:28115/egerrit/test: error occurred during unpacking on the remote end: error No space left on device
09:59:55   QueryChangesCommandTest>CommandTestWithSimpleReview.createReview:19->CommandTest.createReviewWithSimpleFile:111 http://104.154.18.211:28115/egerrit/test: error occurred during unpacking on the remote end: error No space left on device
09:59:55   QueryChangesCommandTest>CommandTestWithSimpleReview.createReview:19->CommandTest.createReviewWithSimpleFile:111 http://104.154.18.211:28115/egerrit/test: error occurred during unpacking on the remote end: error No space left on device
09:59:55   QueryChangesCommandTest>CommandTestWithSimpleReview.createReview:19->CommandTest.createReviewWithSimpleFile:111 http://104.154.18.211:28115/egerrit/test: error occurred during unpacking on the remote end: error No space left on device
09:59:55   ListProjectsCommandTest>CommandTestWithSimpleReview.createReview:19->CommandTest.createReviewWithSimpleFile:111 http://104.154.18.211:28115/egerrit/test: error occurred during unpacking on the remote end: error No space left on device
09:59:55   SuggestAccountCommandTest>CommandTestWithSimpleReview.createReview:19->CommandTest.createReviewWithSimpleFile:111 http://104.154.18.211:28115/egerrit/test: error occurred during unpacking on the remote end: error No space left on device
09:59:55   GetReviewedCommandTest>CommandTestWithSimpleReview.createReview:19->CommandTest.createReviewWithSimpleFile:111 http://104.154.18.211:28115/egerrit/test: error occurred during unpacking on the remote end: error No space left on device
09:59:55   SetReviewCommandTest>CommandTestWithSimpleReview.createReview:19->CommandTest.createReviewWithSimpleFile:111 http://104.154.18.211:28115/egerrit/test: error occurred during unpacking on the remote end: error No space left on device
09:59:55   GetContentCommandTest>CommandTestWithSimpleReview.createReview:19->CommandTest.createReviewWithSimpleFile:111 http://104.154.18.211:28115/egerrit/test: error occurred during unpacking on the remote end: error No space left on device
09:59:55   RebaseRevisionCommandTest>CommandTestWithSimpleReview.createReview:19->CommandTest.createReviewWithSimpleFile:111 http://104.154.18.211:28115/egerrit/test: error occurred during unpacking on the remote end: error No space left on device
09:59:55   DeleteDraftCommandTest>CommandTestWithSimpleReview.createReview:19->CommandTest.createReviewWithSimpleFile:111 http://104.154.18.211:28115/egerrit/test: error occurred during unpacking on the remote end: error No space left on device
09:59:55   GetIncludedInCommandTest>CommandTestWithSimpleReview.createReview:19->CommandTest.createReviewWithSimpleFile:111 http://104.154.18.211:28115/egerrit/test: error occurred during unpacking on the remote end: error No space left on device
09:59:55   PublishDraftChangeCommandTest.createDraftReview:35->CommandTest.createReviewWithSimpleFile:111 http://104.154.18.211:28115/egerrit/test: error occurred during unpacking on the remote end: error No space left on device
09:59:55   GetContentFromCommitCommandTest>CommandTestWithSimpleReview.createReview:19->CommandTest.createReviewWithSimpleFile:111 http://104.154.18.211:28115/egerrit/test: error occurred during unpacking on the remote end: error No space left on device
09:59:55   ListBranchesCommandTest>CommandTestWithSimpleReview.createReview:19->CommandTest.createReviewWithSimpleFile:111 http://104.154.18.211:28115/egerrit/test: error occurred during unpacking on the remote end: error No space left on device
09:59:55   GetRelatedChangesCommandTest>CommandTestWithSimpleReview.createReview:19->CommandTest.createReviewWithSimpleFile:111 http://104.154.18.211:28115/egerrit/test: error occurred during unpacking on the remote end: error No space left on device
09:59:55   SubmitCommandTest>CommandTestWithSimpleReview.createReview:19->CommandTest.createReviewWithSimpleFile:111 http://104.154.18.211:28115/egerrit/test: error occurred during unpacking on the remote end: error No space left on device
09:59:55   GetRevisionActionsCommandTest>CommandTestWithSimpleReview.createReview:19->CommandTest.createReviewWithSimpleFile:111 http://104.154.18.211:28115/egerrit/test: error occurred during unpacking on the remote end: error No space left on device
09:59:55   RevertCommandTest>CommandTestWithSimpleReview.createReview:19->CommandTest.createReviewWithSimpleFile:111 http://104.154.18.211:28115/egerrit/test: error occurred during unpacking on the remote end: error No space left on device
09:59:55   UnstarCommandTest>CommandTestWithSimpleReview.createReview:19->CommandTest.createReviewWithSimpleFile:111 http://104.154.18.211:28115/egerrit/test: error occurred during unpacking on the remote end: error No space left on device
09:59:55   AddReviewerCommandTest>CommandTestWithSimpleReview.createReview:19->CommandTest.createReviewWithSimpleFile:111 http://104.154.18.211:28115/egerrit/test: error occurred during unpacking on the remote end: error No space left on device
09:59:55   AddReviewerCommandTest>CommandTestWithSimpleReview.createReview:19->CommandTest.createReviewWithSimpleFile:111 http://104.154.18.211:28115/egerrit/test: error occurred during unpacking on the remote end: error No space left on device
09:59:55   AddReviewerCommandTest>CommandTestWithSimpleReview.createReview:19->CommandTest.createReviewWithSimpleFile:111 http://104.154.18.211:28115/egerrit/test: error occurred during unpacking on the remote end: error No space left on device
09:59:55   RestoreCommandTest>CommandTestWithSimpleReview.createReview:19->CommandTest.createReviewWithSimpleFile:111 http://104.154.18.211:28115/egerrit/test: error occurred during unpacking on the remote end: error No space left on device
09:59:55   DeleteDraftRevisionCommandTest>CommandTestWithSimpleReview.createReview:19->CommandTest.createReviewWithSimpleFile:111 http://104.154.18.211:28115/egerrit/test: error occurred during unpacking on the remote end: error No space left on device
09:59:55   ChangeCommitMsgCommandTest>CommandTestWithSimpleReview.createReview:19->CommandTest.createReviewWithSimpleFile:111 http://104.154.18.211:28115/egerrit/test: error occurred during unpacking on the remote end: error No space left on device
09:59:55   ListReviewersCommandTest>CommandTestWithSimpleReview.createReview:19->CommandTest.createReviewWithSimpleFile:111 http://104.154.18.211:28115/egerrit/test: error occurred during unpacking on the remote end: error No space left on device
09:59:55   GetDiffCommandTest>CommandTestWithSimpleReview.createReview:19->CommandTest.createReviewWithSimpleFile:111 http://104.154.18.211:28115/egerrit/test: error occurred during unpacking on the remote end: error No space left on device
09:59:55   GetDiffCommandTest>CommandTestWithSimpleReview.createReview:19->CommandTest.createReviewWithSimpleFile:111 http://104.154.18.211:28115/egerrit/test: error occurred during unpacking on the remote end: error No space left on device
09:59:55   GetChangeCommandTest>CommandTestWithSimpleReview.createReview:19->CommandTest.createReviewWithSimpleFile:111 http://104.154.18.211:28115/egerrit/test: error occurred during unpacking on the remote end: error No space left on device
09:59:55   GetChangeCommandTest>CommandTestWithSimpleReview.createReview:19->CommandTest.createReviewWithSimpleFile:111 http://104.154.18.211:28115/egerrit/test: error occurred during unpacking on the remote end: error No space left on device
09:59:55   CreateDraftCommandTest>CommandTestWithSimpleReview.createReview:19->CommandTest.createReviewWithSimpleFile:111 http://104.154.18.211:28115/egerrit/test: error occurred during unpacking on the remote end: error No space left on device
09:59:55   CreateDraftCommandTest>CommandTestWithSimpleReview.createReview:19->CommandTest.createReviewWithSimpleFile:111 http://104.154.18.211:28115/egerrit/test: error occurred during unpacking on the remote end: error No space left on device
09:59:55   SuggestReviewersCommandTest>CommandTestWithSimpleReview.createReview:19->CommandTest.createReviewWithSimpleFile:111 http://104.154.18.211:28115/egerrit/test: error occurred during unpacking on the remote end: error No space left on device
09:59:55   DeleteTopicCommandTest>CommandTestWithSimpleReview.createReview:19->CommandTest.createReviewWithSimpleFile:111 http://104.154.18.211:28115/egerrit/test: error occurred during unpacking on the remote end: error No space left on device
09:59:55   GetCommitMsgCommandTest>CommandTestWithSimpleReview.createReview:19->CommandTest.createReviewWithSimpleFile:111 http://104.154.18.211:28115/egerrit/test: error occurred during unpacking on the remote end: error No space left on device
09:59:55   DeleteReviewedCommandTest>CommandTestWithSimpleReview.createReview:19->CommandTest.createReviewWithSimpleFile:111 http://104.154.18.211:28115/egerrit/test: error occurred during unpacking on the remote end: error No space left on device
09:59:55   ListDraftsCommandTest>CommandTestWithSimpleReview.createReview:19->CommandTest.createReviewWithSimpleFile:111 http://104.154.18.211:28115/egerrit/test: error occurred during unpacking on the remote end: error No space left on device
09:59:55   GetModifiedFilesCommandTest>CommandTestWithSimpleReview.createReview:19->CommandTest.createReviewWithSimpleFile:111 http://104.154.18.211:28115/egerrit/test: error occurred during unpacking on the remote end: error No space left on device
09:59:55   SetReviewedCommandTest>CommandTestWithSimpleReview.createReview:19->CommandTest.createReviewWithSimpleFile:111 http://104.154.18.211:28115/egerrit/test: error occurred during unpacking on the remote end: error No space left on device
09:59:55   DeleteReviewerCommandTest>CommandTestWithSimpleReview.createReview:19->CommandTest.createReviewWithSimpleFile:111 http://104.154.18.211:28115/egerrit/test: error occurred during unpacking on the remote end: error No space left on device
09:59:55   UpdateDraftCommandTest>CommandTestWithSimpleReview.createReview:19->CommandTest.createReviewWithSimpleFile:111 http://104.154.18.211:28115/egerrit/test: error occurred during unpacking on the remote end: error No space left on device
09:59:55   UpdateDraftCommandTest>CommandTestWithSimpleReview.createReview:19->CommandTest.createReviewWithSimpleFile:111 http://104.154.18.211:28115/egerrit/test: error occurred during unpacking on the remote end: error No space left on device
09:59:55   CherryPickRevisionCommandTest>CommandTestWithSimpleReview.createReview:19->CommandTest.createReviewWithSimpleFile:111 http://104.154.18.211:28115/egerrit/test: error occurred during unpacking on the remote end: error No space left on device
09:59:55   AbandonCommandTest>CommandTestWithSimpleReview.createReview:19->CommandTest.createReviewWithSimpleFile:111 http://104.154.18.211:28115/egerrit/test: error occurred during unpacking on the remote end: error No space left on device
09:59:55 
09:59:55 Tests run: 73, Failures: 52, Errors: 0, Skipped: 0
09:59:55 
09:59:56 [INFO] ------------------------------------------------------------------------
09:59:56 [INFO] Reactor Summary:
09:59:56 [INFO] 
09:59:56 [INFO] EGerrit Parent 1.4.0-SNAPSHOT ...................... SUCCESS [ 10.898 s]
09:59:56 [INFO] EGerrit Target Platform ............................ SUCCESS [  0.367 s]
09:59:56 [INFO] EGerrit Model Plug-in .............................. SUCCESS [  8.392 s]
09:59:56 [INFO] EGerrit Core Plug-in ............................... SUCCESS [  2.745 s]
09:59:56 [INFO] EGerrit Model Edit Plug-in ......................... SUCCESS [  2.826 s]
09:59:56 [INFO] EGerrit Core Tests Plug-in ......................... FAILURE [ 47.201 s]
09:59:56 [INFO] EGerrit UI Plug-in ................................. SKIPPED
09:59:56 [INFO] org.eclipse.egerrit.dashboard.core ................. SKIPPED
09:59:56 [INFO] org.eclipse.egerrit.dashboard.ui ................... SKIPPED
09:59:56 [INFO] EGerrit UI Tests Plug-in ........................... SKIPPED
09:59:56 [INFO] EGerrit Feature .................................... SKIPPED
09:59:56 [INFO] EGerrit Update site ................................ SKIPPED
09:59:56 [INFO] EGerrit Update site for tests 1.4.0-SNAPSHOT ....... SKIPPED
09:59:56 [INFO] ------------------------------------------------------------------------
09:59:56 [INFO] BUILD FAILURE
09:59:56 [INFO] ------------------------------------------------------------------------
09:59:56 [INFO] Total time: 04:38 min
09:59:56 [INFO] Finished at: 2018-10-04T09:59:56-04:00
09:59:56 [INFO] ------------------------------------------------------------------------
09:59:56 [ERROR] Failed to execute goal org.eclipse.tycho:tycho-surefire-plugin:1.0.0:test (default-test) on project org.eclipse.egerrit.core.tests: There are test failures.
09:59:56 [ERROR] 
09:59:56 [ERROR] Please refer to /jobs/genie.egerrit/EGerrit/workspace/org.eclipse.egerrit.core.tests/target/surefire-reports for the individual test results.
09:59:56 [ERROR] -> [Help 1]
09:59:56 [ERROR] 
09:59:56 [ERROR] To see the full stack trace of the errors, re-run Maven with the -e switch.
09:59:56 [ERROR] Re-run Maven using the -X switch to enable full debug logging.
09:59:56 [ERROR] 
09:59:56 [ERROR] For more information about the errors and possible solutions, please read the following articles:
09:59:56 [ERROR] [Help 1] http://cwiki.apache.org/confluence/display/MAVEN/MojoFailureException
09:59:56 [ERROR] 
09:59:56 [ERROR] After correcting the problems, you can resume the build with the command
09:59:56 [ERROR]   mvn <goals> -rf :org.eclipse.egerrit.core.tests
09:59:58 Build step 'Invoke top-level Maven targets' marked build as failure
09:59:58 Terminating xvnc.
09:59:58 Not sending mail to unregistered user lmcbout@gmail.com
09:59:58 Sending e-mails to: lmcbout@gmail.com pascal@rapicorp.com patrick.pollo.guilbert@ericsson.com
09:59:58 Recording test results
09:59:59 Archiving artifacts
09:59:59 Started calculate disk usage of build
09:59:59 Finished Calculation of disk usage of build in 0 seconds
10:00:01 Started calculate disk usage of workspace
10:00:01 Finished Calculation of disk usage of workspace in 0 seconds
10:00:02 Finished: FAILURE