FailedConsole Output

Started by user jfaltermeier@eclipsesource.com
Cleaning the workspace because project is configured to clean the workspace before each build.
Checkout:workspace / /home/hudson/genie.modeling.ecp/.hudson/jobs/emf-emfclient-simrel/workspace - hudson.remoting.LocalChannel@67eb249b
Using strategy: Default
Checkout:workspace / /home/hudson/genie.modeling.ecp/.hudson/jobs/emf-emfclient-simrel/workspace - hudson.remoting.LocalChannel@67eb249b
Cloning the remote Git repository
Cloning repository origin
Fetching upstream changes from git://git.eclipse.org/gitroot/emfclient/org.eclipse.emf.ecp.core.git
Commencing build of Revision e9ffc1ee43963468a79d897cb96f9319bf2150f4 (origin/lunaM5)
Checking out Revision e9ffc1ee43963468a79d897cb96f9319bf2150f4 (origin/lunaM5)
No change to record in branch origin/lunaM5
Starting xvnc
[workspace] $ Xvnc :524 -geometry 1024x768 -depth 24 -ac
[workspace] $ /bin/sh -xe /tmp/genie.modeling.ecp/hudson2582694719001190360.sh
+ metacity --replace --sm-disable
_XSERVTransmkdir: Owner of /tmp/.X11-unix should be set to root
28/01/2014 06:08:08 Xvnc version X.org/xf4vnc custom version
28/01/2014 06:08:08 Copyright (C) 2001-2004 Alan Hourihane.
28/01/2014 06:08:08 Copyright (C) 2000-2004 Constantin Kaplinsky
28/01/2014 06:08:08 Copyright (C) 1999 AT&T Laboratories Cambridge
28/01/2014 06:08:08 All Rights Reserved.
28/01/2014 06:08:08 See http://www.tightvnc.com/ for information on TightVNC
28/01/2014 06:08:08 See http://xf4vnc.sf.net for xf4vnc-specific information
28/01/2014 06:08:08 Desktop name 'x11' (hipp4:524)
28/01/2014 06:08:08 Protocol versions supported: 3.7, 3.3
28/01/2014 06:08:08 RGB format 8 8 8
28/01/2014 06:08:08 Listening for VNC connections on TCP port 6424
[dix] Could not init font path element /usr/share/fonts/TTF/, removing from list!
[dix] Could not init font path element /usr/share/fonts/OTF, removing from list!
(EE) config/hal: NewInputDeviceRequest failed (2)
(EE) config/hal: NewInputDeviceRequest failed (2)
Xlib:  extension "RANDR" missing on display ":524.0".
Process leaked file descriptors. See http://wiki.hudson-ci.org/display/HUDSON/Spawning+processes+from+build for more information
[INFO] Using bundled Maven 3 installation
[INFO] Checking Maven 3 installation environment
[workspace] $ /home/hudson/genie.modeling.ecp/.hudson/maven/slavebundle/bundled-maven/bin/mvn --help
[INFO] Checking Maven 3 installation version
[INFO] Detected Maven 3 installation version: 3.0.3
[workspace] $ /home/hudson/genie.modeling.ecp/.hudson/maven/slavebundle/bundled-maven/bin/mvn clean install -P build-server -V -B -Dmaven.ext.class.path=/home/hudson/genie.modeling.ecp/.hudson/maven/slavebundle/resources:/home/hudson/genie.modeling.ecp/.hudson/maven/slavebundle/lib/maven3-eventspy-3.0.jar:/home/hudson/genie.modeling.ecp/.hudson/war/webapp/WEB-INF/lib/hudson-remoting-3.0.0.jar -Dhudson.eventspy.port=40032 -Dmaven.repo.local=/home/hudson/genie.modeling.ecp/.hudson/jobs/emf-emfclient-simrel/workspace/.maven/repo -f releng/org.eclipse.emf.ecp.releng/pom.xml
[DEBUG] Waiting for connection on port: 40032
Apache Maven 3.0.3 (r1075438; 2011-02-28 12:31:09-0500)
Maven home: /home/hudson/genie.modeling.ecp/.hudson/maven/slavebundle/bundled-maven
Java version: 1.6.0_45, vendor: Sun Microsystems Inc.
Java home: /opt/public/common/jdk1.6.0_45/jre
Default locale: en_US, platform encoding: UTF-8
OS name: "linux", version: "3.0.76-0.11-default", arch: "amd64", family: "unix"
[DEBUG] Connected to remote
[INFO] Scanning for projects...
Downloading: https://repo.eclipse.org/content/repositories/releases/org/eclipse/tycho/tycho-maven-plugin/0.18.0/tycho-maven-plugin-0.18.0.pom
Downloading: http://repo1.maven.org/maven2/org/eclipse/tycho/tycho-maven-plugin/0.18.0/tycho-maven-plugin-0.18.0.pom
Downloaded: http://repo1.maven.org/maven2/org/eclipse/tycho/tycho-maven-plugin/0.18.0/tycho-maven-plugin-0.18.0.pom (3 KB at 10.4 KB/sec)
Downloading: https://repo.eclipse.org/content/repositories/releases/org/eclipse/tycho/tycho/0.18.0/tycho-0.18.0.pom
Downloading: http://repo1.maven.org/maven2/org/eclipse/tycho/tycho/0.18.0/tycho-0.18.0.pom
Downloaded: http://repo1.maven.org/maven2/org/eclipse/tycho/tycho/0.18.0/tycho-0.18.0.pom (18 KB at 133.7 KB/sec)
Downloading: https://repo.eclipse.org/content/repositories/releases/org/eclipse/tycho/tycho-core/0.18.0/tycho-core-0.18.0.pom
Downloading: http://repo1.maven.org/maven2/org/eclipse/tycho/tycho-core/0.18.0/tycho-core-0.18.0.pom
Downloaded: http://repo1.maven.org/maven2/org/eclipse/tycho/tycho-core/0.18.0/tycho-core-0.18.0.pom (5 KB at 43.6 KB/sec)
Downloading: https://repo.eclipse.org/content/repositories/releases/org/apache/maven/maven-core/3.0/maven-core-3.0.pom
Downloading: http://repo1.maven.org/maven2/org/apache/maven/maven-core/3.0/maven-core-3.0.pom
Downloaded: http://repo1.maven.org/maven2/org/apache/maven/maven-core/3.0/maven-core-3.0.pom (7 KB at 62.2 KB/sec)
Downloading: https://repo.eclipse.org/content/repositories/releases/org/apache/maven/maven/3.0/maven-3.0.pom
Downloading: http://repo1.maven.org/maven2/org/apache/maven/maven/3.0/maven-3.0.pom
Downloaded: http://repo1.maven.org/maven2/org/apache/maven/maven/3.0/maven-3.0.pom (22 KB at 163.1 KB/sec)
Downloading: https://repo.eclipse.org/content/repositories/releases/org/apache/maven/maven-parent/15/maven-parent-15.pom
Downloading: http://repo1.maven.org/maven2/org/apache/maven/maven-parent/15/maven-parent-15.pom
Downloaded: http://repo1.maven.org/maven2/org/apache/maven/maven-parent/15/maven-parent-15.pom (24 KB at 177.6 KB/sec)
Downloading: https://repo.eclipse.org/content/repositories/releases/org/apache/apache/6/apache-6.pom
Downloading: http://repo1.maven.org/maven2/org/apache/apache/6/apache-6.pom
Downloaded: http://repo1.maven.org/maven2/org/apache/apache/6/apache-6.pom (13 KB at 117.9 KB/sec)
Downloading: https://repo.eclipse.org/content/repositories/releases/org/apache/maven/maven-model/3.0/maven-model-3.0.pom
Downloading: http://repo1.maven.org/maven2/org/apache/maven/maven-model/3.0/maven-model-3.0.pom
Downloaded: http://repo1.maven.org/maven2/org/apache/maven/maven-model/3.0/maven-model-3.0.pom (4 KB at 36.2 KB/sec)
Downloading: https://repo.eclipse.org/content/repositories/releases/org/codehaus/plexus/plexus-utils/3.0.7/plexus-utils-3.0.7.pom
Downloading: http://repo1.maven.org/maven2/org/codehaus/plexus/plexus-utils/3.0.7/plexus-utils-3.0.7.pom
Downloaded: http://repo1.maven.org/maven2/org/codehaus/plexus/plexus-utils/3.0.7/plexus-utils-3.0.7.pom (3 KB at 24.1 KB/sec)
Downloading: https://repo.eclipse.org/content/repositories/releases/org/codehaus/plexus/plexus/3.1/plexus-3.1.pom
Downloading: http://repo1.maven.org/maven2/org/codehaus/plexus/plexus/3.1/plexus-3.1.pom
Downloaded: http://repo1.maven.org/maven2/org/codehaus/plexus/plexus/3.1/plexus-3.1.pom (19 KB at 137.7 KB/sec)
Downloading: https://repo.eclipse.org/content/repositories/releases/org/sonatype/spice/spice-parent/17/spice-parent-17.pom
Downloading: http://repo1.maven.org/maven2/org/sonatype/spice/spice-parent/17/spice-parent-17.pom
Downloaded: http://repo1.maven.org/maven2/org/sonatype/spice/spice-parent/17/spice-parent-17.pom (7 KB at 62.9 KB/sec)
Downloading: https://repo.eclipse.org/content/repositories/releases/org/sonatype/forge/forge-parent/10/forge-parent-10.pom
Downloading: http://repo1.maven.org/maven2/org/sonatype/forge/forge-parent/10/forge-parent-10.pom
Downloaded: http://repo1.maven.org/maven2/org/sonatype/forge/forge-parent/10/forge-parent-10.pom (14 KB at 122.6 KB/sec)
Downloading: https://repo.eclipse.org/content/repositories/releases/org/apache/maven/maven-settings/3.0/maven-settings-3.0.pom
Downloading: http://repo1.maven.org/maven2/org/apache/maven/maven-settings/3.0/maven-settings-3.0.pom
Downloaded: http://repo1.maven.org/maven2/org/apache/maven/maven-settings/3.0/maven-settings-3.0.pom (2 KB at 17.7 KB/sec)
Downloading: https://repo.eclipse.org/content/repositories/releases/org/apache/maven/maven-settings-builder/3.0/maven-settings-builder-3.0.pom
Downloading: http://repo1.maven.org/maven2/org/apache/maven/maven-settings-builder/3.0/maven-settings-builder-3.0.pom
Downloaded: http://repo1.maven.org/maven2/org/apache/maven/maven-settings-builder/3.0/maven-settings-builder-3.0.pom (3 KB at 20.8 KB/sec)
Downloading: https://repo.eclipse.org/content/repositories/releases/org/codehaus/plexus/plexus-interpolation/1.14/plexus-interpolation-1.14.pom
Downloading: http://repo1.maven.org/maven2/org/codehaus/plexus/plexus-interpolation/1.14/plexus-interpolation-1.14.pom
Downloaded: http://repo1.maven.org/maven2/org/codehaus/plexus/plexus-interpolation/1.14/plexus-interpolation-1.14.pom (910 B at 8.6 KB/sec)
Downloading: https://repo.eclipse.org/content/repositories/releases/org/codehaus/plexus/plexus-components/1.1.18/plexus-components-1.1.18.pom
Downloading: http://repo1.maven.org/maven2/org/codehaus/plexus/plexus-components/1.1.18/plexus-components-1.1.18.pom
Downloaded: http://repo1.maven.org/maven2/org/codehaus/plexus/plexus-components/1.1.18/plexus-components-1.1.18.pom (6 KB at 49.8 KB/sec)
Downloading: https://repo.eclipse.org/content/repositories/releases/org/codehaus/plexus/plexus/2.0.7/plexus-2.0.7.pom
Downloading: http://repo1.maven.org/maven2/org/codehaus/plexus/plexus/2.0.7/plexus-2.0.7.pom
Downloaded: http://repo1.maven.org/maven2/org/codehaus/plexus/plexus/2.0.7/plexus-2.0.7.pom (17 KB at 128.0 KB/sec)
Downloading: https://repo.eclipse.org/content/repositories/releases/org/codehaus/plexus/plexus-component-annotations/1.5.5/plexus-component-annotations-1.5.5.pom
Downloading: http://repo1.maven.org/maven2/org/codehaus/plexus/plexus-component-annotations/1.5.5/plexus-component-annotations-1.5.5.pom
Downloaded: http://repo1.maven.org/maven2/org/codehaus/plexus/plexus-component-annotations/1.5.5/plexus-component-annotations-1.5.5.pom (815 B at 7.7 KB/sec)
Downloading: https://repo.eclipse.org/content/repositories/releases/org/codehaus/plexus/plexus-containers/1.5.5/plexus-containers-1.5.5.pom
Downloading: http://repo1.maven.org/maven2/org/codehaus/plexus/plexus-containers/1.5.5/plexus-containers-1.5.5.pom
Downloaded: http://repo1.maven.org/maven2/org/codehaus/plexus/plexus-containers/1.5.5/plexus-containers-1.5.5.pom (5 KB at 39.8 KB/sec)
Downloading: https://repo.eclipse.org/content/repositories/releases/org/sonatype/plexus/plexus-sec-dispatcher/1.3/plexus-sec-dispatcher-1.3.pom
Downloading: http://repo1.maven.org/maven2/org/sonatype/plexus/plexus-sec-dispatcher/1.3/plexus-sec-dispatcher-1.3.pom
Downloaded: http://repo1.maven.org/maven2/org/sonatype/plexus/plexus-sec-dispatcher/1.3/plexus-sec-dispatcher-1.3.pom (3 KB at 28.1 KB/sec)
Downloading: https://repo.eclipse.org/content/repositories/releases/org/sonatype/spice/spice-parent/12/spice-parent-12.pom
Downloading: http://repo1.maven.org/maven2/org/sonatype/spice/spice-parent/12/spice-parent-12.pom
Downloaded: http://repo1.maven.org/maven2/org/sonatype/spice/spice-parent/12/spice-parent-12.pom (7 KB at 64.5 KB/sec)
Downloading: https://repo.eclipse.org/content/repositories/releases/org/sonatype/forge/forge-parent/4/forge-parent-4.pom
Downloading: http://repo1.maven.org/maven2/org/sonatype/forge/forge-parent/4/forge-parent-4.pom
Downloaded: http://repo1.maven.org/maven2/org/sonatype/forge/forge-parent/4/forge-parent-4.pom (9 KB at 79.6 KB/sec)
Downloading: https://repo.eclipse.org/content/repositories/releases/org/sonatype/plexus/plexus-cipher/1.4/plexus-cipher-1.4.pom
Downloading: http://repo1.maven.org/maven2/org/sonatype/plexus/plexus-cipher/1.4/plexus-cipher-1.4.pom
Downloaded: http://repo1.maven.org/maven2/org/sonatype/plexus/plexus-cipher/1.4/plexus-cipher-1.4.pom (3 KB at 19.4 KB/sec)
Downloading: https://repo.eclipse.org/content/repositories/releases/org/apache/maven/maven-repository-metadata/3.0/maven-repository-metadata-3.0.pom
Downloading: http://repo1.maven.org/maven2/org/apache/maven/maven-repository-metadata/3.0/maven-repository-metadata-3.0.pom
Downloaded: http://repo1.maven.org/maven2/org/apache/maven/maven-repository-metadata/3.0/maven-repository-metadata-3.0.pom (2 KB at 18.1 KB/sec)
Downloading: https://repo.eclipse.org/content/repositories/releases/org/apache/maven/maven-artifact/3.0/maven-artifact-3.0.pom
Downloading: http://repo1.maven.org/maven2/org/apache/maven/maven-artifact/3.0/maven-artifact-3.0.pom
Downloaded: http://repo1.maven.org/maven2/org/apache/maven/maven-artifact/3.0/maven-artifact-3.0.pom (2 KB at 18.3 KB/sec)
Downloading: https://repo.eclipse.org/content/repositories/releases/org/apache/maven/maven-plugin-api/3.0/maven-plugin-api-3.0.pom
Downloading: http://repo1.maven.org/maven2/org/apache/maven/maven-plugin-api/3.0/maven-plugin-api-3.0.pom
Downloaded: http://repo1.maven.org/maven2/org/apache/maven/maven-plugin-api/3.0/maven-plugin-api-3.0.pom (3 KB at 21.5 KB/sec)
Downloading: https://repo.eclipse.org/content/repositories/releases/org/sonatype/sisu/sisu-inject-plexus/1.4.2/sisu-inject-plexus-1.4.2.pom
Downloading: http://repo1.maven.org/maven2/org/sonatype/sisu/sisu-inject-plexus/1.4.2/sisu-inject-plexus-1.4.2.pom
Downloaded: http://repo1.maven.org/maven2/org/sonatype/sisu/sisu-inject-plexus/1.4.2/sisu-inject-plexus-1.4.2.pom (6 KB at 49.5 KB/sec)
Downloading: https://repo.eclipse.org/content/repositories/releases/org/sonatype/sisu/inject/guice-plexus/1.4.2/guice-plexus-1.4.2.pom
Downloading: http://repo1.maven.org/maven2/org/sonatype/sisu/inject/guice-plexus/1.4.2/guice-plexus-1.4.2.pom
Downloaded: http://repo1.maven.org/maven2/org/sonatype/sisu/inject/guice-plexus/1.4.2/guice-plexus-1.4.2.pom (4 KB at 29.7 KB/sec)
Downloading: https://repo.eclipse.org/content/repositories/releases/org/sonatype/sisu/inject/guice-bean/1.4.2/guice-bean-1.4.2.pom
Downloading: http://repo1.maven.org/maven2/org/sonatype/sisu/inject/guice-bean/1.4.2/guice-bean-1.4.2.pom
Downloaded: http://repo1.maven.org/maven2/org/sonatype/sisu/inject/guice-bean/1.4.2/guice-bean-1.4.2.pom (3 KB at 24.7 KB/sec)
Downloading: https://repo.eclipse.org/content/repositories/releases/org/sonatype/sisu/sisu-inject/1.4.2/sisu-inject-1.4.2.pom
Downloading: http://repo1.maven.org/maven2/org/sonatype/sisu/sisu-inject/1.4.2/sisu-inject-1.4.2.pom
Downloaded: http://repo1.maven.org/maven2/org/sonatype/sisu/sisu-inject/1.4.2/sisu-inject-1.4.2.pom (2 KB at 11.8 KB/sec)
Downloading: https://repo.eclipse.org/content/repositories/releases/org/sonatype/sisu/sisu-parent/1.4.2/sisu-parent-1.4.2.pom
Downloading: http://repo1.maven.org/maven2/org/sonatype/sisu/sisu-parent/1.4.2/sisu-parent-1.4.2.pom
Downloaded: http://repo1.maven.org/maven2/org/sonatype/sisu/sisu-parent/1.4.2/sisu-parent-1.4.2.pom (8 KB at 72.3 KB/sec)
Downloading: https://repo.eclipse.org/content/repositories/releases/org/sonatype/forge/forge-parent/6/forge-parent-6.pom
Downloading: http://repo1.maven.org/maven2/org/sonatype/forge/forge-parent/6/forge-parent-6.pom
Downloaded: http://repo1.maven.org/maven2/org/sonatype/forge/forge-parent/6/forge-parent-6.pom (11 KB at 99.1 KB/sec)
Downloading: https://repo.eclipse.org/content/repositories/releases/org/codehaus/plexus/plexus-classworlds/2.2.3/plexus-classworlds-2.2.3.pom
Downloading: http://repo1.maven.org/maven2/org/codehaus/plexus/plexus-classworlds/2.2.3/plexus-classworlds-2.2.3.pom
Downloaded: http://repo1.maven.org/maven2/org/codehaus/plexus/plexus-classworlds/2.2.3/plexus-classworlds-2.2.3.pom (4 KB at 37.9 KB/sec)
Downloading: https://repo.eclipse.org/content/repositories/releases/org/codehaus/plexus/plexus/2.0.6/plexus-2.0.6.pom
Downloading: http://repo1.maven.org/maven2/org/codehaus/plexus/plexus/2.0.6/plexus-2.0.6.pom
Downloaded: http://repo1.maven.org/maven2/org/codehaus/plexus/plexus/2.0.6/plexus-2.0.6.pom (17 KB at 125.9 KB/sec)
Downloading: https://repo.eclipse.org/content/repositories/releases/org/sonatype/sisu/sisu-inject-bean/1.4.2/sisu-inject-bean-1.4.2.pom
Downloading: http://repo1.maven.org/maven2/org/sonatype/sisu/sisu-inject-bean/1.4.2/sisu-inject-bean-1.4.2.pom
Downloaded: http://repo1.maven.org/maven2/org/sonatype/sisu/sisu-inject-bean/1.4.2/sisu-inject-bean-1.4.2.pom (6 KB at 50.8 KB/sec)
Downloading: https://repo.eclipse.org/content/repositories/releases/org/sonatype/sisu/sisu-guice/2.1.7/sisu-guice-2.1.7.pom
Downloading: http://repo1.maven.org/maven2/org/sonatype/sisu/sisu-guice/2.1.7/sisu-guice-2.1.7.pom
Downloaded: http://repo1.maven.org/maven2/org/sonatype/sisu/sisu-guice/2.1.7/sisu-guice-2.1.7.pom (11 KB at 102.9 KB/sec)
Downloading: https://repo.eclipse.org/content/repositories/releases/org/apache/maven/maven-model-builder/3.0/maven-model-builder-3.0.pom
Downloading: http://repo1.maven.org/maven2/org/apache/maven/maven-model-builder/3.0/maven-model-builder-3.0.pom
Downloaded: http://repo1.maven.org/maven2/org/apache/maven/maven-model-builder/3.0/maven-model-builder-3.0.pom (3 KB at 20.9 KB/sec)
Downloading: https://repo.eclipse.org/content/repositories/releases/org/apache/maven/maven-aether-provider/3.0/maven-aether-provider-3.0.pom
Downloading: http://repo1.maven.org/maven2/org/apache/maven/maven-aether-provider/3.0/maven-aether-provider-3.0.pom
Downloaded: http://repo1.maven.org/maven2/org/apache/maven/maven-aether-provider/3.0/maven-aether-provider-3.0.pom (3 KB at 22.5 KB/sec)
Downloading: https://repo.eclipse.org/content/repositories/releases/org/sonatype/aether/aether-api/1.7/aether-api-1.7.pom
Downloading: http://repo1.maven.org/maven2/org/sonatype/aether/aether-api/1.7/aether-api-1.7.pom
Downloaded: http://repo1.maven.org/maven2/org/sonatype/aether/aether-api/1.7/aether-api-1.7.pom (2 KB at 16.0 KB/sec)
Downloading: https://repo.eclipse.org/content/repositories/releases/org/sonatype/aether/aether-parent/1.7/aether-parent-1.7.pom
Downloading: http://repo1.maven.org/maven2/org/sonatype/aether/aether-parent/1.7/aether-parent-1.7.pom
Downloaded: http://repo1.maven.org/maven2/org/sonatype/aether/aether-parent/1.7/aether-parent-1.7.pom (8 KB at 72.5 KB/sec)
Downloading: https://repo.eclipse.org/content/repositories/releases/org/sonatype/aether/aether-util/1.7/aether-util-1.7.pom
Downloading: http://repo1.maven.org/maven2/org/sonatype/aether/aether-util/1.7/aether-util-1.7.pom
Downloaded: http://repo1.maven.org/maven2/org/sonatype/aether/aether-util/1.7/aether-util-1.7.pom (3 KB at 19.6 KB/sec)
Downloading: https://repo.eclipse.org/content/repositories/releases/org/sonatype/aether/aether-impl/1.7/aether-impl-1.7.pom
Downloading: http://repo1.maven.org/maven2/org/sonatype/aether/aether-impl/1.7/aether-impl-1.7.pom
Downloaded: http://repo1.maven.org/maven2/org/sonatype/aether/aether-impl/1.7/aether-impl-1.7.pom (4 KB at 34.7 KB/sec)
Downloading: https://repo.eclipse.org/content/repositories/releases/org/sonatype/aether/aether-spi/1.7/aether-spi-1.7.pom
Downloading: http://repo1.maven.org/maven2/org/sonatype/aether/aether-spi/1.7/aether-spi-1.7.pom
Downloaded: http://repo1.maven.org/maven2/org/sonatype/aether/aether-spi/1.7/aether-spi-1.7.pom (2 KB at 15.9 KB/sec)
Downloading: https://repo.eclipse.org/content/repositories/releases/org/codehaus/plexus/plexus-archiver/2.2/plexus-archiver-2.2.pom
Downloading: http://repo1.maven.org/maven2/org/codehaus/plexus/plexus-archiver/2.2/plexus-archiver-2.2.pom
Downloaded: http://repo1.maven.org/maven2/org/codehaus/plexus/plexus-archiver/2.2/plexus-archiver-2.2.pom (4 KB at 30.5 KB/sec)
Downloading: https://repo.eclipse.org/content/repositories/releases/org/codehaus/plexus/plexus-components/1.1.20/plexus-components-1.1.20.pom
Downloading: http://repo1.maven.org/maven2/org/codehaus/plexus/plexus-components/1.1.20/plexus-components-1.1.20.pom
Downloaded: http://repo1.maven.org/maven2/org/codehaus/plexus/plexus-components/1.1.20/plexus-components-1.1.20.pom (3 KB at 28.3 KB/sec)
Downloading: https://repo.eclipse.org/content/repositories/releases/org/codehaus/plexus/plexus-io/2.0.5/plexus-io-2.0.5.pom
Downloading: http://repo1.maven.org/maven2/org/codehaus/plexus/plexus-io/2.0.5/plexus-io-2.0.5.pom
Downloaded: http://repo1.maven.org/maven2/org/codehaus/plexus/plexus-io/2.0.5/plexus-io-2.0.5.pom (3 KB at 21.0 KB/sec)
Downloading: https://repo.eclipse.org/content/repositories/releases/org/codehaus/plexus/plexus-components/1.2/plexus-components-1.2.pom
Downloading: http://repo1.maven.org/maven2/org/codehaus/plexus/plexus-components/1.2/plexus-components-1.2.pom
Downloaded: http://repo1.maven.org/maven2/org/codehaus/plexus/plexus-components/1.2/plexus-components-1.2.pom (3 KB at 28.7 KB/sec)
Downloading: https://repo.eclipse.org/content/repositories/releases/org/codehaus/plexus/plexus/3.2/plexus-3.2.pom
Downloading: http://repo1.maven.org/maven2/org/codehaus/plexus/plexus/3.2/plexus-3.2.pom
Downloaded: http://repo1.maven.org/maven2/org/codehaus/plexus/plexus/3.2/plexus-3.2.pom (19 KB at 139.7 KB/sec)
Downloading: https://repo.eclipse.org/content/repositories/releases/org/eclipse/tycho/org.eclipse.osgi/3.9.0.v20130305-2200/org.eclipse.osgi-3.9.0.v20130305-2200.pom
Downloading: http://repo1.maven.org/maven2/org/eclipse/tycho/org.eclipse.osgi/3.9.0.v20130305-2200/org.eclipse.osgi-3.9.0.v20130305-2200.pom
Downloaded: http://repo1.maven.org/maven2/org/eclipse/tycho/org.eclipse.osgi/3.9.0.v20130305-2200/org.eclipse.osgi-3.9.0.v20130305-2200.pom (2 KB at 14.1 KB/sec)
Downloading: https://repo.eclipse.org/content/repositories/releases/org/eclipse/tycho/sisu-equinox-embedder/0.18.0/sisu-equinox-embedder-0.18.0.pom
Downloading: http://repo1.maven.org/maven2/org/eclipse/tycho/sisu-equinox-embedder/0.18.0/sisu-equinox-embedder-0.18.0.pom
Downloaded: http://repo1.maven.org/maven2/org/eclipse/tycho/sisu-equinox-embedder/0.18.0/sisu-equinox-embedder-0.18.0.pom (2 KB at 17.5 KB/sec)
Downloading: https://repo.eclipse.org/content/repositories/releases/org/eclipse/tycho/sisu-equinox/0.18.0/sisu-equinox-0.18.0.pom
Downloading: http://repo1.maven.org/maven2/org/eclipse/tycho/sisu-equinox/0.18.0/sisu-equinox-0.18.0.pom
Downloaded: http://repo1.maven.org/maven2/org/eclipse/tycho/sisu-equinox/0.18.0/sisu-equinox-0.18.0.pom (2 KB at 9.6 KB/sec)
Downloading: https://repo.eclipse.org/content/repositories/releases/org/eclipse/tycho/sisu-equinox-api/0.18.0/sisu-equinox-api-0.18.0.pom
Downloading: http://repo1.maven.org/maven2/org/eclipse/tycho/sisu-equinox-api/0.18.0/sisu-equinox-api-0.18.0.pom
Downloaded: http://repo1.maven.org/maven2/org/eclipse/tycho/sisu-equinox-api/0.18.0/sisu-equinox-api-0.18.0.pom (2 KB at 16.6 KB/sec)
Downloading: https://repo.eclipse.org/content/repositories/releases/org/eclipse/tycho/tycho-metadata-model/0.18.0/tycho-metadata-model-0.18.0.pom
Downloading: http://repo1.maven.org/maven2/org/eclipse/tycho/tycho-metadata-model/0.18.0/tycho-metadata-model-0.18.0.pom
Downloaded: http://repo1.maven.org/maven2/org/eclipse/tycho/tycho-metadata-model/0.18.0/tycho-metadata-model-0.18.0.pom (2 KB at 12.2 KB/sec)
Downloading: https://repo.eclipse.org/content/repositories/releases/de/pdark/decentxml/1.3/decentxml-1.3.pom
Downloading: http://repo1.maven.org/maven2/de/pdark/decentxml/1.3/decentxml-1.3.pom
Downloaded: http://repo1.maven.org/maven2/de/pdark/decentxml/1.3/decentxml-1.3.pom (7 KB at 58.9 KB/sec)
Downloading: https://repo.eclipse.org/content/repositories/releases/org/eclipse/tycho/tycho-embedder-api/0.18.0/tycho-embedder-api-0.18.0.pom
Downloading: http://repo1.maven.org/maven2/org/eclipse/tycho/tycho-embedder-api/0.18.0/tycho-embedder-api-0.18.0.pom
Downloaded: http://repo1.maven.org/maven2/org/eclipse/tycho/tycho-embedder-api/0.18.0/tycho-embedder-api-0.18.0.pom (3 KB at 19.6 KB/sec)
Downloading: https://repo.eclipse.org/content/repositories/releases/org/eclipse/tycho/org.eclipse.tycho.embedder.shared/0.18.0/org.eclipse.tycho.embedder.shared-0.18.0.pom
Downloading: http://repo1.maven.org/maven2/org/eclipse/tycho/org.eclipse.tycho.embedder.shared/0.18.0/org.eclipse.tycho.embedder.shared-0.18.0.pom
Downloaded: http://repo1.maven.org/maven2/org/eclipse/tycho/org.eclipse.tycho.embedder.shared/0.18.0/org.eclipse.tycho.embedder.shared-0.18.0.pom (2 KB at 10.1 KB/sec)
Downloading: https://repo.eclipse.org/content/repositories/releases/org/eclipse/tycho/tycho-bundles/0.18.0/tycho-bundles-0.18.0.pom
Downloading: http://repo1.maven.org/maven2/org/eclipse/tycho/tycho-bundles/0.18.0/tycho-bundles-0.18.0.pom
Downloaded: http://repo1.maven.org/maven2/org/eclipse/tycho/tycho-bundles/0.18.0/tycho-bundles-0.18.0.pom (3 KB at 25.0 KB/sec)
Downloading: https://repo.eclipse.org/content/repositories/releases/org/eclipse/tycho/org.eclipse.tycho.core.shared/0.18.0/org.eclipse.tycho.core.shared-0.18.0.pom
Downloading: http://repo1.maven.org/maven2/org/eclipse/tycho/org.eclipse.tycho.core.shared/0.18.0/org.eclipse.tycho.core.shared-0.18.0.pom
Downloaded: http://repo1.maven.org/maven2/org/eclipse/tycho/org.eclipse.tycho.core.shared/0.18.0/org.eclipse.tycho.core.shared-0.18.0.pom (2 KB at 9.9 KB/sec)
Downloading: https://repo.eclipse.org/content/repositories/releases/org/eclipse/tycho/tycho-p2-facade/0.18.0/tycho-p2-facade-0.18.0.pom
Downloading: http://repo1.maven.org/maven2/org/eclipse/tycho/tycho-p2-facade/0.18.0/tycho-p2-facade-0.18.0.pom
Downloaded: http://repo1.maven.org/maven2/org/eclipse/tycho/tycho-p2-facade/0.18.0/tycho-p2-facade-0.18.0.pom (3 KB at 22.8 KB/sec)
Downloading: https://repo.eclipse.org/content/repositories/releases/org/eclipse/tycho/tycho-p2/0.18.0/tycho-p2-0.18.0.pom
Downloading: http://repo1.maven.org/maven2/org/eclipse/tycho/tycho-p2/0.18.0/tycho-p2-0.18.0.pom
Downloaded: http://repo1.maven.org/maven2/org/eclipse/tycho/tycho-p2/0.18.0/tycho-p2-0.18.0.pom (2 KB at 10.8 KB/sec)
Downloading: https://repo.eclipse.org/content/repositories/releases/org/eclipse/tycho/org.eclipse.tycho.p2.resolver.shared/0.18.0/org.eclipse.tycho.p2.resolver.shared-0.18.0.pom
Downloading: http://repo1.maven.org/maven2/org/eclipse/tycho/org.eclipse.tycho.p2.resolver.shared/0.18.0/org.eclipse.tycho.p2.resolver.shared-0.18.0.pom
Downloaded: http://repo1.maven.org/maven2/org/eclipse/tycho/org.eclipse.tycho.p2.resolver.shared/0.18.0/org.eclipse.tycho.p2.resolver.shared-0.18.0.pom (2 KB at 10.3 KB/sec)
Downloading: https://repo.eclipse.org/content/repositories/releases/org/eclipse/tycho/org.eclipse.tycho.p2.tools.shared/0.18.0/org.eclipse.tycho.p2.tools.shared-0.18.0.pom
Downloading: http://repo1.maven.org/maven2/org/eclipse/tycho/org.eclipse.tycho.p2.tools.shared/0.18.0/org.eclipse.tycho.p2.tools.shared-0.18.0.pom
Downloaded: http://repo1.maven.org/maven2/org/eclipse/tycho/org.eclipse.tycho.p2.tools.shared/0.18.0/org.eclipse.tycho.p2.tools.shared-0.18.0.pom (2 KB at 10.3 KB/sec)
Downloading: https://repo.eclipse.org/content/repositories/releases/org/eclipse/tycho/tycho-maven-plugin/0.18.0/tycho-maven-plugin-0.18.0.jar
Downloading: https://repo.eclipse.org/content/repositories/releases/org/eclipse/tycho/tycho-core/0.18.0/tycho-core-0.18.0.jar
Downloading: https://repo.eclipse.org/content/repositories/releases/org/sonatype/aether/aether-util/1.7/aether-util-1.7.jar
Downloading: https://repo.eclipse.org/content/repositories/releases/org/codehaus/plexus/plexus-interpolation/1.14/plexus-interpolation-1.14.jar
Downloading: https://repo.eclipse.org/content/repositories/releases/org/sonatype/plexus/plexus-sec-dispatcher/1.3/plexus-sec-dispatcher-1.3.jar
Downloading: https://repo.eclipse.org/content/repositories/releases/org/sonatype/plexus/plexus-cipher/1.4/plexus-cipher-1.4.jar
Downloading: https://repo.eclipse.org/content/repositories/releases/org/codehaus/plexus/plexus-utils/3.0.7/plexus-utils-3.0.7.jar
Downloading: https://repo.eclipse.org/content/repositories/releases/org/codehaus/plexus/plexus-archiver/2.2/plexus-archiver-2.2.jar
Downloading: https://repo.eclipse.org/content/repositories/releases/org/codehaus/plexus/plexus-io/2.0.5/plexus-io-2.0.5.jar
Downloading: https://repo.eclipse.org/content/repositories/releases/org/eclipse/tycho/org.eclipse.osgi/3.9.0.v20130305-2200/org.eclipse.osgi-3.9.0.v20130305-2200.jar
Downloading: https://repo.eclipse.org/content/repositories/releases/org/eclipse/tycho/sisu-equinox-embedder/0.18.0/sisu-equinox-embedder-0.18.0.jar
Downloading: https://repo.eclipse.org/content/repositories/releases/org/eclipse/tycho/sisu-equinox-api/0.18.0/sisu-equinox-api-0.18.0.jar
Downloading: https://repo.eclipse.org/content/repositories/releases/org/eclipse/tycho/tycho-metadata-model/0.18.0/tycho-metadata-model-0.18.0.jar
Downloading: https://repo.eclipse.org/content/repositories/releases/de/pdark/decentxml/1.3/decentxml-1.3.jar
Downloading: https://repo.eclipse.org/content/repositories/releases/org/eclipse/tycho/tycho-embedder-api/0.18.0/tycho-embedder-api-0.18.0.jar
Downloading: https://repo.eclipse.org/content/repositories/releases/org/eclipse/tycho/org.eclipse.tycho.embedder.shared/0.18.0/org.eclipse.tycho.embedder.shared-0.18.0.jar
Downloading: https://repo.eclipse.org/content/repositories/releases/org/eclipse/tycho/org.eclipse.tycho.core.shared/0.18.0/org.eclipse.tycho.core.shared-0.18.0.jar
Downloading: https://repo.eclipse.org/content/repositories/releases/org/eclipse/tycho/tycho-p2-facade/0.18.0/tycho-p2-facade-0.18.0.jar
Downloading: https://repo.eclipse.org/content/repositories/releases/org/codehaus/plexus/plexus-component-annotations/1.5.5/plexus-component-annotations-1.5.5.jar
Downloading: https://repo.eclipse.org/content/repositories/releases/org/sonatype/sisu/sisu-inject-bean/1.4.2/sisu-inject-bean-1.4.2.jar
Downloading: https://repo.eclipse.org/content/repositories/releases/org/sonatype/sisu/sisu-guice/2.1.7/sisu-guice-2.1.7-noaop.jar
Downloading: https://repo.eclipse.org/content/repositories/releases/org/eclipse/tycho/org.eclipse.tycho.p2.resolver.shared/0.18.0/org.eclipse.tycho.p2.resolver.shared-0.18.0.jar
Downloading: https://repo.eclipse.org/content/repositories/releases/org/eclipse/tycho/org.eclipse.tycho.p2.tools.shared/0.18.0/org.eclipse.tycho.p2.tools.shared-0.18.0.jar
Downloading: http://repo1.maven.org/maven2/org/eclipse/tycho/tycho-maven-plugin/0.18.0/tycho-maven-plugin-0.18.0.jar
Downloading: http://repo1.maven.org/maven2/org/eclipse/tycho/tycho-core/0.18.0/tycho-core-0.18.0.jar
Downloading: http://repo1.maven.org/maven2/org/sonatype/aether/aether-util/1.7/aether-util-1.7.jar
Downloading: http://repo1.maven.org/maven2/org/codehaus/plexus/plexus-interpolation/1.14/plexus-interpolation-1.14.jar
Downloading: http://repo1.maven.org/maven2/org/sonatype/plexus/plexus-sec-dispatcher/1.3/plexus-sec-dispatcher-1.3.jar
Downloaded: http://repo1.maven.org/maven2/org/eclipse/tycho/tycho-maven-plugin/0.18.0/tycho-maven-plugin-0.18.0.jar (5 KB at 41.0 KB/sec)
Downloading: http://repo1.maven.org/maven2/org/sonatype/plexus/plexus-cipher/1.4/plexus-cipher-1.4.jar
Downloaded: http://repo1.maven.org/maven2/org/sonatype/plexus/plexus-sec-dispatcher/1.3/plexus-sec-dispatcher-1.3.jar (28 KB at 219.6 KB/sec)
Downloading: http://repo1.maven.org/maven2/org/codehaus/plexus/plexus-utils/3.0.7/plexus-utils-3.0.7.jar
Downloaded: http://repo1.maven.org/maven2/org/codehaus/plexus/plexus-interpolation/1.14/plexus-interpolation-1.14.jar (60 KB at 441.8 KB/sec)
Downloading: http://repo1.maven.org/maven2/org/codehaus/plexus/plexus-archiver/2.2/plexus-archiver-2.2.jar
Downloaded: http://repo1.maven.org/maven2/org/sonatype/plexus/plexus-cipher/1.4/plexus-cipher-1.4.jar (14 KB at 130.5 KB/sec)
Downloading: http://repo1.maven.org/maven2/org/codehaus/plexus/plexus-io/2.0.5/plexus-io-2.0.5.jar
Downloaded: http://repo1.maven.org/maven2/org/sonatype/aether/aether-util/1.7/aether-util-1.7.jar (106 KB at 450.5 KB/sec)
Downloading: http://repo1.maven.org/maven2/org/eclipse/tycho/org.eclipse.osgi/3.9.0.v20130305-2200/org.eclipse.osgi-3.9.0.v20130305-2200.jar
Downloaded: http://repo1.maven.org/maven2/org/eclipse/tycho/tycho-core/0.18.0/tycho-core-0.18.0.jar (176 KB at 702.7 KB/sec)
Downloading: http://repo1.maven.org/maven2/org/eclipse/tycho/sisu-equinox-embedder/0.18.0/sisu-equinox-embedder-0.18.0.jar
Downloaded: http://repo1.maven.org/maven2/org/codehaus/plexus/plexus-utils/3.0.7/plexus-utils-3.0.7.jar (226 KB at 1061.7 KB/sec)
Downloading: http://repo1.maven.org/maven2/org/eclipse/tycho/sisu-equinox-api/0.18.0/sisu-equinox-api-0.18.0.jar
Downloaded: http://repo1.maven.org/maven2/org/eclipse/tycho/sisu-equinox-embedder/0.18.0/sisu-equinox-embedder-0.18.0.jar (13 KB at 106.7 KB/sec)
Downloading: http://repo1.maven.org/maven2/org/eclipse/tycho/tycho-metadata-model/0.18.0/tycho-metadata-model-0.18.0.jar
Downloaded: http://repo1.maven.org/maven2/org/codehaus/plexus/plexus-io/2.0.5/plexus-io-2.0.5.jar (57 KB at 357.9 KB/sec)
Downloading: http://repo1.maven.org/maven2/de/pdark/decentxml/1.3/decentxml-1.3.jar
Downloaded: http://repo1.maven.org/maven2/org/codehaus/plexus/plexus-archiver/2.2/plexus-archiver-2.2.jar (181 KB at 702.9 KB/sec)
Downloading: http://repo1.maven.org/maven2/org/eclipse/tycho/tycho-embedder-api/0.18.0/tycho-embedder-api-0.18.0.jar
Downloaded: http://repo1.maven.org/maven2/org/eclipse/tycho/sisu-equinox-api/0.18.0/sisu-equinox-api-0.18.0.jar (4 KB at 29.5 KB/sec)
Downloading: http://repo1.maven.org/maven2/org/eclipse/tycho/org.eclipse.tycho.embedder.shared/0.18.0/org.eclipse.tycho.embedder.shared-0.18.0.jar
Downloaded: http://repo1.maven.org/maven2/org/eclipse/tycho/tycho-embedder-api/0.18.0/tycho-embedder-api-0.18.0.jar (7 KB at 66.7 KB/sec)
Downloading: http://repo1.maven.org/maven2/org/eclipse/tycho/org.eclipse.tycho.core.shared/0.18.0/org.eclipse.tycho.core.shared-0.18.0.jar
Downloaded: http://repo1.maven.org/maven2/org/eclipse/tycho/tycho-metadata-model/0.18.0/tycho-metadata-model-0.18.0.jar (29 KB at 193.9 KB/sec)
Downloading: http://repo1.maven.org/maven2/org/eclipse/tycho/tycho-p2-facade/0.18.0/tycho-p2-facade-0.18.0.jar
Downloaded: http://repo1.maven.org/maven2/org/eclipse/tycho/org.eclipse.tycho.embedder.shared/0.18.0/org.eclipse.tycho.embedder.shared-0.18.0.jar (7 KB at 71.7 KB/sec)
Downloading: http://repo1.maven.org/maven2/org/codehaus/plexus/plexus-component-annotations/1.5.5/plexus-component-annotations-1.5.5.jar
Downloaded: http://repo1.maven.org/maven2/de/pdark/decentxml/1.3/decentxml-1.3.jar (109 KB at 648.6 KB/sec)
Downloading: http://repo1.maven.org/maven2/org/sonatype/sisu/sisu-inject-bean/1.4.2/sisu-inject-bean-1.4.2.jar
Downloaded: http://repo1.maven.org/maven2/org/codehaus/plexus/plexus-component-annotations/1.5.5/plexus-component-annotations-1.5.5.jar (5 KB at 46.7 KB/sec)
Downloading: http://repo1.maven.org/maven2/org/sonatype/sisu/sisu-guice/2.1.7/sisu-guice-2.1.7-noaop.jar
Downloaded: http://repo1.maven.org/maven2/org/eclipse/tycho/org.eclipse.osgi/3.9.0.v20130305-2200/org.eclipse.osgi-3.9.0.v20130305-2200.jar (1354 KB at 3417.1 KB/sec)
Downloading: http://repo1.maven.org/maven2/org/eclipse/tycho/org.eclipse.tycho.p2.resolver.shared/0.18.0/org.eclipse.tycho.p2.resolver.shared-0.18.0.jar
Downloaded: http://repo1.maven.org/maven2/org/eclipse/tycho/org.eclipse.tycho.core.shared/0.18.0/org.eclipse.tycho.core.shared-0.18.0.jar (30 KB at 203.4 KB/sec)
Downloading: http://repo1.maven.org/maven2/org/eclipse/tycho/org.eclipse.tycho.p2.tools.shared/0.18.0/org.eclipse.tycho.p2.tools.shared-0.18.0.jar
Downloaded: http://repo1.maven.org/maven2/org/eclipse/tycho/tycho-p2-facade/0.18.0/tycho-p2-facade-0.18.0.jar (33 KB at 220.6 KB/sec)
Downloaded: http://repo1.maven.org/maven2/org/eclipse/tycho/org.eclipse.tycho.p2.resolver.shared/0.18.0/org.eclipse.tycho.p2.resolver.shared-0.18.0.jar (25 KB at 186.8 KB/sec)
Downloaded: http://repo1.maven.org/maven2/org/eclipse/tycho/org.eclipse.tycho.p2.tools.shared/0.18.0/org.eclipse.tycho.p2.tools.shared-0.18.0.jar (20 KB at 153.5 KB/sec)
Downloaded: http://repo1.maven.org/maven2/org/sonatype/sisu/sisu-inject-bean/1.4.2/sisu-inject-bean-1.4.2.jar (150 KB at 576.8 KB/sec)
Downloaded: http://repo1.maven.org/maven2/org/sonatype/sisu/sisu-guice/2.1.7/sisu-guice-2.1.7-noaop.jar (461 KB at 1799.5 KB/sec)
[INFO] o.h.m.e.h.MavenExecutionResultHandler - Build failed with exception(s)
[INFO] o.h.m.e.h.MavenExecutionResultHandler - [1] org.apache.maven.project.ProjectBuildingException: Some problems were encountered while processing the POMs:
[FATAL] Non-resolvable parent POM: Could not find artifact org.eclipse.emf.ecp:ecp-parent:pom:1.1.1-SNAPSHOT and 'parent.relativePath' points at wrong local POM @ line 7, column 11
[FATAL] Non-resolvable parent POM: Could not find artifact org.eclipse.emf.ecp:ecp-parent:pom:1.1.1-SNAPSHOT and 'parent.relativePath' points at wrong local POM @ line 7, column 11
[FATAL] Non-resolvable parent POM: Could not find artifact org.eclipse.emf.ecp:ecp-parent:pom:1.1.1-SNAPSHOT and 'parent.relativePath' points at wrong local POM @ line 5, column 11

[DEBUG] Closing connection to remote
[ERROR] The build could not read 3 projects -> [Help 1]
[ERROR]   
[ERROR]   The project org.eclipse.emf.ecp:org.eclipse.emf.ecp.view.separator.ui:1.1.1-SNAPSHOT (/jobs/genie.modeling.ecp/emf-emfclient-simrel/workspace/bundles/org.eclipse.emf.ecp.view.separator.ui/pom.xml) has 1 error
[ERROR]     Non-resolvable parent POM: Could not find artifact org.eclipse.emf.ecp:ecp-parent:pom:1.1.1-SNAPSHOT and 'parent.relativePath' points at wrong local POM @ line 7, column 11 -> [Help 2]
[ERROR]   
[ERROR]   The project org.eclipse.emf.ecp:org.eclipse.emf.ecp.view.groupedgrid.ui:1.1.1-SNAPSHOT (/jobs/genie.modeling.ecp/emf-emfclient-simrel/workspace/bundles/org.eclipse.emf.ecp.view.groupedgrid.ui/pom.xml) has 1 error
[ERROR]     Non-resolvable parent POM: Could not find artifact org.eclipse.emf.ecp:ecp-parent:pom:1.1.1-SNAPSHOT and 'parent.relativePath' points at wrong local POM @ line 7, column 11 -> [Help 2]
[ERROR]   
[ERROR]   The project org.eclipse.emf.ecp:org.eclipse.emf.ecp.view.model.editor.test.feature:1.1.1-SNAPSHOT (/jobs/genie.modeling.ecp/emf-emfclient-simrel/workspace/features/org.eclipse.emf.ecp.view.model.editor.test.feature/pom.xml) has 1 error
[ERROR]     Non-resolvable parent POM: Could not find artifact org.eclipse.emf.ecp:ecp-parent:pom:1.1.1-SNAPSHOT and 'parent.relativePath' points at wrong local POM @ line 5, column 11 -> [Help 2]
[ERROR] 
[ERROR] To see the full stack trace of the errors, re-run Maven with the -e switch.
[ERROR] Re-run Maven using the -X switch to enable full debug logging.
[ERROR] 
[ERROR] For more information about the errors and possible solutions, please read the following articles:
[ERROR] [Help 1] http://cwiki.apache.org/confluence/display/MAVEN/ProjectBuildingException
[ERROR] [Help 2] http://cwiki.apache.org/confluence/display/MAVEN/UnresolvableModelException
[DEBUG] Waiting for process to finish
[DEBUG] Result: 1
Terminating xvnc.
Window manager warning: Fatal IO error 11 (Resource temporarily unavailable) on display ':524'.
[CHECKSTYLE] Skipping publisher since build result is FAILURE
Archiving artifacts
Recording test results
Sending e-mails to: jfaltermeier@eclipsesource.com
Finished: FAILURE