FailedConsole Output

Skipping 304 KB.. Full Log
ache/maven/maven-artifact-manager/2.2.1/maven-artifact-manager-2.2.1.jar (68 kB at 1.0 MB/s)
Progress (2): 26 kB | 12/332 kB
                               
Downloading from eclipse.maven.central.mirror: https://repo.eclipse.org/content/repositories/maven_central/org/apache/maven/maven-artifact/2.2.1/maven-artifact-2.2.1.jar
Progress (2): 26 kB | 16/332 kB
Progress (2): 26 kB | 20/332 kB
Progress (2): 26 kB | 24/332 kB
Progress (2): 26 kB | 28/332 kB
Progress (2): 26 kB | 32/332 kB
Progress (2): 26 kB | 36/332 kB
Progress (2): 26 kB | 40/332 kB
Progress (2): 26 kB | 44/332 kB
Progress (2): 26 kB | 48/332 kB
Progress (2): 26 kB | 52/332 kB
Progress (2): 26 kB | 56/332 kB
Progress (2): 26 kB | 60/332 kB
Progress (2): 26 kB | 64/332 kB
Progress (2): 26 kB | 68/332 kB
Progress (2): 26 kB | 72/332 kB
Progress (2): 26 kB | 76/332 kB
Progress (2): 26 kB | 80/332 kB
Progress (2): 26 kB | 84/332 kB
Progress (2): 26 kB | 88/332 kB
Progress (2): 26 kB | 92/332 kB
Progress (2): 26 kB | 96/332 kB
Progress (2): 26 kB | 100/332 kB
Progress (2): 26 kB | 104/332 kB
Progress (2): 26 kB | 108/332 kB
Progress (2): 26 kB | 112/332 kB
Progress (3): 26 kB | 112/332 kB | 4.1/51 kB
Progress (3): 26 kB | 116/332 kB | 4.1/51 kB
Progress (3): 26 kB | 116/332 kB | 7.7/51 kB
Progress (3): 26 kB | 120/332 kB | 7.7/51 kB
Progress (3): 26 kB | 120/332 kB | 12/51 kB 
Progress (3): 26 kB | 124/332 kB | 12/51 kB
Progress (3): 26 kB | 124/332 kB | 16/51 kB
Progress (3): 26 kB | 128/332 kB | 16/51 kB
Progress (3): 26 kB | 128/332 kB | 20/51 kB
Progress (3): 26 kB | 132/332 kB | 20/51 kB
Progress (3): 26 kB | 132/332 kB | 24/51 kB
Progress (3): 26 kB | 136/332 kB | 24/51 kB
                                           
Downloaded from eclipse.maven.central.mirror: https://repo.eclipse.org/content/repositories/maven_central/org/apache/maven/maven-repository-metadata/2.2.1/maven-repository-metadata-2.2.1.jar (26 kB at 347 kB/s)
Progress (2): 140/332 kB | 24/51 kB
Progress (2): 140/332 kB | 28/51 kB
Progress (2): 144/332 kB | 28/51 kB
                                   
Downloading from eclipse.maven.central.mirror: https://repo.eclipse.org/content/repositories/maven_central/junit/junit/4.8.2/junit-4.8.2.jar
Progress (2): 144/332 kB | 32/51 kB
Progress (2): 148/332 kB | 32/51 kB
Progress (2): 152/332 kB | 32/51 kB
Progress (2): 152/332 kB | 36/51 kB
Progress (2): 152/332 kB | 40/51 kB
Progress (2): 156/332 kB | 40/51 kB
Progress (2): 160/332 kB | 40/51 kB
Progress (2): 160/332 kB | 44/51 kB
Progress (2): 160/332 kB | 48/51 kB
Progress (2): 164/332 kB | 48/51 kB
Progress (2): 164/332 kB | 51 kB   
Progress (2): 168/332 kB | 51 kB
Progress (2): 172/332 kB | 51 kB
Progress (2): 176/332 kB | 51 kB
Progress (2): 180/332 kB | 51 kB
Progress (2): 184/332 kB | 51 kB
Progress (2): 188/332 kB | 51 kB
Progress (2): 192/332 kB | 51 kB
Progress (2): 196/332 kB | 51 kB
Progress (2): 200/332 kB | 51 kB
Progress (2): 204/332 kB | 51 kB
Progress (2): 208/332 kB | 51 kB
Progress (2): 212/332 kB | 51 kB
Progress (2): 216/332 kB | 51 kB
Progress (3): 216/332 kB | 51 kB | 4.1/30 kB
Progress (3): 220/332 kB | 51 kB | 4.1/30 kB
Progress (3): 220/332 kB | 51 kB | 7.7/30 kB
Progress (3): 224/332 kB | 51 kB | 7.7/30 kB
Progress (3): 224/332 kB | 51 kB | 12/30 kB 
Progress (3): 228/332 kB | 51 kB | 12/30 kB
Progress (3): 228/332 kB | 51 kB | 16/30 kB
Progress (3): 232/332 kB | 51 kB | 16/30 kB
Progress (3): 236/332 kB | 51 kB | 16/30 kB
Progress (3): 240/332 kB | 51 kB | 16/30 kB
Progress (3): 244/332 kB | 51 kB | 16/30 kB
Progress (3): 248/332 kB | 51 kB | 16/30 kB
Progress (3): 252/332 kB | 51 kB | 16/30 kB
Progress (3): 256/332 kB | 51 kB | 16/30 kB
Progress (3): 260/332 kB | 51 kB | 16/30 kB
Progress (3): 264/332 kB | 51 kB | 16/30 kB
Progress (3): 268/332 kB | 51 kB | 16/30 kB
Progress (3): 272/332 kB | 51 kB | 16/30 kB
Progress (3): 276/332 kB | 51 kB | 16/30 kB
Progress (3): 280/332 kB | 51 kB | 16/30 kB
Progress (3): 280/332 kB | 51 kB | 20/30 kB
                                           
Downloaded from eclipse.maven.central.mirror: https://repo.eclipse.org/content/repositories/maven_central/org/codehaus/plexus/plexus-interpolation/1.11/plexus-interpolation-1.11.jar (51 kB at 621 kB/s)
Progress (3): 280/332 kB | 20/30 kB | 4.1/80 kB
Progress (3): 284/332 kB | 20/30 kB | 4.1/80 kB
Progress (3): 284/332 kB | 24/30 kB | 4.1/80 kB
Progress (3): 288/332 kB | 24/30 kB | 4.1/80 kB
Progress (3): 288/332 kB | 24/30 kB | 7.7/80 kB
                                               
Downloading from eclipse.maven.central.mirror: https://repo.eclipse.org/content/repositories/maven_central/org/codehaus/plexus/plexus-utils/3.0.22/plexus-utils-3.0.22.jar
Progress (3): 288/332 kB | 24/30 kB | 12/80 kB
Progress (3): 292/332 kB | 24/30 kB | 12/80 kB
Progress (3): 292/332 kB | 28/30 kB | 12/80 kB
Progress (3): 296/332 kB | 28/30 kB | 12/80 kB
Progress (3): 296/332 kB | 28/30 kB | 16/80 kB
Progress (3): 296/332 kB | 30 kB | 16/80 kB   
Progress (3): 300/332 kB | 30 kB | 16/80 kB
Progress (3): 300/332 kB | 30 kB | 20/80 kB
Progress (3): 304/332 kB | 30 kB | 20/80 kB
Progress (3): 304/332 kB | 30 kB | 24/80 kB
Progress (3): 308/332 kB | 30 kB | 24/80 kB
Progress (4): 308/332 kB | 30 kB | 24/80 kB | 4.1/237 kB
Progress (4): 308/332 kB | 30 kB | 28/80 kB | 4.1/237 kB
Progress (4): 312/332 kB | 30 kB | 28/80 kB | 4.1/237 kB
Progress (4): 312/332 kB | 30 kB | 32/80 kB | 4.1/237 kB
Progress (4): 312/332 kB | 30 kB | 32/80 kB | 7.7/237 kB
Progress (4): 316/332 kB | 30 kB | 32/80 kB | 7.7/237 kB
Progress (4): 316/332 kB | 30 kB | 36/80 kB | 7.7/237 kB
Progress (4): 316/332 kB | 30 kB | 36/80 kB | 12/237 kB 
Progress (4): 320/332 kB | 30 kB | 36/80 kB | 12/237 kB
Progress (4): 320/332 kB | 30 kB | 36/80 kB | 16/237 kB
Progress (4): 320/332 kB | 30 kB | 40/80 kB | 16/237 kB
Progress (4): 324/332 kB | 30 kB | 40/80 kB | 16/237 kB
Progress (4): 324/332 kB | 30 kB | 40/80 kB | 20/237 kB
Progress (4): 324/332 kB | 30 kB | 44/80 kB | 20/237 kB
Progress (4): 328/332 kB | 30 kB | 44/80 kB | 20/237 kB
Progress (4): 328/332 kB | 30 kB | 48/80 kB | 20/237 kB
Progress (4): 328/332 kB | 30 kB | 48/80 kB | 24/237 kB
Progress (4): 332 kB | 30 kB | 48/80 kB | 24/237 kB    
Progress (4): 332 kB | 30 kB | 52/80 kB | 24/237 kB
Progress (4): 332 kB | 30 kB | 52/80 kB | 28/237 kB
Progress (4): 332 kB | 30 kB | 56/80 kB | 28/237 kB
Progress (4): 332 kB | 30 kB | 56/80 kB | 32/237 kB
Progress (4): 332 kB | 30 kB | 60/80 kB | 32/237 kB
Progress (4): 332 kB | 30 kB | 60/80 kB | 33/237 kB
Progress (4): 332 kB | 30 kB | 64/80 kB | 33/237 kB
Progress (4): 332 kB | 30 kB | 64/80 kB | 37/237 kB
Progress (4): 332 kB | 30 kB | 68/80 kB | 37/237 kB
Progress (4): 332 kB | 30 kB | 68/80 kB | 41/237 kB
Progress (4): 332 kB | 30 kB | 72/80 kB | 41/237 kB
Progress (4): 332 kB | 30 kB | 72/80 kB | 45/237 kB
Progress (4): 332 kB | 30 kB | 76/80 kB | 45/237 kB
Progress (4): 332 kB | 30 kB | 76/80 kB | 49/237 kB
Progress (4): 332 kB | 30 kB | 80/80 kB | 49/237 kB
Progress (4): 332 kB | 30 kB | 80 kB | 49/237 kB   
Progress (4): 332 kB | 30 kB | 80 kB | 53/237 kB
Progress (5): 332 kB | 30 kB | 80 kB | 53/237 kB | 4.1/245 kB
Progress (5): 332 kB | 30 kB | 80 kB | 57/237 kB | 4.1/245 kB
Progress (5): 332 kB | 30 kB | 80 kB | 57/237 kB | 7.7/245 kB
Progress (5): 332 kB | 30 kB | 80 kB | 61/237 kB | 7.7/245 kB
Progress (5): 332 kB | 30 kB | 80 kB | 61/237 kB | 12/245 kB 
Progress (5): 332 kB | 30 kB | 80 kB | 65/237 kB | 12/245 kB
Progress (5): 332 kB | 30 kB | 80 kB | 65/237 kB | 16/245 kB
Progress (5): 332 kB | 30 kB | 80 kB | 66/237 kB | 16/245 kB
Progress (5): 332 kB | 30 kB | 80 kB | 66/237 kB | 20/245 kB
Progress (5): 332 kB | 30 kB | 80 kB | 70/237 kB | 20/245 kB
                                                            
Downloaded from eclipse.maven.central.mirror: https://repo.eclipse.org/content/repositories/maven_central/org/apache/maven/maven-plugin-registry/2.2.1/maven-plugin-registry-2.2.1.jar (30 kB at 323 kB/s)
Progress (4): 332 kB | 80 kB | 74/237 kB | 20/245 kB
Progress (4): 332 kB | 80 kB | 74/237 kB | 24/245 kB
                                                    
Downloading from eclipse.maven.central.mirror: https://repo.eclipse.org/content/repositories/maven_central/org/apache/maven/shared/file-management/1.2.1/file-management-1.2.1.jar
Progress (4): 332 kB | 80 kB | 74/237 kB | 28/245 kB
Progress (4): 332 kB | 80 kB | 78/237 kB | 28/245 kB
Progress (4): 332 kB | 80 kB | 78/237 kB | 32/245 kB
Progress (4): 332 kB | 80 kB | 82/237 kB | 32/245 kB
Progress (4): 332 kB | 80 kB | 82/237 kB | 36/245 kB
Progress (4): 332 kB | 80 kB | 86/237 kB | 36/245 kB
Progress (4): 332 kB | 80 kB | 86/237 kB | 40/245 kB
Progress (4): 332 kB | 80 kB | 90/237 kB | 40/245 kB
Progress (4): 332 kB | 80 kB | 90/237 kB | 44/245 kB
Progress (4): 332 kB | 80 kB | 94/237 kB | 44/245 kB
Progress (4): 332 kB | 80 kB | 94/237 kB | 48/245 kB
Progress (4): 332 kB | 80 kB | 98/237 kB | 48/245 kB
Progress (4): 332 kB | 80 kB | 98/237 kB | 52/245 kB
Progress (4): 332 kB | 80 kB | 102/237 kB | 52/245 kB
Progress (4): 332 kB | 80 kB | 102/237 kB | 56/245 kB
Progress (4): 332 kB | 80 kB | 106/237 kB | 56/245 kB
Progress (4): 332 kB | 80 kB | 106/237 kB | 60/245 kB
Progress (4): 332 kB | 80 kB | 110/237 kB | 60/245 kB
Progress (4): 332 kB | 80 kB | 110/237 kB | 64/245 kB
Progress (4): 332 kB | 80 kB | 114/237 kB | 64/245 kB
Progress (4): 332 kB | 80 kB | 114/237 kB | 66/245 kB
Progress (4): 332 kB | 80 kB | 118/237 kB | 66/245 kB
Progress (4): 332 kB | 80 kB | 118/237 kB | 70/245 kB
Progress (4): 332 kB | 80 kB | 122/237 kB | 70/245 kB
Progress (4): 332 kB | 80 kB | 122/237 kB | 74/245 kB
Progress (4): 332 kB | 80 kB | 126/237 kB | 74/245 kB
Progress (4): 332 kB | 80 kB | 130/237 kB | 74/245 kB
Progress (4): 332 kB | 80 kB | 130/237 kB | 78/245 kB
Progress (4): 332 kB | 80 kB | 134/237 kB | 78/245 kB
Progress (4): 332 kB | 80 kB | 134/237 kB | 82/245 kB
Progress (4): 332 kB | 80 kB | 138/237 kB | 82/245 kB
Progress (4): 332 kB | 80 kB | 138/237 kB | 86/245 kB
Progress (4): 332 kB | 80 kB | 142/237 kB | 86/245 kB
Progress (4): 332 kB | 80 kB | 142/237 kB | 90/245 kB
Progress (4): 332 kB | 80 kB | 146/237 kB | 90/245 kB
Progress (4): 332 kB | 80 kB | 146/237 kB | 94/245 kB
Progress (4): 332 kB | 80 kB | 150/237 kB | 94/245 kB
Progress (4): 332 kB | 80 kB | 150/237 kB | 98/245 kB
                                                     
Downloaded from eclipse.maven.central.mirror: https://repo.eclipse.org/content/repositories/maven_central/org/apache/maven/maven-artifact/2.2.1/maven-artifact-2.2.1.jar (80 kB at 820 kB/s)
Progress (3): 332 kB | 154/237 kB | 98/245 kB
                                             
Downloading from eclipse.maven.central.mirror: https://repo.eclipse.org/content/repositories/maven_central/org/apache/maven/shared/maven-shared-io/1.1/maven-shared-io-1.1.jar
Downloaded from eclipse.maven.central.mirror: https://repo.eclipse.org/content/repositories/maven_central/backport-util-concurrent/backport-util-concurrent/3.1/backport-util-concurrent-3.1.jar (332 kB at 3.4 MB/s)
Progress (2): 154/237 kB | 98/245 kB
                                    
Downloading from eclipse.maven.central.mirror: https://repo.eclipse.org/content/repositories/maven_central/org/apache/maven/wagon/wagon-provider-api/1.0-alpha-6/wagon-provider-api-1.0-alpha-6.jar
Progress (2): 158/237 kB | 98/245 kB
Progress (3): 158/237 kB | 98/245 kB | 4.1/38 kB
Progress (3): 158/237 kB | 102/245 kB | 4.1/38 kB
Progress (3): 158/237 kB | 102/245 kB | 7.7/38 kB
Progress (3): 162/237 kB | 102/245 kB | 7.7/38 kB
Progress (3): 162/237 kB | 106/245 kB | 7.7/38 kB
Progress (3): 162/237 kB | 106/245 kB | 12/38 kB 
Progress (3): 166/237 kB | 106/245 kB | 12/38 kB
Progress (3): 166/237 kB | 106/245 kB | 16/38 kB
Progress (3): 166/237 kB | 110/245 kB | 16/38 kB
Progress (3): 170/237 kB | 110/245 kB | 16/38 kB
Progress (3): 170/237 kB | 110/245 kB | 20/38 kB
Progress (3): 170/237 kB | 114/245 kB | 20/38 kB
Progress (3): 170/237 kB | 114/245 kB | 24/38 kB
Progress (3): 174/237 kB | 114/245 kB | 24/38 kB
Progress (3): 174/237 kB | 118/245 kB | 24/38 kB
Progress (3): 174/237 kB | 118/245 kB | 28/38 kB
Progress (3): 178/237 kB | 118/245 kB | 28/38 kB
Progress (3): 178/237 kB | 118/245 kB | 32/38 kB
Progress (3): 178/237 kB | 122/245 kB | 32/38 kB
Progress (3): 182/237 kB | 122/245 kB | 32/38 kB
Progress (3): 182/237 kB | 122/245 kB | 36/38 kB
Progress (3): 186/237 kB | 122/245 kB | 36/38 kB
Progress (3): 186/237 kB | 122/245 kB | 38 kB   
Progress (3): 186/237 kB | 126/245 kB | 38 kB
Progress (3): 190/237 kB | 126/245 kB | 38 kB
Progress (3): 190/237 kB | 130/245 kB | 38 kB
Progress (3): 194/237 kB | 130/245 kB | 38 kB
Progress (3): 194/237 kB | 134/245 kB | 38 kB
Progress (3): 198/237 kB | 134/245 kB | 38 kB
Progress (3): 198/237 kB | 138/245 kB | 38 kB
Progress (3): 202/237 kB | 138/245 kB | 38 kB
Progress (3): 202/237 kB | 142/245 kB | 38 kB
Progress (3): 206/237 kB | 142/245 kB | 38 kB
Progress (3): 206/237 kB | 146/245 kB | 38 kB
Progress (3): 210/237 kB | 146/245 kB | 38 kB
Progress (3): 210/237 kB | 150/245 kB | 38 kB
Progress (3): 214/237 kB | 150/245 kB | 38 kB
Progress (3): 214/237 kB | 154/245 kB | 38 kB
Progress (3): 218/237 kB | 154/245 kB | 38 kB
Progress (3): 218/237 kB | 158/245 kB | 38 kB
Progress (3): 222/237 kB | 158/245 kB | 38 kB
Progress (3): 222/237 kB | 162/245 kB | 38 kB
Progress (3): 226/237 kB | 162/245 kB | 38 kB
Progress (3): 226/237 kB | 164/245 kB | 38 kB
Progress (3): 230/237 kB | 164/245 kB | 38 kB
Progress (3): 230/237 kB | 168/245 kB | 38 kB
Progress (3): 234/237 kB | 168/245 kB | 38 kB
Progress (3): 234/237 kB | 172/245 kB | 38 kB
Progress (3): 237 kB | 172/245 kB | 38 kB    
Progress (3): 237 kB | 176/245 kB | 38 kB
Progress (3): 237 kB | 180/245 kB | 38 kB
Progress (3): 237 kB | 184/245 kB | 38 kB
Progress (3): 237 kB | 188/245 kB | 38 kB
Progress (3): 237 kB | 192/245 kB | 38 kB
Progress (3): 237 kB | 196/245 kB | 38 kB
Progress (3): 237 kB | 197/245 kB | 38 kB
Progress (3): 237 kB | 201/245 kB | 38 kB
Progress (3): 237 kB | 205/245 kB | 38 kB
                                         
Downloaded from eclipse.maven.central.mirror: https://repo.eclipse.org/content/repositories/maven_central/org/apache/maven/shared/file-management/1.2.1/file-management-1.2.1.jar (38 kB at 354 kB/s)
Progress (2): 237 kB | 209/245 kB
                                 
Downloading from eclipse.maven.central.mirror: https://repo.eclipse.org/content/repositories/maven_central/org/apache/maven/reporting/maven-reporting-api/2.2.1/maven-reporting-api-2.2.1.jar
Progress (3): 237 kB | 209/245 kB | 4.1/43 kB
Progress (3): 237 kB | 213/245 kB | 4.1/43 kB
Progress (3): 237 kB | 213/245 kB | 7.7/43 kB
Progress (3): 237 kB | 217/245 kB | 7.7/43 kB
Progress (3): 237 kB | 221/245 kB | 7.7/43 kB
Progress (4): 237 kB | 221/245 kB | 7.7/43 kB | 4.1/39 kB
Progress (4): 237 kB | 221/245 kB | 12/43 kB | 4.1/39 kB 
Progress (4): 237 kB | 225/245 kB | 12/43 kB | 4.1/39 kB
Progress (4): 237 kB | 225/245 kB | 16/43 kB | 4.1/39 kB
Progress (4): 237 kB | 225/245 kB | 16/43 kB | 7.7/39 kB
Progress (4): 237 kB | 229/245 kB | 16/43 kB | 7.7/39 kB
Progress (4): 237 kB | 229/245 kB | 20/43 kB | 7.7/39 kB
Progress (4): 237 kB | 229/245 kB | 20/43 kB | 12/39 kB 
Progress (4): 237 kB | 229/245 kB | 20/43 kB | 16/39 kB
Progress (4): 237 kB | 229/245 kB | 24/43 kB | 16/39 kB
Progress (4): 237 kB | 233/245 kB | 24/43 kB | 16/39 kB
Progress (4): 237 kB | 233/245 kB | 24/43 kB | 20/39 kB
Progress (4): 237 kB | 237/245 kB | 24/43 kB | 20/39 kB
Progress (4): 237 kB | 237/245 kB | 28/43 kB | 20/39 kB
Progress (4): 237 kB | 237/245 kB | 28/43 kB | 24/39 kB
Progress (4): 237 kB | 241/245 kB | 28/43 kB | 24/39 kB
Progress (4): 237 kB | 241/245 kB | 28/43 kB | 28/39 kB
Progress (4): 237 kB | 241/245 kB | 32/43 kB | 28/39 kB
Progress (4): 237 kB | 241/245 kB | 32/43 kB | 32/39 kB
Progress (4): 237 kB | 245/245 kB | 32/43 kB | 32/39 kB
Progress (4): 237 kB | 245/245 kB | 36/43 kB | 32/39 kB
Progress (4): 237 kB | 245 kB | 36/43 kB | 32/39 kB    
Progress (4): 237 kB | 245 kB | 36/43 kB | 36/39 kB
Progress (4): 237 kB | 245 kB | 40/43 kB | 36/39 kB
Progress (4): 237 kB | 245 kB | 40/43 kB | 39 kB   
Progress (4): 237 kB | 245 kB | 43 kB | 39 kB   
                                             
Downloaded from eclipse.maven.central.mirror: https://repo.eclipse.org/content/repositories/maven_central/junit/junit/4.8.2/junit-4.8.2.jar (237 kB at 2.1 MB/s)
Downloading from eclipse.maven.central.mirror: https://repo.eclipse.org/content/repositories/maven_central/org/apache/maven/doxia/doxia-sink-api/1.1/doxia-sink-api-1.1.jar
Downloaded from eclipse.maven.central.mirror: https://repo.eclipse.org/content/repositories/maven_central/org/apache/maven/wagon/wagon-provider-api/1.0-alpha-6/wagon-provider-api-1.0-alpha-6.jar (43 kB at 356 kB/s)
Downloading from eclipse.maven.central.mirror: https://repo.eclipse.org/content/repositories/maven_central/org/apache/maven/doxia/doxia-logging-api/1.1/doxia-logging-api-1.1.jar
Downloaded from eclipse.maven.central.mirror: https://repo.eclipse.org/content/repositories/maven_central/org/apache/maven/shared/maven-shared-io/1.1/maven-shared-io-1.1.jar (39 kB at 326 kB/s)
Downloading from eclipse.maven.central.mirror: https://repo.eclipse.org/content/repositories/maven_central/org/apache/maven/reporting/maven-reporting-impl/2.1/maven-reporting-impl-2.1.jar
Downloaded from eclipse.maven.central.mirror: https://repo.eclipse.org/content/repositories/maven_central/org/codehaus/plexus/plexus-utils/3.0.22/plexus-utils-3.0.22.jar (245 kB at 2.0 MB/s)
Progress (1): 4.1/9.8 kB
                        
Downloading from eclipse.maven.central.mirror: https://repo.eclipse.org/content/repositories/maven_central/org/apache/maven/doxia/doxia-core/1.1.2/doxia-core-1.1.2.jar
Progress (2): 4.1/9.8 kB | 4.1/13 kB
Progress (2): 7.7/9.8 kB | 4.1/13 kB
Progress (2): 7.7/9.8 kB | 7.7/13 kB
Progress (2): 9.8 kB | 7.7/13 kB    
Progress (2): 9.8 kB | 12/13 kB 
Progress (2): 9.8 kB | 13 kB   
Progress (3): 9.8 kB | 13 kB | 4.1/11 kB
Progress (3): 9.8 kB | 13 kB | 7.7/11 kB
Progress (3): 9.8 kB | 13 kB | 11 kB    
                                    
Downloaded from eclipse.maven.central.mirror: https://repo.eclipse.org/content/repositories/maven_central/org/apache/maven/doxia/doxia-sink-api/1.1/doxia-sink-api-1.1.jar (13 kB at 97 kB/s)
Downloading from eclipse.maven.central.mirror: https://repo.eclipse.org/content/repositories/maven_central/xerces/xercesImpl/2.8.1/xercesImpl-2.8.1.jar
Downloaded from eclipse.maven.central.mirror: https://repo.eclipse.org/content/repositories/maven_central/org/apache/maven/reporting/maven-reporting-api/2.2.1/maven-reporting-api-2.2.1.jar (9.8 kB at 74 kB/s)
Downloading from eclipse.maven.central.mirror: https://repo.eclipse.org/content/repositories/maven_central/commons-lang/commons-lang/2.4/commons-lang-2.4.jar
Progress (2): 11 kB | 4.1/158 kB
Progress (2): 11 kB | 7.7/158 kB
Progress (2): 11 kB | 12/158 kB 
Progress (2): 11 kB | 16/158 kB
Progress (2): 11 kB | 20/158 kB
Progress (2): 11 kB | 24/158 kB
Progress (2): 11 kB | 28/158 kB
Progress (2): 11 kB | 32/158 kB
Progress (2): 11 kB | 33/158 kB
Progress (3): 11 kB | 33/158 kB | 4.1/17 kB
Progress (3): 11 kB | 37/158 kB | 4.1/17 kB
Progress (3): 11 kB | 37/158 kB | 7.7/17 kB
Progress (3): 11 kB | 41/158 kB | 7.7/17 kB
Progress (3): 11 kB | 41/158 kB | 12/17 kB 
Progress (3): 11 kB | 45/158 kB | 12/17 kB
Progress (3): 11 kB | 45/158 kB | 16/17 kB
Progress (3): 11 kB | 49/158 kB | 16/17 kB
Progress (3): 11 kB | 49/158 kB | 17 kB   
Progress (3): 11 kB | 53/158 kB | 17 kB
Progress (3): 11 kB | 57/158 kB | 17 kB
Progress (3): 11 kB | 61/158 kB | 17 kB
Progress (3): 11 kB | 65/158 kB | 17 kB
Progress (3): 11 kB | 69/158 kB | 17 kB
Progress (3): 11 kB | 73/158 kB | 17 kB
Progress (3): 11 kB | 77/158 kB | 17 kB
Progress (3): 11 kB | 81/158 kB | 17 kB
Progress (3): 11 kB | 85/158 kB | 17 kB
Progress (3): 11 kB | 89/158 kB | 17 kB
Progress (3): 11 kB | 93/158 kB | 17 kB
Progress (3): 11 kB | 97/158 kB | 17 kB
Progress (3): 11 kB | 101/158 kB | 17 kB
Progress (3): 11 kB | 105/158 kB | 17 kB
Progress (3): 11 kB | 109/158 kB | 17 kB
Progress (3): 11 kB | 113/158 kB | 17 kB
Progress (3): 11 kB | 117/158 kB | 17 kB
Progress (3): 11 kB | 121/158 kB | 17 kB
Progress (4): 11 kB | 121/158 kB | 17 kB | 0/1.2 MB
Progress (4): 11 kB | 125/158 kB | 17 kB | 0/1.2 MB
Progress (4): 11 kB | 125/158 kB | 17 kB | 0/1.2 MB
Progress (4): 11 kB | 129/158 kB | 17 kB | 0/1.2 MB
Progress (4): 11 kB | 129/158 kB | 17 kB | 0/1.2 MB
Progress (4): 11 kB | 133/158 kB | 17 kB | 0/1.2 MB
Progress (4): 11 kB | 133/158 kB | 17 kB | 0/1.2 MB
Progress (4): 11 kB | 137/158 kB | 17 kB | 0/1.2 MB
Progress (4): 11 kB | 137/158 kB | 17 kB | 0/1.2 MB
Progress (4): 11 kB | 141/158 kB | 17 kB | 0/1.2 MB
Progress (4): 11 kB | 141/158 kB | 17 kB | 0/1.2 MB
Progress (4): 11 kB | 145/158 kB | 17 kB | 0/1.2 MB
Progress (4): 11 kB | 145/158 kB | 17 kB | 0/1.2 MB
Progress (4): 11 kB | 149/158 kB | 17 kB | 0/1.2 MB
Progress (4): 11 kB | 149/158 kB | 17 kB | 0/1.2 MB
Progress (4): 11 kB | 153/158 kB | 17 kB | 0/1.2 MB
Progress (4): 11 kB | 153/158 kB | 17 kB | 0/1.2 MB
Progress (4): 11 kB | 157/158 kB | 17 kB | 0/1.2 MB
Progress (4): 11 kB | 158 kB | 17 kB | 0/1.2 MB    
Progress (4): 11 kB | 158 kB | 17 kB | 0/1.2 MB
Progress (4): 11 kB | 158 kB | 17 kB | 0/1.2 MB
Progress (4): 11 kB | 158 kB | 17 kB | 0/1.2 MB
Progress (4): 11 kB | 158 kB | 17 kB | 0/1.2 MB
Progress (4): 11 kB | 158 kB | 17 kB | 0.1/1.2 MB
Progress (4): 11 kB | 158 kB | 17 kB | 0.1/1.2 MB
Progress (4): 11 kB | 158 kB | 17 kB | 0.1/1.2 MB
Progress (4): 11 kB | 158 kB | 17 kB | 0.1/1.2 MB
Progress (4): 11 kB | 158 kB | 17 kB | 0.1/1.2 MB
Progress (4): 11 kB | 158 kB | 17 kB | 0.1/1.2 MB
Progress (4): 11 kB | 158 kB | 17 kB | 0.1/1.2 MB
Progress (4): 11 kB | 158 kB | 17 kB | 0.1/1.2 MB
Progress (4): 11 kB | 158 kB | 17 kB | 0.1/1.2 MB
Progress (4): 11 kB | 158 kB | 17 kB | 0.1/1.2 MB
Progress (4): 11 kB | 158 kB | 17 kB | 0.1/1.2 MB
Progress (4): 11 kB | 158 kB | 17 kB | 0.1/1.2 MB
Progress (4): 11 kB | 158 kB | 17 kB | 0.1/1.2 MB
Progress (4): 11 kB | 158 kB | 17 kB | 0.1/1.2 MB
Progress (4): 11 kB | 158 kB | 17 kB | 0.1/1.2 MB
Progress (4): 11 kB | 158 kB | 17 kB | 0.1/1.2 MB
Progress (4): 11 kB | 158 kB | 17 kB | 0.1/1.2 MB
Progress (4): 11 kB | 158 kB | 17 kB | 0.1/1.2 MB
Progress (4): 11 kB | 158 kB | 17 kB | 0.1/1.2 MB
                                                 
Downloaded from eclipse.maven.central.mirror: https://repo.eclipse.org/content/repositories/maven_central/org/apache/maven/reporting/maven-reporting-impl/2.1/maven-reporting-impl-2.1.jar (17 kB at 112 kB/s)
Progress (3): 11 kB | 158 kB | 0.1/1.2 MB
                                         
Downloading from eclipse.maven.central.mirror: https://repo.eclipse.org/content/repositories/maven_central/commons-httpclient/commons-httpclient/3.1/commons-httpclient-3.1.jar
Progress (3): 11 kB | 158 kB | 0.1/1.2 MB
Progress (3): 11 kB | 158 kB | 0.1/1.2 MB
Progress (3): 11 kB | 158 kB | 0.1/1.2 MB
Progress (3): 11 kB | 158 kB | 0.1/1.2 MB
Progress (3): 11 kB | 158 kB | 0.1/1.2 MB
Progress (3): 11 kB | 158 kB | 0.1/1.2 MB
Progress (3): 11 kB | 158 kB | 0.2/1.2 MB
Progress (3): 11 kB | 158 kB | 0.2/1.2 MB
Progress (3): 11 kB | 158 kB | 0.2/1.2 MB
Progress (3): 11 kB | 158 kB | 0.2/1.2 MB
Progress (3): 11 kB | 158 kB | 0.2/1.2 MB
Progress (3): 11 kB | 158 kB | 0.2/1.2 MB
Progress (3): 11 kB | 158 kB | 0.2/1.2 MB
Progress (3): 11 kB | 158 kB | 0.2/1.2 MB
Progress (3): 11 kB | 158 kB | 0.2/1.2 MB
Progress (3): 11 kB | 158 kB | 0.2/1.2 MB
Progress (3): 11 kB | 158 kB | 0.2/1.2 MB
Progress (3): 11 kB | 158 kB | 0.2/1.2 MB
Progress (3): 11 kB | 158 kB | 0.2/1.2 MB
Progress (3): 11 kB | 158 kB | 0.2/1.2 MB
Progress (3): 11 kB | 158 kB | 0.2/1.2 MB
Progress (3): 11 kB | 158 kB | 0.2/1.2 MB
Progress (3): 11 kB | 158 kB | 0.2/1.2 MB
Progress (3): 11 kB | 158 kB | 0.2/1.2 MB
Progress (3): 11 kB | 158 kB | 0.2/1.2 MB
Progress (3): 11 kB | 158 kB | 0.2/1.2 MB
Progress (3): 11 kB | 158 kB | 0.2/1.2 MB
Progress (3): 11 kB | 158 kB | 0.2/1.2 MB
Progress (3): 11 kB | 158 kB | 0.2/1.2 MB
Progress (3): 11 kB | 158 kB | 0.2/1.2 MB
Progress (3): 11 kB | 158 kB | 0.2/1.2 MB
Progress (4): 11 kB | 158 kB | 0.2/1.2 MB | 4.1/262 kB
Progress (4): 11 kB | 158 kB | 0.3/1.2 MB | 4.1/262 kB
Progress (4): 11 kB | 158 kB | 0.3/1.2 MB | 7.7/262 kB
                                                      
Downloaded from eclipse.maven.central.mirror: https://repo.eclipse.org/content/repositories/maven_central/org/apache/maven/doxia/doxia-logging-api/1.1/doxia-logging-api-1.1.jar (11 kB at 73 kB/s)
Progress (3): 158 kB | 0.3/1.2 MB | 12/262 kB
Progress (3): 158 kB | 0.3/1.2 MB | 12/262 kB
Progress (3): 158 kB | 0.3/1.2 MB | 16/262 kB
                                             
Downloading from eclipse.maven.central.mirror: https://repo.eclipse.org/content/repositories/maven_central/commons-codec/commons-codec/1.2/commons-codec-1.2.jar
Progress (3): 158 kB | 0.3/1.2 MB | 20/262 kB
Progress (3): 158 kB | 0.3/1.2 MB | 20/262 kB
                                             
Downloaded from eclipse.maven.central.mirror: https://repo.eclipse.org/content/repositories/maven_central/org/apache/maven/doxia/doxia-core/1.1.2/doxia-core-1.1.2.jar (158 kB at 1.0 MB/s)
Progress (2): 0.3/1.2 MB | 20/262 kB
Progress (2): 0.3/1.2 MB | 24/262 kB
                                    
Downloading from eclipse.maven.central.mirror: https://repo.eclipse.org/content/repositories/maven_central/org/apache/maven/doxia/doxia-site-renderer/1.1.2/doxia-site-renderer-1.1.2.jar
Progress (2): 0.3/1.2 MB | 28/262 kB
Progress (3): 0.3/1.2 MB | 28/262 kB | 4.1/305 kB
Progress (3): 0.3/1.2 MB | 28/262 kB | 4.1/305 kB
Progress (3): 0.3/1.2 MB | 28/262 kB | 7.7/305 kB
Progress (3): 0.3/1.2 MB | 32/262 kB | 7.7/305 kB
Progress (3): 0.3/1.2 MB | 32/262 kB | 12/305 kB 
Progress (3): 0.3/1.2 MB | 32/262 kB | 12/305 kB
Progress (3): 0.3/1.2 MB | 32/262 kB | 16/305 kB
Progress (3): 0.3/1.2 MB | 36/262 kB | 16/305 kB
Progress (3): 0.3/1.2 MB | 36/262 kB | 20/305 kB
Progress (3): 0.3/1.2 MB | 36/262 kB | 20/305 kB
Progress (3): 0.3/1.2 MB | 36/262 kB | 24/305 kB
Progress (3): 0.3/1.2 MB | 40/262 kB | 24/305 kB
Progress (3): 0.3/1.2 MB | 40/262 kB | 24/305 kB
Progress (3): 0.3/1.2 MB | 40/262 kB | 28/305 kB
Progress (3): 0.3/1.2 MB | 44/262 kB | 28/305 kB
Progress (3): 0.3/1.2 MB | 44/262 kB | 32/305 kB
Progress (3): 0.3/1.2 MB | 44/262 kB | 32/305 kB
Progress (3): 0.3/1.2 MB | 48/262 kB | 32/305 kB
Progress (3): 0.3/1.2 MB | 48/262 kB | 32/305 kB
Progress (3): 0.3/1.2 MB | 48/262 kB | 36/305 kB
Progress (3): 0.3/1.2 MB | 52/262 kB | 36/305 kB
Progress (3): 0.3/1.2 MB | 52/262 kB | 40/305 kB
Progress (3): 0.3/1.2 MB | 52/262 kB | 40/305 kB
Progress (3): 0.3/1.2 MB | 56/262 kB | 40/305 kB
Progress (3): 0.3/1.2 MB | 56/262 kB | 44/305 kB
Progress (3): 0.3/1.2 MB | 56/262 kB | 44/305 kB
Progress (3): 0.3/1.2 MB | 56/262 kB | 48/305 kB
Progress (3): 0.3/1.2 MB | 60/262 kB | 48/305 kB
Progress (3): 0.3/1.2 MB | 60/262 kB | 48/305 kB
Progress (3): 0.3/1.2 MB | 64/262 kB | 48/305 kB
Progress (3): 0.3/1.2 MB | 64/262 kB | 52/305 kB
Progress (3): 0.3/1.2 MB | 68/262 kB | 52/305 kB
Progress (3): 0.3/1.2 MB | 68/262 kB | 52/305 kB
Progress (3): 0.3/1.2 MB | 72/262 kB | 52/305 kB
Progress (3): 0.3/1.2 MB | 72/262 kB | 56/305 kB
Progress (3): 0.3/1.2 MB | 72/262 kB | 56/305 kB
Progress (3): 0.3/1.2 MB | 76/262 kB | 56/305 kB
Progress (3): 0.3/1.2 MB | 76/262 kB | 56/305 kB
Progress (3): 0.3/1.2 MB | 76/262 kB | 60/305 kB
Progress (3): 0.3/1.2 MB | 80/262 kB | 60/305 kB
Progress (3): 0.3/1.2 MB | 80/262 kB | 64/305 kB
Progress (3): 0.3/1.2 MB | 80/262 kB | 64/305 kB
Progress (3): 0.3/1.2 MB | 80/262 kB | 68/305 kB
Progress (3): 0.3/1.2 MB | 80/262 kB | 68/305 kB
Progress (3): 0.3/1.2 MB | 84/262 kB | 68/305 kB
Progress (3): 0.3/1.2 MB | 84/262 kB | 72/305 kB
Progress (3): 0.3/1.2 MB | 88/262 kB | 72/305 kB
Progress (3): 0.3/1.2 MB | 88/262 kB | 72/305 kB
Progress (3): 0.3/1.2 MB | 88/262 kB | 76/305 kB
Progress (3): 0.3/1.2 MB | 88/262 kB | 76/305 kB
Progress (3): 0.3/1.2 MB | 92/262 kB | 76/305 kB
Progress (3): 0.3/1.2 MB | 92/262 kB | 80/305 kB
Progress (3): 0.3/1.2 MB | 96/262 kB | 80/305 kB
Progress (3): 0.3/1.2 MB | 96/262 kB | 80/305 kB
Progress (3): 0.3/1.2 MB | 96/262 kB | 84/305 kB
Progress (3): 0.3/1.2 MB | 96/262 kB | 84/305 kB
Progress (3): 0.3/1.2 MB | 100/262 kB | 84/305 kB
Progress (3): 0.3/1.2 MB | 100/262 kB | 84/305 kB
Progress (3): 0.3/1.2 MB | 100/262 kB | 88/305 kB
Progress (3): 0.3/1.2 MB | 100/262 kB | 88/305 kB
Progress (3): 0.3/1.2 MB | 104/262 kB | 88/305 kB
Progress (3): 0.3/1.2 MB | 104/262 kB | 88/305 kB
Progress (3): 0.3/1.2 MB | 104/262 kB | 92/305 kB
Progress (3): 0.3/1.2 MB | 108/262 kB | 92/305 kB
Progress (3): 0.4/1.2 MB | 108/262 kB | 92/305 kB
Progress (3): 0.4/1.2 MB | 112/262 kB | 92/305 kB
Progress (3): 0.4/1.2 MB | 112/262 kB | 96/305 kB
Progress (3): 0.4/1.2 MB | 112/262 kB | 96/305 kB
Progress (3): 0.4/1.2 MB | 116/262 kB | 96/305 kB
Progress (3): 0.4/1.2 MB | 116/262 kB | 96/305 kB
Progress (3): 0.4/1.2 MB | 116/262 kB | 100/305 kB
Progress (3): 0.4/1.2 MB | 120/262 kB | 100/305 kB
Progress (3): 0.4/1.2 MB | 120/262 kB | 104/305 kB
Progress (3): 0.4/1.2 MB | 120/262 kB | 104/305 kB
Progress (3): 0.4/1.2 MB | 124/262 kB | 104/305 kB
Progress (3): 0.4/1.2 MB | 124/262 kB | 104/305 kB
Progress (3): 0.4/1.2 MB | 124/262 kB | 108/305 kB
Progress (3): 0.4/1.2 MB | 128/262 kB | 108/305 kB
Progress (4): 0.4/1.2 MB | 128/262 kB | 108/305 kB | 4.1/30 kB
Progress (4): 0.4/1.2 MB | 128/262 kB | 108/305 kB | 4.1/30 kB
Progress (4): 0.4/1.2 MB | 128/262 kB | 112/305 kB | 4.1/30 kB
Progress (4): 0.4/1.2 MB | 128/262 kB | 112/305 kB | 4.1/30 kB
Progress (4): 0.4/1.2 MB | 128/262 kB | 112/305 kB | 7.7/30 kB
Progress (4): 0.4/1.2 MB | 132/262 kB | 112/305 kB | 7.7/30 kB
Progress (4): 0.4/1.2 MB | 132/262 kB | 112/305 kB | 12/30 kB 
Progress (4): 0.4/1.2 MB | 132/262 kB | 112/305 kB | 12/30 kB
Progress (4): 0.4/1.2 MB | 132/262 kB | 116/305 kB | 12/30 kB
Progress (4): 0.4/1.2 MB | 132/262 kB | 116/305 kB | 12/30 kB
Progress (4): 0.4/1.2 MB | 132/262 kB | 116/305 kB | 16/30 kB
Progress (4): 0.4/1.2 MB | 136/262 kB | 116/305 kB | 16/30 kB
Progress (4): 0.4/1.2 MB | 136/262 kB | 116/305 kB | 20/30 kB
Progress (4): 0.4/1.2 MB | 136/262 kB | 116/305 kB | 20/30 kB
Progress (4): 0.4/1.2 MB | 136/262 kB | 120/305 kB | 20/30 kB
Progress (4): 0.4/1.2 MB | 136/262 kB | 120/305 kB | 20/30 kB
Progress (4): 0.4/1.2 MB | 136/262 kB | 120/305 kB | 24/30 kB
Progress (4): 0.4/1.2 MB | 140/262 kB | 120/305 kB | 24/30 kB
Progress (5): 0.4/1.2 MB | 140/262 kB | 120/305 kB | 24/30 kB | 4.1/50 kB
Progress (5): 0.4/1.2 MB | 140/262 kB | 120/305 kB | 28/30 kB | 4.1/50 kB
Progress (5): 0.4/1.2 MB | 140/262 kB | 120/305 kB | 28/30 kB | 4.1/50 kB
Progress (5): 0.4/1.2 MB | 140/262 kB | 124/305 kB | 28/30 kB | 4.1/50 kB
Progress (5): 0.4/1.2 MB | 140/262 kB | 124/305 kB | 28/30 kB | 4.1/50 kB
Progress (5): 0.4/1.2 MB | 140/262 kB | 124/305 kB | 30 kB | 4.1/50 kB   
Progress (5): 0.4/1.2 MB | 140/262 kB | 124/305 kB | 30 kB | 7.7/50 kB
Progress (5): 0.4/1.2 MB | 144/262 kB | 124/305 kB | 30 kB | 7.7/50 kB
Progress (5): 0.4/1.2 MB | 144/262 kB | 124/305 kB | 30 kB | 12/50 kB 
Progress (5): 0.4/1.2 MB | 144/262 kB | 124/305 kB | 30 kB | 12/50 kB
Progress (5): 0.4/1.2 MB | 144/262 kB | 128/305 kB | 30 kB | 12/50 kB
Progress (5): 0.4/1.2 MB | 144/262 kB | 128/305 kB | 30 kB | 12/50 kB
Progress (5): 0.4/1.2 MB | 148/262 kB | 128/305 kB | 30 kB | 12/50 kB
Progress (5): 0.4/1.2 MB | 148/262 kB | 128/305 kB | 30 kB | 16/50 kB
Progress (5): 0.4/1.2 MB | 152/262 kB | 128/305 kB | 30 kB | 16/50 kB
Progress (5): 0.4/1.2 MB | 152/262 kB | 128/305 kB | 30 kB | 16/50 kB
Progress (5): 0.4/1.2 MB | 152/262 kB | 132/305 kB | 30 kB | 16/50 kB
Progress (5): 0.4/1.2 MB | 152/262 kB | 132/305 kB | 30 kB | 16/50 kB
Progress (5): 0.4/1.2 MB | 156/262 kB | 132/305 kB | 30 kB | 16/50 kB
Progress (5): 0.4/1.2 MB | 156/262 kB | 132/305 kB | 30 kB | 20/50 kB
Progress (5): 0.4/1.2 MB | 160/262 kB | 132/305 kB | 30 kB | 20/50 kB
Progress (5): 0.4/1.2 MB | 160/262 kB | 132/305 kB | 30 kB | 20/50 kB
Progress (5): 0.4/1.2 MB | 160/262 kB | 136/305 kB | 30 kB | 20/50 kB
Progress (5): 0.4/1.2 MB | 160/262 kB | 136/305 kB | 30 kB | 20/50 kB
Progress (5): 0.4/1.2 MB | 164/262 kB | 136/305 kB | 30 kB | 20/50 kB
Progress (5): 0.4/1.2 MB | 164/262 kB | 136/305 kB | 30 kB | 24/50 kB
Progress (5): 0.4/1.2 MB | 168/262 kB | 136/305 kB | 30 kB | 24/50 kB
Progress (5): 0.4/1.2 MB | 168/262 kB | 136/305 kB | 30 kB | 24/50 kB
Progress (5): 0.4/1.2 MB | 168/262 kB | 140/305 kB | 30 kB | 24/50 kB
Progress (5): 0.4/1.2 MB | 168/262 kB | 140/305 kB | 30 kB | 24/50 kB
Progress (5): 0.4/1.2 MB | 172/262 kB | 140/305 kB | 30 kB | 24/50 kB
Progress (5): 0.4/1.2 MB | 172/262 kB | 140/305 kB | 30 kB | 24/50 kB
Progress (5): 0.4/1.2 MB | 172/262 kB | 140/305 kB | 30 kB | 28/50 kB
Progress (5): 0.4/1.2 MB | 172/262 kB | 140/305 kB | 30 kB | 28/50 kB
Progress (5): 0.4/1.2 MB | 176/262 kB | 140/305 kB | 30 kB | 28/50 kB
Progress (5): 0.4/1.2 MB | 176/262 kB | 144/305 kB | 30 kB | 28/50 kB
Progress (5): 0.4/1.2 MB | 180/262 kB | 144/305 kB | 30 kB | 28/50 kB
Progress (5): 0.4/1.2 MB | 180/262 kB | 148/305 kB | 30 kB | 28/50 kB
Progress (5): 0.4/1.2 MB | 180/262 kB | 148/305 kB | 30 kB | 28/50 kB
Progress (5): 0.4/1.2 MB | 180/262 kB | 148/305 kB | 30 kB | 32/50 kB
                                                                     
Downloaded from eclipse.maven.central.mirror: https://repo.eclipse.org/content/repositories/maven_central/commons-codec/commons-codec/1.2/commons-codec-1.2.jar (30 kB at 171 kB/s)
Progress (4): 0.4/1.2 MB | 180/262 kB | 148/305 kB | 36/50 kB
Progress (4): 0.4/1.2 MB | 180/262 kB | 148/305 kB | 36/50 kB
Progress (4): 0.4/1.2 MB | 180/262 kB | 152/305 kB | 36/50 kB
Progress (4): 0.4/1.2 MB | 184/262 kB | 152/305 kB | 36/50 kB
Progress (4): 0.4/1.2 MB | 184/262 kB | 156/305 kB | 36/50 kB
Progress (4): 0.5/1.2 MB | 184/262 kB | 156/305 kB | 36/50 kB
Progress (4): 0.5/1.2 MB | 184/262 kB | 156/305 kB | 40/50 kB
                                                             
Downloading from eclipse.maven.central.mirror: https://repo.eclipse.org/content/repositories/maven_central/org/apache/maven/doxia/doxia-decoration-model/1.1.2/doxia-decoration-model-1.1.2.jar
Progress (4): 0.5/1.2 MB | 184/262 kB | 156/305 kB | 44/50 kB
Progress (4): 0.5/1.2 MB | 184/262 kB | 156/305 kB | 44/50 kB
Progress (4): 0.5/1.2 MB | 184/262 kB | 160/305 kB | 44/50 kB
Progress (4): 0.5/1.2 MB | 188/262 kB | 160/305 kB | 44/50 kB
Progress (4): 0.5/1.2 MB | 188/262 kB | 160/305 kB | 44/50 kB
Progress (4): 0.5/1.2 MB | 192/262 kB | 160/305 kB | 44/50 kB
Progress (4): 0.5/1.2 MB | 192/262 kB | 164/305 kB | 44/50 kB
Progress (4): 0.5/1.2 MB | 196/262 kB | 164/305 kB | 44/50 kB
Progress (4): 0.5/1.2 MB | 196/262 kB | 164/305 kB | 48/50 kB
Progress (4): 0.5/1.2 MB | 200/262 kB | 164/305 kB | 48/50 kB
Progress (4): 0.5/1.2 MB | 200/262 kB | 168/305 kB | 48/50 kB
Progress (4): 0.5/1.2 MB | 200/262 kB | 168/305 kB | 48/50 kB
Progress (4): 0.5/1.2 MB | 200/262 kB | 172/305 kB | 48/50 kB
Progress (4): 0.5/1.2 MB | 204/262 kB | 172/305 kB | 48/50 kB
Progress (4): 0.5/1.2 MB | 204/262 kB | 172/305 kB | 50 kB   
Progress (4): 0.5/1.2 MB | 208/262 kB | 172/305 kB | 50 kB
Progress (4): 0.5/1.2 MB | 208/262 kB | 172/305 kB | 50 kB
Progress (4): 0.5/1.2 MB | 208/262 kB | 176/305 kB | 50 kB
Progress (4): 0.5/1.2 MB | 208/262 kB | 176/305 kB | 50 kB
Progress (4): 0.5/1.2 MB | 212/262 kB | 176/305 kB | 50 kB
Progress (4): 0.5/1.2 MB | 212/262 kB | 180/305 kB | 50 kB
Progress (4): 0.5/1.2 MB | 216/262 kB | 180/305 kB | 50 kB
Progress (4): 0.5/1.2 MB | 216/262 kB | 180/305 kB | 50 kB
Progress (4): 0.5/1.2 MB | 216/262 kB | 184/305 kB | 50 kB
Progress (4): 0.5/1.2 MB | 216/262 kB | 184/305 kB | 50 kB
Progress (4): 0.5/1.2 MB | 220/262 kB | 184/305 kB | 50 kB
Progress (4): 0.5/1.2 MB | 220/262 kB | 188/305 kB | 50 kB
Progress (4): 0.5/1.2 MB | 224/262 kB | 188/305 kB | 50 kB
Progress (4): 0.5/1.2 MB | 224/262 kB | 188/305 kB | 50 kB
Progress (4): 0.5/1.2 MB | 224/262 kB | 192/305 kB | 50 kB
Progress (4): 0.5/1.2 MB | 224/262 kB | 192/305 kB | 50 kB
Progress (4): 0.5/1.2 MB | 228/262 kB | 192/305 kB | 50 kB
Progress (4): 0.5/1.2 MB | 228/262 kB | 196/305 kB | 50 kB
Progress (4): 0.5/1.2 MB | 232/262 kB | 196/305 kB | 50 kB
Progress (4): 0.5/1.2 MB | 232/262 kB | 196/305 kB | 50 kB
Progress (4): 0.5/1.2 MB | 232/262 kB | 200/305 kB | 50 kB
Progress (4): 0.5/1.2 MB | 232/262 kB | 200/305 kB | 50 kB
Progress (4): 0.5/1.2 MB | 236/262 kB | 200/305 kB | 50 kB
Progress (4): 0.5/1.2 MB | 236/262 kB | 204/305 kB | 50 kB
Progress (4): 0.5/1.2 MB | 240/262 kB | 204/305 kB | 50 kB
Progress (4): 0.5/1.2 MB | 240/262 kB | 204/305 kB | 50 kB
Progress (4): 0.5/1.2 MB | 240/262 kB | 208/305 kB | 50 kB
Progress (4): 0.5/1.2 MB | 240/262 kB | 208/305 kB | 50 kB
Progress (4): 0.5/1.2 MB | 244/262 kB | 208/305 kB | 50 kB
Progress (4): 0.5/1.2 MB | 244/262 kB | 212/305 kB | 50 kB
Progress (4): 0.5/1.2 MB | 248/262 kB | 212/305 kB | 50 kB
Progress (4): 0.5/1.2 MB | 248/262 kB | 212/305 kB | 50 kB
Progress (4): 0.5/1.2 MB | 248/262 kB | 216/305 kB | 50 kB
Progress (4): 0.5/1.2 MB | 248/262 kB | 216/305 kB | 50 kB
Progress (4): 0.5/1.2 MB | 252/262 kB | 216/305 kB | 50 kB
Progress (5): 0.5/1.2 MB | 252/262 kB | 216/305 kB | 50 kB | 4.1/52 kB
Progress (5): 0.5/1.2 MB | 252/262 kB | 220/305 kB | 50 kB | 4.1/52 kB
Progress (5): 0.5/1.2 MB | 256/262 kB | 220/305 kB | 50 kB | 4.1/52 kB
Progress (5): 0.5/1.2 MB | 256/262 kB | 220/305 kB | 50 kB | 4.1/52 kB
Progress (5): 0.5/1.2 MB | 260/262 kB | 220/305 kB | 50 kB | 4.1/52 kB
Progress (5): 0.5/1.2 MB | 260/262 kB | 224/305 kB | 50 kB | 4.1/52 kB
Progress (5): 0.5/1.2 MB | 260/262 kB | 224/305 kB | 50 kB | 7.7/52 kB
                                                                      
Downloaded from eclipse.maven.central.mirror: https://repo.eclipse.org/content/repositories/maven_central/org/apache/maven/doxia/doxia-site-renderer/1.1.2/doxia-site-renderer-1.1.2.jar (50 kB at 273 kB/s)
Progress (4): 0.5/1.2 MB | 262 kB | 224/305 kB | 7.7/52 kB
Progress (4): 0.5/1.2 MB | 262 kB | 224/305 kB | 7.7/52 kB
                                                          
Downloading from eclipse.maven.central.mirror: https://repo.eclipse.org/content/repositories/maven_central/org/apache/maven/doxia/doxia-module-xhtml/1.1.2/doxia-module-xhtml-1.1.2.jar
Progress (4): 0.5/1.2 MB | 262 kB | 224/305 kB | 12/52 kB
Progress (4): 0.5/1.2 MB | 262 kB | 228/305 kB | 12/52 kB
Progress (4): 0.5/1.2 MB | 262 kB | 228/305 kB | 16/52 kB
Progress (4): 0.5/1.2 MB | 262 kB | 228/305 kB | 16/52 kB
Progress (4): 0.5/1.2 MB | 262 kB | 232/305 kB | 16/52 kB
Progress (4): 0.5/1.2 MB | 262 kB | 232/305 kB | 16/52 kB
Progress (4): 0.5/1.2 MB | 262 kB | 232/305 kB | 20/52 kB
Progress (4): 0.5/1.2 MB | 262 kB | 236/305 kB | 20/52 kB
Progress (4): 0.5/1.2 MB | 262 kB | 236/305 kB | 24/52 kB
Progress (4): 0.5/1.2 MB | 262 kB | 236/305 kB | 24/52 kB
Progress (4): 0.5/1.2 MB | 262 kB | 240/305 kB | 24/52 kB
Progress (4): 0.5/1.2 MB | 262 kB | 240/305 kB | 24/52 kB
Progress (4): 0.5/1.2 MB | 262 kB | 240/305 kB | 28/52 kB
Progress (4): 0.5/1.2 MB | 262 kB | 244/305 kB | 28/52 kB
Progress (4): 0.5/1.2 MB | 262 kB | 244/305 kB | 32/52 kB
Progress (4): 0.5/1.2 MB | 262 kB | 244/305 kB | 32/52 kB
Progress (4): 0.5/1.2 MB | 262 kB | 248/305 kB | 32/52 kB
Progress (4): 0.5/1.2 MB | 262 kB | 248/305 kB | 32/52 kB
Progress (4): 0.5/1.2 MB | 262 kB | 248/305 kB | 36/52 kB
Progress (4): 0.5/1.2 MB | 262 kB | 252/305 kB | 36/52 kB
Progress (4): 0.5/1.2 MB | 262 kB | 252/305 kB | 40/52 kB
Progress (4): 0.5/1.2 MB | 262 kB | 252/305 kB | 40/52 kB
Progress (4): 0.5/1.2 MB | 262 kB | 256/305 kB | 40/52 kB
Progress (4): 0.6/1.2 MB | 262 kB | 256/305 kB | 40/52 kB
Progress (4): 0.6/1.2 MB | 262 kB | 256/305 kB | 44/52 kB
Progress (4): 0.6/1.2 MB | 262 kB | 260/305 kB | 44/52 kB
Progress (4): 0.6/1.2 MB | 262 kB | 260/305 kB | 48/52 kB
Progress (4): 0.6/1.2 MB | 262 kB | 260/305 kB | 48/52 kB
Progress (4): 0.6/1.2 MB | 262 kB | 260/305 kB | 52/52 kB
Progress (4): 0.6/1.2 MB | 262 kB | 264/305 kB | 52/52 kB
Progress (4): 0.6/1.2 MB | 262 kB | 264/305 kB | 52 kB   
Progress (4): 0.6/1.2 MB | 262 kB | 264/305 kB | 52 kB
Progress (4): 0.6/1.2 MB | 262 kB | 268/305 kB | 52 kB
Progress (4): 0.6/1.2 MB | 262 kB | 272/305 kB | 52 kB
Progress (4): 0.6/1.2 MB | 262 kB | 272/305 kB | 52 kB
Progress (4): 0.6/1.2 MB | 262 kB | 276/305 kB | 52 kB
Progress (4): 0.6/1.2 MB | 262 kB | 276/305 kB | 52 kB
Progress (4): 0.6/1.2 MB | 262 kB | 280/305 kB | 52 kB
Progress (4): 0.6/1.2 MB | 262 kB | 280/305 kB | 52 kB
Progress (4): 0.6/1.2 MB | 262 kB | 284/305 kB | 52 kB
Progress (4): 0.6/1.2 MB | 262 kB | 284/305 kB | 52 kB
Progress (4): 0.6/1.2 MB | 262 kB | 288/305 kB | 52 kB
Progress (4): 0.6/1.2 MB | 262 kB | 288/305 kB | 52 kB
Progress (4): 0.6/1.2 MB | 262 kB | 292/305 kB | 52 kB
Progress (4): 0.6/1.2 MB | 262 kB | 292/305 kB | 52 kB
Progress (4): 0.6/1.2 MB | 262 kB | 296/305 kB | 52 kB
Progress (4): 0.6/1.2 MB | 262 kB | 296/305 kB | 52 kB
Progress (4): 0.6/1.2 MB | 262 kB | 300/305 kB | 52 kB
Progress (4): 0.6/1.2 MB | 262 kB | 300/305 kB | 52 kB
Progress (4): 0.6/1.2 MB | 262 kB | 304/305 kB | 52 kB
                                                      
Downloaded from eclipse.maven.central.mirror: https://repo.eclipse.org/content/repositories/maven_central/commons-lang/commons-lang/2.4/commons-lang-2.4.jar (262 kB at 1.4 MB/s)
Progress (3): 0.6/1.2 MB | 305 kB | 52 kB
Progress (3): 0.6/1.2 MB | 305 kB | 52 kB
                                         
Downloading from eclipse.maven.central.mirror: https://repo.eclipse.org/content/repositories/maven_central/org/apache/maven/doxia/doxia-module-fml/1.1.2/doxia-module-fml-1.1.2.jar
Progress (3): 0.6/1.2 MB | 305 kB | 52 kB
Progress (3): 0.6/1.2 MB | 305 kB | 52 kB
Progress (3): 0.6/1.2 MB | 305 kB | 52 kB
Progress (3): 0.6/1.2 MB | 305 kB | 52 kB
Progress (4): 0.6/1.2 MB | 305 kB | 52 kB | 4.1/15 kB
Progress (4): 0.6/1.2 MB | 305 kB | 52 kB | 4.1/15 kB
Progress (4): 0.6/1.2 MB | 305 kB | 52 kB | 7.7/15 kB
Progress (4): 0.6/1.2 MB | 305 kB | 52 kB | 7.7/15 kB
Progress (4): 0.6/1.2 MB | 305 kB | 52 kB | 12/15 kB 
Progress (4): 0.6/1.2 MB | 305 kB | 52 kB | 12/15 kB
Progress (4): 0.6/1.2 MB | 305 kB | 52 kB | 15 kB   
Progress (4): 0.6/1.2 MB | 305 kB | 52 kB | 15 kB
Progress (4): 0.6/1.2 MB | 305 kB | 52 kB | 15 kB
Progress (4): 0.6/1.2 MB | 305 kB | 52 kB | 15 kB
Progress (4): 0.6/1.2 MB | 305 kB | 52 kB | 15 kB
Progress (4): 0.6/1.2 MB | 305 kB | 52 kB | 15 kB
Progress (4): 0.6/1.2 MB | 305 kB | 52 kB | 15 kB
Progress (4): 0.7/1.2 MB | 305 kB | 52 kB | 15 kB
Progress (4): 0.7/1.2 MB | 305 kB | 52 kB | 15 kB
Progress (4): 0.7/1.2 MB | 305 kB | 52 kB | 15 kB
Progress (4): 0.7/1.2 MB | 305 kB | 52 kB | 15 kB
Progress (4): 0.7/1.2 MB | 305 kB | 52 kB | 15 kB
Progress (4): 0.7/1.2 MB | 305 kB | 52 kB | 15 kB
Progress (4): 0.7/1.2 MB | 305 kB | 52 kB | 15 kB
Progress (4): 0.7/1.2 MB | 305 kB | 52 kB | 15 kB
Progress (4): 0.7/1.2 MB | 305 kB | 52 kB | 15 kB
Progress (4): 0.7/1.2 MB | 305 kB | 52 kB | 15 kB
Progress (4): 0.7/1.2 MB | 305 kB | 52 kB | 15 kB
Progress (4): 0.7/1.2 MB | 305 kB | 52 kB | 15 kB
Progress (4): 0.7/1.2 MB | 305 kB | 52 kB | 15 kB
Progress (4): 0.7/1.2 MB | 305 kB | 52 kB | 15 kB
Progress (4): 0.7/1.2 MB | 305 kB | 52 kB | 15 kB
Progress (4): 0.7/1.2 MB | 305 kB | 52 kB | 15 kB
Progress (4): 0.7/1.2 MB | 305 kB | 52 kB | 15 kB
Progress (4): 0.7/1.2 MB | 305 kB | 52 kB | 15 kB
                                                 
Downloaded from eclipse.maven.central.mirror: https://repo.eclipse.org/content/repositories/maven_central/org/apache/maven/doxia/doxia-decoration-model/1.1.2/doxia-decoration-model-1.1.2.jar (52 kB at 263 kB/s)
Progress (3): 0.7/1.2 MB | 305 kB | 15 kB
                                         
Downloading from eclipse.maven.central.mirror: https://repo.eclipse.org/content/repositories/maven_central/org/codehaus/plexus/plexus-i18n/1.0-beta-7/plexus-i18n-1.0-beta-7.jar
Progress (3): 0.7/1.2 MB | 305 kB | 15 kB
                                         
Downloaded from eclipse.maven.central.mirror: https://repo.eclipse.org/content/repositories/maven_central/commons-httpclient/commons-httpclient/3.1/commons-httpclient-3.1.jar (305 kB at 1.5 MB/s)
Progress (2): 0.7/1.2 MB | 15 kB
                                
Downloading from eclipse.maven.central.mirror: https://repo.eclipse.org/content/repositories/maven_central/org/codehaus/plexus/plexus-velocity/1.1.7/plexus-velocity-1.1.7.jar
Progress (2): 0.7/1.2 MB | 15 kB
Progress (2): 0.7/1.2 MB | 15 kB
Progress (2): 0.7/1.2 MB | 15 kB
Progress (2): 0.7/1.2 MB | 15 kB
Progress (2): 0.8/1.2 MB | 15 kB
                                
Downloaded from eclipse.maven.central.mirror: https://repo.eclipse.org/content/repositories/maven_central/org/apache/maven/doxia/doxia-module-xhtml/1.1.2/doxia-module-xhtml-1.1.2.jar (15 kB at 75 kB/s)
Progress (1): 0.8/1.2 MB
                        
Downloading from eclipse.maven.central.mirror: https://repo.eclipse.org/content/repositories/maven_central/org/apache/velocity/velocity/1.5/velocity-1.5.jar
Progress (1): 0.8/1.2 MB
Progress (1): 0.8/1.2 MB
Progress (1): 0.8/1.2 MB
Progress (1): 0.8/1.2 MB
Progress (1): 0.8/1.2 MB
Progress (2): 0.8/1.2 MB | 4.1/37 kB
Progress (2): 0.8/1.2 MB | 4.1/37 kB
Progress (2): 0.8/1.2 MB | 7.7/37 kB
Progress (2): 0.8/1.2 MB | 7.7/37 kB
Progress (2): 0.8/1.2 MB | 12/37 kB 
Progress (2): 0.8/1.2 MB | 12/37 kB
Progress (2): 0.8/1.2 MB | 16/37 kB
Progress (2): 0.8/1.2 MB | 16/37 kB
Progress (2): 0.8/1.2 MB | 20/37 kB
Progress (2): 0.8/1.2 MB | 20/37 kB
Progress (2): 0.8/1.2 MB | 24/37 kB
Progress (2): 0.8/1.2 MB | 24/37 kB
Progress (2): 0.8/1.2 MB | 28/37 kB
Progress (2): 0.8/1.2 MB | 28/37 kB
Progress (2): 0.8/1.2 MB | 32/37 kB
Progress (2): 0.8/1.2 MB | 32/37 kB
Progress (2): 0.8/1.2 MB | 36/37 kB
Progress (2): 0.8/1.2 MB | 36/37 kB
Progress (2): 0.8/1.2 MB | 37 kB   
Progress (2): 0.8/1.2 MB | 37 kB
Progress (2): 0.8/1.2 MB | 37 kB
Progress (2): 0.8/1.2 MB | 37 kB
Progress (2): 0.8/1.2 MB | 37 kB
Progress (2): 0.8/1.2 MB | 37 kB
Progress (2): 0.8/1.2 MB | 37 kB
Progress (2): 0.8/1.2 MB | 37 kB
Progress (2): 0.8/1.2 MB | 37 kB
Progress (2): 0.8/1.2 MB | 37 kB
Progress (2): 0.9/1.2 MB | 37 kB
Progress (2): 0.9/1.2 MB | 37 kB
Progress (2): 0.9/1.2 MB | 37 kB
Progress (2): 0.9/1.2 MB | 37 kB
Progress (2): 0.9/1.2 MB | 37 kB
Progress (2): 0.9/1.2 MB | 37 kB
Progress (2): 0.9/1.2 MB | 37 kB
Progress (2): 0.9/1.2 MB | 37 kB
Progress (2): 0.9/1.2 MB | 37 kB
Progress (2): 0.9/1.2 MB | 37 kB
Progress (2): 0.9/1.2 MB | 37 kB
Progress (2): 0.9/1.2 MB | 37 kB
Progress (2): 0.9/1.2 MB | 37 kB
Progress (2): 0.9/1.2 MB | 37 kB
Progress (2): 0.9/1.2 MB | 37 kB
Progress (2): 0.9/1.2 MB | 37 kB
Progress (2): 0.9/1.2 MB | 37 kB
Progress (2): 0.9/1.2 MB | 37 kB
Progress (2): 0.9/1.2 MB | 37 kB
Progress (2): 0.9/1.2 MB | 37 kB
Progress (2): 0.9/1.2 MB | 37 kB
Progress (2): 0.9/1.2 MB | 37 kB
Progress (2): 0.9/1.2 MB | 37 kB
Progress (2): 0.9/1.2 MB | 37 kB
Progress (2): 0.9/1.2 MB | 37 kB
Progress (2): 1.0/1.2 MB | 37 kB
Progress (2): 1.0/1.2 MB | 37 kB
Progress (2): 1.0/1.2 MB | 37 kB
Progress (2): 1.0/1.2 MB | 37 kB
Progress (2): 1.0/1.2 MB | 37 kB
Progress (2): 1.0/1.2 MB | 37 kB
Progress (3): 1.0/1.2 MB | 37 kB | 4.1/392 kB
Progress (3): 1.0/1.2 MB | 37 kB | 4.1/392 kB
Progress (3): 1.0/1.2 MB | 37 kB | 7.7/392 kB
Progress (3): 1.0/1.2 MB | 37 kB | 7.7/392 kB
Progress (3): 1.0/1.2 MB | 37 kB | 12/392 kB 
Progress (3): 1.0/1.2 MB | 37 kB | 12/392 kB
Progress (3): 1.0/1.2 MB | 37 kB | 16/392 kB
Progress (4): 1.0/1.2 MB | 37 kB | 16/392 kB | 4.1/7.7 kB
Progress (4): 1.0/1.2 MB | 37 kB | 16/392 kB | 4.1/7.7 kB
Progress (4): 1.0/1.2 MB | 37 kB | 16/392 kB | 7.7 kB    
Progress (4): 1.0/1.2 MB | 37 kB | 20/392 kB | 7.7 kB
                                                     
Downloaded from eclipse.maven.central.mirror: https://repo.eclipse.org/content/repositories/maven_central/org/apache/maven/doxia/doxia-module-fml/1.1.2/doxia-module-fml-1.1.2.jar (37 kB at 176 kB/s)
Progress (3): 1.0/1.2 MB | 20/392 kB | 7.7 kB
                                             
Downloading from eclipse.maven.central.mirror: https://repo.eclipse.org/content/repositories/maven_central/commons-collections/commons-collections/3.2/commons-collections-3.2.jar
Progress (3): 1.0/1.2 MB | 24/392 kB | 7.7 kB
Progress (3): 1.0/1.2 MB | 24/392 kB | 7.7 kB
Progress (3): 1.0/1.2 MB | 24/392 kB | 7.7 kB
Progress (3): 1.0/1.2 MB | 28/392 kB | 7.7 kB
Progress (3): 1.0/1.2 MB | 28/392 kB | 7.7 kB
Progress (4): 1.0/1.2 MB | 28/392 kB | 7.7 kB | 4.1/11 kB
Progress (4): 1.0/1.2 MB | 32/392 kB | 7.7 kB | 4.1/11 kB
Progress (4): 1.0/1.2 MB | 32/392 kB | 7.7 kB | 7.7/11 kB
Progress (4): 1.0/1.2 MB | 32/392 kB | 7.7 kB | 7.7/11 kB
Progress (4): 1.0/1.2 MB | 32/392 kB | 7.7 kB | 11 kB    
Progress (4): 1.0/1.2 MB | 36/392 kB | 7.7 kB | 11 kB
Progress (4): 1.0/1.2 MB | 36/392 kB | 7.7 kB | 11 kB
Progress (4): 1.0/1.2 MB | 40/392 kB | 7.7 kB | 11 kB
Progress (4): 1.0/1.2 MB | 40/392 kB | 7.7 kB | 11 kB
Progress (4): 1.0/1.2 MB | 44/392 kB | 7.7 kB | 11 kB
Progress (4): 1.0/1.2 MB | 44/392 kB | 7.7 kB | 11 kB
Progress (4): 1.0/1.2 MB | 48/392 kB | 7.7 kB | 11 kB
Progress (4): 1.0/1.2 MB | 48/392 kB | 7.7 kB | 11 kB
Progress (4): 1.0/1.2 MB | 52/392 kB | 7.7 kB | 11 kB
Progress (4): 1.0/1.2 MB | 52/392 kB | 7.7 kB | 11 kB
Progress (4): 1.0/1.2 MB | 56/392 kB | 7.7 kB | 11 kB
Progress (4): 1.0/1.2 MB | 56/392 kB | 7.7 kB | 11 kB
Progress (4): 1.0/1.2 MB | 60/392 kB | 7.7 kB | 11 kB
Progress (4): 1.0/1.2 MB | 60/392 kB | 7.7 kB | 11 kB
Progress (4): 1.0/1.2 MB | 64/392 kB | 7.7 kB | 11 kB
Progress (4): 1.0/1.2 MB | 64/392 kB | 7.7 kB | 11 kB
Progress (4): 1.0/1.2 MB | 68/392 kB | 7.7 kB | 11 kB
Progress (4): 1.0/1.2 MB | 68/392 kB | 7.7 kB | 11 kB
Progress (4): 1.0/1.2 MB | 72/392 kB | 7.7 kB | 11 kB
Progress (4): 1.0/1.2 MB | 72/392 kB | 7.7 kB | 11 kB
Progress (4): 1.0/1.2 MB | 76/392 kB | 7.7 kB | 11 kB
Progress (4): 1.1/1.2 MB | 76/392 kB | 7.7 kB | 11 kB
Progress (4): 1.1/1.2 MB | 80/392 kB | 7.7 kB | 11 kB
Progress (4): 1.1/1.2 MB | 80/392 kB | 7.7 kB | 11 kB
Progress (4): 1.1/1.2 MB | 84/392 kB | 7.7 kB | 11 kB
Progress (4): 1.1/1.2 MB | 84/392 kB | 7.7 kB | 11 kB
Progress (4): 1.1/1.2 MB | 88/392 kB | 7.7 kB | 11 kB
Progress (4): 1.1/1.2 MB | 88/392 kB | 7.7 kB | 11 kB
Progress (4): 1.1/1.2 MB | 92/392 kB | 7.7 kB | 11 kB
Progress (4): 1.1/1.2 MB | 92/392 kB | 7.7 kB | 11 kB
Progress (4): 1.1/1.2 MB | 96/392 kB | 7.7 kB | 11 kB
Progress (4): 1.1/1.2 MB | 96/392 kB | 7.7 kB | 11 kB
                                                     
Downloaded from eclipse.maven.central.mirror: https://repo.eclipse.org/content/repositories/maven_central/org/codehaus/plexus/plexus-velocity/1.1.7/plexus-velocity-1.1.7.jar (7.7 kB at 35 kB/s)
Progress (3): 1.1/1.2 MB | 96/392 kB | 11 kB
Progress (3): 1.1/1.2 MB | 100/392 kB | 11 kB
Progress (3): 1.1/1.2 MB | 100/392 kB | 11 kB
                                             
Downloading from eclipse.maven.central.mirror: https://repo.eclipse.org/content/repositories/maven_central/commons-validator/commons-validator/1.2.0/commons-validator-1.2.0.jar
Progress (3): 1.1/1.2 MB | 100/392 kB | 11 kB
Progress (3): 1.1/1.2 MB | 104/392 kB | 11 kB
Progress (3): 1.1/1.2 MB | 104/392 kB | 11 kB
Progress (3): 1.1/1.2 MB | 108/392 kB | 11 kB
Progress (3): 1.1/1.2 MB | 108/392 kB | 11 kB
Progress (3): 1.1/1.2 MB | 112/392 kB | 11 kB
Progress (3): 1.1/1.2 MB | 112/392 kB | 11 kB
Progress (3): 1.1/1.2 MB | 116/392 kB | 11 kB
Progress (3): 1.1/1.2 MB | 116/392 kB | 11 kB
Progress (3): 1.1/1.2 MB | 120/392 kB | 11 kB
Progress (3): 1.1/1.2 MB | 120/392 kB | 11 kB
Progress (3): 1.1/1.2 MB | 124/392 kB | 11 kB
Progress (3): 1.1/1.2 MB | 124/392 kB | 11 kB
Progress (4): 1.1/1.2 MB | 124/392 kB | 11 kB | 4.1/571 kB
Progress (4): 1.1/1.2 MB | 128/392 kB | 11 kB | 4.1/571 kB
Progress (4): 1.1/1.2 MB | 128/392 kB | 11 kB | 4.1/571 kB
Progress (4): 1.1/1.2 MB | 128/392 kB | 11 kB | 7.7/571 kB
Progress (4): 1.1/1.2 MB | 132/392 kB | 11 kB | 7.7/571 kB
Progress (4): 1.1/1.2 MB | 132/392 kB | 11 kB | 7.7/571 kB
Progress (4): 1.1/1.2 MB | 136/392 kB | 11 kB | 7.7/571 kB
Progress (4): 1.1/1.2 MB | 136/392 kB | 11 kB | 12/571 kB 
Progress (4): 1.1/1.2 MB | 136/392 kB | 11 kB | 12/571 kB
Progress (4): 1.1/1.2 MB | 136/392 kB | 11 kB | 16/571 kB
Progress (4): 1.1/1.2 MB | 140/392 kB | 11 kB | 16/571 kB
Progress (4): 1.1/1.2 MB | 140/392 kB | 11 kB | 16/571 kB
Progress (4): 1.1/1.2 MB | 144/392 kB | 11 kB | 16/571 kB
Progress (4): 1.1/1.2 MB | 144/392 kB | 11 kB | 20/571 kB
Progress (4): 1.1/1.2 MB | 144/392 kB | 11 kB | 20/571 kB
Progress (4): 1.1/1.2 MB | 144/392 kB | 11 kB | 24/571 kB
Progress (4): 1.1/1.2 MB | 148/392 kB | 11 kB | 24/571 kB
Progress (4): 1.1/1.2 MB | 148/392 kB | 11 kB | 24/571 kB
Progress (4): 1.1/1.2 MB | 152/392 kB | 11 kB | 24/571 kB
Progress (4): 1.1/1.2 MB | 152/392 kB | 11 kB | 28/571 kB
Progress (4): 1.1/1.2 MB | 152/392 kB | 11 kB | 28/571 kB
Progress (4): 1.1/1.2 MB | 152/392 kB | 11 kB | 32/571 kB
Progress (4): 1.1/1.2 MB | 156/392 kB | 11 kB | 32/571 kB
                                                         
Downloaded from eclipse.maven.central.mirror: https://repo.eclipse.org/content/repositories/maven_central/org/codehaus/plexus/plexus-i18n/1.0-beta-7/plexus-i18n-1.0-beta-7.jar (11 kB at 46 kB/s)
Progress (3): 1.1/1.2 MB | 156/392 kB | 32/571 kB
                                                 
Downloading from eclipse.maven.central.mirror: https://repo.eclipse.org/content/repositories/maven_central/commons-beanutils/commons-beanutils/1.7.0/commons-beanutils-1.7.0.jar
Progress (3): 1.1/1.2 MB | 160/392 kB | 32/571 kB
Progress (3): 1.1/1.2 MB | 160/392 kB | 36/571 kB
Progress (3): 1.1/1.2 MB | 164/392 kB | 36/571 kB
Progress (3): 1.1/1.2 MB | 164/392 kB | 36/571 kB
Progress (3): 1.1/1.2 MB | 168/392 kB | 36/571 kB
Progress (3): 1.1/1.2 MB | 168/392 kB | 40/571 kB
Progress (3): 1.1/1.2 MB | 172/392 kB | 40/571 kB
Progress (3): 1.1/1.2 MB | 172/392 kB | 40/571 kB
Progress (3): 1.1/1.2 MB | 176/392 kB | 40/571 kB
Progress (3): 1.1/1.2 MB | 176/392 kB | 44/571 kB
Progress (3): 1.2/1.2 MB | 176/392 kB | 44/571 kB
Progress (4): 1.2/1.2 MB | 176/392 kB | 44/571 kB | 4.1/91 kB
Progress (4): 1.2/1.2 MB | 176/392 kB | 44/571 kB | 4.1/91 kB
Progress (4): 1.2/1.2 MB | 176/392 kB | 48/571 kB | 4.1/91 kB
Progress (4): 1.2/1.2 MB | 180/392 kB | 48/571 kB | 4.1/91 kB
Progress (4): 1.2/1.2 MB | 180/392 kB | 48/571 kB | 4.1/91 kB
Progress (4): 1.2/1.2 MB | 180/392 kB | 48/571 kB | 7.7/91 kB
Progress (4): 1.2/1.2 MB | 184/392 kB | 48/571 kB | 7.7/91 kB
Progress (4): 1.2/1.2 MB | 184/392 kB | 48/571 kB | 12/91 kB 
Progress (4): 1.2/1.2 MB | 184/392 kB | 52/571 kB | 12/91 kB
Progress (4): 1.2/1.2 MB | 184/392 kB | 52/571 kB | 16/91 kB
Progress (4): 1.2/1.2 MB | 188/392 kB | 52/571 kB | 16/91 kB
Progress (4): 1.2/1.2 MB | 188/392 kB | 52/571 kB | 16/91 kB
Progress (4): 1.2/1.2 MB | 192/392 kB | 52/571 kB | 16/91 kB
Progress (4): 1.2/1.2 MB | 192/392 kB | 52/571 kB | 20/91 kB
Progress (4): 1.2/1.2 MB | 192/392 kB | 56/571 kB | 20/91 kB
Progress (4): 1.2/1.2 MB | 192/392 kB | 56/571 kB | 24/91 kB
Progress (4): 1.2/1.2 MB | 196/392 kB | 56/571 kB | 24/91 kB
Progress (4): 1.2/1.2 MB | 196/392 kB | 56/571 kB | 24/91 kB
Progress (4): 1.2/1.2 MB | 200/392 kB | 56/571 kB | 24/91 kB
Progress (4): 1.2/1.2 MB | 200/392 kB | 56/571 kB | 24/91 kB
Progress (4): 1.2/1.2 MB | 200/392 kB | 56/571 kB | 28/91 kB
Progress (4): 1.2/1.2 MB | 200/392 kB | 60/571 kB | 28/91 kB
Progress (4): 1.2/1.2 MB | 200/392 kB | 60/571 kB | 32/91 kB
Progress (4): 1.2/1.2 MB | 200/392 kB | 60/571 kB | 32/91 kB
Progress (4): 1.2/1.2 MB | 204/392 kB | 60/571 kB | 32/91 kB
Progress (4): 1.2/1.2 MB | 204/392 kB | 60/571 kB | 33/91 kB
Progress (4): 1.2/1.2 MB | 204/392 kB | 64/571 kB | 33/91 kB
Progress (4): 1.2/1.2 MB | 204/392 kB | 64/571 kB | 37/91 kB
Progress (4): 1.2/1.2 MB | 208/392 kB | 64/571 kB | 37/91 kB
Progress (4): 1.2/1.2 MB | 208/392 kB | 64/571 kB | 37/91 kB
Progress (4): 1.2/1.2 MB | 208/392 kB | 64/571 kB | 41/91 kB
Progress (4): 1.2/1.2 MB | 208/392 kB | 68/571 kB | 41/91 kB
Progress (4): 1.2/1.2 MB | 208/392 kB | 68/571 kB | 45/91 kB
Progress (4): 1.2/1.2 MB | 208/392 kB | 68/571 kB | 45/91 kB
Progress (4): 1.2/1.2 MB | 212/392 kB | 68/571 kB | 45/91 kB
Progress (4): 1.2/1.2 MB | 212/392 kB | 68/571 kB | 49/91 kB
Progress (4): 1.2/1.2 MB | 212/392 kB | 72/571 kB | 49/91 kB
Progress (4): 1.2/1.2 MB | 216/392 kB | 72/571 kB | 49/91 kB
Progress (4): 1.2/1.2 MB | 216/392 kB | 72/571 kB | 49/91 kB
Progress (4): 1.2/1.2 MB | 216/392 kB | 76/571 kB | 49/91 kB
Progress (4): 1.2/1.2 MB | 216/392 kB | 76/571 kB | 53/91 kB
Progress (4): 1.2/1.2 MB | 216/392 kB | 80/571 kB | 53/91 kB
Progress (4): 1.2/1.2 MB | 216/392 kB | 80/571 kB | 53/91 kB
Progress (4): 1.2/1.2 MB | 220/392 kB | 80/571 kB | 53/91 kB
Progress (4): 1.2/1.2 MB | 220/392 kB | 84/571 kB | 53/91 kB
Progress (4): 1.2/1.2 MB | 220/392 kB | 84/571 kB | 57/91 kB
Progress (4): 1.2/1.2 MB | 220/392 kB | 88/571 kB | 57/91 kB
Progress (4): 1.2/1.2 MB | 224/392 kB | 88/571 kB | 57/91 kB
Progress (4): 1.2/1.2 MB | 224/392 kB | 88/571 kB | 57/91 kB
Progress (4): 1.2/1.2 MB | 224/392 kB | 92/571 kB | 57/91 kB
Progress (4): 1.2/1.2 MB | 224/392 kB | 92/571 kB | 61/91 kB
Progress (4): 1.2/1.2 MB | 224/392 kB | 96/571 kB | 61/91 kB
Progress (4): 1.2/1.2 MB | 224/392 kB | 96/571 kB | 61/91 kB
Progress (4): 1.2/1.2 MB | 228/392 kB | 96/571 kB | 61/91 kB
Progress (4): 1.2/1.2 MB | 228/392 kB | 100/571 kB | 61/91 kB
Progress (4): 1.2/1.2 MB | 228/392 kB | 100/571 kB | 65/91 kB
Progress (4): 1.2/1.2 MB | 228/392 kB | 104/571 kB | 65/91 kB
Progress (5): 1.2/1.2 MB | 228/392 kB | 104/571 kB | 65/91 kB | 4.1/189 kB
Progress (5): 1.2/1.2 MB | 232/392 kB | 104/571 kB | 65/91 kB | 4.1/189 kB
Progress (5): 1.2/1.2 MB | 232/392 kB | 104/571 kB | 65/91 kB | 4.1/189 kB
Progress (5): 1.2/1.2 MB | 236/392 kB | 104/571 kB | 65/91 kB | 4.1/189 kB
Progress (5): 1.2/1.2 MB | 236/392 kB | 104/571 kB | 65/91 kB | 7.7/189 kB
Progress (5): 1.2/1.2 MB | 236/392 kB | 108/571 kB | 65/91 kB | 7.7/189 kB
Progress (5): 1.2/1.2 MB | 236/392 kB | 108/571 kB | 69/91 kB | 7.7/189 kB
Progress (5): 1.2/1.2 MB | 236/392 kB | 112/571 kB | 69/91 kB | 7.7/189 kB
Progress (5): 1.2/1.2 MB | 236/392 kB | 112/571 kB | 69/91 kB | 12/189 kB 
Progress (5): 1.2/1.2 MB | 240/392 kB | 112/571 kB | 69/91 kB | 12/189 kB
Progress (5): 1.2/1.2 MB | 240/392 kB | 112/571 kB | 69/91 kB | 12/189 kB
Progress (5): 1.2/1.2 MB | 244/392 kB | 112/571 kB | 69/91 kB | 12/189 kB
Progress (5): 1.2/1.2 MB | 244/392 kB | 112/571 kB | 69/91 kB | 16/189 kB
Progress (5): 1.2/1.2 MB | 244/392 kB | 116/571 kB | 69/91 kB | 16/189 kB
Progress (5): 1.2/1.2 MB | 244/392 kB | 116/571 kB | 73/91 kB | 16/189 kB
Progress (5): 1.2/1.2 MB | 244/392 kB | 120/571 kB | 73/91 kB | 16/189 kB
Progress (5): 1.2/1.2 MB | 244/392 kB | 120/571 kB | 73/91 kB | 20/189 kB
Progress (5): 1.2/1.2 MB | 248/392 kB | 120/571 kB | 73/91 kB | 20/189 kB
Progress (5): 1.2 MB | 248/392 kB | 120/571 kB | 73/91 kB | 20/189 kB    
Progress (5): 1.2 MB | 248/392 kB | 120/571 kB | 73/91 kB | 24/189 kB
Progress (5): 1.2 MB | 248/392 kB | 124/571 kB | 73/91 kB | 24/189 kB
Progress (5): 1.2 MB | 248/392 kB | 124/571 kB | 73/91 kB | 28/189 kB
Progress (5): 1.2 MB | 248/392 kB | 124/571 kB | 77/91 kB | 28/189 kB
Progress (5): 1.2 MB | 248/392 kB | 124/571 kB | 77/91 kB | 32/189 kB
Progress (5): 1.2 MB | 248/392 kB | 128/571 kB | 77/91 kB | 32/189 kB
Progress (5): 1.2 MB | 252/392 kB | 128/571 kB | 77/91 kB | 32/189 kB
Progress (5): 1.2 MB | 252/392 kB | 132/571 kB | 77/91 kB | 32/189 kB
Progress (5): 1.2 MB | 252/392 kB | 132/571 kB | 77/91 kB | 33/189 kB
Progress (5): 1.2 MB | 252/392 kB | 132/571 kB | 81/91 kB | 33/189 kB
Progress (5): 1.2 MB | 252/392 kB | 132/571 kB | 81/91 kB | 37/189 kB
Progress (5): 1.2 MB | 252/392 kB | 136/571 kB | 81/91 kB | 37/189 kB
Progress (5): 1.2 MB | 256/392 kB | 136/571 kB | 81/91 kB | 37/189 kB
Progress (5): 1.2 MB | 256/392 kB | 136/571 kB | 81/91 kB | 41/189 kB
Progress (5): 1.2 MB | 256/392 kB | 136/571 kB | 85/91 kB | 41/189 kB
Progress (5): 1.2 MB | 260/392 kB | 136/571 kB | 85/91 kB | 41/189 kB
Progress (5): 1.2 MB | 260/392 kB | 140/571 kB | 85/91 kB | 41/189 kB
Progress (5): 1.2 MB | 264/392 kB | 140/571 kB | 85/91 kB | 41/189 kB
Progress (5): 1.2 MB | 264/392 kB | 140/571 kB | 85/91 kB | 45/189 kB
Progress (5): 1.2 MB | 268/392 kB | 140/571 kB | 85/91 kB | 45/189 kB
Progress (5): 1.2 MB | 268/392 kB | 140/571 kB | 89/91 kB | 45/189 kB
Progress (5): 1.2 MB | 272/392 kB | 140/571 kB | 89/91 kB | 45/189 kB
Progress (5): 1.2 MB | 272/392 kB | 140/571 kB | 89/91 kB | 49/189 kB
Progress (5): 1.2 MB | 272/392 kB | 144/571 kB | 89/91 kB | 49/189 kB
Progress (5): 1.2 MB | 276/392 kB | 144/571 kB | 89/91 kB | 49/189 kB
Progress (5): 1.2 MB | 276/392 kB | 144/571 kB | 91 kB | 49/189 kB   
Progress (5): 1.2 MB | 280/392 kB | 144/571 kB | 91 kB | 49/189 kB
Progress (5): 1.2 MB | 280/392 kB | 148/571 kB | 91 kB | 49/189 kB
Progress (5): 1.2 MB | 280/392 kB | 148/571 kB | 91 kB | 53/189 kB
Progress (5): 1.2 MB | 280/392 kB | 152/571 kB | 91 kB | 53/189 kB
Progress (5): 1.2 MB | 284/392 kB | 152/571 kB | 91 kB | 53/189 kB
Progress (5): 1.2 MB | 284/392 kB | 152/571 kB | 91 kB | 57/189 kB
Progress (5): 1.2 MB | 284/392 kB | 156/571 kB | 91 kB | 57/189 kB
Progress (5): 1.2 MB | 288/392 kB | 156/571 kB | 91 kB | 57/189 kB
Progress (5): 1.2 MB | 288/392 kB | 160/571 kB | 91 kB | 57/189 kB
Progress (5): 1.2 MB | 288/392 kB | 160/571 kB | 91 kB | 61/189 kB
Progress (5): 1.2 MB | 292/392 kB | 160/571 kB | 91 kB | 61/189 kB
Progress (5): 1.2 MB | 292/392 kB | 160/571 kB | 91 kB | 65/189 kB
Progress (5): 1.2 MB | 292/392 kB | 164/571 kB | 91 kB | 65/189 kB
Progress (5): 1.2 MB | 292/392 kB | 164/571 kB | 91 kB | 66/189 kB
Progress (5): 1.2 MB | 296/392 kB | 164/571 kB | 91 kB | 66/189 kB
Progress (5): 1.2 MB | 296/392 kB | 164/571 kB | 91 kB | 70/189 kB
Progress (5): 1.2 MB | 296/392 kB | 168/571 kB | 91 kB | 70/189 kB
Progress (5): 1.2 MB | 296/392 kB | 168/571 kB | 91 kB | 74/189 kB
Progress (5): 1.2 MB | 300/392 kB | 168/571 kB | 91 kB | 74/189 kB
Progress (5): 1.2 MB | 300/392 kB | 172/571 kB | 91 kB | 74/189 kB
                                                                  
Downloaded from eclipse.maven.central.mirror: https://repo.eclipse.org/content/repositories/maven_central/xerces/xercesImpl/2.8.1/xercesImpl-2.8.1.jar (1.2 MB at 5.0 MB/s)
Progress (4): 300/392 kB | 176/571 kB | 91 kB | 74/189 kB
Progress (4): 304/392 kB | 176/571 kB | 91 kB | 74/189 kB
Progress (4): 304/392 kB | 176/571 kB | 91 kB | 78/189 kB
Progress (4): 308/392 kB | 176/571 kB | 91 kB | 78/189 kB
Progress (4): 308/392 kB | 180/571 kB | 91 kB | 78/189 kB
                                                         
Downloading from eclipse.maven.central.mirror: https://repo.eclipse.org/content/repositories/maven_central/commons-digester/commons-digester/1.6/commons-digester-1.6.jar
Progress (4): 308/392 kB | 184/571 kB | 91 kB | 78/189 kB
Progress (4): 312/392 kB | 184/571 kB | 91 kB | 78/189 kB
Progress (4): 312/392 kB | 184/571 kB | 91 kB | 82/189 kB
Progress (4): 316/392 kB | 184/571 kB | 91 kB | 82/189 kB
Progress (4): 316/392 kB | 188/571 kB | 91 kB | 82/189 kB
Progress (4): 320/392 kB | 188/571 kB | 91 kB | 82/189 kB
Progress (4): 320/392 kB | 192/571 kB | 91 kB | 82/189 kB
                                                         
Downloaded from eclipse.maven.central.mirror: https://repo.eclipse.org/content/repositories/maven_central/commons-validator/commons-validator/1.2.0/commons-validator-1.2.0.jar (91 kB at 370 kB/s)
Progress (3): 320/392 kB | 192/571 kB | 86/189 kB
                                                 
Downloading from eclipse.maven.central.mirror: https://repo.eclipse.org/content/repositories/maven_central/commons-logging/commons-logging/1.0.4/commons-logging-1.0.4.jar
Progress (3): 320/392 kB | 196/571 kB | 86/189 kB
Progress (3): 324/392 kB | 196/571 kB | 86/189 kB
Progress (3): 324/392 kB | 200/571 kB | 86/189 kB
Progress (3): 324/392 kB | 200/571 kB | 90/189 kB
Progress (3): 328/392 kB | 200/571 kB | 90/189 kB
Progress (3): 328/392 kB | 204/571 kB | 90/189 kB
Progress (3): 328/392 kB | 204/571 kB | 94/189 kB
Progress (3): 328/392 kB | 208/571 kB | 94/189 kB
Progress (3): 332/392 kB | 208/571 kB | 94/189 kB
Progress (3): 332/392 kB | 208/571 kB | 98/189 kB
Progress (3): 336/392 kB | 208/571 kB | 98/189 kB
Progress (3): 336/392 kB | 212/571 kB | 98/189 kB
Progress (3): 336/392 kB | 212/571 kB | 98/189 kB
Progress (3): 336/392 kB | 216/571 kB | 98/189 kB
Progress (3): 340/392 kB | 216/571 kB | 98/189 kB
Progress (3): 340/392 kB | 216/571 kB | 102/189 kB
Progress (3): 344/392 kB | 216/571 kB | 102/189 kB
Progress (3): 344/392 kB | 220/571 kB | 102/189 kB
Progress (3): 344/392 kB | 220/571 kB | 106/189 kB
Progress (3): 344/392 kB | 224/571 kB | 106/189 kB
Progress (3): 348/392 kB | 224/571 kB | 106/189 kB
Progress (3): 348/392 kB | 224/571 kB | 110/189 kB
Progress (3): 352/392 kB | 224/571 kB | 110/189 kB
Progress (3): 352/392 kB | 228/571 kB | 110/189 kB
Progress (3): 352/392 kB | 228/571 kB | 114/189 kB
Progress (3): 352/392 kB | 232/571 kB | 114/189 kB
Progress (3): 356/392 kB | 232/571 kB | 114/189 kB
Progress (3): 356/392 kB | 232/571 kB | 118/189 kB
Progress (3): 360/392 kB | 232/571 kB | 118/189 kB
Progress (3): 360/392 kB | 236/571 kB | 118/189 kB
Progress (3): 360/392 kB | 236/571 kB | 122/189 kB
Progress (3): 360/392 kB | 240/571 kB | 122/189 kB
Progress (3): 364/392 kB | 240/571 kB | 122/189 kB
Progress (3): 364/392 kB | 240/571 kB | 126/189 kB
Progress (3): 368/392 kB | 240/571 kB | 126/189 kB
Progress (3): 368/392 kB | 244/571 kB | 126/189 kB
Progress (3): 368/392 kB | 244/571 kB | 130/189 kB
Progress (3): 368/392 kB | 248/571 kB | 130/189 kB
Progress (3): 372/392 kB | 248/571 kB | 130/189 kB
Progress (3): 372/392 kB | 248/571 kB | 131/189 kB
Progress (3): 376/392 kB | 248/571 kB | 131/189 kB
Progress (3): 376/392 kB | 252/571 kB | 131/189 kB
Progress (3): 376/392 kB | 252/571 kB | 135/189 kB
Progress (3): 376/392 kB | 256/571 kB | 135/189 kB
Progress (3): 380/392 kB | 256/571 kB | 135/189 kB
Progress (4): 380/392 kB | 256/571 kB | 135/189 kB | 4.1/168 kB
Progress (4): 380/392 kB | 256/571 kB | 139/189 kB | 4.1/168 kB
Progress (4): 384/392 kB | 256/571 kB | 139/189 kB | 4.1/168 kB
Progress (4): 384/392 kB | 260/571 kB | 139/189 kB | 4.1/168 kB
Progress (4): 384/392 kB | 260/571 kB | 143/189 kB | 4.1/168 kB
Progress (4): 384/392 kB | 260/571 kB | 143/189 kB | 7.7/168 kB
Progress (4): 384/392 kB | 260/571 kB | 147/189 kB | 7.7/168 kB
Progress (4): 384/392 kB | 264/571 kB | 147/189 kB | 7.7/168 kB
Progress (4): 388/392 kB | 264/571 kB | 147/189 kB | 7.7/168 kB
Progress (4): 388/392 kB | 264/571 kB | 151/189 kB | 7.7/168 kB
Progress (4): 388/392 kB | 264/571 kB | 151/189 kB | 12/168 kB 
Progress (4): 388/392 kB | 264/571 kB | 155/189 kB | 12/168 kB
Progress (4): 392/392 kB | 264/571 kB | 155/189 kB | 12/168 kB
Progress (4): 392/392 kB | 268/571 kB | 155/189 kB | 12/168 kB
Progress (4): 392 kB | 268/571 kB | 155/189 kB | 12/168 kB    
Progress (4): 392 kB | 268/571 kB | 159/189 kB | 12/168 kB
Progress (4): 392 kB | 268/571 kB | 159/189 kB | 16/168 kB
Progress (4): 392 kB | 268/571 kB | 163/189 kB | 16/168 kB
Progress (4): 392 kB | 272/571 kB | 163/189 kB | 16/168 kB
Progress (4): 392 kB | 272/571 kB | 167/189 kB | 16/168 kB
Progress (4): 392 kB | 272/571 kB | 167/189 kB | 20/168 kB
Progress (4): 392 kB | 276/571 kB | 167/189 kB | 20/168 kB
Progress (4): 392 kB | 276/571 kB | 171/189 kB | 20/168 kB
Progress (4): 392 kB | 280/571 kB | 171/189 kB | 20/168 kB
Progress (4): 392 kB | 280/571 kB | 171/189 kB | 24/168 kB
Progress (4): 392 kB | 280/571 kB | 175/189 kB | 24/168 kB
Progress (4): 392 kB | 280/571 kB | 175/189 kB | 28/168 kB
Progress (4): 392 kB | 284/571 kB | 175/189 kB | 28/168 kB
Progress (4): 392 kB | 284/571 kB | 175/189 kB | 32/168 kB
Progress (4): 392 kB | 284/571 kB | 179/189 kB | 32/168 kB
Progress (4): 392 kB | 284/571 kB | 179/189 kB | 33/168 kB
Progress (4): 392 kB | 284/571 kB | 183/189 kB | 33/168 kB
Progress (4): 392 kB | 288/571 kB | 183/189 kB | 33/168 kB
Progress (4): 392 kB | 288/571 kB | 187/189 kB | 33/168 kB
Progress (4): 392 kB | 288/571 kB | 187/189 kB | 37/168 kB
Progress (4): 392 kB | 292/571 kB | 187/189 kB | 37/168 kB
Progress (4): 392 kB | 292/571 kB | 189 kB | 37/168 kB    
Progress (4): 392 kB | 296/571 kB | 189 kB | 37/168 kB
Progress (4): 392 kB | 296/571 kB | 189 kB | 41/168 kB
Progress (4): 392 kB | 300/571 kB | 189 kB | 41/168 kB
Progress (4): 392 kB | 300/571 kB | 189 kB | 45/168 kB
Progress (4): 392 kB | 304/571 kB | 189 kB | 45/168 kB
Progress (4): 392 kB | 304/571 kB | 189 kB | 49/168 kB
Progress (4): 392 kB | 308/571 kB | 189 kB | 49/168 kB
Progress (4): 392 kB | 308/571 kB | 189 kB | 53/168 kB
Progress (5): 392 kB | 308/571 kB | 189 kB | 53/168 kB | 4.1/38 kB
Progress (5): 392 kB | 308/571 kB | 189 kB | 57/168 kB | 4.1/38 kB
Progress (5): 392 kB | 308/571 kB | 189 kB | 57/168 kB | 7.7/38 kB
Progress (5): 392 kB | 312/571 kB | 189 kB | 57/168 kB | 7.7/38 kB
Progress (5): 392 kB | 312/571 kB | 189 kB | 57/168 kB | 12/38 kB 
Progress (5): 392 kB | 316/571 kB | 189 kB | 57/168 kB | 12/38 kB
Progress (5): 392 kB | 316/571 kB | 189 kB | 61/168 kB | 12/38 kB
Progress (5): 392 kB | 320/571 kB | 189 kB | 61/168 kB | 12/38 kB
Progress (5): 392 kB | 320/571 kB | 189 kB | 61/168 kB | 16/38 kB
Progress (5): 392 kB | 324/571 kB | 189 kB | 61/168 kB | 16/38 kB
Progress (5): 392 kB | 324/571 kB | 189 kB | 65/168 kB | 16/38 kB
Progress (5): 392 kB | 328/571 kB | 189 kB | 65/168 kB | 16/38 kB
Progress (5): 392 kB | 328/571 kB | 189 kB | 65/168 kB | 20/38 kB
Progress (5): 392 kB | 328/571 kB | 189 kB | 69/168 kB | 20/38 kB
Progress (5): 392 kB | 328/571 kB | 189 kB | 69/168 kB | 24/38 kB
Progress (5): 392 kB | 332/571 kB | 189 kB | 69/168 kB | 24/38 kB
Progress (5): 392 kB | 332/571 kB | 189 kB | 73/168 kB | 24/38 kB
Progress (5): 392 kB | 336/571 kB | 189 kB | 73/168 kB | 24/38 kB
Progress (5): 392 kB | 336/571 kB | 189 kB | 73/168 kB | 28/38 kB
Progress (5): 392 kB | 336/571 kB | 189 kB | 77/168 kB | 28/38 kB
Progress (5): 392 kB | 336/571 kB | 189 kB | 77/168 kB | 32/38 kB
                                                                 
Downloaded from eclipse.maven.central.mirror: https://repo.eclipse.org/content/repositories/maven_central/org/apache/velocity/velocity/1.5/velocity-1.5.jar (392 kB at 1.5 MB/s)
Progress (4): 340/571 kB | 189 kB | 77/168 kB | 32/38 kB
                                                        
Downloading from eclipse.maven.central.mirror: https://repo.eclipse.org/content/repositories/maven_central/oro/oro/2.0.8/oro-2.0.8.jar
Progress (4): 340/571 kB | 189 kB | 77/168 kB | 36/38 kB
Progress (4): 340/571 kB | 189 kB | 81/168 kB | 36/38 kB
Progress (4): 340/571 kB | 189 kB | 81/168 kB | 38 kB   
Progress (4): 344/571 kB | 189 kB | 81/168 kB | 38 kB
Progress (4): 344/571 kB | 189 kB | 85/168 kB | 38 kB
Progress (4): 344/571 kB | 189 kB | 89/168 kB | 38 kB
Progress (4): 348/571 kB | 189 kB | 89/168 kB | 38 kB
Progress (4): 348/571 kB | 189 kB | 93/168 kB | 38 kB
Progress (4): 352/571 kB | 189 kB | 93/168 kB | 38 kB
Progress (4): 352/571 kB | 189 kB | 97/168 kB | 38 kB
Progress (4): 356/571 kB | 189 kB | 97/168 kB | 38 kB
Progress (4): 356/571 kB | 189 kB | 101/168 kB | 38 kB
Progress (4): 360/571 kB | 189 kB | 101/168 kB | 38 kB
Progress (4): 360/571 kB | 189 kB | 105/168 kB | 38 kB
Progress (4): 364/571 kB | 189 kB | 105/168 kB | 38 kB
Progress (4): 364/571 kB | 189 kB | 109/168 kB | 38 kB
Progress (4): 368/571 kB | 189 kB | 109/168 kB | 38 kB
Progress (4): 368/571 kB | 189 kB | 113/168 kB | 38 kB
Progress (4): 372/571 kB | 189 kB | 113/168 kB | 38 kB
Progress (4): 372/571 kB | 189 kB | 117/168 kB | 38 kB
Progress (4): 376/571 kB | 189 kB | 117/168 kB | 38 kB
Progress (4): 376/571 kB | 189 kB | 121/168 kB | 38 kB
                                                      
Downloaded from eclipse.maven.central.mirror: https://repo.eclipse.org/content/repositories/maven_central/commons-beanutils/commons-beanutils/1.7.0/commons-beanutils-1.7.0.jar (189 kB at 712 kB/s)
Progress (3): 376/571 kB | 125/168 kB | 38 kB
Progress (3): 380/571 kB | 125/168 kB | 38 kB
Progress (3): 380/571 kB | 129/168 kB | 38 kB
                                             
Downloading from eclipse.maven.central.mirror: https://repo.eclipse.org/content/repositories/maven_central/xml-apis/xml-apis/1.0.b2/xml-apis-1.0.b2.jar
Progress (3): 380/571 kB | 133/168 kB | 38 kB
Progress (3): 384/571 kB | 133/168 kB | 38 kB
Progress (3): 384/571 kB | 137/168 kB | 38 kB
Progress (3): 388/571 kB | 137/168 kB | 38 kB
Progress (3): 388/571 kB | 141/168 kB | 38 kB
Progress (3): 392/571 kB | 141/168 kB | 38 kB
Progress (3): 392/571 kB | 145/168 kB | 38 kB
Progress (3): 396/571 kB | 145/168 kB | 38 kB
Progress (3): 396/571 kB | 149/168 kB | 38 kB
Progress (3): 400/571 kB | 149/168 kB | 38 kB
Progress (3): 400/571 kB | 153/168 kB | 38 kB
Progress (3): 404/571 kB | 153/168 kB | 38 kB
Progress (3): 404/571 kB | 157/168 kB | 38 kB
Progress (3): 408/571 kB | 157/168 kB | 38 kB
Progress (3): 408/571 kB | 161/168 kB | 38 kB
Progress (3): 412/571 kB | 161/168 kB | 38 kB
Progress (3): 412/571 kB | 165/168 kB | 38 kB
Progress (3): 416/571 kB | 165/168 kB | 38 kB
Progress (3): 416/571 kB | 168 kB | 38 kB    
Progress (3): 420/571 kB | 168 kB | 38 kB
Progress (3): 424/571 kB | 168 kB | 38 kB
Progress (3): 428/571 kB | 168 kB | 38 kB
Progress (3): 432/571 kB | 168 kB | 38 kB
Progress (3): 436/571 kB | 168 kB | 38 kB
Progress (3): 440/571 kB | 168 kB | 38 kB
Progress (3): 444/571 kB | 168 kB | 38 kB
Progress (3): 448/571 kB | 168 kB | 38 kB
                                         
Downloaded from eclipse.maven.central.mirror: https://repo.eclipse.org/content/repositories/maven_central/commons-logging/commons-logging/1.0.4/commons-logging-1.0.4.jar (38 kB at 141 kB/s)
Progress (2): 452/571 kB | 168 kB
                                 
Downloading from eclipse.maven.central.mirror: https://repo.eclipse.org/content/repositories/maven_central/org/jacoco/org.jacoco.agent/0.7.9/org.jacoco.agent-0.7.9-runtime.jar
Progress (2): 456/571 kB | 168 kB
Progress (2): 460/571 kB | 168 kB
Progress (2): 464/571 kB | 168 kB
Progress (2): 468/571 kB | 168 kB
Progress (2): 472/571 kB | 168 kB
Progress (2): 476/571 kB | 168 kB
Progress (2): 480/571 kB | 168 kB
Progress (2): 484/571 kB | 168 kB
Progress (2): 488/571 kB | 168 kB
Progress (2): 492/571 kB | 168 kB
Progress (2): 496/571 kB | 168 kB
Progress (2): 500/571 kB | 168 kB
Progress (2): 504/571 kB | 168 kB
Progress (2): 508/571 kB | 168 kB
Progress (2): 512/571 kB | 168 kB
Progress (2): 516/571 kB | 168 kB
Progress (2): 520/571 kB | 168 kB
Progress (2): 524/571 kB | 168 kB
Progress (2): 528/571 kB | 168 kB
Progress (2): 532/571 kB | 168 kB
Progress (2): 536/571 kB | 168 kB
Progress (2): 540/571 kB | 168 kB
Progress (2): 544/571 kB | 168 kB
Progress (2): 548/571 kB | 168 kB
                                 
Downloaded from eclipse.maven.central.mirror: https://repo.eclipse.org/content/repositories/maven_central/commons-digester/commons-digester/1.6/commons-digester-1.6.jar (168 kB at 615 kB/s)
Progress (1): 552/571 kB
                        
Downloading from eclipse.maven.central.mirror: https://repo.eclipse.org/content/repositories/maven_central/org/jacoco/org.jacoco.core/0.7.9/org.jacoco.core-0.7.9.jar
Progress (1): 556/571 kB
Progress (1): 560/571 kB
Progress (1): 564/571 kB
Progress (1): 568/571 kB
Progress (1): 571 kB    
                    
Downloaded from eclipse.maven.central.mirror: https://repo.eclipse.org/content/repositories/maven_central/commons-collections/commons-collections/3.2/commons-collections-3.2.jar (571 kB at 2.0 MB/s)
Downloading from eclipse.maven.central.mirror: https://repo.eclipse.org/content/repositories/maven_central/org/ow2/asm/asm-debug-all/5.2/asm-debug-all-5.2.jar
Progress (1): 4.1/65 kB
Progress (1): 7.7/65 kB
Progress (2): 7.7/65 kB | 4.1/109 kB
Progress (2): 7.7/65 kB | 7.7/109 kB
Progress (2): 7.7/65 kB | 12/109 kB 
Progress (2): 12/65 kB | 12/109 kB 
Progress (2): 12/65 kB | 16/109 kB
Progress (2): 16/65 kB | 16/109 kB
Progress (2): 16/65 kB | 20/109 kB
Progress (2): 16/65 kB | 24/109 kB
Progress (2): 20/65 kB | 24/109 kB
Progress (2): 20/65 kB | 28/109 kB
Progress (2): 24/65 kB | 28/109 kB
Progress (2): 24/65 kB | 32/109 kB
Progress (2): 28/65 kB | 32/109 kB
Progress (2): 28/65 kB | 36/109 kB
Progress (2): 32/65 kB | 36/109 kB
Progress (2): 32/65 kB | 40/109 kB
Progress (2): 36/65 kB | 40/109 kB
Progress (2): 36/65 kB | 44/109 kB
Progress (2): 40/65 kB | 44/109 kB
Progress (2): 40/65 kB | 48/109 kB
Progress (2): 44/65 kB | 48/109 kB
Progress (2): 44/65 kB | 52/109 kB
Progress (2): 48/65 kB | 52/109 kB
Progress (2): 48/65 kB | 56/109 kB
Progress (2): 52/65 kB | 56/109 kB
Progress (2): 52/65 kB | 60/109 kB
Progress (2): 56/65 kB | 60/109 kB
Progress (2): 56/65 kB | 64/109 kB
Progress (2): 60/65 kB | 64/109 kB
Progress (2): 60/65 kB | 68/109 kB
Progress (2): 64/65 kB | 68/109 kB
Progress (2): 64/65 kB | 72/109 kB
Progress (2): 65 kB | 72/109 kB   
Progress (2): 65 kB | 76/109 kB
Progress (2): 65 kB | 80/109 kB
Progress (2): 65 kB | 84/109 kB
Progress (2): 65 kB | 88/109 kB
Progress (2): 65 kB | 92/109 kB
Progress (2): 65 kB | 96/109 kB
Progress (2): 65 kB | 100/109 kB
Progress (2): 65 kB | 104/109 kB
Progress (2): 65 kB | 108/109 kB
Progress (2): 65 kB | 109 kB    
                            
Downloaded from eclipse.maven.central.mirror: https://repo.eclipse.org/content/repositories/maven_central/oro/oro/2.0.8/oro-2.0.8.jar (65 kB at 223 kB/s)
Downloading from eclipse.maven.central.mirror: https://repo.eclipse.org/content/repositories/maven_central/org/jacoco/org.jacoco.report/0.7.9/org.jacoco.report-0.7.9.jar
Downloaded from eclipse.maven.central.mirror: https://repo.eclipse.org/content/repositories/maven_central/xml-apis/xml-apis/1.0.b2/xml-apis-1.0.b2.jar (109 kB at 372 kB/s)
Progress (1): 4.1/259 kB
Progress (1): 7.7/259 kB
Progress (1): 12/259 kB 
Progress (1): 16/259 kB
Progress (1): 20/259 kB
Progress (1): 24/259 kB
Progress (1): 28/259 kB
Progress (1): 32/259 kB
Progress (1): 33/259 kB
Progress (1): 37/259 kB
Progress (1): 41/259 kB
Progress (1): 45/259 kB
Progress (1): 49/259 kB
Progress (1): 53/259 kB
Progress (1): 57/259 kB
Progress (1): 61/259 kB
Progress (1): 65/259 kB
Progress (1): 69/259 kB
Progress (1): 73/259 kB
Progress (1): 77/259 kB
Progress (1): 81/259 kB
Progress (1): 85/259 kB
Progress (1): 89/259 kB
Progress (1): 93/259 kB
Progress (1): 97/259 kB
Progress (1): 101/259 kB
Progress (1): 105/259 kB
Progress (1): 109/259 kB
Progress (1): 113/259 kB
Progress (1): 117/259 kB
Progress (1): 121/259 kB
Progress (1): 125/259 kB
Progress (1): 129/259 kB
Progress (1): 133/259 kB
Progress (1): 137/259 kB
Progress (1): 141/259 kB
Progress (1): 145/259 kB
Progress (1): 149/259 kB
Progress (1): 153/259 kB
Progress (1): 157/259 kB
Progress (1): 161/259 kB
Progress (1): 165/259 kB
Progress (1): 169/259 kB
Progress (1): 173/259 kB
Progress (1): 177/259 kB
Progress (1): 181/259 kB
Progress (1): 185/259 kB
Progress (1): 189/259 kB
Progress (1): 193/259 kB
Progress (1): 197/259 kB
Progress (1): 201/259 kB
Progress (1): 205/259 kB
Progress (1): 209/259 kB
Progress (1): 213/259 kB
Progress (1): 217/259 kB
Progress (1): 221/259 kB
Progress (1): 225/259 kB
Progress (1): 229/259 kB
Progress (1): 233/259 kB
Progress (1): 237/259 kB
Progress (1): 241/259 kB
Progress (1): 245/259 kB
Progress (1): 249/259 kB
Progress (1): 253/259 kB
Progress (1): 257/259 kB
Progress (1): 259 kB    
                    
Downloaded from eclipse.maven.central.mirror: https://repo.eclipse.org/content/repositories/maven_central/org/jacoco/org.jacoco.agent/0.7.9/org.jacoco.agent-0.7.9-runtime.jar (259 kB at 434 kB/s)
Progress (1): 4.1/388 kB
Progress (1): 7.7/388 kB
Progress (1): 12/388 kB 
Progress (1): 16/388 kB
Progress (1): 20/388 kB
Progress (1): 24/388 kB
Progress (1): 28/388 kB
Progress (1): 32/388 kB
Progress (1): 33/388 kB
Progress (1): 37/388 kB
Progress (1): 41/388 kB
Progress (1): 45/388 kB
Progress (1): 49/388 kB
Progress (1): 53/388 kB
Progress (1): 57/388 kB
Progress (1): 61/388 kB
Progress (1): 65/388 kB
Progress (1): 66/388 kB
Progress (1): 70/388 kB
Progress (1): 74/388 kB
Progress (1): 78/388 kB
Progress (1): 82/388 kB
Progress (1): 86/388 kB
Progress (1): 90/388 kB
Progress (1): 94/388 kB
Progress (1): 98/388 kB
Progress (1): 98/388 kB
Progress (1): 102/388 kB
Progress (2): 102/388 kB | 4.1/128 kB
Progress (2): 106/388 kB | 4.1/128 kB
Progress (2): 106/388 kB | 7.7/128 kB
Progress (2): 110/388 kB | 7.7/128 kB
Progress (2): 110/388 kB | 12/128 kB 
Progress (2): 114/388 kB | 12/128 kB
Progress (2): 114/388 kB | 16/128 kB
Progress (2): 118/388 kB | 16/128 kB
Progress (2): 118/388 kB | 20/128 kB
Progress (2): 122/388 kB | 20/128 kB
Progress (2): 122/388 kB | 24/128 kB
Progress (2): 126/388 kB | 24/128 kB
Progress (2): 126/388 kB | 28/128 kB
Progress (2): 130/388 kB | 28/128 kB
Progress (2): 130/388 kB | 32/128 kB
Progress (2): 131/388 kB | 32/128 kB
Progress (2): 131/388 kB | 33/128 kB
Progress (2): 131/388 kB | 37/128 kB
Progress (2): 135/388 kB | 37/128 kB
Progress (2): 135/388 kB | 41/128 kB
Progress (2): 139/388 kB | 41/128 kB
Progress (2): 139/388 kB | 45/128 kB
Progress (2): 139/388 kB | 49/128 kB
Progress (2): 143/388 kB | 49/128 kB
Progress (2): 143/388 kB | 53/128 kB
Progress (2): 147/388 kB | 53/128 kB
Progress (2): 147/388 kB | 57/128 kB
Progress (2): 151/388 kB | 57/128 kB
Progress (2): 151/388 kB | 61/128 kB
Progress (2): 155/388 kB | 61/128 kB
Progress (2): 155/388 kB | 65/128 kB
Progress (2): 155/388 kB | 66/128 kB
Progress (2): 159/388 kB | 66/128 kB
Progress (2): 159/388 kB | 70/128 kB
Progress (2): 163/388 kB | 70/128 kB
Progress (2): 163/388 kB | 74/128 kB
Progress (2): 163/388 kB | 78/128 kB
Progress (2): 167/388 kB | 78/128 kB
Progress (2): 167/388 kB | 82/128 kB
Progress (2): 171/388 kB | 82/128 kB
Progress (2): 171/388 kB | 86/128 kB
Progress (2): 171/388 kB | 90/128 kB
Progress (2): 175/388 kB | 90/128 kB
Progress (2): 175/388 kB | 94/128 kB
Progress (2): 179/388 kB | 94/128 kB
Progress (2): 179/388 kB | 98/128 kB
Progress (2): 183/388 kB | 98/128 kB
Progress (2): 183/388 kB | 102/128 kB
Progress (2): 187/388 kB | 102/128 kB
Progress (2): 187/388 kB | 106/128 kB
Progress (2): 191/388 kB | 106/128 kB
Progress (2): 191/388 kB | 110/128 kB
Progress (2): 195/388 kB | 110/128 kB
Progress (2): 195/388 kB | 114/128 kB
Progress (2): 195/388 kB | 118/128 kB
Progress (2): 199/388 kB | 118/128 kB
Progress (2): 199/388 kB | 122/128 kB
Progress (2): 203/388 kB | 122/128 kB
Progress (2): 203/388 kB | 126/128 kB
Progress (2): 203/388 kB | 128 kB    
Progress (2): 207/388 kB | 128 kB
Progress (2): 211/388 kB | 128 kB
Progress (2): 215/388 kB | 128 kB
Progress (2): 219/388 kB | 128 kB
Progress (2): 223/388 kB | 128 kB
Progress (2): 227/388 kB | 128 kB
Progress (2): 231/388 kB | 128 kB
Progress (2): 235/388 kB | 128 kB
Progress (2): 239/388 kB | 128 kB
Progress (2): 243/388 kB | 128 kB
Progress (2): 247/388 kB | 128 kB
Progress (2): 251/388 kB | 128 kB
Progress (2): 255/388 kB | 128 kB
Progress (2): 259/388 kB | 128 kB
Progress (2): 263/388 kB | 128 kB
Progress (2): 267/388 kB | 128 kB
Progress (2): 271/388 kB | 128 kB
Progress (2): 275/388 kB | 128 kB
Progress (2): 279/388 kB | 128 kB
Progress (2): 283/388 kB | 128 kB
Progress (2): 287/388 kB | 128 kB
Progress (2): 291/388 kB | 128 kB
Progress (2): 295/388 kB | 128 kB
Progress (2): 299/388 kB | 128 kB
Progress (2): 303/388 kB | 128 kB
Progress (2): 307/388 kB | 128 kB
Progress (2): 311/388 kB | 128 kB
Progress (2): 315/388 kB | 128 kB
Progress (2): 319/388 kB | 128 kB
Progress (2): 323/388 kB | 128 kB
Progress (2): 327/388 kB | 128 kB
Progress (2): 331/388 kB | 128 kB
                                 
Downloaded from eclipse.maven.central.mirror: https://repo.eclipse.org/content/repositories/maven_central/org/jacoco/org.jacoco.report/0.7.9/org.jacoco.report-0.7.9.jar (128 kB at 206 kB/s)
Progress (1): 335/388 kB
Progress (1): 339/388 kB
Progress (1): 343/388 kB
Progress (1): 347/388 kB
Progress (1): 351/388 kB
Progress (1): 355/388 kB
Progress (1): 359/388 kB
Progress (1): 363/388 kB
Progress (1): 367/388 kB
Progress (1): 371/388 kB
Progress (1): 375/388 kB
Progress (1): 379/388 kB
Progress (1): 383/388 kB
Progress (1): 387/388 kB
Progress (1): 388 kB    
                    
Downloaded from eclipse.maven.central.mirror: https://repo.eclipse.org/content/repositories/maven_central/org/ow2/asm/asm-debug-all/5.2/asm-debug-all-5.2.jar (388 kB at 616 kB/s)
Progress (1): 4.1/126 kB
Progress (1): 7.7/126 kB
Progress (1): 12/126 kB 
Progress (1): 16/126 kB
Progress (1): 20/126 kB
Progress (1): 24/126 kB
Progress (1): 28/126 kB
Progress (1): 32/126 kB
Progress (1): 33/126 kB
Progress (1): 37/126 kB
Progress (1): 41/126 kB
Progress (1): 45/126 kB
Progress (1): 49/126 kB
Progress (1): 53/126 kB
Progress (1): 57/126 kB
Progress (1): 61/126 kB
Progress (1): 65/126 kB
Progress (1): 66/126 kB
Progress (1): 70/126 kB
Progress (1): 74/126 kB
Progress (1): 78/126 kB
Progress (1): 82/126 kB
Progress (1): 86/126 kB
Progress (1): 90/126 kB
Progress (1): 94/126 kB
Progress (1): 98/126 kB
Progress (1): 102/126 kB
Progress (1): 106/126 kB
Progress (1): 110/126 kB
Progress (1): 114/126 kB
Progress (1): 118/126 kB
Progress (1): 122/126 kB
Progress (1): 126/126 kB
Progress (1): 126 kB    
                    
Downloaded from eclipse.maven.central.mirror: https://repo.eclipse.org/content/repositories/maven_central/org/jacoco/org.jacoco.core/0.7.9/org.jacoco.core-0.7.9.jar (126 kB at 194 kB/s)
[INFO] failsafeArgline set to -javaagent:/home/hudson/genie.ecp/.jenkins/jobs/ecp-relaeseBranch-q7test/workspace/.repository/org/jacoco/org.jacoco.agent/0.7.9/org.jacoco.agent-0.7.9-runtime.jar=destfile=/jobs/genie.ecp/ecp-relaeseBranch-q7test/workspace/tests/ECPQ7Tests/target/jacoco-rcptt.exec
[INFO] 
[INFO] ------------------< org.eclipse.emf.ecp:q7-epp-tests >------------------
[INFO] Building q7-epp-tests 0.0.1-SNAPSHOT                               [2/7]
[INFO] --------------------------------[ pom ]---------------------------------
Downloading from eclipse.maven.central.mirror: https://repo.eclipse.org/content/repositories/maven_central/org/codehaus/mojo/exec-maven-plugin/maven-metadata.xml
Downloading from rcptt-releases: https://repo.eclipse.org/content/repositories/rcptt-releases/org/codehaus/mojo/exec-maven-plugin/maven-metadata.xml
Downloading from rcptt-snapshots: https://repo.eclipse.org/content/repositories/rcptt-snapshots/org/codehaus/mojo/exec-maven-plugin/maven-metadata.xml
Progress (1): 741 B
                   
Downloaded from eclipse.maven.central.mirror: https://repo.eclipse.org/content/repositories/maven_central/org/codehaus/mojo/exec-maven-plugin/maven-metadata.xml (741 B at 2.4 kB/s)
Downloading from rcptt-releases: https://repo.eclipse.org/content/repositories/rcptt-releases/org/codehaus/mojo/exec-maven-plugin/1.6.0/exec-maven-plugin-1.6.0.pom
Downloading from rcptt-snapshots: https://repo.eclipse.org/content/repositories/rcptt-snapshots/org/codehaus/mojo/exec-maven-plugin/1.6.0/exec-maven-plugin-1.6.0.pom
Downloading from eclipse.maven.central.mirror: https://repo.eclipse.org/content/repositories/maven_central/org/codehaus/mojo/exec-maven-plugin/1.6.0/exec-maven-plugin-1.6.0.pom
Progress (1): 4.1/13 kB
Progress (1): 7.7/13 kB
Progress (1): 12/13 kB 
Progress (1): 13 kB   
                   
Downloaded from eclipse.maven.central.mirror: https://repo.eclipse.org/content/repositories/maven_central/org/codehaus/mojo/exec-maven-plugin/1.6.0/exec-maven-plugin-1.6.0.pom (13 kB at 75 kB/s)
Downloading from rcptt-releases: https://repo.eclipse.org/content/repositories/rcptt-releases/org/codehaus/mojo/mojo-parent/40/mojo-parent-40.pom
Downloading from rcptt-snapshots: https://repo.eclipse.org/content/repositories/rcptt-snapshots/org/codehaus/mojo/mojo-parent/40/mojo-parent-40.pom
Downloading from eclipse.maven.central.mirror: https://repo.eclipse.org/content/repositories/maven_central/org/codehaus/mojo/mojo-parent/40/mojo-parent-40.pom
Progress (1): 4.1/34 kB
Progress (1): 7.7/34 kB
Progress (1): 12/34 kB 
Progress (1): 16/34 kB
Progress (1): 20/34 kB
Progress (1): 24/34 kB
Progress (1): 28/34 kB
Progress (1): 32/34 kB
Progress (1): 34 kB   
                   
Downloaded from eclipse.maven.central.mirror: https://repo.eclipse.org/content/repositories/maven_central/org/codehaus/mojo/mojo-parent/40/mojo-parent-40.pom (34 kB at 1.1 MB/s)
Downloading from rcptt-releases: https://repo.eclipse.org/content/repositories/rcptt-releases/org/codehaus/mojo/exec-maven-plugin/1.6.0/exec-maven-plugin-1.6.0.jar
Downloading from rcptt-snapshots: https://repo.eclipse.org/content/repositories/rcptt-snapshots/org/codehaus/mojo/exec-maven-plugin/1.6.0/exec-maven-plugin-1.6.0.jar
Downloading from eclipse.maven.central.mirror: https://repo.eclipse.org/content/repositories/maven_central/org/codehaus/mojo/exec-maven-plugin/1.6.0/exec-maven-plugin-1.6.0.jar
Progress (1): 4.1/58 kB
Progress (1): 7.7/58 kB
Progress (1): 12/58 kB 
Progress (1): 16/58 kB
Progress (1): 20/58 kB
Progress (1): 24/58 kB
Progress (1): 28/58 kB
Progress (1): 32/58 kB
Progress (1): 36/58 kB
Progress (1): 40/58 kB
Progress (1): 44/58 kB
Progress (1): 48/58 kB
Progress (1): 52/58 kB
Progress (1): 56/58 kB
Progress (1): 58 kB   
                   
Downloaded from eclipse.maven.central.mirror: https://repo.eclipse.org/content/repositories/maven_central/org/codehaus/mojo/exec-maven-plugin/1.6.0/exec-maven-plugin-1.6.0.jar (58 kB at 40 kB/s)
[INFO] 
[INFO] --- jacoco-maven-plugin:0.7.9:prepare-agent (init-agent-rcptt) @ q7-epp-tests ---
[INFO] failsafeArgline set to -javaagent:/home/hudson/genie.ecp/.jenkins/jobs/ecp-relaeseBranch-q7test/workspace/.repository/org/jacoco/org.jacoco.agent/0.7.9/org.jacoco.agent-0.7.9-runtime.jar=destfile=/jobs/genie.ecp/ecp-relaeseBranch-q7test/workspace/tests/ECPQ7Tests/EPPTests/target/jacoco-rcptt.exec
[INFO] 
[INFO] ------------< org.eclipse.emf.ecp:q7-epp-tests-updatesite >-------------
[INFO] Building q7-epp-tests-updatesite 0.0.1-SNAPSHOT                    [3/7]
[INFO] --------------------------------[ pom ]---------------------------------
[INFO] 
[INFO] --- jacoco-maven-plugin:0.7.9:prepare-agent (init-agent-rcptt) @ q7-epp-tests-updatesite ---
[INFO] failsafeArgline set to -javaagent:/home/hudson/genie.ecp/.jenkins/jobs/ecp-relaeseBranch-q7test/workspace/.repository/org/jacoco/org.jacoco.agent/0.7.9/org.jacoco.agent-0.7.9-runtime.jar=destfile=/jobs/genie.ecp/ecp-relaeseBranch-q7test/workspace/tests/ECPQ7Tests/EPPTests/update-site/target/jacoco-rcptt.exec
[INFO] 
[INFO] ----------------< org.eclipse.emf.ecp:q7tests-previous >----------------
[INFO] Building q7tests-previous 0.0.1-SNAPSHOT                           [4/7]
[INFO] -----------------------------[ rcpttTest ]------------------------------
Downloading from rcptt-snapshots: https://repo.eclipse.org/content/repositories/rcptt-snapshots/org/apache/maven/plugins/maven-install-plugin/maven-metadata.xml
Downloading from eclipse.maven.central.mirror: https://repo.eclipse.org/content/repositories/maven_central/org/apache/maven/plugins/maven-install-plugin/maven-metadata.xml
Downloading from rcptt-releases: https://repo.eclipse.org/content/repositories/rcptt-releases/org/apache/maven/plugins/maven-install-plugin/maven-metadata.xml
Progress (1): 663 B
                   
Downloaded from eclipse.maven.central.mirror: https://repo.eclipse.org/content/repositories/maven_central/org/apache/maven/plugins/maven-install-plugin/maven-metadata.xml (663 B at 20 kB/s)
Downloading from rcptt-releases: https://repo.eclipse.org/content/repositories/rcptt-releases/org/apache/maven/plugins/maven-install-plugin/3.0.0-M1/maven-install-plugin-3.0.0-M1.pom
Downloading from rcptt-snapshots: https://repo.eclipse.org/content/repositories/rcptt-snapshots/org/apache/maven/plugins/maven-install-plugin/3.0.0-M1/maven-install-plugin-3.0.0-M1.pom
Downloading from eclipse.maven.central.mirror: https://repo.eclipse.org/content/repositories/maven_central/org/apache/maven/plugins/maven-install-plugin/3.0.0-M1/maven-install-plugin-3.0.0-M1.pom
Progress (1): 4.1/6.2 kB
Progress (1): 6.2 kB    
                    
Downloaded from eclipse.maven.central.mirror: https://repo.eclipse.org/content/repositories/maven_central/org/apache/maven/plugins/maven-install-plugin/3.0.0-M1/maven-install-plugin-3.0.0-M1.pom (6.2 kB at 206 kB/s)
Downloading from rcptt-releases: https://repo.eclipse.org/content/repositories/rcptt-releases/org/apache/maven/plugins/maven-plugins/33/maven-plugins-33.pom
Downloading from rcptt-snapshots: https://repo.eclipse.org/content/repositories/rcptt-snapshots/org/apache/maven/plugins/maven-plugins/33/maven-plugins-33.pom
Downloading from eclipse.maven.central.mirror: https://repo.eclipse.org/content/repositories/maven_central/org/apache/maven/plugins/maven-plugins/33/maven-plugins-33.pom
Progress (1): 4.1/11 kB
Progress (1): 7.7/11 kB
Progress (1): 11 kB    
                   
Downloaded from eclipse.maven.central.mirror: https://repo.eclipse.org/content/repositories/maven_central/org/apache/maven/plugins/maven-plugins/33/maven-plugins-33.pom (11 kB at 314 kB/s)
Downloading from rcptt-releases: https://repo.eclipse.org/content/repositories/rcptt-releases/org/apache/maven/maven-parent/33/maven-parent-33.pom
Downloading from rcptt-snapshots: https://repo.eclipse.org/content/repositories/rcptt-snapshots/org/apache/maven/maven-parent/33/maven-parent-33.pom
Downloading from eclipse.maven.central.mirror: https://repo.eclipse.org/content/repositories/maven_central/org/apache/maven/maven-parent/33/maven-parent-33.pom
Progress (1): 4.1/44 kB
Progress (1): 7.7/44 kB
Progress (1): 12/44 kB 
Progress (1): 16/44 kB
Progress (1): 20/44 kB
Progress (1): 24/44 kB
Progress (1): 28/44 kB
Progress (1): 32/44 kB
Progress (1): 36/44 kB
Progress (1): 40/44 kB
Progress (1): 44/44 kB
Progress (1): 44 kB   
                   
Downloaded from eclipse.maven.central.mirror: https://repo.eclipse.org/content/repositories/maven_central/org/apache/maven/maven-parent/33/maven-parent-33.pom (44 kB at 1.1 MB/s)
Downloading from rcptt-releases: https://repo.eclipse.org/content/repositories/rcptt-releases/org/apache/apache/21/apache-21.pom
Downloading from rcptt-snapshots: https://repo.eclipse.org/content/repositories/rcptt-snapshots/org/apache/apache/21/apache-21.pom
Downloading from eclipse.maven.central.mirror: https://repo.eclipse.org/content/repositories/maven_central/org/apache/apache/21/apache-21.pom
Progress (1): 4.1/17 kB
Progress (1): 7.7/17 kB
Progress (1): 12/17 kB 
Progress (1): 16/17 kB
Progress (1): 17 kB   
                   
Downloaded from eclipse.maven.central.mirror: https://repo.eclipse.org/content/repositories/maven_central/org/apache/apache/21/apache-21.pom (17 kB at 489 kB/s)
Downloading from rcptt-releases: https://repo.eclipse.org/content/repositories/rcptt-releases/org/apache/maven/plugins/maven-install-plugin/3.0.0-M1/maven-install-plugin-3.0.0-M1.jar
Downloading from rcptt-snapshots: https://repo.eclipse.org/content/repositories/rcptt-snapshots/org/apache/maven/plugins/maven-install-plugin/3.0.0-M1/maven-install-plugin-3.0.0-M1.jar
Downloading from eclipse.maven.central.mirror: https://repo.eclipse.org/content/repositories/maven_central/org/apache/maven/plugins/maven-install-plugin/3.0.0-M1/maven-install-plugin-3.0.0-M1.jar
Progress (1): 4.1/29 kB
Progress (1): 7.7/29 kB
Progress (1): 12/29 kB 
Progress (1): 16/29 kB
Progress (1): 20/29 kB
Progress (1): 24/29 kB
Progress (1): 28/29 kB
Progress (1): 29 kB   
                   
Downloaded from eclipse.maven.central.mirror: https://repo.eclipse.org/content/repositories/maven_central/org/apache/maven/plugins/maven-install-plugin/3.0.0-M1/maven-install-plugin-3.0.0-M1.jar (29 kB at 981 kB/s)
Downloading from rcptt-snapshots: https://repo.eclipse.org/content/repositories/rcptt-snapshots/org/apache/maven/plugins/maven-deploy-plugin/maven-metadata.xml
Downloading from eclipse.maven.central.mirror: https://repo.eclipse.org/content/repositories/maven_central/org/apache/maven/plugins/maven-deploy-plugin/maven-metadata.xml
Downloading from rcptt-releases: https://repo.eclipse.org/content/repositories/rcptt-releases/org/apache/maven/plugins/maven-deploy-plugin/maven-metadata.xml
Progress (1): 749 B
                   
Downloaded from eclipse.maven.central.mirror: https://repo.eclipse.org/content/repositories/maven_central/org/apache/maven/plugins/maven-deploy-plugin/maven-metadata.xml (749 B at 9.1 kB/s)
Downloading from rcptt-releases: https://repo.eclipse.org/content/repositories/rcptt-releases/org/apache/maven/plugins/maven-deploy-plugin/3.0.0-M1/maven-deploy-plugin-3.0.0-M1.pom
Downloading from rcptt-snapshots: https://repo.eclipse.org/content/repositories/rcptt-snapshots/org/apache/maven/plugins/maven-deploy-plugin/3.0.0-M1/maven-deploy-plugin-3.0.0-M1.pom
Downloading from eclipse.maven.central.mirror: https://repo.eclipse.org/content/repositories/maven_central/org/apache/maven/plugins/maven-deploy-plugin/3.0.0-M1/maven-deploy-plugin-3.0.0-M1.pom
Progress (1): 4.1/7.8 kB
Progress (1): 7.7/7.8 kB
Progress (1): 7.8 kB    
                    
Downloaded from eclipse.maven.central.mirror: https://repo.eclipse.org/content/repositories/maven_central/org/apache/maven/plugins/maven-deploy-plugin/3.0.0-M1/maven-deploy-plugin-3.0.0-M1.pom (7.8 kB at 128 kB/s)
Downloading from rcptt-releases: https://repo.eclipse.org/content/repositories/rcptt-releases/org/apache/maven/plugins/maven-deploy-plugin/3.0.0-M1/maven-deploy-plugin-3.0.0-M1.jar
Downloading from rcptt-snapshots: https://repo.eclipse.org/content/repositories/rcptt-snapshots/org/apache/maven/plugins/maven-deploy-plugin/3.0.0-M1/maven-deploy-plugin-3.0.0-M1.jar
Downloading from eclipse.maven.central.mirror: https://repo.eclipse.org/content/repositories/maven_central/org/apache/maven/plugins/maven-deploy-plugin/3.0.0-M1/maven-deploy-plugin-3.0.0-M1.jar
Progress (1): 4.1/34 kB
Progress (1): 7.7/34 kB
Progress (1): 12/34 kB 
Progress (1): 16/34 kB
Progress (1): 20/34 kB
Progress (1): 24/34 kB
Progress (1): 28/34 kB
Progress (1): 32/34 kB
Progress (1): 34 kB   
                   
Downloaded from eclipse.maven.central.mirror: https://repo.eclipse.org/content/repositories/maven_central/org/apache/maven/plugins/maven-deploy-plugin/3.0.0-M1/maven-deploy-plugin-3.0.0-M1.jar (34 kB at 953 kB/s)
[INFO] 
[INFO] --- exec-maven-plugin:1.6.0:exec (Download Eclipses) @ q7tests-previous ---
Downloading from rcptt-releases: https://repo.eclipse.org/content/repositories/rcptt-releases/org/apache/maven/maven-toolchain/2.2.1/maven-toolchain-2.2.1.pom
Downloading from rcptt-snapshots: https://repo.eclipse.org/content/repositories/rcptt-snapshots/org/apache/maven/maven-toolchain/2.2.1/maven-toolchain-2.2.1.pom
Downloading from eclipse.maven.central.mirror: https://repo.eclipse.org/content/repositories/maven_central/org/apache/maven/maven-toolchain/2.2.1/maven-toolchain-2.2.1.pom
Progress (1): 3.3 kB
                    
Downloaded from eclipse.maven.central.mirror: https://repo.eclipse.org/content/repositories/maven_central/org/apache/maven/maven-toolchain/2.2.1/maven-toolchain-2.2.1.pom (3.3 kB at 111 kB/s)
Downloading from rcptt-releases: https://repo.eclipse.org/content/repositories/rcptt-releases/org/apache/maven/maven-core/2.2.1/maven-core-2.2.1.pom
Downloading from rcptt-snapshots: https://repo.eclipse.org/content/repositories/rcptt-snapshots/org/apache/maven/maven-core/2.2.1/maven-core-2.2.1.pom
Downloading from eclipse.maven.central.mirror: https://repo.eclipse.org/content/repositories/maven_central/org/apache/maven/maven-core/2.2.1/maven-core-2.2.1.pom
Progress (1): 4.1/12 kB
Progress (1): 7.7/12 kB
Progress (1): 12 kB    
                   
Downloaded from eclipse.maven.central.mirror: https://repo.eclipse.org/content/repositories/maven_central/org/apache/maven/maven-core/2.2.1/maven-core-2.2.1.pom (12 kB at 306 kB/s)
Downloading from rcptt-releases: https://repo.eclipse.org/content/repositories/rcptt-releases/junit/junit/4.12/junit-4.12.pom
Downloading from rcptt-snapshots: https://repo.eclipse.org/content/repositories/rcptt-snapshots/junit/junit/4.12/junit-4.12.pom
Downloading from eclipse.maven.central.mirror: https://repo.eclipse.org/content/repositories/maven_central/junit/junit/4.12/junit-4.12.pom
Progress (1): 4.1/24 kB
Progress (1): 7.7/24 kB
Progress (1): 12/24 kB 
Progress (1): 16/24 kB
Progress (1): 20/24 kB
Progress (1): 24/24 kB
Progress (1): 24 kB   
                   
Downloaded from eclipse.maven.central.mirror: https://repo.eclipse.org/content/repositories/maven_central/junit/junit/4.12/junit-4.12.pom (24 kB at 718 kB/s)
Downloading from rcptt-releases: https://repo.eclipse.org/content/repositories/rcptt-releases/org/hamcrest/hamcrest-core/1.3/hamcrest-core-1.3.pom
Downloading from rcptt-snapshots: https://repo.eclipse.org/content/repositories/rcptt-snapshots/org/hamcrest/hamcrest-core/1.3/hamcrest-core-1.3.pom
Downloading from eclipse.maven.central.mirror: https://repo.eclipse.org/content/repositories/maven_central/org/hamcrest/hamcrest-core/1.3/hamcrest-core-1.3.pom
Progress (1): 766 B
                   
Downloaded from eclipse.maven.central.mirror: https://repo.eclipse.org/content/repositories/maven_central/org/hamcrest/hamcrest-core/1.3/hamcrest-core-1.3.pom (766 B at 27 kB/s)
Downloading from rcptt-releases: https://repo.eclipse.org/content/repositories/rcptt-releases/org/hamcrest/hamcrest-parent/1.3/hamcrest-parent-1.3.pom
Downloading from rcptt-snapshots: https://repo.eclipse.org/content/repositories/rcptt-snapshots/org/hamcrest/hamcrest-parent/1.3/hamcrest-parent-1.3.pom
Downloading from eclipse.maven.central.mirror: https://repo.eclipse.org/content/repositories/maven_central/org/hamcrest/hamcrest-parent/1.3/hamcrest-parent-1.3.pom
Progress (1): 2.0 kB
                    
Downloaded from eclipse.maven.central.mirror: https://repo.eclipse.org/content/repositories/maven_central/org/hamcrest/hamcrest-parent/1.3/hamcrest-parent-1.3.pom (2.0 kB at 64 kB/s)
Downloading from rcptt-releases: https://repo.eclipse.org/content/repositories/rcptt-releases/org/apache/maven/maven-plugin-parameter-documenter/2.2.1/maven-plugin-parameter-documenter-2.2.1.pom
Downloading from rcptt-snapshots: https://repo.eclipse.org/content/repositories/rcptt-snapshots/org/apache/maven/maven-plugin-parameter-documenter/2.2.1/maven-plugin-parameter-documenter-2.2.1.pom
Downloading from eclipse.maven.central.mirror: https://repo.eclipse.org/content/repositories/maven_central/org/apache/maven/maven-plugin-parameter-documenter/2.2.1/maven-plugin-parameter-documenter-2.2.1.pom
Progress (1): 2.0 kB
                    
Downloaded from eclipse.maven.central.mirror: https://repo.eclipse.org/content/repositories/maven_central/org/apache/maven/maven-plugin-parameter-documenter/2.2.1/maven-plugin-parameter-documenter-2.2.1.pom (2.0 kB at 63 kB/s)
Downloading from rcptt-releases: https://repo.eclipse.org/content/repositories/rcptt-releases/org/slf4j/slf4j-jdk14/1.5.6/slf4j-jdk14-1.5.6.pom
Downloading from rcptt-snapshots: https://repo.eclipse.org/content/repositories/rcptt-snapshots/org/slf4j/slf4j-jdk14/1.5.6/slf4j-jdk14-1.5.6.pom
Downloading from eclipse.maven.central.mirror: https://repo.eclipse.org/content/repositories/maven_central/org/slf4j/slf4j-jdk14/1.5.6/slf4j-jdk14-1.5.6.pom
Progress (1): 1.9 kB
                    
Downloaded from eclipse.maven.central.mirror: https://repo.eclipse.org/content/repositories/maven_central/org/slf4j/slf4j-jdk14/1.5.6/slf4j-jdk14-1.5.6.pom (1.9 kB at 53 kB/s)
Downloading from rcptt-releases: https://repo.eclipse.org/content/repositories/rcptt-releases/org/slf4j/slf4j-parent/1.5.6/slf4j-parent-1.5.6.pom
Downloading from rcptt-snapshots: https://repo.eclipse.org/content/repositories/rcptt-snapshots/org/slf4j/slf4j-parent/1.5.6/slf4j-parent-1.5.6.pom
Downloading from eclipse.maven.central.mirror: https://repo.eclipse.org/content/repositories/maven_central/org/slf4j/slf4j-parent/1.5.6/slf4j-parent-1.5.6.pom
Progress (1): 4.1/7.9 kB
Progress (1): 7.7/7.9 kB
Progress (1): 7.9 kB    
                    
Downloaded from eclipse.maven.central.mirror: https://repo.eclipse.org/content/repositories/maven_central/org/slf4j/slf4j-parent/1.5.6/slf4j-parent-1.5.6.pom (7.9 kB at 226 kB/s)
Downloading from rcptt-releases: https://repo.eclipse.org/content/repositories/rcptt-releases/org/slf4j/slf4j-api/1.5.6/slf4j-api-1.5.6.pom
Downloading from rcptt-snapshots: https://repo.eclipse.org/content/repositories/rcptt-snapshots/org/slf4j/slf4j-api/1.5.6/slf4j-api-1.5.6.pom
Downloading from eclipse.maven.central.mirror: https://repo.eclipse.org/content/repositories/maven_central/org/slf4j/slf4j-api/1.5.6/slf4j-api-1.5.6.pom
Progress (1): 3.0 kB
                    
Downloaded from eclipse.maven.central.mirror: https://repo.eclipse.org/content/repositories/maven_central/org/slf4j/slf4j-api/1.5.6/slf4j-api-1.5.6.pom (3.0 kB at 96 kB/s)
Downloading from rcptt-releases: https://repo.eclipse.org/content/repositories/rcptt-releases/org/slf4j/jcl-over-slf4j/1.5.6/jcl-over-slf4j-1.5.6.pom
Downloading from rcptt-snapshots: https://repo.eclipse.org/content/repositories/rcptt-snapshots/org/slf4j/jcl-over-slf4j/1.5.6/jcl-over-slf4j-1.5.6.pom
Downloading from eclipse.maven.central.mirror: https://repo.eclipse.org/content/repositories/maven_central/org/slf4j/jcl-over-slf4j/1.5.6/jcl-over-slf4j-1.5.6.pom
Progress (1): 2.2 kB
                    
Downloaded from eclipse.maven.central.mirror: https://repo.eclipse.org/content/repositories/maven_central/org/slf4j/jcl-over-slf4j/1.5.6/jcl-over-slf4j-1.5.6.pom (2.2 kB at 62 kB/s)
Downloading from rcptt-releases: https://repo.eclipse.org/content/repositories/rcptt-releases/org/apache/maven/maven-error-diagnostics/2.2.1/maven-error-diagnostics-2.2.1.pom
Downloading from rcptt-snapshots: https://repo.eclipse.org/content/repositories/rcptt-snapshots/org/apache/maven/maven-error-diagnostics/2.2.1/maven-error-diagnostics-2.2.1.pom
Downloading from eclipse.maven.central.mirror: https://repo.eclipse.org/content/repositories/maven_central/org/apache/maven/maven-error-diagnostics/2.2.1/maven-error-diagnostics-2.2.1.pom
Progress (1): 1.7 kB
                    
Downloaded from eclipse.maven.central.mirror: https://repo.eclipse.org/content/repositories/maven_central/org/apache/maven/maven-error-diagnostics/2.2.1/maven-error-diagnostics-2.2.1.pom (1.7 kB at 52 kB/s)
Downloading from rcptt-releases: https://repo.eclipse.org/content/repositories/rcptt-releases/commons-cli/commons-cli/1.2/commons-cli-1.2.pom
Downloading from rcptt-snapshots: https://repo.eclipse.org/content/repositories/rcptt-snapshots/commons-cli/commons-cli/1.2/commons-cli-1.2.pom
Downloading from eclipse.maven.central.mirror: https://repo.eclipse.org/content/repositories/maven_central/commons-cli/commons-cli/1.2/commons-cli-1.2.pom
Progress (1): 4.1/8.0 kB
Progress (1): 7.7/8.0 kB
Progress (1): 8.0 kB    
                    
Downloaded from eclipse.maven.central.mirror: https://repo.eclipse.org/content/repositories/maven_central/commons-cli/commons-cli/1.2/commons-cli-1.2.pom (8.0 kB at 242 kB/s)
Downloading from rcptt-releases: https://repo.eclipse.org/content/repositories/rcptt-releases/org/apache/commons/commons-parent/11/commons-parent-11.pom
Downloading from rcptt-snapshots: https://repo.eclipse.org/content/repositories/rcptt-snapshots/org/apache/commons/commons-parent/11/commons-parent-11.pom
Downloading from eclipse.maven.central.mirror: https://repo.eclipse.org/content/repositories/maven_central/org/apache/commons/commons-parent/11/commons-parent-11.pom
Progress (1): 4.1/25 kB
Progress (1): 7.7/25 kB
Progress (1): 12/25 kB 
Progress (1): 16/25 kB
Progress (1): 20/25 kB
Progress (1): 24/25 kB
Progress (1): 25 kB   
                   
Downloaded from eclipse.maven.central.mirror: https://repo.eclipse.org/content/repositories/maven_central/org/apache/commons/commons-parent/11/commons-parent-11.pom (25 kB at 747 kB/s)
Downloading from rcptt-releases: https://repo.eclipse.org/content/repositories/rcptt-releases/org/apache/maven/maven-plugin-api/3.0/maven-plugin-api-3.0.pom
Downloading from rcptt-snapshots: https://repo.eclipse.org/content/repositories/rcptt-snapshots/org/apache/maven/maven-plugin-api/3.0/maven-plugin-api-3.0.pom
Downloading from eclipse.maven.central.mirror: https://repo.eclipse.org/content/repositories/maven_central/org/apache/maven/maven-plugin-api/3.0/maven-plugin-api-3.0.pom
Progress (1): 2.3 kB
                    
Downloaded from eclipse.maven.central.mirror: https://repo.eclipse.org/content/repositories/maven_central/org/apache/maven/maven-plugin-api/3.0/maven-plugin-api-3.0.pom (2.3 kB at 69 kB/s)
Downloading from rcptt-releases: https://repo.eclipse.org/content/repositories/rcptt-releases/org/apache/maven/maven/3.0/maven-3.0.pom
Downloading from rcptt-snapshots: https://repo.eclipse.org/content/repositories/rcptt-snapshots/org/apache/maven/maven/3.0/maven-3.0.pom
Downloading from eclipse.maven.central.mirror: https://repo.eclipse.org/content/repositories/maven_central/org/apache/maven/maven/3.0/maven-3.0.pom
Progress (1): 4.1/22 kB
Progress (1): 7.7/22 kB
Progress (1): 12/22 kB 
Progress (1): 16/22 kB
Progress (1): 20/22 kB
Progress (1): 22 kB   
                   
Downloaded from eclipse.maven.central.mirror: https://repo.eclipse.org/content/repositories/maven_central/org/apache/maven/maven/3.0/maven-3.0.pom (22 kB at 547 kB/s)
Downloading from rcptt-releases: https://repo.eclipse.org/content/repositories/rcptt-releases/org/apache/maven/maven-model/3.0/maven-model-3.0.pom
Downloading from rcptt-snapshots: https://repo.eclipse.org/content/repositories/rcptt-snapshots/org/apache/maven/maven-model/3.0/maven-model-3.0.pom
Downloading from eclipse.maven.central.mirror: https://repo.eclipse.org/content/repositories/maven_central/org/apache/maven/maven-model/3.0/maven-model-3.0.pom
Progress (1): 3.9 kB
                    
Downloaded from eclipse.maven.central.mirror: https://repo.eclipse.org/content/repositories/maven_central/org/apache/maven/maven-model/3.0/maven-model-3.0.pom (3.9 kB at 83 kB/s)
Downloading from rcptt-releases: https://repo.eclipse.org/content/repositories/rcptt-releases/org/codehaus/plexus/plexus-utils/2.0.4/plexus-utils-2.0.4.pom
Downloading from rcptt-snapshots: https://repo.eclipse.org/content/repositories/rcptt-snapshots/org/codehaus/plexus/plexus-utils/2.0.4/plexus-utils-2.0.4.pom
Downloading from eclipse.maven.central.mirror: https://repo.eclipse.org/content/repositories/maven_central/org/codehaus/plexus/plexus-utils/2.0.4/plexus-utils-2.0.4.pom
Progress (1): 3.3 kB
                    
Downloaded from eclipse.maven.central.mirror: https://repo.eclipse.org/content/repositories/maven_central/org/codehaus/plexus/plexus-utils/2.0.4/plexus-utils-2.0.4.pom (3.3 kB at 108 kB/s)
Downloading from rcptt-releases: https://repo.eclipse.org/content/repositories/rcptt-releases/org/apache/maven/maven-artifact/3.0/maven-artifact-3.0.pom
Downloading from rcptt-snapshots: https://repo.eclipse.org/content/repositories/rcptt-snapshots/org/apache/maven/maven-artifact/3.0/maven-artifact-3.0.pom
Downloading from eclipse.maven.central.mirror: https://repo.eclipse.org/content/repositories/maven_central/org/apache/maven/maven-artifact/3.0/maven-artifact-3.0.pom
Progress (1): 1.9 kB
                    
Downloaded from eclipse.maven.central.mirror: https://repo.eclipse.org/content/repositories/maven_central/org/apache/maven/maven-artifact/3.0/maven-artifact-3.0.pom (1.9 kB at 62 kB/s)
Downloading from rcptt-releases: https://repo.eclipse.org/content/repositories/rcptt-releases/org/sonatype/sisu/sisu-inject-plexus/1.4.2/sisu-inject-plexus-1.4.2.pom
Downloading from rcptt-snapshots: https://repo.eclipse.org/content/repositories/rcptt-snapshots/org/sonatype/sisu/sisu-inject-plexus/1.4.2/sisu-inject-plexus-1.4.2.pom
Downloading from eclipse.maven.central.mirror: https://repo.eclipse.org/content/repositories/maven_central/org/sonatype/sisu/sisu-inject-plexus/1.4.2/sisu-inject-plexus-1.4.2.pom
Progress (1): 4.1/5.4 kB
Progress (1): 5.4 kB    
                    
Downloaded from eclipse.maven.central.mirror: https://repo.eclipse.org/content/repositories/maven_central/org/sonatype/sisu/sisu-inject-plexus/1.4.2/sisu-inject-plexus-1.4.2.pom (5.4 kB at 173 kB/s)
Downloading from rcptt-releases: https://repo.eclipse.org/content/repositories/rcptt-releases/org/sonatype/sisu/inject/guice-plexus/1.4.2/guice-plexus-1.4.2.pom
Downloading from rcptt-snapshots: https://repo.eclipse.org/content/repositories/rcptt-snapshots/org/sonatype/sisu/inject/guice-plexus/1.4.2/guice-plexus-1.4.2.pom
Downloading from eclipse.maven.central.mirror: https://repo.eclipse.org/content/repositories/maven_central/org/sonatype/sisu/inject/guice-plexus/1.4.2/guice-plexus-1.4.2.pom
Progress (1): 3.1 kB
                    
Downloaded from eclipse.maven.central.mirror: https://repo.eclipse.org/content/repositories/maven_central/org/sonatype/sisu/inject/guice-plexus/1.4.2/guice-plexus-1.4.2.pom (3.1 kB at 92 kB/s)
Downloading from rcptt-releases: https://repo.eclipse.org/content/repositories/rcptt-releases/org/sonatype/sisu/inject/guice-bean/1.4.2/guice-bean-1.4.2.pom
Downloading from rcptt-snapshots: https://repo.eclipse.org/content/repositories/rcptt-snapshots/org/sonatype/sisu/inject/guice-bean/1.4.2/guice-bean-1.4.2.pom
Downloading from eclipse.maven.central.mirror: https://repo.eclipse.org/content/repositories/maven_central/org/sonatype/sisu/inject/guice-bean/1.4.2/guice-bean-1.4.2.pom
Progress (1): 2.6 kB
                    
Downloaded from eclipse.maven.central.mirror: https://repo.eclipse.org/content/repositories/maven_central/org/sonatype/sisu/inject/guice-bean/1.4.2/guice-bean-1.4.2.pom (2.6 kB at 81 kB/s)
Downloading from rcptt-releases: https://repo.eclipse.org/content/repositories/rcptt-releases/org/sonatype/sisu/sisu-inject/1.4.2/sisu-inject-1.4.2.pom
Downloading from rcptt-snapshots: https://repo.eclipse.org/content/repositories/rcptt-snapshots/org/sonatype/sisu/sisu-inject/1.4.2/sisu-inject-1.4.2.pom
Downloading from eclipse.maven.central.mirror: https://repo.eclipse.org/content/repositories/maven_central/org/sonatype/sisu/sisu-inject/1.4.2/sisu-inject-1.4.2.pom
Progress (1): 1.2 kB
                    
Downloaded from eclipse.maven.central.mirror: https://repo.eclipse.org/content/repositories/maven_central/org/sonatype/sisu/sisu-inject/1.4.2/sisu-inject-1.4.2.pom (1.2 kB at 36 kB/s)
Downloading from rcptt-releases: https://repo.eclipse.org/content/repositories/rcptt-releases/org/sonatype/sisu/sisu-parent/1.4.2/sisu-parent-1.4.2.pom
Downloading from rcptt-snapshots: https://repo.eclipse.org/content/repositories/rcptt-snapshots/org/sonatype/sisu/sisu-parent/1.4.2/sisu-parent-1.4.2.pom
Downloading from eclipse.maven.central.mirror: https://repo.eclipse.org/content/repositories/maven_central/org/sonatype/sisu/sisu-parent/1.4.2/sisu-parent-1.4.2.pom
Progress (1): 4.1/7.8 kB
Progress (1): 7.7/7.8 kB
Progress (1): 7.8 kB    
                    
Downloaded from eclipse.maven.central.mirror: https://repo.eclipse.org/content/repositories/maven_central/org/sonatype/sisu/sisu-parent/1.4.2/sisu-parent-1.4.2.pom (7.8 kB at 216 kB/s)
Downloading from rcptt-releases: https://repo.eclipse.org/content/repositories/rcptt-releases/org/sonatype/forge/forge-parent/6/forge-parent-6.pom
Downloading from rcptt-snapshots: https://repo.eclipse.org/content/repositories/rcptt-snapshots/org/sonatype/forge/forge-parent/6/forge-parent-6.pom
Downloading from eclipse.maven.central.mirror: https://repo.eclipse.org/content/repositories/maven_central/org/sonatype/forge/forge-parent/6/forge-parent-6.pom
Progress (1): 4.1/11 kB
Progress (1): 7.7/11 kB
Progress (1): 11 kB    
                   
Downloaded from eclipse.maven.central.mirror: https://repo.eclipse.org/content/repositories/maven_central/org/sonatype/forge/forge-parent/6/forge-parent-6.pom (11 kB at 276 kB/s)
Downloading from rcptt-releases: https://repo.eclipse.org/content/repositories/rcptt-releases/org/codehaus/plexus/plexus-component-annotations/1.5.4/plexus-component-annotations-1.5.4.pom
Downloading from rcptt-snapshots: https://repo.eclipse.org/content/repositories/rcptt-snapshots/org/codehaus/plexus/plexus-component-annotations/1.5.4/plexus-component-annotations-1.5.4.pom
Downloading from eclipse.maven.central.mirror: https://repo.eclipse.org/content/repositories/maven_central/org/codehaus/plexus/plexus-component-annotations/1.5.4/plexus-component-annotations-1.5.4.pom
Progress (1): 815 B
                   
Downloaded from eclipse.maven.central.mirror: https://repo.eclipse.org/content/repositories/maven_central/org/codehaus/plexus/plexus-component-annotations/1.5.4/plexus-component-annotations-1.5.4.pom (815 B at 26 kB/s)
Downloading from rcptt-releases: https://repo.eclipse.org/content/repositories/rcptt-releases/org/codehaus/plexus/plexus-containers/1.5.4/plexus-containers-1.5.4.pom
Downloading from rcptt-snapshots: https://repo.eclipse.org/content/repositories/rcptt-snapshots/org/codehaus/plexus/plexus-containers/1.5.4/plexus-containers-1.5.4.pom
Downloading from eclipse.maven.central.mirror: https://repo.eclipse.org/content/repositories/maven_central/org/codehaus/plexus/plexus-containers/1.5.4/plexus-containers-1.5.4.pom
Progress (1): 4.1/4.2 kB
Progress (1): 4.2 kB    
                    
Downloaded from eclipse.maven.central.mirror: https://repo.eclipse.org/content/repositories/maven_central/org/codehaus/plexus/plexus-containers/1.5.4/plexus-containers-1.5.4.pom (4.2 kB at 128 kB/s)
Downloading from rcptt-releases: https://repo.eclipse.org/content/repositories/rcptt-releases/org/codehaus/plexus/plexus/2.0.5/plexus-2.0.5.pom
Downloading from rcptt-snapshots: https://repo.eclipse.org/content/repositories/rcptt-snapshots/org/codehaus/plexus/plexus/2.0.5/plexus-2.0.5.pom
Downloading from eclipse.maven.central.mirror: https://repo.eclipse.org/content/repositories/maven_central/org/codehaus/plexus/plexus/2.0.5/plexus-2.0.5.pom
Progress (1): 4.1/17 kB
Progress (1): 7.7/17 kB
Progress (1): 12/17 kB 
Progress (1): 16/17 kB
Progress (1): 17 kB   
                   
Downloaded from eclipse.maven.central.mirror: https://repo.eclipse.org/content/repositories/maven_central/org/codehaus/plexus/plexus/2.0.5/plexus-2.0.5.pom (17 kB at 361 kB/s)
Downloading from rcptt-releases: https://repo.eclipse.org/content/repositories/rcptt-releases/org/codehaus/plexus/plexus-classworlds/2.2.3/plexus-classworlds-2.2.3.pom
Downloading from rcptt-snapshots: https://repo.eclipse.org/content/repositories/rcptt-snapshots/org/codehaus/plexus/plexus-classworlds/2.2.3/plexus-classworlds-2.2.3.pom
Downloading from eclipse.maven.central.mirror: https://repo.eclipse.org/content/repositories/maven_central/org/codehaus/plexus/plexus-classworlds/2.2.3/plexus-classworlds-2.2.3.pom
Progress (1): 4.0 kB
                    
Downloaded from eclipse.maven.central.mirror: https://repo.eclipse.org/content/repositories/maven_central/org/codehaus/plexus/plexus-classworlds/2.2.3/plexus-classworlds-2.2.3.pom (4.0 kB at 133 kB/s)
Downloading from rcptt-releases: https://repo.eclipse.org/content/repositories/rcptt-releases/org/sonatype/sisu/sisu-inject-bean/1.4.2/sisu-inject-bean-1.4.2.pom
Downloading from rcptt-snapshots: https://repo.eclipse.org/content/repositories/rcptt-snapshots/org/sonatype/sisu/sisu-inject-bean/1.4.2/sisu-inject-bean-1.4.2.pom
Downloading from eclipse.maven.central.mirror: https://repo.eclipse.org/content/repositories/maven_central/org/sonatype/sisu/sisu-inject-bean/1.4.2/sisu-inject-bean-1.4.2.pom
Progress (1): 4.1/5.5 kB
Progress (1): 5.5 kB    
                    
Downloaded from eclipse.maven.central.mirror: https://repo.eclipse.org/content/repositories/maven_central/org/sonatype/sisu/sisu-inject-bean/1.4.2/sisu-inject-bean-1.4.2.pom (5.5 kB at 130 kB/s)
Downloading from rcptt-releases: https://repo.eclipse.org/content/repositories/rcptt-releases/org/sonatype/sisu/sisu-guice/2.1.7/sisu-guice-2.1.7.pom
Downloading from rcptt-snapshots: https://repo.eclipse.org/content/repositories/rcptt-snapshots/org/sonatype/sisu/sisu-guice/2.1.7/sisu-guice-2.1.7.pom
Downloading from eclipse.maven.central.mirror: https://repo.eclipse.org/content/repositories/maven_central/org/sonatype/sisu/sisu-guice/2.1.7/sisu-guice-2.1.7.pom
Progress (1): 4.1/11 kB
Progress (1): 7.7/11 kB
Progress (1): 11 kB    
                   
Downloaded from eclipse.maven.central.mirror: https://repo.eclipse.org/content/repositories/maven_central/org/sonatype/sisu/sisu-guice/2.1.7/sisu-guice-2.1.7.pom (11 kB at 316 kB/s)
Downloading from rcptt-releases: https://repo.eclipse.org/content/repositories/rcptt-releases/org/apache/maven/maven-plugin-descriptor/2.2.1/maven-plugin-descriptor-2.2.1.pom
Downloading from rcptt-snapshots: https://repo.eclipse.org/content/repositories/rcptt-snapshots/org/apache/maven/maven-plugin-descriptor/2.2.1/maven-plugin-descriptor-2.2.1.pom
Downloading from eclipse.maven.central.mirror: https://repo.eclipse.org/content/repositories/maven_central/org/apache/maven/maven-plugin-descriptor/2.2.1/maven-plugin-descriptor-2.2.1.pom
Progress (1): 2.1 kB
                    
Downloaded from eclipse.maven.central.mirror: https://repo.eclipse.org/content/repositories/maven_central/org/apache/maven/maven-plugin-descriptor/2.2.1/maven-plugin-descriptor-2.2.1.pom (2.1 kB at 56 kB/s)
Downloading from rcptt-releases: https://repo.eclipse.org/content/repositories/rcptt-releases/org/codehaus/plexus/plexus-interactivity-api/1.0-alpha-4/plexus-interactivity-api-1.0-alpha-4.pom
Downloading from rcptt-snapshots: https://repo.eclipse.org/content/repositories/rcptt-snapshots/org/codehaus/plexus/plexus-interactivity-api/1.0-alpha-4/plexus-interactivity-api-1.0-alpha-4.pom
Downloading from eclipse.maven.central.mirror: https://repo.eclipse.org/content/repositories/maven_central/org/codehaus/plexus/plexus-interactivity-api/1.0-alpha-4/plexus-interactivity-api-1.0-alpha-4.pom
Progress (1): 4.1/7.1 kB
Progress (1): 7.1 kB    
                    
Downloaded from eclipse.maven.central.mirror: https://repo.eclipse.org/content/repositories/maven_central/org/codehaus/plexus/plexus-interactivity-api/1.0-alpha-4/plexus-interactivity-api-1.0-alpha-4.pom (7.1 kB at 236 kB/s)
Downloading from rcptt-releases: https://repo.eclipse.org/content/repositories/rcptt-releases/org/apache/maven/maven-monitor/2.2.1/maven-monitor-2.2.1.pom
Downloading from rcptt-snapshots: https://repo.eclipse.org/content/repositories/rcptt-snapshots/org/apache/maven/maven-monitor/2.2.1/maven-monitor-2.2.1.pom
Downloading from eclipse.maven.central.mirror: https://repo.eclipse.org/content/repositories/maven_central/org/apache/maven/maven-monitor/2.2.1/maven-monitor-2.2.1.pom
Progress (1): 1.3 kB
                    
Downloaded from eclipse.maven.central.mirror: https://repo.eclipse.org/content/repositories/maven_central/org/apache/maven/maven-monitor/2.2.1/maven-monitor-2.2.1.pom (1.3 kB at 42 kB/s)
Downloading from rcptt-releases: https://repo.eclipse.org/content/repositories/rcptt-releases/classworlds/classworlds/1.1/classworlds-1.1.pom
Downloading from rcptt-snapshots: https://repo.eclipse.org/content/repositories/rcptt-snapshots/classworlds/classworlds/1.1/classworlds-1.1.pom
Downloading from eclipse.maven.central.mirror: https://repo.eclipse.org/content/repositories/maven_central/classworlds/classworlds/1.1/classworlds-1.1.pom
Progress (1): 3.3 kB
                    
Downloaded from eclipse.maven.central.mirror: https://repo.eclipse.org/content/repositories/maven_central/classworlds/classworlds/1.1/classworlds-1.1.pom (3.3 kB at 65 B/s)
Downloading from rcptt-releases: https://repo.eclipse.org/content/repositories/rcptt-releases/org/sonatype/plexus/plexus-sec-dispatcher/1.3/plexus-sec-dispatcher-1.3.pom
Downloading from rcptt-snapshots: https://repo.eclipse.org/content/repositories/rcptt-snapshots/org/sonatype/plexus/plexus-sec-dispatcher/1.3/plexus-sec-dispatcher-1.3.pom
Downloading from eclipse.maven.central.mirror: https://repo.eclipse.org/content/repositories/maven_central/org/sonatype/plexus/plexus-sec-dispatcher/1.3/plexus-sec-dispatcher-1.3.pom
Progress (1): 3.0 kB
                    
Downloaded from eclipse.maven.central.mirror: https://repo.eclipse.org/content/repositories/maven_central/org/sonatype/plexus/plexus-sec-dispatcher/1.3/plexus-sec-dispatcher-1.3.pom (3.0 kB at 93 kB/s)
Downloading from rcptt-releases: https://repo.eclipse.org/content/repositories/rcptt-releases/org/codehaus/plexus/plexus-utils/3.0.20/plexus-utils-3.0.20.pom
Downloading from rcptt-snapshots: https://repo.eclipse.org/content/repositories/rcptt-snapshots/org/codehaus/plexus/plexus-utils/3.0.20/plexus-utils-3.0.20.pom
Downloading from eclipse.maven.central.mirror: https://repo.eclipse.org/content/repositories/maven_central/org/codehaus/plexus/plexus-utils/3.0.20/plexus-utils-3.0.20.pom
Progress (1): 3.8 kB
                    
Downloaded from eclipse.maven.central.mirror: https://repo.eclipse.org/content/repositories/maven_central/org/codehaus/plexus/plexus-utils/3.0.20/plexus-utils-3.0.20.pom (3.8 kB at 119 kB/s)
Downloading from rcptt-releases: https://repo.eclipse.org/content/repositories/rcptt-releases/org/apache/commons/commons-exec/1.3/commons-exec-1.3.pom
Downloading from rcptt-snapshots: https://repo.eclipse.org/content/repositories/rcptt-snapshots/org/apache/commons/commons-exec/1.3/commons-exec-1.3.pom
Downloading from eclipse.maven.central.mirror: https://repo.eclipse.org/content/repositories/maven_central/org/apache/commons/commons-exec/1.3/commons-exec-1.3.pom
Progress (1): 4.1/11 kB
Progress (1): 7.7/11 kB
Progress (1): 11 kB    
                   
Downloaded from eclipse.maven.central.mirror: https://repo.eclipse.org/content/repositories/maven_central/org/apache/commons/commons-exec/1.3/commons-exec-1.3.pom (11 kB at 92 kB/s)
Downloading from rcptt-releases: https://repo.eclipse.org/content/repositories/rcptt-releases/org/apache/commons/commons-parent/35/commons-parent-35.pom
Downloading from rcptt-snapshots: https://repo.eclipse.org/content/repositories/rcptt-snapshots/org/apache/commons/commons-parent/35/commons-parent-35.pom
Downloading from eclipse.maven.central.mirror: https://repo.eclipse.org/content/repositories/maven_central/org/apache/commons/commons-parent/35/commons-parent-35.pom
Progress (1): 4.1/58 kB
Progress (1): 7.7/58 kB
Progress (1): 12/58 kB 
Progress (1): 16/58 kB
Progress (1): 20/58 kB
Progress (1): 24/58 kB
Progress (1): 28/58 kB
Progress (1): 32/58 kB
Progress (1): 36/58 kB
Progress (1): 40/58 kB
Progress (1): 44/58 kB
Progress (1): 48/58 kB
Progress (1): 52/58 kB
Progress (1): 56/58 kB
Progress (1): 58 kB   
                   
Downloaded from eclipse.maven.central.mirror: https://repo.eclipse.org/content/repositories/maven_central/org/apache/commons/commons-parent/35/commons-parent-35.pom (58 kB at 1.3 MB/s)
Downloading from rcptt-releases: https://repo.eclipse.org/content/repositories/rcptt-releases/org/apache/apache/15/apache-15.pom
Downloading from rcptt-snapshots: https://repo.eclipse.org/content/repositories/rcptt-snapshots/org/apache/apache/15/apache-15.pom
Downloading from eclipse.maven.central.mirror: https://repo.eclipse.org/content/repositories/maven_central/org/apache/apache/15/apache-15.pom
Progress (1): 4.1/15 kB
Progress (1): 7.7/15 kB
Progress (1): 12/15 kB 
Progress (1): 15 kB   
                   
Downloaded from eclipse.maven.central.mirror: https://repo.eclipse.org/content/repositories/maven_central/org/apache/apache/15/apache-15.pom (15 kB at 525 kB/s)
Downloading from rcptt-releases: https://repo.eclipse.org/content/repositories/rcptt-releases/org/apache/maven/maven-toolchain/2.2.1/maven-toolchain-2.2.1.jar
Downloading from rcptt-releases: https://repo.eclipse.org/content/repositories/rcptt-releases/org/apache/maven/maven-plugin-parameter-documenter/2.2.1/maven-plugin-parameter-documenter-2.2.1.jar
Downloading from rcptt-releases: https://repo.eclipse.org/content/repositories/rcptt-releases/org/apache/maven/maven-core/2.2.1/maven-core-2.2.1.jar
Downloading from rcptt-releases: https://repo.eclipse.org/content/repositories/rcptt-releases/org/slf4j/slf4j-api/1.5.6/slf4j-api-1.5.6.jar
Downloading from rcptt-releases: https://repo.eclipse.org/content/repositories/rcptt-releases/org/slf4j/slf4j-jdk14/1.5.6/slf4j-jdk14-1.5.6.jar
Downloading from rcptt-releases: https://repo.eclipse.org/content/repositories/rcptt-releases/org/slf4j/jcl-over-slf4j/1.5.6/jcl-over-slf4j-1.5.6.jar
Downloading from rcptt-releases: https://repo.eclipse.org/content/repositories/rcptt-releases/org/apache/maven/maven-error-diagnostics/2.2.1/maven-error-diagnostics-2.2.1.jar
Downloading from rcptt-releases: https://repo.eclipse.org/content/repositories/rcptt-releases/commons-cli/commons-cli/1.2/commons-cli-1.2.jar
Downloading from rcptt-releases: https://repo.eclipse.org/content/repositories/rcptt-releases/org/apache/maven/maven-plugin-descriptor/2.2.1/maven-plugin-descriptor-2.2.1.jar
Downloading from rcptt-releases: https://repo.eclipse.org/content/repositories/rcptt-releases/org/codehaus/plexus/plexus-interactivity-api/1.0-alpha-4/plexus-interactivity-api-1.0-alpha-4.jar
Downloading from rcptt-releases: https://repo.eclipse.org/content/repositories/rcptt-releases/org/apache/maven/maven-monitor/2.2.1/maven-monitor-2.2.1.jar
Downloading from rcptt-releases: https://repo.eclipse.org/content/repositories/rcptt-releases/classworlds/classworlds/1.1/classworlds-1.1.jar
Downloading from rcptt-releases: https://repo.eclipse.org/content/repositories/rcptt-releases/org/sonatype/plexus/plexus-sec-dispatcher/1.3/plexus-sec-dispatcher-1.3.jar
Downloading from rcptt-releases: https://repo.eclipse.org/content/repositories/rcptt-releases/org/codehaus/plexus/plexus-utils/3.0.20/plexus-utils-3.0.20.jar
Downloading from rcptt-releases: https://repo.eclipse.org/content/repositories/rcptt-releases/org/apache/commons/commons-exec/1.3/commons-exec-1.3.jar
Downloading from rcptt-snapshots: https://repo.eclipse.org/content/repositories/rcptt-snapshots/org/apache/maven/maven-toolchain/2.2.1/maven-toolchain-2.2.1.jar
Downloading from rcptt-snapshots: https://repo.eclipse.org/content/repositories/rcptt-snapshots/org/apache/maven/maven-plugin-parameter-documenter/2.2.1/maven-plugin-parameter-documenter-2.2.1.jar
Downloading from rcptt-snapshots: https://repo.eclipse.org/content/repositories/rcptt-snapshots/org/slf4j/slf4j-api/1.5.6/slf4j-api-1.5.6.jar
Downloading from rcptt-snapshots: https://repo.eclipse.org/content/repositories/rcptt-snapshots/org/slf4j/slf4j-jdk14/1.5.6/slf4j-jdk14-1.5.6.jar
Downloading from rcptt-snapshots: https://repo.eclipse.org/content/repositories/rcptt-snapshots/org/apache/maven/maven-core/2.2.1/maven-core-2.2.1.jar
Downloading from rcptt-snapshots: https://repo.eclipse.org/content/repositories/rcptt-snapshots/org/slf4j/jcl-over-slf4j/1.5.6/jcl-over-slf4j-1.5.6.jar
Downloading from rcptt-snapshots: https://repo.eclipse.org/content/repositories/rcptt-snapshots/org/apache/maven/maven-error-diagnostics/2.2.1/maven-error-diagnostics-2.2.1.jar
Downloading from rcptt-snapshots: https://repo.eclipse.org/content/repositories/rcptt-snapshots/commons-cli/commons-cli/1.2/commons-cli-1.2.jar
Downloading from rcptt-snapshots: https://repo.eclipse.org/content/repositories/rcptt-snapshots/org/apache/maven/maven-plugin-descriptor/2.2.1/maven-plugin-descriptor-2.2.1.jar
Downloading from rcptt-snapshots: https://repo.eclipse.org/content/repositories/rcptt-snapshots/org/codehaus/plexus/plexus-interactivity-api/1.0-alpha-4/plexus-interactivity-api-1.0-alpha-4.jar
Downloading from rcptt-snapshots: https://repo.eclipse.org/content/repositories/rcptt-snapshots/org/apache/maven/maven-monitor/2.2.1/maven-monitor-2.2.1.jar
Downloading from rcptt-snapshots: https://repo.eclipse.org/content/repositories/rcptt-snapshots/classworlds/classworlds/1.1/classworlds-1.1.jar
Downloading from rcptt-snapshots: https://repo.eclipse.org/content/repositories/rcptt-snapshots/org/sonatype/plexus/plexus-sec-dispatcher/1.3/plexus-sec-dispatcher-1.3.jar
Downloading from rcptt-snapshots: https://repo.eclipse.org/content/repositories/rcptt-snapshots/org/codehaus/plexus/plexus-utils/3.0.20/plexus-utils-3.0.20.jar
Downloading from rcptt-snapshots: https://repo.eclipse.org/content/repositories/rcptt-snapshots/org/apache/commons/commons-exec/1.3/commons-exec-1.3.jar
Downloading from eclipse.maven.central.mirror: https://repo.eclipse.org/content/repositories/maven_central/org/apache/maven/maven-toolchain/2.2.1/maven-toolchain-2.2.1.jar
Downloading from eclipse.maven.central.mirror: https://repo.eclipse.org/content/repositories/maven_central/org/apache/maven/maven-plugin-parameter-documenter/2.2.1/maven-plugin-parameter-documenter-2.2.1.jar
Downloading from eclipse.maven.central.mirror: https://repo.eclipse.org/content/repositories/maven_central/org/apache/maven/maven-core/2.2.1/maven-core-2.2.1.jar
Downloading from eclipse.maven.central.mirror: https://repo.eclipse.org/content/repositories/maven_central/org/slf4j/slf4j-api/1.5.6/slf4j-api-1.5.6.jar
Downloading from eclipse.maven.central.mirror: https://repo.eclipse.org/content/repositories/maven_central/org/slf4j/slf4j-jdk14/1.5.6/slf4j-jdk14-1.5.6.jar
Progress (1): 4.1/22 kB
Progress (2): 4.1/22 kB | 4.1/38 kB
Progress (2): 7.7/22 kB | 4.1/38 kB
Progress (2): 7.7/22 kB | 7.7/38 kB
Progress (2): 7.7/22 kB | 12/38 kB 
Progress (2): 12/22 kB | 12/38 kB 
Progress (2): 12/22 kB | 16/38 kB
Progress (2): 16/22 kB | 16/38 kB
Progress (2): 16/22 kB | 20/38 kB
Progress (2): 20/22 kB | 20/38 kB
Progress (2): 20/22 kB | 24/38 kB
Progress (2): 22 kB | 24/38 kB   
Progress (2): 22 kB | 28/38 kB
Progress (2): 22 kB | 32/38 kB
Progress (2): 22 kB | 36/38 kB
Progress (2): 22 kB | 38 kB   
Progress (3): 22 kB | 38 kB | 4.1/22 kB
Progress (3): 22 kB | 38 kB | 7.7/22 kB
Progress (3): 22 kB | 38 kB | 12/22 kB 
Progress (3): 22 kB | 38 kB | 16/22 kB
Progress (3): 22 kB | 38 kB | 20/22 kB
Progress (3): 22 kB | 38 kB | 22 kB   
Progress (4): 22 kB | 38 kB | 22 kB | 4.1/8.8 kB
Progress (4): 22 kB | 38 kB | 22 kB | 7.7/8.8 kB
Progress (4): 22 kB | 38 kB | 22 kB | 8.8 kB    
Progress (5): 22 kB | 38 kB | 22 kB | 8.8 kB | 4.1/178 kB
Progress (5): 22 kB | 38 kB | 22 kB | 8.8 kB | 7.7/178 kB
Progress (5): 22 kB | 38 kB | 22 kB | 8.8 kB | 12/178 kB 
Progress (5): 22 kB | 38 kB | 22 kB | 8.8 kB | 16/178 kB
                                                        
Downloaded from eclipse.maven.central.mirror: https://repo.eclipse.org/content/repositories/maven_central/org/apache/maven/maven-toolchain/2.2.1/maven-toolchain-2.2.1.jar (38 kB at 855 kB/s)
Downloaded from eclipse.maven.central.mirror: https://repo.eclipse.org/content/repositories/maven_central/org/slf4j/slf4j-api/1.5.6/slf4j-api-1.5.6.jar (22 kB at 508 kB/s)
Downloading from eclipse.maven.central.mirror: https://repo.eclipse.org/content/repositories/maven_central/org/slf4j/jcl-over-slf4j/1.5.6/jcl-over-slf4j-1.5.6.jar
Progress (3): 22 kB | 8.8 kB | 20/178 kB
                                        
Downloading from eclipse.maven.central.mirror: https://repo.eclipse.org/content/repositories/maven_central/org/apache/maven/maven-error-diagnostics/2.2.1/maven-error-diagnostics-2.2.1.jar
Progress (3): 22 kB | 8.8 kB | 24/178 kB
Progress (3): 22 kB | 8.8 kB | 28/178 kB
Progress (3): 22 kB | 8.8 kB | 32/178 kB
Progress (3): 22 kB | 8.8 kB | 36/178 kB
                                        
Downloaded from eclipse.maven.central.mirror: https://repo.eclipse.org/content/repositories/maven_central/org/apache/maven/maven-plugin-parameter-documenter/2.2.1/maven-plugin-parameter-documenter-2.2.1.jar (22 kB at 472 kB/s)
Downloaded from eclipse.maven.central.mirror: https://repo.eclipse.org/content/repositories/maven_central/org/slf4j/slf4j-jdk14/1.5.6/slf4j-jdk14-1.5.6.jar (8.8 kB at 184 kB/s)
Progress (1): 40/178 kB
                       
Downloading from eclipse.maven.central.mirror: https://repo.eclipse.org/content/repositories/maven_central/org/apache/maven/maven-plugin-descriptor/2.2.1/maven-plugin-descriptor-2.2.1.jar
Downloading from eclipse.maven.central.mirror: https://repo.eclipse.org/content/repositories/maven_central/commons-cli/commons-cli/1.2/commons-cli-1.2.jar
Progress (1): 44/178 kB
Progress (1): 48/178 kB
Progress (1): 52/178 kB
Progress (1): 56/178 kB
Progress (1): 60/178 kB
Progress (1): 64/178 kB
Progress (1): 68/178 kB
Progress (1): 72/178 kB
Progress (1): 76/178 kB
Progress (1): 80/178 kB
Progress (1): 84/178 kB
Progress (1): 88/178 kB
Progress (1): 92/178 kB
Progress (1): 96/178 kB
Progress (1): 100/178 kB
Progress (1): 104/178 kB
Progress (1): 108/178 kB
Progress (1): 112/178 kB
Progress (1): 116/178 kB
Progress (1): 120/178 kB
Progress (1): 124/178 kB
Progress (1): 128/178 kB
Progress (1): 132/178 kB
Progress (1): 136/178 kB
Progress (1): 140/178 kB
Progress (1): 144/178 kB
Progress (1): 148/178 kB
Progress (1): 152/178 kB
Progress (1): 156/178 kB
Progress (1): 160/178 kB
Progress (1): 164/178 kB
Progress (1): 168/178 kB
Progress (1): 172/178 kB
Progress (2): 172/178 kB | 4.1/41 kB
Progress (2): 176/178 kB | 4.1/41 kB
Progress (3): 176/178 kB | 4.1/41 kB | 4.1/39 kB
Progress (3): 178 kB | 4.1/41 kB | 4.1/39 kB    
Progress (3): 178 kB | 7.7/41 kB | 4.1/39 kB
Progress (3): 178 kB | 7.7/41 kB | 7.7/39 kB
Progress (3): 178 kB | 12/41 kB | 7.7/39 kB 
Progress (3): 178 kB | 12/41 kB | 12/39 kB 
Progress (3): 178 kB | 16/41 kB | 12/39 kB
Progress (3): 178 kB | 16/41 kB | 16/39 kB
Progress (3): 178 kB | 20/41 kB | 16/39 kB
Progress (3): 178 kB | 20/41 kB | 20/39 kB
Progress (3): 178 kB | 24/41 kB | 20/39 kB
Progress (3): 178 kB | 24/41 kB | 24/39 kB
Progress (3): 178 kB | 28/41 kB | 24/39 kB
Progress (3): 178 kB | 28/41 kB | 28/39 kB
Progress (3): 178 kB | 32/41 kB | 28/39 kB
Progress (3): 178 kB | 32/41 kB | 32/39 kB
Progress (3): 178 kB | 36/41 kB | 32/39 kB
Progress (3): 178 kB | 36/41 kB | 36/39 kB
Progress (3): 178 kB | 40/41 kB | 36/39 kB
Progress (3): 178 kB | 40/41 kB | 39 kB   
Progress (3): 178 kB | 41 kB | 39 kB   
Progress (4): 178 kB | 41 kB | 39 kB | 4.1/17 kB
Progress (4): 178 kB | 41 kB | 39 kB | 7.7/17 kB
Progress (5): 178 kB | 41 kB | 39 kB | 7.7/17 kB | 4.1/13 kB
Progress (5): 178 kB | 41 kB | 39 kB | 12/17 kB | 4.1/13 kB 
Progress (5): 178 kB | 41 kB | 39 kB | 12/17 kB | 7.7/13 kB
Progress (5): 178 kB | 41 kB | 39 kB | 16/17 kB | 7.7/13 kB
                                                           
Downloaded from eclipse.maven.central.mirror: https://repo.eclipse.org/content/repositories/maven_central/org/apache/maven/maven-core/2.2.1/maven-core-2.2.1.jar (178 kB at 3.0 MB/s)
Downloading from eclipse.maven.central.mirror: https://repo.eclipse.org/content/repositories/maven_central/org/codehaus/plexus/plexus-interactivity-api/1.0-alpha-4/plexus-interactivity-api-1.0-alpha-4.jar
Progress (4): 41 kB | 39 kB | 17 kB | 7.7/13 kB
Progress (4): 41 kB | 39 kB | 17 kB | 12/13 kB 
Progress (4): 41 kB | 39 kB | 17 kB | 13 kB   
                                           
Downloaded from eclipse.maven.central.mirror: https://repo.eclipse.org/content/repositories/maven_central/org/apache/maven/maven-plugin-descriptor/2.2.1/maven-plugin-descriptor-2.2.1.jar (39 kB at 634 kB/s)
Downloading from eclipse.maven.central.mirror: https://repo.eclipse.org/content/repositories/maven_central/org/apache/maven/maven-monitor/2.2.1/maven-monitor-2.2.1.jar
Downloaded from eclipse.maven.central.mirror: https://repo.eclipse.org/content/repositories/maven_central/commons-cli/commons-cli/1.2/commons-cli-1.2.jar (41 kB at 633 kB/s)
Downloading from eclipse.maven.central.mirror: https://repo.eclipse.org/content/repositories/maven_central/classworlds/classworlds/1.1/classworlds-1.1.jar
Downloaded from eclipse.maven.central.mirror: https://repo.eclipse.org/content/repositories/maven_central/org/slf4j/jcl-over-slf4j/1.5.6/jcl-over-slf4j-1.5.6.jar (17 kB at 253 kB/s)
Downloading from eclipse.maven.central.mirror: https://repo.eclipse.org/content/repositories/maven_central/org/sonatype/plexus/plexus-sec-dispatcher/1.3/plexus-sec-dispatcher-1.3.jar
Downloaded from eclipse.maven.central.mirror: https://repo.eclipse.org/content/repositories/maven_central/org/apache/maven/maven-error-diagnostics/2.2.1/maven-error-diagnostics-2.2.1.jar (13 kB at 197 kB/s)
Downloading from eclipse.maven.central.mirror: https://repo.eclipse.org/content/repositories/maven_central/org/codehaus/plexus/plexus-utils/3.0.20/plexus-utils-3.0.20.jar
Progress (1): 4.1/10 kB
Progress (2): 4.1/10 kB | 4.1/13 kB
Progress (2): 7.7/10 kB | 4.1/13 kB
Progress (2): 7.7/10 kB | 7.7/13 kB
Progress (2): 10 kB | 7.7/13 kB    
Progress (2): 10 kB | 12/13 kB 
Progress (2): 10 kB | 13 kB   
                           
Downloaded from eclipse.maven.central.mirror: https://repo.eclipse.org/content/repositories/maven_central/org/apache/maven/maven-monitor/2.2.1/maven-monitor-2.2.1.jar (10 kB at 111 kB/s)
Downloaded from eclipse.maven.central.mirror: https://repo.eclipse.org/content/repositories/maven_central/org/codehaus/plexus/plexus-interactivity-api/1.0-alpha-4/plexus-interactivity-api-1.0-alpha-4.jar (13 kB at 143 kB/s)
Progress (1): 4.1/29 kB
                       
Downloading from eclipse.maven.central.mirror: https://repo.eclipse.org/content/repositories/maven_central/org/apache/commons/commons-exec/1.3/commons-exec-1.3.jar
Progress (1): 7.7/29 kB
Progress (1): 12/29 kB 
Progress (1): 16/29 kB
Progress (1): 20/29 kB
Progress (1): 24/29 kB
Progress (1): 28/29 kB
Progress (1): 29 kB   
Progress (2): 29 kB | 4.1/243 kB
Progress (2): 29 kB | 7.7/243 kB
Progress (2): 29 kB | 12/243 kB 
Progress (2): 29 kB | 16/243 kB
Progress (2): 29 kB | 20/243 kB
Progress (2): 29 kB | 24/243 kB
Progress (2): 29 kB | 28/243 kB
Progress (2): 29 kB | 32/243 kB
Progress (2): 29 kB | 36/243 kB
Progress (2): 29 kB | 40/243 kB
Progress (2): 29 kB | 44/243 kB
Progress (3): 29 kB | 44/243 kB | 4.1/38 kB
Progress (3): 29 kB | 48/243 kB | 4.1/38 kB
Progress (3): 29 kB | 48/243 kB | 7.7/38 kB
Progress (3): 29 kB | 52/243 kB | 7.7/38 kB
Progress (3): 29 kB | 56/243 kB | 7.7/38 kB
Progress (3): 29 kB | 56/243 kB | 12/38 kB 
Progress (3): 29 kB | 60/243 kB | 12/38 kB
Progress (3): 29 kB | 60/243 kB | 16/38 kB
Progress (3): 29 kB | 64/243 kB | 16/38 kB
Progress (3): 29 kB | 64/243 kB | 20/38 kB
Progress (3): 29 kB | 68/243 kB | 20/38 kB
Progress (3): 29 kB | 68/243 kB | 24/38 kB
Progress (3): 29 kB | 72/243 kB | 24/38 kB
Progress (3): 29 kB | 72/243 kB | 28/38 kB
Progress (3): 29 kB | 76/243 kB | 28/38 kB
Progress (3): 29 kB | 76/243 kB | 32/38 kB
Progress (3): 29 kB | 80/243 kB | 32/38 kB
Progress (3): 29 kB | 80/243 kB | 36/38 kB
Progress (3): 29 kB | 84/243 kB | 36/38 kB
Progress (3): 29 kB | 84/243 kB | 38 kB   
Progress (3): 29 kB | 88/243 kB | 38 kB
Progress (3): 29 kB | 92/243 kB | 38 kB
Progress (3): 29 kB | 96/243 kB | 38 kB
Progress (3): 29 kB | 100/243 kB | 38 kB
Progress (3): 29 kB | 104/243 kB | 38 kB
Progress (3): 29 kB | 108/243 kB | 38 kB
                                        
Downloaded from eclipse.maven.central.mirror: https://repo.eclipse.org/content/repositories/maven_central/org/sonatype/plexus/plexus-sec-dispatcher/1.3/plexus-sec-dispatcher-1.3.jar (29 kB at 280 kB/s)
Progress (2): 112/243 kB | 38 kB
Progress (2): 116/243 kB | 38 kB
Progress (2): 120/243 kB | 38 kB
Progress (2): 124/243 kB | 38 kB
Progress (3): 124/243 kB | 38 kB | 4.1/54 kB
Progress (3): 128/243 kB | 38 kB | 4.1/54 kB
Progress (3): 128/243 kB | 38 kB | 7.7/54 kB
Progress (3): 132/243 kB | 38 kB | 7.7/54 kB
Progress (3): 132/243 kB | 38 kB | 12/54 kB 
Progress (3): 136/243 kB | 38 kB | 12/54 kB
Progress (3): 136/243 kB | 38 kB | 16/54 kB
Progress (3): 140/243 kB | 38 kB | 16/54 kB
Progress (3): 140/243 kB | 38 kB | 20/54 kB
Progress (3): 144/243 kB | 38 kB | 20/54 kB
Progress (3): 144/243 kB | 38 kB | 24/54 kB
Progress (3): 148/243 kB | 38 kB | 24/54 kB
Progress (3): 152/243 kB | 38 kB | 24/54 kB
Progress (3): 152/243 kB | 38 kB | 28/54 kB
Progress (3): 156/243 kB | 38 kB | 28/54 kB
Progress (3): 156/243 kB | 38 kB | 32/54 kB
Progress (3): 160/243 kB | 38 kB | 32/54 kB
Progress (3): 160/243 kB | 38 kB | 36/54 kB
                                           
Downloaded from eclipse.maven.central.mirror: https://repo.eclipse.org/content/repositories/maven_central/classworlds/classworlds/1.1/classworlds-1.1.jar (38 kB at 265 kB/s)
Progress (2): 164/243 kB | 36/54 kB
Progress (2): 164/243 kB | 40/54 kB
Progress (2): 168/243 kB | 40/54 kB
Progress (2): 168/243 kB | 44/54 kB
Progress (2): 172/243 kB | 44/54 kB
Progress (2): 172/243 kB | 48/54 kB
Progress (2): 176/243 kB | 48/54 kB
Progress (2): 176/243 kB | 52/54 kB
Progress (2): 176/243 kB | 54 kB   
Progress (2): 180/243 kB | 54 kB
Progress (2): 184/243 kB | 54 kB
Progress (2): 188/243 kB | 54 kB
Progress (2): 192/243 kB | 54 kB
Progress (2): 196/243 kB | 54 kB
Progress (2): 200/243 kB | 54 kB
Progress (2): 204/243 kB | 54 kB
Progress (2): 208/243 kB | 54 kB
Progress (2): 212/243 kB | 54 kB
Progress (2): 216/243 kB | 54 kB
Progress (2): 220/243 kB | 54 kB
Progress (2): 224/243 kB | 54 kB
Progress (2): 228/243 kB | 54 kB
Progress (2): 232/243 kB | 54 kB
Progress (2): 236/243 kB | 54 kB
Progress (2): 240/243 kB | 54 kB
Progress (2): 243 kB | 54 kB    
                            
Downloaded from eclipse.maven.central.mirror: https://repo.eclipse.org/content/repositories/maven_central/org/apache/commons/commons-exec/1.3/commons-exec-1.3.jar (54 kB at 363 kB/s)
Downloaded from eclipse.maven.central.mirror: https://repo.eclipse.org/content/repositories/maven_central/org/codehaus/plexus/plexus-utils/3.0.20/plexus-utils-3.0.20.jar (243 kB at 1.6 MB/s)
rm: cannot remove ‘/home/data/httpd/download.eclipse.org/ecp/aut/2019-06_R.tar.gz’: Permission denied
photon_R.tar.gz: Permission denied
[ERROR] Command execution failed.
org.apache.commons.exec.ExecuteException: Process exited with an error: 1 (Exit value: 1)
    at org.apache.commons.exec.DefaultExecutor.executeInternal (DefaultExecutor.java:404)
    at org.apache.commons.exec.DefaultExecutor.execute (DefaultExecutor.java:166)
    at org.codehaus.mojo.exec.ExecMojo.executeCommandLine (ExecMojo.java:804)
    at org.codehaus.mojo.exec.ExecMojo.executeCommandLine (ExecMojo.java:751)
    at org.codehaus.mojo.exec.ExecMojo.execute (ExecMojo.java:313)
    at org.apache.maven.plugin.DefaultBuildPluginManager.executeMojo (DefaultBuildPluginManager.java:137)
    at org.apache.maven.lifecycle.internal.MojoExecutor.execute (MojoExecutor.java:210)
    at org.apache.maven.lifecycle.internal.MojoExecutor.execute (MojoExecutor.java:156)
    at org.apache.maven.lifecycle.internal.MojoExecutor.execute (MojoExecutor.java:148)
    at org.apache.maven.lifecycle.internal.LifecycleModuleBuilder.buildProject (LifecycleModuleBuilder.java:117)
    at org.apache.maven.lifecycle.internal.LifecycleModuleBuilder.buildProject (LifecycleModuleBuilder.java:81)
    at org.apache.maven.lifecycle.internal.builder.singlethreaded.SingleThreadedBuilder.build (SingleThreadedBuilder.java:56)
    at org.apache.maven.lifecycle.internal.LifecycleStarter.execute (LifecycleStarter.java:128)
    at org.apache.maven.DefaultMaven.doExecute (DefaultMaven.java:305)
    at org.apache.maven.DefaultMaven.doExecute (DefaultMaven.java:192)
    at org.apache.maven.DefaultMaven.execute (DefaultMaven.java:105)
    at org.apache.maven.cli.MavenCli.execute (MavenCli.java:956)
    at org.apache.maven.cli.MavenCli.doMain (MavenCli.java:288)
    at org.apache.maven.cli.MavenCli.main (MavenCli.java:192)
    at sun.reflect.NativeMethodAccessorImpl.invoke0 (Native Method)
    at sun.reflect.NativeMethodAccessorImpl.invoke (NativeMethodAccessorImpl.java:62)
    at sun.reflect.DelegatingMethodAccessorImpl.invoke (DelegatingMethodAccessorImpl.java:43)
    at java.lang.reflect.Method.invoke (Method.java:498)
    at org.codehaus.plexus.classworlds.launcher.Launcher.launchEnhanced (Launcher.java:289)
    at org.codehaus.plexus.classworlds.launcher.Launcher.launch (Launcher.java:229)
    at org.codehaus.plexus.classworlds.launcher.Launcher.mainWithExitCode (Launcher.java:415)
    at org.codehaus.plexus.classworlds.launcher.Launcher.main (Launcher.java:356)
[INFO] ------------------------------------------------------------------------
[INFO] Reactor Summary for q7tests 0.0.1-SNAPSHOT:
[INFO] 
[INFO] q7tests ............................................ SUCCESS [ 13.113 s]
[INFO] q7-epp-tests ....................................... SUCCESS [  2.176 s]
[INFO] q7-epp-tests-updatesite ............................ SUCCESS [  0.004 s]
[INFO] q7tests-previous ................................... FAILURE [ 54.975 s]
[INFO] q7tests-current .................................... SKIPPED
[INFO] q7-non-epp-tests ................................... SKIPPED
[INFO] q7-non-epp-nebula-tests ............................ SKIPPED
[INFO] ------------------------------------------------------------------------
[INFO] BUILD FAILURE
[INFO] ------------------------------------------------------------------------
[INFO] Total time:  01:20 min
[INFO] Finished at: 2019-12-02T12:17:15-05:00
[INFO] ------------------------------------------------------------------------
[ERROR] Failed to execute goal org.codehaus.mojo:exec-maven-plugin:1.6.0:exec (Download Eclipses) on project q7tests-previous: Command execution failed.: Process exited with an error: 1 (Exit value: 1) -> [Help 1]
[ERROR] 
[ERROR] To see the full stack trace of the errors, re-run Maven with the -e switch.
[ERROR] Re-run Maven using the -X switch to enable full debug logging.
[ERROR] 
[ERROR] For more information about the errors and possible solutions, please read the following articles:
[ERROR] [Help 1] http://cwiki.apache.org/confluence/display/MAVEN/MojoExecutionException
[ERROR] 
[ERROR] After correcting the problems, you can resume the build with the command
[ERROR]   mvn <goals> -rf :q7tests-previous
Build step 'Invoke top-level Maven targets' marked build as failure
Terminating xvnc.
Sending e-mails to: eneufeld@eclipsesource.com jfaltermeier@eclipsesource.com
Recording test results
ERROR: Step ‘Publish JUnit test result report’ failed: No test report files were found. Configuration error?
Started calculate disk usage of build
Finished Calculation of disk usage of build in 0 seconds
Started calculate disk usage of workspace
Finished Calculation of disk usage of workspace in 0 seconds
Finished: FAILURE