FailedConsole Output

Skipping 308 KB.. Full Log
20/80 kB
Progress (3): 312/332 kB | 126/237 kB | 20/80 kB
Progress (3): 312/332 kB | 126/237 kB | 24/80 kB
Progress (3): 312/332 kB | 130/237 kB | 24/80 kB
Progress (3): 316/332 kB | 130/237 kB | 24/80 kB
Progress (3): 316/332 kB | 130/237 kB | 28/80 kB
Progress (3): 316/332 kB | 134/237 kB | 28/80 kB
Progress (3): 320/332 kB | 134/237 kB | 28/80 kB
Progress (3): 320/332 kB | 138/237 kB | 28/80 kB
Progress (3): 320/332 kB | 138/237 kB | 32/80 kB
Progress (3): 324/332 kB | 138/237 kB | 32/80 kB
Progress (3): 324/332 kB | 142/237 kB | 32/80 kB
Progress (3): 328/332 kB | 142/237 kB | 32/80 kB
Progress (3): 328/332 kB | 142/237 kB | 36/80 kB
Progress (3): 328/332 kB | 146/237 kB | 36/80 kB
Progress (3): 332 kB | 146/237 kB | 36/80 kB    
Progress (3): 332 kB | 146/237 kB | 40/80 kB
Progress (3): 332 kB | 150/237 kB | 40/80 kB
Progress (4): 332 kB | 150/237 kB | 40/80 kB | 4.1/51 kB
Progress (4): 332 kB | 150/237 kB | 44/80 kB | 4.1/51 kB
Progress (4): 332 kB | 154/237 kB | 44/80 kB | 4.1/51 kB
Progress (4): 332 kB | 154/237 kB | 48/80 kB | 4.1/51 kB
Progress (4): 332 kB | 154/237 kB | 48/80 kB | 7.7/51 kB
Progress (4): 332 kB | 158/237 kB | 48/80 kB | 7.7/51 kB
Progress (4): 332 kB | 158/237 kB | 52/80 kB | 7.7/51 kB
Progress (4): 332 kB | 162/237 kB | 52/80 kB | 7.7/51 kB
Progress (4): 332 kB | 162/237 kB | 52/80 kB | 12/51 kB 
Progress (4): 332 kB | 162/237 kB | 56/80 kB | 12/51 kB
Progress (4): 332 kB | 162/237 kB | 56/80 kB | 16/51 kB
Progress (4): 332 kB | 166/237 kB | 56/80 kB | 16/51 kB
Progress (4): 332 kB | 166/237 kB | 60/80 kB | 16/51 kB
Progress (4): 332 kB | 166/237 kB | 60/80 kB | 20/51 kB
Progress (4): 332 kB | 170/237 kB | 60/80 kB | 20/51 kB
Progress (4): 332 kB | 170/237 kB | 60/80 kB | 24/51 kB
Progress (4): 332 kB | 170/237 kB | 64/80 kB | 24/51 kB
Progress (4): 332 kB | 174/237 kB | 64/80 kB | 24/51 kB
Progress (4): 332 kB | 174/237 kB | 68/80 kB | 24/51 kB
Progress (5): 332 kB | 174/237 kB | 68/80 kB | 24/51 kB | 4.1/245 kB
Progress (5): 332 kB | 174/237 kB | 68/80 kB | 28/51 kB | 4.1/245 kB
Progress (5): 332 kB | 174/237 kB | 68/80 kB | 28/51 kB | 7.7/245 kB
Progress (5): 332 kB | 174/237 kB | 72/80 kB | 28/51 kB | 7.7/245 kB
Progress (5): 332 kB | 174/237 kB | 72/80 kB | 28/51 kB | 12/245 kB 
Progress (5): 332 kB | 178/237 kB | 72/80 kB | 28/51 kB | 12/245 kB
Progress (5): 332 kB | 178/237 kB | 72/80 kB | 28/51 kB | 16/245 kB
Progress (5): 332 kB | 178/237 kB | 76/80 kB | 28/51 kB | 16/245 kB
Progress (5): 332 kB | 178/237 kB | 76/80 kB | 32/51 kB | 16/245 kB
Progress (5): 332 kB | 178/237 kB | 76/80 kB | 32/51 kB | 20/245 kB
Progress (5): 332 kB | 178/237 kB | 80/80 kB | 32/51 kB | 20/245 kB
Progress (5): 332 kB | 182/237 kB | 80/80 kB | 32/51 kB | 20/245 kB
Progress (5): 332 kB | 182/237 kB | 80 kB | 32/51 kB | 20/245 kB   
Progress (5): 332 kB | 182/237 kB | 80 kB | 32/51 kB | 24/245 kB
Progress (5): 332 kB | 182/237 kB | 80 kB | 36/51 kB | 24/245 kB
Progress (5): 332 kB | 182/237 kB | 80 kB | 36/51 kB | 28/245 kB
Progress (5): 332 kB | 186/237 kB | 80 kB | 36/51 kB | 28/245 kB
Progress (5): 332 kB | 186/237 kB | 80 kB | 36/51 kB | 32/245 kB
Progress (5): 332 kB | 186/237 kB | 80 kB | 40/51 kB | 32/245 kB
Progress (5): 332 kB | 186/237 kB | 80 kB | 40/51 kB | 33/245 kB
Progress (5): 332 kB | 190/237 kB | 80 kB | 40/51 kB | 33/245 kB
Progress (5): 332 kB | 190/237 kB | 80 kB | 44/51 kB | 33/245 kB
Progress (5): 332 kB | 194/237 kB | 80 kB | 44/51 kB | 33/245 kB
Progress (5): 332 kB | 194/237 kB | 80 kB | 44/51 kB | 37/245 kB
Progress (5): 332 kB | 194/237 kB | 80 kB | 48/51 kB | 37/245 kB
                                                                
Downloaded from eclipse.maven.central.mirror: https://repo.eclipse.org/content/repositories/maven_central/backport-util-concurrent/backport-util-concurrent/3.1/backport-util-concurrent-3.1.jar (332 kB at 3.7 MB/s)
Progress (4): 194/237 kB | 80 kB | 48/51 kB | 41/245 kB
Progress (4): 198/237 kB | 80 kB | 48/51 kB | 41/245 kB
                                                       
Downloading from eclipse.maven.central.mirror: https://repo.eclipse.org/content/repositories/maven_central/org/apache/maven/shared/file-management/1.2.1/file-management-1.2.1.jar
Progress (4): 198/237 kB | 80 kB | 51 kB | 41/245 kB
Progress (4): 202/237 kB | 80 kB | 51 kB | 41/245 kB
Progress (4): 202/237 kB | 80 kB | 51 kB | 45/245 kB
Progress (4): 206/237 kB | 80 kB | 51 kB | 45/245 kB
Progress (4): 206/237 kB | 80 kB | 51 kB | 49/245 kB
Progress (4): 210/237 kB | 80 kB | 51 kB | 49/245 kB
Progress (4): 210/237 kB | 80 kB | 51 kB | 53/245 kB
Progress (4): 214/237 kB | 80 kB | 51 kB | 53/245 kB
Progress (4): 214/237 kB | 80 kB | 51 kB | 57/245 kB
Progress (4): 218/237 kB | 80 kB | 51 kB | 57/245 kB
Progress (4): 218/237 kB | 80 kB | 51 kB | 61/245 kB
Progress (4): 222/237 kB | 80 kB | 51 kB | 61/245 kB
Progress (4): 222/237 kB | 80 kB | 51 kB | 65/245 kB
Progress (4): 226/237 kB | 80 kB | 51 kB | 65/245 kB
Progress (4): 226/237 kB | 80 kB | 51 kB | 69/245 kB
Progress (4): 230/237 kB | 80 kB | 51 kB | 69/245 kB
Progress (4): 230/237 kB | 80 kB | 51 kB | 73/245 kB
Progress (4): 234/237 kB | 80 kB | 51 kB | 73/245 kB
Progress (4): 234/237 kB | 80 kB | 51 kB | 77/245 kB
Progress (4): 237 kB | 80 kB | 51 kB | 77/245 kB    
Progress (4): 237 kB | 80 kB | 51 kB | 81/245 kB
Progress (4): 237 kB | 80 kB | 51 kB | 85/245 kB
Progress (4): 237 kB | 80 kB | 51 kB | 89/245 kB
Progress (4): 237 kB | 80 kB | 51 kB | 93/245 kB
Progress (4): 237 kB | 80 kB | 51 kB | 97/245 kB
Progress (4): 237 kB | 80 kB | 51 kB | 101/245 kB
Progress (4): 237 kB | 80 kB | 51 kB | 105/245 kB
Progress (4): 237 kB | 80 kB | 51 kB | 109/245 kB
Progress (4): 237 kB | 80 kB | 51 kB | 113/245 kB
Progress (4): 237 kB | 80 kB | 51 kB | 117/245 kB
Progress (4): 237 kB | 80 kB | 51 kB | 121/245 kB
Progress (4): 237 kB | 80 kB | 51 kB | 125/245 kB
Progress (4): 237 kB | 80 kB | 51 kB | 129/245 kB
Progress (4): 237 kB | 80 kB | 51 kB | 133/245 kB
Progress (4): 237 kB | 80 kB | 51 kB | 137/245 kB
Progress (4): 237 kB | 80 kB | 51 kB | 141/245 kB
Progress (4): 237 kB | 80 kB | 51 kB | 145/245 kB
Progress (4): 237 kB | 80 kB | 51 kB | 149/245 kB
Progress (4): 237 kB | 80 kB | 51 kB | 153/245 kB
Progress (4): 237 kB | 80 kB | 51 kB | 157/245 kB
Progress (4): 237 kB | 80 kB | 51 kB | 161/245 kB
Progress (4): 237 kB | 80 kB | 51 kB | 165/245 kB
Progress (4): 237 kB | 80 kB | 51 kB | 169/245 kB
Progress (4): 237 kB | 80 kB | 51 kB | 173/245 kB
Progress (4): 237 kB | 80 kB | 51 kB | 177/245 kB
Progress (4): 237 kB | 80 kB | 51 kB | 181/245 kB
Progress (4): 237 kB | 80 kB | 51 kB | 185/245 kB
Progress (4): 237 kB | 80 kB | 51 kB | 189/245 kB
Progress (4): 237 kB | 80 kB | 51 kB | 193/245 kB
Progress (4): 237 kB | 80 kB | 51 kB | 197/245 kB
Progress (4): 237 kB | 80 kB | 51 kB | 201/245 kB
Progress (4): 237 kB | 80 kB | 51 kB | 205/245 kB
Progress (4): 237 kB | 80 kB | 51 kB | 209/245 kB
Progress (4): 237 kB | 80 kB | 51 kB | 213/245 kB
Progress (4): 237 kB | 80 kB | 51 kB | 217/245 kB
Progress (4): 237 kB | 80 kB | 51 kB | 221/245 kB
Progress (4): 237 kB | 80 kB | 51 kB | 225/245 kB
Progress (4): 237 kB | 80 kB | 51 kB | 229/245 kB
Progress (4): 237 kB | 80 kB | 51 kB | 233/245 kB
Progress (4): 237 kB | 80 kB | 51 kB | 237/245 kB
Progress (4): 237 kB | 80 kB | 51 kB | 241/245 kB
Progress (4): 237 kB | 80 kB | 51 kB | 245/245 kB
Progress (4): 237 kB | 80 kB | 51 kB | 245 kB    
                                             
Downloaded from eclipse.maven.central.mirror: https://repo.eclipse.org/content/repositories/maven_central/junit/junit/4.8.2/junit-4.8.2.jar (237 kB at 2.0 MB/s)
Downloaded from eclipse.maven.central.mirror: https://repo.eclipse.org/content/repositories/maven_central/org/codehaus/plexus/plexus-interpolation/1.11/plexus-interpolation-1.11.jar (51 kB at 432 kB/s)
Downloaded from eclipse.maven.central.mirror: https://repo.eclipse.org/content/repositories/maven_central/org/apache/maven/maven-artifact/2.2.1/maven-artifact-2.2.1.jar (80 kB at 675 kB/s)
Downloading from eclipse.maven.central.mirror: https://repo.eclipse.org/content/repositories/maven_central/org/apache/maven/shared/maven-shared-io/1.1/maven-shared-io-1.1.jar
Downloading from eclipse.maven.central.mirror: https://repo.eclipse.org/content/repositories/maven_central/org/apache/maven/reporting/maven-reporting-api/2.2.1/maven-reporting-api-2.2.1.jar
Downloaded from eclipse.maven.central.mirror: https://repo.eclipse.org/content/repositories/maven_central/org/codehaus/plexus/plexus-utils/3.0.22/plexus-utils-3.0.22.jar (245 kB at 2.1 MB/s)
Downloading from eclipse.maven.central.mirror: https://repo.eclipse.org/content/repositories/maven_central/org/apache/maven/wagon/wagon-provider-api/1.0-alpha-6/wagon-provider-api-1.0-alpha-6.jar
Progress (1): 4.1/38 kB
                       
Downloading from eclipse.maven.central.mirror: https://repo.eclipse.org/content/repositories/maven_central/org/apache/maven/doxia/doxia-sink-api/1.1/doxia-sink-api-1.1.jar
Progress (1): 7.7/38 kB
Progress (1): 12/38 kB 
Progress (1): 16/38 kB
Progress (1): 20/38 kB
Progress (1): 24/38 kB
Progress (1): 28/38 kB
Progress (1): 32/38 kB
Progress (1): 36/38 kB
Progress (1): 38 kB   
                   
Downloaded from eclipse.maven.central.mirror: https://repo.eclipse.org/content/repositories/maven_central/org/apache/maven/shared/file-management/1.2.1/file-management-1.2.1.jar (38 kB at 296 kB/s)
Downloading from eclipse.maven.central.mirror: https://repo.eclipse.org/content/repositories/maven_central/org/apache/maven/doxia/doxia-logging-api/1.1/doxia-logging-api-1.1.jar
Progress (1): 4.1/9.8 kB
Progress (2): 4.1/9.8 kB | 4.1/43 kB
Progress (2): 7.7/9.8 kB | 4.1/43 kB
Progress (2): 7.7/9.8 kB | 7.7/43 kB
Progress (2): 9.8 kB | 7.7/43 kB    
Progress (2): 9.8 kB | 12/43 kB 
Progress (2): 9.8 kB | 16/43 kB
Progress (2): 9.8 kB | 20/43 kB
Progress (2): 9.8 kB | 24/43 kB
Progress (3): 9.8 kB | 24/43 kB | 4.1/39 kB
Progress (3): 9.8 kB | 24/43 kB | 7.7/39 kB
Progress (3): 9.8 kB | 24/43 kB | 12/39 kB 
Progress (3): 9.8 kB | 24/43 kB | 16/39 kB
Progress (3): 9.8 kB | 24/43 kB | 20/39 kB
Progress (3): 9.8 kB | 24/43 kB | 24/39 kB
Progress (3): 9.8 kB | 28/43 kB | 24/39 kB
Progress (3): 9.8 kB | 32/43 kB | 24/39 kB
Progress (3): 9.8 kB | 36/43 kB | 24/39 kB
Progress (3): 9.8 kB | 36/43 kB | 28/39 kB
Progress (3): 9.8 kB | 40/43 kB | 28/39 kB
Progress (3): 9.8 kB | 40/43 kB | 32/39 kB
Progress (3): 9.8 kB | 43 kB | 32/39 kB   
Progress (3): 9.8 kB | 43 kB | 36/39 kB
Progress (3): 9.8 kB | 43 kB | 39 kB   
                                    
Downloaded from eclipse.maven.central.mirror: https://repo.eclipse.org/content/repositories/maven_central/org/apache/maven/wagon/wagon-provider-api/1.0-alpha-6/wagon-provider-api-1.0-alpha-6.jar (43 kB at 316 kB/s)
Downloading from eclipse.maven.central.mirror: https://repo.eclipse.org/content/repositories/maven_central/org/apache/maven/reporting/maven-reporting-impl/2.1/maven-reporting-impl-2.1.jar
Progress (3): 9.8 kB | 39 kB | 4.1/11 kB
                                        
Downloaded from eclipse.maven.central.mirror: https://repo.eclipse.org/content/repositories/maven_central/org/apache/maven/reporting/maven-reporting-api/2.2.1/maven-reporting-api-2.2.1.jar (9.8 kB at 72 kB/s)
Progress (2): 39 kB | 7.7/11 kB
                               
Downloaded from eclipse.maven.central.mirror: https://repo.eclipse.org/content/repositories/maven_central/org/apache/maven/shared/maven-shared-io/1.1/maven-shared-io-1.1.jar (39 kB at 290 kB/s)
Progress (1): 11 kB
                   
Downloading from eclipse.maven.central.mirror: https://repo.eclipse.org/content/repositories/maven_central/org/apache/maven/doxia/doxia-core/1.1.2/doxia-core-1.1.2.jar
Downloading from eclipse.maven.central.mirror: https://repo.eclipse.org/content/repositories/maven_central/xerces/xercesImpl/2.8.1/xercesImpl-2.8.1.jar
Downloaded from eclipse.maven.central.mirror: https://repo.eclipse.org/content/repositories/maven_central/org/apache/maven/doxia/doxia-logging-api/1.1/doxia-logging-api-1.1.jar (11 kB at 80 kB/s)
Downloading from eclipse.maven.central.mirror: https://repo.eclipse.org/content/repositories/maven_central/commons-lang/commons-lang/2.4/commons-lang-2.4.jar
Progress (1): 4.1/17 kB
Progress (1): 7.7/17 kB
Progress (1): 12/17 kB 
Progress (2): 12/17 kB | 4.1/13 kB
Progress (2): 16/17 kB | 4.1/13 kB
Progress (2): 16/17 kB | 7.7/13 kB
Progress (2): 17 kB | 7.7/13 kB   
Progress (2): 17 kB | 12/13 kB 
Progress (2): 17 kB | 13 kB   
Progress (3): 17 kB | 13 kB | 4.1/158 kB
Progress (3): 17 kB | 13 kB | 7.7/158 kB
Progress (4): 17 kB | 13 kB | 7.7/158 kB | 0/1.2 MB
Progress (4): 17 kB | 13 kB | 12/158 kB | 0/1.2 MB 
Progress (4): 17 kB | 13 kB | 12/158 kB | 0/1.2 MB
Progress (4): 17 kB | 13 kB | 16/158 kB | 0/1.2 MB
Progress (4): 17 kB | 13 kB | 16/158 kB | 0/1.2 MB
Progress (4): 17 kB | 13 kB | 20/158 kB | 0/1.2 MB
Progress (4): 17 kB | 13 kB | 20/158 kB | 0/1.2 MB
Progress (4): 17 kB | 13 kB | 24/158 kB | 0/1.2 MB
Progress (4): 17 kB | 13 kB | 24/158 kB | 0/1.2 MB
Progress (4): 17 kB | 13 kB | 28/158 kB | 0/1.2 MB
Progress (4): 17 kB | 13 kB | 28/158 kB | 0/1.2 MB
                                                  
Downloaded from eclipse.maven.central.mirror: https://repo.eclipse.org/content/repositories/maven_central/org/apache/maven/doxia/doxia-sink-api/1.1/doxia-sink-api-1.1.jar (13 kB at 85 kB/s)
Progress (3): 17 kB | 28/158 kB | 0/1.2 MB
Progress (3): 17 kB | 32/158 kB | 0/1.2 MB
Progress (3): 17 kB | 32/158 kB | 0/1.2 MB
                                          
Downloaded from eclipse.maven.central.mirror: https://repo.eclipse.org/content/repositories/maven_central/org/apache/maven/reporting/maven-reporting-impl/2.1/maven-reporting-impl-2.1.jar (17 kB at 110 kB/s)
Downloading from eclipse.maven.central.mirror: https://repo.eclipse.org/content/repositories/maven_central/commons-codec/commons-codec/1.2/commons-codec-1.2.jar
Downloading from eclipse.maven.central.mirror: https://repo.eclipse.org/content/repositories/maven_central/commons-httpclient/commons-httpclient/3.1/commons-httpclient-3.1.jar
Progress (3): 32/158 kB | 0/1.2 MB | 4.1/262 kB
Progress (3): 32/158 kB | 0/1.2 MB | 4.1/262 kB
Progress (3): 33/158 kB | 0/1.2 MB | 4.1/262 kB
Progress (3): 33/158 kB | 0/1.2 MB | 4.1/262 kB
Progress (3): 33/158 kB | 0/1.2 MB | 7.7/262 kB
Progress (3): 37/158 kB | 0/1.2 MB | 7.7/262 kB
Progress (3): 37/158 kB | 0/1.2 MB | 7.7/262 kB
Progress (3): 41/158 kB | 0/1.2 MB | 7.7/262 kB
Progress (3): 41/158 kB | 0/1.2 MB | 7.7/262 kB
Progress (3): 41/158 kB | 0/1.2 MB | 12/262 kB 
Progress (3): 45/158 kB | 0/1.2 MB | 12/262 kB
Progress (3): 45/158 kB | 0/1.2 MB | 16/262 kB
Progress (3): 45/158 kB | 0.1/1.2 MB | 16/262 kB
Progress (3): 49/158 kB | 0.1/1.2 MB | 16/262 kB
Progress (3): 49/158 kB | 0.1/1.2 MB | 20/262 kB
Progress (3): 49/158 kB | 0.1/1.2 MB | 20/262 kB
Progress (3): 49/158 kB | 0.1/1.2 MB | 24/262 kB
Progress (3): 53/158 kB | 0.1/1.2 MB | 24/262 kB
Progress (3): 53/158 kB | 0.1/1.2 MB | 24/262 kB
Progress (3): 57/158 kB | 0.1/1.2 MB | 24/262 kB
Progress (3): 57/158 kB | 0.1/1.2 MB | 24/262 kB
Progress (3): 57/158 kB | 0.1/1.2 MB | 28/262 kB
Progress (3): 61/158 kB | 0.1/1.2 MB | 28/262 kB
Progress (3): 61/158 kB | 0.1/1.2 MB | 32/262 kB
Progress (3): 61/158 kB | 0.1/1.2 MB | 32/262 kB
Progress (3): 61/158 kB | 0.1/1.2 MB | 33/262 kB
Progress (3): 65/158 kB | 0.1/1.2 MB | 33/262 kB
Progress (3): 65/158 kB | 0.1/1.2 MB | 33/262 kB
Progress (3): 66/158 kB | 0.1/1.2 MB | 33/262 kB
Progress (3): 66/158 kB | 0.1/1.2 MB | 37/262 kB
Progress (3): 66/158 kB | 0.1/1.2 MB | 37/262 kB
Progress (3): 66/158 kB | 0.1/1.2 MB | 41/262 kB
Progress (3): 70/158 kB | 0.1/1.2 MB | 41/262 kB
Progress (3): 70/158 kB | 0.1/1.2 MB | 41/262 kB
Progress (3): 74/158 kB | 0.1/1.2 MB | 41/262 kB
Progress (3): 74/158 kB | 0.1/1.2 MB | 45/262 kB
Progress (3): 74/158 kB | 0.1/1.2 MB | 45/262 kB
Progress (3): 74/158 kB | 0.1/1.2 MB | 49/262 kB
Progress (3): 78/158 kB | 0.1/1.2 MB | 49/262 kB
Progress (3): 78/158 kB | 0.1/1.2 MB | 49/262 kB
Progress (3): 82/158 kB | 0.1/1.2 MB | 49/262 kB
Progress (3): 82/158 kB | 0.1/1.2 MB | 53/262 kB
Progress (3): 82/158 kB | 0.1/1.2 MB | 53/262 kB
Progress (3): 82/158 kB | 0.1/1.2 MB | 57/262 kB
Progress (3): 86/158 kB | 0.1/1.2 MB | 57/262 kB
Progress (3): 86/158 kB | 0.1/1.2 MB | 57/262 kB
Progress (3): 90/158 kB | 0.1/1.2 MB | 57/262 kB
Progress (3): 90/158 kB | 0.1/1.2 MB | 61/262 kB
Progress (3): 90/158 kB | 0.1/1.2 MB | 61/262 kB
Progress (3): 90/158 kB | 0.1/1.2 MB | 65/262 kB
Progress (3): 94/158 kB | 0.1/1.2 MB | 65/262 kB
Progress (3): 94/158 kB | 0.1/1.2 MB | 66/262 kB
Progress (3): 94/158 kB | 0.1/1.2 MB | 66/262 kB
Progress (3): 98/158 kB | 0.1/1.2 MB | 66/262 kB
Progress (3): 98/158 kB | 0.1/1.2 MB | 70/262 kB
Progress (3): 98/158 kB | 0.1/1.2 MB | 70/262 kB
Progress (3): 98/158 kB | 0.1/1.2 MB | 70/262 kB
Progress (3): 98/158 kB | 0.1/1.2 MB | 74/262 kB
Progress (3): 98/158 kB | 0.1/1.2 MB | 74/262 kB
Progress (3): 102/158 kB | 0.1/1.2 MB | 74/262 kB
Progress (3): 102/158 kB | 0.1/1.2 MB | 78/262 kB
Progress (3): 106/158 kB | 0.1/1.2 MB | 78/262 kB
Progress (3): 106/158 kB | 0.1/1.2 MB | 78/262 kB
Progress (4): 106/158 kB | 0.1/1.2 MB | 78/262 kB | 4.1/30 kB
Progress (5): 106/158 kB | 0.1/1.2 MB | 78/262 kB | 4.1/30 kB | 4.1/305 kB
Progress (5): 106/158 kB | 0.1/1.2 MB | 78/262 kB | 4.1/30 kB | 4.1/305 kB
Progress (5): 110/158 kB | 0.1/1.2 MB | 78/262 kB | 4.1/30 kB | 4.1/305 kB
Progress (5): 110/158 kB | 0.1/1.2 MB | 82/262 kB | 4.1/30 kB | 4.1/305 kB
Progress (5): 114/158 kB | 0.1/1.2 MB | 82/262 kB | 4.1/30 kB | 4.1/305 kB
Progress (5): 114/158 kB | 0.1/1.2 MB | 82/262 kB | 4.1/30 kB | 4.1/305 kB
Progress (5): 114/158 kB | 0.1/1.2 MB | 82/262 kB | 4.1/30 kB | 7.7/305 kB
Progress (5): 114/158 kB | 0.1/1.2 MB | 82/262 kB | 7.7/30 kB | 7.7/305 kB
Progress (5): 114/158 kB | 0.1/1.2 MB | 82/262 kB | 7.7/30 kB | 12/305 kB 
Progress (5): 114/158 kB | 0.1/1.2 MB | 82/262 kB | 7.7/30 kB | 12/305 kB
Progress (5): 118/158 kB | 0.1/1.2 MB | 82/262 kB | 7.7/30 kB | 12/305 kB
Progress (5): 118/158 kB | 0.1/1.2 MB | 86/262 kB | 7.7/30 kB | 12/305 kB
Progress (5): 122/158 kB | 0.1/1.2 MB | 86/262 kB | 7.7/30 kB | 12/305 kB
Progress (5): 122/158 kB | 0.1/1.2 MB | 86/262 kB | 7.7/30 kB | 12/305 kB
Progress (5): 122/158 kB | 0.1/1.2 MB | 86/262 kB | 7.7/30 kB | 16/305 kB
Progress (5): 122/158 kB | 0.1/1.2 MB | 86/262 kB | 12/30 kB | 16/305 kB 
Progress (5): 122/158 kB | 0.1/1.2 MB | 86/262 kB | 12/30 kB | 20/305 kB
Progress (5): 122/158 kB | 0.1/1.2 MB | 86/262 kB | 12/30 kB | 20/305 kB
Progress (5): 126/158 kB | 0.1/1.2 MB | 86/262 kB | 12/30 kB | 20/305 kB
Progress (5): 126/158 kB | 0.1/1.2 MB | 90/262 kB | 12/30 kB | 20/305 kB
Progress (5): 130/158 kB | 0.1/1.2 MB | 90/262 kB | 12/30 kB | 20/305 kB
Progress (5): 130/158 kB | 0.1/1.2 MB | 90/262 kB | 12/30 kB | 20/305 kB
Progress (5): 130/158 kB | 0.1/1.2 MB | 90/262 kB | 12/30 kB | 24/305 kB
Progress (5): 130/158 kB | 0.1/1.2 MB | 90/262 kB | 16/30 kB | 24/305 kB
Progress (5): 130/158 kB | 0.1/1.2 MB | 90/262 kB | 16/30 kB | 28/305 kB
Progress (5): 130/158 kB | 0.1/1.2 MB | 90/262 kB | 16/30 kB | 28/305 kB
Progress (5): 131/158 kB | 0.1/1.2 MB | 90/262 kB | 16/30 kB | 28/305 kB
Progress (5): 131/158 kB | 0.1/1.2 MB | 94/262 kB | 16/30 kB | 28/305 kB
Progress (5): 135/158 kB | 0.1/1.2 MB | 94/262 kB | 16/30 kB | 28/305 kB
Progress (5): 135/158 kB | 0.1/1.2 MB | 94/262 kB | 16/30 kB | 28/305 kB
Progress (5): 135/158 kB | 0.1/1.2 MB | 94/262 kB | 16/30 kB | 32/305 kB
Progress (5): 135/158 kB | 0.1/1.2 MB | 94/262 kB | 20/30 kB | 32/305 kB
Progress (5): 135/158 kB | 0.1/1.2 MB | 94/262 kB | 20/30 kB | 33/305 kB
Progress (5): 135/158 kB | 0.2/1.2 MB | 94/262 kB | 20/30 kB | 33/305 kB
Progress (5): 139/158 kB | 0.2/1.2 MB | 94/262 kB | 20/30 kB | 33/305 kB
Progress (5): 139/158 kB | 0.2/1.2 MB | 98/262 kB | 20/30 kB | 33/305 kB
Progress (5): 143/158 kB | 0.2/1.2 MB | 98/262 kB | 20/30 kB | 33/305 kB
Progress (5): 143/158 kB | 0.2/1.2 MB | 98/262 kB | 20/30 kB | 33/305 kB
Progress (5): 143/158 kB | 0.2/1.2 MB | 98/262 kB | 20/30 kB | 37/305 kB
Progress (5): 143/158 kB | 0.2/1.2 MB | 98/262 kB | 24/30 kB | 37/305 kB
Progress (5): 143/158 kB | 0.2/1.2 MB | 98/262 kB | 24/30 kB | 41/305 kB
Progress (5): 143/158 kB | 0.2/1.2 MB | 98/262 kB | 24/30 kB | 41/305 kB
Progress (5): 147/158 kB | 0.2/1.2 MB | 98/262 kB | 24/30 kB | 41/305 kB
Progress (5): 147/158 kB | 0.2/1.2 MB | 102/262 kB | 24/30 kB | 41/305 kB
Progress (5): 151/158 kB | 0.2/1.2 MB | 102/262 kB | 24/30 kB | 41/305 kB
Progress (5): 151/158 kB | 0.2/1.2 MB | 102/262 kB | 24/30 kB | 41/305 kB
Progress (5): 151/158 kB | 0.2/1.2 MB | 102/262 kB | 24/30 kB | 45/305 kB
Progress (5): 151/158 kB | 0.2/1.2 MB | 102/262 kB | 28/30 kB | 45/305 kB
Progress (5): 151/158 kB | 0.2/1.2 MB | 102/262 kB | 28/30 kB | 49/305 kB
Progress (5): 151/158 kB | 0.2/1.2 MB | 102/262 kB | 28/30 kB | 49/305 kB
Progress (5): 155/158 kB | 0.2/1.2 MB | 102/262 kB | 28/30 kB | 49/305 kB
Progress (5): 155/158 kB | 0.2/1.2 MB | 106/262 kB | 28/30 kB | 49/305 kB
Progress (5): 158 kB | 0.2/1.2 MB | 106/262 kB | 28/30 kB | 49/305 kB    
Progress (5): 158 kB | 0.2/1.2 MB | 106/262 kB | 28/30 kB | 49/305 kB
Progress (5): 158 kB | 0.2/1.2 MB | 106/262 kB | 28/30 kB | 53/305 kB
Progress (5): 158 kB | 0.2/1.2 MB | 106/262 kB | 30 kB | 53/305 kB   
Progress (5): 158 kB | 0.2/1.2 MB | 106/262 kB | 30 kB | 57/305 kB
Progress (5): 158 kB | 0.2/1.2 MB | 106/262 kB | 30 kB | 57/305 kB
Progress (5): 158 kB | 0.2/1.2 MB | 110/262 kB | 30 kB | 57/305 kB
Progress (5): 158 kB | 0.2/1.2 MB | 110/262 kB | 30 kB | 57/305 kB
Progress (5): 158 kB | 0.2/1.2 MB | 110/262 kB | 30 kB | 61/305 kB
Progress (5): 158 kB | 0.2/1.2 MB | 110/262 kB | 30 kB | 61/305 kB
Progress (5): 158 kB | 0.2/1.2 MB | 114/262 kB | 30 kB | 61/305 kB
Progress (5): 158 kB | 0.2/1.2 MB | 114/262 kB | 30 kB | 61/305 kB
Progress (5): 158 kB | 0.2/1.2 MB | 114/262 kB | 30 kB | 65/305 kB
Progress (5): 158 kB | 0.2/1.2 MB | 114/262 kB | 30 kB | 65/305 kB
Progress (5): 158 kB | 0.2/1.2 MB | 118/262 kB | 30 kB | 65/305 kB
Progress (5): 158 kB | 0.2/1.2 MB | 118/262 kB | 30 kB | 69/305 kB
Progress (5): 158 kB | 0.2/1.2 MB | 122/262 kB | 30 kB | 69/305 kB
Progress (5): 158 kB | 0.2/1.2 MB | 122/262 kB | 30 kB | 69/305 kB
Progress (5): 158 kB | 0.2/1.2 MB | 122/262 kB | 30 kB | 73/305 kB
Progress (5): 158 kB | 0.2/1.2 MB | 122/262 kB | 30 kB | 73/305 kB
Progress (5): 158 kB | 0.2/1.2 MB | 126/262 kB | 30 kB | 73/305 kB
Progress (5): 158 kB | 0.2/1.2 MB | 126/262 kB | 30 kB | 73/305 kB
Progress (5): 158 kB | 0.2/1.2 MB | 126/262 kB | 30 kB | 77/305 kB
Progress (5): 158 kB | 0.2/1.2 MB | 126/262 kB | 30 kB | 77/305 kB
Progress (5): 158 kB | 0.2/1.2 MB | 130/262 kB | 30 kB | 77/305 kB
Progress (5): 158 kB | 0.2/1.2 MB | 130/262 kB | 30 kB | 81/305 kB
Progress (5): 158 kB | 0.2/1.2 MB | 134/262 kB | 30 kB | 81/305 kB
Progress (5): 158 kB | 0.2/1.2 MB | 134/262 kB | 30 kB | 81/305 kB
Progress (5): 158 kB | 0.2/1.2 MB | 134/262 kB | 30 kB | 85/305 kB
Progress (5): 158 kB | 0.2/1.2 MB | 138/262 kB | 30 kB | 85/305 kB
Progress (5): 158 kB | 0.2/1.2 MB | 138/262 kB | 30 kB | 89/305 kB
Progress (5): 158 kB | 0.2/1.2 MB | 138/262 kB | 30 kB | 89/305 kB
                                                                  
Downloaded from eclipse.maven.central.mirror: https://repo.eclipse.org/content/repositories/maven_central/org/apache/maven/doxia/doxia-core/1.1.2/doxia-core-1.1.2.jar (158 kB at 915 kB/s)
Progress (4): 0.2/1.2 MB | 142/262 kB | 30 kB | 89/305 kB
                                                         
Downloading from eclipse.maven.central.mirror: https://repo.eclipse.org/content/repositories/maven_central/org/apache/maven/doxia/doxia-site-renderer/1.1.2/doxia-site-renderer-1.1.2.jar
Progress (4): 0.2/1.2 MB | 142/262 kB | 30 kB | 89/305 kB
Progress (4): 0.2/1.2 MB | 142/262 kB | 30 kB | 93/305 kB
Progress (4): 0.2/1.2 MB | 142/262 kB | 30 kB | 93/305 kB
Progress (4): 0.2/1.2 MB | 146/262 kB | 30 kB | 93/305 kB
Progress (4): 0.2/1.2 MB | 146/262 kB | 30 kB | 97/305 kB
Progress (4): 0.2/1.2 MB | 146/262 kB | 30 kB | 97/305 kB
                                                         
Downloaded from eclipse.maven.central.mirror: https://repo.eclipse.org/content/repositories/maven_central/commons-codec/commons-codec/1.2/commons-codec-1.2.jar (30 kB at 173 kB/s)
Progress (3): 0.2/1.2 MB | 150/262 kB | 97/305 kB
                                                 
Downloading from eclipse.maven.central.mirror: https://repo.eclipse.org/content/repositories/maven_central/org/apache/maven/doxia/doxia-decoration-model/1.1.2/doxia-decoration-model-1.1.2.jar
Progress (3): 0.2/1.2 MB | 150/262 kB | 97/305 kB
Progress (3): 0.2/1.2 MB | 150/262 kB | 101/305 kB
Progress (3): 0.2/1.2 MB | 150/262 kB | 101/305 kB
Progress (3): 0.2/1.2 MB | 154/262 kB | 101/305 kB
Progress (3): 0.2/1.2 MB | 154/262 kB | 101/305 kB
Progress (3): 0.2/1.2 MB | 154/262 kB | 105/305 kB
Progress (3): 0.2/1.2 MB | 154/262 kB | 105/305 kB
Progress (3): 0.2/1.2 MB | 158/262 kB | 105/305 kB
Progress (3): 0.2/1.2 MB | 158/262 kB | 109/305 kB
Progress (3): 0.2/1.2 MB | 158/262 kB | 109/305 kB
Progress (3): 0.2/1.2 MB | 158/262 kB | 113/305 kB
Progress (3): 0.2/1.2 MB | 162/262 kB | 113/305 kB
Progress (3): 0.3/1.2 MB | 162/262 kB | 113/305 kB
Progress (3): 0.3/1.2 MB | 162/262 kB | 117/305 kB
Progress (3): 0.3/1.2 MB | 162/262 kB | 117/305 kB
Progress (3): 0.3/1.2 MB | 166/262 kB | 117/305 kB
Progress (3): 0.3/1.2 MB | 166/262 kB | 121/305 kB
Progress (3): 0.3/1.2 MB | 170/262 kB | 121/305 kB
Progress (3): 0.3/1.2 MB | 170/262 kB | 121/305 kB
Progress (3): 0.3/1.2 MB | 170/262 kB | 125/305 kB
Progress (3): 0.3/1.2 MB | 170/262 kB | 125/305 kB
Progress (3): 0.3/1.2 MB | 174/262 kB | 125/305 kB
Progress (3): 0.3/1.2 MB | 174/262 kB | 129/305 kB
Progress (3): 0.3/1.2 MB | 178/262 kB | 129/305 kB
Progress (3): 0.3/1.2 MB | 178/262 kB | 129/305 kB
Progress (3): 0.3/1.2 MB | 178/262 kB | 133/305 kB
Progress (3): 0.3/1.2 MB | 178/262 kB | 133/305 kB
Progress (3): 0.3/1.2 MB | 182/262 kB | 133/305 kB
Progress (3): 0.3/1.2 MB | 182/262 kB | 137/305 kB
Progress (3): 0.3/1.2 MB | 186/262 kB | 137/305 kB
Progress (3): 0.3/1.2 MB | 186/262 kB | 137/305 kB
Progress (3): 0.3/1.2 MB | 186/262 kB | 141/305 kB
Progress (3): 0.3/1.2 MB | 186/262 kB | 141/305 kB
Progress (3): 0.3/1.2 MB | 190/262 kB | 141/305 kB
Progress (3): 0.3/1.2 MB | 190/262 kB | 145/305 kB
Progress (3): 0.3/1.2 MB | 194/262 kB | 145/305 kB
Progress (3): 0.3/1.2 MB | 194/262 kB | 145/305 kB
Progress (3): 0.3/1.2 MB | 194/262 kB | 149/305 kB
Progress (3): 0.3/1.2 MB | 194/262 kB | 149/305 kB
Progress (3): 0.3/1.2 MB | 198/262 kB | 149/305 kB
Progress (3): 0.3/1.2 MB | 198/262 kB | 153/305 kB
Progress (3): 0.3/1.2 MB | 202/262 kB | 153/305 kB
Progress (3): 0.3/1.2 MB | 202/262 kB | 153/305 kB
Progress (3): 0.3/1.2 MB | 202/262 kB | 157/305 kB
Progress (3): 0.3/1.2 MB | 202/262 kB | 157/305 kB
Progress (3): 0.3/1.2 MB | 206/262 kB | 157/305 kB
Progress (3): 0.3/1.2 MB | 206/262 kB | 161/305 kB
Progress (3): 0.3/1.2 MB | 210/262 kB | 161/305 kB
Progress (3): 0.3/1.2 MB | 210/262 kB | 161/305 kB
Progress (3): 0.3/1.2 MB | 210/262 kB | 165/305 kB
Progress (3): 0.3/1.2 MB | 210/262 kB | 165/305 kB
Progress (3): 0.3/1.2 MB | 214/262 kB | 165/305 kB
Progress (3): 0.3/1.2 MB | 214/262 kB | 169/305 kB
Progress (3): 0.3/1.2 MB | 218/262 kB | 169/305 kB
Progress (3): 0.3/1.2 MB | 218/262 kB | 169/305 kB
Progress (3): 0.3/1.2 MB | 218/262 kB | 173/305 kB
Progress (3): 0.3/1.2 MB | 218/262 kB | 173/305 kB
Progress (3): 0.3/1.2 MB | 222/262 kB | 173/305 kB
Progress (3): 0.3/1.2 MB | 222/262 kB | 177/305 kB
Progress (3): 0.3/1.2 MB | 226/262 kB | 177/305 kB
Progress (3): 0.3/1.2 MB | 226/262 kB | 177/305 kB
Progress (4): 0.3/1.2 MB | 226/262 kB | 177/305 kB | 4.1/52 kB
Progress (4): 0.3/1.2 MB | 226/262 kB | 177/305 kB | 7.7/52 kB
Progress (5): 0.3/1.2 MB | 226/262 kB | 177/305 kB | 7.7/52 kB | 4.1/50 kB
Progress (5): 0.3/1.2 MB | 226/262 kB | 177/305 kB | 7.7/52 kB | 7.7/50 kB
Progress (5): 0.3/1.2 MB | 226/262 kB | 177/305 kB | 7.7/52 kB | 12/50 kB 
Progress (5): 0.3/1.2 MB | 226/262 kB | 177/305 kB | 7.7/52 kB | 16/50 kB
Progress (5): 0.3/1.2 MB | 226/262 kB | 177/305 kB | 7.7/52 kB | 20/50 kB
Progress (5): 0.3/1.2 MB | 226/262 kB | 181/305 kB | 7.7/52 kB | 20/50 kB
Progress (5): 0.3/1.2 MB | 226/262 kB | 181/305 kB | 7.7/52 kB | 24/50 kB
Progress (5): 0.3/1.2 MB | 226/262 kB | 181/305 kB | 12/52 kB | 24/50 kB 
Progress (5): 0.3/1.2 MB | 226/262 kB | 181/305 kB | 12/52 kB | 24/50 kB
Progress (5): 0.3/1.2 MB | 230/262 kB | 181/305 kB | 12/52 kB | 24/50 kB
Progress (5): 0.3/1.2 MB | 230/262 kB | 181/305 kB | 16/52 kB | 24/50 kB
Progress (5): 0.3/1.2 MB | 230/262 kB | 181/305 kB | 16/52 kB | 28/50 kB
Progress (5): 0.3/1.2 MB | 230/262 kB | 185/305 kB | 16/52 kB | 28/50 kB
Progress (5): 0.3/1.2 MB | 230/262 kB | 185/305 kB | 16/52 kB | 32/50 kB
Progress (5): 0.3/1.2 MB | 230/262 kB | 189/305 kB | 16/52 kB | 32/50 kB
Progress (5): 0.3/1.2 MB | 230/262 kB | 189/305 kB | 16/52 kB | 36/50 kB
Progress (5): 0.3/1.2 MB | 230/262 kB | 189/305 kB | 20/52 kB | 36/50 kB
Progress (5): 0.3/1.2 MB | 234/262 kB | 189/305 kB | 20/52 kB | 36/50 kB
Progress (5): 0.3/1.2 MB | 234/262 kB | 189/305 kB | 20/52 kB | 36/50 kB
Progress (5): 0.3/1.2 MB | 238/262 kB | 189/305 kB | 20/52 kB | 36/50 kB
Progress (5): 0.3/1.2 MB | 238/262 kB | 189/305 kB | 24/52 kB | 36/50 kB
Progress (5): 0.3/1.2 MB | 238/262 kB | 189/305 kB | 24/52 kB | 40/50 kB
Progress (5): 0.3/1.2 MB | 238/262 kB | 193/305 kB | 24/52 kB | 40/50 kB
Progress (5): 0.3/1.2 MB | 238/262 kB | 193/305 kB | 24/52 kB | 44/50 kB
Progress (5): 0.3/1.2 MB | 238/262 kB | 193/305 kB | 28/52 kB | 44/50 kB
Progress (5): 0.3/1.2 MB | 242/262 kB | 193/305 kB | 28/52 kB | 44/50 kB
Progress (5): 0.3/1.2 MB | 242/262 kB | 193/305 kB | 28/52 kB | 44/50 kB
Progress (5): 0.3/1.2 MB | 246/262 kB | 193/305 kB | 28/52 kB | 44/50 kB
Progress (5): 0.3/1.2 MB | 246/262 kB | 193/305 kB | 32/52 kB | 44/50 kB
Progress (5): 0.3/1.2 MB | 246/262 kB | 193/305 kB | 32/52 kB | 48/50 kB
Progress (5): 0.3/1.2 MB | 246/262 kB | 197/305 kB | 32/52 kB | 48/50 kB
Progress (5): 0.3/1.2 MB | 246/262 kB | 197/305 kB | 32/52 kB | 50 kB   
Progress (5): 0.3/1.2 MB | 246/262 kB | 197/305 kB | 36/52 kB | 50 kB
Progress (5): 0.3/1.2 MB | 246/262 kB | 197/305 kB | 36/52 kB | 50 kB
Progress (5): 0.3/1.2 MB | 250/262 kB | 197/305 kB | 36/52 kB | 50 kB
Progress (5): 0.3/1.2 MB | 250/262 kB | 197/305 kB | 36/52 kB | 50 kB
Progress (5): 0.3/1.2 MB | 250/262 kB | 197/305 kB | 40/52 kB | 50 kB
Progress (5): 0.3/1.2 MB | 250/262 kB | 201/305 kB | 40/52 kB | 50 kB
Progress (5): 0.3/1.2 MB | 250/262 kB | 201/305 kB | 40/52 kB | 50 kB
Progress (5): 0.3/1.2 MB | 254/262 kB | 201/305 kB | 40/52 kB | 50 kB
Progress (5): 0.3/1.2 MB | 254/262 kB | 201/305 kB | 40/52 kB | 50 kB
Progress (5): 0.3/1.2 MB | 254/262 kB | 205/305 kB | 40/52 kB | 50 kB
Progress (5): 0.3/1.2 MB | 254/262 kB | 205/305 kB | 44/52 kB | 50 kB
Progress (5): 0.3/1.2 MB | 254/262 kB | 205/305 kB | 44/52 kB | 50 kB
Progress (5): 0.3/1.2 MB | 254/262 kB | 209/305 kB | 44/52 kB | 50 kB
Progress (5): 0.3/1.2 MB | 258/262 kB | 209/305 kB | 44/52 kB | 50 kB
Progress (5): 0.3/1.2 MB | 258/262 kB | 213/305 kB | 44/52 kB | 50 kB
Progress (5): 0.4/1.2 MB | 258/262 kB | 213/305 kB | 44/52 kB | 50 kB
Progress (5): 0.4/1.2 MB | 258/262 kB | 213/305 kB | 48/52 kB | 50 kB
Progress (5): 0.4/1.2 MB | 262/262 kB | 213/305 kB | 48/52 kB | 50 kB
Progress (5): 0.4/1.2 MB | 262/262 kB | 217/305 kB | 48/52 kB | 50 kB
Progress (5): 0.4/1.2 MB | 262 kB | 217/305 kB | 48/52 kB | 50 kB    
Progress (5): 0.4/1.2 MB | 262 kB | 217/305 kB | 52/52 kB | 50 kB
Progress (5): 0.4/1.2 MB | 262 kB | 217/305 kB | 52/52 kB | 50 kB
Progress (5): 0.4/1.2 MB | 262 kB | 217/305 kB | 52 kB | 50 kB   
Progress (5): 0.4/1.2 MB | 262 kB | 221/305 kB | 52 kB | 50 kB
Progress (5): 0.4/1.2 MB | 262 kB | 221/305 kB | 52 kB | 50 kB
Progress (5): 0.4/1.2 MB | 262 kB | 225/305 kB | 52 kB | 50 kB
                                                              
Downloaded from eclipse.maven.central.mirror: https://repo.eclipse.org/content/repositories/maven_central/org/apache/maven/doxia/doxia-site-renderer/1.1.2/doxia-site-renderer-1.1.2.jar (50 kB at 264 kB/s)
Progress (4): 0.4/1.2 MB | 262 kB | 229/305 kB | 52 kB
Progress (4): 0.4/1.2 MB | 262 kB | 229/305 kB | 52 kB
Progress (4): 0.4/1.2 MB | 262 kB | 233/305 kB | 52 kB
                                                      
Downloading from eclipse.maven.central.mirror: https://repo.eclipse.org/content/repositories/maven_central/org/apache/maven/doxia/doxia-module-xhtml/1.1.2/doxia-module-xhtml-1.1.2.jar
Progress (4): 0.4/1.2 MB | 262 kB | 237/305 kB | 52 kB
Progress (4): 0.4/1.2 MB | 262 kB | 237/305 kB | 52 kB
Progress (4): 0.4/1.2 MB | 262 kB | 241/305 kB | 52 kB
Progress (4): 0.4/1.2 MB | 262 kB | 241/305 kB | 52 kB
Progress (4): 0.4/1.2 MB | 262 kB | 245/305 kB | 52 kB
Progress (4): 0.4/1.2 MB | 262 kB | 245/305 kB | 52 kB
Progress (4): 0.4/1.2 MB | 262 kB | 249/305 kB | 52 kB
Progress (4): 0.4/1.2 MB | 262 kB | 249/305 kB | 52 kB
Progress (4): 0.4/1.2 MB | 262 kB | 253/305 kB | 52 kB
Progress (4): 0.4/1.2 MB | 262 kB | 253/305 kB | 52 kB
Progress (4): 0.4/1.2 MB | 262 kB | 257/305 kB | 52 kB
Progress (4): 0.4/1.2 MB | 262 kB | 257/305 kB | 52 kB
Progress (4): 0.4/1.2 MB | 262 kB | 261/305 kB | 52 kB
Progress (4): 0.4/1.2 MB | 262 kB | 261/305 kB | 52 kB
Progress (4): 0.4/1.2 MB | 262 kB | 265/305 kB | 52 kB
Progress (4): 0.4/1.2 MB | 262 kB | 265/305 kB | 52 kB
Progress (4): 0.4/1.2 MB | 262 kB | 269/305 kB | 52 kB
Progress (4): 0.4/1.2 MB | 262 kB | 269/305 kB | 52 kB
Progress (4): 0.4/1.2 MB | 262 kB | 273/305 kB | 52 kB
Progress (4): 0.4/1.2 MB | 262 kB | 273/305 kB | 52 kB
Progress (4): 0.4/1.2 MB | 262 kB | 277/305 kB | 52 kB
Progress (4): 0.4/1.2 MB | 262 kB | 277/305 kB | 52 kB
Progress (4): 0.4/1.2 MB | 262 kB | 281/305 kB | 52 kB
Progress (4): 0.4/1.2 MB | 262 kB | 281/305 kB | 52 kB
Progress (4): 0.4/1.2 MB | 262 kB | 285/305 kB | 52 kB
Progress (4): 0.4/1.2 MB | 262 kB | 285/305 kB | 52 kB
Progress (4): 0.4/1.2 MB | 262 kB | 289/305 kB | 52 kB
Progress (4): 0.4/1.2 MB | 262 kB | 289/305 kB | 52 kB
Progress (4): 0.4/1.2 MB | 262 kB | 293/305 kB | 52 kB
Progress (4): 0.4/1.2 MB | 262 kB | 293/305 kB | 52 kB
Progress (4): 0.4/1.2 MB | 262 kB | 297/305 kB | 52 kB
Progress (4): 0.4/1.2 MB | 262 kB | 297/305 kB | 52 kB
Progress (4): 0.4/1.2 MB | 262 kB | 301/305 kB | 52 kB
Progress (4): 0.4/1.2 MB | 262 kB | 301/305 kB | 52 kB
Progress (4): 0.4/1.2 MB | 262 kB | 305/305 kB | 52 kB
Progress (4): 0.4/1.2 MB | 262 kB | 305 kB | 52 kB    
Progress (4): 0.4/1.2 MB | 262 kB | 305 kB | 52 kB
Progress (4): 0.4/1.2 MB | 262 kB | 305 kB | 52 kB
Progress (4): 0.4/1.2 MB | 262 kB | 305 kB | 52 kB
Progress (4): 0.4/1.2 MB | 262 kB | 305 kB | 52 kB
Progress (4): 0.5/1.2 MB | 262 kB | 305 kB | 52 kB
Progress (4): 0.5/1.2 MB | 262 kB | 305 kB | 52 kB
Progress (4): 0.5/1.2 MB | 262 kB | 305 kB | 52 kB
Progress (4): 0.5/1.2 MB | 262 kB | 305 kB | 52 kB
Progress (4): 0.5/1.2 MB | 262 kB | 305 kB | 52 kB
Progress (4): 0.5/1.2 MB | 262 kB | 305 kB | 52 kB
Progress (4): 0.5/1.2 MB | 262 kB | 305 kB | 52 kB
Progress (4): 0.5/1.2 MB | 262 kB | 305 kB | 52 kB
Progress (4): 0.5/1.2 MB | 262 kB | 305 kB | 52 kB
Progress (4): 0.5/1.2 MB | 262 kB | 305 kB | 52 kB
Progress (4): 0.5/1.2 MB | 262 kB | 305 kB | 52 kB
Progress (4): 0.5/1.2 MB | 262 kB | 305 kB | 52 kB
Progress (4): 0.5/1.2 MB | 262 kB | 305 kB | 52 kB
Progress (4): 0.5/1.2 MB | 262 kB | 305 kB | 52 kB
Progress (4): 0.5/1.2 MB | 262 kB | 305 kB | 52 kB
Progress (4): 0.5/1.2 MB | 262 kB | 305 kB | 52 kB
Progress (4): 0.5/1.2 MB | 262 kB | 305 kB | 52 kB
Progress (4): 0.5/1.2 MB | 262 kB | 305 kB | 52 kB
Progress (4): 0.5/1.2 MB | 262 kB | 305 kB | 52 kB
Progress (4): 0.5/1.2 MB | 262 kB | 305 kB | 52 kB
Progress (4): 0.5/1.2 MB | 262 kB | 305 kB | 52 kB
Progress (4): 0.5/1.2 MB | 262 kB | 305 kB | 52 kB
Progress (4): 0.5/1.2 MB | 262 kB | 305 kB | 52 kB
Progress (4): 0.5/1.2 MB | 262 kB | 305 kB | 52 kB
                                                  
Downloaded from eclipse.maven.central.mirror: https://repo.eclipse.org/content/repositories/maven_central/org/apache/maven/doxia/doxia-decoration-model/1.1.2/doxia-decoration-model-1.1.2.jar (52 kB at 260 kB/s)
Progress (3): 0.5/1.2 MB | 262 kB | 305 kB
                                          
Downloading from eclipse.maven.central.mirror: https://repo.eclipse.org/content/repositories/maven_central/org/apache/maven/doxia/doxia-module-fml/1.1.2/doxia-module-fml-1.1.2.jar
Progress (3): 0.6/1.2 MB | 262 kB | 305 kB
Progress (3): 0.6/1.2 MB | 262 kB | 305 kB
Progress (3): 0.6/1.2 MB | 262 kB | 305 kB
Progress (3): 0.6/1.2 MB | 262 kB | 305 kB
                                          
Downloaded from eclipse.maven.central.mirror: https://repo.eclipse.org/content/repositories/maven_central/commons-lang/commons-lang/2.4/commons-lang-2.4.jar (262 kB at 1.3 MB/s)
Progress (2): 0.6/1.2 MB | 305 kB
                                 
Downloading from eclipse.maven.central.mirror: https://repo.eclipse.org/content/repositories/maven_central/org/codehaus/plexus/plexus-i18n/1.0-beta-7/plexus-i18n-1.0-beta-7.jar
Progress (2): 0.6/1.2 MB | 305 kB
Progress (2): 0.6/1.2 MB | 305 kB
Progress (2): 0.6/1.2 MB | 305 kB
Progress (2): 0.6/1.2 MB | 305 kB
                                 
Downloaded from eclipse.maven.central.mirror: https://repo.eclipse.org/content/repositories/maven_central/commons-httpclient/commons-httpclient/3.1/commons-httpclient-3.1.jar (305 kB at 1.5 MB/s)
Progress (1): 0.6/1.2 MB
                        
Downloading from eclipse.maven.central.mirror: https://repo.eclipse.org/content/repositories/maven_central/org/codehaus/plexus/plexus-velocity/1.1.7/plexus-velocity-1.1.7.jar
Progress (1): 0.6/1.2 MB
Progress (1): 0.6/1.2 MB
Progress (1): 0.6/1.2 MB
Progress (1): 0.6/1.2 MB
Progress (1): 0.6/1.2 MB
Progress (1): 0.6/1.2 MB
Progress (2): 0.6/1.2 MB | 4.1/15 kB
Progress (2): 0.6/1.2 MB | 4.1/15 kB
Progress (2): 0.6/1.2 MB | 7.7/15 kB
Progress (2): 0.6/1.2 MB | 7.7/15 kB
Progress (2): 0.6/1.2 MB | 12/15 kB 
Progress (2): 0.6/1.2 MB | 12/15 kB
Progress (2): 0.6/1.2 MB | 15 kB   
Progress (2): 0.6/1.2 MB | 15 kB
Progress (2): 0.6/1.2 MB | 15 kB
Progress (2): 0.6/1.2 MB | 15 kB
Progress (2): 0.6/1.2 MB | 15 kB
Progress (2): 0.6/1.2 MB | 15 kB
Progress (2): 0.6/1.2 MB | 15 kB
Progress (2): 0.7/1.2 MB | 15 kB
Progress (2): 0.7/1.2 MB | 15 kB
Progress (2): 0.7/1.2 MB | 15 kB
Progress (2): 0.7/1.2 MB | 15 kB
Progress (2): 0.7/1.2 MB | 15 kB
Progress (2): 0.7/1.2 MB | 15 kB
Progress (2): 0.7/1.2 MB | 15 kB
Progress (2): 0.7/1.2 MB | 15 kB
Progress (2): 0.7/1.2 MB | 15 kB
Progress (2): 0.7/1.2 MB | 15 kB
Progress (2): 0.7/1.2 MB | 15 kB
Progress (2): 0.7/1.2 MB | 15 kB
Progress (2): 0.7/1.2 MB | 15 kB
Progress (2): 0.7/1.2 MB | 15 kB
Progress (2): 0.7/1.2 MB | 15 kB
Progress (2): 0.7/1.2 MB | 15 kB
Progress (2): 0.7/1.2 MB | 15 kB
Progress (2): 0.7/1.2 MB | 15 kB
Progress (2): 0.7/1.2 MB | 15 kB
Progress (2): 0.7/1.2 MB | 15 kB
Progress (2): 0.7/1.2 MB | 15 kB
Progress (2): 0.7/1.2 MB | 15 kB
Progress (2): 0.7/1.2 MB | 15 kB
Progress (2): 0.7/1.2 MB | 15 kB
Progress (2): 0.7/1.2 MB | 15 kB
Progress (2): 0.8/1.2 MB | 15 kB
Progress (2): 0.8/1.2 MB | 15 kB
Progress (2): 0.8/1.2 MB | 15 kB
Progress (2): 0.8/1.2 MB | 15 kB
Progress (2): 0.8/1.2 MB | 15 kB
                                
Downloaded from eclipse.maven.central.mirror: https://repo.eclipse.org/content/repositories/maven_central/org/apache/maven/doxia/doxia-module-xhtml/1.1.2/doxia-module-xhtml-1.1.2.jar (15 kB at 71 kB/s)
Progress (1): 0.8/1.2 MB
                        
Downloading from eclipse.maven.central.mirror: https://repo.eclipse.org/content/repositories/maven_central/org/apache/velocity/velocity/1.5/velocity-1.5.jar
Progress (1): 0.8/1.2 MB
Progress (1): 0.8/1.2 MB
Progress (1): 0.8/1.2 MB
Progress (1): 0.8/1.2 MB
Progress (1): 0.8/1.2 MB
Progress (1): 0.8/1.2 MB
Progress (1): 0.8/1.2 MB
Progress (1): 0.8/1.2 MB
Progress (2): 0.8/1.2 MB | 4.1/37 kB
Progress (2): 0.8/1.2 MB | 4.1/37 kB
Progress (2): 0.8/1.2 MB | 7.7/37 kB
Progress (2): 0.8/1.2 MB | 7.7/37 kB
Progress (2): 0.8/1.2 MB | 12/37 kB 
Progress (2): 0.8/1.2 MB | 12/37 kB
Progress (2): 0.8/1.2 MB | 16/37 kB
Progress (2): 0.8/1.2 MB | 16/37 kB
Progress (2): 0.8/1.2 MB | 20/37 kB
Progress (2): 0.8/1.2 MB | 20/37 kB
Progress (2): 0.8/1.2 MB | 24/37 kB
Progress (2): 0.8/1.2 MB | 24/37 kB
Progress (2): 0.8/1.2 MB | 28/37 kB
Progress (2): 0.8/1.2 MB | 28/37 kB
Progress (2): 0.8/1.2 MB | 32/37 kB
Progress (2): 0.8/1.2 MB | 32/37 kB
Progress (2): 0.8/1.2 MB | 36/37 kB
Progress (2): 0.8/1.2 MB | 36/37 kB
Progress (2): 0.8/1.2 MB | 37 kB   
Progress (2): 0.8/1.2 MB | 37 kB
Progress (2): 0.8/1.2 MB | 37 kB
Progress (3): 0.8/1.2 MB | 37 kB | 4.1/11 kB
Progress (3): 0.9/1.2 MB | 37 kB | 4.1/11 kB
Progress (3): 0.9/1.2 MB | 37 kB | 7.7/11 kB
Progress (3): 0.9/1.2 MB | 37 kB | 7.7/11 kB
Progress (3): 0.9/1.2 MB | 37 kB | 11 kB    
Progress (3): 0.9/1.2 MB | 37 kB | 11 kB
Progress (3): 0.9/1.2 MB | 37 kB | 11 kB
Progress (3): 0.9/1.2 MB | 37 kB | 11 kB
Progress (3): 0.9/1.2 MB | 37 kB | 11 kB
Progress (4): 0.9/1.2 MB | 37 kB | 11 kB | 4.1/7.7 kB
Progress (4): 0.9/1.2 MB | 37 kB | 11 kB | 4.1/7.7 kB
Progress (4): 0.9/1.2 MB | 37 kB | 11 kB | 7.7 kB    
Progress (4): 0.9/1.2 MB | 37 kB | 11 kB | 7.7 kB
Progress (4): 0.9/1.2 MB | 37 kB | 11 kB | 7.7 kB
Progress (4): 0.9/1.2 MB | 37 kB | 11 kB | 7.7 kB
Progress (4): 0.9/1.2 MB | 37 kB | 11 kB | 7.7 kB
Progress (4): 0.9/1.2 MB | 37 kB | 11 kB | 7.7 kB
Progress (4): 0.9/1.2 MB | 37 kB | 11 kB | 7.7 kB
Progress (4): 0.9/1.2 MB | 37 kB | 11 kB | 7.7 kB
Progress (4): 0.9/1.2 MB | 37 kB | 11 kB | 7.7 kB
Progress (4): 0.9/1.2 MB | 37 kB | 11 kB | 7.7 kB
Progress (4): 0.9/1.2 MB | 37 kB | 11 kB | 7.7 kB
Progress (4): 0.9/1.2 MB | 37 kB | 11 kB | 7.7 kB
Progress (4): 0.9/1.2 MB | 37 kB | 11 kB | 7.7 kB
Progress (4): 0.9/1.2 MB | 37 kB | 11 kB | 7.7 kB
Progress (4): 0.9/1.2 MB | 37 kB | 11 kB | 7.7 kB
Progress (4): 0.9/1.2 MB | 37 kB | 11 kB | 7.7 kB
Progress (4): 0.9/1.2 MB | 37 kB | 11 kB | 7.7 kB
Progress (4): 0.9/1.2 MB | 37 kB | 11 kB | 7.7 kB
Progress (5): 0.9/1.2 MB | 37 kB | 11 kB | 7.7 kB | 4.1/392 kB
Progress (5): 0.9/1.2 MB | 37 kB | 11 kB | 7.7 kB | 4.1/392 kB
Progress (5): 0.9/1.2 MB | 37 kB | 11 kB | 7.7 kB | 7.7/392 kB
Progress (5): 1.0/1.2 MB | 37 kB | 11 kB | 7.7 kB | 7.7/392 kB
Progress (5): 1.0/1.2 MB | 37 kB | 11 kB | 7.7 kB | 12/392 kB 
Progress (5): 1.0/1.2 MB | 37 kB | 11 kB | 7.7 kB | 12/392 kB
Progress (5): 1.0/1.2 MB | 37 kB | 11 kB | 7.7 kB | 16/392 kB
Progress (5): 1.0/1.2 MB | 37 kB | 11 kB | 7.7 kB | 16/392 kB
Progress (5): 1.0/1.2 MB | 37 kB | 11 kB | 7.7 kB | 20/392 kB
Progress (5): 1.0/1.2 MB | 37 kB | 11 kB | 7.7 kB | 20/392 kB
Progress (5): 1.0/1.2 MB | 37 kB | 11 kB | 7.7 kB | 24/392 kB
Progress (5): 1.0/1.2 MB | 37 kB | 11 kB | 7.7 kB | 24/392 kB
Progress (5): 1.0/1.2 MB | 37 kB | 11 kB | 7.7 kB | 28/392 kB
Progress (5): 1.0/1.2 MB | 37 kB | 11 kB | 7.7 kB | 28/392 kB
Progress (5): 1.0/1.2 MB | 37 kB | 11 kB | 7.7 kB | 32/392 kB
Progress (5): 1.0/1.2 MB | 37 kB | 11 kB | 7.7 kB | 32/392 kB
Progress (5): 1.0/1.2 MB | 37 kB | 11 kB | 7.7 kB | 33/392 kB
Progress (5): 1.0/1.2 MB | 37 kB | 11 kB | 7.7 kB | 33/392 kB
                                                             
Downloaded from eclipse.maven.central.mirror: https://repo.eclipse.org/content/repositories/maven_central/org/apache/maven/doxia/doxia-module-fml/1.1.2/doxia-module-fml-1.1.2.jar (37 kB at 168 kB/s)
Downloaded from eclipse.maven.central.mirror: https://repo.eclipse.org/content/repositories/maven_central/org/codehaus/plexus/plexus-i18n/1.0-beta-7/plexus-i18n-1.0-beta-7.jar (11 kB at 47 kB/s)
Downloading from eclipse.maven.central.mirror: https://repo.eclipse.org/content/repositories/maven_central/commons-validator/commons-validator/1.2.0/commons-validator-1.2.0.jar
Downloaded from eclipse.maven.central.mirror: https://repo.eclipse.org/content/repositories/maven_central/org/codehaus/plexus/plexus-velocity/1.1.7/plexus-velocity-1.1.7.jar (7.7 kB at 34 kB/s)
Progress (2): 1.0/1.2 MB | 33/392 kB
Progress (2): 1.0/1.2 MB | 37/392 kB
                                    
Downloading from eclipse.maven.central.mirror: https://repo.eclipse.org/content/repositories/maven_central/commons-beanutils/commons-beanutils/1.7.0/commons-beanutils-1.7.0.jar
Downloading from eclipse.maven.central.mirror: https://repo.eclipse.org/content/repositories/maven_central/commons-collections/commons-collections/3.2/commons-collections-3.2.jar
Progress (2): 1.0/1.2 MB | 41/392 kB
Progress (2): 1.0/1.2 MB | 41/392 kB
Progress (2): 1.0/1.2 MB | 45/392 kB
Progress (2): 1.0/1.2 MB | 45/392 kB
Progress (2): 1.0/1.2 MB | 49/392 kB
Progress (2): 1.0/1.2 MB | 49/392 kB
Progress (2): 1.0/1.2 MB | 53/392 kB
Progress (2): 1.0/1.2 MB | 53/392 kB
Progress (2): 1.0/1.2 MB | 57/392 kB
Progress (2): 1.0/1.2 MB | 57/392 kB
Progress (2): 1.0/1.2 MB | 61/392 kB
Progress (2): 1.0/1.2 MB | 61/392 kB
Progress (2): 1.0/1.2 MB | 65/392 kB
Progress (2): 1.0/1.2 MB | 65/392 kB
Progress (2): 1.0/1.2 MB | 66/392 kB
Progress (2): 1.0/1.2 MB | 66/392 kB
Progress (2): 1.0/1.2 MB | 70/392 kB
Progress (2): 1.0/1.2 MB | 70/392 kB
Progress (2): 1.0/1.2 MB | 74/392 kB
Progress (2): 1.0/1.2 MB | 74/392 kB
Progress (2): 1.0/1.2 MB | 78/392 kB
Progress (2): 1.0/1.2 MB | 78/392 kB
Progress (2): 1.0/1.2 MB | 82/392 kB
Progress (2): 1.0/1.2 MB | 82/392 kB
Progress (2): 1.0/1.2 MB | 86/392 kB
Progress (2): 1.0/1.2 MB | 86/392 kB
Progress (2): 1.0/1.2 MB | 90/392 kB
Progress (2): 1.0/1.2 MB | 90/392 kB
Progress (2): 1.0/1.2 MB | 94/392 kB
Progress (2): 1.0/1.2 MB | 94/392 kB
Progress (2): 1.0/1.2 MB | 98/392 kB
Progress (2): 1.0/1.2 MB | 98/392 kB
Progress (2): 1.0/1.2 MB | 98/392 kB
Progress (2): 1.1/1.2 MB | 98/392 kB
Progress (2): 1.1/1.2 MB | 102/392 kB
Progress (2): 1.1/1.2 MB | 102/392 kB
Progress (2): 1.1/1.2 MB | 106/392 kB
Progress (2): 1.1/1.2 MB | 106/392 kB
Progress (2): 1.1/1.2 MB | 106/392 kB
Progress (2): 1.1/1.2 MB | 110/392 kB
Progress (2): 1.1/1.2 MB | 110/392 kB
Progress (2): 1.1/1.2 MB | 114/392 kB
Progress (2): 1.1/1.2 MB | 114/392 kB
Progress (2): 1.1/1.2 MB | 118/392 kB
Progress (2): 1.1/1.2 MB | 118/392 kB
Progress (2): 1.1/1.2 MB | 122/392 kB
Progress (2): 1.1/1.2 MB | 122/392 kB
Progress (2): 1.1/1.2 MB | 126/392 kB
Progress (2): 1.1/1.2 MB | 126/392 kB
Progress (2): 1.1/1.2 MB | 130/392 kB
Progress (2): 1.1/1.2 MB | 130/392 kB
Progress (2): 1.1/1.2 MB | 131/392 kB
Progress (2): 1.1/1.2 MB | 131/392 kB
Progress (2): 1.1/1.2 MB | 135/392 kB
Progress (2): 1.1/1.2 MB | 135/392 kB
Progress (2): 1.1/1.2 MB | 139/392 kB
Progress (2): 1.1/1.2 MB | 139/392 kB
Progress (2): 1.1/1.2 MB | 139/392 kB
Progress (2): 1.1/1.2 MB | 143/392 kB
Progress (2): 1.1/1.2 MB | 143/392 kB
Progress (2): 1.1/1.2 MB | 147/392 kB
Progress (2): 1.1/1.2 MB | 147/392 kB
Progress (3): 1.1/1.2 MB | 147/392 kB | 4.1/91 kB
Progress (3): 1.1/1.2 MB | 147/392 kB | 4.1/91 kB
Progress (3): 1.1/1.2 MB | 151/392 kB | 4.1/91 kB
Progress (3): 1.1/1.2 MB | 151/392 kB | 4.1/91 kB
Progress (3): 1.1/1.2 MB | 151/392 kB | 7.7/91 kB
Progress (3): 1.1/1.2 MB | 155/392 kB | 7.7/91 kB
Progress (3): 1.1/1.2 MB | 155/392 kB | 7.7/91 kB
Progress (3): 1.1/1.2 MB | 155/392 kB | 12/91 kB 
Progress (4): 1.1/1.2 MB | 155/392 kB | 12/91 kB | 4.1/189 kB
Progress (4): 1.1/1.2 MB | 159/392 kB | 12/91 kB | 4.1/189 kB
Progress (4): 1.1/1.2 MB | 159/392 kB | 12/91 kB | 4.1/189 kB
Progress (4): 1.1/1.2 MB | 163/392 kB | 12/91 kB | 4.1/189 kB
Progress (4): 1.1/1.2 MB | 163/392 kB | 12/91 kB | 7.7/189 kB
Progress (4): 1.1/1.2 MB | 163/392 kB | 16/91 kB | 7.7/189 kB
Progress (4): 1.1/1.2 MB | 167/392 kB | 16/91 kB | 7.7/189 kB
Progress (4): 1.1/1.2 MB | 167/392 kB | 16/91 kB | 7.7/189 kB
Progress (4): 1.1/1.2 MB | 171/392 kB | 16/91 kB | 7.7/189 kB
Progress (4): 1.1/1.2 MB | 171/392 kB | 20/91 kB | 7.7/189 kB
Progress (4): 1.1/1.2 MB | 175/392 kB | 20/91 kB | 7.7/189 kB
Progress (4): 1.1/1.2 MB | 175/392 kB | 20/91 kB | 12/189 kB 
Progress (4): 1.1/1.2 MB | 179/392 kB | 20/91 kB | 12/189 kB
Progress (4): 1.1/1.2 MB | 179/392 kB | 24/91 kB | 12/189 kB
Progress (4): 1.1/1.2 MB | 179/392 kB | 24/91 kB | 12/189 kB
Progress (4): 1.1/1.2 MB | 183/392 kB | 24/91 kB | 12/189 kB
Progress (5): 1.1/1.2 MB | 183/392 kB | 24/91 kB | 12/189 kB | 4.1/571 kB
Progress (5): 1.1/1.2 MB | 183/392 kB | 24/91 kB | 16/189 kB | 4.1/571 kB
Progress (5): 1.1/1.2 MB | 183/392 kB | 24/91 kB | 16/189 kB | 7.7/571 kB
Progress (5): 1.1/1.2 MB | 187/392 kB | 24/91 kB | 16/189 kB | 7.7/571 kB
Progress (5): 1.1/1.2 MB | 187/392 kB | 24/91 kB | 16/189 kB | 7.7/571 kB
Progress (5): 1.1/1.2 MB | 187/392 kB | 28/91 kB | 16/189 kB | 7.7/571 kB
Progress (5): 1.1/1.2 MB | 187/392 kB | 28/91 kB | 16/189 kB | 7.7/571 kB
Progress (5): 1.1/1.2 MB | 191/392 kB | 28/91 kB | 16/189 kB | 7.7/571 kB
Progress (5): 1.1/1.2 MB | 191/392 kB | 28/91 kB | 16/189 kB | 12/571 kB 
Progress (5): 1.1/1.2 MB | 191/392 kB | 28/91 kB | 20/189 kB | 12/571 kB
Progress (5): 1.1/1.2 MB | 191/392 kB | 28/91 kB | 20/189 kB | 16/571 kB
Progress (5): 1.1/1.2 MB | 195/392 kB | 28/91 kB | 20/189 kB | 16/571 kB
Progress (5): 1.1/1.2 MB | 195/392 kB | 28/91 kB | 20/189 kB | 16/571 kB
Progress (5): 1.1/1.2 MB | 199/392 kB | 28/91 kB | 20/189 kB | 16/571 kB
Progress (5): 1.1/1.2 MB | 199/392 kB | 32/91 kB | 20/189 kB | 16/571 kB
Progress (5): 1.1/1.2 MB | 203/392 kB | 32/91 kB | 20/189 kB | 16/571 kB
Progress (5): 1.2/1.2 MB | 203/392 kB | 32/91 kB | 20/189 kB | 16/571 kB
Progress (5): 1.2/1.2 MB | 203/392 kB | 32/91 kB | 20/189 kB | 20/571 kB
Progress (5): 1.2/1.2 MB | 203/392 kB | 32/91 kB | 20/189 kB | 20/571 kB
Progress (5): 1.2/1.2 MB | 203/392 kB | 32/91 kB | 24/189 kB | 20/571 kB
Progress (5): 1.2/1.2 MB | 203/392 kB | 32/91 kB | 24/189 kB | 20/571 kB
Progress (5): 1.2/1.2 MB | 203/392 kB | 32/91 kB | 24/189 kB | 24/571 kB
Progress (5): 1.2/1.2 MB | 207/392 kB | 32/91 kB | 24/189 kB | 24/571 kB
Progress (5): 1.2/1.2 MB | 207/392 kB | 32/91 kB | 24/189 kB | 28/571 kB
Progress (5): 1.2/1.2 MB | 207/392 kB | 36/91 kB | 24/189 kB | 28/571 kB
Progress (5): 1.2/1.2 MB | 207/392 kB | 36/91 kB | 24/189 kB | 32/571 kB
Progress (5): 1.2/1.2 MB | 211/392 kB | 36/91 kB | 24/189 kB | 32/571 kB
Progress (5): 1.2/1.2 MB | 211/392 kB | 36/91 kB | 24/189 kB | 32/571 kB
Progress (5): 1.2/1.2 MB | 211/392 kB | 36/91 kB | 28/189 kB | 32/571 kB
Progress (5): 1.2/1.2 MB | 211/392 kB | 36/91 kB | 28/189 kB | 32/571 kB
Progress (5): 1.2/1.2 MB | 215/392 kB | 36/91 kB | 28/189 kB | 32/571 kB
Progress (5): 1.2/1.2 MB | 215/392 kB | 36/91 kB | 28/189 kB | 33/571 kB
Progress (5): 1.2/1.2 MB | 215/392 kB | 40/91 kB | 28/189 kB | 33/571 kB
Progress (5): 1.2/1.2 MB | 215/392 kB | 40/91 kB | 28/189 kB | 37/571 kB
Progress (5): 1.2/1.2 MB | 219/392 kB | 40/91 kB | 28/189 kB | 37/571 kB
Progress (5): 1.2/1.2 MB | 219/392 kB | 40/91 kB | 28/189 kB | 37/571 kB
Progress (5): 1.2/1.2 MB | 219/392 kB | 40/91 kB | 32/189 kB | 37/571 kB
Progress (5): 1.2/1.2 MB | 219/392 kB | 40/91 kB | 32/189 kB | 37/571 kB
Progress (5): 1.2/1.2 MB | 223/392 kB | 40/91 kB | 32/189 kB | 37/571 kB
Progress (5): 1.2/1.2 MB | 223/392 kB | 40/91 kB | 32/189 kB | 37/571 kB
Progress (5): 1.2/1.2 MB | 223/392 kB | 40/91 kB | 32/189 kB | 41/571 kB
Progress (5): 1.2/1.2 MB | 223/392 kB | 44/91 kB | 32/189 kB | 41/571 kB
Progress (5): 1.2/1.2 MB | 223/392 kB | 44/91 kB | 32/189 kB | 41/571 kB
Progress (5): 1.2/1.2 MB | 227/392 kB | 44/91 kB | 32/189 kB | 41/571 kB
Progress (5): 1.2/1.2 MB | 227/392 kB | 44/91 kB | 32/189 kB | 41/571 kB
Progress (5): 1.2/1.2 MB | 227/392 kB | 44/91 kB | 36/189 kB | 41/571 kB
Progress (5): 1.2/1.2 MB | 227/392 kB | 44/91 kB | 36/189 kB | 41/571 kB
Progress (5): 1.2/1.2 MB | 231/392 kB | 44/91 kB | 36/189 kB | 41/571 kB
Progress (5): 1.2/1.2 MB | 231/392 kB | 48/91 kB | 36/189 kB | 41/571 kB
Progress (5): 1.2/1.2 MB | 231/392 kB | 48/91 kB | 36/189 kB | 45/571 kB
Progress (5): 1.2/1.2 MB | 231/392 kB | 52/91 kB | 36/189 kB | 45/571 kB
Progress (5): 1.2/1.2 MB | 235/392 kB | 52/91 kB | 36/189 kB | 45/571 kB
Progress (5): 1.2/1.2 MB | 235/392 kB | 52/91 kB | 36/189 kB | 45/571 kB
Progress (5): 1.2/1.2 MB | 235/392 kB | 52/91 kB | 40/189 kB | 45/571 kB
Progress (5): 1.2/1.2 MB | 235/392 kB | 52/91 kB | 40/189 kB | 45/571 kB
Progress (5): 1.2/1.2 MB | 239/392 kB | 52/91 kB | 40/189 kB | 45/571 kB
Progress (5): 1.2/1.2 MB | 239/392 kB | 52/91 kB | 40/189 kB | 45/571 kB
Progress (5): 1.2/1.2 MB | 239/392 kB | 56/91 kB | 40/189 kB | 45/571 kB
Progress (5): 1.2/1.2 MB | 239/392 kB | 56/91 kB | 40/189 kB | 49/571 kB
Progress (5): 1.2/1.2 MB | 239/392 kB | 60/91 kB | 40/189 kB | 49/571 kB
Progress (5): 1.2/1.2 MB | 239/392 kB | 60/91 kB | 40/189 kB | 49/571 kB
Progress (5): 1.2/1.2 MB | 243/392 kB | 60/91 kB | 40/189 kB | 49/571 kB
Progress (5): 1.2/1.2 MB | 243/392 kB | 60/91 kB | 44/189 kB | 49/571 kB
Progress (5): 1.2/1.2 MB | 247/392 kB | 60/91 kB | 44/189 kB | 49/571 kB
Progress (5): 1.2/1.2 MB | 247/392 kB | 60/91 kB | 44/189 kB | 49/571 kB
Progress (5): 1.2/1.2 MB | 247/392 kB | 64/91 kB | 44/189 kB | 49/571 kB
Progress (5): 1.2/1.2 MB | 247/392 kB | 64/91 kB | 44/189 kB | 53/571 kB
Progress (5): 1.2/1.2 MB | 247/392 kB | 68/91 kB | 44/189 kB | 53/571 kB
Progress (5): 1.2 MB | 247/392 kB | 68/91 kB | 44/189 kB | 53/571 kB    
Progress (5): 1.2 MB | 251/392 kB | 68/91 kB | 44/189 kB | 53/571 kB
Progress (5): 1.2 MB | 251/392 kB | 68/91 kB | 48/189 kB | 53/571 kB
Progress (5): 1.2 MB | 255/392 kB | 68/91 kB | 48/189 kB | 53/571 kB
Progress (5): 1.2 MB | 255/392 kB | 72/91 kB | 48/189 kB | 53/571 kB
Progress (5): 1.2 MB | 255/392 kB | 72/91 kB | 48/189 kB | 57/571 kB
Progress (5): 1.2 MB | 255/392 kB | 76/91 kB | 48/189 kB | 57/571 kB
Progress (5): 1.2 MB | 259/392 kB | 76/91 kB | 48/189 kB | 57/571 kB
Progress (5): 1.2 MB | 259/392 kB | 76/91 kB | 52/189 kB | 57/571 kB
Progress (5): 1.2 MB | 263/392 kB | 76/91 kB | 52/189 kB | 57/571 kB
Progress (5): 1.2 MB | 263/392 kB | 80/91 kB | 52/189 kB | 57/571 kB
Progress (5): 1.2 MB | 263/392 kB | 80/91 kB | 52/189 kB | 61/571 kB
Progress (5): 1.2 MB | 263/392 kB | 84/91 kB | 52/189 kB | 61/571 kB
Progress (5): 1.2 MB | 267/392 kB | 84/91 kB | 52/189 kB | 61/571 kB
Progress (5): 1.2 MB | 267/392 kB | 84/91 kB | 56/189 kB | 61/571 kB
Progress (5): 1.2 MB | 271/392 kB | 84/91 kB | 56/189 kB | 61/571 kB
Progress (5): 1.2 MB | 271/392 kB | 88/91 kB | 56/189 kB | 61/571 kB
Progress (5): 1.2 MB | 271/392 kB | 88/91 kB | 56/189 kB | 65/571 kB
Progress (5): 1.2 MB | 271/392 kB | 91 kB | 56/189 kB | 65/571 kB   
Progress (5): 1.2 MB | 275/392 kB | 91 kB | 56/189 kB | 65/571 kB
Progress (5): 1.2 MB | 275/392 kB | 91 kB | 60/189 kB | 65/571 kB
Progress (5): 1.2 MB | 279/392 kB | 91 kB | 60/189 kB | 65/571 kB
Progress (5): 1.2 MB | 279/392 kB | 91 kB | 60/189 kB | 66/571 kB
Progress (5): 1.2 MB | 283/392 kB | 91 kB | 60/189 kB | 66/571 kB
Progress (5): 1.2 MB | 283/392 kB | 91 kB | 64/189 kB | 66/571 kB
Progress (5): 1.2 MB | 287/392 kB | 91 kB | 64/189 kB | 66/571 kB
Progress (5): 1.2 MB | 287/392 kB | 91 kB | 64/189 kB | 70/571 kB
Progress (5): 1.2 MB | 291/392 kB | 91 kB | 64/189 kB | 70/571 kB
Progress (5): 1.2 MB | 291/392 kB | 91 kB | 68/189 kB | 70/571 kB
Progress (5): 1.2 MB | 295/392 kB | 91 kB | 68/189 kB | 70/571 kB
Progress (5): 1.2 MB | 295/392 kB | 91 kB | 68/189 kB | 74/571 kB
Progress (5): 1.2 MB | 299/392 kB | 91 kB | 68/189 kB | 74/571 kB
Progress (5): 1.2 MB | 299/392 kB | 91 kB | 72/189 kB | 74/571 kB
Progress (5): 1.2 MB | 303/392 kB | 91 kB | 72/189 kB | 74/571 kB
Progress (5): 1.2 MB | 303/392 kB | 91 kB | 72/189 kB | 78/571 kB
Progress (5): 1.2 MB | 307/392 kB | 91 kB | 72/189 kB | 78/571 kB
Progress (5): 1.2 MB | 307/392 kB | 91 kB | 76/189 kB | 78/571 kB
Progress (5): 1.2 MB | 311/392 kB | 91 kB | 76/189 kB | 78/571 kB
Progress (5): 1.2 MB | 311/392 kB | 91 kB | 76/189 kB | 82/571 kB
Progress (5): 1.2 MB | 315/392 kB | 91 kB | 76/189 kB | 82/571 kB
Progress (5): 1.2 MB | 315/392 kB | 91 kB | 80/189 kB | 82/571 kB
Progress (5): 1.2 MB | 319/392 kB | 91 kB | 80/189 kB | 82/571 kB
Progress (5): 1.2 MB | 319/392 kB | 91 kB | 80/189 kB | 86/571 kB
Progress (5): 1.2 MB | 323/392 kB | 91 kB | 80/189 kB | 86/571 kB
Progress (5): 1.2 MB | 323/392 kB | 91 kB | 84/189 kB | 86/571 kB
Progress (5): 1.2 MB | 327/392 kB | 91 kB | 84/189 kB | 86/571 kB
                                                                 
Downloaded from eclipse.maven.central.mirror: https://repo.eclipse.org/content/repositories/maven_central/xerces/xercesImpl/2.8.1/xercesImpl-2.8.1.jar (1.2 MB at 4.9 MB/s)
Progress (4): 327/392 kB | 91 kB | 84/189 kB | 90/571 kB
                                                        
Downloading from eclipse.maven.central.mirror: https://repo.eclipse.org/content/repositories/maven_central/commons-digester/commons-digester/1.6/commons-digester-1.6.jar
Progress (4): 331/392 kB | 91 kB | 84/189 kB | 90/571 kB
Progress (4): 331/392 kB | 91 kB | 88/189 kB | 90/571 kB
Progress (4): 335/392 kB | 91 kB | 88/189 kB | 90/571 kB
                                                        
Downloaded from eclipse.maven.central.mirror: https://repo.eclipse.org/content/repositories/maven_central/commons-validator/commons-validator/1.2.0/commons-validator-1.2.0.jar (91 kB at 363 kB/s)
Progress (3): 335/392 kB | 88/189 kB | 94/571 kB
                                                
Downloading from eclipse.maven.central.mirror: https://repo.eclipse.org/content/repositories/maven_central/commons-logging/commons-logging/1.0.4/commons-logging-1.0.4.jar
Progress (3): 339/392 kB | 88/189 kB | 94/571 kB
Progress (3): 339/392 kB | 92/189 kB | 94/571 kB
Progress (3): 339/392 kB | 92/189 kB | 98/571 kB
Progress (3): 343/392 kB | 92/189 kB | 98/571 kB
Progress (3): 343/392 kB | 96/189 kB | 98/571 kB
Progress (3): 343/392 kB | 96/189 kB | 102/571 kB
Progress (3): 347/392 kB | 96/189 kB | 102/571 kB
Progress (3): 347/392 kB | 100/189 kB | 102/571 kB
Progress (3): 347/392 kB | 100/189 kB | 106/571 kB
Progress (3): 347/392 kB | 104/189 kB | 106/571 kB
Progress (3): 351/392 kB | 104/189 kB | 106/571 kB
Progress (3): 351/392 kB | 104/189 kB | 110/571 kB
Progress (3): 351/392 kB | 108/189 kB | 110/571 kB
Progress (3): 355/392 kB | 108/189 kB | 110/571 kB
Progress (3): 355/392 kB | 112/189 kB | 110/571 kB
Progress (3): 355/392 kB | 112/189 kB | 114/571 kB
Progress (3): 359/392 kB | 112/189 kB | 114/571 kB
Progress (3): 359/392 kB | 116/189 kB | 114/571 kB
Progress (3): 363/392 kB | 116/189 kB | 114/571 kB
Progress (3): 363/392 kB | 116/189 kB | 118/571 kB
Progress (3): 363/392 kB | 120/189 kB | 118/571 kB
Progress (3): 363/392 kB | 120/189 kB | 122/571 kB
Progress (3): 367/392 kB | 120/189 kB | 122/571 kB
Progress (3): 367/392 kB | 124/189 kB | 122/571 kB
Progress (3): 371/392 kB | 124/189 kB | 122/571 kB
Progress (3): 371/392 kB | 124/189 kB | 126/571 kB
Progress (3): 371/392 kB | 128/189 kB | 126/571 kB
Progress (3): 371/392 kB | 128/189 kB | 130/571 kB
Progress (3): 375/392 kB | 128/189 kB | 130/571 kB
Progress (3): 375/392 kB | 132/189 kB | 130/571 kB
Progress (3): 379/392 kB | 132/189 kB | 130/571 kB
Progress (3): 379/392 kB | 132/189 kB | 134/571 kB
Progress (3): 379/392 kB | 136/189 kB | 134/571 kB
Progress (3): 383/392 kB | 136/189 kB | 134/571 kB
Progress (3): 383/392 kB | 136/189 kB | 138/571 kB
Progress (3): 383/392 kB | 140/189 kB | 138/571 kB
Progress (3): 387/392 kB | 140/189 kB | 138/571 kB
Progress (3): 387/392 kB | 144/189 kB | 138/571 kB
Progress (3): 387/392 kB | 144/189 kB | 142/571 kB
Progress (3): 391/392 kB | 144/189 kB | 142/571 kB
Progress (3): 391/392 kB | 148/189 kB | 142/571 kB
Progress (3): 391/392 kB | 148/189 kB | 146/571 kB
Progress (3): 391/392 kB | 152/189 kB | 146/571 kB
Progress (3): 392 kB | 152/189 kB | 146/571 kB    
Progress (3): 392 kB | 152/189 kB | 150/571 kB
Progress (3): 392 kB | 156/189 kB | 150/571 kB
Progress (3): 392 kB | 156/189 kB | 154/571 kB
Progress (3): 392 kB | 160/189 kB | 154/571 kB
Progress (3): 392 kB | 160/189 kB | 158/571 kB
Progress (3): 392 kB | 164/189 kB | 158/571 kB
Progress (4): 392 kB | 164/189 kB | 158/571 kB | 4.1/168 kB
Progress (4): 392 kB | 168/189 kB | 158/571 kB | 4.1/168 kB
Progress (4): 392 kB | 168/189 kB | 162/571 kB | 4.1/168 kB
Progress (4): 392 kB | 168/189 kB | 162/571 kB | 7.7/168 kB
Progress (4): 392 kB | 172/189 kB | 162/571 kB | 7.7/168 kB
Progress (4): 392 kB | 172/189 kB | 166/571 kB | 7.7/168 kB
Progress (4): 392 kB | 176/189 kB | 166/571 kB | 7.7/168 kB
Progress (4): 392 kB | 176/189 kB | 166/571 kB | 12/168 kB 
Progress (4): 392 kB | 176/189 kB | 170/571 kB | 12/168 kB
Progress (4): 392 kB | 176/189 kB | 170/571 kB | 16/168 kB
Progress (4): 392 kB | 176/189 kB | 174/571 kB | 16/168 kB
Progress (4): 392 kB | 180/189 kB | 174/571 kB | 16/168 kB
Progress (4): 392 kB | 180/189 kB | 178/571 kB | 16/168 kB
Progress (4): 392 kB | 180/189 kB | 178/571 kB | 20/168 kB
Progress (4): 392 kB | 184/189 kB | 178/571 kB | 20/168 kB
Progress (4): 392 kB | 184/189 kB | 178/571 kB | 24/168 kB
Progress (4): 392 kB | 184/189 kB | 182/571 kB | 24/168 kB
Progress (4): 392 kB | 188/189 kB | 182/571 kB | 24/168 kB
Progress (4): 392 kB | 188/189 kB | 186/571 kB | 24/168 kB
Progress (4): 392 kB | 188/189 kB | 186/571 kB | 28/168 kB
Progress (4): 392 kB | 189 kB | 186/571 kB | 28/168 kB    
Progress (4): 392 kB | 189 kB | 186/571 kB | 32/168 kB
Progress (4): 392 kB | 189 kB | 190/571 kB | 32/168 kB
Progress (4): 392 kB | 189 kB | 190/571 kB | 33/168 kB
Progress (4): 392 kB | 189 kB | 194/571 kB | 33/168 kB
Progress (4): 392 kB | 189 kB | 194/571 kB | 37/168 kB
Progress (4): 392 kB | 189 kB | 198/571 kB | 37/168 kB
Progress (4): 392 kB | 189 kB | 198/571 kB | 41/168 kB
Progress (4): 392 kB | 189 kB | 202/571 kB | 41/168 kB
Progress (4): 392 kB | 189 kB | 202/571 kB | 45/168 kB
Progress (4): 392 kB | 189 kB | 206/571 kB | 45/168 kB
Progress (4): 392 kB | 189 kB | 206/571 kB | 49/168 kB
Progress (4): 392 kB | 189 kB | 210/571 kB | 49/168 kB
Progress (4): 392 kB | 189 kB | 210/571 kB | 53/168 kB
Progress (4): 392 kB | 189 kB | 214/571 kB | 53/168 kB
Progress (4): 392 kB | 189 kB | 214/571 kB | 57/168 kB
Progress (4): 392 kB | 189 kB | 218/571 kB | 57/168 kB
Progress (4): 392 kB | 189 kB | 218/571 kB | 61/168 kB
Progress (4): 392 kB | 189 kB | 222/571 kB | 61/168 kB
Progress (4): 392 kB | 189 kB | 222/571 kB | 65/168 kB
Progress (4): 392 kB | 189 kB | 226/571 kB | 65/168 kB
Progress (4): 392 kB | 189 kB | 226/571 kB | 66/168 kB
Progress (4): 392 kB | 189 kB | 230/571 kB | 66/168 kB
Progress (4): 392 kB | 189 kB | 230/571 kB | 70/168 kB
Progress (5): 392 kB | 189 kB | 230/571 kB | 70/168 kB | 4.1/38 kB
Progress (5): 392 kB | 189 kB | 230/571 kB | 74/168 kB | 4.1/38 kB
Progress (5): 392 kB | 189 kB | 234/571 kB | 74/168 kB | 4.1/38 kB
Progress (5): 392 kB | 189 kB | 234/571 kB | 74/168 kB | 7.7/38 kB
Progress (5): 392 kB | 189 kB | 234/571 kB | 78/168 kB | 7.7/38 kB
Progress (5): 392 kB | 189 kB | 234/571 kB | 78/168 kB | 12/38 kB 
Progress (5): 392 kB | 189 kB | 238/571 kB | 78/168 kB | 12/38 kB
Progress (5): 392 kB | 189 kB | 238/571 kB | 78/168 kB | 16/38 kB
Progress (5): 392 kB | 189 kB | 238/571 kB | 82/168 kB | 16/38 kB
Progress (5): 392 kB | 189 kB | 242/571 kB | 82/168 kB | 16/38 kB
                                                                 
Downloaded from eclipse.maven.central.mirror: https://repo.eclipse.org/content/repositories/maven_central/org/apache/velocity/velocity/1.5/velocity-1.5.jar (392 kB at 1.5 MB/s)
Downloading from eclipse.maven.central.mirror: https://repo.eclipse.org/content/repositories/maven_central/oro/oro/2.0.8/oro-2.0.8.jar
Progress (4): 189 kB | 246/571 kB | 82/168 kB | 16/38 kB
Progress (4): 189 kB | 246/571 kB | 86/168 kB | 16/38 kB
Progress (4): 189 kB | 246/571 kB | 86/168 kB | 20/38 kB
Progress (4): 189 kB | 246/571 kB | 90/168 kB | 20/38 kB
Progress (4): 189 kB | 250/571 kB | 90/168 kB | 20/38 kB
Progress (4): 189 kB | 250/571 kB | 90/168 kB | 24/38 kB
Progress (4): 189 kB | 250/571 kB | 94/168 kB | 24/38 kB
Progress (4): 189 kB | 254/571 kB | 94/168 kB | 24/38 kB
Progress (4): 189 kB | 254/571 kB | 98/168 kB | 24/38 kB
Progress (4): 189 kB | 254/571 kB | 98/168 kB | 28/38 kB
Progress (4): 189 kB | 254/571 kB | 98/168 kB | 28/38 kB
Progress (4): 189 kB | 258/571 kB | 98/168 kB | 28/38 kB
Progress (4): 189 kB | 258/571 kB | 102/168 kB | 28/38 kB
Progress (4): 189 kB | 258/571 kB | 102/168 kB | 32/38 kB
Progress (4): 189 kB | 258/571 kB | 106/168 kB | 32/38 kB
Progress (4): 189 kB | 262/571 kB | 106/168 kB | 32/38 kB
Progress (4): 189 kB | 262/571 kB | 106/168 kB | 36/38 kB
Progress (4): 189 kB | 266/571 kB | 106/168 kB | 36/38 kB
Progress (4): 189 kB | 266/571 kB | 110/168 kB | 36/38 kB
Progress (4): 189 kB | 266/571 kB | 110/168 kB | 38 kB   
Progress (4): 189 kB | 266/571 kB | 114/168 kB | 38 kB
Progress (4): 189 kB | 270/571 kB | 114/168 kB | 38 kB
Progress (4): 189 kB | 270/571 kB | 118/168 kB | 38 kB
Progress (4): 189 kB | 274/571 kB | 118/168 kB | 38 kB
Progress (4): 189 kB | 274/571 kB | 122/168 kB | 38 kB
Progress (4): 189 kB | 278/571 kB | 122/168 kB | 38 kB
Progress (4): 189 kB | 278/571 kB | 126/168 kB | 38 kB
Progress (4): 189 kB | 282/571 kB | 126/168 kB | 38 kB
Progress (4): 189 kB | 282/571 kB | 130/168 kB | 38 kB
Progress (4): 189 kB | 286/571 kB | 130/168 kB | 38 kB
Progress (4): 189 kB | 286/571 kB | 134/168 kB | 38 kB
Progress (4): 189 kB | 290/571 kB | 134/168 kB | 38 kB
Progress (4): 189 kB | 290/571 kB | 138/168 kB | 38 kB
Progress (4): 189 kB | 294/571 kB | 138/168 kB | 38 kB
Progress (4): 189 kB | 294/571 kB | 142/168 kB | 38 kB
Progress (4): 189 kB | 298/571 kB | 142/168 kB | 38 kB
Progress (4): 189 kB | 298/571 kB | 146/168 kB | 38 kB
Progress (4): 189 kB | 302/571 kB | 146/168 kB | 38 kB
Progress (4): 189 kB | 302/571 kB | 150/168 kB | 38 kB
Progress (4): 189 kB | 306/571 kB | 150/168 kB | 38 kB
Progress (4): 189 kB | 306/571 kB | 154/168 kB | 38 kB
Progress (4): 189 kB | 310/571 kB | 154/168 kB | 38 kB
Progress (4): 189 kB | 310/571 kB | 158/168 kB | 38 kB
Progress (4): 189 kB | 314/571 kB | 158/168 kB | 38 kB
Progress (4): 189 kB | 314/571 kB | 162/168 kB | 38 kB
Progress (4): 189 kB | 318/571 kB | 162/168 kB | 38 kB
Progress (4): 189 kB | 318/571 kB | 166/168 kB | 38 kB
Progress (4): 189 kB | 322/571 kB | 166/168 kB | 38 kB
Progress (4): 189 kB | 322/571 kB | 168 kB | 38 kB    
Progress (4): 189 kB | 326/571 kB | 168 kB | 38 kB
Progress (4): 189 kB | 330/571 kB | 168 kB | 38 kB
Progress (4): 189 kB | 334/571 kB | 168 kB | 38 kB
Progress (4): 189 kB | 338/571 kB | 168 kB | 38 kB
Progress (4): 189 kB | 342/571 kB | 168 kB | 38 kB
Progress (4): 189 kB | 346/571 kB | 168 kB | 38 kB
Progress (4): 189 kB | 350/571 kB | 168 kB | 38 kB
Progress (4): 189 kB | 354/571 kB | 168 kB | 38 kB
Progress (4): 189 kB | 358/571 kB | 168 kB | 38 kB
Progress (4): 189 kB | 362/571 kB | 168 kB | 38 kB
Progress (4): 189 kB | 366/571 kB | 168 kB | 38 kB
Progress (4): 189 kB | 370/571 kB | 168 kB | 38 kB
Progress (4): 189 kB | 374/571 kB | 168 kB | 38 kB
Progress (4): 189 kB | 378/571 kB | 168 kB | 38 kB
Progress (4): 189 kB | 382/571 kB | 168 kB | 38 kB
Progress (4): 189 kB | 386/571 kB | 168 kB | 38 kB
Progress (4): 189 kB | 390/571 kB | 168 kB | 38 kB
Progress (4): 189 kB | 394/571 kB | 168 kB | 38 kB
Progress (4): 189 kB | 398/571 kB | 168 kB | 38 kB
Progress (4): 189 kB | 402/571 kB | 168 kB | 38 kB
Progress (4): 189 kB | 406/571 kB | 168 kB | 38 kB
Progress (4): 189 kB | 410/571 kB | 168 kB | 38 kB
Progress (4): 189 kB | 414/571 kB | 168 kB | 38 kB
Progress (4): 189 kB | 418/571 kB | 168 kB | 38 kB
Progress (4): 189 kB | 422/571 kB | 168 kB | 38 kB
Progress (4): 189 kB | 426/571 kB | 168 kB | 38 kB
Progress (4): 189 kB | 430/571 kB | 168 kB | 38 kB
Progress (4): 189 kB | 434/571 kB | 168 kB | 38 kB
                                                  
Downloaded from eclipse.maven.central.mirror: https://repo.eclipse.org/content/repositories/maven_central/commons-logging/commons-logging/1.0.4/commons-logging-1.0.4.jar (38 kB at 139 kB/s)
Progress (3): 189 kB | 438/571 kB | 168 kB
Progress (4): 189 kB | 438/571 kB | 168 kB | 4.1/65 kB
Progress (4): 189 kB | 442/571 kB | 168 kB | 4.1/65 kB
Progress (4): 189 kB | 442/571 kB | 168 kB | 7.7/65 kB
                                                      
Downloading from eclipse.maven.central.mirror: https://repo.eclipse.org/content/repositories/maven_central/xml-apis/xml-apis/1.0.b2/xml-apis-1.0.b2.jar
Progress (4): 189 kB | 442/571 kB | 168 kB | 12/65 kB
Progress (4): 189 kB | 446/571 kB | 168 kB | 12/65 kB
Progress (4): 189 kB | 446/571 kB | 168 kB | 16/65 kB
Progress (4): 189 kB | 450/571 kB | 168 kB | 16/65 kB
Progress (4): 189 kB | 450/571 kB | 168 kB | 20/65 kB
Progress (4): 189 kB | 454/571 kB | 168 kB | 20/65 kB
Progress (4): 189 kB | 454/571 kB | 168 kB | 24/65 kB
                                                     
Downloaded from eclipse.maven.central.mirror: https://repo.eclipse.org/content/repositories/maven_central/commons-digester/commons-digester/1.6/commons-digester-1.6.jar (168 kB at 610 kB/s)
Progress (3): 189 kB | 454/571 kB | 28/65 kB
Progress (3): 189 kB | 458/571 kB | 28/65 kB
Progress (3): 189 kB | 458/571 kB | 32/65 kB
                                            
Downloading from eclipse.maven.central.mirror: https://repo.eclipse.org/content/repositories/maven_central/org/jacoco/org.jacoco.agent/0.7.9/org.jacoco.agent-0.7.9-runtime.jar
Progress (3): 189 kB | 458/571 kB | 36/65 kB
Progress (3): 189 kB | 462/571 kB | 36/65 kB
Progress (3): 189 kB | 462/571 kB | 40/65 kB
Progress (3): 189 kB | 466/571 kB | 40/65 kB
Progress (3): 189 kB | 466/571 kB | 44/65 kB
Progress (3): 189 kB | 470/571 kB | 44/65 kB
Progress (3): 189 kB | 470/571 kB | 48/65 kB
Progress (3): 189 kB | 474/571 kB | 48/65 kB
Progress (3): 189 kB | 474/571 kB | 52/65 kB
Progress (3): 189 kB | 478/571 kB | 52/65 kB
Progress (3): 189 kB | 478/571 kB | 56/65 kB
Progress (3): 189 kB | 482/571 kB | 56/65 kB
Progress (3): 189 kB | 482/571 kB | 60/65 kB
Progress (3): 189 kB | 486/571 kB | 60/65 kB
Progress (3): 189 kB | 486/571 kB | 64/65 kB
Progress (3): 189 kB | 490/571 kB | 64/65 kB
Progress (3): 189 kB | 490/571 kB | 65 kB   
Progress (3): 189 kB | 494/571 kB | 65 kB
Progress (3): 189 kB | 498/571 kB | 65 kB
Progress (3): 189 kB | 502/571 kB | 65 kB
Progress (3): 189 kB | 506/571 kB | 65 kB
                                         
Downloaded from eclipse.maven.central.mirror: https://repo.eclipse.org/content/repositories/maven_central/commons-beanutils/commons-beanutils/1.7.0/commons-beanutils-1.7.0.jar (189 kB at 674 kB/s)
Progress (2): 510/571 kB | 65 kB
                                
Downloading from eclipse.maven.central.mirror: https://repo.eclipse.org/content/repositories/maven_central/org/jacoco/org.jacoco.core/0.7.9/org.jacoco.core-0.7.9.jar
Progress (2): 514/571 kB | 65 kB
Progress (2): 518/571 kB | 65 kB
Progress (2): 522/571 kB | 65 kB
Progress (2): 526/571 kB | 65 kB
Progress (2): 530/571 kB | 65 kB
Progress (2): 534/571 kB | 65 kB
Progress (2): 538/571 kB | 65 kB
Progress (2): 542/571 kB | 65 kB
Progress (2): 546/571 kB | 65 kB
Progress (2): 550/571 kB | 65 kB
Progress (2): 554/571 kB | 65 kB
Progress (2): 558/571 kB | 65 kB
Progress (2): 562/571 kB | 65 kB
Progress (2): 566/571 kB | 65 kB
Progress (2): 570/571 kB | 65 kB
Progress (2): 571 kB | 65 kB    
Progress (3): 571 kB | 65 kB | 4.1/109 kB
Progress (3): 571 kB | 65 kB | 7.7/109 kB
Progress (3): 571 kB | 65 kB | 12/109 kB 
Progress (3): 571 kB | 65 kB | 16/109 kB
Progress (3): 571 kB | 65 kB | 20/109 kB
Progress (3): 571 kB | 65 kB | 24/109 kB
Progress (3): 571 kB | 65 kB | 28/109 kB
Progress (3): 571 kB | 65 kB | 32/109 kB
Progress (3): 571 kB | 65 kB | 33/109 kB
                                        
Downloaded from eclipse.maven.central.mirror: https://repo.eclipse.org/content/repositories/maven_central/oro/oro/2.0.8/oro-2.0.8.jar (65 kB at 225 kB/s)
Progress (3): 571 kB | 33/109 kB | 4.1/259 kB
                                             
Downloading from eclipse.maven.central.mirror: https://repo.eclipse.org/content/repositories/maven_central/org/ow2/asm/asm-debug-all/5.2/asm-debug-all-5.2.jar
Progress (3): 571 kB | 33/109 kB | 7.7/259 kB
Progress (3): 571 kB | 37/109 kB | 7.7/259 kB
Progress (3): 571 kB | 37/109 kB | 12/259 kB 
Progress (3): 571 kB | 41/109 kB | 12/259 kB
Progress (3): 571 kB | 41/109 kB | 16/259 kB
Progress (3): 571 kB | 45/109 kB | 16/259 kB
Progress (3): 571 kB | 45/109 kB | 20/259 kB
Progress (3): 571 kB | 49/109 kB | 20/259 kB
Progress (3): 571 kB | 49/109 kB | 24/259 kB
Progress (3): 571 kB | 53/109 kB | 24/259 kB
Progress (3): 571 kB | 53/109 kB | 28/259 kB
Progress (3): 571 kB | 57/109 kB | 28/259 kB
Progress (3): 571 kB | 57/109 kB | 32/259 kB
Progress (3): 571 kB | 61/109 kB | 32/259 kB
Progress (3): 571 kB | 61/109 kB | 36/259 kB
Progress (3): 571 kB | 65/109 kB | 36/259 kB
Progress (3): 571 kB | 65/109 kB | 40/259 kB
Progress (3): 571 kB | 69/109 kB | 40/259 kB
Progress (3): 571 kB | 69/109 kB | 44/259 kB
Progress (3): 571 kB | 73/109 kB | 44/259 kB
Progress (3): 571 kB | 73/109 kB | 48/259 kB
Progress (3): 571 kB | 77/109 kB | 48/259 kB
Progress (3): 571 kB | 81/109 kB | 48/259 kB
Progress (3): 571 kB | 81/109 kB | 52/259 kB
Progress (3): 571 kB | 85/109 kB | 52/259 kB
Progress (3): 571 kB | 85/109 kB | 56/259 kB
                                            
Downloaded from eclipse.maven.central.mirror: https://repo.eclipse.org/content/repositories/maven_central/commons-collections/commons-collections/3.2/commons-collections-3.2.jar (571 kB at 1.9 MB/s)
Progress (2): 85/109 kB | 60/259 kB
Progress (2): 89/109 kB | 60/259 kB
Progress (2): 89/109 kB | 64/259 kB
                                   
Downloading from eclipse.maven.central.mirror: https://repo.eclipse.org/content/repositories/maven_central/org/jacoco/org.jacoco.report/0.7.9/org.jacoco.report-0.7.9.jar
Progress (2): 89/109 kB | 68/259 kB
Progress (2): 93/109 kB | 68/259 kB
Progress (2): 93/109 kB | 72/259 kB
Progress (2): 97/109 kB | 72/259 kB
Progress (3): 97/109 kB | 72/259 kB | 4.1/126 kB
Progress (3): 97/109 kB | 76/259 kB | 4.1/126 kB
Progress (3): 101/109 kB | 76/259 kB | 4.1/126 kB
Progress (3): 101/109 kB | 80/259 kB | 4.1/126 kB
Progress (3): 101/109 kB | 80/259 kB | 7.7/126 kB
Progress (3): 105/109 kB | 80/259 kB | 7.7/126 kB
Progress (3): 105/109 kB | 84/259 kB | 7.7/126 kB
Progress (3): 109/109 kB | 84/259 kB | 7.7/126 kB
Progress (3): 109/109 kB | 84/259 kB | 12/126 kB 
Progress (3): 109 kB | 84/259 kB | 12/126 kB    
Progress (3): 109 kB | 88/259 kB | 12/126 kB
Progress (3): 109 kB | 88/259 kB | 16/126 kB
Progress (3): 109 kB | 92/259 kB | 16/126 kB
Progress (3): 109 kB | 92/259 kB | 20/126 kB
Progress (3): 109 kB | 96/259 kB | 20/126 kB
Progress (3): 109 kB | 96/259 kB | 24/126 kB
Progress (3): 109 kB | 100/259 kB | 24/126 kB
Progress (3): 109 kB | 104/259 kB | 24/126 kB
Progress (3): 109 kB | 104/259 kB | 28/126 kB
Progress (3): 109 kB | 108/259 kB | 28/126 kB
Progress (3): 109 kB | 108/259 kB | 32/126 kB
Progress (3): 109 kB | 112/259 kB | 32/126 kB
Progress (3): 109 kB | 112/259 kB | 36/126 kB
Progress (3): 109 kB | 116/259 kB | 36/126 kB
Progress (3): 109 kB | 116/259 kB | 40/126 kB
Progress (3): 109 kB | 120/259 kB | 40/126 kB
Progress (3): 109 kB | 120/259 kB | 44/126 kB
Progress (3): 109 kB | 124/259 kB | 44/126 kB
Progress (3): 109 kB | 124/259 kB | 48/126 kB
Progress (3): 109 kB | 128/259 kB | 48/126 kB
Progress (3): 109 kB | 128/259 kB | 52/126 kB
Progress (3): 109 kB | 132/259 kB | 52/126 kB
Progress (3): 109 kB | 132/259 kB | 56/126 kB
Progress (3): 109 kB | 136/259 kB | 56/126 kB
Progress (3): 109 kB | 136/259 kB | 60/126 kB
Progress (3): 109 kB | 140/259 kB | 60/126 kB
Progress (3): 109 kB | 140/259 kB | 64/126 kB
Progress (3): 109 kB | 144/259 kB | 64/126 kB
Progress (3): 109 kB | 144/259 kB | 68/126 kB
Progress (3): 109 kB | 148/259 kB | 68/126 kB
Progress (3): 109 kB | 148/259 kB | 72/126 kB
Progress (3): 109 kB | 152/259 kB | 72/126 kB
Progress (4): 109 kB | 152/259 kB | 72/126 kB | 4.1/388 kB
Progress (4): 109 kB | 156/259 kB | 72/126 kB | 4.1/388 kB
Progress (4): 109 kB | 156/259 kB | 76/126 kB | 4.1/388 kB
Progress (4): 109 kB | 160/259 kB | 76/126 kB | 4.1/388 kB
Progress (4): 109 kB | 160/259 kB | 76/126 kB | 7.7/388 kB
Progress (4): 109 kB | 160/259 kB | 80/126 kB | 7.7/388 kB
Progress (4): 109 kB | 160/259 kB | 80/126 kB | 12/388 kB 
Progress (4): 109 kB | 164/259 kB | 80/126 kB | 12/388 kB
Progress (4): 109 kB | 164/259 kB | 84/126 kB | 12/388 kB
Progress (4): 109 kB | 164/259 kB | 84/126 kB | 16/388 kB
Progress (4): 109 kB | 164/259 kB | 88/126 kB | 16/388 kB
Progress (4): 109 kB | 168/259 kB | 88/126 kB | 16/388 kB
Progress (4): 109 kB | 168/259 kB | 88/126 kB | 20/388 kB
Progress (4): 109 kB | 168/259 kB | 92/126 kB | 20/388 kB
Progress (4): 109 kB | 168/259 kB | 92/126 kB | 24/388 kB
Progress (4): 109 kB | 172/259 kB | 92/126 kB | 24/388 kB
Progress (4): 109 kB | 172/259 kB | 96/126 kB | 24/388 kB
Progress (4): 109 kB | 176/259 kB | 96/126 kB | 24/388 kB
Progress (4): 109 kB | 176/259 kB | 96/126 kB | 28/388 kB
Progress (4): 109 kB | 180/259 kB | 96/126 kB | 28/388 kB
Progress (4): 109 kB | 180/259 kB | 100/126 kB | 28/388 kB
Progress (4): 109 kB | 184/259 kB | 100/126 kB | 28/388 kB
Progress (4): 109 kB | 184/259 kB | 100/126 kB | 32/388 kB
Progress (4): 109 kB | 184/259 kB | 104/126 kB | 32/388 kB
Progress (4): 109 kB | 184/259 kB | 104/126 kB | 33/388 kB
Progress (4): 109 kB | 188/259 kB | 104/126 kB | 33/388 kB
                                                          
Downloaded from eclipse.maven.central.mirror: https://repo.eclipse.org/content/repositories/maven_central/xml-apis/xml-apis/1.0.b2/xml-apis-1.0.b2.jar (109 kB at 361 kB/s)
Progress (3): 188/259 kB | 108/126 kB | 33/388 kB
Progress (3): 192/259 kB | 108/126 kB | 33/388 kB
Progress (3): 192/259 kB | 108/126 kB | 37/388 kB
Progress (3): 192/259 kB | 112/126 kB | 37/388 kB
Progress (3): 192/259 kB | 112/126 kB | 41/388 kB
Progress (3): 196/259 kB | 112/126 kB | 41/388 kB
Progress (3): 196/259 kB | 116/126 kB | 41/388 kB
Progress (3): 200/259 kB | 116/126 kB | 41/388 kB
Progress (3): 200/259 kB | 116/126 kB | 45/388 kB
Progress (3): 200/259 kB | 120/126 kB | 45/388 kB
Progress (3): 200/259 kB | 120/126 kB | 49/388 kB
Progress (3): 204/259 kB | 120/126 kB | 49/388 kB
Progress (3): 204/259 kB | 120/126 kB | 53/388 kB
Progress (3): 204/259 kB | 124/126 kB | 53/388 kB
Progress (3): 204/259 kB | 124/126 kB | 57/388 kB
Progress (3): 208/259 kB | 124/126 kB | 57/388 kB
Progress (3): 208/259 kB | 124/126 kB | 61/388 kB
Progress (3): 208/259 kB | 126 kB | 61/388 kB    
Progress (3): 212/259 kB | 126 kB | 61/388 kB
Progress (3): 212/259 kB | 126 kB | 65/388 kB
Progress (3): 216/259 kB | 126 kB | 65/388 kB
Progress (3): 216/259 kB | 126 kB | 66/388 kB
Progress (4): 216/259 kB | 126 kB | 66/388 kB | 4.1/128 kB
Progress (4): 220/259 kB | 126 kB | 66/388 kB | 4.1/128 kB
Progress (4): 220/259 kB | 126 kB | 66/388 kB | 7.7/128 kB
Progress (4): 220/259 kB | 126 kB | 70/388 kB | 7.7/128 kB
Progress (4): 224/259 kB | 126 kB | 70/388 kB | 7.7/128 kB
Progress (4): 224/259 kB | 126 kB | 70/388 kB | 12/128 kB 
Progress (4): 224/259 kB | 126 kB | 74/388 kB | 12/128 kB
Progress (4): 228/259 kB | 126 kB | 74/388 kB | 12/128 kB
Progress (4): 228/259 kB | 126 kB | 74/388 kB | 16/128 kB
Progress (4): 232/259 kB | 126 kB | 74/388 kB | 16/128 kB
Progress (4): 232/259 kB | 126 kB | 78/388 kB | 16/128 kB
Progress (4): 232/259 kB | 126 kB | 78/388 kB | 20/128 kB
Progress (4): 232/259 kB | 126 kB | 82/388 kB | 20/128 kB
Progress (4): 236/259 kB | 126 kB | 82/388 kB | 20/128 kB
Progress (4): 236/259 kB | 126 kB | 86/388 kB | 20/128 kB
Progress (4): 236/259 kB | 126 kB | 86/388 kB | 24/128 kB
Progress (4): 236/259 kB | 126 kB | 90/388 kB | 24/128 kB
Progress (4): 240/259 kB | 126 kB | 90/388 kB | 24/128 kB
Progress (4): 240/259 kB | 126 kB | 90/388 kB | 28/128 kB
Progress (4): 240/259 kB | 126 kB | 94/388 kB | 28/128 kB
Progress (4): 240/259 kB | 126 kB | 94/388 kB | 32/128 kB
Progress (4): 244/259 kB | 126 kB | 94/388 kB | 32/128 kB
Progress (4): 244/259 kB | 126 kB | 94/388 kB | 33/128 kB
Progress (4): 244/259 kB | 126 kB | 98/388 kB | 33/128 kB
Progress (4): 248/259 kB | 126 kB | 98/388 kB | 33/128 kB
Progress (4): 248/259 kB | 126 kB | 98/388 kB | 37/128 kB
Progress (4): 248/259 kB | 126 kB | 98/388 kB | 37/128 kB
Progress (4): 248/259 kB | 126 kB | 98/388 kB | 41/128 kB
Progress (4): 248/259 kB | 126 kB | 102/388 kB | 41/128 kB
Progress (4): 252/259 kB | 126 kB | 102/388 kB | 41/128 kB
Progress (4): 252/259 kB | 126 kB | 106/388 kB | 41/128 kB
Progress (4): 252/259 kB | 126 kB | 106/388 kB | 45/128 kB
Progress (4): 252/259 kB | 126 kB | 110/388 kB | 45/128 kB
Progress (4): 256/259 kB | 126 kB | 110/388 kB | 45/128 kB
Progress (4): 256/259 kB | 126 kB | 114/388 kB | 45/128 kB
Progress (4): 256/259 kB | 126 kB | 114/388 kB | 49/128 kB
Progress (4): 259 kB | 126 kB | 114/388 kB | 49/128 kB    
Progress (4): 259 kB | 126 kB | 118/388 kB | 49/128 kB
Progress (4): 259 kB | 126 kB | 118/388 kB | 53/128 kB
Progress (4): 259 kB | 126 kB | 122/388 kB | 53/128 kB
Progress (4): 259 kB | 126 kB | 122/388 kB | 57/128 kB
                                                      
Downloaded from eclipse.maven.central.mirror: https://repo.eclipse.org/content/repositories/maven_central/org/jacoco/org.jacoco.core/0.7.9/org.jacoco.core-0.7.9.jar (126 kB at 404 kB/s)
Progress (3): 259 kB | 122/388 kB | 61/128 kB
Progress (3): 259 kB | 126/388 kB | 61/128 kB
Progress (3): 259 kB | 126/388 kB | 65/128 kB
Progress (3): 259 kB | 130/388 kB | 65/128 kB
Progress (3): 259 kB | 130/388 kB | 66/128 kB
Progress (3): 259 kB | 131/388 kB | 66/128 kB
Progress (3): 259 kB | 131/388 kB | 70/128 kB
Progress (3): 259 kB | 135/388 kB | 70/128 kB
Progress (3): 259 kB | 135/388 kB | 74/128 kB
Progress (3): 259 kB | 139/388 kB | 74/128 kB
Progress (3): 259 kB | 139/388 kB | 78/128 kB
Progress (3): 259 kB | 143/388 kB | 78/128 kB
Progress (3): 259 kB | 143/388 kB | 82/128 kB
Progress (3): 259 kB | 147/388 kB | 82/128 kB
Progress (3): 259 kB | 147/388 kB | 86/128 kB
Progress (3): 259 kB | 151/388 kB | 86/128 kB
Progress (3): 259 kB | 151/388 kB | 90/128 kB
Progress (3): 259 kB | 155/388 kB | 90/128 kB
Progress (3): 259 kB | 155/388 kB | 94/128 kB
Progress (3): 259 kB | 159/388 kB | 94/128 kB
Progress (3): 259 kB | 159/388 kB | 98/128 kB
Progress (3): 259 kB | 163/388 kB | 98/128 kB
Progress (3): 259 kB | 164/388 kB | 98/128 kB
Progress (3): 259 kB | 164/388 kB | 102/128 kB
Progress (3): 259 kB | 168/388 kB | 102/128 kB
Progress (3): 259 kB | 168/388 kB | 106/128 kB
Progress (3): 259 kB | 172/388 kB | 106/128 kB
Progress (3): 259 kB | 172/388 kB | 110/128 kB
Progress (3): 259 kB | 176/388 kB | 110/128 kB
Progress (3): 259 kB | 176/388 kB | 114/128 kB
Progress (3): 259 kB | 180/388 kB | 114/128 kB
Progress (3): 259 kB | 180/388 kB | 118/128 kB
Progress (3): 259 kB | 184/388 kB | 118/128 kB
Progress (3): 259 kB | 184/388 kB | 122/128 kB
Progress (3): 259 kB | 188/388 kB | 122/128 kB
Progress (3): 259 kB | 188/388 kB | 126/128 kB
Progress (3): 259 kB | 192/388 kB | 126/128 kB
                                              
Downloaded from eclipse.maven.central.mirror: https://repo.eclipse.org/content/repositories/maven_central/org/jacoco/org.jacoco.agent/0.7.9/org.jacoco.agent-0.7.9-runtime.jar (259 kB at 821 kB/s)
Progress (2): 196/388 kB | 126/128 kB
Progress (2): 196/388 kB | 128 kB    
Progress (2): 197/388 kB | 128 kB
Progress (2): 201/388 kB | 128 kB
Progress (2): 205/388 kB | 128 kB
Progress (2): 209/388 kB | 128 kB
Progress (2): 213/388 kB | 128 kB
Progress (2): 217/388 kB | 128 kB
Progress (2): 221/388 kB | 128 kB
Progress (2): 225/388 kB | 128 kB
Progress (2): 229/388 kB | 128 kB
Progress (2): 233/388 kB | 128 kB
Progress (2): 237/388 kB | 128 kB
Progress (2): 241/388 kB | 128 kB
Progress (2): 245/388 kB | 128 kB
Progress (2): 249/388 kB | 128 kB
Progress (2): 253/388 kB | 128 kB
Progress (2): 257/388 kB | 128 kB
Progress (2): 261/388 kB | 128 kB
Progress (2): 265/388 kB | 128 kB
Progress (2): 269/388 kB | 128 kB
Progress (2): 273/388 kB | 128 kB
Progress (2): 277/388 kB | 128 kB
Progress (2): 281/388 kB | 128 kB
Progress (2): 285/388 kB | 128 kB
Progress (2): 289/388 kB | 128 kB
Progress (2): 293/388 kB | 128 kB
Progress (2): 297/388 kB | 128 kB
Progress (2): 301/388 kB | 128 kB
Progress (2): 305/388 kB | 128 kB
Progress (2): 309/388 kB | 128 kB
                                 
Downloaded from eclipse.maven.central.mirror: https://repo.eclipse.org/content/repositories/maven_central/org/jacoco/org.jacoco.report/0.7.9/org.jacoco.report-0.7.9.jar (128 kB at 401 kB/s)
Progress (1): 313/388 kB
Progress (1): 317/388 kB
Progress (1): 321/388 kB
Progress (1): 325/388 kB
Progress (1): 329/388 kB
Progress (1): 333/388 kB
Progress (1): 337/388 kB
Progress (1): 341/388 kB
Progress (1): 345/388 kB
Progress (1): 349/388 kB
Progress (1): 353/388 kB
Progress (1): 357/388 kB
Progress (1): 361/388 kB
Progress (1): 365/388 kB
Progress (1): 369/388 kB
Progress (1): 373/388 kB
Progress (1): 377/388 kB
Progress (1): 381/388 kB
Progress (1): 385/388 kB
Progress (1): 388 kB    
                    
Downloaded from eclipse.maven.central.mirror: https://repo.eclipse.org/content/repositories/maven_central/org/ow2/asm/asm-debug-all/5.2/asm-debug-all-5.2.jar (388 kB at 1.2 MB/s)
[INFO] failsafeArgline set to -javaagent:/home/hudson/genie.ecp/.jenkins/jobs/ecp-relaeseBranch-q7test/workspace/.repository/org/jacoco/org.jacoco.agent/0.7.9/org.jacoco.agent-0.7.9-runtime.jar=destfile=/jobs/genie.ecp/ecp-relaeseBranch-q7test/workspace/tests/ECPQ7Tests/target/jacoco-rcptt.exec
[INFO] 
[INFO] ------------------< org.eclipse.emf.ecp:q7-epp-tests >------------------
[INFO] Building q7-epp-tests 0.0.1-SNAPSHOT                               [2/7]
[INFO] --------------------------------[ pom ]---------------------------------
Downloading from rcptt-snapshots: https://repo.eclipse.org/content/repositories/rcptt-snapshots/org/codehaus/mojo/exec-maven-plugin/maven-metadata.xml
Downloading from rcptt-releases: https://repo.eclipse.org/content/repositories/rcptt-releases/org/codehaus/mojo/exec-maven-plugin/maven-metadata.xml
Downloading from eclipse.maven.central.mirror: https://repo.eclipse.org/content/repositories/maven_central/org/codehaus/mojo/exec-maven-plugin/maven-metadata.xml
Progress (1): 741 B
                   
Downloaded from eclipse.maven.central.mirror: https://repo.eclipse.org/content/repositories/maven_central/org/codehaus/mojo/exec-maven-plugin/maven-metadata.xml (741 B at 30 kB/s)
Downloading from rcptt-releases: https://repo.eclipse.org/content/repositories/rcptt-releases/org/codehaus/mojo/exec-maven-plugin/1.6.0/exec-maven-plugin-1.6.0.pom
Downloading from rcptt-snapshots: https://repo.eclipse.org/content/repositories/rcptt-snapshots/org/codehaus/mojo/exec-maven-plugin/1.6.0/exec-maven-plugin-1.6.0.pom
Downloading from eclipse.maven.central.mirror: https://repo.eclipse.org/content/repositories/maven_central/org/codehaus/mojo/exec-maven-plugin/1.6.0/exec-maven-plugin-1.6.0.pom
Progress (1): 4.1/13 kB
Progress (1): 7.7/13 kB
Progress (1): 12/13 kB 
Progress (1): 13 kB   
                   
Downloaded from eclipse.maven.central.mirror: https://repo.eclipse.org/content/repositories/maven_central/org/codehaus/mojo/exec-maven-plugin/1.6.0/exec-maven-plugin-1.6.0.pom (13 kB at 1.1 MB/s)
Downloading from rcptt-releases: https://repo.eclipse.org/content/repositories/rcptt-releases/org/codehaus/mojo/mojo-parent/40/mojo-parent-40.pom
Downloading from rcptt-snapshots: https://repo.eclipse.org/content/repositories/rcptt-snapshots/org/codehaus/mojo/mojo-parent/40/mojo-parent-40.pom
Downloading from eclipse.maven.central.mirror: https://repo.eclipse.org/content/repositories/maven_central/org/codehaus/mojo/mojo-parent/40/mojo-parent-40.pom
Progress (1): 4.1/34 kB
Progress (1): 7.7/34 kB
Progress (1): 12/34 kB 
Progress (1): 16/34 kB
Progress (1): 20/34 kB
Progress (1): 24/34 kB
Progress (1): 28/34 kB
Progress (1): 32/34 kB
Progress (1): 34 kB   
                   
Downloaded from eclipse.maven.central.mirror: https://repo.eclipse.org/content/repositories/maven_central/org/codehaus/mojo/mojo-parent/40/mojo-parent-40.pom (34 kB at 1.1 MB/s)
Downloading from rcptt-releases: https://repo.eclipse.org/content/repositories/rcptt-releases/org/codehaus/mojo/exec-maven-plugin/1.6.0/exec-maven-plugin-1.6.0.jar
Downloading from rcptt-snapshots: https://repo.eclipse.org/content/repositories/rcptt-snapshots/org/codehaus/mojo/exec-maven-plugin/1.6.0/exec-maven-plugin-1.6.0.jar
Downloading from eclipse.maven.central.mirror: https://repo.eclipse.org/content/repositories/maven_central/org/codehaus/mojo/exec-maven-plugin/1.6.0/exec-maven-plugin-1.6.0.jar
Progress (1): 4.1/58 kB
Progress (1): 7.7/58 kB
Progress (1): 12/58 kB 
Progress (1): 16/58 kB
Progress (1): 20/58 kB
Progress (1): 24/58 kB
Progress (1): 28/58 kB
Progress (1): 32/58 kB
Progress (1): 36/58 kB
Progress (1): 40/58 kB
Progress (1): 44/58 kB
Progress (1): 48/58 kB
Progress (1): 52/58 kB
Progress (1): 56/58 kB
Progress (1): 58 kB   
                   
Downloaded from eclipse.maven.central.mirror: https://repo.eclipse.org/content/repositories/maven_central/org/codehaus/mojo/exec-maven-plugin/1.6.0/exec-maven-plugin-1.6.0.jar (58 kB at 2.4 MB/s)
[INFO] 
[INFO] --- jacoco-maven-plugin:0.7.9:prepare-agent (init-agent-rcptt) @ q7-epp-tests ---
[INFO] failsafeArgline set to -javaagent:/home/hudson/genie.ecp/.jenkins/jobs/ecp-relaeseBranch-q7test/workspace/.repository/org/jacoco/org.jacoco.agent/0.7.9/org.jacoco.agent-0.7.9-runtime.jar=destfile=/jobs/genie.ecp/ecp-relaeseBranch-q7test/workspace/tests/ECPQ7Tests/EPPTests/target/jacoco-rcptt.exec
[INFO] 
[INFO] ------------< org.eclipse.emf.ecp:q7-epp-tests-updatesite >-------------
[INFO] Building q7-epp-tests-updatesite 0.0.1-SNAPSHOT                    [3/7]
[INFO] --------------------------------[ pom ]---------------------------------
[INFO] 
[INFO] --- jacoco-maven-plugin:0.7.9:prepare-agent (init-agent-rcptt) @ q7-epp-tests-updatesite ---
[INFO] failsafeArgline set to -javaagent:/home/hudson/genie.ecp/.jenkins/jobs/ecp-relaeseBranch-q7test/workspace/.repository/org/jacoco/org.jacoco.agent/0.7.9/org.jacoco.agent-0.7.9-runtime.jar=destfile=/jobs/genie.ecp/ecp-relaeseBranch-q7test/workspace/tests/ECPQ7Tests/EPPTests/update-site/target/jacoco-rcptt.exec
[INFO] 
[INFO] ----------------< org.eclipse.emf.ecp:q7tests-previous >----------------
[INFO] Building q7tests-previous 0.0.1-SNAPSHOT                           [4/7]
[INFO] -----------------------------[ rcpttTest ]------------------------------
Downloading from rcptt-releases: https://repo.eclipse.org/content/repositories/rcptt-releases/org/apache/maven/plugins/maven-install-plugin/maven-metadata.xml
Downloading from rcptt-snapshots: https://repo.eclipse.org/content/repositories/rcptt-snapshots/org/apache/maven/plugins/maven-install-plugin/maven-metadata.xml
Downloading from eclipse.maven.central.mirror: https://repo.eclipse.org/content/repositories/maven_central/org/apache/maven/plugins/maven-install-plugin/maven-metadata.xml
Progress (1): 663 B
                   
Downloaded from eclipse.maven.central.mirror: https://repo.eclipse.org/content/repositories/maven_central/org/apache/maven/plugins/maven-install-plugin/maven-metadata.xml (663 B at 9.2 kB/s)
Downloading from rcptt-releases: https://repo.eclipse.org/content/repositories/rcptt-releases/org/apache/maven/plugins/maven-install-plugin/3.0.0-M1/maven-install-plugin-3.0.0-M1.pom
Downloading from rcptt-snapshots: https://repo.eclipse.org/content/repositories/rcptt-snapshots/org/apache/maven/plugins/maven-install-plugin/3.0.0-M1/maven-install-plugin-3.0.0-M1.pom
Downloading from eclipse.maven.central.mirror: https://repo.eclipse.org/content/repositories/maven_central/org/apache/maven/plugins/maven-install-plugin/3.0.0-M1/maven-install-plugin-3.0.0-M1.pom
Progress (1): 4.1/6.2 kB
Progress (1): 6.2 kB    
                    
Downloaded from eclipse.maven.central.mirror: https://repo.eclipse.org/content/repositories/maven_central/org/apache/maven/plugins/maven-install-plugin/3.0.0-M1/maven-install-plugin-3.0.0-M1.pom (6.2 kB at 221 kB/s)
Downloading from rcptt-releases: https://repo.eclipse.org/content/repositories/rcptt-releases/org/apache/maven/plugins/maven-plugins/33/maven-plugins-33.pom
Downloading from rcptt-snapshots: https://repo.eclipse.org/content/repositories/rcptt-snapshots/org/apache/maven/plugins/maven-plugins/33/maven-plugins-33.pom
Downloading from eclipse.maven.central.mirror: https://repo.eclipse.org/content/repositories/maven_central/org/apache/maven/plugins/maven-plugins/33/maven-plugins-33.pom
Progress (1): 4.1/11 kB
Progress (1): 7.7/11 kB
Progress (1): 11 kB    
                   
Downloaded from eclipse.maven.central.mirror: https://repo.eclipse.org/content/repositories/maven_central/org/apache/maven/plugins/maven-plugins/33/maven-plugins-33.pom (11 kB at 445 kB/s)
Downloading from rcptt-releases: https://repo.eclipse.org/content/repositories/rcptt-releases/org/apache/maven/maven-parent/33/maven-parent-33.pom
Downloading from rcptt-snapshots: https://repo.eclipse.org/content/repositories/rcptt-snapshots/org/apache/maven/maven-parent/33/maven-parent-33.pom
Downloading from eclipse.maven.central.mirror: https://repo.eclipse.org/content/repositories/maven_central/org/apache/maven/maven-parent/33/maven-parent-33.pom
Progress (1): 4.1/44 kB
Progress (1): 7.7/44 kB
Progress (1): 12/44 kB 
Progress (1): 16/44 kB
Progress (1): 20/44 kB
Progress (1): 24/44 kB
Progress (1): 28/44 kB
Progress (1): 32/44 kB
Progress (1): 36/44 kB
Progress (1): 40/44 kB
Progress (1): 44/44 kB
Progress (1): 44 kB   
                   
Downloaded from eclipse.maven.central.mirror: https://repo.eclipse.org/content/repositories/maven_central/org/apache/maven/maven-parent/33/maven-parent-33.pom (44 kB at 1.5 MB/s)
Downloading from rcptt-releases: https://repo.eclipse.org/content/repositories/rcptt-releases/org/apache/apache/21/apache-21.pom
Downloading from rcptt-snapshots: https://repo.eclipse.org/content/repositories/rcptt-snapshots/org/apache/apache/21/apache-21.pom
Downloading from eclipse.maven.central.mirror: https://repo.eclipse.org/content/repositories/maven_central/org/apache/apache/21/apache-21.pom
Progress (1): 4.1/17 kB
Progress (1): 7.7/17 kB
Progress (1): 12/17 kB 
Progress (1): 16/17 kB
Progress (1): 17 kB   
                   
Downloaded from eclipse.maven.central.mirror: https://repo.eclipse.org/content/repositories/maven_central/org/apache/apache/21/apache-21.pom (17 kB at 428 kB/s)
Downloading from rcptt-releases: https://repo.eclipse.org/content/repositories/rcptt-releases/org/apache/maven/plugins/maven-install-plugin/3.0.0-M1/maven-install-plugin-3.0.0-M1.jar
Downloading from rcptt-snapshots: https://repo.eclipse.org/content/repositories/rcptt-snapshots/org/apache/maven/plugins/maven-install-plugin/3.0.0-M1/maven-install-plugin-3.0.0-M1.jar
Downloading from eclipse.maven.central.mirror: https://repo.eclipse.org/content/repositories/maven_central/org/apache/maven/plugins/maven-install-plugin/3.0.0-M1/maven-install-plugin-3.0.0-M1.jar
Progress (1): 4.1/29 kB
Progress (1): 7.7/29 kB
Progress (1): 12/29 kB 
Progress (1): 16/29 kB
Progress (1): 20/29 kB
Progress (1): 24/29 kB
Progress (1): 28/29 kB
Progress (1): 29 kB   
                   
Downloaded from eclipse.maven.central.mirror: https://repo.eclipse.org/content/repositories/maven_central/org/apache/maven/plugins/maven-install-plugin/3.0.0-M1/maven-install-plugin-3.0.0-M1.jar (29 kB at 1.2 MB/s)
Downloading from rcptt-snapshots: https://repo.eclipse.org/content/repositories/rcptt-snapshots/org/apache/maven/plugins/maven-deploy-plugin/maven-metadata.xml
Downloading from eclipse.maven.central.mirror: https://repo.eclipse.org/content/repositories/maven_central/org/apache/maven/plugins/maven-deploy-plugin/maven-metadata.xml
Downloading from rcptt-releases: https://repo.eclipse.org/content/repositories/rcptt-releases/org/apache/maven/plugins/maven-deploy-plugin/maven-metadata.xml
Progress (1): 749 B
                   
Downloaded from eclipse.maven.central.mirror: https://repo.eclipse.org/content/repositories/maven_central/org/apache/maven/plugins/maven-deploy-plugin/maven-metadata.xml (749 B at 12 kB/s)
Downloading from rcptt-releases: https://repo.eclipse.org/content/repositories/rcptt-releases/org/apache/maven/plugins/maven-deploy-plugin/3.0.0-M1/maven-deploy-plugin-3.0.0-M1.pom
Downloading from rcptt-snapshots: https://repo.eclipse.org/content/repositories/rcptt-snapshots/org/apache/maven/plugins/maven-deploy-plugin/3.0.0-M1/maven-deploy-plugin-3.0.0-M1.pom
Downloading from eclipse.maven.central.mirror: https://repo.eclipse.org/content/repositories/maven_central/org/apache/maven/plugins/maven-deploy-plugin/3.0.0-M1/maven-deploy-plugin-3.0.0-M1.pom
Progress (1): 4.1/7.8 kB
Progress (1): 7.7/7.8 kB
Progress (1): 7.8 kB    
                    
Downloaded from eclipse.maven.central.mirror: https://repo.eclipse.org/content/repositories/maven_central/org/apache/maven/plugins/maven-deploy-plugin/3.0.0-M1/maven-deploy-plugin-3.0.0-M1.pom (7.8 kB at 230 kB/s)
Downloading from rcptt-releases: https://repo.eclipse.org/content/repositories/rcptt-releases/org/apache/maven/plugins/maven-deploy-plugin/3.0.0-M1/maven-deploy-plugin-3.0.0-M1.jar
Downloading from rcptt-snapshots: https://repo.eclipse.org/content/repositories/rcptt-snapshots/org/apache/maven/plugins/maven-deploy-plugin/3.0.0-M1/maven-deploy-plugin-3.0.0-M1.jar
Downloading from eclipse.maven.central.mirror: https://repo.eclipse.org/content/repositories/maven_central/org/apache/maven/plugins/maven-deploy-plugin/3.0.0-M1/maven-deploy-plugin-3.0.0-M1.jar
Progress (1): 4.1/34 kB
Progress (1): 7.7/34 kB
Progress (1): 12/34 kB 
Progress (1): 16/34 kB
Progress (1): 20/34 kB
Progress (1): 24/34 kB
Progress (1): 28/34 kB
Progress (1): 32/34 kB
Progress (1): 34 kB   
                   
Downloaded from eclipse.maven.central.mirror: https://repo.eclipse.org/content/repositories/maven_central/org/apache/maven/plugins/maven-deploy-plugin/3.0.0-M1/maven-deploy-plugin-3.0.0-M1.jar (34 kB at 1.3 MB/s)
[INFO] 
[INFO] --- exec-maven-plugin:1.6.0:exec (Download Eclipses) @ q7tests-previous ---
Downloading from rcptt-releases: https://repo.eclipse.org/content/repositories/rcptt-releases/org/apache/maven/maven-toolchain/2.2.1/maven-toolchain-2.2.1.pom
Downloading from rcptt-snapshots: https://repo.eclipse.org/content/repositories/rcptt-snapshots/org/apache/maven/maven-toolchain/2.2.1/maven-toolchain-2.2.1.pom
Downloading from eclipse.maven.central.mirror: https://repo.eclipse.org/content/repositories/maven_central/org/apache/maven/maven-toolchain/2.2.1/maven-toolchain-2.2.1.pom
Progress (1): 3.3 kB
                    
Downloaded from eclipse.maven.central.mirror: https://repo.eclipse.org/content/repositories/maven_central/org/apache/maven/maven-toolchain/2.2.1/maven-toolchain-2.2.1.pom (3.3 kB at 101 kB/s)
Downloading from rcptt-releases: https://repo.eclipse.org/content/repositories/rcptt-releases/org/apache/maven/maven-core/2.2.1/maven-core-2.2.1.pom
Downloading from rcptt-snapshots: https://repo.eclipse.org/content/repositories/rcptt-snapshots/org/apache/maven/maven-core/2.2.1/maven-core-2.2.1.pom
Downloading from eclipse.maven.central.mirror: https://repo.eclipse.org/content/repositories/maven_central/org/apache/maven/maven-core/2.2.1/maven-core-2.2.1.pom
Progress (1): 4.1/12 kB
Progress (1): 7.7/12 kB
Progress (1): 12 kB    
                   
Downloaded from eclipse.maven.central.mirror: https://repo.eclipse.org/content/repositories/maven_central/org/apache/maven/maven-core/2.2.1/maven-core-2.2.1.pom (12 kB at 401 kB/s)
Downloading from rcptt-releases: https://repo.eclipse.org/content/repositories/rcptt-releases/junit/junit/4.12/junit-4.12.pom
Downloading from rcptt-snapshots: https://repo.eclipse.org/content/repositories/rcptt-snapshots/junit/junit/4.12/junit-4.12.pom
Downloading from eclipse.maven.central.mirror: https://repo.eclipse.org/content/repositories/maven_central/junit/junit/4.12/junit-4.12.pom
Progress (1): 4.1/24 kB
Progress (1): 7.7/24 kB
Progress (1): 12/24 kB 
Progress (1): 16/24 kB
Progress (1): 20/24 kB
Progress (1): 24/24 kB
Progress (1): 24 kB   
                   
Downloaded from eclipse.maven.central.mirror: https://repo.eclipse.org/content/repositories/maven_central/junit/junit/4.12/junit-4.12.pom (24 kB at 249 kB/s)
Downloading from rcptt-releases: https://repo.eclipse.org/content/repositories/rcptt-releases/org/hamcrest/hamcrest-core/1.3/hamcrest-core-1.3.pom
Downloading from rcptt-snapshots: https://repo.eclipse.org/content/repositories/rcptt-snapshots/org/hamcrest/hamcrest-core/1.3/hamcrest-core-1.3.pom
Downloading from eclipse.maven.central.mirror: https://repo.eclipse.org/content/repositories/maven_central/org/hamcrest/hamcrest-core/1.3/hamcrest-core-1.3.pom
Progress (1): 766 B
                   
Downloaded from eclipse.maven.central.mirror: https://repo.eclipse.org/content/repositories/maven_central/org/hamcrest/hamcrest-core/1.3/hamcrest-core-1.3.pom (766 B at 26 kB/s)
Downloading from rcptt-releases: https://repo.eclipse.org/content/repositories/rcptt-releases/org/hamcrest/hamcrest-parent/1.3/hamcrest-parent-1.3.pom
Downloading from rcptt-snapshots: https://repo.eclipse.org/content/repositories/rcptt-snapshots/org/hamcrest/hamcrest-parent/1.3/hamcrest-parent-1.3.pom
Downloading from eclipse.maven.central.mirror: https://repo.eclipse.org/content/repositories/maven_central/org/hamcrest/hamcrest-parent/1.3/hamcrest-parent-1.3.pom
Progress (1): 2.0 kB
                    
Downloaded from eclipse.maven.central.mirror: https://repo.eclipse.org/content/repositories/maven_central/org/hamcrest/hamcrest-parent/1.3/hamcrest-parent-1.3.pom (2.0 kB at 66 kB/s)
Downloading from rcptt-releases: https://repo.eclipse.org/content/repositories/rcptt-releases/org/apache/maven/maven-plugin-parameter-documenter/2.2.1/maven-plugin-parameter-documenter-2.2.1.pom
Downloading from rcptt-snapshots: https://repo.eclipse.org/content/repositories/rcptt-snapshots/org/apache/maven/maven-plugin-parameter-documenter/2.2.1/maven-plugin-parameter-documenter-2.2.1.pom
Downloading from eclipse.maven.central.mirror: https://repo.eclipse.org/content/repositories/maven_central/org/apache/maven/maven-plugin-parameter-documenter/2.2.1/maven-plugin-parameter-documenter-2.2.1.pom
Progress (1): 2.0 kB
                    
Downloaded from eclipse.maven.central.mirror: https://repo.eclipse.org/content/repositories/maven_central/org/apache/maven/maven-plugin-parameter-documenter/2.2.1/maven-plugin-parameter-documenter-2.2.1.pom (2.0 kB at 59 kB/s)
Downloading from rcptt-releases: https://repo.eclipse.org/content/repositories/rcptt-releases/org/slf4j/slf4j-jdk14/1.5.6/slf4j-jdk14-1.5.6.pom
Downloading from rcptt-snapshots: https://repo.eclipse.org/content/repositories/rcptt-snapshots/org/slf4j/slf4j-jdk14/1.5.6/slf4j-jdk14-1.5.6.pom
Downloading from eclipse.maven.central.mirror: https://repo.eclipse.org/content/repositories/maven_central/org/slf4j/slf4j-jdk14/1.5.6/slf4j-jdk14-1.5.6.pom
Progress (1): 1.9 kB
                    
Downloaded from eclipse.maven.central.mirror: https://repo.eclipse.org/content/repositories/maven_central/org/slf4j/slf4j-jdk14/1.5.6/slf4j-jdk14-1.5.6.pom (1.9 kB at 65 kB/s)
Downloading from rcptt-releases: https://repo.eclipse.org/content/repositories/rcptt-releases/org/slf4j/slf4j-parent/1.5.6/slf4j-parent-1.5.6.pom
Downloading from rcptt-snapshots: https://repo.eclipse.org/content/repositories/rcptt-snapshots/org/slf4j/slf4j-parent/1.5.6/slf4j-parent-1.5.6.pom
Downloading from eclipse.maven.central.mirror: https://repo.eclipse.org/content/repositories/maven_central/org/slf4j/slf4j-parent/1.5.6/slf4j-parent-1.5.6.pom
Progress (1): 4.1/7.9 kB
Progress (1): 7.7/7.9 kB
Progress (1): 7.9 kB    
                    
Downloaded from eclipse.maven.central.mirror: https://repo.eclipse.org/content/repositories/maven_central/org/slf4j/slf4j-parent/1.5.6/slf4j-parent-1.5.6.pom (7.9 kB at 273 kB/s)
Downloading from rcptt-releases: https://repo.eclipse.org/content/repositories/rcptt-releases/org/slf4j/slf4j-api/1.5.6/slf4j-api-1.5.6.pom
Downloading from rcptt-snapshots: https://repo.eclipse.org/content/repositories/rcptt-snapshots/org/slf4j/slf4j-api/1.5.6/slf4j-api-1.5.6.pom
Downloading from eclipse.maven.central.mirror: https://repo.eclipse.org/content/repositories/maven_central/org/slf4j/slf4j-api/1.5.6/slf4j-api-1.5.6.pom
Progress (1): 3.0 kB
                    
Downloaded from eclipse.maven.central.mirror: https://repo.eclipse.org/content/repositories/maven_central/org/slf4j/slf4j-api/1.5.6/slf4j-api-1.5.6.pom (3.0 kB at 103 kB/s)
Downloading from rcptt-releases: https://repo.eclipse.org/content/repositories/rcptt-releases/org/slf4j/jcl-over-slf4j/1.5.6/jcl-over-slf4j-1.5.6.pom
Downloading from rcptt-snapshots: https://repo.eclipse.org/content/repositories/rcptt-snapshots/org/slf4j/jcl-over-slf4j/1.5.6/jcl-over-slf4j-1.5.6.pom
Downloading from eclipse.maven.central.mirror: https://repo.eclipse.org/content/repositories/maven_central/org/slf4j/jcl-over-slf4j/1.5.6/jcl-over-slf4j-1.5.6.pom
Progress (1): 2.2 kB
                    
Downloaded from eclipse.maven.central.mirror: https://repo.eclipse.org/content/repositories/maven_central/org/slf4j/jcl-over-slf4j/1.5.6/jcl-over-slf4j-1.5.6.pom (2.2 kB at 80 kB/s)
Downloading from rcptt-releases: https://repo.eclipse.org/content/repositories/rcptt-releases/org/apache/maven/maven-error-diagnostics/2.2.1/maven-error-diagnostics-2.2.1.pom
Downloading from rcptt-snapshots: https://repo.eclipse.org/content/repositories/rcptt-snapshots/org/apache/maven/maven-error-diagnostics/2.2.1/maven-error-diagnostics-2.2.1.pom
Downloading from eclipse.maven.central.mirror: https://repo.eclipse.org/content/repositories/maven_central/org/apache/maven/maven-error-diagnostics/2.2.1/maven-error-diagnostics-2.2.1.pom
Progress (1): 1.7 kB
                    
Downloaded from eclipse.maven.central.mirror: https://repo.eclipse.org/content/repositories/maven_central/org/apache/maven/maven-error-diagnostics/2.2.1/maven-error-diagnostics-2.2.1.pom (1.7 kB at 61 kB/s)
Downloading from rcptt-releases: https://repo.eclipse.org/content/repositories/rcptt-releases/commons-cli/commons-cli/1.2/commons-cli-1.2.pom
Downloading from rcptt-snapshots: https://repo.eclipse.org/content/repositories/rcptt-snapshots/commons-cli/commons-cli/1.2/commons-cli-1.2.pom
Downloading from eclipse.maven.central.mirror: https://repo.eclipse.org/content/repositories/maven_central/commons-cli/commons-cli/1.2/commons-cli-1.2.pom
Progress (1): 4.1/8.0 kB
Progress (1): 7.7/8.0 kB
Progress (1): 8.0 kB    
                    
Downloaded from eclipse.maven.central.mirror: https://repo.eclipse.org/content/repositories/maven_central/commons-cli/commons-cli/1.2/commons-cli-1.2.pom (8.0 kB at 275 kB/s)
Downloading from rcptt-releases: https://repo.eclipse.org/content/repositories/rcptt-releases/org/apache/commons/commons-parent/11/commons-parent-11.pom
Downloading from rcptt-snapshots: https://repo.eclipse.org/content/repositories/rcptt-snapshots/org/apache/commons/commons-parent/11/commons-parent-11.pom
Downloading from eclipse.maven.central.mirror: https://repo.eclipse.org/content/repositories/maven_central/org/apache/commons/commons-parent/11/commons-parent-11.pom
Progress (1): 4.1/25 kB
Progress (1): 7.7/25 kB
Progress (1): 12/25 kB 
Progress (1): 16/25 kB
Progress (1): 20/25 kB
Progress (1): 24/25 kB
Progress (1): 25 kB   
                   
Downloaded from eclipse.maven.central.mirror: https://repo.eclipse.org/content/repositories/maven_central/org/apache/commons/commons-parent/11/commons-parent-11.pom (25 kB at 666 kB/s)
Downloading from rcptt-releases: https://repo.eclipse.org/content/repositories/rcptt-releases/org/apache/maven/maven-plugin-api/3.0/maven-plugin-api-3.0.pom
Downloading from rcptt-snapshots: https://repo.eclipse.org/content/repositories/rcptt-snapshots/org/apache/maven/maven-plugin-api/3.0/maven-plugin-api-3.0.pom
Downloading from eclipse.maven.central.mirror: https://repo.eclipse.org/content/repositories/maven_central/org/apache/maven/maven-plugin-api/3.0/maven-plugin-api-3.0.pom
Progress (1): 2.3 kB
                    
Downloaded from eclipse.maven.central.mirror: https://repo.eclipse.org/content/repositories/maven_central/org/apache/maven/maven-plugin-api/3.0/maven-plugin-api-3.0.pom (2.3 kB at 82 kB/s)
Downloading from rcptt-releases: https://repo.eclipse.org/content/repositories/rcptt-releases/org/apache/maven/maven/3.0/maven-3.0.pom
Downloading from rcptt-snapshots: https://repo.eclipse.org/content/repositories/rcptt-snapshots/org/apache/maven/maven/3.0/maven-3.0.pom
Downloading from eclipse.maven.central.mirror: https://repo.eclipse.org/content/repositories/maven_central/org/apache/maven/maven/3.0/maven-3.0.pom
Progress (1): 4.1/22 kB
Progress (1): 7.7/22 kB
Progress (1): 12/22 kB 
Progress (1): 16/22 kB
Progress (1): 20/22 kB
Progress (1): 22 kB   
                   
Downloaded from eclipse.maven.central.mirror: https://repo.eclipse.org/content/repositories/maven_central/org/apache/maven/maven/3.0/maven-3.0.pom (22 kB at 561 kB/s)
Downloading from rcptt-releases: https://repo.eclipse.org/content/repositories/rcptt-releases/org/apache/maven/maven-model/3.0/maven-model-3.0.pom
Downloading from rcptt-snapshots: https://repo.eclipse.org/content/repositories/rcptt-snapshots/org/apache/maven/maven-model/3.0/maven-model-3.0.pom
Downloading from eclipse.maven.central.mirror: https://repo.eclipse.org/content/repositories/maven_central/org/apache/maven/maven-model/3.0/maven-model-3.0.pom
Progress (1): 3.9 kB
                    
Downloaded from eclipse.maven.central.mirror: https://repo.eclipse.org/content/repositories/maven_central/org/apache/maven/maven-model/3.0/maven-model-3.0.pom (3.9 kB at 130 kB/s)
Downloading from rcptt-releases: https://repo.eclipse.org/content/repositories/rcptt-releases/org/codehaus/plexus/plexus-utils/2.0.4/plexus-utils-2.0.4.pom
Downloading from rcptt-snapshots: https://repo.eclipse.org/content/repositories/rcptt-snapshots/org/codehaus/plexus/plexus-utils/2.0.4/plexus-utils-2.0.4.pom
Downloading from eclipse.maven.central.mirror: https://repo.eclipse.org/content/repositories/maven_central/org/codehaus/plexus/plexus-utils/2.0.4/plexus-utils-2.0.4.pom
Progress (1): 3.3 kB
                    
Downloaded from eclipse.maven.central.mirror: https://repo.eclipse.org/content/repositories/maven_central/org/codehaus/plexus/plexus-utils/2.0.4/plexus-utils-2.0.4.pom (3.3 kB at 111 kB/s)
Downloading from rcptt-releases: https://repo.eclipse.org/content/repositories/rcptt-releases/org/apache/maven/maven-artifact/3.0/maven-artifact-3.0.pom
Downloading from rcptt-snapshots: https://repo.eclipse.org/content/repositories/rcptt-snapshots/org/apache/maven/maven-artifact/3.0/maven-artifact-3.0.pom
Downloading from eclipse.maven.central.mirror: https://repo.eclipse.org/content/repositories/maven_central/org/apache/maven/maven-artifact/3.0/maven-artifact-3.0.pom
Progress (1): 1.9 kB
                    
Downloaded from eclipse.maven.central.mirror: https://repo.eclipse.org/content/repositories/maven_central/org/apache/maven/maven-artifact/3.0/maven-artifact-3.0.pom (1.9 kB at 64 kB/s)
Downloading from rcptt-releases: https://repo.eclipse.org/content/repositories/rcptt-releases/org/sonatype/sisu/sisu-inject-plexus/1.4.2/sisu-inject-plexus-1.4.2.pom
Downloading from rcptt-snapshots: https://repo.eclipse.org/content/repositories/rcptt-snapshots/org/sonatype/sisu/sisu-inject-plexus/1.4.2/sisu-inject-plexus-1.4.2.pom
Downloading from eclipse.maven.central.mirror: https://repo.eclipse.org/content/repositories/maven_central/org/sonatype/sisu/sisu-inject-plexus/1.4.2/sisu-inject-plexus-1.4.2.pom
Progress (1): 4.1/5.4 kB
Progress (1): 5.4 kB    
                    
Downloaded from eclipse.maven.central.mirror: https://repo.eclipse.org/content/repositories/maven_central/org/sonatype/sisu/sisu-inject-plexus/1.4.2/sisu-inject-plexus-1.4.2.pom (5.4 kB at 199 kB/s)
Downloading from rcptt-releases: https://repo.eclipse.org/content/repositories/rcptt-releases/org/sonatype/sisu/inject/guice-plexus/1.4.2/guice-plexus-1.4.2.pom
Downloading from rcptt-snapshots: https://repo.eclipse.org/content/repositories/rcptt-snapshots/org/sonatype/sisu/inject/guice-plexus/1.4.2/guice-plexus-1.4.2.pom
Downloading from eclipse.maven.central.mirror: https://repo.eclipse.org/content/repositories/maven_central/org/sonatype/sisu/inject/guice-plexus/1.4.2/guice-plexus-1.4.2.pom
Progress (1): 3.1 kB
                    
Downloaded from eclipse.maven.central.mirror: https://repo.eclipse.org/content/repositories/maven_central/org/sonatype/sisu/inject/guice-plexus/1.4.2/guice-plexus-1.4.2.pom (3.1 kB at 104 kB/s)
Downloading from rcptt-releases: https://repo.eclipse.org/content/repositories/rcptt-releases/org/sonatype/sisu/inject/guice-bean/1.4.2/guice-bean-1.4.2.pom
Downloading from rcptt-snapshots: https://repo.eclipse.org/content/repositories/rcptt-snapshots/org/sonatype/sisu/inject/guice-bean/1.4.2/guice-bean-1.4.2.pom
Downloading from eclipse.maven.central.mirror: https://repo.eclipse.org/content/repositories/maven_central/org/sonatype/sisu/inject/guice-bean/1.4.2/guice-bean-1.4.2.pom
Progress (1): 2.6 kB
                    
Downloaded from eclipse.maven.central.mirror: https://repo.eclipse.org/content/repositories/maven_central/org/sonatype/sisu/inject/guice-bean/1.4.2/guice-bean-1.4.2.pom (2.6 kB at 97 kB/s)
Downloading from rcptt-releases: https://repo.eclipse.org/content/repositories/rcptt-releases/org/sonatype/sisu/sisu-inject/1.4.2/sisu-inject-1.4.2.pom
Downloading from rcptt-snapshots: https://repo.eclipse.org/content/repositories/rcptt-snapshots/org/sonatype/sisu/sisu-inject/1.4.2/sisu-inject-1.4.2.pom
Downloading from eclipse.maven.central.mirror: https://repo.eclipse.org/content/repositories/maven_central/org/sonatype/sisu/sisu-inject/1.4.2/sisu-inject-1.4.2.pom
Progress (1): 1.2 kB
                    
Downloaded from eclipse.maven.central.mirror: https://repo.eclipse.org/content/repositories/maven_central/org/sonatype/sisu/sisu-inject/1.4.2/sisu-inject-1.4.2.pom (1.2 kB at 39 kB/s)
Downloading from rcptt-releases: https://repo.eclipse.org/content/repositories/rcptt-releases/org/sonatype/sisu/sisu-parent/1.4.2/sisu-parent-1.4.2.pom
Downloading from rcptt-snapshots: https://repo.eclipse.org/content/repositories/rcptt-snapshots/org/sonatype/sisu/sisu-parent/1.4.2/sisu-parent-1.4.2.pom
Downloading from eclipse.maven.central.mirror: https://repo.eclipse.org/content/repositories/maven_central/org/sonatype/sisu/sisu-parent/1.4.2/sisu-parent-1.4.2.pom
Progress (1): 4.1/7.8 kB
Progress (1): 7.7/7.8 kB
Progress (1): 7.8 kB    
                    
Downloaded from eclipse.maven.central.mirror: https://repo.eclipse.org/content/repositories/maven_central/org/sonatype/sisu/sisu-parent/1.4.2/sisu-parent-1.4.2.pom (7.8 kB at 251 kB/s)
Downloading from rcptt-releases: https://repo.eclipse.org/content/repositories/rcptt-releases/org/sonatype/forge/forge-parent/6/forge-parent-6.pom
Downloading from rcptt-snapshots: https://repo.eclipse.org/content/repositories/rcptt-snapshots/org/sonatype/forge/forge-parent/6/forge-parent-6.pom
Downloading from eclipse.maven.central.mirror: https://repo.eclipse.org/content/repositories/maven_central/org/sonatype/forge/forge-parent/6/forge-parent-6.pom
Progress (1): 4.1/11 kB
Progress (1): 7.7/11 kB
Progress (1): 11 kB    
                   
Downloaded from eclipse.maven.central.mirror: https://repo.eclipse.org/content/repositories/maven_central/org/sonatype/forge/forge-parent/6/forge-parent-6.pom (11 kB at 398 kB/s)
Downloading from rcptt-releases: https://repo.eclipse.org/content/repositories/rcptt-releases/org/codehaus/plexus/plexus-component-annotations/1.5.4/plexus-component-annotations-1.5.4.pom
Downloading from rcptt-snapshots: https://repo.eclipse.org/content/repositories/rcptt-snapshots/org/codehaus/plexus/plexus-component-annotations/1.5.4/plexus-component-annotations-1.5.4.pom
Downloading from eclipse.maven.central.mirror: https://repo.eclipse.org/content/repositories/maven_central/org/codehaus/plexus/plexus-component-annotations/1.5.4/plexus-component-annotations-1.5.4.pom
Progress (1): 815 B
                   
Downloaded from eclipse.maven.central.mirror: https://repo.eclipse.org/content/repositories/maven_central/org/codehaus/plexus/plexus-component-annotations/1.5.4/plexus-component-annotations-1.5.4.pom (815 B at 25 kB/s)
Downloading from rcptt-releases: https://repo.eclipse.org/content/repositories/rcptt-releases/org/codehaus/plexus/plexus-containers/1.5.4/plexus-containers-1.5.4.pom
Downloading from rcptt-snapshots: https://repo.eclipse.org/content/repositories/rcptt-snapshots/org/codehaus/plexus/plexus-containers/1.5.4/plexus-containers-1.5.4.pom
Downloading from eclipse.maven.central.mirror: https://repo.eclipse.org/content/repositories/maven_central/org/codehaus/plexus/plexus-containers/1.5.4/plexus-containers-1.5.4.pom
Progress (1): 4.1/4.2 kB
Progress (1): 4.2 kB    
                    
Downloaded from eclipse.maven.central.mirror: https://repo.eclipse.org/content/repositories/maven_central/org/codehaus/plexus/plexus-containers/1.5.4/plexus-containers-1.5.4.pom (4.2 kB at 137 kB/s)
Downloading from rcptt-releases: https://repo.eclipse.org/content/repositories/rcptt-releases/org/codehaus/plexus/plexus/2.0.5/plexus-2.0.5.pom
Downloading from rcptt-snapshots: https://repo.eclipse.org/content/repositories/rcptt-snapshots/org/codehaus/plexus/plexus/2.0.5/plexus-2.0.5.pom
Downloading from eclipse.maven.central.mirror: https://repo.eclipse.org/content/repositories/maven_central/org/codehaus/plexus/plexus/2.0.5/plexus-2.0.5.pom
Progress (1): 4.1/17 kB
Progress (1): 7.7/17 kB
Progress (1): 12/17 kB 
Progress (1): 16/17 kB
Progress (1): 17 kB   
                   
Downloaded from eclipse.maven.central.mirror: https://repo.eclipse.org/content/repositories/maven_central/org/codehaus/plexus/plexus/2.0.5/plexus-2.0.5.pom (17 kB at 482 kB/s)
Downloading from rcptt-releases: https://repo.eclipse.org/content/repositories/rcptt-releases/org/codehaus/plexus/plexus-classworlds/2.2.3/plexus-classworlds-2.2.3.pom
Downloading from rcptt-snapshots: https://repo.eclipse.org/content/repositories/rcptt-snapshots/org/codehaus/plexus/plexus-classworlds/2.2.3/plexus-classworlds-2.2.3.pom
Downloading from eclipse.maven.central.mirror: https://repo.eclipse.org/content/repositories/maven_central/org/codehaus/plexus/plexus-classworlds/2.2.3/plexus-classworlds-2.2.3.pom
Progress (1): 4.0 kB
                    
Downloaded from eclipse.maven.central.mirror: https://repo.eclipse.org/content/repositories/maven_central/org/codehaus/plexus/plexus-classworlds/2.2.3/plexus-classworlds-2.2.3.pom (4.0 kB at 148 kB/s)
Downloading from rcptt-releases: https://repo.eclipse.org/content/repositories/rcptt-releases/org/sonatype/sisu/sisu-inject-bean/1.4.2/sisu-inject-bean-1.4.2.pom
Downloading from rcptt-snapshots: https://repo.eclipse.org/content/repositories/rcptt-snapshots/org/sonatype/sisu/sisu-inject-bean/1.4.2/sisu-inject-bean-1.4.2.pom
Downloading from eclipse.maven.central.mirror: https://repo.eclipse.org/content/repositories/maven_central/org/sonatype/sisu/sisu-inject-bean/1.4.2/sisu-inject-bean-1.4.2.pom
Progress (1): 4.1/5.5 kB
Progress (1): 5.5 kB    
                    
Downloaded from eclipse.maven.central.mirror: https://repo.eclipse.org/content/repositories/maven_central/org/sonatype/sisu/sisu-inject-bean/1.4.2/sisu-inject-bean-1.4.2.pom (5.5 kB at 171 kB/s)
Downloading from rcptt-releases: https://repo.eclipse.org/content/repositories/rcptt-releases/org/sonatype/sisu/sisu-guice/2.1.7/sisu-guice-2.1.7.pom
Downloading from rcptt-snapshots: https://repo.eclipse.org/content/repositories/rcptt-snapshots/org/sonatype/sisu/sisu-guice/2.1.7/sisu-guice-2.1.7.pom
Downloading from eclipse.maven.central.mirror: https://repo.eclipse.org/content/repositories/maven_central/org/sonatype/sisu/sisu-guice/2.1.7/sisu-guice-2.1.7.pom
Progress (1): 4.1/11 kB
Progress (1): 7.7/11 kB
Progress (1): 11 kB    
                   
Downloaded from eclipse.maven.central.mirror: https://repo.eclipse.org/content/repositories/maven_central/org/sonatype/sisu/sisu-guice/2.1.7/sisu-guice-2.1.7.pom (11 kB at 381 kB/s)
Downloading from rcptt-releases: https://repo.eclipse.org/content/repositories/rcptt-releases/org/apache/maven/maven-plugin-descriptor/2.2.1/maven-plugin-descriptor-2.2.1.pom
Downloading from rcptt-snapshots: https://repo.eclipse.org/content/repositories/rcptt-snapshots/org/apache/maven/maven-plugin-descriptor/2.2.1/maven-plugin-descriptor-2.2.1.pom
Downloading from eclipse.maven.central.mirror: https://repo.eclipse.org/content/repositories/maven_central/org/apache/maven/maven-plugin-descriptor/2.2.1/maven-plugin-descriptor-2.2.1.pom
Progress (1): 2.1 kB
                    
Downloaded from eclipse.maven.central.mirror: https://repo.eclipse.org/content/repositories/maven_central/org/apache/maven/maven-plugin-descriptor/2.2.1/maven-plugin-descriptor-2.2.1.pom (2.1 kB at 94 kB/s)
Downloading from rcptt-releases: https://repo.eclipse.org/content/repositories/rcptt-releases/org/codehaus/plexus/plexus-interactivity-api/1.0-alpha-4/plexus-interactivity-api-1.0-alpha-4.pom
Downloading from rcptt-snapshots: https://repo.eclipse.org/content/repositories/rcptt-snapshots/org/codehaus/plexus/plexus-interactivity-api/1.0-alpha-4/plexus-interactivity-api-1.0-alpha-4.pom
Downloading from eclipse.maven.central.mirror: https://repo.eclipse.org/content/repositories/maven_central/org/codehaus/plexus/plexus-interactivity-api/1.0-alpha-4/plexus-interactivity-api-1.0-alpha-4.pom
Progress (1): 4.1/7.1 kB
Progress (1): 7.1 kB    
                    
Downloaded from eclipse.maven.central.mirror: https://repo.eclipse.org/content/repositories/maven_central/org/codehaus/plexus/plexus-interactivity-api/1.0-alpha-4/plexus-interactivity-api-1.0-alpha-4.pom (7.1 kB at 236 kB/s)
Downloading from rcptt-releases: https://repo.eclipse.org/content/repositories/rcptt-releases/org/apache/maven/maven-monitor/2.2.1/maven-monitor-2.2.1.pom
Downloading from rcptt-snapshots: https://repo.eclipse.org/content/repositories/rcptt-snapshots/org/apache/maven/maven-monitor/2.2.1/maven-monitor-2.2.1.pom
Downloading from eclipse.maven.central.mirror: https://repo.eclipse.org/content/repositories/maven_central/org/apache/maven/maven-monitor/2.2.1/maven-monitor-2.2.1.pom
Progress (1): 1.3 kB
                    
Downloaded from eclipse.maven.central.mirror: https://repo.eclipse.org/content/repositories/maven_central/org/apache/maven/maven-monitor/2.2.1/maven-monitor-2.2.1.pom (1.3 kB at 43 kB/s)
Downloading from rcptt-releases: https://repo.eclipse.org/content/repositories/rcptt-releases/classworlds/classworlds/1.1/classworlds-1.1.pom
Downloading from rcptt-snapshots: https://repo.eclipse.org/content/repositories/rcptt-snapshots/classworlds/classworlds/1.1/classworlds-1.1.pom
Downloading from eclipse.maven.central.mirror: https://repo.eclipse.org/content/repositories/maven_central/classworlds/classworlds/1.1/classworlds-1.1.pom
Progress (1): 3.3 kB
                    
Downloaded from eclipse.maven.central.mirror: https://repo.eclipse.org/content/repositories/maven_central/classworlds/classworlds/1.1/classworlds-1.1.pom (3.3 kB at 77 kB/s)
Downloading from rcptt-releases: https://repo.eclipse.org/content/repositories/rcptt-releases/org/sonatype/plexus/plexus-sec-dispatcher/1.3/plexus-sec-dispatcher-1.3.pom
Downloading from rcptt-snapshots: https://repo.eclipse.org/content/repositories/rcptt-snapshots/org/sonatype/plexus/plexus-sec-dispatcher/1.3/plexus-sec-dispatcher-1.3.pom
Downloading from eclipse.maven.central.mirror: https://repo.eclipse.org/content/repositories/maven_central/org/sonatype/plexus/plexus-sec-dispatcher/1.3/plexus-sec-dispatcher-1.3.pom
Progress (1): 3.0 kB
                    
Downloaded from eclipse.maven.central.mirror: https://repo.eclipse.org/content/repositories/maven_central/org/sonatype/plexus/plexus-sec-dispatcher/1.3/plexus-sec-dispatcher-1.3.pom (3.0 kB at 93 kB/s)
Downloading from rcptt-releases: https://repo.eclipse.org/content/repositories/rcptt-releases/org/codehaus/plexus/plexus-utils/3.0.20/plexus-utils-3.0.20.pom
Downloading from rcptt-snapshots: https://repo.eclipse.org/content/repositories/rcptt-snapshots/org/codehaus/plexus/plexus-utils/3.0.20/plexus-utils-3.0.20.pom
Downloading from eclipse.maven.central.mirror: https://repo.eclipse.org/content/repositories/maven_central/org/codehaus/plexus/plexus-utils/3.0.20/plexus-utils-3.0.20.pom
Progress (1): 3.8 kB
                    
Downloaded from eclipse.maven.central.mirror: https://repo.eclipse.org/content/repositories/maven_central/org/codehaus/plexus/plexus-utils/3.0.20/plexus-utils-3.0.20.pom (3.8 kB at 136 kB/s)
Downloading from rcptt-releases: https://repo.eclipse.org/content/repositories/rcptt-releases/org/apache/commons/commons-exec/1.3/commons-exec-1.3.pom
Downloading from rcptt-snapshots: https://repo.eclipse.org/content/repositories/rcptt-snapshots/org/apache/commons/commons-exec/1.3/commons-exec-1.3.pom
Downloading from eclipse.maven.central.mirror: https://repo.eclipse.org/content/repositories/maven_central/org/apache/commons/commons-exec/1.3/commons-exec-1.3.pom
Progress (1): 4.1/11 kB
Progress (1): 7.7/11 kB
Progress (1): 11 kB    
                   
Downloaded from eclipse.maven.central.mirror: https://repo.eclipse.org/content/repositories/maven_central/org/apache/commons/commons-exec/1.3/commons-exec-1.3.pom (11 kB at 344 kB/s)
Downloading from rcptt-releases: https://repo.eclipse.org/content/repositories/rcptt-releases/org/apache/commons/commons-parent/35/commons-parent-35.pom
Downloading from rcptt-snapshots: https://repo.eclipse.org/content/repositories/rcptt-snapshots/org/apache/commons/commons-parent/35/commons-parent-35.pom
Downloading from eclipse.maven.central.mirror: https://repo.eclipse.org/content/repositories/maven_central/org/apache/commons/commons-parent/35/commons-parent-35.pom
Progress (1): 4.1/58 kB
Progress (1): 7.7/58 kB
Progress (1): 12/58 kB 
Progress (1): 16/58 kB
Progress (1): 20/58 kB
Progress (1): 24/58 kB
Progress (1): 28/58 kB
Progress (1): 32/58 kB
Progress (1): 36/58 kB
Progress (1): 40/58 kB
Progress (1): 44/58 kB
Progress (1): 48/58 kB
Progress (1): 52/58 kB
Progress (1): 56/58 kB
Progress (1): 58 kB   
                   
Downloaded from eclipse.maven.central.mirror: https://repo.eclipse.org/content/repositories/maven_central/org/apache/commons/commons-parent/35/commons-parent-35.pom (58 kB at 1.9 MB/s)
Downloading from rcptt-releases: https://repo.eclipse.org/content/repositories/rcptt-releases/org/apache/apache/15/apache-15.pom
Downloading from rcptt-snapshots: https://repo.eclipse.org/content/repositories/rcptt-snapshots/org/apache/apache/15/apache-15.pom
Downloading from eclipse.maven.central.mirror: https://repo.eclipse.org/content/repositories/maven_central/org/apache/apache/15/apache-15.pom
Progress (1): 4.1/15 kB
Progress (1): 7.7/15 kB
Progress (1): 12/15 kB 
Progress (1): 15 kB   
                   
Downloaded from eclipse.maven.central.mirror: https://repo.eclipse.org/content/repositories/maven_central/org/apache/apache/15/apache-15.pom (15 kB at 544 kB/s)
Downloading from rcptt-releases: https://repo.eclipse.org/content/repositories/rcptt-releases/org/apache/maven/maven-toolchain/2.2.1/maven-toolchain-2.2.1.jar
Downloading from rcptt-releases: https://repo.eclipse.org/content/repositories/rcptt-releases/org/apache/maven/maven-plugin-parameter-documenter/2.2.1/maven-plugin-parameter-documenter-2.2.1.jar
Downloading from rcptt-releases: https://repo.eclipse.org/content/repositories/rcptt-releases/org/slf4j/slf4j-api/1.5.6/slf4j-api-1.5.6.jar
Downloading from rcptt-releases: https://repo.eclipse.org/content/repositories/rcptt-releases/org/slf4j/slf4j-jdk14/1.5.6/slf4j-jdk14-1.5.6.jar
Downloading from rcptt-releases: https://repo.eclipse.org/content/repositories/rcptt-releases/org/apache/maven/maven-core/2.2.1/maven-core-2.2.1.jar
Downloading from rcptt-releases: https://repo.eclipse.org/content/repositories/rcptt-releases/org/slf4j/jcl-over-slf4j/1.5.6/jcl-over-slf4j-1.5.6.jar
Downloading from rcptt-releases: https://repo.eclipse.org/content/repositories/rcptt-releases/org/apache/maven/maven-error-diagnostics/2.2.1/maven-error-diagnostics-2.2.1.jar
Downloading from rcptt-releases: https://repo.eclipse.org/content/repositories/rcptt-releases/commons-cli/commons-cli/1.2/commons-cli-1.2.jar
Downloading from rcptt-releases: https://repo.eclipse.org/content/repositories/rcptt-releases/org/apache/maven/maven-plugin-descriptor/2.2.1/maven-plugin-descriptor-2.2.1.jar
Downloading from rcptt-releases: https://repo.eclipse.org/content/repositories/rcptt-releases/org/codehaus/plexus/plexus-interactivity-api/1.0-alpha-4/plexus-interactivity-api-1.0-alpha-4.jar
Downloading from rcptt-releases: https://repo.eclipse.org/content/repositories/rcptt-releases/org/apache/maven/maven-monitor/2.2.1/maven-monitor-2.2.1.jar
Downloading from rcptt-releases: https://repo.eclipse.org/content/repositories/rcptt-releases/classworlds/classworlds/1.1/classworlds-1.1.jar
Downloading from rcptt-releases: https://repo.eclipse.org/content/repositories/rcptt-releases/org/sonatype/plexus/plexus-sec-dispatcher/1.3/plexus-sec-dispatcher-1.3.jar
Downloading from rcptt-releases: https://repo.eclipse.org/content/repositories/rcptt-releases/org/codehaus/plexus/plexus-utils/3.0.20/plexus-utils-3.0.20.jar
Downloading from rcptt-releases: https://repo.eclipse.org/content/repositories/rcptt-releases/org/apache/commons/commons-exec/1.3/commons-exec-1.3.jar
Downloading from rcptt-snapshots: https://repo.eclipse.org/content/repositories/rcptt-snapshots/org/apache/maven/maven-toolchain/2.2.1/maven-toolchain-2.2.1.jar
Downloading from rcptt-snapshots: https://repo.eclipse.org/content/repositories/rcptt-snapshots/org/apache/maven/maven-core/2.2.1/maven-core-2.2.1.jar
Downloading from rcptt-snapshots: https://repo.eclipse.org/content/repositories/rcptt-snapshots/org/apache/maven/maven-plugin-parameter-documenter/2.2.1/maven-plugin-parameter-documenter-2.2.1.jar
Downloading from rcptt-snapshots: https://repo.eclipse.org/content/repositories/rcptt-snapshots/org/slf4j/slf4j-api/1.5.6/slf4j-api-1.5.6.jar
Downloading from rcptt-snapshots: https://repo.eclipse.org/content/repositories/rcptt-snapshots/org/slf4j/slf4j-jdk14/1.5.6/slf4j-jdk14-1.5.6.jar
Downloading from rcptt-snapshots: https://repo.eclipse.org/content/repositories/rcptt-snapshots/org/slf4j/jcl-over-slf4j/1.5.6/jcl-over-slf4j-1.5.6.jar
Downloading from rcptt-snapshots: https://repo.eclipse.org/content/repositories/rcptt-snapshots/org/apache/maven/maven-error-diagnostics/2.2.1/maven-error-diagnostics-2.2.1.jar
Downloading from rcptt-snapshots: https://repo.eclipse.org/content/repositories/rcptt-snapshots/commons-cli/commons-cli/1.2/commons-cli-1.2.jar
Downloading from rcptt-snapshots: https://repo.eclipse.org/content/repositories/rcptt-snapshots/org/apache/maven/maven-plugin-descriptor/2.2.1/maven-plugin-descriptor-2.2.1.jar
Downloading from rcptt-snapshots: https://repo.eclipse.org/content/repositories/rcptt-snapshots/org/codehaus/plexus/plexus-interactivity-api/1.0-alpha-4/plexus-interactivity-api-1.0-alpha-4.jar
Downloading from rcptt-snapshots: https://repo.eclipse.org/content/repositories/rcptt-snapshots/org/apache/maven/maven-monitor/2.2.1/maven-monitor-2.2.1.jar
Downloading from rcptt-snapshots: https://repo.eclipse.org/content/repositories/rcptt-snapshots/classworlds/classworlds/1.1/classworlds-1.1.jar
Downloading from rcptt-snapshots: https://repo.eclipse.org/content/repositories/rcptt-snapshots/org/sonatype/plexus/plexus-sec-dispatcher/1.3/plexus-sec-dispatcher-1.3.jar
Downloading from rcptt-snapshots: https://repo.eclipse.org/content/repositories/rcptt-snapshots/org/codehaus/plexus/plexus-utils/3.0.20/plexus-utils-3.0.20.jar
Downloading from rcptt-snapshots: https://repo.eclipse.org/content/repositories/rcptt-snapshots/org/apache/commons/commons-exec/1.3/commons-exec-1.3.jar
Downloading from eclipse.maven.central.mirror: https://repo.eclipse.org/content/repositories/maven_central/org/apache/maven/maven-toolchain/2.2.1/maven-toolchain-2.2.1.jar
Downloading from eclipse.maven.central.mirror: https://repo.eclipse.org/content/repositories/maven_central/org/apache/maven/maven-plugin-parameter-documenter/2.2.1/maven-plugin-parameter-documenter-2.2.1.jar
Downloading from eclipse.maven.central.mirror: https://repo.eclipse.org/content/repositories/maven_central/org/slf4j/slf4j-api/1.5.6/slf4j-api-1.5.6.jar
Downloading from eclipse.maven.central.mirror: https://repo.eclipse.org/content/repositories/maven_central/org/slf4j/slf4j-jdk14/1.5.6/slf4j-jdk14-1.5.6.jar
Downloading from eclipse.maven.central.mirror: https://repo.eclipse.org/content/repositories/maven_central/org/apache/maven/maven-core/2.2.1/maven-core-2.2.1.jar
Progress (1): 4.1/22 kB
Progress (2): 4.1/22 kB | 4.1/8.8 kB
Progress (2): 7.7/22 kB | 4.1/8.8 kB
Progress (2): 7.7/22 kB | 7.7/8.8 kB
Progress (2): 12/22 kB | 7.7/8.8 kB 
Progress (2): 12/22 kB | 8.8 kB    
Progress (2): 16/22 kB | 8.8 kB
Progress (3): 16/22 kB | 8.8 kB | 4.1/22 kB
Progress (3): 20/22 kB | 8.8 kB | 4.1/22 kB
Progress (3): 20/22 kB | 8.8 kB | 7.7/22 kB
Progress (3): 22 kB | 8.8 kB | 7.7/22 kB   
Progress (3): 22 kB | 8.8 kB | 12/22 kB 
Progress (3): 22 kB | 8.8 kB | 16/22 kB
Progress (3): 22 kB | 8.8 kB | 20/22 kB
Progress (3): 22 kB | 8.8 kB | 22 kB   
Progress (4): 22 kB | 8.8 kB | 22 kB | 4.1/38 kB
Progress (4): 22 kB | 8.8 kB | 22 kB | 7.7/38 kB
Progress (4): 22 kB | 8.8 kB | 22 kB | 12/38 kB 
Progress (4): 22 kB | 8.8 kB | 22 kB | 16/38 kB
Progress (4): 22 kB | 8.8 kB | 22 kB | 20/38 kB
Progress (4): 22 kB | 8.8 kB | 22 kB | 24/38 kB
Progress (4): 22 kB | 8.8 kB | 22 kB | 28/38 kB
Progress (4): 22 kB | 8.8 kB | 22 kB | 32/38 kB
Progress (4): 22 kB | 8.8 kB | 22 kB | 36/38 kB
Progress (4): 22 kB | 8.8 kB | 22 kB | 38 kB   
Progress (5): 22 kB | 8.8 kB | 22 kB | 38 kB | 4.1/178 kB
Progress (5): 22 kB | 8.8 kB | 22 kB | 38 kB | 7.7/178 kB
Progress (5): 22 kB | 8.8 kB | 22 kB | 38 kB | 12/178 kB 
Progress (5): 22 kB | 8.8 kB | 22 kB | 38 kB | 16/178 kB
Progress (5): 22 kB | 8.8 kB | 22 kB | 38 kB | 20/178 kB
Progress (5): 22 kB | 8.8 kB | 22 kB | 38 kB | 24/178 kB
                                                        
Downloaded from eclipse.maven.central.mirror: https://repo.eclipse.org/content/repositories/maven_central/org/apache/maven/maven-plugin-parameter-documenter/2.2.1/maven-plugin-parameter-documenter-2.2.1.jar (22 kB at 694 kB/s)
Progress (4): 8.8 kB | 22 kB | 38 kB | 28/178 kB
                                                
Downloading from eclipse.maven.central.mirror: https://repo.eclipse.org/content/repositories/maven_central/org/slf4j/jcl-over-slf4j/1.5.6/jcl-over-slf4j-1.5.6.jar
Progress (4): 8.8 kB | 22 kB | 38 kB | 32/178 kB
Progress (4): 8.8 kB | 22 kB | 38 kB | 36/178 kB
                                                
Downloaded from eclipse.maven.central.mirror: https://repo.eclipse.org/content/repositories/maven_central/org/slf4j/slf4j-api/1.5.6/slf4j-api-1.5.6.jar (22 kB at 657 kB/s)
Downloaded from eclipse.maven.central.mirror: https://repo.eclipse.org/content/repositories/maven_central/org/slf4j/slf4j-jdk14/1.5.6/slf4j-jdk14-1.5.6.jar (8.8 kB at 259 kB/s)
Progress (2): 38 kB | 40/178 kB
                               
Downloading from eclipse.maven.central.mirror: https://repo.eclipse.org/content/repositories/maven_central/commons-cli/commons-cli/1.2/commons-cli-1.2.jar
Downloaded from eclipse.maven.central.mirror: https://repo.eclipse.org/content/repositories/maven_central/org/apache/maven/maven-toolchain/2.2.1/maven-toolchain-2.2.1.jar (38 kB at 1.1 MB/s)
Downloading from eclipse.maven.central.mirror: https://repo.eclipse.org/content/repositories/maven_central/org/apache/maven/maven-plugin-descriptor/2.2.1/maven-plugin-descriptor-2.2.1.jar
Downloading from eclipse.maven.central.mirror: https://repo.eclipse.org/content/repositories/maven_central/org/apache/maven/maven-error-diagnostics/2.2.1/maven-error-diagnostics-2.2.1.jar
Progress (1): 44/178 kB
Progress (1): 48/178 kB
Progress (1): 52/178 kB
Progress (1): 56/178 kB
Progress (1): 60/178 kB
Progress (1): 64/178 kB
Progress (1): 68/178 kB
Progress (1): 72/178 kB
Progress (1): 76/178 kB
Progress (1): 80/178 kB
Progress (1): 84/178 kB
Progress (1): 88/178 kB
Progress (1): 92/178 kB
Progress (1): 96/178 kB
Progress (1): 100/178 kB
Progress (1): 104/178 kB
Progress (1): 108/178 kB
Progress (1): 112/178 kB
Progress (1): 116/178 kB
Progress (1): 120/178 kB
Progress (1): 124/178 kB
Progress (1): 128/178 kB
Progress (1): 132/178 kB
Progress (1): 136/178 kB
Progress (1): 140/178 kB
Progress (1): 144/178 kB
Progress (1): 148/178 kB
Progress (1): 152/178 kB
Progress (1): 156/178 kB
Progress (1): 160/178 kB
Progress (2): 160/178 kB | 4.1/17 kB
Progress (2): 164/178 kB | 4.1/17 kB
Progress (2): 164/178 kB | 7.7/17 kB
Progress (2): 168/178 kB | 7.7/17 kB
Progress (2): 168/178 kB | 12/17 kB 
Progress (2): 172/178 kB | 12/17 kB
Progress (2): 172/178 kB | 16/17 kB
Progress (2): 176/178 kB | 16/17 kB
Progress (2): 176/178 kB | 17 kB   
Progress (2): 178 kB | 17 kB    
Progress (3): 178 kB | 17 kB | 4.1/39 kB
Progress (3): 178 kB | 17 kB | 7.7/39 kB
Progress (3): 178 kB | 17 kB | 12/39 kB 
Progress (3): 178 kB | 17 kB | 16/39 kB
Progress (3): 178 kB | 17 kB | 20/39 kB
Progress (3): 178 kB | 17 kB | 24/39 kB
Progress (3): 178 kB | 17 kB | 28/39 kB
Progress (3): 178 kB | 17 kB | 32/39 kB
Progress (4): 178 kB | 17 kB | 32/39 kB | 4.1/41 kB
Progress (4): 178 kB | 17 kB | 32/39 kB | 7.7/41 kB
                                                   
Downloaded from eclipse.maven.central.mirror: https://repo.eclipse.org/content/repositories/maven_central/org/slf4j/jcl-over-slf4j/1.5.6/jcl-over-slf4j-1.5.6.jar (17 kB at 380 kB/s)
Progress (4): 178 kB | 32/39 kB | 7.7/41 kB | 4.1/13 kB
Progress (4): 178 kB | 32/39 kB | 12/41 kB | 4.1/13 kB 
Progress (4): 178 kB | 36/39 kB | 12/41 kB | 4.1/13 kB
Progress (4): 178 kB | 36/39 kB | 16/41 kB | 4.1/13 kB
Progress (4): 178 kB | 36/39 kB | 16/41 kB | 7.7/13 kB
                                                      
Downloading from eclipse.maven.central.mirror: https://repo.eclipse.org/content/repositories/maven_central/org/codehaus/plexus/plexus-interactivity-api/1.0-alpha-4/plexus-interactivity-api-1.0-alpha-4.jar
Progress (4): 178 kB | 36/39 kB | 16/41 kB | 12/13 kB
Progress (4): 178 kB | 36/39 kB | 20/41 kB | 12/13 kB
                                                     
Downloaded from eclipse.maven.central.mirror: https://repo.eclipse.org/content/repositories/maven_central/org/apache/maven/maven-core/2.2.1/maven-core-2.2.1.jar (178 kB at 3.8 MB/s)
Downloading from eclipse.maven.central.mirror: https://repo.eclipse.org/content/repositories/maven_central/org/apache/maven/maven-monitor/2.2.1/maven-monitor-2.2.1.jar
Progress (3): 39 kB | 20/41 kB | 12/13 kB
Progress (3): 39 kB | 24/41 kB | 12/13 kB
Progress (3): 39 kB | 24/41 kB | 13 kB   
Progress (3): 39 kB | 28/41 kB | 13 kB
Progress (3): 39 kB | 32/41 kB | 13 kB
Progress (3): 39 kB | 36/41 kB | 13 kB
Progress (3): 39 kB | 40/41 kB | 13 kB
Progress (3): 39 kB | 41 kB | 13 kB   
                                   
Downloaded from eclipse.maven.central.mirror: https://repo.eclipse.org/content/repositories/maven_central/org/apache/maven/maven-plugin-descriptor/2.2.1/maven-plugin-descriptor-2.2.1.jar (39 kB at 755 kB/s)
Downloading from eclipse.maven.central.mirror: https://repo.eclipse.org/content/repositories/maven_central/classworlds/classworlds/1.1/classworlds-1.1.jar
Downloaded from eclipse.maven.central.mirror: https://repo.eclipse.org/content/repositories/maven_central/org/apache/maven/maven-error-diagnostics/2.2.1/maven-error-diagnostics-2.2.1.jar (13 kB at 246 kB/s)
Downloaded from eclipse.maven.central.mirror: https://repo.eclipse.org/content/repositories/maven_central/commons-cli/commons-cli/1.2/commons-cli-1.2.jar (41 kB at 762 kB/s)
Progress (1): 4.1/13 kB
                       
Downloading from eclipse.maven.central.mirror: https://repo.eclipse.org/content/repositories/maven_central/org/sonatype/plexus/plexus-sec-dispatcher/1.3/plexus-sec-dispatcher-1.3.jar
Progress (1): 7.7/13 kB
                       
Downloading from eclipse.maven.central.mirror: https://repo.eclipse.org/content/repositories/maven_central/org/codehaus/plexus/plexus-utils/3.0.20/plexus-utils-3.0.20.jar
Progress (2): 7.7/13 kB | 4.1/10 kB
Progress (2): 12/13 kB | 4.1/10 kB 
Progress (2): 12/13 kB | 7.7/10 kB
Progress (2): 13 kB | 7.7/10 kB   
Progress (2): 13 kB | 10 kB    
                           
Downloaded from eclipse.maven.central.mirror: https://repo.eclipse.org/content/repositories/maven_central/org/codehaus/plexus/plexus-interactivity-api/1.0-alpha-4/plexus-interactivity-api-1.0-alpha-4.jar (13 kB at 220 kB/s)
Downloading from eclipse.maven.central.mirror: https://repo.eclipse.org/content/repositories/maven_central/org/apache/commons/commons-exec/1.3/commons-exec-1.3.jar
Progress (2): 10 kB | 4.1/38 kB
Progress (2): 10 kB | 7.7/38 kB
                               
Downloaded from eclipse.maven.central.mirror: https://repo.eclipse.org/content/repositories/maven_central/org/apache/maven/maven-monitor/2.2.1/maven-monitor-2.2.1.jar (10 kB at 169 kB/s)
Progress (1): 12/38 kB
Progress (1): 16/38 kB
Progress (2): 16/38 kB | 4.1/243 kB
Progress (2): 20/38 kB | 4.1/243 kB
Progress (2): 20/38 kB | 7.7/243 kB
Progress (2): 24/38 kB | 7.7/243 kB
Progress (2): 24/38 kB | 12/243 kB 
Progress (2): 28/38 kB | 12/243 kB
Progress (3): 28/38 kB | 12/243 kB | 4.1/29 kB
Progress (3): 32/38 kB | 12/243 kB | 4.1/29 kB
Progress (3): 32/38 kB | 16/243 kB | 4.1/29 kB
Progress (3): 32/38 kB | 16/243 kB | 7.7/29 kB
Progress (3): 36/38 kB | 16/243 kB | 7.7/29 kB
Progress (3): 36/38 kB | 20/243 kB | 7.7/29 kB
Progress (3): 36/38 kB | 20/243 kB | 12/29 kB 
Progress (3): 38 kB | 20/243 kB | 12/29 kB   
Progress (3): 38 kB | 20/243 kB | 16/29 kB
Progress (3): 38 kB | 24/243 kB | 16/29 kB
Progress (3): 38 kB | 28/243 kB | 16/29 kB
Progress (3): 38 kB | 28/243 kB | 20/29 kB
Progress (3): 38 kB | 32/243 kB | 20/29 kB
Progress (3): 38 kB | 32/243 kB | 24/29 kB
Progress (3): 38 kB | 33/243 kB | 24/29 kB
Progress (3): 38 kB | 33/243 kB | 28/29 kB
Progress (3): 38 kB | 33/243 kB | 29 kB   
Progress (3): 38 kB | 37/243 kB | 29 kB
Progress (3): 38 kB | 41/243 kB | 29 kB
Progress (3): 38 kB | 45/243 kB | 29 kB
Progress (3): 38 kB | 49/243 kB | 29 kB
Progress (3): 38 kB | 53/243 kB | 29 kB
Progress (3): 38 kB | 57/243 kB | 29 kB
Progress (3): 38 kB | 61/243 kB | 29 kB
Progress (3): 38 kB | 65/243 kB | 29 kB
Progress (3): 38 kB | 66/243 kB | 29 kB
Progress (3): 38 kB | 70/243 kB | 29 kB
Progress (3): 38 kB | 74/243 kB | 29 kB
Progress (3): 38 kB | 78/243 kB | 29 kB
Progress (3): 38 kB | 82/243 kB | 29 kB
Progress (3): 38 kB | 86/243 kB | 29 kB
Progress (3): 38 kB | 90/243 kB | 29 kB
Progress (3): 38 kB | 94/243 kB | 29 kB
Progress (3): 38 kB | 98/243 kB | 29 kB
Progress (3): 38 kB | 102/243 kB | 29 kB
Progress (3): 38 kB | 106/243 kB | 29 kB
Progress (3): 38 kB | 110/243 kB | 29 kB
Progress (3): 38 kB | 114/243 kB | 29 kB
Progress (3): 38 kB | 118/243 kB | 29 kB
Progress (3): 38 kB | 122/243 kB | 29 kB
                                        
Downloaded from eclipse.maven.central.mirror: https://repo.eclipse.org/content/repositories/maven_central/classworlds/classworlds/1.1/classworlds-1.1.jar (38 kB at 549 kB/s)
Progress (2): 126/243 kB | 29 kB
                                
Downloaded from eclipse.maven.central.mirror: https://repo.eclipse.org/content/repositories/maven_central/org/sonatype/plexus/plexus-sec-dispatcher/1.3/plexus-sec-dispatcher-1.3.jar (29 kB at 414 kB/s)
Progress (1): 130/243 kB
Progress (1): 134/243 kB
Progress (1): 138/243 kB
Progress (1): 142/243 kB
Progress (1): 146/243 kB
Progress (2): 146/243 kB | 4.1/54 kB
Progress (2): 150/243 kB | 4.1/54 kB
Progress (2): 150/243 kB | 7.7/54 kB
Progress (2): 154/243 kB | 7.7/54 kB
Progress (2): 154/243 kB | 12/54 kB 
Progress (2): 158/243 kB | 12/54 kB
Progress (2): 158/243 kB | 16/54 kB
Progress (2): 162/243 kB | 16/54 kB
Progress (2): 162/243 kB | 20/54 kB
Progress (2): 166/243 kB | 20/54 kB
Progress (2): 166/243 kB | 24/54 kB
Progress (2): 170/243 kB | 24/54 kB
Progress (2): 170/243 kB | 28/54 kB
Progress (2): 174/243 kB | 28/54 kB
Progress (2): 174/243 kB | 32/54 kB
Progress (2): 178/243 kB | 32/54 kB
Progress (2): 178/243 kB | 36/54 kB
Progress (2): 182/243 kB | 36/54 kB
Progress (2): 182/243 kB | 40/54 kB
Progress (2): 186/243 kB | 40/54 kB
Progress (2): 186/243 kB | 44/54 kB
Progress (2): 190/243 kB | 44/54 kB
Progress (2): 190/243 kB | 48/54 kB
Progress (2): 194/243 kB | 48/54 kB
Progress (2): 194/243 kB | 49/54 kB
Progress (2): 198/243 kB | 49/54 kB
Progress (2): 198/243 kB | 53/54 kB
Progress (2): 202/243 kB | 53/54 kB
Progress (2): 202/243 kB | 54 kB   
Progress (2): 206/243 kB | 54 kB
Progress (2): 210/243 kB | 54 kB
Progress (2): 214/243 kB | 54 kB
Progress (2): 218/243 kB | 54 kB
Progress (2): 222/243 kB | 54 kB
Progress (2): 226/243 kB | 54 kB
Progress (2): 230/243 kB | 54 kB
Progress (2): 234/243 kB | 54 kB
Progress (2): 238/243 kB | 54 kB
Progress (2): 242/243 kB | 54 kB
Progress (2): 243 kB | 54 kB    
                            
Downloaded from eclipse.maven.central.mirror: https://repo.eclipse.org/content/repositories/maven_central/org/apache/commons/commons-exec/1.3/commons-exec-1.3.jar (54 kB at 707 kB/s)
Downloaded from eclipse.maven.central.mirror: https://repo.eclipse.org/content/repositories/maven_central/org/codehaus/plexus/plexus-utils/3.0.20/plexus-utils-3.0.20.jar (243 kB at 3.1 MB/s)
rm: cannot remove ‘/home/data/httpd/download.eclipse.org/ecp/aut/2019-06_R.tar.gz’: Permission denied
photon_R.tar.gz: Permission denied
[ERROR] Command execution failed.
org.apache.commons.exec.ExecuteException: Process exited with an error: 1 (Exit value: 1)
    at org.apache.commons.exec.DefaultExecutor.executeInternal (DefaultExecutor.java:404)
    at org.apache.commons.exec.DefaultExecutor.execute (DefaultExecutor.java:166)
    at org.codehaus.mojo.exec.ExecMojo.executeCommandLine (ExecMojo.java:804)
    at org.codehaus.mojo.exec.ExecMojo.executeCommandLine (ExecMojo.java:751)
    at org.codehaus.mojo.exec.ExecMojo.execute (ExecMojo.java:313)
    at org.apache.maven.plugin.DefaultBuildPluginManager.executeMojo (DefaultBuildPluginManager.java:137)
    at org.apache.maven.lifecycle.internal.MojoExecutor.execute (MojoExecutor.java:210)
    at org.apache.maven.lifecycle.internal.MojoExecutor.execute (MojoExecutor.java:156)
    at org.apache.maven.lifecycle.internal.MojoExecutor.execute (MojoExecutor.java:148)
    at org.apache.maven.lifecycle.internal.LifecycleModuleBuilder.buildProject (LifecycleModuleBuilder.java:117)
    at org.apache.maven.lifecycle.internal.LifecycleModuleBuilder.buildProject (LifecycleModuleBuilder.java:81)
    at org.apache.maven.lifecycle.internal.builder.singlethreaded.SingleThreadedBuilder.build (SingleThreadedBuilder.java:56)
    at org.apache.maven.lifecycle.internal.LifecycleStarter.execute (LifecycleStarter.java:128)
    at org.apache.maven.DefaultMaven.doExecute (DefaultMaven.java:305)
    at org.apache.maven.DefaultMaven.doExecute (DefaultMaven.java:192)
    at org.apache.maven.DefaultMaven.execute (DefaultMaven.java:105)
    at org.apache.maven.cli.MavenCli.execute (MavenCli.java:956)
    at org.apache.maven.cli.MavenCli.doMain (MavenCli.java:288)
    at org.apache.maven.cli.MavenCli.main (MavenCli.java:192)
    at sun.reflect.NativeMethodAccessorImpl.invoke0 (Native Method)
    at sun.reflect.NativeMethodAccessorImpl.invoke (NativeMethodAccessorImpl.java:62)
    at sun.reflect.DelegatingMethodAccessorImpl.invoke (DelegatingMethodAccessorImpl.java:43)
    at java.lang.reflect.Method.invoke (Method.java:498)
    at org.codehaus.plexus.classworlds.launcher.Launcher.launchEnhanced (Launcher.java:289)
    at org.codehaus.plexus.classworlds.launcher.Launcher.launch (Launcher.java:229)
    at org.codehaus.plexus.classworlds.launcher.Launcher.mainWithExitCode (Launcher.java:415)
    at org.codehaus.plexus.classworlds.launcher.Launcher.main (Launcher.java:356)
[INFO] ------------------------------------------------------------------------
[INFO] Reactor Summary for q7tests 0.0.1-SNAPSHOT:
[INFO] 
[INFO] q7tests ............................................ SUCCESS [ 12.016 s]
[INFO] q7-epp-tests ....................................... SUCCESS [  0.301 s]
[INFO] q7-epp-tests-updatesite ............................ SUCCESS [  0.005 s]
[INFO] q7tests-previous ................................... FAILURE [  3.445 s]
[INFO] q7tests-current .................................... SKIPPED
[INFO] q7-non-epp-tests ................................... SKIPPED
[INFO] q7-non-epp-nebula-tests ............................ SKIPPED
[INFO] ------------------------------------------------------------------------
[INFO] BUILD FAILURE
[INFO] ------------------------------------------------------------------------
[INFO] Total time:  24.356 s
[INFO] Finished at: 2019-12-16T13:00:14-05:00
[INFO] ------------------------------------------------------------------------
[ERROR] Failed to execute goal org.codehaus.mojo:exec-maven-plugin:1.6.0:exec (Download Eclipses) on project q7tests-previous: Command execution failed.: Process exited with an error: 1 (Exit value: 1) -> [Help 1]
[ERROR] 
[ERROR] To see the full stack trace of the errors, re-run Maven with the -e switch.
[ERROR] Re-run Maven using the -X switch to enable full debug logging.
[ERROR] 
[ERROR] For more information about the errors and possible solutions, please read the following articles:
[ERROR] [Help 1] http://cwiki.apache.org/confluence/display/MAVEN/MojoExecutionException
[ERROR] 
[ERROR] After correcting the problems, you can resume the build with the command
[ERROR]   mvn <goals> -rf :q7tests-previous
Build step 'Invoke top-level Maven targets' marked build as failure
Terminating xvnc.
Sending e-mails to: eneufeld@eclipsesource.com jfaltermeier@eclipsesource.com
Recording test results
ERROR: Step ‘Publish JUnit test result report’ failed: No test report files were found. Configuration error?
Started calculate disk usage of build
Finished Calculation of disk usage of build in 0 seconds
Started calculate disk usage of workspace
Finished Calculation of disk usage of workspace in 0 seconds
Finished: FAILURE