Console Output

Skipping 623 KB.. Full Log
isNotAcceleo[204](org.eclipse.emf.ecoretools.design.tests.InterpretedExpressionTests)  Time elapsed: 0 sec
isNotAcceleo[205](org.eclipse.emf.ecoretools.design.tests.InterpretedExpressionTests)  Time elapsed: 0 sec
isNotAcceleo[206](org.eclipse.emf.ecoretools.design.tests.InterpretedExpressionTests)  Time elapsed: 0 sec
isNotAcceleo[207](org.eclipse.emf.ecoretools.design.tests.InterpretedExpressionTests)  Time elapsed: 0 sec
isNotAcceleo[208](org.eclipse.emf.ecoretools.design.tests.InterpretedExpressionTests)  Time elapsed: 0 sec
isNotAcceleo[209](org.eclipse.emf.ecoretools.design.tests.InterpretedExpressionTests)  Time elapsed: 0 sec
isNotAcceleo[210](org.eclipse.emf.ecoretools.design.tests.InterpretedExpressionTests)  Time elapsed: 0 sec
isNotAcceleo[211](org.eclipse.emf.ecoretools.design.tests.InterpretedExpressionTests)  Time elapsed: 0 sec
isNotAcceleo[212](org.eclipse.emf.ecoretools.design.tests.InterpretedExpressionTests)  Time elapsed: 0 sec
isNotAcceleo[213](org.eclipse.emf.ecoretools.design.tests.InterpretedExpressionTests)  Time elapsed: 0 sec
isNotAcceleo[214](org.eclipse.emf.ecoretools.design.tests.InterpretedExpressionTests)  Time elapsed: 0 sec
isNotAcceleo[215](org.eclipse.emf.ecoretools.design.tests.InterpretedExpressionTests)  Time elapsed: 0 sec
isNotAcceleo[216](org.eclipse.emf.ecoretools.design.tests.InterpretedExpressionTests)  Time elapsed: 0 sec
isNotAcceleo[217](org.eclipse.emf.ecoretools.design.tests.InterpretedExpressionTests)  Time elapsed: 0 sec
isNotAcceleo[218](org.eclipse.emf.ecoretools.design.tests.InterpretedExpressionTests)  Time elapsed: 0 sec
isNotAcceleo[219](org.eclipse.emf.ecoretools.design.tests.InterpretedExpressionTests)  Time elapsed: 0 sec
isNotAcceleo[220](org.eclipse.emf.ecoretools.design.tests.InterpretedExpressionTests)  Time elapsed: 0 sec
isNotAcceleo[221](org.eclipse.emf.ecoretools.design.tests.InterpretedExpressionTests)  Time elapsed: 0 sec
isNotAcceleo[222](org.eclipse.emf.ecoretools.design.tests.InterpretedExpressionTests)  Time elapsed: 0 sec
isNotAcceleo[223](org.eclipse.emf.ecoretools.design.tests.InterpretedExpressionTests)  Time elapsed: 0 sec
isNotAcceleo[224](org.eclipse.emf.ecoretools.design.tests.InterpretedExpressionTests)  Time elapsed: 0 sec
isNotAcceleo[225](org.eclipse.emf.ecoretools.design.tests.InterpretedExpressionTests)  Time elapsed: 0 sec
isNotAcceleo[226](org.eclipse.emf.ecoretools.design.tests.InterpretedExpressionTests)  Time elapsed: 0 sec
isNotAcceleo[227](org.eclipse.emf.ecoretools.design.tests.InterpretedExpressionTests)  Time elapsed: 0 sec
isNotAcceleo[228](org.eclipse.emf.ecoretools.design.tests.InterpretedExpressionTests)  Time elapsed: 0 sec
isNotAcceleo[229](org.eclipse.emf.ecoretools.design.tests.InterpretedExpressionTests)  Time elapsed: 0 sec
isNotAcceleo[230](org.eclipse.emf.ecoretools.design.tests.InterpretedExpressionTests)  Time elapsed: 0 sec
isNotAcceleo[231](org.eclipse.emf.ecoretools.design.tests.InterpretedExpressionTests)  Time elapsed: 0 sec
isNotAcceleo[232](org.eclipse.emf.ecoretools.design.tests.InterpretedExpressionTests)  Time elapsed: 0 sec
isNotAcceleo[233](org.eclipse.emf.ecoretools.design.tests.InterpretedExpressionTests)  Time elapsed: 0 sec
isNotAcceleo[234](org.eclipse.emf.ecoretools.design.tests.InterpretedExpressionTests)  Time elapsed: 0 sec
isNotAcceleo[235](org.eclipse.emf.ecoretools.design.tests.InterpretedExpressionTests)  Time elapsed: 0 sec
isNotAcceleo[236](org.eclipse.emf.ecoretools.design.tests.InterpretedExpressionTests)  Time elapsed: 0 sec
isNotAcceleo[237](org.eclipse.emf.ecoretools.design.tests.InterpretedExpressionTests)  Time elapsed: 0 sec
isNotAcceleo[238](org.eclipse.emf.ecoretools.design.tests.InterpretedExpressionTests)  Time elapsed: 0 sec
isNotAcceleo[239](org.eclipse.emf.ecoretools.design.tests.InterpretedExpressionTests)  Time elapsed: 0 sec
isNotAcceleo[240](org.eclipse.emf.ecoretools.design.tests.InterpretedExpressionTests)  Time elapsed: 0 sec
isNotAcceleo[241](org.eclipse.emf.ecoretools.design.tests.InterpretedExpressionTests)  Time elapsed: 0 sec
isNotAcceleo[242](org.eclipse.emf.ecoretools.design.tests.InterpretedExpressionTests)  Time elapsed: 0 sec
isNotAcceleo[243](org.eclipse.emf.ecoretools.design.tests.InterpretedExpressionTests)  Time elapsed: 0 sec
isNotAcceleo[244](org.eclipse.emf.ecoretools.design.tests.InterpretedExpressionTests)  Time elapsed: 0 sec
isNotAcceleo[245](org.eclipse.emf.ecoretools.design.tests.InterpretedExpressionTests)  Time elapsed: 0 sec
isNotAcceleo[246](org.eclipse.emf.ecoretools.design.tests.InterpretedExpressionTests)  Time elapsed: 0 sec
isNotAcceleo[247](org.eclipse.emf.ecoretools.design.tests.InterpretedExpressionTests)  Time elapsed: 0 sec
isNotAcceleo[248](org.eclipse.emf.ecoretools.design.tests.InterpretedExpressionTests)  Time elapsed: 0 sec
isNotAcceleo[249](org.eclipse.emf.ecoretools.design.tests.InterpretedExpressionTests)  Time elapsed: 0 sec
isNotAcceleo[250](org.eclipse.emf.ecoretools.design.tests.InterpretedExpressionTests)  Time elapsed: 0 sec
isNotAcceleo[251](org.eclipse.emf.ecoretools.design.tests.InterpretedExpressionTests)  Time elapsed: 0 sec
isNotAcceleo[252](org.eclipse.emf.ecoretools.design.tests.InterpretedExpressionTests)  Time elapsed: 0 sec
isNotAcceleo[253](org.eclipse.emf.ecoretools.design.tests.InterpretedExpressionTests)  Time elapsed: 0 sec
isNotAcceleo[254](org.eclipse.emf.ecoretools.design.tests.InterpretedExpressionTests)  Time elapsed: 0 sec
isNotAcceleo[255](org.eclipse.emf.ecoretools.design.tests.InterpretedExpressionTests)  Time elapsed: 0.001 sec
isNotAcceleo[256](org.eclipse.emf.ecoretools.design.tests.InterpretedExpressionTests)  Time elapsed: 0 sec
isNotAcceleo[257](org.eclipse.emf.ecoretools.design.tests.InterpretedExpressionTests)  Time elapsed: 0 sec
isNotAcceleo[258](org.eclipse.emf.ecoretools.design.tests.InterpretedExpressionTests)  Time elapsed: 0 sec
isNotAcceleo[259](org.eclipse.emf.ecoretools.design.tests.InterpretedExpressionTests)  Time elapsed: 0 sec
isNotAcceleo[260](org.eclipse.emf.ecoretools.design.tests.InterpretedExpressionTests)  Time elapsed: 0 sec
isNotAcceleo[261](org.eclipse.emf.ecoretools.design.tests.InterpretedExpressionTests)  Time elapsed: 0 sec
isNotAcceleo[262](org.eclipse.emf.ecoretools.design.tests.InterpretedExpressionTests)  Time elapsed: 0 sec
isNotAcceleo[263](org.eclipse.emf.ecoretools.design.tests.InterpretedExpressionTests)  Time elapsed: 0 sec
isNotAcceleo[264](org.eclipse.emf.ecoretools.design.tests.InterpretedExpressionTests)  Time elapsed: 0 sec
isNotAcceleo[265](org.eclipse.emf.ecoretools.design.tests.InterpretedExpressionTests)  Time elapsed: 0 sec
isNotAcceleo[266](org.eclipse.emf.ecoretools.design.tests.InterpretedExpressionTests)  Time elapsed: 0 sec
isNotAcceleo[267](org.eclipse.emf.ecoretools.design.tests.InterpretedExpressionTests)  Time elapsed: 0 sec
isNotAcceleo[268](org.eclipse.emf.ecoretools.design.tests.InterpretedExpressionTests)  Time elapsed: 0 sec
isNotAcceleo[269](org.eclipse.emf.ecoretools.design.tests.InterpretedExpressionTests)  Time elapsed: 0 sec
isNotAcceleo[270](org.eclipse.emf.ecoretools.design.tests.InterpretedExpressionTests)  Time elapsed: 0 sec
isNotAcceleo[271](org.eclipse.emf.ecoretools.design.tests.InterpretedExpressionTests)  Time elapsed: 0.001 sec
isNotAcceleo[272](org.eclipse.emf.ecoretools.design.tests.InterpretedExpressionTests)  Time elapsed: 0 sec
isNotAcceleo[273](org.eclipse.emf.ecoretools.design.tests.InterpretedExpressionTests)  Time elapsed: 0 sec
isNotAcceleo[274](org.eclipse.emf.ecoretools.design.tests.InterpretedExpressionTests)  Time elapsed: 0 sec
isNotAcceleo[275](org.eclipse.emf.ecoretools.design.tests.InterpretedExpressionTests)  Time elapsed: 0 sec
isNotAcceleo[276](org.eclipse.emf.ecoretools.design.tests.InterpretedExpressionTests)  Time elapsed: 0 sec
isNotAcceleo[277](org.eclipse.emf.ecoretools.design.tests.InterpretedExpressionTests)  Time elapsed: 0 sec
isNotAcceleo[278](org.eclipse.emf.ecoretools.design.tests.InterpretedExpressionTests)  Time elapsed: 0 sec
isNotAcceleo[279](org.eclipse.emf.ecoretools.design.tests.InterpretedExpressionTests)  Time elapsed: 0 sec
isNotAcceleo[280](org.eclipse.emf.ecoretools.design.tests.InterpretedExpressionTests)  Time elapsed: 0 sec
isNotAcceleo[281](org.eclipse.emf.ecoretools.design.tests.InterpretedExpressionTests)  Time elapsed: 0 sec
isNotAcceleo[282](org.eclipse.emf.ecoretools.design.tests.InterpretedExpressionTests)  Time elapsed: 0 sec
isNotAcceleo[283](org.eclipse.emf.ecoretools.design.tests.InterpretedExpressionTests)  Time elapsed: 0 sec
isNotAcceleo[284](org.eclipse.emf.ecoretools.design.tests.InterpretedExpressionTests)  Time elapsed: 0 sec
isNotAcceleo[285](org.eclipse.emf.ecoretools.design.tests.InterpretedExpressionTests)  Time elapsed: 0 sec
isNotAcceleo[286](org.eclipse.emf.ecoretools.design.tests.InterpretedExpressionTests)  Time elapsed: 0 sec
isNotAcceleo[287](org.eclipse.emf.ecoretools.design.tests.InterpretedExpressionTests)  Time elapsed: 0 sec
isNotAcceleo[288](org.eclipse.emf.ecoretools.design.tests.InterpretedExpressionTests)  Time elapsed: 0 sec
isNotAcceleo[289](org.eclipse.emf.ecoretools.design.tests.InterpretedExpressionTests)  Time elapsed: 0 sec
isNotAcceleo[290](org.eclipse.emf.ecoretools.design.tests.InterpretedExpressionTests)  Time elapsed: 0 sec
isNotAcceleo[291](org.eclipse.emf.ecoretools.design.tests.InterpretedExpressionTests)  Time elapsed: 0 sec
isNotAcceleo[292](org.eclipse.emf.ecoretools.design.tests.InterpretedExpressionTests)  Time elapsed: 0 sec
isNotAcceleo[293](org.eclipse.emf.ecoretools.design.tests.InterpretedExpressionTests)  Time elapsed: 0 sec
isNotAcceleo[294](org.eclipse.emf.ecoretools.design.tests.InterpretedExpressionTests)  Time elapsed: 0 sec
isNotAcceleo[295](org.eclipse.emf.ecoretools.design.tests.InterpretedExpressionTests)  Time elapsed: 0 sec
isNotAcceleo[296](org.eclipse.emf.ecoretools.design.tests.InterpretedExpressionTests)  Time elapsed: 0 sec
isNotAcceleo[297](org.eclipse.emf.ecoretools.design.tests.InterpretedExpressionTests)  Time elapsed: 0 sec
isNotAcceleo[298](org.eclipse.emf.ecoretools.design.tests.InterpretedExpressionTests)  Time elapsed: 0 sec
isNotAcceleo[299](org.eclipse.emf.ecoretools.design.tests.InterpretedExpressionTests)  Time elapsed: 0 sec
isNotAcceleo[300](org.eclipse.emf.ecoretools.design.tests.InterpretedExpressionTests)  Time elapsed: 0 sec
isNotAcceleo[301](org.eclipse.emf.ecoretools.design.tests.InterpretedExpressionTests)  Time elapsed: 0 sec
isNotAcceleo[302](org.eclipse.emf.ecoretools.design.tests.InterpretedExpressionTests)  Time elapsed: 0 sec
isNotAcceleo[303](org.eclipse.emf.ecoretools.design.tests.InterpretedExpressionTests)  Time elapsed: 0 sec
isNotAcceleo[304](org.eclipse.emf.ecoretools.design.tests.InterpretedExpressionTests)  Time elapsed: 0 sec
isNotAcceleo[305](org.eclipse.emf.ecoretools.design.tests.InterpretedExpressionTests)  Time elapsed: 0 sec
isNotAcceleo[306](org.eclipse.emf.ecoretools.design.tests.InterpretedExpressionTests)  Time elapsed: 0 sec
isNotAcceleo[307](org.eclipse.emf.ecoretools.design.tests.InterpretedExpressionTests)  Time elapsed: 0 sec
isNotAcceleo[308](org.eclipse.emf.ecoretools.design.tests.InterpretedExpressionTests)  Time elapsed: 0 sec
isNotAcceleo[309](org.eclipse.emf.ecoretools.design.tests.InterpretedExpressionTests)  Time elapsed: 0 sec
isNotAcceleo[310](org.eclipse.emf.ecoretools.design.tests.InterpretedExpressionTests)  Time elapsed: 0 sec
isNotAcceleo[311](org.eclipse.emf.ecoretools.design.tests.InterpretedExpressionTests)  Time elapsed: 0 sec
isNotAcceleo[312](org.eclipse.emf.ecoretools.design.tests.InterpretedExpressionTests)  Time elapsed: 0 sec
isNotAcceleo[313](org.eclipse.emf.ecoretools.design.tests.InterpretedExpressionTests)  Time elapsed: 0 sec
isNotAcceleo[314](org.eclipse.emf.ecoretools.design.tests.InterpretedExpressionTests)  Time elapsed: 0 sec
isNotAcceleo[315](org.eclipse.emf.ecoretools.design.tests.InterpretedExpressionTests)  Time elapsed: 0 sec
isNotAcceleo[316](org.eclipse.emf.ecoretools.design.tests.InterpretedExpressionTests)  Time elapsed: 0 sec
isNotAcceleo[317](org.eclipse.emf.ecoretools.design.tests.InterpretedExpressionTests)  Time elapsed: 0 sec
isNotAcceleo[318](org.eclipse.emf.ecoretools.design.tests.InterpretedExpressionTests)  Time elapsed: 0 sec
isNotAcceleo[319](org.eclipse.emf.ecoretools.design.tests.InterpretedExpressionTests)  Time elapsed: 0 sec
isNotAcceleo[320](org.eclipse.emf.ecoretools.design.tests.InterpretedExpressionTests)  Time elapsed: 0 sec
isNotAcceleo[321](org.eclipse.emf.ecoretools.design.tests.InterpretedExpressionTests)  Time elapsed: 0 sec
isNotAcceleo[322](org.eclipse.emf.ecoretools.design.tests.InterpretedExpressionTests)  Time elapsed: 0 sec
isNotAcceleo[323](org.eclipse.emf.ecoretools.design.tests.InterpretedExpressionTests)  Time elapsed: 0 sec
isNotAcceleo[324](org.eclipse.emf.ecoretools.design.tests.InterpretedExpressionTests)  Time elapsed: 0 sec
isNotAcceleo[325](org.eclipse.emf.ecoretools.design.tests.InterpretedExpressionTests)  Time elapsed: 0 sec
isNotAcceleo[326](org.eclipse.emf.ecoretools.design.tests.InterpretedExpressionTests)  Time elapsed: 0 sec
isNotAcceleo[327](org.eclipse.emf.ecoretools.design.tests.InterpretedExpressionTests)  Time elapsed: 0 sec
isNotAcceleo[328](org.eclipse.emf.ecoretools.design.tests.InterpretedExpressionTests)  Time elapsed: 0 sec
isNotAcceleo[329](org.eclipse.emf.ecoretools.design.tests.InterpretedExpressionTests)  Time elapsed: 0.001 sec
isNotAcceleo[330](org.eclipse.emf.ecoretools.design.tests.InterpretedExpressionTests)  Time elapsed: 0 sec
isNotAcceleo[331](org.eclipse.emf.ecoretools.design.tests.InterpretedExpressionTests)  Time elapsed: 0 sec
isNotAcceleo[332](org.eclipse.emf.ecoretools.design.tests.InterpretedExpressionTests)  Time elapsed: 0 sec
isNotAcceleo[333](org.eclipse.emf.ecoretools.design.tests.InterpretedExpressionTests)  Time elapsed: 0 sec
isNotAcceleo[334](org.eclipse.emf.ecoretools.design.tests.InterpretedExpressionTests)  Time elapsed: 0 sec
isNotAcceleo[335](org.eclipse.emf.ecoretools.design.tests.InterpretedExpressionTests)  Time elapsed: 0 sec
isNotAcceleo[336](org.eclipse.emf.ecoretools.design.tests.InterpretedExpressionTests)  Time elapsed: 0 sec
isNotAcceleo[337](org.eclipse.emf.ecoretools.design.tests.InterpretedExpressionTests)  Time elapsed: 0 sec
isNotAcceleo[338](org.eclipse.emf.ecoretools.design.tests.InterpretedExpressionTests)  Time elapsed: 0 sec
isNotAcceleo[339](org.eclipse.emf.ecoretools.design.tests.InterpretedExpressionTests)  Time elapsed: 0 sec
isNotAcceleo[340](org.eclipse.emf.ecoretools.design.tests.InterpretedExpressionTests)  Time elapsed: 0 sec
isNotAcceleo[341](org.eclipse.emf.ecoretools.design.tests.InterpretedExpressionTests)  Time elapsed: 0 sec
isNotAcceleo[342](org.eclipse.emf.ecoretools.design.tests.InterpretedExpressionTests)  Time elapsed: 0 sec
isNotAcceleo[343](org.eclipse.emf.ecoretools.design.tests.InterpretedExpressionTests)  Time elapsed: 0 sec
isNotAcceleo[344](org.eclipse.emf.ecoretools.design.tests.InterpretedExpressionTests)  Time elapsed: 0 sec
isNotAcceleo[345](org.eclipse.emf.ecoretools.design.tests.InterpretedExpressionTests)  Time elapsed: 0 sec
isNotAcceleo[346](org.eclipse.emf.ecoretools.design.tests.InterpretedExpressionTests)  Time elapsed: 0 sec
isNotAcceleo[347](org.eclipse.emf.ecoretools.design.tests.InterpretedExpressionTests)  Time elapsed: 0 sec
isNotAcceleo[348](org.eclipse.emf.ecoretools.design.tests.InterpretedExpressionTests)  Time elapsed: 0 sec
isNotAcceleo[349](org.eclipse.emf.ecoretools.design.tests.InterpretedExpressionTests)  Time elapsed: 0 sec
isNotAcceleo[350](org.eclipse.emf.ecoretools.design.tests.InterpretedExpressionTests)  Time elapsed: 0.001 sec
isNotAcceleo[351](org.eclipse.emf.ecoretools.design.tests.InterpretedExpressionTests)  Time elapsed: 0 sec
isNotAcceleo[352](org.eclipse.emf.ecoretools.design.tests.InterpretedExpressionTests)  Time elapsed: 0 sec
isNotAcceleo[353](org.eclipse.emf.ecoretools.design.tests.InterpretedExpressionTests)  Time elapsed: 0 sec
isNotAcceleo[354](org.eclipse.emf.ecoretools.design.tests.InterpretedExpressionTests)  Time elapsed: 0 sec
isNotAcceleo[355](org.eclipse.emf.ecoretools.design.tests.InterpretedExpressionTests)  Time elapsed: 0 sec
isNotAcceleo[356](org.eclipse.emf.ecoretools.design.tests.InterpretedExpressionTests)  Time elapsed: 0 sec
isNotAcceleo[357](org.eclipse.emf.ecoretools.design.tests.InterpretedExpressionTests)  Time elapsed: 0 sec
isNotAcceleo[358](org.eclipse.emf.ecoretools.design.tests.InterpretedExpressionTests)  Time elapsed: 0 sec
isNotAcceleo[359](org.eclipse.emf.ecoretools.design.tests.InterpretedExpressionTests)  Time elapsed: 0 sec
isNotAcceleo[360](org.eclipse.emf.ecoretools.design.tests.InterpretedExpressionTests)  Time elapsed: 0 sec
isNotAcceleo[361](org.eclipse.emf.ecoretools.design.tests.InterpretedExpressionTests)  Time elapsed: 0 sec
isNotAcceleo[362](org.eclipse.emf.ecoretools.design.tests.InterpretedExpressionTests)  Time elapsed: 0 sec
isNotAcceleo[363](org.eclipse.emf.ecoretools.design.tests.InterpretedExpressionTests)  Time elapsed: 0 sec
isNotAcceleo[364](org.eclipse.emf.ecoretools.design.tests.InterpretedExpressionTests)  Time elapsed: 0 sec
isNotAcceleo[365](org.eclipse.emf.ecoretools.design.tests.InterpretedExpressionTests)  Time elapsed: 0 sec
isNotAcceleo[366](org.eclipse.emf.ecoretools.design.tests.InterpretedExpressionTests)  Time elapsed: 0 sec
isNotAcceleo[367](org.eclipse.emf.ecoretools.design.tests.InterpretedExpressionTests)  Time elapsed: 0 sec
isNotAcceleo[368](org.eclipse.emf.ecoretools.design.tests.InterpretedExpressionTests)  Time elapsed: 0 sec
isNotAcceleo[369](org.eclipse.emf.ecoretools.design.tests.InterpretedExpressionTests)  Time elapsed: 0 sec
isNotAcceleo[370](org.eclipse.emf.ecoretools.design.tests.InterpretedExpressionTests)  Time elapsed: 0 sec
isNotAcceleo[371](org.eclipse.emf.ecoretools.design.tests.InterpretedExpressionTests)  Time elapsed: 0 sec
isNotAcceleo[372](org.eclipse.emf.ecoretools.design.tests.InterpretedExpressionTests)  Time elapsed: 0 sec
isNotAcceleo[373](org.eclipse.emf.ecoretools.design.tests.InterpretedExpressionTests)  Time elapsed: 0 sec
isNotAcceleo[374](org.eclipse.emf.ecoretools.design.tests.InterpretedExpressionTests)  Time elapsed: 0 sec
isNotAcceleo[375](org.eclipse.emf.ecoretools.design.tests.InterpretedExpressionTests)  Time elapsed: 0 sec
isNotAcceleo[376](org.eclipse.emf.ecoretools.design.tests.InterpretedExpressionTests)  Time elapsed: 0 sec
isNotAcceleo[377](org.eclipse.emf.ecoretools.design.tests.InterpretedExpressionTests)  Time elapsed: 0 sec
isNotAcceleo[378](org.eclipse.emf.ecoretools.design.tests.InterpretedExpressionTests)  Time elapsed: 0 sec
isNotAcceleo[379](org.eclipse.emf.ecoretools.design.tests.InterpretedExpressionTests)  Time elapsed: 0 sec
isNotAcceleo[380](org.eclipse.emf.ecoretools.design.tests.InterpretedExpressionTests)  Time elapsed: 0 sec
isNotAcceleo[381](org.eclipse.emf.ecoretools.design.tests.InterpretedExpressionTests)  Time elapsed: 0 sec
isNotAcceleo[382](org.eclipse.emf.ecoretools.design.tests.InterpretedExpressionTests)  Time elapsed: 0 sec
isNotAcceleo[383](org.eclipse.emf.ecoretools.design.tests.InterpretedExpressionTests)  Time elapsed: 0 sec
isNotAcceleo[384](org.eclipse.emf.ecoretools.design.tests.InterpretedExpressionTests)  Time elapsed: 0 sec
isNotAcceleo[385](org.eclipse.emf.ecoretools.design.tests.InterpretedExpressionTests)  Time elapsed: 0 sec
isNotAcceleo[386](org.eclipse.emf.ecoretools.design.tests.InterpretedExpressionTests)  Time elapsed: 0 sec
isNotAcceleo[387](org.eclipse.emf.ecoretools.design.tests.InterpretedExpressionTests)  Time elapsed: 0 sec
isNotAcceleo[388](org.eclipse.emf.ecoretools.design.tests.InterpretedExpressionTests)  Time elapsed: 0 sec
isNotAcceleo[389](org.eclipse.emf.ecoretools.design.tests.InterpretedExpressionTests)  Time elapsed: 0 sec
isNotAcceleo[390](org.eclipse.emf.ecoretools.design.tests.InterpretedExpressionTests)  Time elapsed: 0 sec
isNotAcceleo[391](org.eclipse.emf.ecoretools.design.tests.InterpretedExpressionTests)  Time elapsed: 0 sec
isNotAcceleo[392](org.eclipse.emf.ecoretools.design.tests.InterpretedExpressionTests)  Time elapsed: 0 sec
isNotAcceleo[393](org.eclipse.emf.ecoretools.design.tests.InterpretedExpressionTests)  Time elapsed: 0 sec
isNotAcceleo[394](org.eclipse.emf.ecoretools.design.tests.InterpretedExpressionTests)  Time elapsed: 0 sec
isNotAcceleo[395](org.eclipse.emf.ecoretools.design.tests.InterpretedExpressionTests)  Time elapsed: 0 sec
isNotAcceleo[396](org.eclipse.emf.ecoretools.design.tests.InterpretedExpressionTests)  Time elapsed: 0 sec
isNotAcceleo[397](org.eclipse.emf.ecoretools.design.tests.InterpretedExpressionTests)  Time elapsed: 0 sec
isNotAcceleo[398](org.eclipse.emf.ecoretools.design.tests.InterpretedExpressionTests)  Time elapsed: 0 sec
isNotAcceleo[399](org.eclipse.emf.ecoretools.design.tests.InterpretedExpressionTests)  Time elapsed: 0 sec
isNotAcceleo[400](org.eclipse.emf.ecoretools.design.tests.InterpretedExpressionTests)  Time elapsed: 0 sec
isNotAcceleo[401](org.eclipse.emf.ecoretools.design.tests.InterpretedExpressionTests)  Time elapsed: 0 sec
isNotAcceleo[402](org.eclipse.emf.ecoretools.design.tests.InterpretedExpressionTests)  Time elapsed: 0 sec
isNotAcceleo[403](org.eclipse.emf.ecoretools.design.tests.InterpretedExpressionTests)  Time elapsed: 0 sec
isNotAcceleo[404](org.eclipse.emf.ecoretools.design.tests.InterpretedExpressionTests)  Time elapsed: 0 sec
isNotAcceleo[405](org.eclipse.emf.ecoretools.design.tests.InterpretedExpressionTests)  Time elapsed: 0 sec
isNotAcceleo[406](org.eclipse.emf.ecoretools.design.tests.InterpretedExpressionTests)  Time elapsed: 0 sec
isNotAcceleo[407](org.eclipse.emf.ecoretools.design.tests.InterpretedExpressionTests)  Time elapsed: 0 sec
isNotAcceleo[408](org.eclipse.emf.ecoretools.design.tests.InterpretedExpressionTests)  Time elapsed: 0 sec
isNotAcceleo[409](org.eclipse.emf.ecoretools.design.tests.InterpretedExpressionTests)  Time elapsed: 0 sec
isNotAcceleo[410](org.eclipse.emf.ecoretools.design.tests.InterpretedExpressionTests)  Time elapsed: 0 sec
isNotAcceleo[411](org.eclipse.emf.ecoretools.design.tests.InterpretedExpressionTests)  Time elapsed: 0 sec
isNotAcceleo[412](org.eclipse.emf.ecoretools.design.tests.InterpretedExpressionTests)  Time elapsed: 0 sec
isNotAcceleo[413](org.eclipse.emf.ecoretools.design.tests.InterpretedExpressionTests)  Time elapsed: 0 sec
isNotAcceleo[414](org.eclipse.emf.ecoretools.design.tests.InterpretedExpressionTests)  Time elapsed: 0 sec
isNotAcceleo[415](org.eclipse.emf.ecoretools.design.tests.InterpretedExpressionTests)  Time elapsed: 0 sec
isNotAcceleo[416](org.eclipse.emf.ecoretools.design.tests.InterpretedExpressionTests)  Time elapsed: 0 sec
isNotAcceleo[417](org.eclipse.emf.ecoretools.design.tests.InterpretedExpressionTests)  Time elapsed: 0.001 sec
isNotAcceleo[418](org.eclipse.emf.ecoretools.design.tests.InterpretedExpressionTests)  Time elapsed: 0 sec
isNotAcceleo[419](org.eclipse.emf.ecoretools.design.tests.InterpretedExpressionTests)  Time elapsed: 0 sec
isNotAcceleo[420](org.eclipse.emf.ecoretools.design.tests.InterpretedExpressionTests)  Time elapsed: 0 sec
isNotAcceleo[421](org.eclipse.emf.ecoretools.design.tests.InterpretedExpressionTests)  Time elapsed: 0 sec
isNotAcceleo[422](org.eclipse.emf.ecoretools.design.tests.InterpretedExpressionTests)  Time elapsed: 0 sec
isNotAcceleo[423](org.eclipse.emf.ecoretools.design.tests.InterpretedExpressionTests)  Time elapsed: 0 sec
isNotAcceleo[424](org.eclipse.emf.ecoretools.design.tests.InterpretedExpressionTests)  Time elapsed: 0 sec
isNotAcceleo[425](org.eclipse.emf.ecoretools.design.tests.InterpretedExpressionTests)  Time elapsed: 0 sec
isNotAcceleo[426](org.eclipse.emf.ecoretools.design.tests.InterpretedExpressionTests)  Time elapsed: 0 sec
isNotAcceleo[427](org.eclipse.emf.ecoretools.design.tests.InterpretedExpressionTests)  Time elapsed: 0.001 sec
isNotAcceleo[428](org.eclipse.emf.ecoretools.design.tests.InterpretedExpressionTests)  Time elapsed: 0 sec
isNotAcceleo[429](org.eclipse.emf.ecoretools.design.tests.InterpretedExpressionTests)  Time elapsed: 0 sec
isNotAcceleo[430](org.eclipse.emf.ecoretools.design.tests.InterpretedExpressionTests)  Time elapsed: 0 sec
isNotAcceleo[431](org.eclipse.emf.ecoretools.design.tests.InterpretedExpressionTests)  Time elapsed: 0.001 sec
isNotAcceleo[432](org.eclipse.emf.ecoretools.design.tests.InterpretedExpressionTests)  Time elapsed: 0 sec
isNotAcceleo[433](org.eclipse.emf.ecoretools.design.tests.InterpretedExpressionTests)  Time elapsed: 0 sec
isNotAcceleo[434](org.eclipse.emf.ecoretools.design.tests.InterpretedExpressionTests)  Time elapsed: 0 sec
isNotAcceleo[435](org.eclipse.emf.ecoretools.design.tests.InterpretedExpressionTests)  Time elapsed: 0 sec
isNotAcceleo[436](org.eclipse.emf.ecoretools.design.tests.InterpretedExpressionTests)  Time elapsed: 0 sec
isNotAcceleo[437](org.eclipse.emf.ecoretools.design.tests.InterpretedExpressionTests)  Time elapsed: 0 sec
isNotAcceleo[438](org.eclipse.emf.ecoretools.design.tests.InterpretedExpressionTests)  Time elapsed: 0 sec
isNotAcceleo[439](org.eclipse.emf.ecoretools.design.tests.InterpretedExpressionTests)  Time elapsed: 0 sec
isNotAcceleo[440](org.eclipse.emf.ecoretools.design.tests.InterpretedExpressionTests)  Time elapsed: 0 sec
isNotAcceleo[441](org.eclipse.emf.ecoretools.design.tests.InterpretedExpressionTests)  Time elapsed: 0 sec
isNotAcceleo[442](org.eclipse.emf.ecoretools.design.tests.InterpretedExpressionTests)  Time elapsed: 0 sec
isNotAcceleo[443](org.eclipse.emf.ecoretools.design.tests.InterpretedExpressionTests)  Time elapsed: 0 sec
Running org.eclipse.emf.ecoretools.design.tests.TypeNameTests
3 : ecore.EAnnotation
2 : ecore.EAttribute
11 : ecore.EClass
3 : ecore.EClassifier
3 : ecore.EDataType
2 : ecore.EEnum
2 : ecore.EEnumLiteral
2 : ecore.EOperation
11 : ecore.EPackage
9 : ecore.EReference
6 : ecore.EStringToStringMapEntry
2 : ecore.EStructuralFeature
2 : ecore.ETypeParameter
1 : genmodel.GenClass
1 : genmodel.GenFeature
1 : genmodel.GenPackage
Tests run: 61, Failures: 0, Errors: 0, Skipped: 0, Time elapsed: 0.03 sec - in org.eclipse.emf.ecoretools.design.tests.TypeNameTests
isNotQualified[0](org.eclipse.emf.ecoretools.design.tests.TypeNameTests)  Time elapsed: 0 sec
isNotQualified[1](org.eclipse.emf.ecoretools.design.tests.TypeNameTests)  Time elapsed: 0 sec
isNotQualified[2](org.eclipse.emf.ecoretools.design.tests.TypeNameTests)  Time elapsed: 0 sec
isNotQualified[3](org.eclipse.emf.ecoretools.design.tests.TypeNameTests)  Time elapsed: 0 sec
isNotQualified[4](org.eclipse.emf.ecoretools.design.tests.TypeNameTests)  Time elapsed: 0 sec
isNotQualified[5](org.eclipse.emf.ecoretools.design.tests.TypeNameTests)  Time elapsed: 0 sec
isNotQualified[6](org.eclipse.emf.ecoretools.design.tests.TypeNameTests)  Time elapsed: 0 sec
isNotQualified[7](org.eclipse.emf.ecoretools.design.tests.TypeNameTests)  Time elapsed: 0 sec
isNotQualified[8](org.eclipse.emf.ecoretools.design.tests.TypeNameTests)  Time elapsed: 0 sec
isNotQualified[9](org.eclipse.emf.ecoretools.design.tests.TypeNameTests)  Time elapsed: 0 sec
isNotQualified[10](org.eclipse.emf.ecoretools.design.tests.TypeNameTests)  Time elapsed: 0 sec
isNotQualified[11](org.eclipse.emf.ecoretools.design.tests.TypeNameTests)  Time elapsed: 0 sec
isNotQualified[12](org.eclipse.emf.ecoretools.design.tests.TypeNameTests)  Time elapsed: 0 sec
isNotQualified[13](org.eclipse.emf.ecoretools.design.tests.TypeNameTests)  Time elapsed: 0 sec
isNotQualified[14](org.eclipse.emf.ecoretools.design.tests.TypeNameTests)  Time elapsed: 0 sec
isNotQualified[15](org.eclipse.emf.ecoretools.design.tests.TypeNameTests)  Time elapsed: 0 sec
isNotQualified[16](org.eclipse.emf.ecoretools.design.tests.TypeNameTests)  Time elapsed: 0 sec
isNotQualified[17](org.eclipse.emf.ecoretools.design.tests.TypeNameTests)  Time elapsed: 0 sec
isNotQualified[18](org.eclipse.emf.ecoretools.design.tests.TypeNameTests)  Time elapsed: 0 sec
isNotQualified[19](org.eclipse.emf.ecoretools.design.tests.TypeNameTests)  Time elapsed: 0 sec
isNotQualified[20](org.eclipse.emf.ecoretools.design.tests.TypeNameTests)  Time elapsed: 0 sec
isNotQualified[21](org.eclipse.emf.ecoretools.design.tests.TypeNameTests)  Time elapsed: 0 sec
isNotQualified[22](org.eclipse.emf.ecoretools.design.tests.TypeNameTests)  Time elapsed: 0 sec
isNotQualified[23](org.eclipse.emf.ecoretools.design.tests.TypeNameTests)  Time elapsed: 0.001 sec
isNotQualified[24](org.eclipse.emf.ecoretools.design.tests.TypeNameTests)  Time elapsed: 0 sec
isNotQualified[25](org.eclipse.emf.ecoretools.design.tests.TypeNameTests)  Time elapsed: 0 sec
isNotQualified[26](org.eclipse.emf.ecoretools.design.tests.TypeNameTests)  Time elapsed: 0 sec
isNotQualified[27](org.eclipse.emf.ecoretools.design.tests.TypeNameTests)  Time elapsed: 0 sec
isNotQualified[28](org.eclipse.emf.ecoretools.design.tests.TypeNameTests)  Time elapsed: 0 sec
isNotQualified[29](org.eclipse.emf.ecoretools.design.tests.TypeNameTests)  Time elapsed: 0 sec
isNotQualified[30](org.eclipse.emf.ecoretools.design.tests.TypeNameTests)  Time elapsed: 0 sec
isNotQualified[31](org.eclipse.emf.ecoretools.design.tests.TypeNameTests)  Time elapsed: 0 sec
isNotQualified[32](org.eclipse.emf.ecoretools.design.tests.TypeNameTests)  Time elapsed: 0 sec
isNotQualified[33](org.eclipse.emf.ecoretools.design.tests.TypeNameTests)  Time elapsed: 0 sec
isNotQualified[34](org.eclipse.emf.ecoretools.design.tests.TypeNameTests)  Time elapsed: 0 sec
isNotQualified[35](org.eclipse.emf.ecoretools.design.tests.TypeNameTests)  Time elapsed: 0 sec
isNotQualified[36](org.eclipse.emf.ecoretools.design.tests.TypeNameTests)  Time elapsed: 0 sec
isNotQualified[37](org.eclipse.emf.ecoretools.design.tests.TypeNameTests)  Time elapsed: 0 sec
isNotQualified[38](org.eclipse.emf.ecoretools.design.tests.TypeNameTests)  Time elapsed: 0 sec
isNotQualified[39](org.eclipse.emf.ecoretools.design.tests.TypeNameTests)  Time elapsed: 0 sec
isNotQualified[40](org.eclipse.emf.ecoretools.design.tests.TypeNameTests)  Time elapsed: 0 sec
isNotQualified[41](org.eclipse.emf.ecoretools.design.tests.TypeNameTests)  Time elapsed: 0 sec
isNotQualified[42](org.eclipse.emf.ecoretools.design.tests.TypeNameTests)  Time elapsed: 0 sec
isNotQualified[43](org.eclipse.emf.ecoretools.design.tests.TypeNameTests)  Time elapsed: 0 sec
isNotQualified[44](org.eclipse.emf.ecoretools.design.tests.TypeNameTests)  Time elapsed: 0 sec
isNotQualified[45](org.eclipse.emf.ecoretools.design.tests.TypeNameTests)  Time elapsed: 0 sec
isNotQualified[46](org.eclipse.emf.ecoretools.design.tests.TypeNameTests)  Time elapsed: 0 sec
isNotQualified[47](org.eclipse.emf.ecoretools.design.tests.TypeNameTests)  Time elapsed: 0 sec
isNotQualified[48](org.eclipse.emf.ecoretools.design.tests.TypeNameTests)  Time elapsed: 0 sec
isNotQualified[49](org.eclipse.emf.ecoretools.design.tests.TypeNameTests)  Time elapsed: 0 sec
isNotQualified[50](org.eclipse.emf.ecoretools.design.tests.TypeNameTests)  Time elapsed: 0 sec
isNotQualified[51](org.eclipse.emf.ecoretools.design.tests.TypeNameTests)  Time elapsed: 0 sec
isNotQualified[52](org.eclipse.emf.ecoretools.design.tests.TypeNameTests)  Time elapsed: 0 sec
isNotQualified[53](org.eclipse.emf.ecoretools.design.tests.TypeNameTests)  Time elapsed: 0 sec
isNotQualified[54](org.eclipse.emf.ecoretools.design.tests.TypeNameTests)  Time elapsed: 0 sec
isNotQualified[55](org.eclipse.emf.ecoretools.design.tests.TypeNameTests)  Time elapsed: 0 sec
isNotQualified[56](org.eclipse.emf.ecoretools.design.tests.TypeNameTests)  Time elapsed: 0 sec
isNotQualified[57](org.eclipse.emf.ecoretools.design.tests.TypeNameTests)  Time elapsed: 0 sec
isNotQualified[58](org.eclipse.emf.ecoretools.design.tests.TypeNameTests)  Time elapsed: 0 sec
isNotQualified[59](org.eclipse.emf.ecoretools.design.tests.TypeNameTests)  Time elapsed: 0 sec
isNotQualified[60](org.eclipse.emf.ecoretools.design.tests.TypeNameTests)  Time elapsed: 0 sec
Running org.eclipse.emf.ecoretools.design.tests.VsmValidationTests
Tests run: 1, Failures: 1, Errors: 0, Skipped: 0, Time elapsed: 1.453 sec <<< FAILURE! - in org.eclipse.emf.ecoretools.design.tests.VsmValidationTests
isValid(org.eclipse.emf.ecoretools.design.tests.VsmValidationTests)  Time elapsed: 1.447 sec  <<< FAILURE!
java.lang.AssertionError: The VSM is not valid it has errors : Diagnostic ERROR source=org.eclipse.emf.ecore code=0 Diagnosis of org.eclipse.sirius.viewpoint.description.impl.GroupImpl@68c7ef83{platform:/plugin/org.eclipse.emf.ecoretools.design/description/ecore.odesign#/} data=[org.eclipse.sirius.viewpoint.description.impl.GroupImpl@68c7ef83 (documentation: FORCE_LEGACY_PROPERTIES, name: EcoreTools, version: 11.1.1.201610211630)] [Diagnostic ERROR source=org.eclipse.sirius code=1 Nothing will be left after calling oclAsType:
EClassifier=EClass is not compatible with type EClassifierLiteral=DEdge data=[org.eclipse.sirius.diagram.business.internal.metamodel.description.filter.spec.MappingFilterSpec@2b38b1f (filterKind: HIDE) (semanticConditionExpression: null, viewConditionExpression: aql:not self.oclAsType(diagram::DEdge).sourceNode.oclAsType(viewpoint::DSemanticDecorator).target.oclAsType(ecore::EClass).eSuperTypes->includes(self.oclAsType(diagram::DEdge).targetNode.oclAsType(viewpoint::DSemanticDecorator).target))], Diagnostic ERROR source=org.eclipse.sirius code=1 Nothing will be left after calling oclAsType:
EClassifier=EClass is not compatible with type EClassifierLiteral=DEdge data=[org.eclipse.sirius.diagram.business.internal.metamodel.description.filter.spec.MappingFilterSpec@2b38b1f (filterKind: HIDE) (semanticConditionExpression: null, viewConditionExpression: aql:not self.oclAsType(diagram::DEdge).sourceNode.oclAsType(viewpoint::DSemanticDecorator).target.oclAsType(ecore::EClass).eSuperTypes->includes(self.oclAsType(diagram::DEdge).targetNode.oclAsType(viewpoint::DSemanticDecorator).target))], Diagnostic ERROR source=org.eclipse.sirius code=1 Nothing will be left after calling oclAsType:
EClassifier=EClass is not compatible with type EClassifierLiteral=DSemanticDecorator
EClassifier=EAnnotation is not compatible with type EClassifierLiteral=DSemanticDecorator
EClassifier=GenAnnotation is not compatible with type EClassifierLiteral=DSemanticDecorator
EClassifier=DAnalysisCustomData is not compatible with type EClassifierLiteral=DSemanticDecorator
EClassifier=AnnotationEntry is not compatible with type EClassifierLiteral=DSemanticDecorator
EClassifier=TableDescription is not compatible with type EClassifierLiteral=DSemanticDecorator
EClassifier=ChangeDescription is not compatible with type EClassifierLiteral=DSemanticDecorator data=[org.eclipse.sirius.diagram.business.internal.metamodel.description.filter.spec.MappingFilterSpec@3b1dc579 (filterKind: HIDE) (semanticConditionExpression: null, viewConditionExpression: aql:self.eContainer().oclAsType(viewpoint::DSemanticDecorator).target = self.oclAsType(viewpoint::DSemanticDecorator).target.eContainer())], Diagnostic ERROR source=org.eclipse.sirius code=1 Nothing will be left after calling oclAsType:
EClassifier=EReference is not compatible with type EClassifierLiteral=DSemanticDecorator data=[org.eclipse.sirius.diagram.business.internal.metamodel.description.filter.spec.MappingFilterSpec@3b1dc579 (filterKind: HIDE) (semanticConditionExpression: null, viewConditionExpression: aql:self.eContainer().oclAsType(viewpoint::DSemanticDecorator).target = self.oclAsType(viewpoint::DSemanticDecorator).target.eContainer())], Diagnostic ERROR source=org.eclipse.sirius code=1 Feature eClassifiers not found in EClass EObject data=[org.eclipse.sirius.diagram.business.internal.metamodel.description.spec.NodeMappingSpec Empty Diagram], Diagnostic ERROR source=org.eclipse.sirius code=1 Feature target not found in EClass EObject data=[org.eclipse.sirius.viewpoint.description.tool.impl.OperationActionImpl@7523a3dc (documentation: ) (name: Model Code, label: null, precondition: aql:OrderedSet{views.target}.eInverse().eContainerOrSelf(genmodel::GenModel)->asSet()->select(m | m.modelDirectory.size() > 0)->size() > 0, forceRefresh: false, elementsToSelect: , inverseSelectionOrder: false) (icon: /org.eclipse.emf.ecoretools.design/icons/full/obj16/GenModel.gif)], Diagnostic ERROR source=org.eclipse.sirius code=1 The m variable has no types data=[org.eclipse.sirius.viewpoint.description.tool.impl.OperationActionImpl@7523a3dc (documentation: ) (name: Model Code, label: null, precondition: aql:OrderedSet{views.target}.eInverse().eContainerOrSelf(genmodel::GenModel)->asSet()->select(m | m.modelDirectory.size() > 0)->size() > 0, forceRefresh: false, elementsToSelect: , inverseSelectionOrder: false) (icon: /org.eclipse.emf.ecoretools.design/icons/full/obj16/GenModel.gif)], Diagnostic ERROR source=org.eclipse.sirius code=1 Feature target not found in EClass EObject data=[org.eclipse.sirius.viewpoint.description.tool.impl.ExternalJavaActionParameterImpl@1b01a0d (name: genmodels, value: aql:OrderedSet{views.target}.eInverse().eContainerOrSelf(genmodel::GenModel)->asSet())], Diagnostic ERROR source=org.eclipse.sirius code=1 Feature target not found in EClass EObject data=[org.eclipse.sirius.viewpoint.description.tool.impl.OperationActionImpl@766a49c7 (documentation: ) (name: Edit Code, label: null, precondition: aql:OrderedSet{views.target}.eInverse().eContainerOrSelf(genmodel::GenModel)->asSet()->select(m | m.editDirectory.size() > 0)->size() > 0, forceRefresh: false, elementsToSelect: , inverseSelectionOrder: false) (icon: /org.eclipse.emf.ecoretools.design/icons/full/obj16/GenModel.gif)], Diagnostic ERROR source=org.eclipse.sirius code=1 The m variable has no types data=[org.eclipse.sirius.viewpoint.description.tool.impl.OperationActionImpl@766a49c7 (documentation: ) (name: Edit Code, label: null, precondition: aql:OrderedSet{views.target}.eInverse().eContainerOrSelf(genmodel::GenModel)->asSet()->select(m | m.editDirectory.size() > 0)->size() > 0, forceRefresh: false, elementsToSelect: , inverseSelectionOrder: false) (icon: /org.eclipse.emf.ecoretools.design/icons/full/obj16/GenModel.gif)], Diagnostic ERROR source=org.eclipse.sirius code=1 Feature target not found in EClass EObject data=[org.eclipse.sirius.viewpoint.description.tool.impl.ExternalJavaActionParameterImpl@7df28f1 (name: genmodels, value: aql:OrderedSet{views.target}.eInverse().eContainerOrSelf(genmodel::GenModel)->asSet())], Diagnostic ERROR source=org.eclipse.sirius code=1 Feature target not found in EClass EObject data=[org.eclipse.sirius.viewpoint.description.tool.impl.OperationActionImpl@75e27856 (documentation: ) (name: Editor Code, label: null, precondition: aql:OrderedSet{views.target}.eInverse().eContainerOrSelf(genmodel::GenModel)->asSet()->select(m | m.editorDirectory.size() > 0)->size() > 0, forceRefresh: false, elementsToSelect: , inverseSelectionOrder: false) (icon: /org.eclipse.emf.ecoretools.design/icons/full/obj16/GenModel.gif)], Diagnostic ERROR source=org.eclipse.sirius code=1 The m variable has no types data=[org.eclipse.sirius.viewpoint.description.tool.impl.OperationActionImpl@75e27856 (documentation: ) (name: Editor Code, label: null, precondition: aql:OrderedSet{views.target}.eInverse().eContainerOrSelf(genmodel::GenModel)->asSet()->select(m | m.editorDirectory.size() > 0)->size() > 0, forceRefresh: false, elementsToSelect: , inverseSelectionOrder: false) (icon: /org.eclipse.emf.ecoretools.design/icons/full/obj16/GenModel.gif)], Diagnostic ERROR source=org.eclipse.sirius code=1 Feature target not found in EClass EObject data=[org.eclipse.sirius.viewpoint.description.tool.impl.ExternalJavaActionParameterImpl@75fd65c (name: genmodels, value: aql:OrderedSet{views.target}.eInverse().eContainerOrSelf(genmodel::GenModel)->asSet())], Diagnostic ERROR source=org.eclipse.sirius code=1 Feature target not found in EClass EObject data=[org.eclipse.sirius.viewpoint.description.tool.impl.OperationActionImpl@4f4c88f9 (documentation: ) (name: Tests Code, label: null, precondition: aql:OrderedSet{views.target}.eInverse().eContainerOrSelf(genmodel::GenModel)->asSet()->select(m | m.testsDirectory.size() > 0)->size() > 0, forceRefresh: false, elementsToSelect: , inverseSelectionOrder: false) (icon: /org.eclipse.emf.ecoretools.design/icons/full/obj16/GenModel.gif)], Diagnostic ERROR source=org.eclipse.sirius code=1 The m variable has no types data=[org.eclipse.sirius.viewpoint.description.tool.impl.OperationActionImpl@4f4c88f9 (documentation: ) (name: Tests Code, label: null, precondition: aql:OrderedSet{views.target}.eInverse().eContainerOrSelf(genmodel::GenModel)->asSet()->select(m | m.testsDirectory.size() > 0)->size() > 0, forceRefresh: false, elementsToSelect: , inverseSelectionOrder: false) (icon: /org.eclipse.emf.ecoretools.design/icons/full/obj16/GenModel.gif)], Diagnostic ERROR source=org.eclipse.sirius code=1 Feature target not found in EClass EObject data=[org.eclipse.sirius.viewpoint.description.tool.impl.ExternalJavaActionParameterImpl@2bc7db89 (name: genmodels, value: aql:OrderedSet{views.target}.eInverse().eContainerOrSelf(genmodel::GenModel)->asSet())], Diagnostic ERROR source=org.eclipse.sirius code=1 Feature target not found in EClass EObject data=[org.eclipse.sirius.viewpoint.description.tool.impl.OperationActionImpl@cb39552 (documentation: ) (name:  All, label: null, precondition: aql:OrderedSet{views.target}.eInverse().eContainerOrSelf(genmodel::GenModel)->asSet()->size() > 0, forceRefresh: false, elementsToSelect: , inverseSelectionOrder: false) (icon: /org.eclipse.emf.ecoretools.design/icons/full/obj16/GenModel.gif)], Diagnostic ERROR source=org.eclipse.sirius code=1 Feature target not found in EClass EObject data=[org.eclipse.sirius.viewpoint.description.tool.impl.ExternalJavaActionParameterImpl@287ae90c (name: genmodels, value: aql:OrderedSet{views.target}.eInverse().eContainerOrSelf(genmodel::GenModel)->asSet())], Diagnostic ERROR source=org.eclipse.sirius code=1 Couldnt find the getDisplayedEClassifiers(EClassifier=DDiagram)' service data=[org.eclipse.sirius.viewpoint.description.tool.impl.SelectionWizardDescriptionImpl@2935fd2c (documentation: ) (name: Add, label: null, precondition: aql:container.oclIsKindOf(ecore::EPackage), forceRefresh: true, elementsToSelect: , inverseSelectionOrder: false) (candidatesExpression: aql:self.getValidsForDiagram(containerView)->asSet() - diagram.getDisplayedEClassifiers(), multiple: true, tree: true, rootExpression: service:rootEPackages, childrenExpression: feature:eContents, message: null, iconPath: /org.eclipse.emf.ecoretools.design/icons/full/etools16/search.gif, windowTitle: Select element to add in diagram, windowImagePath: null)], Diagnostic WARNING source=org.eclipse.sirius.diagram code=1 The Drop tool External EClass from treeview accepts arbitrary elements from the Model Content view as drag source. You should specify a precondition to validate the nature of the dragged element. data=[org.eclipse.sirius.diagram.business.internal.metamodel.description.tool.spec.ContainerDropDescriptionSpec@3ce443f9 (documentation: ) (name: External EClass from treeview, label: null, precondition: , forceRefresh: true, elementsToSelect: , inverseSelectionOrder: false) (dragSource: PROJECT_EXPLORER, moveEdges: false)], Diagnostic INFO source=org.eclipse.sirius.diagram code=80 The constraint "No reconnect on regions" is disabled.  It will not be evaluated. data=[], Diagnostic WARNING source=org.eclipse.sirius.diagram code=1 The Drop tool Drop EPackage into EPackage accepts arbitrary elements from the Model Content view as drag source. You should specify a precondition to validate the nature of the dragged element. data=[org.eclipse.sirius.diagram.business.internal.metamodel.description.tool.spec.ContainerDropDescriptionSpec@794366a5 (documentation: ) (name: Drop EPackage into EPackage, label: null, precondition: , forceRefresh: false, elementsToSelect: , inverseSelectionOrder: false) (dragSource: BOTH, moveEdges: false)], Diagnostic WARNING source=org.eclipse.sirius code=1 There is no associated meta-model. data=[org.eclipse.sirius.table.business.internal.metamodel.description.spec.EditionTableDescriptionSpec@2a87ba34 (documentation: <html>
<head>
</head>
<body>
<p>A tabular editor (spreadsheet-like) of the entities in an Ecore model.</p>
<br>
<img src="/icons/full/wizban/classes.png"/>
</body>
</html>


) (endUserDocumentation: A tabular editor (spreadsheet-like) of the entities in an Ecore model., name: Classes, label: Classes in a spreadsheet, titleExpression: aql:self.name + ' class table', initialisation: false, showOnStartup: false, preconditionExpression: , domainClass: ecore.EPackage, initialHeaderColumnWidth: 0)], Diagnostic WARNING source=org.eclipse.sirius.diagram code=1 The Drop tool External EPackageTo Analyze from treeview accepts arbitrary elements from the Model Content view as drag source. You should specify a precondition to validate the nature of the dragged element. data=[org.eclipse.sirius.diagram.business.internal.metamodel.description.tool.spec.ContainerDropDescriptionSpec@1f916219 (documentation: ) (name: External EPackageTo Analyze from treeview, label: null, precondition: , forceRefresh: true, elementsToSelect: , inverseSelectionOrder: false) (dragSource: PROJECT_EXPLORER, moveEdges: false)], Diagnostic INFO source=org.eclipse.sirius code=1 Always false:
Nothing inferred when self (EClassifier=GenPackage) is type of EClassifierLiteral=GenFeature data=[org.eclipse.sirius.table.business.internal.metamodel.description.spec.FeatureColumnMappingSpec@63e5b8aa (name: Category, label: null) (semanticElements: null) (headerLabelExpression: Category, initialWidth: 0) (canEdit: aql:self.oclIsTypeOf(genmodel::GenFeature), featureName: propertyCategory, labelExpression: aql:self->filter(genmodel::GenFeature).propertyCategory->first(), featureParentExpression: null)], Diagnostic INFO source=org.eclipse.sirius code=1 Always false:
Nothing inferred when self (EClassifier=GenPackage) is type of EClassifierLiteral=GenFeature data=[org.eclipse.sirius.table.business.internal.metamodel.description.spec.FeatureColumnMappingSpec@64f4f12 (name: Decription, label: null) (semanticElements: null) (headerLabelExpression: Description, initialWidth: 0) (canEdit: aql:self.oclIsTypeOf(genmodel::GenFeature), featureName: propertyDescription, labelExpression: aql:self->filter(genmodel::GenFeature).propertyDescription->first(), featureParentExpression: null)]]
	at org.junit.Assert.fail(Assert.java:88)
	at org.eclipse.emf.ecoretools.design.tests.VsmValidationTests.isValid(VsmValidationTests.java:51)


Results :

Failed tests: 
  VsmValidationTests.isValid:51 The VSM is not valid it has errors : Diagnostic ERROR source=org.eclipse.emf.ecore code=0 Diagnosis of org.eclipse.sirius.viewpoint.description.impl.GroupImpl@68c7ef83{platform:/plugin/org.eclipse.emf.ecoretools.design/description/ecore.odesign#/} data=[org.eclipse.sirius.viewpoint.description.impl.GroupImpl@68c7ef83 (documentation: FORCE_LEGACY_PROPERTIES, name: EcoreTools, version: 11.1.1.201610211630)] [Diagnostic ERROR source=org.eclipse.sirius code=1 Nothing will be left after calling oclAsType:
EClassifier=EClass is not compatible with type EClassifierLiteral=DEdge data=[org.eclipse.sirius.diagram.business.internal.metamodel.description.filter.spec.MappingFilterSpec@2b38b1f (filterKind: HIDE) (semanticConditionExpression: null, viewConditionExpression: aql:not self.oclAsType(diagram::DEdge).sourceNode.oclAsType(viewpoint::DSemanticDecorator).target.oclAsType(ecore::EClass).eSuperTypes->includes(self.oclAsType(diagram::DEdge).targetNode.oclAsType(viewpoint::DSemanticDecorator).target))], Diagnostic ERROR source=org.eclipse.sirius code=1 Nothing will be left after calling oclAsType:
EClassifier=EClass is not compatible with type EClassifierLiteral=DEdge data=[org.eclipse.sirius.diagram.business.internal.metamodel.description.filter.spec.MappingFilterSpec@2b38b1f (filterKind: HIDE) (semanticConditionExpression: null, viewConditionExpression: aql:not self.oclAsType(diagram::DEdge).sourceNode.oclAsType(viewpoint::DSemanticDecorator).target.oclAsType(ecore::EClass).eSuperTypes->includes(self.oclAsType(diagram::DEdge).targetNode.oclAsType(viewpoint::DSemanticDecorator).target))], Diagnostic ERROR source=org.eclipse.sirius code=1 Nothing will be left after calling oclAsType:
EClassifier=EClass is not compatible with type EClassifierLiteral=DSemanticDecorator
EClassifier=EAnnotation is not compatible with type EClassifierLiteral=DSemanticDecorator
EClassifier=GenAnnotation is not compatible with type EClassifierLiteral=DSemanticDecorator
EClassifier=DAnalysisCustomData is not compatible with type EClassifierLiteral=DSemanticDecorator
EClassifier=AnnotationEntry is not compatible with type EClassifierLiteral=DSemanticDecorator
EClassifier=TableDescription is not compatible with type EClassifierLiteral=DSemanticDecorator
EClassifier=ChangeDescription is not compatible with type EClassifierLiteral=DSemanticDecorator data=[org.eclipse.sirius.diagram.business.internal.metamodel.description.filter.spec.MappingFilterSpec@3b1dc579 (filterKind: HIDE) (semanticConditionExpression: null, viewConditionExpression: aql:self.eContainer().oclAsType(viewpoint::DSemanticDecorator).target = self.oclAsType(viewpoint::DSemanticDecorator).target.eContainer())], Diagnostic ERROR source=org.eclipse.sirius code=1 Nothing will be left after calling oclAsType:
EClassifier=EReference is not compatible with type EClassifierLiteral=DSemanticDecorator data=[org.eclipse.sirius.diagram.business.internal.metamodel.description.filter.spec.MappingFilterSpec@3b1dc579 (filterKind: HIDE) (semanticConditionExpression: null, viewConditionExpression: aql:self.eContainer().oclAsType(viewpoint::DSemanticDecorator).target = self.oclAsType(viewpoint::DSemanticDecorator).target.eContainer())], Diagnostic ERROR source=org.eclipse.sirius code=1 Feature eClassifiers not found in EClass EObject data=[org.eclipse.sirius.diagram.business.internal.metamodel.description.spec.NodeMappingSpec Empty Diagram], Diagnostic ERROR source=org.eclipse.sirius code=1 Feature target not found in EClass EObject data=[org.eclipse.sirius.viewpoint.description.tool.impl.OperationActionImpl@7523a3dc (documentation: ) (name: Model Code, label: null, precondition: aql:OrderedSet{views.target}.eInverse().eContainerOrSelf(genmodel::GenModel)->asSet()->select(m | m.modelDirectory.size() > 0)->size() > 0, forceRefresh: false, elementsToSelect: , inverseSelectionOrder: false) (icon: /org.eclipse.emf.ecoretools.design/icons/full/obj16/GenModel.gif)], Diagnostic ERROR source=org.eclipse.sirius code=1 The m variable has no types data=[org.eclipse.sirius.viewpoint.description.tool.impl.OperationActionImpl@7523a3dc (documentation: ) (name: Model Code, label: null, precondition: aql:OrderedSet{views.target}.eInverse().eContainerOrSelf(genmodel::GenModel)->asSet()->select(m | m.modelDirectory.size() > 0)->size() > 0, forceRefresh: false, elementsToSelect: , inverseSelectionOrder: false) (icon: /org.eclipse.emf.ecoretools.design/icons/full/obj16/GenModel.gif)], Diagnostic ERROR source=org.eclipse.sirius code=1 Feature target not found in EClass EObject data=[org.eclipse.sirius.viewpoint.description.tool.impl.ExternalJavaActionParameterImpl@1b01a0d (name: genmodels, value: aql:OrderedSet{views.target}.eInverse().eContainerOrSelf(genmodel::GenModel)->asSet())], Diagnostic ERROR source=org.eclipse.sirius code=1 Feature target not found in EClass EObject data=[org.eclipse.sirius.viewpoint.description.tool.impl.OperationActionImpl@766a49c7 (documentation: ) (name: Edit Code, label: null, precondition: aql:OrderedSet{views.target}.eInverse().eContainerOrSelf(genmodel::GenModel)->asSet()->select(m | m.editDirectory.size() > 0)->size() > 0, forceRefresh: false, elementsToSelect: , inverseSelectionOrder: false) (icon: /org.eclipse.emf.ecoretools.design/icons/full/obj16/GenModel.gif)], Diagnostic ERROR source=org.eclipse.sirius code=1 The m variable has no types data=[org.eclipse.sirius.viewpoint.description.tool.impl.OperationActionImpl@766a49c7 (documentation: ) (name: Edit Code, label: null, precondition: aql:OrderedSet{views.target}.eInverse().eContainerOrSelf(genmodel::GenModel)->asSet()->select(m | m.editDirectory.size() > 0)->size() > 0, forceRefresh: false, elementsToSelect: , inverseSelectionOrder: false) (icon: /org.eclipse.emf.ecoretools.design/icons/full/obj16/GenModel.gif)], Diagnostic ERROR source=org.eclipse.sirius code=1 Feature target not found in EClass EObject data=[org.eclipse.sirius.viewpoint.description.tool.impl.ExternalJavaActionParameterImpl@7df28f1 (name: genmodels, value: aql:OrderedSet{views.target}.eInverse().eContainerOrSelf(genmodel::GenModel)->asSet())], Diagnostic ERROR source=org.eclipse.sirius code=1 Feature target not found in EClass EObject data=[org.eclipse.sirius.viewpoint.description.tool.impl.OperationActionImpl@75e27856 (documentation: ) (name: Editor Code, label: null, precondition: aql:OrderedSet{views.target}.eInverse().eContainerOrSelf(genmodel::GenModel)->asSet()->select(m | m.editorDirectory.size() > 0)->size() > 0, forceRefresh: false, elementsToSelect: , inverseSelectionOrder: false) (icon: /org.eclipse.emf.ecoretools.design/icons/full/obj16/GenModel.gif)], Diagnostic ERROR source=org.eclipse.sirius code=1 The m variable has no types data=[org.eclipse.sirius.viewpoint.description.tool.impl.OperationActionImpl@75e27856 (documentation: ) (name: Editor Code, label: null, precondition: aql:OrderedSet{views.target}.eInverse().eContainerOrSelf(genmodel::GenModel)->asSet()->select(m | m.editorDirectory.size() > 0)->size() > 0, forceRefresh: false, elementsToSelect: , inverseSelectionOrder: false) (icon: /org.eclipse.emf.ecoretools.design/icons/full/obj16/GenModel.gif)], Diagnostic ERROR source=org.eclipse.sirius code=1 Feature target not found in EClass EObject data=[org.eclipse.sirius.viewpoint.description.tool.impl.ExternalJavaActionParameterImpl@75fd65c (name: genmodels, value: aql:OrderedSet{views.target}.eInverse().eContainerOrSelf(genmodel::GenModel)->asSet())], Diagnostic ERROR source=org.eclipse.sirius code=1 Feature target not found in EClass EObject data=[org.eclipse.sirius.viewpoint.description.tool.impl.OperationActionImpl@4f4c88f9 (documentation: ) (name: Tests Code, label: null, precondition: aql:OrderedSet{views.target}.eInverse().eContainerOrSelf(genmodel::GenModel)->asSet()->select(m | m.testsDirectory.size() > 0)->size() > 0, forceRefresh: false, elementsToSelect: , inverseSelectionOrder: false) (icon: /org.eclipse.emf.ecoretools.design/icons/full/obj16/GenModel.gif)], Diagnostic ERROR source=org.eclipse.sirius code=1 The m variable has no types data=[org.eclipse.sirius.viewpoint.description.tool.impl.OperationActionImpl@4f4c88f9 (documentation: ) (name: Tests Code, label: null, precondition: aql:OrderedSet{views.target}.eInverse().eContainerOrSelf(genmodel::GenModel)->asSet()->select(m | m.testsDirectory.size() > 0)->size() > 0, forceRefresh: false, elementsToSelect: , inverseSelectionOrder: false) (icon: /org.eclipse.emf.ecoretools.design/icons/full/obj16/GenModel.gif)], Diagnostic ERROR source=org.eclipse.sirius code=1 Feature target not found in EClass EObject data=[org.eclipse.sirius.viewpoint.description.tool.impl.ExternalJavaActionParameterImpl@2bc7db89 (name: genmodels, value: aql:OrderedSet{views.target}.eInverse().eContainerOrSelf(genmodel::GenModel)->asSet())], Diagnostic ERROR source=org.eclipse.sirius code=1 Feature target not found in EClass EObject data=[org.eclipse.sirius.viewpoint.description.tool.impl.OperationActionImpl@cb39552 (documentation: ) (name:  All, label: null, precondition: aql:OrderedSet{views.target}.eInverse().eContainerOrSelf(genmodel::GenModel)->asSet()->size() > 0, forceRefresh: false, elementsToSelect: , inverseSelectionOrder: false) (icon: /org.eclipse.emf.ecoretools.design/icons/full/obj16/GenModel.gif)], Diagnostic ERROR source=org.eclipse.sirius code=1 Feature target not found in EClass EObject data=[org.eclipse.sirius.viewpoint.description.tool.impl.ExternalJavaActionParameterImpl@287ae90c (name: genmodels, value: aql:OrderedSet{views.target}.eInverse().eContainerOrSelf(genmodel::GenModel)->asSet())], Diagnostic ERROR source=org.eclipse.sirius code=1 Couldnt find the getDisplayedEClassifiers(EClassifier=DDiagram)' service data=[org.eclipse.sirius.viewpoint.description.tool.impl.SelectionWizardDescriptionImpl@2935fd2c (documentation: ) (name: Add, label: null, precondition: aql:container.oclIsKindOf(ecore::EPackage), forceRefresh: true, elementsToSelect: , inverseSelectionOrder: false) (candidatesExpression: aql:self.getValidsForDiagram(containerView)->asSet() - diagram.getDisplayedEClassifiers(), multiple: true, tree: true, rootExpression: service:rootEPackages, childrenExpression: feature:eContents, message: null, iconPath: /org.eclipse.emf.ecoretools.design/icons/full/etools16/search.gif, windowTitle: Select element to add in diagram, windowImagePath: null)], Diagnostic WARNING source=org.eclipse.sirius.diagram code=1 The Drop tool External EClass from treeview accepts arbitrary elements from the Model Content view as drag source. You should specify a precondition to validate the nature of the dragged element. data=[org.eclipse.sirius.diagram.business.internal.metamodel.description.tool.spec.ContainerDropDescriptionSpec@3ce443f9 (documentation: ) (name: External EClass from treeview, label: null, precondition: , forceRefresh: true, elementsToSelect: , inverseSelectionOrder: false) (dragSource: PROJECT_EXPLORER, moveEdges: false)], Diagnostic INFO source=org.eclipse.sirius.diagram code=80 The constraint "No reconnect on regions" is disabled.  It will not be evaluated. data=[], Diagnostic WARNING source=org.eclipse.sirius.diagram code=1 The Drop tool Drop EPackage into EPackage accepts arbitrary elements from the Model Content view as drag source. You should specify a precondition to validate the nature of the dragged element. data=[org.eclipse.sirius.diagram.business.internal.metamodel.description.tool.spec.ContainerDropDescriptionSpec@794366a5 (documentation: ) (name: Drop EPackage into EPackage, label: null, precondition: , forceRefresh: false, elementsToSelect: , inverseSelectionOrder: false) (dragSource: BOTH, moveEdges: false)], Diagnostic WARNING source=org.eclipse.sirius code=1 There is no associated meta-model. data=[org.eclipse.sirius.table.business.internal.metamodel.description.spec.EditionTableDescriptionSpec@2a87ba34 (documentation: <html>
<head>
</head>
<body>
<p>A tabular editor (spreadsheet-like) of the entities in an Ecore model.</p>
<br>
<img src="/icons/full/wizban/classes.png"/>
</body>
</html>


) (endUserDocumentation: A tabular editor (spreadsheet-like) of the entities in an Ecore model., name: Classes, label: Classes in a spreadsheet, titleExpression: aql:self.name + ' class table', initialisation: false, showOnStartup: false, preconditionExpression: , domainClass: ecore.EPackage, initialHeaderColumnWidth: 0)], Diagnostic WARNING source=org.eclipse.sirius.diagram code=1 The Drop tool External EPackageTo Analyze from treeview accepts arbitrary elements from the Model Content view as drag source. You should specify a precondition to validate the nature of the dragged element. data=[org.eclipse.sirius.diagram.business.internal.metamodel.description.tool.spec.ContainerDropDescriptionSpec@1f916219 (documentation: ) (name: External EPackageTo Analyze from treeview, label: null, precondition: , forceRefresh: true, elementsToSelect: , inverseSelectionOrder: false) (dragSource: PROJECT_EXPLORER, moveEdges: false)], Diagnostic INFO source=org.eclipse.sirius code=1 Always false:
Nothing inferred when self (EClassifier=GenPackage) is type of EClassifierLiteral=GenFeature data=[org.eclipse.sirius.table.business.internal.metamodel.description.spec.FeatureColumnMappingSpec@63e5b8aa (name: Category, label: null) (semanticElements: null) (headerLabelExpression: Category, initialWidth: 0) (canEdit: aql:self.oclIsTypeOf(genmodel::GenFeature), featureName: propertyCategory, labelExpression: aql:self->filter(genmodel::GenFeature).propertyCategory->first(), featureParentExpression: null)], Diagnostic INFO source=org.eclipse.sirius code=1 Always false:
Nothing inferred when self (EClassifier=GenPackage) is type of EClassifierLiteral=GenFeature data=[org.eclipse.sirius.table.business.internal.metamodel.description.spec.FeatureColumnMappingSpec@64f4f12 (name: Decription, label: null) (semanticElements: null) (headerLabelExpression: Description, initialWidth: 0) (canEdit: aql:self.oclIsTypeOf(genmodel::GenFeature), featureName: propertyDescription, labelExpression: aql:self->filter(genmodel::GenFeature).propertyDescription->first(), featureParentExpression: null)]]

Tests run: 506, Failures: 1, Errors: 0, Skipped: 0

[ERROR] There are test failures.

Please refer to /jobs/genie.sirius/ecoretools-3.2/workspace/org.eclipse.emf.ecoretools.design.tests/target/surefire-reports for the individual test results.
[INFO] 
[INFO] --- tycho-pack200a-plugin:0.23.1:normalize (pack200-normalize) @ org.eclipse.emf.ecoretools.design.tests ---
[INFO] Pack200 normalizing jar /jobs/genie.sirius/ecoretools-3.2/workspace/org.eclipse.emf.ecoretools.design.tests/target/org.eclipse.emf.ecoretools.design.tests-3.2.1-SNAPSHOT.jar
[INFO] 
[INFO] --- eclipse-jarsigner-plugin:1.0.4:sign (sign) @ org.eclipse.emf.ecoretools.design.tests ---
[INFO] Signed org.eclipse.emf.ecoretools:org.eclipse.emf.ecoretools.design.tests:eclipse-test-plugin:3.2.1-SNAPSHOT in 0 seconds.
[INFO] Signed org.eclipse.emf.ecoretools:org.eclipse.emf.ecoretools.design.tests:java-source:sources:3.2.1-SNAPSHOT in 0 seconds.
[INFO] 
[INFO] --- tycho-pack200b-plugin:0.23.1:pack (pack200-pack) @ org.eclipse.emf.ecoretools.design.tests ---
[INFO] Pack200 packing jar /jobs/genie.sirius/ecoretools-3.2/workspace/org.eclipse.emf.ecoretools.design.tests/target/org.eclipse.emf.ecoretools.design.tests-3.2.1-SNAPSHOT.jar
[INFO] 
[INFO] ------------------------------------------------------------------------
[INFO] Building org.eclipse.emf.ecoretools.ui 3.2.1-SNAPSHOT
[INFO] ------------------------------------------------------------------------
[INFO] 
[INFO] --- maven-clean-plugin:2.5:clean (default-clean) @ org.eclipse.emf.ecoretools.ui ---
[INFO] Deleting /jobs/genie.sirius/ecoretools-3.2/workspace/org.eclipse.emf.ecoretools.ui/target
[INFO] 
[INFO] --- tycho-packaging-plugin:0.23.1:build-qualifier (default-build-qualifier) @ org.eclipse.emf.ecoretools.ui ---
[INFO] The project's OSGi version is 3.2.1.201801160715
[INFO] 
[INFO] --- tycho-packaging-plugin:0.23.1:validate-id (default-validate-id) @ org.eclipse.emf.ecoretools.ui ---
[INFO] 
[INFO] --- tycho-packaging-plugin:0.23.1:validate-version (default-validate-version) @ org.eclipse.emf.ecoretools.ui ---
[INFO] 
[INFO] --- maven-resources-plugin:2.4.1:resources (default-resources) @ org.eclipse.emf.ecoretools.ui ---
[INFO] Using 'ISO-8859-1' encoding to copy filtered resources.
[INFO] skip non existing resourceDirectory /jobs/genie.sirius/ecoretools-3.2/workspace/org.eclipse.emf.ecoretools.ui/src/main/resources
[INFO] 
[INFO] --- tycho-compiler-plugin:0.23.1:compile (default-compile) @ org.eclipse.emf.ecoretools.ui ---
[INFO] Compiling 20 source files to /jobs/genie.sirius/ecoretools-3.2/workspace/org.eclipse.emf.ecoretools.ui/target/classes
[INFO] 
[INFO] --- maven-resources-plugin:2.4.1:testResources (default-testResources) @ org.eclipse.emf.ecoretools.ui ---
[INFO] Using 'ISO-8859-1' encoding to copy filtered resources.
[INFO] skip non existing resourceDirectory /jobs/genie.sirius/ecoretools-3.2/workspace/org.eclipse.emf.ecoretools.ui/src/test/resources
[INFO] 
[INFO] --- tycho-source-plugin:0.23.1:plugin-source (plugin-source) @ org.eclipse.emf.ecoretools.ui ---
[INFO] Building jar: /jobs/genie.sirius/ecoretools-3.2/workspace/org.eclipse.emf.ecoretools.ui/target/org.eclipse.emf.ecoretools.ui-3.2.1-SNAPSHOT-sources.jar
[INFO] 
[INFO] --- target-platform-configuration:0.23.1:target-platform (default-target-platform) @ org.eclipse.emf.ecoretools.ui ---
[INFO] 
[INFO] --- tycho-packaging-plugin:0.23.1:package-plugin (default-package-plugin) @ org.eclipse.emf.ecoretools.ui ---
[INFO] Building jar: /jobs/genie.sirius/ecoretools-3.2/workspace/org.eclipse.emf.ecoretools.ui/target/org.eclipse.emf.ecoretools.ui-3.2.1-SNAPSHOT.jar
[INFO] 
[INFO] --- tycho-p2-plugin:0.23.1:p2-metadata-default (default-p2-metadata-default) @ org.eclipse.emf.ecoretools.ui ---
[INFO] 
[INFO] --- tycho-pack200a-plugin:0.23.1:normalize (pack200-normalize) @ org.eclipse.emf.ecoretools.ui ---
[INFO] Pack200 normalizing jar /jobs/genie.sirius/ecoretools-3.2/workspace/org.eclipse.emf.ecoretools.ui/target/org.eclipse.emf.ecoretools.ui-3.2.1-SNAPSHOT.jar
[INFO] 
[INFO] --- eclipse-jarsigner-plugin:1.0.4:sign (sign) @ org.eclipse.emf.ecoretools.ui ---
[INFO] Signed org.eclipse.emf.ecoretools:org.eclipse.emf.ecoretools.ui:eclipse-plugin:3.2.1-SNAPSHOT in 0 seconds.
[INFO] Signed org.eclipse.emf.ecoretools:org.eclipse.emf.ecoretools.ui:java-source:sources:3.2.1-SNAPSHOT in 0 seconds.
[INFO] 
[INFO] --- tycho-pack200b-plugin:0.23.1:pack (pack200-pack) @ org.eclipse.emf.ecoretools.ui ---
[INFO] Pack200 packing jar /jobs/genie.sirius/ecoretools-3.2/workspace/org.eclipse.emf.ecoretools.ui/target/org.eclipse.emf.ecoretools.ui-3.2.1-SNAPSHOT.jar
[INFO] 
[INFO] ------------------------------------------------------------------------
[INFO] Building org.eclipse.emf.ecoretools.doc 3.2.1-SNAPSHOT
[INFO] ------------------------------------------------------------------------
[INFO] 
[INFO] --- maven-clean-plugin:2.5:clean (default-clean) @ org.eclipse.emf.ecoretools.doc ---
[INFO] Deleting /jobs/genie.sirius/ecoretools-3.2/workspace/org.eclipse.emf.ecoretools.doc/target
[INFO] 
[INFO] --- tycho-packaging-plugin:0.23.1:build-qualifier (default-build-qualifier) @ org.eclipse.emf.ecoretools.doc ---
[INFO] The project's OSGi version is 3.2.1.201801160715
[INFO] 
[INFO] --- tycho-packaging-plugin:0.23.1:validate-id (default-validate-id) @ org.eclipse.emf.ecoretools.doc ---
[INFO] 
[INFO] --- tycho-packaging-plugin:0.23.1:validate-version (default-validate-version) @ org.eclipse.emf.ecoretools.doc ---
[INFO] 
[INFO] --- maven-resources-plugin:2.4.1:resources (default-resources) @ org.eclipse.emf.ecoretools.doc ---
[INFO] Using 'ISO-8859-1' encoding to copy filtered resources.
[INFO] skip non existing resourceDirectory /jobs/genie.sirius/ecoretools-3.2/workspace/org.eclipse.emf.ecoretools.doc/src/main/resources
[INFO] 
[INFO] --- tycho-compiler-plugin:0.23.1:compile (default-compile) @ org.eclipse.emf.ecoretools.doc ---
[INFO] 
[INFO] --- maven-resources-plugin:2.4.1:testResources (default-testResources) @ org.eclipse.emf.ecoretools.doc ---
[INFO] Using 'ISO-8859-1' encoding to copy filtered resources.
[INFO] skip non existing resourceDirectory /jobs/genie.sirius/ecoretools-3.2/workspace/org.eclipse.emf.ecoretools.doc/src/test/resources
[INFO] 
[INFO] --- tycho-source-plugin:0.23.1:plugin-source (plugin-source) @ org.eclipse.emf.ecoretools.doc ---
[INFO] 
[INFO] --- target-platform-configuration:0.23.1:target-platform (default-target-platform) @ org.eclipse.emf.ecoretools.doc ---
[INFO] 
[INFO] --- tycho-packaging-plugin:0.23.1:package-plugin (default-package-plugin) @ org.eclipse.emf.ecoretools.doc ---
[INFO] Building jar: /jobs/genie.sirius/ecoretools-3.2/workspace/org.eclipse.emf.ecoretools.doc/target/org.eclipse.emf.ecoretools.doc-3.2.1-SNAPSHOT.jar
[INFO] 
[INFO] --- tycho-p2-plugin:0.23.1:p2-metadata-default (default-p2-metadata-default) @ org.eclipse.emf.ecoretools.doc ---
[INFO] 
[INFO] --- tycho-pack200a-plugin:0.23.1:normalize (pack200-normalize) @ org.eclipse.emf.ecoretools.doc ---
[INFO] Pack200 normalizing jar /jobs/genie.sirius/ecoretools-3.2/workspace/org.eclipse.emf.ecoretools.doc/target/org.eclipse.emf.ecoretools.doc-3.2.1-SNAPSHOT.jar
[INFO] 
[INFO] --- eclipse-jarsigner-plugin:1.0.4:sign (sign) @ org.eclipse.emf.ecoretools.doc ---
[INFO] Signed org.eclipse.emf.ecoretools:org.eclipse.emf.ecoretools.doc:eclipse-plugin:3.2.1-SNAPSHOT in 1 seconds.
[INFO] 
[INFO] --- tycho-pack200b-plugin:0.23.1:pack (pack200-pack) @ org.eclipse.emf.ecoretools.doc ---
[INFO] Pack200 packing jar /jobs/genie.sirius/ecoretools-3.2/workspace/org.eclipse.emf.ecoretools.doc/target/org.eclipse.emf.ecoretools.doc-3.2.1-SNAPSHOT.jar
[INFO] 
[INFO] ------------------------------------------------------------------------
[INFO] Building org.eclipse.emf.ecoretools.tabbedproperties 3.2.1-SNAPSHOT
[INFO] ------------------------------------------------------------------------
[INFO] 
[INFO] --- maven-clean-plugin:2.5:clean (default-clean) @ org.eclipse.emf.ecoretools.tabbedproperties ---
[INFO] Deleting /jobs/genie.sirius/ecoretools-3.2/workspace/org.eclipse.emf.ecoretools.tabbedproperties/target
[INFO] 
[INFO] --- tycho-packaging-plugin:0.23.1:build-qualifier (default-build-qualifier) @ org.eclipse.emf.ecoretools.tabbedproperties ---
[INFO] The project's OSGi version is 3.2.1.201801160715
[INFO] 
[INFO] --- tycho-packaging-plugin:0.23.1:validate-id (default-validate-id) @ org.eclipse.emf.ecoretools.tabbedproperties ---
[INFO] 
[INFO] --- tycho-packaging-plugin:0.23.1:validate-version (default-validate-version) @ org.eclipse.emf.ecoretools.tabbedproperties ---
[INFO] 
[INFO] --- maven-resources-plugin:2.4.1:resources (default-resources) @ org.eclipse.emf.ecoretools.tabbedproperties ---
[INFO] Using 'ISO-8859-1' encoding to copy filtered resources.
[INFO] skip non existing resourceDirectory /jobs/genie.sirius/ecoretools-3.2/workspace/org.eclipse.emf.ecoretools.tabbedproperties/src/main/resources
[INFO] 
[INFO] --- tycho-compiler-plugin:0.23.1:compile (default-compile) @ org.eclipse.emf.ecoretools.tabbedproperties ---
[INFO] Compiling 39 source files to /jobs/genie.sirius/ecoretools-3.2/workspace/org.eclipse.emf.ecoretools.tabbedproperties/target/classes
[INFO] 
[INFO] --- maven-resources-plugin:2.4.1:testResources (default-testResources) @ org.eclipse.emf.ecoretools.tabbedproperties ---
[INFO] Using 'ISO-8859-1' encoding to copy filtered resources.
[INFO] skip non existing resourceDirectory /jobs/genie.sirius/ecoretools-3.2/workspace/org.eclipse.emf.ecoretools.tabbedproperties/src/test/resources
[INFO] 
[INFO] --- tycho-source-plugin:0.23.1:plugin-source (plugin-source) @ org.eclipse.emf.ecoretools.tabbedproperties ---
[INFO] Building jar: /jobs/genie.sirius/ecoretools-3.2/workspace/org.eclipse.emf.ecoretools.tabbedproperties/target/org.eclipse.emf.ecoretools.tabbedproperties-3.2.1-SNAPSHOT-sources.jar
[INFO] 
[INFO] --- target-platform-configuration:0.23.1:target-platform (default-target-platform) @ org.eclipse.emf.ecoretools.tabbedproperties ---
[INFO] 
[INFO] --- tycho-packaging-plugin:0.23.1:package-plugin (default-package-plugin) @ org.eclipse.emf.ecoretools.tabbedproperties ---
[INFO] Building jar: /jobs/genie.sirius/ecoretools-3.2/workspace/org.eclipse.emf.ecoretools.tabbedproperties/target/org.eclipse.emf.ecoretools.tabbedproperties-3.2.1-SNAPSHOT.jar
[INFO] 
[INFO] --- tycho-p2-plugin:0.23.1:p2-metadata-default (default-p2-metadata-default) @ org.eclipse.emf.ecoretools.tabbedproperties ---
[INFO] 
[INFO] --- tycho-pack200a-plugin:0.23.1:normalize (pack200-normalize) @ org.eclipse.emf.ecoretools.tabbedproperties ---
[INFO] Pack200 normalizing jar /jobs/genie.sirius/ecoretools-3.2/workspace/org.eclipse.emf.ecoretools.tabbedproperties/target/org.eclipse.emf.ecoretools.tabbedproperties-3.2.1-SNAPSHOT.jar
[INFO] 
[INFO] --- eclipse-jarsigner-plugin:1.0.4:sign (sign) @ org.eclipse.emf.ecoretools.tabbedproperties ---
[INFO] Signed org.eclipse.emf.ecoretools:org.eclipse.emf.ecoretools.tabbedproperties:eclipse-plugin:3.2.1-SNAPSHOT in 0 seconds.
[INFO] Signed org.eclipse.emf.ecoretools:org.eclipse.emf.ecoretools.tabbedproperties:java-source:sources:3.2.1-SNAPSHOT in 0 seconds.
[INFO] 
[INFO] --- tycho-pack200b-plugin:0.23.1:pack (pack200-pack) @ org.eclipse.emf.ecoretools.tabbedproperties ---
[INFO] Pack200 packing jar /jobs/genie.sirius/ecoretools-3.2/workspace/org.eclipse.emf.ecoretools.tabbedproperties/target/org.eclipse.emf.ecoretools.tabbedproperties-3.2.1-SNAPSHOT.jar
[INFO] 
[INFO] ------------------------------------------------------------------------
[INFO] Building org.eclipse.emf.ecoretools.properties 3.2.1-SNAPSHOT
[INFO] ------------------------------------------------------------------------
[INFO] 
[INFO] --- maven-clean-plugin:2.5:clean (default-clean) @ org.eclipse.emf.ecoretools.properties ---
[INFO] Deleting /jobs/genie.sirius/ecoretools-3.2/workspace/org.eclipse.emf.ecoretools.properties/target
[INFO] 
[INFO] --- tycho-packaging-plugin:0.23.1:build-qualifier (default-build-qualifier) @ org.eclipse.emf.ecoretools.properties ---
[INFO] The project's OSGi version is 3.2.1.201801160715
[INFO] 
[INFO] --- tycho-packaging-plugin:0.23.1:validate-id (default-validate-id) @ org.eclipse.emf.ecoretools.properties ---
[INFO] 
[INFO] --- tycho-packaging-plugin:0.23.1:validate-version (default-validate-version) @ org.eclipse.emf.ecoretools.properties ---
[INFO] 
[INFO] --- maven-resources-plugin:2.4.1:resources (default-resources) @ org.eclipse.emf.ecoretools.properties ---
[INFO] Using 'ISO-8859-1' encoding to copy filtered resources.
[INFO] skip non existing resourceDirectory /jobs/genie.sirius/ecoretools-3.2/workspace/org.eclipse.emf.ecoretools.properties/src/main/resources
[INFO] 
[INFO] --- tycho-compiler-plugin:0.23.1:compile (default-compile) @ org.eclipse.emf.ecoretools.properties ---
[INFO] Compiling 45 source files to /jobs/genie.sirius/ecoretools-3.2/workspace/org.eclipse.emf.ecoretools.properties/target/classes
[INFO] 
[INFO] --- maven-resources-plugin:2.4.1:testResources (default-testResources) @ org.eclipse.emf.ecoretools.properties ---
[INFO] Using 'ISO-8859-1' encoding to copy filtered resources.
[INFO] skip non existing resourceDirectory /jobs/genie.sirius/ecoretools-3.2/workspace/org.eclipse.emf.ecoretools.properties/src/test/resources
[INFO] 
[INFO] --- tycho-source-plugin:0.23.1:plugin-source (plugin-source) @ org.eclipse.emf.ecoretools.properties ---
[INFO] Building jar: /jobs/genie.sirius/ecoretools-3.2/workspace/org.eclipse.emf.ecoretools.properties/target/org.eclipse.emf.ecoretools.properties-3.2.1-SNAPSHOT-sources.jar
[INFO] 
[INFO] --- target-platform-configuration:0.23.1:target-platform (default-target-platform) @ org.eclipse.emf.ecoretools.properties ---
[INFO] 
[INFO] --- tycho-packaging-plugin:0.23.1:package-plugin (default-package-plugin) @ org.eclipse.emf.ecoretools.properties ---
[INFO] Building jar: /jobs/genie.sirius/ecoretools-3.2/workspace/org.eclipse.emf.ecoretools.properties/target/org.eclipse.emf.ecoretools.properties-3.2.1-SNAPSHOT.jar
[INFO] 
[INFO] --- tycho-p2-plugin:0.23.1:p2-metadata-default (default-p2-metadata-default) @ org.eclipse.emf.ecoretools.properties ---
[INFO] 
[INFO] --- tycho-pack200a-plugin:0.23.1:normalize (pack200-normalize) @ org.eclipse.emf.ecoretools.properties ---
[INFO] Pack200 normalizing jar /jobs/genie.sirius/ecoretools-3.2/workspace/org.eclipse.emf.ecoretools.properties/target/org.eclipse.emf.ecoretools.properties-3.2.1-SNAPSHOT.jar
[INFO] 
[INFO] --- eclipse-jarsigner-plugin:1.0.4:sign (sign) @ org.eclipse.emf.ecoretools.properties ---
[INFO] Signed org.eclipse.emf.ecoretools:org.eclipse.emf.ecoretools.properties:eclipse-plugin:3.2.1-SNAPSHOT in 1 seconds.
[INFO] Signed org.eclipse.emf.ecoretools:org.eclipse.emf.ecoretools.properties:java-source:sources:3.2.1-SNAPSHOT in 0 seconds.
[INFO] 
[INFO] --- tycho-pack200b-plugin:0.23.1:pack (pack200-pack) @ org.eclipse.emf.ecoretools.properties ---
[INFO] Pack200 packing jar /jobs/genie.sirius/ecoretools-3.2/workspace/org.eclipse.emf.ecoretools.properties/target/org.eclipse.emf.ecoretools.properties-3.2.1-SNAPSHOT.jar
[INFO] 
[INFO] ------------------------------------------------------------------------
[INFO] Building org.eclipse.emf.ecoretools.design.properties 3.2.1-SNAPSHOT
[INFO] ------------------------------------------------------------------------
[INFO] 
[INFO] --- maven-clean-plugin:2.5:clean (default-clean) @ org.eclipse.emf.ecoretools.design.properties ---
[INFO] Deleting /jobs/genie.sirius/ecoretools-3.2/workspace/org.eclipse.emf.ecoretools.design.properties/target
[INFO] 
[INFO] --- tycho-packaging-plugin:0.23.1:build-qualifier (default-build-qualifier) @ org.eclipse.emf.ecoretools.design.properties ---
[INFO] The project's OSGi version is 3.2.1.201801160715
[INFO] 
[INFO] --- tycho-packaging-plugin:0.23.1:validate-id (default-validate-id) @ org.eclipse.emf.ecoretools.design.properties ---
[INFO] 
[INFO] --- tycho-packaging-plugin:0.23.1:validate-version (default-validate-version) @ org.eclipse.emf.ecoretools.design.properties ---
[INFO] 
[INFO] --- maven-resources-plugin:2.4.1:resources (default-resources) @ org.eclipse.emf.ecoretools.design.properties ---
[INFO] Using 'ISO-8859-1' encoding to copy filtered resources.
[INFO] Copying 0 resource
[INFO] 
[INFO] --- tycho-compiler-plugin:0.23.1:compile (default-compile) @ org.eclipse.emf.ecoretools.design.properties ---
[INFO] Compiling 69 source files to /jobs/genie.sirius/ecoretools-3.2/workspace/org.eclipse.emf.ecoretools.design.properties/target/classes
[INFO] 
[INFO] --- maven-resources-plugin:2.4.1:testResources (default-testResources) @ org.eclipse.emf.ecoretools.design.properties ---
[INFO] Using 'ISO-8859-1' encoding to copy filtered resources.
[INFO] skip non existing resourceDirectory /jobs/genie.sirius/ecoretools-3.2/workspace/org.eclipse.emf.ecoretools.design.properties/src/test/resources
[INFO] 
[INFO] --- tycho-source-plugin:0.23.1:plugin-source (plugin-source) @ org.eclipse.emf.ecoretools.design.properties ---
[INFO] Building jar: /jobs/genie.sirius/ecoretools-3.2/workspace/org.eclipse.emf.ecoretools.design.properties/target/org.eclipse.emf.ecoretools.design.properties-3.2.1-SNAPSHOT-sources.jar
[INFO] 
[INFO] --- target-platform-configuration:0.23.1:target-platform (default-target-platform) @ org.eclipse.emf.ecoretools.design.properties ---
[INFO] 
[INFO] --- tycho-packaging-plugin:0.23.1:package-plugin (default-package-plugin) @ org.eclipse.emf.ecoretools.design.properties ---
[INFO] Building jar: /jobs/genie.sirius/ecoretools-3.2/workspace/org.eclipse.emf.ecoretools.design.properties/target/org.eclipse.emf.ecoretools.design.properties-3.2.1-SNAPSHOT.jar
[INFO] 
[INFO] --- tycho-p2-plugin:0.23.1:p2-metadata-default (default-p2-metadata-default) @ org.eclipse.emf.ecoretools.design.properties ---
[INFO] 
[INFO] --- tycho-pack200a-plugin:0.23.1:normalize (pack200-normalize) @ org.eclipse.emf.ecoretools.design.properties ---
[INFO] Pack200 normalizing jar /jobs/genie.sirius/ecoretools-3.2/workspace/org.eclipse.emf.ecoretools.design.properties/target/org.eclipse.emf.ecoretools.design.properties-3.2.1-SNAPSHOT.jar
[INFO] 
[INFO] --- eclipse-jarsigner-plugin:1.0.4:sign (sign) @ org.eclipse.emf.ecoretools.design.properties ---
[INFO] Signed org.eclipse.emf.ecoretools:org.eclipse.emf.ecoretools.design.properties:eclipse-plugin:3.2.1-SNAPSHOT in 1 seconds.
[INFO] Signed org.eclipse.emf.ecoretools:org.eclipse.emf.ecoretools.design.properties:java-source:sources:3.2.1-SNAPSHOT in 0 seconds.
[INFO] 
[INFO] --- tycho-pack200b-plugin:0.23.1:pack (pack200-pack) @ org.eclipse.emf.ecoretools.design.properties ---
[INFO] Pack200 packing jar /jobs/genie.sirius/ecoretools-3.2/workspace/org.eclipse.emf.ecoretools.design.properties/target/org.eclipse.emf.ecoretools.design.properties-3.2.1-SNAPSHOT.jar
[INFO] 
[INFO] ------------------------------------------------------------------------
[INFO] Building org.eclipse.emf.ecoretools.design 3.2.1-SNAPSHOT
[INFO] ------------------------------------------------------------------------
[INFO] 
[INFO] --- maven-clean-plugin:2.5:clean (default-clean) @ org.eclipse.emf.ecoretools.design ---
[INFO] Deleting /jobs/genie.sirius/ecoretools-3.2/workspace/org.eclipse.emf.ecoretools.design-feature/target
[INFO] 
[INFO] --- tycho-packaging-plugin:0.23.1:build-qualifier-aggregator (default-build-qualifier-aggregator) @ org.eclipse.emf.ecoretools.design ---
[INFO] The project's OSGi version is 3.2.1.201801160715
[INFO] 
[INFO] --- tycho-packaging-plugin:0.23.1:validate-id (default-validate-id) @ org.eclipse.emf.ecoretools.design ---
[INFO] 
[INFO] --- tycho-packaging-plugin:0.23.1:validate-version (default-validate-version) @ org.eclipse.emf.ecoretools.design ---
[INFO] 
[INFO] --- target-platform-configuration:0.23.1:target-platform (default-target-platform) @ org.eclipse.emf.ecoretools.design ---
[INFO] 
[INFO] --- tycho-packaging-plugin:0.23.1:package-feature (default-package-feature) @ org.eclipse.emf.ecoretools.design ---
[INFO] Building jar: /jobs/genie.sirius/ecoretools-3.2/workspace/org.eclipse.emf.ecoretools.design-feature/target/org.eclipse.emf.ecoretools.design-3.2.1-SNAPSHOT.jar
[INFO] 
[INFO] --- tycho-p2-plugin:0.23.1:p2-metadata-default (default-p2-metadata-default) @ org.eclipse.emf.ecoretools.design ---
[INFO] 
[INFO] --- tycho-p2-plugin:0.23.1:feature-p2-metadata (default-feature-p2-metadata) @ org.eclipse.emf.ecoretools.design ---
[INFO] 
[INFO] --- tycho-pack200a-plugin:0.23.1:normalize (pack200-normalize) @ org.eclipse.emf.ecoretools.design ---
[INFO] 
[INFO] --- eclipse-jarsigner-plugin:1.0.4:sign (sign) @ org.eclipse.emf.ecoretools.design ---
[INFO] Signed org.eclipse.emf.ecoretools.features:org.eclipse.emf.ecoretools.design:eclipse-feature:3.2.1-SNAPSHOT in 0 seconds.
[INFO] 
[INFO] --- tycho-pack200b-plugin:0.23.1:pack (pack200-pack) @ org.eclipse.emf.ecoretools.design ---
[INFO] 
[INFO] ------------------------------------------------------------------------
[INFO] Building org.eclipse.emf.ecoretools.doc 3.2.1-SNAPSHOT
[INFO] ------------------------------------------------------------------------
[INFO] 
[INFO] --- maven-clean-plugin:2.5:clean (default-clean) @ org.eclipse.emf.ecoretools.doc ---
[INFO] Deleting /jobs/genie.sirius/ecoretools-3.2/workspace/org.eclipse.emf.ecoretools.doc-feature/target
[INFO] 
[INFO] --- tycho-packaging-plugin:0.23.1:build-qualifier-aggregator (default-build-qualifier-aggregator) @ org.eclipse.emf.ecoretools.doc ---
[INFO] The project's OSGi version is 3.2.1.201801160715
[INFO] 
[INFO] --- tycho-packaging-plugin:0.23.1:validate-id (default-validate-id) @ org.eclipse.emf.ecoretools.doc ---
[INFO] 
[INFO] --- tycho-packaging-plugin:0.23.1:validate-version (default-validate-version) @ org.eclipse.emf.ecoretools.doc ---
[INFO] 
[INFO] --- target-platform-configuration:0.23.1:target-platform (default-target-platform) @ org.eclipse.emf.ecoretools.doc ---
[INFO] 
[INFO] --- tycho-packaging-plugin:0.23.1:package-feature (default-package-feature) @ org.eclipse.emf.ecoretools.doc ---
[INFO] Building jar: /jobs/genie.sirius/ecoretools-3.2/workspace/org.eclipse.emf.ecoretools.doc-feature/target/org.eclipse.emf.ecoretools.doc-3.2.1-SNAPSHOT.jar
[INFO] 
[INFO] --- tycho-p2-plugin:0.23.1:p2-metadata-default (default-p2-metadata-default) @ org.eclipse.emf.ecoretools.doc ---
[INFO] 
[INFO] --- tycho-p2-plugin:0.23.1:feature-p2-metadata (default-feature-p2-metadata) @ org.eclipse.emf.ecoretools.doc ---
[INFO] 
[INFO] --- tycho-pack200a-plugin:0.23.1:normalize (pack200-normalize) @ org.eclipse.emf.ecoretools.doc ---
[INFO] 
[INFO] --- eclipse-jarsigner-plugin:1.0.4:sign (sign) @ org.eclipse.emf.ecoretools.doc ---
[INFO] Signed org.eclipse.emf.ecoretools.features:org.eclipse.emf.ecoretools.doc:eclipse-feature:3.2.1-SNAPSHOT in 0 seconds.
[INFO] 
[INFO] --- tycho-pack200b-plugin:0.23.1:pack (pack200-pack) @ org.eclipse.emf.ecoretools.doc ---
[INFO] 
[INFO] ------------------------------------------------------------------------
[INFO] Building org.eclipse.emf.ecoretools.registration 3.2.1-SNAPSHOT
[INFO] ------------------------------------------------------------------------
[INFO] 
[INFO] --- maven-clean-plugin:2.5:clean (default-clean) @ org.eclipse.emf.ecoretools.registration ---
[INFO] Deleting /jobs/genie.sirius/ecoretools-3.2/workspace/org.eclipse.emf.ecoretools.registration/target
[INFO] 
[INFO] --- tycho-packaging-plugin:0.23.1:build-qualifier (default-build-qualifier) @ org.eclipse.emf.ecoretools.registration ---
[INFO] The project's OSGi version is 3.2.1.201801160715
[INFO] 
[INFO] --- tycho-packaging-plugin:0.23.1:validate-id (default-validate-id) @ org.eclipse.emf.ecoretools.registration ---
[INFO] 
[INFO] --- tycho-packaging-plugin:0.23.1:validate-version (default-validate-version) @ org.eclipse.emf.ecoretools.registration ---
[INFO] 
[INFO] --- maven-resources-plugin:2.4.1:resources (default-resources) @ org.eclipse.emf.ecoretools.registration ---
[INFO] Using 'ISO-8859-1' encoding to copy filtered resources.
[INFO] skip non existing resourceDirectory /jobs/genie.sirius/ecoretools-3.2/workspace/org.eclipse.emf.ecoretools.registration/src/main/resources
[INFO] 
[INFO] --- tycho-compiler-plugin:0.23.1:compile (default-compile) @ org.eclipse.emf.ecoretools.registration ---
[INFO] Compiling 18 source files to /jobs/genie.sirius/ecoretools-3.2/workspace/org.eclipse.emf.ecoretools.registration/target/classes
[INFO] 
[INFO] --- maven-resources-plugin:2.4.1:testResources (default-testResources) @ org.eclipse.emf.ecoretools.registration ---
[INFO] Using 'ISO-8859-1' encoding to copy filtered resources.
[INFO] skip non existing resourceDirectory /jobs/genie.sirius/ecoretools-3.2/workspace/org.eclipse.emf.ecoretools.registration/src/test/resources
[INFO] 
[INFO] --- tycho-source-plugin:0.23.1:plugin-source (plugin-source) @ org.eclipse.emf.ecoretools.registration ---
[INFO] Building jar: /jobs/genie.sirius/ecoretools-3.2/workspace/org.eclipse.emf.ecoretools.registration/target/org.eclipse.emf.ecoretools.registration-3.2.1-SNAPSHOT-sources.jar
[INFO] 
[INFO] --- target-platform-configuration:0.23.1:target-platform (default-target-platform) @ org.eclipse.emf.ecoretools.registration ---
[INFO] 
[INFO] --- tycho-packaging-plugin:0.23.1:package-plugin (default-package-plugin) @ org.eclipse.emf.ecoretools.registration ---
[INFO] Building jar: /jobs/genie.sirius/ecoretools-3.2/workspace/org.eclipse.emf.ecoretools.registration/target/org.eclipse.emf.ecoretools.registration-3.2.1-SNAPSHOT.jar
[INFO] 
[INFO] --- tycho-p2-plugin:0.23.1:p2-metadata-default (default-p2-metadata-default) @ org.eclipse.emf.ecoretools.registration ---
[INFO] 
[INFO] --- tycho-pack200a-plugin:0.23.1:normalize (pack200-normalize) @ org.eclipse.emf.ecoretools.registration ---
[INFO] Pack200 normalizing jar /jobs/genie.sirius/ecoretools-3.2/workspace/org.eclipse.emf.ecoretools.registration/target/org.eclipse.emf.ecoretools.registration-3.2.1-SNAPSHOT.jar
[INFO] 
[INFO] --- eclipse-jarsigner-plugin:1.0.4:sign (sign) @ org.eclipse.emf.ecoretools.registration ---
[INFO] Signed org.eclipse.emf.ecoretools:org.eclipse.emf.ecoretools.registration:eclipse-plugin:3.2.1-SNAPSHOT in 0 seconds.
[INFO] Signed org.eclipse.emf.ecoretools:org.eclipse.emf.ecoretools.registration:java-source:sources:3.2.1-SNAPSHOT in 0 seconds.
[INFO] 
[INFO] --- tycho-pack200b-plugin:0.23.1:pack (pack200-pack) @ org.eclipse.emf.ecoretools.registration ---
[INFO] Pack200 packing jar /jobs/genie.sirius/ecoretools-3.2/workspace/org.eclipse.emf.ecoretools.registration/target/org.eclipse.emf.ecoretools.registration-3.2.1-SNAPSHOT.jar
[INFO] 
[INFO] ------------------------------------------------------------------------
[INFO] Building org.eclipse.emf.ecoretools.sdk 3.2.1-SNAPSHOT
[INFO] ------------------------------------------------------------------------
[INFO] 
[INFO] --- maven-clean-plugin:2.5:clean (default-clean) @ org.eclipse.emf.ecoretools.sdk ---
[INFO] Deleting /jobs/genie.sirius/ecoretools-3.2/workspace/org.eclipse.emf.ecoretools.sdk-feature/target
[INFO] 
[INFO] --- tycho-packaging-plugin:0.23.1:build-qualifier-aggregator (default-build-qualifier-aggregator) @ org.eclipse.emf.ecoretools.sdk ---
[INFO] The project's OSGi version is 3.2.1.201801160715
[INFO] 
[INFO] --- tycho-packaging-plugin:0.23.1:validate-id (default-validate-id) @ org.eclipse.emf.ecoretools.sdk ---
[INFO] 
[INFO] --- tycho-packaging-plugin:0.23.1:validate-version (default-validate-version) @ org.eclipse.emf.ecoretools.sdk ---
[INFO] 
[INFO] --- target-platform-configuration:0.23.1:target-platform (default-target-platform) @ org.eclipse.emf.ecoretools.sdk ---
[INFO] 
[INFO] --- tycho-packaging-plugin:0.23.1:package-feature (default-package-feature) @ org.eclipse.emf.ecoretools.sdk ---
[INFO] Building jar: /jobs/genie.sirius/ecoretools-3.2/workspace/org.eclipse.emf.ecoretools.sdk-feature/target/org.eclipse.emf.ecoretools.sdk-3.2.1-SNAPSHOT.jar
[INFO] 
[INFO] --- tycho-p2-plugin:0.23.1:p2-metadata-default (default-p2-metadata-default) @ org.eclipse.emf.ecoretools.sdk ---
[INFO] 
[INFO] --- tycho-p2-plugin:0.23.1:feature-p2-metadata (default-feature-p2-metadata) @ org.eclipse.emf.ecoretools.sdk ---
[INFO] 
[INFO] --- tycho-pack200a-plugin:0.23.1:normalize (pack200-normalize) @ org.eclipse.emf.ecoretools.sdk ---
[INFO] 
[INFO] --- eclipse-jarsigner-plugin:1.0.4:sign (sign) @ org.eclipse.emf.ecoretools.sdk ---
[INFO] Signed org.eclipse.emf.ecoretools.features:org.eclipse.emf.ecoretools.sdk:eclipse-feature:3.2.1-SNAPSHOT in 0 seconds.
[INFO] 
[INFO] --- tycho-pack200b-plugin:0.23.1:pack (pack200-pack) @ org.eclipse.emf.ecoretools.sdk ---
[INFO] 
[INFO] ------------------------------------------------------------------------
[INFO] Building org.eclipse.emf.ecoretools.explorer.contextual 3.2.1-SNAPSHOT
[INFO] ------------------------------------------------------------------------
[INFO] 
[INFO] --- maven-clean-plugin:2.5:clean (default-clean) @ org.eclipse.emf.ecoretools.explorer.contextual ---
[INFO] Deleting /jobs/genie.sirius/ecoretools-3.2/workspace/org.eclipse.emf.ecoretools.explorer.contextual/target
[INFO] 
[INFO] --- tycho-packaging-plugin:0.23.1:build-qualifier (default-build-qualifier) @ org.eclipse.emf.ecoretools.explorer.contextual ---
[INFO] The project's OSGi version is 3.2.1.201801160715
[INFO] 
[INFO] --- tycho-packaging-plugin:0.23.1:validate-id (default-validate-id) @ org.eclipse.emf.ecoretools.explorer.contextual ---
[INFO] 
[INFO] --- tycho-packaging-plugin:0.23.1:validate-version (default-validate-version) @ org.eclipse.emf.ecoretools.explorer.contextual ---
[INFO] 
[INFO] --- maven-resources-plugin:2.4.1:resources (default-resources) @ org.eclipse.emf.ecoretools.explorer.contextual ---
[INFO] Using 'ISO-8859-1' encoding to copy filtered resources.
[INFO] Copying 0 resource
[INFO] 
[INFO] --- tycho-compiler-plugin:0.23.1:compile (default-compile) @ org.eclipse.emf.ecoretools.explorer.contextual ---
[INFO] Compiling 10 source files to /jobs/genie.sirius/ecoretools-3.2/workspace/org.eclipse.emf.ecoretools.explorer.contextual/target/classes
[INFO] 
[INFO] --- maven-resources-plugin:2.4.1:testResources (default-testResources) @ org.eclipse.emf.ecoretools.explorer.contextual ---
[INFO] Using 'ISO-8859-1' encoding to copy filtered resources.
[INFO] skip non existing resourceDirectory /jobs/genie.sirius/ecoretools-3.2/workspace/org.eclipse.emf.ecoretools.explorer.contextual/src/test/resources
[INFO] 
[INFO] --- tycho-source-plugin:0.23.1:plugin-source (plugin-source) @ org.eclipse.emf.ecoretools.explorer.contextual ---
[INFO] Building jar: /jobs/genie.sirius/ecoretools-3.2/workspace/org.eclipse.emf.ecoretools.explorer.contextual/target/org.eclipse.emf.ecoretools.explorer.contextual-3.2.1-SNAPSHOT-sources.jar
[INFO] 
[INFO] --- target-platform-configuration:0.23.1:target-platform (default-target-platform) @ org.eclipse.emf.ecoretools.explorer.contextual ---
[INFO] 
[INFO] --- tycho-packaging-plugin:0.23.1:package-plugin (default-package-plugin) @ org.eclipse.emf.ecoretools.explorer.contextual ---
[INFO] Building jar: /jobs/genie.sirius/ecoretools-3.2/workspace/org.eclipse.emf.ecoretools.explorer.contextual/target/org.eclipse.emf.ecoretools.explorer.contextual-3.2.1-SNAPSHOT.jar
[INFO] 
[INFO] --- tycho-p2-plugin:0.23.1:p2-metadata-default (default-p2-metadata-default) @ org.eclipse.emf.ecoretools.explorer.contextual ---
[INFO] 
[INFO] --- tycho-pack200a-plugin:0.23.1:normalize (pack200-normalize) @ org.eclipse.emf.ecoretools.explorer.contextual ---
[INFO] Pack200 normalizing jar /jobs/genie.sirius/ecoretools-3.2/workspace/org.eclipse.emf.ecoretools.explorer.contextual/target/org.eclipse.emf.ecoretools.explorer.contextual-3.2.1-SNAPSHOT.jar
[INFO] 
[INFO] --- eclipse-jarsigner-plugin:1.0.4:sign (sign) @ org.eclipse.emf.ecoretools.explorer.contextual ---
[INFO] Signed org.eclipse.emf.ecoretools:org.eclipse.emf.ecoretools.explorer.contextual:eclipse-plugin:3.2.1-SNAPSHOT in 0 seconds.
[INFO] Signed org.eclipse.emf.ecoretools:org.eclipse.emf.ecoretools.explorer.contextual:java-source:sources:3.2.1-SNAPSHOT in 0 seconds.
[INFO] 
[INFO] --- tycho-pack200b-plugin:0.23.1:pack (pack200-pack) @ org.eclipse.emf.ecoretools.explorer.contextual ---
[INFO] Pack200 packing jar /jobs/genie.sirius/ecoretools-3.2/workspace/org.eclipse.emf.ecoretools.explorer.contextual/target/org.eclipse.emf.ecoretools.explorer.contextual-3.2.1-SNAPSHOT.jar
[INFO] 
[INFO] ------------------------------------------------------------------------
[INFO] Building org.eclipse.emf.ecoretools.explorer.contextual 3.2.1-SNAPSHOT
[INFO] ------------------------------------------------------------------------
[INFO] 
[INFO] --- maven-clean-plugin:2.5:clean (default-clean) @ org.eclipse.emf.ecoretools.explorer.contextual ---
[INFO] Deleting /jobs/genie.sirius/ecoretools-3.2/workspace/org.eclipse.emf.ecoretools.explorer.contextual-feature/target
[INFO] 
[INFO] --- tycho-packaging-plugin:0.23.1:build-qualifier-aggregator (default-build-qualifier-aggregator) @ org.eclipse.emf.ecoretools.explorer.contextual ---
[INFO] The project's OSGi version is 3.2.1.201801160715
[INFO] 
[INFO] --- tycho-packaging-plugin:0.23.1:validate-id (default-validate-id) @ org.eclipse.emf.ecoretools.explorer.contextual ---
[INFO] 
[INFO] --- tycho-packaging-plugin:0.23.1:validate-version (default-validate-version) @ org.eclipse.emf.ecoretools.explorer.contextual ---
[INFO] 
[INFO] --- target-platform-configuration:0.23.1:target-platform (default-target-platform) @ org.eclipse.emf.ecoretools.explorer.contextual ---
[INFO] 
[INFO] --- tycho-packaging-plugin:0.23.1:package-feature (default-package-feature) @ org.eclipse.emf.ecoretools.explorer.contextual ---
[INFO] Building jar: /jobs/genie.sirius/ecoretools-3.2/workspace/org.eclipse.emf.ecoretools.explorer.contextual-feature/target/org.eclipse.emf.ecoretools.explorer.contextual-3.2.1-SNAPSHOT.jar
[INFO] 
[INFO] --- tycho-p2-plugin:0.23.1:p2-metadata-default (default-p2-metadata-default) @ org.eclipse.emf.ecoretools.explorer.contextual ---
[INFO] 
[INFO] --- tycho-p2-plugin:0.23.1:feature-p2-metadata (default-feature-p2-metadata) @ org.eclipse.emf.ecoretools.explorer.contextual ---
[INFO] 
[INFO] --- tycho-pack200a-plugin:0.23.1:normalize (pack200-normalize) @ org.eclipse.emf.ecoretools.explorer.contextual ---
[INFO] 
[INFO] --- eclipse-jarsigner-plugin:1.0.4:sign (sign) @ org.eclipse.emf.ecoretools.explorer.contextual ---
[INFO] Signed org.eclipse.emf.ecoretools.features:org.eclipse.emf.ecoretools.explorer.contextual:eclipse-feature:3.2.1-SNAPSHOT in 0 seconds.
[INFO] 
[INFO] --- tycho-pack200b-plugin:0.23.1:pack (pack200-pack) @ org.eclipse.emf.ecoretools.explorer.contextual ---
[INFO] 
[INFO] ------------------------------------------------------------------------
[INFO] Building org.eclipse.emf.ecoretools.update 1.3.0-SNAPSHOT
[INFO] ------------------------------------------------------------------------
[INFO] 
[INFO] --- maven-clean-plugin:2.5:clean (default-clean) @ org.eclipse.emf.ecoretools.update ---
[INFO] Deleting /jobs/genie.sirius/ecoretools-3.2/workspace/org.eclipse.emf.ecoretools.update/target
[INFO] 
[INFO] --- tycho-packaging-plugin:0.23.1:build-qualifier-aggregator (default-build-qualifier-aggregator) @ org.eclipse.emf.ecoretools.update ---
[INFO] The project's OSGi version is 1.3.0.201801160715
[INFO] 
[INFO] --- maven-resources-plugin:2.4.1:copy-resources (copy-resources) @ org.eclipse.emf.ecoretools.update ---
[INFO] Using 'ISO-8859-1' encoding to copy filtered resources.
[INFO] Copying 1 resource
[INFO] 
[INFO] --- maven-clean-plugin:2.5:clean (default-clean-1) @ org.eclipse.emf.ecoretools.update ---
[INFO] Deleting /jobs/genie.sirius/ecoretools-3.2/workspace/org.eclipse.emf.ecoretools.update/target
[INFO] 
[INFO] --- maven-resources-plugin:2.4.1:resources (default-resources) @ org.eclipse.emf.ecoretools.update ---
[INFO] Using 'ISO-8859-1' encoding to copy filtered resources.
[INFO] skip non existing resourceDirectory /jobs/genie.sirius/ecoretools-3.2/workspace/org.eclipse.emf.ecoretools.update/src/main/resources
[INFO] 
[INFO] --- target-platform-configuration:0.23.1:target-platform (default-target-platform) @ org.eclipse.emf.ecoretools.update ---
[INFO] 
[INFO] --- tycho-p2-publisher-plugin:0.23.1:publish-products (default-publish-products) @ org.eclipse.emf.ecoretools.update ---
[INFO] 
[INFO] --- tycho-p2-publisher-plugin:0.23.1:publish-categories (default-publish-categories) @ org.eclipse.emf.ecoretools.update ---
[INFO] 
[INFO] --- tycho-p2-publisher-plugin:0.23.1:attach-artifacts (default-attach-artifacts) @ org.eclipse.emf.ecoretools.update ---
[INFO] 
[INFO] --- tycho-p2-repository-plugin:0.23.1:assemble-repository (default-assemble-repository) @ org.eclipse.emf.ecoretools.update ---
[INFO] 
[INFO] --- tycho-p2-repository-plugin:0.23.1:archive-repository (default-archive-repository) @ org.eclipse.emf.ecoretools.update ---
[INFO] Building zip: /jobs/genie.sirius/ecoretools-3.2/workspace/org.eclipse.emf.ecoretools.update/target/org.eclipse.emf.ecoretools.update.zip
[INFO] 
[INFO] --- tycho-pack200a-plugin:0.23.1:normalize (pack200-normalize) @ org.eclipse.emf.ecoretools.update ---
[INFO] 
[INFO] --- eclipse-jarsigner-plugin:1.0.4:sign (sign) @ org.eclipse.emf.ecoretools.update ---
[INFO] 
[INFO] --- tycho-pack200b-plugin:0.23.1:pack (pack200-pack) @ org.eclipse.emf.ecoretools.update ---
[INFO] 
[INFO] ------------------------------------------------------------------------
[INFO] Building org.eclipse.emf.ecoretools.update-all 1.3.0-SNAPSHOT
[INFO] ------------------------------------------------------------------------
[INFO] 
[INFO] --- maven-clean-plugin:2.5:clean (default-clean) @ org.eclipse.emf.ecoretools.update-all ---
[INFO] Deleting /jobs/genie.sirius/ecoretools-3.2/workspace/org.eclipse.emf.ecoretools.update-all/target
[INFO] 
[INFO] --- tycho-packaging-plugin:0.23.1:build-qualifier-aggregator (default-build-qualifier-aggregator) @ org.eclipse.emf.ecoretools.update-all ---
[INFO] The project's OSGi version is 1.3.0.201801160715
[INFO] 
[INFO] --- maven-resources-plugin:2.4.1:copy-resources (copy-resources) @ org.eclipse.emf.ecoretools.update-all ---
[INFO] Using 'ISO-8859-1' encoding to copy filtered resources.
[INFO] Copying 1 resource
[INFO] 
[INFO] --- maven-clean-plugin:2.5:clean (default-clean-1) @ org.eclipse.emf.ecoretools.update-all ---
[INFO] Deleting /jobs/genie.sirius/ecoretools-3.2/workspace/org.eclipse.emf.ecoretools.update-all/target
[INFO] 
[INFO] --- maven-resources-plugin:2.4.1:resources (default-resources) @ org.eclipse.emf.ecoretools.update-all ---
[INFO] Using 'ISO-8859-1' encoding to copy filtered resources.
[INFO] skip non existing resourceDirectory /jobs/genie.sirius/ecoretools-3.2/workspace/org.eclipse.emf.ecoretools.update-all/src/main/resources
[INFO] 
[INFO] --- target-platform-configuration:0.23.1:target-platform (default-target-platform) @ org.eclipse.emf.ecoretools.update-all ---
[INFO] 
[INFO] --- tycho-p2-publisher-plugin:0.23.1:publish-products (default-publish-products) @ org.eclipse.emf.ecoretools.update-all ---
[INFO] 
[INFO] --- tycho-p2-publisher-plugin:0.23.1:publish-categories (default-publish-categories) @ org.eclipse.emf.ecoretools.update-all ---
[INFO] 
[INFO] --- tycho-p2-publisher-plugin:0.23.1:attach-artifacts (default-attach-artifacts) @ org.eclipse.emf.ecoretools.update-all ---
[INFO] 
[INFO] --- tycho-p2-repository-plugin:0.23.1:assemble-repository (default-assemble-repository) @ org.eclipse.emf.ecoretools.update-all ---
[WARNING] Mirror tool: Problems resolving provisioning plan.: [Unable to satisfy dependency from 201801160715.deps 1.0.0._J7Y9KcLYUob_FdUtrEt0MgJZ to org.eclipse.sirius.runtime.ide.eef.feature.group [4.0.0.201605311157].; Unable to satisfy dependency from 201801160715.deps 1.0.0._J7Y9KcLYUob_FdUtrEt0MgJZ to org.eclipse.sirius.runtime.ide.eef.feature.group [4.1.2.201612021444].; Unable to satisfy dependency from 201801160715.deps 1.0.0._J7Y9KcLYUob_FdUtrEt0MgJZ to org.eclipse.sirius.runtime.ide.eef.feature.group [4.0.1.201608261223].; Unable to satisfy dependency from 201801160715.deps 1.0.0._J7Y9KcLYUob_FdUtrEt0MgJZ to org.eclipse.acceleo.query.feature.group [5.0.1.201608301456].; Unable to satisfy dependency from 201801160715.deps 1.0.0._J7Y9KcLYUob_FdUtrEt0MgJZ to org.eclipse.sirius.runtime.feature.group [4.1.3.201701271256].; Unable to satisfy dependency from 201801160715.deps 1.0.0._J7Y9KcLYUob_FdUtrEt0MgJZ to org.eclipse.acceleo.query.feature.group [5.0.0.201605260729].; Unable to satisfy dependency from 201801160715.deps 1.0.0._J7Y9KcLYUob_FdUtrEt0MgJZ to org.eclipse.sirius.runtime.feature.group [4.0.1.201608261223].; Unable to satisfy dependency from 201801160715.deps 1.0.0._J7Y9KcLYUob_FdUtrEt0MgJZ to org.eclipse.sirius.runtime.aql.feature.group [4.0.1.201608261223].; Unable to satisfy dependency from 201801160715.deps 1.0.0._J7Y9KcLYUob_FdUtrEt0MgJZ to org.eclipse.sirius.runtime.ide.eef.feature.group [4.1.3.201701271256].; Unable to satisfy dependency from 201801160715.deps 1.0.0._J7Y9KcLYUob_FdUtrEt0MgJZ to org.eclipse.sirius.runtime.feature.group [4.1.2.201612021444].; Unable to satisfy dependency from 201801160715.deps 1.0.0._J7Y9KcLYUob_FdUtrEt0MgJZ to org.eclipse.sirius.runtime.feature.group [4.0.0.201605311157].; Unable to satisfy dependency from 201801160715.deps 1.0.0._J7Y9KcLYUob_FdUtrEt0MgJZ to org.eclipse.sirius.runtime.ide.ui.feature.group [4.0.1.201608261223].; Unable to satisfy dependency from 201801160715.deps 1.0.0._J7Y9KcLYUob_FdUtrEt0MgJZ to org.eclipse.sirius.runtime.ide.ui.feature.group [4.1.2.201612021444].; Unable to satisfy dependency from 201801160715.deps 1.0.0._J7Y9KcLYUob_FdUtrEt0MgJZ to org.eclipse.sirius.runtime.ide.ui.feature.group [4.0.0.201605311157].; Unable to satisfy dependency from 201801160715.deps 1.0.0._J7Y9KcLYUob_FdUtrEt0MgJZ to org.eclipse.sirius.runtime.ide.ui.feature.group [4.1.3.201701271256].; Unable to satisfy dependency from 201801160715.deps 1.0.0._J7Y9KcLYUob_FdUtrEt0MgJZ to org.eclipse.sirius.runtime.aql.feature.group [4.0.0.201605311157].; Unable to satisfy dependency from 201801160715.deps 1.0.0._J7Y9KcLYUob_FdUtrEt0MgJZ to org.eclipse.sirius.runtime.aql.feature.group [4.1.2.201612021444].; Unable to satisfy dependency from 201801160715.deps 1.0.0._J7Y9KcLYUob_FdUtrEt0MgJZ to org.eclipse.acceleo.query.feature.group [5.0.2.201610060831].; Unable to satisfy dependency from 201801160715.deps 1.0.0._J7Y9KcLYUob_FdUtrEt0MgJZ to org.eclipse.sirius.runtime.aql.feature.group [4.1.3.201701271256].]
[WARNING] More information on the preceding warning(s) can be found here:
[WARNING] - http://wiki.eclipse.org/Tycho_Messages_Explained#Mirror_tool
[WARNING] Mirror tool: Problems resolving provisioning plan.: [Unable to satisfy dependency from 201801160715.deps 1.0.0._J7Y9KcLYUob_FdUtrEt0MgJZ to org.eclipse.sirius.runtime.ide.eef.feature.group [4.0.0.201605311157].; Unable to satisfy dependency from 201801160715.deps 1.0.0._J7Y9KcLYUob_FdUtrEt0MgJZ to org.eclipse.sirius.runtime.ide.eef.feature.group [4.1.2.201612021444].; Unable to satisfy dependency from 201801160715.deps 1.0.0._J7Y9KcLYUob_FdUtrEt0MgJZ to org.eclipse.sirius.runtime.ide.eef.feature.group [4.0.1.201608261223].; Unable to satisfy dependency from 201801160715.deps 1.0.0._J7Y9KcLYUob_FdUtrEt0MgJZ to org.eclipse.acceleo.query.feature.group [5.0.1.201608301456].; Unable to satisfy dependency from 201801160715.deps 1.0.0._J7Y9KcLYUob_FdUtrEt0MgJZ to org.eclipse.sirius.runtime.feature.group [4.1.3.201701271256].; Unable to satisfy dependency from 201801160715.deps 1.0.0._J7Y9KcLYUob_FdUtrEt0MgJZ to org.eclipse.acceleo.query.feature.group [5.0.0.201605260729].; Unable to satisfy dependency from 201801160715.deps 1.0.0._J7Y9KcLYUob_FdUtrEt0MgJZ to org.eclipse.sirius.runtime.feature.group [4.0.1.201608261223].; Unable to satisfy dependency from 201801160715.deps 1.0.0._J7Y9KcLYUob_FdUtrEt0MgJZ to org.eclipse.sirius.runtime.aql.feature.group [4.0.1.201608261223].; Unable to satisfy dependency from 201801160715.deps 1.0.0._J7Y9KcLYUob_FdUtrEt0MgJZ to org.eclipse.sirius.runtime.ide.eef.feature.group [4.1.3.201701271256].; Unable to satisfy dependency from 201801160715.deps 1.0.0._J7Y9KcLYUob_FdUtrEt0MgJZ to org.eclipse.sirius.runtime.feature.group [4.1.2.201612021444].; Unable to satisfy dependency from 201801160715.deps 1.0.0._J7Y9KcLYUob_FdUtrEt0MgJZ to org.eclipse.sirius.runtime.feature.group [4.0.0.201605311157].; Unable to satisfy dependency from 201801160715.deps 1.0.0._J7Y9KcLYUob_FdUtrEt0MgJZ to org.eclipse.sirius.runtime.ide.ui.feature.group [4.0.1.201608261223].; Unable to satisfy dependency from 201801160715.deps 1.0.0._J7Y9KcLYUob_FdUtrEt0MgJZ to org.eclipse.sirius.runtime.ide.ui.feature.group [4.1.2.201612021444].; Unable to satisfy dependency from 201801160715.deps 1.0.0._J7Y9KcLYUob_FdUtrEt0MgJZ to org.eclipse.sirius.runtime.ide.ui.feature.group [4.0.0.201605311157].; Unable to satisfy dependency from 201801160715.deps 1.0.0._J7Y9KcLYUob_FdUtrEt0MgJZ to org.eclipse.sirius.runtime.ide.ui.feature.group [4.1.3.201701271256].; Unable to satisfy dependency from 201801160715.deps 1.0.0._J7Y9KcLYUob_FdUtrEt0MgJZ to org.eclipse.sirius.runtime.aql.feature.group [4.0.0.201605311157].; Unable to satisfy dependency from 201801160715.deps 1.0.0._J7Y9KcLYUob_FdUtrEt0MgJZ to org.eclipse.sirius.runtime.aql.feature.group [4.1.2.201612021444].; Unable to satisfy dependency from 201801160715.deps 1.0.0._J7Y9KcLYUob_FdUtrEt0MgJZ to org.eclipse.acceleo.query.feature.group [5.0.2.201610060831].; Unable to satisfy dependency from 201801160715.deps 1.0.0._J7Y9KcLYUob_FdUtrEt0MgJZ to org.eclipse.sirius.runtime.aql.feature.group [4.1.3.201701271256].]
[WARNING] More information on the preceding warning(s) can be found here:
[WARNING] - http://wiki.eclipse.org/Tycho_Messages_Explained#Mirror_tool
[WARNING] Mirror tool: Problems resolving provisioning plan.: [Unable to satisfy dependency from 201801160715.deps 1.0.0._J7Y9KcLYUob_FdUtrEt0MgJZ to org.eclipse.sirius.runtime.ide.eef.feature.group [4.0.0.201605311157].; Unable to satisfy dependency from 201801160715.deps 1.0.0._J7Y9KcLYUob_FdUtrEt0MgJZ to org.eclipse.sirius.runtime.ide.eef.feature.group [4.1.2.201612021444].; Unable to satisfy dependency from 201801160715.deps 1.0.0._J7Y9KcLYUob_FdUtrEt0MgJZ to org.eclipse.sirius.runtime.ide.eef.feature.group [4.0.1.201608261223].; Unable to satisfy dependency from 201801160715.deps 1.0.0._J7Y9KcLYUob_FdUtrEt0MgJZ to org.eclipse.acceleo.query.feature.group [5.0.1.201608301456].; Unable to satisfy dependency from 201801160715.deps 1.0.0._J7Y9KcLYUob_FdUtrEt0MgJZ to org.eclipse.sirius.runtime.feature.group [4.1.3.201701271256].; Unable to satisfy dependency from 201801160715.deps 1.0.0._J7Y9KcLYUob_FdUtrEt0MgJZ to org.eclipse.acceleo.query.feature.group [5.0.0.201605260729].; Unable to satisfy dependency from 201801160715.deps 1.0.0._J7Y9KcLYUob_FdUtrEt0MgJZ to org.eclipse.sirius.runtime.feature.group [4.0.1.201608261223].; Unable to satisfy dependency from 201801160715.deps 1.0.0._J7Y9KcLYUob_FdUtrEt0MgJZ to org.eclipse.sirius.runtime.aql.feature.group [4.0.1.201608261223].; Unable to satisfy dependency from 201801160715.deps 1.0.0._J7Y9KcLYUob_FdUtrEt0MgJZ to org.eclipse.sirius.runtime.ide.eef.feature.group [4.1.3.201701271256].; Unable to satisfy dependency from 201801160715.deps 1.0.0._J7Y9KcLYUob_FdUtrEt0MgJZ to org.eclipse.sirius.runtime.feature.group [4.1.2.201612021444].; Unable to satisfy dependency from 201801160715.deps 1.0.0._J7Y9KcLYUob_FdUtrEt0MgJZ to org.eclipse.sirius.runtime.feature.group [4.0.0.201605311157].; Unable to satisfy dependency from 201801160715.deps 1.0.0._J7Y9KcLYUob_FdUtrEt0MgJZ to org.eclipse.sirius.runtime.ide.ui.feature.group [4.0.1.201608261223].; Unable to satisfy dependency from 201801160715.deps 1.0.0._J7Y9KcLYUob_FdUtrEt0MgJZ to org.eclipse.sirius.runtime.ide.ui.feature.group [4.1.2.201612021444].; Unable to satisfy dependency from 201801160715.deps 1.0.0._J7Y9KcLYUob_FdUtrEt0MgJZ to org.eclipse.sirius.runtime.ide.ui.feature.group [4.0.0.201605311157].; Unable to satisfy dependency from 201801160715.deps 1.0.0._J7Y9KcLYUob_FdUtrEt0MgJZ to org.eclipse.sirius.runtime.ide.ui.feature.group [4.1.3.201701271256].; Unable to satisfy dependency from 201801160715.deps 1.0.0._J7Y9KcLYUob_FdUtrEt0MgJZ to org.eclipse.sirius.runtime.aql.feature.group [4.0.0.201605311157].; Unable to satisfy dependency from 201801160715.deps 1.0.0._J7Y9KcLYUob_FdUtrEt0MgJZ to org.eclipse.sirius.runtime.aql.feature.group [4.1.2.201612021444].; Unable to satisfy dependency from 201801160715.deps 1.0.0._J7Y9KcLYUob_FdUtrEt0MgJZ to org.eclipse.acceleo.query.feature.group [5.0.2.201610060831].; Unable to satisfy dependency from 201801160715.deps 1.0.0._J7Y9KcLYUob_FdUtrEt0MgJZ to org.eclipse.sirius.runtime.aql.feature.group [4.1.3.201701271256].]
[WARNING] More information on the preceding warning(s) can be found here:
[WARNING] - http://wiki.eclipse.org/Tycho_Messages_Explained#Mirror_tool
[WARNING] Mirror tool: Problems resolving provisioning plan.: [Unable to satisfy dependency from 201801160715.deps 1.0.0._J7Y9KcLYUob_FdUtrEt0MgJZ to org.eclipse.sirius.runtime.ide.eef.feature.group [4.0.0.201605311157].; Unable to satisfy dependency from 201801160715.deps 1.0.0._J7Y9KcLYUob_FdUtrEt0MgJZ to org.eclipse.sirius.runtime.ide.eef.feature.group [4.1.2.201612021444].; Unable to satisfy dependency from 201801160715.deps 1.0.0._J7Y9KcLYUob_FdUtrEt0MgJZ to org.eclipse.sirius.runtime.ide.eef.feature.group [4.0.1.201608261223].; Unable to satisfy dependency from 201801160715.deps 1.0.0._J7Y9KcLYUob_FdUtrEt0MgJZ to org.eclipse.acceleo.query.feature.group [5.0.1.201608301456].; Unable to satisfy dependency from 201801160715.deps 1.0.0._J7Y9KcLYUob_FdUtrEt0MgJZ to org.eclipse.sirius.runtime.feature.group [4.1.3.201701271256].; Unable to satisfy dependency from 201801160715.deps 1.0.0._J7Y9KcLYUob_FdUtrEt0MgJZ to org.eclipse.acceleo.query.feature.group [5.0.0.201605260729].; Unable to satisfy dependency from 201801160715.deps 1.0.0._J7Y9KcLYUob_FdUtrEt0MgJZ to org.eclipse.sirius.runtime.feature.group [4.0.1.201608261223].; Unable to satisfy dependency from 201801160715.deps 1.0.0._J7Y9KcLYUob_FdUtrEt0MgJZ to org.eclipse.sirius.runtime.aql.feature.group [4.0.1.201608261223].; Unable to satisfy dependency from 201801160715.deps 1.0.0._J7Y9KcLYUob_FdUtrEt0MgJZ to org.eclipse.sirius.runtime.ide.eef.feature.group [4.1.3.201701271256].; Unable to satisfy dependency from 201801160715.deps 1.0.0._J7Y9KcLYUob_FdUtrEt0MgJZ to org.eclipse.sirius.runtime.feature.group [4.1.2.201612021444].; Unable to satisfy dependency from 201801160715.deps 1.0.0._J7Y9KcLYUob_FdUtrEt0MgJZ to org.eclipse.sirius.runtime.feature.group [4.0.0.201605311157].; Unable to satisfy dependency from 201801160715.deps 1.0.0._J7Y9KcLYUob_FdUtrEt0MgJZ to org.eclipse.sirius.runtime.ide.ui.feature.group [4.0.1.201608261223].; Unable to satisfy dependency from 201801160715.deps 1.0.0._J7Y9KcLYUob_FdUtrEt0MgJZ to org.eclipse.sirius.runtime.ide.ui.feature.group [4.1.2.201612021444].; Unable to satisfy dependency from 201801160715.deps 1.0.0._J7Y9KcLYUob_FdUtrEt0MgJZ to org.eclipse.sirius.runtime.ide.ui.feature.group [4.0.0.201605311157].; Unable to satisfy dependency from 201801160715.deps 1.0.0._J7Y9KcLYUob_FdUtrEt0MgJZ to org.eclipse.sirius.runtime.ide.ui.feature.group [4.1.3.201701271256].; Unable to satisfy dependency from 201801160715.deps 1.0.0._J7Y9KcLYUob_FdUtrEt0MgJZ to org.eclipse.sirius.runtime.aql.feature.group [4.0.0.201605311157].; Unable to satisfy dependency from 201801160715.deps 1.0.0._J7Y9KcLYUob_FdUtrEt0MgJZ to org.eclipse.sirius.runtime.aql.feature.group [4.1.2.201612021444].; Unable to satisfy dependency from 201801160715.deps 1.0.0._J7Y9KcLYUob_FdUtrEt0MgJZ to org.eclipse.acceleo.query.feature.group [5.0.2.201610060831].; Unable to satisfy dependency from 201801160715.deps 1.0.0._J7Y9KcLYUob_FdUtrEt0MgJZ to org.eclipse.sirius.runtime.aql.feature.group [4.1.3.201701271256].]
[WARNING] More information on the preceding warning(s) can be found here:
[WARNING] - http://wiki.eclipse.org/Tycho_Messages_Explained#Mirror_tool
[WARNING] Mirror tool: Problems resolving provisioning plan.: [Unable to satisfy dependency from 201801160715.deps 1.0.0._J7Y9KcLYUob_FdUtrEt0MgJZ to org.eclipse.sirius.runtime.ide.eef.feature.group [4.0.0.201605311157].; Unable to satisfy dependency from 201801160715.deps 1.0.0._J7Y9KcLYUob_FdUtrEt0MgJZ to org.eclipse.sirius.runtime.ide.eef.feature.group [4.1.2.201612021444].; Unable to satisfy dependency from 201801160715.deps 1.0.0._J7Y9KcLYUob_FdUtrEt0MgJZ to org.eclipse.sirius.runtime.ide.eef.feature.group [4.0.1.201608261223].; Unable to satisfy dependency from 201801160715.deps 1.0.0._J7Y9KcLYUob_FdUtrEt0MgJZ to org.eclipse.acceleo.query.feature.group [5.0.1.201608301456].; Unable to satisfy dependency from 201801160715.deps 1.0.0._J7Y9KcLYUob_FdUtrEt0MgJZ to org.eclipse.sirius.runtime.feature.group [4.1.3.201701271256].; Unable to satisfy dependency from 201801160715.deps 1.0.0._J7Y9KcLYUob_FdUtrEt0MgJZ to org.eclipse.acceleo.query.feature.group [5.0.0.201605260729].; Unable to satisfy dependency from 201801160715.deps 1.0.0._J7Y9KcLYUob_FdUtrEt0MgJZ to org.eclipse.sirius.runtime.feature.group [4.0.1.201608261223].; Unable to satisfy dependency from 201801160715.deps 1.0.0._J7Y9KcLYUob_FdUtrEt0MgJZ to org.eclipse.sirius.runtime.aql.feature.group [4.0.1.201608261223].; Unable to satisfy dependency from 201801160715.deps 1.0.0._J7Y9KcLYUob_FdUtrEt0MgJZ to org.eclipse.sirius.runtime.ide.eef.feature.group [4.1.3.201701271256].; Unable to satisfy dependency from 201801160715.deps 1.0.0._J7Y9KcLYUob_FdUtrEt0MgJZ to org.eclipse.sirius.runtime.feature.group [4.1.2.201612021444].; Unable to satisfy dependency from 201801160715.deps 1.0.0._J7Y9KcLYUob_FdUtrEt0MgJZ to org.eclipse.sirius.runtime.feature.group [4.0.0.201605311157].; Unable to satisfy dependency from 201801160715.deps 1.0.0._J7Y9KcLYUob_FdUtrEt0MgJZ to org.eclipse.sirius.runtime.ide.ui.feature.group [4.0.1.201608261223].; Unable to satisfy dependency from 201801160715.deps 1.0.0._J7Y9KcLYUob_FdUtrEt0MgJZ to org.eclipse.sirius.runtime.ide.ui.feature.group [4.1.2.201612021444].; Unable to satisfy dependency from 201801160715.deps 1.0.0._J7Y9KcLYUob_FdUtrEt0MgJZ to org.eclipse.sirius.runtime.ide.ui.feature.group [4.0.0.201605311157].; Unable to satisfy dependency from 201801160715.deps 1.0.0._J7Y9KcLYUob_FdUtrEt0MgJZ to org.eclipse.sirius.runtime.ide.ui.feature.group [4.1.3.201701271256].; Unable to satisfy dependency from 201801160715.deps 1.0.0._J7Y9KcLYUob_FdUtrEt0MgJZ to org.eclipse.sirius.runtime.aql.feature.group [4.0.0.201605311157].; Unable to satisfy dependency from 201801160715.deps 1.0.0._J7Y9KcLYUob_FdUtrEt0MgJZ to org.eclipse.sirius.runtime.aql.feature.group [4.1.2.201612021444].; Unable to satisfy dependency from 201801160715.deps 1.0.0._J7Y9KcLYUob_FdUtrEt0MgJZ to org.eclipse.acceleo.query.feature.group [5.0.2.201610060831].; Unable to satisfy dependency from 201801160715.deps 1.0.0._J7Y9KcLYUob_FdUtrEt0MgJZ to org.eclipse.sirius.runtime.aql.feature.group [4.1.3.201701271256].]
[WARNING] More information on the preceding warning(s) can be found here:
[WARNING] - http://wiki.eclipse.org/Tycho_Messages_Explained#Mirror_tool
[INFO] 
[INFO] --- tycho-p2-repository-plugin:0.23.1:archive-repository (default-archive-repository) @ org.eclipse.emf.ecoretools.update-all ---
[INFO] Building zip: /jobs/genie.sirius/ecoretools-3.2/workspace/org.eclipse.emf.ecoretools.update-all/target/org.eclipse.emf.ecoretools.update-all-in-one.zip
[INFO] 
[INFO] --- tycho-pack200a-plugin:0.23.1:normalize (pack200-normalize) @ org.eclipse.emf.ecoretools.update-all ---
[INFO] 
[INFO] --- eclipse-jarsigner-plugin:1.0.4:sign (sign) @ org.eclipse.emf.ecoretools.update-all ---
[INFO] 
[INFO] --- tycho-pack200b-plugin:0.23.1:pack (pack200-pack) @ org.eclipse.emf.ecoretools.update-all ---
[INFO] ------------------------------------------------------------------------
[INFO] Reactor Summary:
[INFO] 
[INFO] emf.ecoretools-parent .............................. SUCCESS [  3.567 s]
[INFO] org.eclipse.emf.ecoretools ......................... SUCCESS [  6.468 s]
[INFO] org.eclipse.emf.ecoretools.design .................. SUCCESS [  3.306 s]
[INFO] org.eclipse.emf.ecoretools.design.ui ............... SUCCESS [  3.354 s]
[INFO] org.eclipse.emf.ecoretools.design.tests ............ SUCCESS [ 17.895 s]
[INFO] org.eclipse.emf.ecoretools.ui ...................... SUCCESS [  2.382 s]
[INFO] org.eclipse.emf.ecoretools.doc ..................... SUCCESS [  2.235 s]
[INFO] org.eclipse.emf.ecoretools.tabbedproperties ........ SUCCESS [  3.087 s]
[INFO] org.eclipse.emf.ecoretools.properties .............. SUCCESS [  3.116 s]
[INFO] org.eclipse.emf.ecoretools.design.properties ....... SUCCESS [  4.453 s]
[INFO] org.eclipse.emf.ecoretools.design .................. SUCCESS [  1.100 s]
[INFO] org.eclipse.emf.ecoretools.doc ..................... SUCCESS [  0.857 s]
[INFO] org.eclipse.emf.ecoretools.registration ............ SUCCESS [  2.149 s]
[INFO] org.eclipse.emf.ecoretools.sdk ..................... SUCCESS [  1.078 s]
[INFO] org.eclipse.emf.ecoretools.explorer.contextual ..... SUCCESS [  2.086 s]
[INFO] org.eclipse.emf.ecoretools.explorer.contextual ..... SUCCESS [  0.979 s]
[INFO] org.eclipse.emf.ecoretools.update .................. SUCCESS [  9.040 s]
[INFO] org.eclipse.emf.ecoretools.update-all .............. SUCCESS [ 15.172 s]
[INFO] ------------------------------------------------------------------------
[INFO] BUILD SUCCESS
[INFO] ------------------------------------------------------------------------
[INFO] Total time: 04:14 min
[INFO] Finished at: 2018-01-16T02:16:28-05:00
[INFO] Final Memory: 239M/3491M
[INFO] ------------------------------------------------------------------------
[workspace] $ /bin/sh -xe /tmp/jenkins8976074334747774730.sh
+ sh /home/hudson/genie.sirius/.jenkins/jobs/ecoretools-3.2/workspace/org.eclipse.emf.ecoretools.build/publish-nightly.sh
Terminating xvnc.
Recording test results
Build step 'Publish JUnit test result report' changed build result to UNSTABLE
Archiving artifacts
Started calculate disk usage of build
Finished Calculation of disk usage of build in 0 seconds
Started calculate disk usage of workspace
Finished Calculation of disk usage of workspace in 0 seconds
Finished: UNSTABLE