FailedConsole Output

Started by user mandrikov@gmail.com
Checkout:workspace / /home/hudson/genie.eclemma/.hudson/jobs/test-downloads/workspace - hudson.remoting.LocalChannel@214a7382
Using strategy: Default
Git Exe: git
Last Built Revision: Revision 045d819fdecd7a745577385a6faee62bff3217b9 (origin/wip)
Checkout:workspace / /home/hudson/genie.eclemma/.hudson/jobs/test-downloads/workspace - hudson.remoting.LocalChannel@214a7382
Fetching changes from the remote Git repository
Fetching upstream changes from https://github.com/Godin/eclipse-eclemma.git
Commencing build of Revision 045d819fdecd7a745577385a6faee62bff3217b9 (origin/wip)
Checking out Revision 045d819fdecd7a745577385a6faee62bff3217b9 (origin/wip)
[INFO] Using Maven 3 installation: apache-maven-latest
[INFO] Checking Maven 3 installation environment
[workspace] $ /shared/common/apache-maven-latest/bin/mvn --help
[INFO] Checking Maven 3 installation version
[INFO] Detected Maven 3 installation version: 3.3.9
[workspace] $ /shared/common/apache-maven-latest/bin/mvn clean install -V -B -e -Dmaven.ext.class.path=/home/hudson/genie.eclemma/.hudson/maven/slavebundle/resources:/home/hudson/genie.eclemma/.hudson/maven/slavebundle/lib/maven3-eventspy-3.1.jar:/home/hudson/genie.eclemma/.hudson/war/webapp/WEB-INF/lib/hudson-remoting-3.0.3.jar -Dhudson.eventspy.port=56956 -Dmaven.repo.local=/home/hudson/genie.eclemma/.hudson/jobs/test-downloads/workspace/.maven/repo -f pom.xml -P publish
[DEBUG] Waiting for connection on port: 56956
Apache Maven 3.3.9 (bb52d8502b132ec0a5a3f4c09453c07478323dc5; 2015-11-10T11:41:47-05:00)
Maven home: /shared/common/apache-maven-latest
Java version: 1.7.0_80, vendor: Oracle Corporation
Java home: /opt/public/common/jdk1.7.0_80/jre
Default locale: en_US, platform encoding: UTF-8
OS name: "linux", version: "3.12.51-52.39-default", arch: "amd64", family: "unix"
SLF4J: Class path contains multiple SLF4J bindings.
SLF4J: Found binding in [jar:file:/home/hudson/genie.eclemma/.hudson/maven/slavebundle/lib/maven3-eventspy-runtime.jar!/org/slf4j/impl/StaticLoggerBinder.class]
SLF4J: Found binding in [jar:file:/shared/common/apache-maven-latest/lib/slf4j-simple-1.7.5.jar!/org/slf4j/impl/StaticLoggerBinder.class]
SLF4J: See http://www.slf4j.org/codes.html#multiple_bindings for an explanation.
[DEBUG] Connected to remote
[INFO] Error stacktraces are turned on.
[WARN] o.h.m.e.EventSpyProcessor - Unhandled event: org.apache.maven.toolchain.building.DefaultToolchainsBuildingRequest@23d90c0d (org.apache.maven.toolchain.building.DefaultToolchainsBuildingRequest)
[WARN] o.h.m.e.EventSpyProcessor - Unhandled event: org.apache.maven.toolchain.building.DefaultToolchainsBuildingRequest@23d90c0d (org.apache.maven.toolchain.building.DefaultToolchainsBuildingRequest)
[INFO] Scanning for projects...
[INFO] Computing target platform for MavenProject: org.eclipse.eclemma:org.eclipse.eclemma.asm:2.3.4-SNAPSHOT @ /jobs/genie.eclemma/test-downloads/workspace/org.eclipse.eclemma.asm/pom.xml
[INFO] Adding repository http://download.eclipse.org/releases/galileo
[INFO] Fetching p2.index from http://download.eclipse.org/tools/orbit/downloads/drops/R20110523182458/repository/ (0B at 0B/s)
[INFO] Adding repository http://download.eclipse.org/tools/orbit/downloads/drops/R20110523182458/repository
[INFO] Resolving dependencies of MavenProject: org.eclipse.eclemma:org.eclipse.eclemma.asm:2.3.4-SNAPSHOT @ /jobs/genie.eclemma/test-downloads/workspace/org.eclipse.eclemma.asm/pom.xml
[INFO] Resolving class path of MavenProject: org.eclipse.eclemma:org.eclipse.eclemma.asm:2.3.4-SNAPSHOT @ /jobs/genie.eclemma/test-downloads/workspace/org.eclipse.eclemma.asm/pom.xml
[INFO] Computing target platform for MavenProject: org.eclipse.eclemma:org.eclipse.eclemma.core:2.3.4-SNAPSHOT @ /jobs/genie.eclemma/test-downloads/workspace/org.eclipse.eclemma.core/pom.xml
[INFO] Resolving dependencies of MavenProject: org.eclipse.eclemma:org.eclipse.eclemma.core:2.3.4-SNAPSHOT @ /jobs/genie.eclemma/test-downloads/workspace/org.eclipse.eclemma.core/pom.xml
[INFO] Resolving class path of MavenProject: org.eclipse.eclemma:org.eclipse.eclemma.core:2.3.4-SNAPSHOT @ /jobs/genie.eclemma/test-downloads/workspace/org.eclipse.eclemma.core/pom.xml
[INFO] Computing target platform for MavenProject: org.eclipse.eclemma:org.eclipse.eclemma.core.test:2.3.4-SNAPSHOT @ /jobs/genie.eclemma/test-downloads/workspace/org.eclipse.eclemma.core.test/pom.xml
[INFO] Resolving dependencies of MavenProject: org.eclipse.eclemma:org.eclipse.eclemma.core.test:2.3.4-SNAPSHOT @ /jobs/genie.eclemma/test-downloads/workspace/org.eclipse.eclemma.core.test/pom.xml
[INFO] Resolving class path of MavenProject: org.eclipse.eclemma:org.eclipse.eclemma.core.test:2.3.4-SNAPSHOT @ /jobs/genie.eclemma/test-downloads/workspace/org.eclipse.eclemma.core.test/pom.xml
[INFO] Computing target platform for MavenProject: org.eclipse.eclemma:org.eclipse.eclemma.debug.ui.compatibility:2.3.4-SNAPSHOT @ /jobs/genie.eclemma/test-downloads/workspace/org.eclipse.eclemma.debug.ui.compatibility/pom.xml
[INFO] Resolving dependencies of MavenProject: org.eclipse.eclemma:org.eclipse.eclemma.debug.ui.compatibility:2.3.4-SNAPSHOT @ /jobs/genie.eclemma/test-downloads/workspace/org.eclipse.eclemma.debug.ui.compatibility/pom.xml
[INFO] Resolving class path of MavenProject: org.eclipse.eclemma:org.eclipse.eclemma.debug.ui.compatibility:2.3.4-SNAPSHOT @ /jobs/genie.eclemma/test-downloads/workspace/org.eclipse.eclemma.debug.ui.compatibility/pom.xml
[INFO] Computing target platform for MavenProject: org.eclipse.eclemma:org.eclipse.eclemma.ui:2.3.4-SNAPSHOT @ /jobs/genie.eclemma/test-downloads/workspace/org.eclipse.eclemma.ui/pom.xml
[INFO] Resolving dependencies of MavenProject: org.eclipse.eclemma:org.eclipse.eclemma.ui:2.3.4-SNAPSHOT @ /jobs/genie.eclemma/test-downloads/workspace/org.eclipse.eclemma.ui/pom.xml
[INFO] Resolving class path of MavenProject: org.eclipse.eclemma:org.eclipse.eclemma.ui:2.3.4-SNAPSHOT @ /jobs/genie.eclemma/test-downloads/workspace/org.eclipse.eclemma.ui/pom.xml
[INFO] Computing target platform for MavenProject: org.eclipse.eclemma:org.eclipse.eclemma.doc:2.3.4-SNAPSHOT @ /jobs/genie.eclemma/test-downloads/workspace/org.eclipse.eclemma.doc/pom.xml
[INFO] Resolving dependencies of MavenProject: org.eclipse.eclemma:org.eclipse.eclemma.doc:2.3.4-SNAPSHOT @ /jobs/genie.eclemma/test-downloads/workspace/org.eclipse.eclemma.doc/pom.xml
[INFO] Resolving class path of MavenProject: org.eclipse.eclemma:org.eclipse.eclemma.doc:2.3.4-SNAPSHOT @ /jobs/genie.eclemma/test-downloads/workspace/org.eclipse.eclemma.doc/pom.xml
[INFO] Computing target platform for MavenProject: org.eclipse.eclemma:org.eclipse.eclemma.feature:2.3.4-SNAPSHOT @ /jobs/genie.eclemma/test-downloads/workspace/org.eclipse.eclemma.feature/pom.xml
[INFO] Resolving dependencies of MavenProject: org.eclipse.eclemma:org.eclipse.eclemma.feature:2.3.4-SNAPSHOT @ /jobs/genie.eclemma/test-downloads/workspace/org.eclipse.eclemma.feature/pom.xml
[INFO] Resolving class path of MavenProject: org.eclipse.eclemma:org.eclipse.eclemma.feature:2.3.4-SNAPSHOT @ /jobs/genie.eclemma/test-downloads/workspace/org.eclipse.eclemma.feature/pom.xml
[INFO] Computing target platform for MavenProject: org.eclipse.eclemma:EclEmma:2.3.4-SNAPSHOT @ /jobs/genie.eclemma/test-downloads/workspace/org.eclipse.eclemma.site/pom.xml
[INFO] Resolving dependencies of MavenProject: org.eclipse.eclemma:EclEmma:2.3.4-SNAPSHOT @ /jobs/genie.eclemma/test-downloads/workspace/org.eclipse.eclemma.site/pom.xml
[INFO] Resolving class path of MavenProject: org.eclipse.eclemma:EclEmma:2.3.4-SNAPSHOT @ /jobs/genie.eclemma/test-downloads/workspace/org.eclipse.eclemma.site/pom.xml
[INFO] ------------------------------------------------------------------------
[INFO] Reactor Build Order:
[INFO] 
[INFO] EclEmma
[INFO] org.eclipse.eclemma.target
[INFO] org.eclipse.eclemma.asm
[INFO] org.eclipse.eclemma.core
[INFO] org.eclipse.eclemma.core.test
[INFO] org.eclipse.eclemma.debug.ui.compatibility
[INFO] org.eclipse.eclemma.ui
[INFO] org.eclipse.eclemma.doc
[INFO] org.eclipse.eclemma.feature
[INFO] EclEmma
[INFO] eclemma
[INFO]                                                                         
[INFO] ------------------------------------------------------------------------
[INFO] Building EclEmma 2.3.4-SNAPSHOT
[INFO] ------------------------------------------------------------------------
[INFO] 
[INFO] --- maven-clean-plugin:2.5:clean (default-clean) @ org.eclipse.eclemma.build ---
[INFO] 
[INFO] --- jacoco-maven-plugin:0.7.7.201606060606:prepare-agent (default) @ org.eclipse.eclemma.build ---
[INFO] argLine set to -javaagent:/home/hudson/genie.eclemma/.hudson/jobs/test-downloads/workspace/.maven/repo/org/jacoco/org.jacoco.agent/0.7.7.201606060606/org.jacoco.agent-0.7.7.201606060606-runtime.jar=destfile=/jobs/genie.eclemma/test-downloads/workspace/org.eclipse.eclemma.build/../target/jacoco.exec,includes=org.eclipse.eclemma.*,sessionid=org.eclipse.eclemma.build
[INFO] 
[INFO] --- maven-install-plugin:2.4:install (default-install) @ org.eclipse.eclemma.build ---
[INFO] Installing /jobs/genie.eclemma/test-downloads/workspace/org.eclipse.eclemma.build/pom.xml to /home/hudson/genie.eclemma/.hudson/jobs/test-downloads/workspace/.maven/repo/org/eclipse/eclemma/org.eclipse.eclemma.build/2.3.4-SNAPSHOT/org.eclipse.eclemma.build-2.3.4-SNAPSHOT.pom
[INFO]                                                                         
[INFO] ------------------------------------------------------------------------
[INFO] Building org.eclipse.eclemma.target 2.3.4-SNAPSHOT
[INFO] ------------------------------------------------------------------------
[INFO] 
[INFO] --- maven-clean-plugin:2.5:clean (default-clean) @ org.eclipse.eclemma.target ---
[INFO] 
[INFO] --- jacoco-maven-plugin:0.7.7.201606060606:prepare-agent (default) @ org.eclipse.eclemma.target ---
[INFO] argLine set to -javaagent:/home/hudson/genie.eclemma/.hudson/jobs/test-downloads/workspace/.maven/repo/org/jacoco/org.jacoco.agent/0.7.7.201606060606/org.jacoco.agent-0.7.7.201606060606-runtime.jar=destfile=/jobs/genie.eclemma/test-downloads/workspace/org.eclipse.eclemma.target/../target/jacoco.exec,includes=org.eclipse.eclemma.*,sessionid=org.eclipse.eclemma.target
[INFO] 
[INFO] --- build-helper-maven-plugin:1.9.1:attach-artifact (attach-artifacts) @ org.eclipse.eclemma.target ---
[INFO] 
[INFO] --- maven-install-plugin:2.4:install (default-install) @ org.eclipse.eclemma.target ---
[INFO] Installing /jobs/genie.eclemma/test-downloads/workspace/org.eclipse.eclemma.target/pom.xml to /home/hudson/genie.eclemma/.hudson/jobs/test-downloads/workspace/.maven/repo/org/eclipse/eclemma/org.eclipse.eclemma.target/2.3.4-SNAPSHOT/org.eclipse.eclemma.target-2.3.4-SNAPSHOT.pom
[INFO] Installing /jobs/genie.eclemma/test-downloads/workspace/org.eclipse.eclemma.target/eclemma-e3.5.target to /home/hudson/genie.eclemma/.hudson/jobs/test-downloads/workspace/.maven/repo/org/eclipse/eclemma/org.eclipse.eclemma.target/2.3.4-SNAPSHOT/org.eclipse.eclemma.target-2.3.4-SNAPSHOT-eclemma-e3.5.target
[INFO] Installing /jobs/genie.eclemma/test-downloads/workspace/org.eclipse.eclemma.target/eclemma-e3.6.target to /home/hudson/genie.eclemma/.hudson/jobs/test-downloads/workspace/.maven/repo/org/eclipse/eclemma/org.eclipse.eclemma.target/2.3.4-SNAPSHOT/org.eclipse.eclemma.target-2.3.4-SNAPSHOT-eclemma-e3.6.target
[INFO] Installing /jobs/genie.eclemma/test-downloads/workspace/org.eclipse.eclemma.target/eclemma-e3.7.target to /home/hudson/genie.eclemma/.hudson/jobs/test-downloads/workspace/.maven/repo/org/eclipse/eclemma/org.eclipse.eclemma.target/2.3.4-SNAPSHOT/org.eclipse.eclemma.target-2.3.4-SNAPSHOT-eclemma-e3.7.target
[INFO] Installing /jobs/genie.eclemma/test-downloads/workspace/org.eclipse.eclemma.target/eclemma-e3.8.target to /home/hudson/genie.eclemma/.hudson/jobs/test-downloads/workspace/.maven/repo/org/eclipse/eclemma/org.eclipse.eclemma.target/2.3.4-SNAPSHOT/org.eclipse.eclemma.target-2.3.4-SNAPSHOT-eclemma-e3.8.target
[INFO]                                                                         
[INFO] ------------------------------------------------------------------------
[INFO] Building org.eclipse.eclemma.asm 2.3.4-SNAPSHOT
[INFO] ------------------------------------------------------------------------
[INFO] 
[INFO] --- maven-clean-plugin:2.5:clean (default-clean) @ org.eclipse.eclemma.asm ---
[INFO] Deleting /jobs/genie.eclemma/test-downloads/workspace/org.eclipse.eclemma.asm/target
[INFO] 
[INFO] --- tycho-packaging-plugin:0.22.0:build-qualifier (default-build-qualifier) @ org.eclipse.eclemma.asm ---
[INFO] The project's OSGi version is 2.3.4.201609011800
[INFO] 
[INFO] --- tycho-packaging-plugin:0.22.0:validate-id (default-validate-id) @ org.eclipse.eclemma.asm ---
[INFO] 
[INFO] --- tycho-packaging-plugin:0.22.0:validate-version (default-validate-version) @ org.eclipse.eclemma.asm ---
[INFO] 
[INFO] --- jacoco-maven-plugin:0.7.7.201606060606:prepare-agent (default) @ org.eclipse.eclemma.asm ---
[INFO] argLine set to -javaagent:/home/hudson/genie.eclemma/.hudson/jobs/test-downloads/workspace/.maven/repo/org/jacoco/org.jacoco.agent/0.7.7.201606060606/org.jacoco.agent-0.7.7.201606060606-runtime.jar=destfile=/jobs/genie.eclemma/test-downloads/workspace/org.eclipse.eclemma.asm/../target/jacoco.exec,includes=org.eclipse.eclemma.*,sessionid=org.eclipse.eclemma.asm
[INFO] 
[INFO] --- maven-resources-plugin:2.4.3:resources (default-resources) @ org.eclipse.eclemma.asm ---
[INFO] Using 'UTF-8' encoding to copy filtered resources.
[INFO] skip non existing resourceDirectory /jobs/genie.eclemma/test-downloads/workspace/org.eclipse.eclemma.asm/src/main/resources
[INFO] 
[INFO] --- tycho-compiler-plugin:0.22.0:compile (default-compile) @ org.eclipse.eclemma.asm ---
[INFO] No sources to compile
[WARNING] Source directory /jobs/genie.eclemma/test-downloads/workspace/org.eclipse.eclemma.asm/src does not exist
[INFO] 
[INFO] --- maven-dependency-plugin:2.10:unpack (unpack) @ org.eclipse.eclemma.asm ---
[INFO] Configured Artifact: org.ow2.asm:asm-all:5.1:jar
[INFO] Unpacking /home/hudson/genie.eclemma/.hudson/jobs/test-downloads/workspace/.maven/repo/org/ow2/asm/asm-all/5.1/asm-all-5.1.jar to /jobs/genie.eclemma/test-downloads/workspace/org.eclipse.eclemma.asm/target/classes with includes "" and excludes ""
[INFO] 
[INFO] --- maven-resources-plugin:2.4.3:testResources (default-testResources) @ org.eclipse.eclemma.asm ---
[INFO] Using 'UTF-8' encoding to copy filtered resources.
[INFO] skip non existing resourceDirectory /jobs/genie.eclemma/test-downloads/workspace/org.eclipse.eclemma.asm/src/test/resources
[INFO] 
[INFO] --- target-platform-configuration:0.22.0:target-platform (default-target-platform) @ org.eclipse.eclemma.asm ---
[INFO] 
[INFO] --- tycho-packaging-plugin:0.22.0:package-plugin (default-package-plugin) @ org.eclipse.eclemma.asm ---
[INFO] Building jar: /jobs/genie.eclemma/test-downloads/workspace/org.eclipse.eclemma.asm/target/org.eclipse.eclemma.asm-2.3.4-SNAPSHOT.jar
[INFO] 
[INFO] --- tycho-p2-plugin:0.22.0:p2-metadata-default (default-p2-metadata-default) @ org.eclipse.eclemma.asm ---
[INFO] 
[INFO] --- maven-install-plugin:2.3.1:install (default-install) @ org.eclipse.eclemma.asm ---
[INFO] Installing /jobs/genie.eclemma/test-downloads/workspace/org.eclipse.eclemma.asm/target/org.eclipse.eclemma.asm-2.3.4-SNAPSHOT.jar to /home/hudson/genie.eclemma/.hudson/jobs/test-downloads/workspace/.maven/repo/org/eclipse/eclemma/org.eclipse.eclemma.asm/2.3.4-SNAPSHOT/org.eclipse.eclemma.asm-2.3.4-SNAPSHOT.jar
[INFO] Installing /jobs/genie.eclemma/test-downloads/workspace/org.eclipse.eclemma.asm/pom.xml to /home/hudson/genie.eclemma/.hudson/jobs/test-downloads/workspace/.maven/repo/org/eclipse/eclemma/org.eclipse.eclemma.asm/2.3.4-SNAPSHOT/org.eclipse.eclemma.asm-2.3.4-SNAPSHOT.pom
[INFO] Installing /jobs/genie.eclemma/test-downloads/workspace/org.eclipse.eclemma.asm/target/p2content.xml to /home/hudson/genie.eclemma/.hudson/jobs/test-downloads/workspace/.maven/repo/org/eclipse/eclemma/org.eclipse.eclemma.asm/2.3.4-SNAPSHOT/org.eclipse.eclemma.asm-2.3.4-SNAPSHOT-p2metadata.xml
[INFO] Installing /jobs/genie.eclemma/test-downloads/workspace/org.eclipse.eclemma.asm/target/p2artifacts.xml to /home/hudson/genie.eclemma/.hudson/jobs/test-downloads/workspace/.maven/repo/org/eclipse/eclemma/org.eclipse.eclemma.asm/2.3.4-SNAPSHOT/org.eclipse.eclemma.asm-2.3.4-SNAPSHOT-p2artifacts.xml
[INFO] 
[INFO] --- tycho-p2-plugin:0.22.0:update-local-index (default-update-local-index) @ org.eclipse.eclemma.asm ---
[INFO]                                                                         
[INFO] ------------------------------------------------------------------------
[INFO] Building org.eclipse.eclemma.core 2.3.4-SNAPSHOT
[INFO] ------------------------------------------------------------------------
[INFO] 
[INFO] --- maven-clean-plugin:2.5:clean (default-clean) @ org.eclipse.eclemma.core ---
[INFO] Deleting /jobs/genie.eclemma/test-downloads/workspace/org.eclipse.eclemma.core/target
[INFO] 
[INFO] --- tycho-packaging-plugin:0.22.0:build-qualifier (default-build-qualifier) @ org.eclipse.eclemma.core ---
[INFO] The project's OSGi version is 2.3.4.201609011800
[INFO] 
[INFO] --- tycho-packaging-plugin:0.22.0:validate-id (default-validate-id) @ org.eclipse.eclemma.core ---
[INFO] 
[INFO] --- tycho-packaging-plugin:0.22.0:validate-version (default-validate-version) @ org.eclipse.eclemma.core ---
[INFO] 
[INFO] --- jacoco-maven-plugin:0.7.7.201606060606:prepare-agent (default) @ org.eclipse.eclemma.core ---
[INFO] argLine set to -javaagent:/home/hudson/genie.eclemma/.hudson/jobs/test-downloads/workspace/.maven/repo/org/jacoco/org.jacoco.agent/0.7.7.201606060606/org.jacoco.agent-0.7.7.201606060606-runtime.jar=destfile=/jobs/genie.eclemma/test-downloads/workspace/org.eclipse.eclemma.core/../target/jacoco.exec,includes=org.eclipse.eclemma.*,sessionid=org.eclipse.eclemma.core
[INFO] 
[INFO] --- maven-resources-plugin:2.4.3:resources (default-resources) @ org.eclipse.eclemma.core ---
[INFO] Using 'UTF-8' encoding to copy filtered resources.
[INFO] skip non existing resourceDirectory /jobs/genie.eclemma/test-downloads/workspace/org.eclipse.eclemma.core/src/main/resources
[INFO] 
[INFO] --- tycho-compiler-plugin:0.22.0:compile (default-compile) @ org.eclipse.eclemma.core ---
[INFO] Compiling 46 source files to /jobs/genie.eclemma/test-downloads/workspace/org.eclipse.eclemma.core/target/classes
[INFO] 
[INFO] --- maven-resources-plugin:2.4.3:testResources (default-testResources) @ org.eclipse.eclemma.core ---
[INFO] Using 'UTF-8' encoding to copy filtered resources.
[INFO] skip non existing resourceDirectory /jobs/genie.eclemma/test-downloads/workspace/org.eclipse.eclemma.core/src/test/resources
[INFO] 
[INFO] --- target-platform-configuration:0.22.0:target-platform (default-target-platform) @ org.eclipse.eclemma.core ---
[INFO] 
[INFO] --- tycho-packaging-plugin:0.22.0:package-plugin (default-package-plugin) @ org.eclipse.eclemma.core ---
[INFO] Building jar: /jobs/genie.eclemma/test-downloads/workspace/org.eclipse.eclemma.core/target/org.eclipse.eclemma.core-2.3.4-SNAPSHOT.jar
[INFO] 
[INFO] --- tycho-p2-plugin:0.22.0:p2-metadata-default (default-p2-metadata-default) @ org.eclipse.eclemma.core ---
[INFO] 
[INFO] --- maven-install-plugin:2.3.1:install (default-install) @ org.eclipse.eclemma.core ---
[INFO] Installing /jobs/genie.eclemma/test-downloads/workspace/org.eclipse.eclemma.core/target/org.eclipse.eclemma.core-2.3.4-SNAPSHOT.jar to /home/hudson/genie.eclemma/.hudson/jobs/test-downloads/workspace/.maven/repo/org/eclipse/eclemma/org.eclipse.eclemma.core/2.3.4-SNAPSHOT/org.eclipse.eclemma.core-2.3.4-SNAPSHOT.jar
[INFO] Installing /jobs/genie.eclemma/test-downloads/workspace/org.eclipse.eclemma.core/pom.xml to /home/hudson/genie.eclemma/.hudson/jobs/test-downloads/workspace/.maven/repo/org/eclipse/eclemma/org.eclipse.eclemma.core/2.3.4-SNAPSHOT/org.eclipse.eclemma.core-2.3.4-SNAPSHOT.pom
[INFO] Installing /jobs/genie.eclemma/test-downloads/workspace/org.eclipse.eclemma.core/target/p2content.xml to /home/hudson/genie.eclemma/.hudson/jobs/test-downloads/workspace/.maven/repo/org/eclipse/eclemma/org.eclipse.eclemma.core/2.3.4-SNAPSHOT/org.eclipse.eclemma.core-2.3.4-SNAPSHOT-p2metadata.xml
[INFO] Installing /jobs/genie.eclemma/test-downloads/workspace/org.eclipse.eclemma.core/target/p2artifacts.xml to /home/hudson/genie.eclemma/.hudson/jobs/test-downloads/workspace/.maven/repo/org/eclipse/eclemma/org.eclipse.eclemma.core/2.3.4-SNAPSHOT/org.eclipse.eclemma.core-2.3.4-SNAPSHOT-p2artifacts.xml
[INFO] 
[INFO] --- tycho-p2-plugin:0.22.0:update-local-index (default-update-local-index) @ org.eclipse.eclemma.core ---
[INFO]                                                                         
[INFO] ------------------------------------------------------------------------
[INFO] Building org.eclipse.eclemma.core.test 2.3.4-SNAPSHOT
[INFO] ------------------------------------------------------------------------
[INFO] 
[INFO] --- maven-clean-plugin:2.5:clean (default-clean) @ org.eclipse.eclemma.core.test ---
[INFO] Deleting /jobs/genie.eclemma/test-downloads/workspace/org.eclipse.eclemma.core.test/target
[INFO] 
[INFO] --- tycho-packaging-plugin:0.22.0:build-qualifier (default-build-qualifier) @ org.eclipse.eclemma.core.test ---
[INFO] The project's OSGi version is 2.3.4.201609011800
[INFO] 
[INFO] --- tycho-packaging-plugin:0.22.0:validate-id (default-validate-id) @ org.eclipse.eclemma.core.test ---
[INFO] 
[INFO] --- tycho-packaging-plugin:0.22.0:validate-version (default-validate-version) @ org.eclipse.eclemma.core.test ---
[INFO] 
[INFO] --- jacoco-maven-plugin:0.7.7.201606060606:prepare-agent (default) @ org.eclipse.eclemma.core.test ---
[INFO] tycho.testArgLine set to -javaagent:/home/hudson/genie.eclemma/.hudson/jobs/test-downloads/workspace/.maven/repo/org/jacoco/org.jacoco.agent/0.7.7.201606060606/org.jacoco.agent-0.7.7.201606060606-runtime.jar=destfile=/jobs/genie.eclemma/test-downloads/workspace/org.eclipse.eclemma.core.test/../target/jacoco.exec,includes=org.eclipse.eclemma.*,sessionid=org.eclipse.eclemma.core.test -Xmx800m
[INFO] 
[INFO] --- maven-resources-plugin:2.4.3:resources (default-resources) @ org.eclipse.eclemma.core.test ---
[INFO] Using 'UTF-8' encoding to copy filtered resources.
[INFO] skip non existing resourceDirectory /jobs/genie.eclemma/test-downloads/workspace/org.eclipse.eclemma.core.test/src/main/resources
[INFO] 
[INFO] --- tycho-compiler-plugin:0.22.0:compile (default-compile) @ org.eclipse.eclemma.core.test ---
[INFO] Compiling 20 source files to /jobs/genie.eclemma/test-downloads/workspace/org.eclipse.eclemma.core.test/target/classes
[INFO] 
[INFO] --- maven-resources-plugin:2.4.3:testResources (default-testResources) @ org.eclipse.eclemma.core.test ---
[INFO] Using 'UTF-8' encoding to copy filtered resources.
[INFO] skip non existing resourceDirectory /jobs/genie.eclemma/test-downloads/workspace/org.eclipse.eclemma.core.test/src/test/resources
[INFO] 
[INFO] --- target-platform-configuration:0.22.0:target-platform (default-target-platform) @ org.eclipse.eclemma.core.test ---
[INFO] 
[INFO] --- tycho-packaging-plugin:0.22.0:package-plugin (default-package-plugin) @ org.eclipse.eclemma.core.test ---
[INFO] Building jar: /jobs/genie.eclemma/test-downloads/workspace/org.eclipse.eclemma.core.test/target/org.eclipse.eclemma.core.test-2.3.4-SNAPSHOT.jar
[INFO] 
[INFO] --- tycho-p2-plugin:0.22.0:p2-metadata-default (default-p2-metadata-default) @ org.eclipse.eclemma.core.test ---
[INFO] 
[INFO] --- tycho-surefire-plugin:0.22.0:test (default-test) @ org.eclipse.eclemma.core.test ---
[INFO] Expected eclipse log file: /jobs/genie.eclemma/test-downloads/workspace/org.eclipse.eclemma.core.test/target/work/data/.metadata/.log
[INFO] Command line:
	[/opt/public/common/jdk1.7.0_80/jre/bin/java, -Dosgi.noShutdown=false, -Dosgi.os=linux, -Dosgi.ws=gtk, -Dosgi.arch=x86_64, -javaagent:/home/hudson/genie.eclemma/.hudson/jobs/test-downloads/workspace/.maven/repo/org/jacoco/org.jacoco.agent/0.7.7.201606060606/org.jacoco.agent-0.7.7.201606060606-runtime.jar=destfile=/jobs/genie.eclemma/test-downloads/workspace/org.eclipse.eclemma.core.test/../target/jacoco.exec,includes=org.eclipse.eclemma.*,sessionid=org.eclipse.eclemma.core.test, -Xmx800m, -Dosgi.clean=true, -jar, /jobs/genie.eclemma/test-downloads/workspace/.maven/repo/p2/osgi/bundle/org.eclipse.equinox.launcher/1.0.201.R35x_v20090715/org.eclipse.equinox.launcher-1.0.201.R35x_v20090715.jar, -data, /jobs/genie.eclemma/test-downloads/workspace/org.eclipse.eclemma.core.test/target/work/data, -install, /jobs/genie.eclemma/test-downloads/workspace/org.eclipse.eclemma.core.test/target/work, -configuration, /jobs/genie.eclemma/test-downloads/workspace/org.eclipse.eclemma.core.test/target/work/configuration, -application, org.eclipse.tycho.surefire.osgibooter.headlesstest, -testproperties, /jobs/genie.eclemma/test-downloads/workspace/org.eclipse.eclemma.core.test/target/surefire.properties]

-------------------------------------------------------
 T E S T S
-------------------------------------------------------
Running org.eclipse.eclemma.internal.core.DefaultScopeFilterTest
Tests run: 4, Failures: 0, Errors: 0, Skipped: 0, Time elapsed: 7.837 sec - in org.eclipse.eclemma.internal.core.DefaultScopeFilterTest
testSourceFoldersOnly(org.eclipse.eclemma.internal.core.DefaultScopeFilterTest)  Time elapsed: 4.649 sec
testSameProjectOnly(org.eclipse.eclemma.internal.core.DefaultScopeFilterTest)  Time elapsed: 0.622 sec
testFilter(org.eclipse.eclemma.internal.core.DefaultScopeFilterTest)  Time elapsed: 0.726 sec
testNoFilters(org.eclipse.eclemma.internal.core.DefaultScopeFilterTest)  Time elapsed: 1.73 sec
Running org.eclipse.eclemma.internal.core.CoverageSessionTest
Tests run: 3, Failures: 0, Errors: 0, Skipped: 0, Time elapsed: 3.174 sec - in org.eclipse.eclemma.internal.core.CoverageSessionTest
testAttributes(org.eclipse.eclemma.internal.core.CoverageSessionTest)  Time elapsed: 1.026 sec
testScopeUnmodifiable(org.eclipse.eclemma.internal.core.CoverageSessionTest)  Time elapsed: 1.161 sec
testReadExecutionData(org.eclipse.eclemma.internal.core.CoverageSessionTest)  Time elapsed: 0.984 sec
Running org.eclipse.eclemma.internal.core.launching.AdjustedLaunchConfigurationTest
Tests run: 7, Failures: 0, Errors: 0, Skipped: 0, Time elapsed: 0.017 sec - in org.eclipse.eclemma.internal.core.launching.AdjustedLaunchConfigurationTest
testHasAttributeNegative(org.eclipse.eclemma.internal.core.launching.AdjustedLaunchConfigurationTest)  Time elapsed: 0.006 sec
testHasAttributeOther(org.eclipse.eclemma.internal.core.launching.AdjustedLaunchConfigurationTest)  Time elapsed: 0 sec
testHasAttribute(org.eclipse.eclemma.internal.core.launching.AdjustedLaunchConfigurationTest)  Time elapsed: 0 sec
testGetAttribute(org.eclipse.eclemma.internal.core.launching.AdjustedLaunchConfigurationTest)  Time elapsed: 0.001 sec
testGetAttributePrepended(org.eclipse.eclemma.internal.core.launching.AdjustedLaunchConfigurationTest)  Time elapsed: 0 sec
testGetAttributeOther(org.eclipse.eclemma.internal.core.launching.AdjustedLaunchConfigurationTest)  Time elapsed: 0 sec
testGetAttributes(org.eclipse.eclemma.internal.core.launching.AdjustedLaunchConfigurationTest)  Time elapsed: 0.001 sec
Running org.eclipse.eclemma.internal.core.launching.AgentArgumentSupportTest
Tests run: 5, Failures: 0, Errors: 0, Skipped: 0, Time elapsed: 0.014 sec - in org.eclipse.eclemma.internal.core.launching.AgentArgumentSupportTest
testQuote2(org.eclipse.eclemma.internal.core.launching.AgentArgumentSupportTest)  Time elapsed: 0 sec
testQuote1(org.eclipse.eclemma.internal.core.launching.AgentArgumentSupportTest)  Time elapsed: 0 sec
testGetAgentFile(org.eclipse.eclemma.internal.core.launching.AgentArgumentSupportTest)  Time elapsed: 0.007 sec
testGetArgument(org.eclipse.eclemma.internal.core.launching.AgentArgumentSupportTest)  Time elapsed: 0.001 sec
testAddArgument(org.eclipse.eclemma.internal.core.launching.AgentArgumentSupportTest)  Time elapsed: 0 sec
Running org.eclipse.eclemma.internal.core.SessionManagerTest
Tests run: 25, Failures: 0, Errors: 0, Skipped: 0, Time elapsed: 0.109 sec - in org.eclipse.eclemma.internal.core.SessionManagerTest
testMergeSession2(org.eclipse.eclemma.internal.core.SessionManagerTest)  Time elapsed: 0.014 sec
testAddSession4(org.eclipse.eclemma.internal.core.SessionManagerTest)  Time elapsed: 0.004 sec
testAddSession5(org.eclipse.eclemma.internal.core.SessionManagerTest)  Time elapsed: 0.004 sec
testRemoveSession1(org.eclipse.eclemma.internal.core.SessionManagerTest)  Time elapsed: 0.004 sec
testRemoveSession2(org.eclipse.eclemma.internal.core.SessionManagerTest)  Time elapsed: 0.004 sec
testRemoveSession3(org.eclipse.eclemma.internal.core.SessionManagerTest)  Time elapsed: 0.003 sec
testRemoveSession4(org.eclipse.eclemma.internal.core.SessionManagerTest)  Time elapsed: 0.003 sec
testRemoveSessionsFor1(org.eclipse.eclemma.internal.core.SessionManagerTest)  Time elapsed: 0.004 sec
testRemoveSessionsFor2(org.eclipse.eclemma.internal.core.SessionManagerTest)  Time elapsed: 0.004 sec
testRemoveSessionsFor3(org.eclipse.eclemma.internal.core.SessionManagerTest)  Time elapsed: 0.003 sec
testRemoveAllSessions1(org.eclipse.eclemma.internal.core.SessionManagerTest)  Time elapsed: 0.004 sec
testRemoveAllSessions2(org.eclipse.eclemma.internal.core.SessionManagerTest)  Time elapsed: 0.003 sec
testGetSessions1(org.eclipse.eclemma.internal.core.SessionManagerTest)  Time elapsed: 0.003 sec
testActivateSession1(org.eclipse.eclemma.internal.core.SessionManagerTest)  Time elapsed: 0.003 sec
testActivateSession2(org.eclipse.eclemma.internal.core.SessionManagerTest)  Time elapsed: 0.004 sec
testActivateSession3(org.eclipse.eclemma.internal.core.SessionManagerTest)  Time elapsed: 0.005 sec
testRefreshActivateSession1(org.eclipse.eclemma.internal.core.SessionManagerTest)  Time elapsed: 0.003 sec
testRefreshActivateSession2(org.eclipse.eclemma.internal.core.SessionManagerTest)  Time elapsed: 0.003 sec
testAddSessionListener1(org.eclipse.eclemma.internal.core.SessionManagerTest)  Time elapsed: 0.003 sec
testAddSessionListener2(org.eclipse.eclemma.internal.core.SessionManagerTest)  Time elapsed: 0.002 sec
testRemoveSessionListener1(org.eclipse.eclemma.internal.core.SessionManagerTest)  Time elapsed: 0.003 sec
testMergeSession1(org.eclipse.eclemma.internal.core.SessionManagerTest)  Time elapsed: 0.004 sec
testAddSession1(org.eclipse.eclemma.internal.core.SessionManagerTest)  Time elapsed: 0.003 sec
testAddSession2(org.eclipse.eclemma.internal.core.SessionManagerTest)  Time elapsed: 0.002 sec
testAddSession3(org.eclipse.eclemma.internal.core.SessionManagerTest)  Time elapsed: 0.002 sec
Running org.eclipse.eclemma.internal.core.MemoryExecutionDataSourceTest
Tests run: 4, Failures: 0, Errors: 0, Skipped: 0, Time elapsed: 0.004 sec - in org.eclipse.eclemma.internal.core.MemoryExecutionDataSourceTest
testIsEmptyPositive(org.eclipse.eclemma.internal.core.MemoryExecutionDataSourceTest)  Time elapsed: 0 sec
testReadFrom(org.eclipse.eclemma.internal.core.MemoryExecutionDataSourceTest)  Time elapsed: 0.002 sec
testIsEmptyNegative(org.eclipse.eclemma.internal.core.MemoryExecutionDataSourceTest)  Time elapsed: 0 sec
testAccept(org.eclipse.eclemma.internal.core.MemoryExecutionDataSourceTest)  Time elapsed: 0 sec
Running org.eclipse.eclemma.internal.core.ExecutionDataFilesTest
Tests run: 3, Failures: 0, Errors: 0, Skipped: 0, Time elapsed: 0.019 sec - in org.eclipse.eclemma.internal.core.ExecutionDataFilesTest
testNewFile(org.eclipse.eclemma.internal.core.ExecutionDataFilesTest)  Time elapsed: 0.007 sec
testNewFileNegative(org.eclipse.eclemma.internal.core.ExecutionDataFilesTest)  Time elapsed: 0.006 sec
testDeleteTemporaryFiles(org.eclipse.eclemma.internal.core.ExecutionDataFilesTest)  Time elapsed: 0.003 sec
Running org.eclipse.eclemma.internal.core.analysis.SourceSignatureResolverTest
Tests run: 22, Failures: 0, Errors: 0, Skipped: 0, Time elapsed: 26.922 sec - in org.eclipse.eclemma.internal.core.analysis.SourceSignatureResolverTest
test_innerClassTypeVariable(org.eclipse.eclemma.internal.core.analysis.SourceSignatureResolverTest)  Time elapsed: 2.531 sec
test_int_int_int(org.eclipse.eclemma.internal.core.analysis.SourceSignatureResolverTest)  Time elapsed: 0.396 sec
test_short(org.eclipse.eclemma.internal.core.analysis.SourceSignatureResolverTest)  Time elapsed: 2.365 sec
test_charArr(org.eclipse.eclemma.internal.core.analysis.SourceSignatureResolverTest)  Time elapsed: 0.923 sec
test_byteArr3(org.eclipse.eclemma.internal.core.analysis.SourceSignatureResolverTest)  Time elapsed: 1.153 sec
test_String(org.eclipse.eclemma.internal.core.analysis.SourceSignatureResolverTest)  Time elapsed: 1.175 sec
test_Inner(org.eclipse.eclemma.internal.core.analysis.SourceSignatureResolverTest)  Time elapsed: 1.095 sec
test_javautilDate(org.eclipse.eclemma.internal.core.analysis.SourceSignatureResolverTest)  Time elapsed: 0.846 sec
test_javautilMapEntry(org.eclipse.eclemma.internal.core.analysis.SourceSignatureResolverTest)  Time elapsed: 1.245 sec
test_parameterizedType(org.eclipse.eclemma.internal.core.analysis.SourceSignatureResolverTest)  Time elapsed: 0.842 sec
test_parameterizedParameterizedType(org.eclipse.eclemma.internal.core.analysis.SourceSignatureResolverTest)  Time elapsed: 1.243 sec
test_parameterizedTypeWildcard(org.eclipse.eclemma.internal.core.analysis.SourceSignatureResolverTest)  Time elapsed: 0.926 sec
test_parameterizedTypeExtends(org.eclipse.eclemma.internal.core.analysis.SourceSignatureResolverTest)  Time elapsed: 1.132 sec
test_parameterizedTypeSuper(org.eclipse.eclemma.internal.core.analysis.SourceSignatureResolverTest)  Time elapsed: 0.998 sec
test_methodTypeVariable(org.eclipse.eclemma.internal.core.analysis.SourceSignatureResolverTest)  Time elapsed: 1.267 sec
test_methodTypeVariableExtends(org.eclipse.eclemma.internal.core.analysis.SourceSignatureResolverTest)  Time elapsed: 0.789 sec
test_methodTypeVariableExtends2(org.eclipse.eclemma.internal.core.analysis.SourceSignatureResolverTest)  Time elapsed: 2.06 sec
test_classTypeVariable(org.eclipse.eclemma.internal.core.analysis.SourceSignatureResolverTest)  Time elapsed: 0.58 sec
test_classTypeVariableExtends(org.eclipse.eclemma.internal.core.analysis.SourceSignatureResolverTest)  Time elapsed: 0.929 sec
test_classTypeVariableExtends2(org.eclipse.eclemma.internal.core.analysis.SourceSignatureResolverTest)  Time elapsed: 2.452 sec
test_NoArgs(org.eclipse.eclemma.internal.core.analysis.SourceSignatureResolverTest)  Time elapsed: 1 sec
test_int(org.eclipse.eclemma.internal.core.analysis.SourceSignatureResolverTest)  Time elapsed: 0.962 sec
Running org.eclipse.eclemma.internal.core.analysis.AnalyzedNodesTest
Tests run: 4, Failures: 0, Errors: 0, Skipped: 0, Time elapsed: 0.007 sec - in org.eclipse.eclemma.internal.core.analysis.AnalyzedNodesTest
testGetClassCoverageNegative(org.eclipse.eclemma.internal.core.analysis.AnalyzedNodesTest)  Time elapsed: 0.001 sec
testGetSourceFileCoverage(org.eclipse.eclemma.internal.core.analysis.AnalyzedNodesTest)  Time elapsed: 0.004 sec
testGetClassCoverage(org.eclipse.eclemma.internal.core.analysis.AnalyzedNodesTest)  Time elapsed: 0 sec
testGetSourceFileCoverageNegative(org.eclipse.eclemma.internal.core.analysis.AnalyzedNodesTest)  Time elapsed: 0 sec
Running org.eclipse.eclemma.internal.core.analysis.MethodLocatorTest
Tests run: 6, Failures: 0, Errors: 0, Skipped: 0, Time elapsed: 6.9 sec - in org.eclipse.eclemma.internal.core.analysis.MethodLocatorTest
testAmbiguousConstructor2(org.eclipse.eclemma.internal.core.analysis.MethodLocatorTest)  Time elapsed: 0.972 sec
testUnambiguousMethod(org.eclipse.eclemma.internal.core.analysis.MethodLocatorTest)  Time elapsed: 1.152 sec
testAmbiguousMethod1(org.eclipse.eclemma.internal.core.analysis.MethodLocatorTest)  Time elapsed: 0.877 sec
testAmbiguousMethod2(org.eclipse.eclemma.internal.core.analysis.MethodLocatorTest)  Time elapsed: 1.036 sec
testUnambiguousConstructor(org.eclipse.eclemma.internal.core.analysis.MethodLocatorTest)  Time elapsed: 1.182 sec
testAmbiguousConstructor1(org.eclipse.eclemma.internal.core.analysis.MethodLocatorTest)  Time elapsed: 1.678 sec
Running org.eclipse.eclemma.internal.core.analysis.BinarySignatureResolverTest
Tests run: 23, Failures: 0, Errors: 0, Skipped: 0, Time elapsed: 24.26 sec - in org.eclipse.eclemma.internal.core.analysis.BinarySignatureResolverTest
testGetParameterNoArgs(org.eclipse.eclemma.internal.core.analysis.BinarySignatureResolverTest)  Time elapsed: 0.661 sec
testGetParameterWithArgs(org.eclipse.eclemma.internal.core.analysis.BinarySignatureResolverTest)  Time elapsed: 0.757 sec
test_int_int_int(org.eclipse.eclemma.internal.core.analysis.BinarySignatureResolverTest)  Time elapsed: 1.081 sec
test_short(org.eclipse.eclemma.internal.core.analysis.BinarySignatureResolverTest)  Time elapsed: 1.209 sec
test_charArr(org.eclipse.eclemma.internal.core.analysis.BinarySignatureResolverTest)  Time elapsed: 0.897 sec
test_byteArr3(org.eclipse.eclemma.internal.core.analysis.BinarySignatureResolverTest)  Time elapsed: 1.189 sec
test_String(org.eclipse.eclemma.internal.core.analysis.BinarySignatureResolverTest)  Time elapsed: 1.008 sec
test_Inner(org.eclipse.eclemma.internal.core.analysis.BinarySignatureResolverTest)  Time elapsed: 0.903 sec
test_javautilDate(org.eclipse.eclemma.internal.core.analysis.BinarySignatureResolverTest)  Time elapsed: 1.064 sec
test_javautilMapEntry(org.eclipse.eclemma.internal.core.analysis.BinarySignatureResolverTest)  Time elapsed: 1.157 sec
test_parameterizedType(org.eclipse.eclemma.internal.core.analysis.BinarySignatureResolverTest)  Time elapsed: 0.993 sec
test_parameterizedParameterizedType(org.eclipse.eclemma.internal.core.analysis.BinarySignatureResolverTest)  Time elapsed: 0.935 sec
test_parameterizedTypeWildcard(org.eclipse.eclemma.internal.core.analysis.BinarySignatureResolverTest)  Time elapsed: 1.132 sec
test_parameterizedTypeExtends(org.eclipse.eclemma.internal.core.analysis.BinarySignatureResolverTest)  Time elapsed: 0.955 sec
test_parameterizedTypeSuper(org.eclipse.eclemma.internal.core.analysis.BinarySignatureResolverTest)  Time elapsed: 1.141 sec
test_methodTypeVariable(org.eclipse.eclemma.internal.core.analysis.BinarySignatureResolverTest)  Time elapsed: 2.466 sec
test_methodTypeVariableExtends(org.eclipse.eclemma.internal.core.analysis.BinarySignatureResolverTest)  Time elapsed: 0.35 sec
test_methodTypeVariableExtends2(org.eclipse.eclemma.internal.core.analysis.BinarySignatureResolverTest)  Time elapsed: 1.117 sec
test_classTypeVariable(org.eclipse.eclemma.internal.core.analysis.BinarySignatureResolverTest)  Time elapsed: 1.126 sec
test_classTypeVariableExtends(org.eclipse.eclemma.internal.core.analysis.BinarySignatureResolverTest)  Time elapsed: 0.93 sec
test_classTypeVariableExtends2(org.eclipse.eclemma.internal.core.analysis.BinarySignatureResolverTest)  Time elapsed: 1.045 sec
test_NoArgs(org.eclipse.eclemma.internal.core.analysis.BinarySignatureResolverTest)  Time elapsed: 1.131 sec
test_int(org.eclipse.eclemma.internal.core.analysis.BinarySignatureResolverTest)  Time elapsed: 1.002 sec
Running org.eclipse.eclemma.internal.core.analysis.SessionAnalyzerTest
Tests run: 6, Failures: 0, Errors: 0, Skipped: 0, Time elapsed: 0.874 sec - in org.eclipse.eclemma.internal.core.analysis.SessionAnalyzerTest
testGetNameExternalLibrary(org.eclipse.eclemma.internal.core.analysis.SessionAnalyzerTest)  Time elapsed: 0.228 sec
testGetNameSourceFolder(org.eclipse.eclemma.internal.core.analysis.SessionAnalyzerTest)  Time elapsed: 0.106 sec
testGetNameNestedSourceFolder(org.eclipse.eclemma.internal.core.analysis.SessionAnalyzerTest)  Time elapsed: 0.114 sec
testGetNameProjectRootSourceFolder(org.eclipse.eclemma.internal.core.analysis.SessionAnalyzerTest)  Time elapsed: 0.2 sec
testGetNameLocalLibrary(org.eclipse.eclemma.internal.core.analysis.SessionAnalyzerTest)  Time elapsed: 0.098 sec
testGetNameLocalLibraryInFolder(org.eclipse.eclemma.internal.core.analysis.SessionAnalyzerTest)  Time elapsed: 0.121 sec
Running org.eclipse.eclemma.internal.core.analysis.TypeTraverserTest
Tests run: 1, Failures: 0, Errors: 0, Skipped: 0, Time elapsed: 0.47 sec - in org.eclipse.eclemma.internal.core.analysis.TypeTraverserTest
testTraverse1(org.eclipse.eclemma.internal.core.analysis.TypeTraverserTest)  Time elapsed: 0.469 sec
Running org.eclipse.eclemma.internal.core.analysis.PackageFragmentRootAnalyzerTest
Tests run: 4, Failures: 0, Errors: 0, Skipped: 0, Time elapsed: 4.116 sec - in org.eclipse.eclemma.internal.core.analysis.PackageFragmentRootAnalyzerTest
testSourceWithOutputFolder(org.eclipse.eclemma.internal.core.analysis.PackageFragmentRootAnalyzerTest)  Time elapsed: 0.993 sec
testJar(org.eclipse.eclemma.internal.core.analysis.PackageFragmentRootAnalyzerTest)  Time elapsed: 1.017 sec
testExternalJar(org.eclipse.eclemma.internal.core.analysis.PackageFragmentRootAnalyzerTest)  Time elapsed: 1.098 sec
testSourceFolder(org.eclipse.eclemma.internal.core.analysis.PackageFragmentRootAnalyzerTest)  Time elapsed: 0.999 sec
Running org.eclipse.eclemma.core.URLExecutionDataSourceTest
Tests run: 2, Failures: 0, Errors: 0, Skipped: 0, Time elapsed: 0.013 sec - in org.eclipse.eclemma.core.URLExecutionDataSourceTest
testAcceptWithError(org.eclipse.eclemma.core.URLExecutionDataSourceTest)  Time elapsed: 0.008 sec
testAccept(org.eclipse.eclemma.core.URLExecutionDataSourceTest)  Time elapsed: 0.003 sec
Running org.eclipse.eclemma.core.launching.JavaApplicationLauncherTest
Tests run: 5, Failures: 0, Errors: 0, Skipped: 0, Time elapsed: 6.418 sec - in org.eclipse.eclemma.core.launching.JavaApplicationLauncherTest
testProjectWithSourceFolders(org.eclipse.eclemma.core.launching.JavaApplicationLauncherTest)  Time elapsed: 2.302 sec
testProjectWithRootSourceFolder(org.eclipse.eclemma.core.launching.JavaApplicationLauncherTest)  Time elapsed: 0.869 sec
testProjectWithLibrary(org.eclipse.eclemma.core.launching.JavaApplicationLauncherTest)  Time elapsed: 1.146 sec
testProjectWithProjectReference(org.eclipse.eclemma.core.launching.JavaApplicationLauncherTest)  Time elapsed: 0.955 sec
testNoProject(org.eclipse.eclemma.core.launching.JavaApplicationLauncherTest)  Time elapsed: 1.142 sec
Running org.eclipse.eclemma.core.EclEmmaStatusTest
Tests run: 5, Failures: 0, Errors: 0, Skipped: 0, Time elapsed: 0.004 sec - in org.eclipse.eclemma.core.EclEmmaStatusTest
testSeverity1(org.eclipse.eclemma.core.EclEmmaStatusTest)  Time elapsed: 0.001 sec
testCode1(org.eclipse.eclemma.core.EclEmmaStatusTest)  Time elapsed: 0 sec
testMessage1(org.eclipse.eclemma.core.EclEmmaStatusTest)  Time elapsed: 0 sec
testMessage2(org.eclipse.eclemma.core.EclEmmaStatusTest)  Time elapsed: 0 sec
testThrowable1(org.eclipse.eclemma.core.EclEmmaStatusTest)  Time elapsed: 0 sec

Results :

Tests run: 129, Failures: 0, Errors: 0, Skipped: 0

[INFO] All tests passed!
[INFO] 
[INFO] --- maven-install-plugin:2.3.1:install (default-install) @ org.eclipse.eclemma.core.test ---
[INFO] Installing /jobs/genie.eclemma/test-downloads/workspace/org.eclipse.eclemma.core.test/target/org.eclipse.eclemma.core.test-2.3.4-SNAPSHOT.jar to /home/hudson/genie.eclemma/.hudson/jobs/test-downloads/workspace/.maven/repo/org/eclipse/eclemma/org.eclipse.eclemma.core.test/2.3.4-SNAPSHOT/org.eclipse.eclemma.core.test-2.3.4-SNAPSHOT.jar
[INFO] Installing /jobs/genie.eclemma/test-downloads/workspace/org.eclipse.eclemma.core.test/pom.xml to /home/hudson/genie.eclemma/.hudson/jobs/test-downloads/workspace/.maven/repo/org/eclipse/eclemma/org.eclipse.eclemma.core.test/2.3.4-SNAPSHOT/org.eclipse.eclemma.core.test-2.3.4-SNAPSHOT.pom
[INFO] Installing /jobs/genie.eclemma/test-downloads/workspace/org.eclipse.eclemma.core.test/target/p2content.xml to /home/hudson/genie.eclemma/.hudson/jobs/test-downloads/workspace/.maven/repo/org/eclipse/eclemma/org.eclipse.eclemma.core.test/2.3.4-SNAPSHOT/org.eclipse.eclemma.core.test-2.3.4-SNAPSHOT-p2metadata.xml
[INFO] Installing /jobs/genie.eclemma/test-downloads/workspace/org.eclipse.eclemma.core.test/target/p2artifacts.xml to /home/hudson/genie.eclemma/.hudson/jobs/test-downloads/workspace/.maven/repo/org/eclipse/eclemma/org.eclipse.eclemma.core.test/2.3.4-SNAPSHOT/org.eclipse.eclemma.core.test-2.3.4-SNAPSHOT-p2artifacts.xml
[INFO] 
[INFO] --- tycho-p2-plugin:0.22.0:update-local-index (default-update-local-index) @ org.eclipse.eclemma.core.test ---
[INFO]                                                                         
[INFO] ------------------------------------------------------------------------
[INFO] Building org.eclipse.eclemma.debug.ui.compatibility 2.3.4-SNAPSHOT
[INFO] ------------------------------------------------------------------------
[INFO] 
[INFO] --- maven-clean-plugin:2.5:clean (default-clean) @ org.eclipse.eclemma.debug.ui.compatibility ---
[INFO] Deleting /jobs/genie.eclemma/test-downloads/workspace/org.eclipse.eclemma.debug.ui.compatibility/target
[INFO] 
[INFO] --- tycho-packaging-plugin:0.22.0:build-qualifier (default-build-qualifier) @ org.eclipse.eclemma.debug.ui.compatibility ---
[INFO] The project's OSGi version is 2.3.4.201609011800
[INFO] 
[INFO] --- tycho-packaging-plugin:0.22.0:validate-id (default-validate-id) @ org.eclipse.eclemma.debug.ui.compatibility ---
[INFO] 
[INFO] --- tycho-packaging-plugin:0.22.0:validate-version (default-validate-version) @ org.eclipse.eclemma.debug.ui.compatibility ---
[INFO] 
[INFO] --- jacoco-maven-plugin:0.7.7.201606060606:prepare-agent (default) @ org.eclipse.eclemma.debug.ui.compatibility ---
[INFO] argLine set to -javaagent:/home/hudson/genie.eclemma/.hudson/jobs/test-downloads/workspace/.maven/repo/org/jacoco/org.jacoco.agent/0.7.7.201606060606/org.jacoco.agent-0.7.7.201606060606-runtime.jar=destfile=/jobs/genie.eclemma/test-downloads/workspace/org.eclipse.eclemma.debug.ui.compatibility/../target/jacoco.exec,includes=org.eclipse.eclemma.*,sessionid=org.eclipse.eclemma.debug.ui.compatibility
[INFO] 
[INFO] --- maven-resources-plugin:2.4.3:resources (default-resources) @ org.eclipse.eclemma.debug.ui.compatibility ---
[INFO] Using 'UTF-8' encoding to copy filtered resources.
[INFO] skip non existing resourceDirectory /jobs/genie.eclemma/test-downloads/workspace/org.eclipse.eclemma.debug.ui.compatibility/src/main/resources
[INFO] 
[INFO] --- tycho-compiler-plugin:0.22.0:compile (default-compile) @ org.eclipse.eclemma.debug.ui.compatibility ---
[INFO] Compiling 1 source file to /jobs/genie.eclemma/test-downloads/workspace/org.eclipse.eclemma.debug.ui.compatibility/target/classes
[INFO] 
[INFO] --- maven-resources-plugin:2.4.3:testResources (default-testResources) @ org.eclipse.eclemma.debug.ui.compatibility ---
[INFO] Using 'UTF-8' encoding to copy filtered resources.
[INFO] skip non existing resourceDirectory /jobs/genie.eclemma/test-downloads/workspace/org.eclipse.eclemma.debug.ui.compatibility/src/test/resources
[INFO] 
[INFO] --- target-platform-configuration:0.22.0:target-platform (default-target-platform) @ org.eclipse.eclemma.debug.ui.compatibility ---
[INFO] 
[INFO] --- tycho-packaging-plugin:0.22.0:package-plugin (default-package-plugin) @ org.eclipse.eclemma.debug.ui.compatibility ---
[INFO] Building jar: /jobs/genie.eclemma/test-downloads/workspace/org.eclipse.eclemma.debug.ui.compatibility/target/org.eclipse.eclemma.debug.ui.compatibility-2.3.4-SNAPSHOT.jar
[INFO] 
[INFO] --- tycho-p2-plugin:0.22.0:p2-metadata-default (default-p2-metadata-default) @ org.eclipse.eclemma.debug.ui.compatibility ---
[INFO] 
[INFO] --- maven-install-plugin:2.3.1:install (default-install) @ org.eclipse.eclemma.debug.ui.compatibility ---
[INFO] Installing /jobs/genie.eclemma/test-downloads/workspace/org.eclipse.eclemma.debug.ui.compatibility/target/org.eclipse.eclemma.debug.ui.compatibility-2.3.4-SNAPSHOT.jar to /home/hudson/genie.eclemma/.hudson/jobs/test-downloads/workspace/.maven/repo/org/eclipse/eclemma/org.eclipse.eclemma.debug.ui.compatibility/2.3.4-SNAPSHOT/org.eclipse.eclemma.debug.ui.compatibility-2.3.4-SNAPSHOT.jar
[INFO] Installing /jobs/genie.eclemma/test-downloads/workspace/org.eclipse.eclemma.debug.ui.compatibility/pom.xml to /home/hudson/genie.eclemma/.hudson/jobs/test-downloads/workspace/.maven/repo/org/eclipse/eclemma/org.eclipse.eclemma.debug.ui.compatibility/2.3.4-SNAPSHOT/org.eclipse.eclemma.debug.ui.compatibility-2.3.4-SNAPSHOT.pom
[INFO] Installing /jobs/genie.eclemma/test-downloads/workspace/org.eclipse.eclemma.debug.ui.compatibility/target/p2content.xml to /home/hudson/genie.eclemma/.hudson/jobs/test-downloads/workspace/.maven/repo/org/eclipse/eclemma/org.eclipse.eclemma.debug.ui.compatibility/2.3.4-SNAPSHOT/org.eclipse.eclemma.debug.ui.compatibility-2.3.4-SNAPSHOT-p2metadata.xml
[INFO] Installing /jobs/genie.eclemma/test-downloads/workspace/org.eclipse.eclemma.debug.ui.compatibility/target/p2artifacts.xml to /home/hudson/genie.eclemma/.hudson/jobs/test-downloads/workspace/.maven/repo/org/eclipse/eclemma/org.eclipse.eclemma.debug.ui.compatibility/2.3.4-SNAPSHOT/org.eclipse.eclemma.debug.ui.compatibility-2.3.4-SNAPSHOT-p2artifacts.xml
[INFO] 
[INFO] --- tycho-p2-plugin:0.22.0:update-local-index (default-update-local-index) @ org.eclipse.eclemma.debug.ui.compatibility ---
[INFO]                                                                         
[INFO] ------------------------------------------------------------------------
[INFO] Building org.eclipse.eclemma.ui 2.3.4-SNAPSHOT
[INFO] ------------------------------------------------------------------------
[INFO] 
[INFO] --- maven-clean-plugin:2.5:clean (default-clean) @ org.eclipse.eclemma.ui ---
[INFO] Deleting /jobs/genie.eclemma/test-downloads/workspace/org.eclipse.eclemma.ui/target
[INFO] 
[INFO] --- tycho-packaging-plugin:0.22.0:build-qualifier (default-build-qualifier) @ org.eclipse.eclemma.ui ---
[INFO] The project's OSGi version is 2.3.4.201609011800
[INFO] 
[INFO] --- tycho-packaging-plugin:0.22.0:validate-id (default-validate-id) @ org.eclipse.eclemma.ui ---
[INFO] 
[INFO] --- tycho-packaging-plugin:0.22.0:validate-version (default-validate-version) @ org.eclipse.eclemma.ui ---
[INFO] 
[INFO] --- jacoco-maven-plugin:0.7.7.201606060606:prepare-agent (default) @ org.eclipse.eclemma.ui ---
[INFO] argLine set to -javaagent:/home/hudson/genie.eclemma/.hudson/jobs/test-downloads/workspace/.maven/repo/org/jacoco/org.jacoco.agent/0.7.7.201606060606/org.jacoco.agent-0.7.7.201606060606-runtime.jar=destfile=/jobs/genie.eclemma/test-downloads/workspace/org.eclipse.eclemma.ui/../target/jacoco.exec,includes=org.eclipse.eclemma.*,sessionid=org.eclipse.eclemma.ui
[INFO] 
[INFO] --- maven-resources-plugin:2.4.3:resources (default-resources) @ org.eclipse.eclemma.ui ---
[INFO] Using 'UTF-8' encoding to copy filtered resources.
[INFO] skip non existing resourceDirectory /jobs/genie.eclemma/test-downloads/workspace/org.eclipse.eclemma.ui/src/main/resources
[INFO] 
[INFO] --- tycho-compiler-plugin:0.22.0:compile (default-compile) @ org.eclipse.eclemma.ui ---
[INFO] Compiling 66 source files to /jobs/genie.eclemma/test-downloads/workspace/org.eclipse.eclemma.ui/target/classes
[INFO] 
[INFO] --- maven-resources-plugin:2.4.3:testResources (default-testResources) @ org.eclipse.eclemma.ui ---
[INFO] Using 'UTF-8' encoding to copy filtered resources.
[INFO] skip non existing resourceDirectory /jobs/genie.eclemma/test-downloads/workspace/org.eclipse.eclemma.ui/src/test/resources
[INFO] 
[INFO] --- target-platform-configuration:0.22.0:target-platform (default-target-platform) @ org.eclipse.eclemma.ui ---
[INFO] 
[INFO] --- tycho-packaging-plugin:0.22.0:package-plugin (default-package-plugin) @ org.eclipse.eclemma.ui ---
[INFO] Building jar: /jobs/genie.eclemma/test-downloads/workspace/org.eclipse.eclemma.ui/target/org.eclipse.eclemma.ui-2.3.4-SNAPSHOT.jar
[INFO] 
[INFO] --- tycho-p2-plugin:0.22.0:p2-metadata-default (default-p2-metadata-default) @ org.eclipse.eclemma.ui ---
[INFO] 
[INFO] --- maven-install-plugin:2.3.1:install (default-install) @ org.eclipse.eclemma.ui ---
[INFO] Installing /jobs/genie.eclemma/test-downloads/workspace/org.eclipse.eclemma.ui/target/org.eclipse.eclemma.ui-2.3.4-SNAPSHOT.jar to /home/hudson/genie.eclemma/.hudson/jobs/test-downloads/workspace/.maven/repo/org/eclipse/eclemma/org.eclipse.eclemma.ui/2.3.4-SNAPSHOT/org.eclipse.eclemma.ui-2.3.4-SNAPSHOT.jar
[INFO] Installing /jobs/genie.eclemma/test-downloads/workspace/org.eclipse.eclemma.ui/pom.xml to /home/hudson/genie.eclemma/.hudson/jobs/test-downloads/workspace/.maven/repo/org/eclipse/eclemma/org.eclipse.eclemma.ui/2.3.4-SNAPSHOT/org.eclipse.eclemma.ui-2.3.4-SNAPSHOT.pom
[INFO] Installing /jobs/genie.eclemma/test-downloads/workspace/org.eclipse.eclemma.ui/target/p2content.xml to /home/hudson/genie.eclemma/.hudson/jobs/test-downloads/workspace/.maven/repo/org/eclipse/eclemma/org.eclipse.eclemma.ui/2.3.4-SNAPSHOT/org.eclipse.eclemma.ui-2.3.4-SNAPSHOT-p2metadata.xml
[INFO] Installing /jobs/genie.eclemma/test-downloads/workspace/org.eclipse.eclemma.ui/target/p2artifacts.xml to /home/hudson/genie.eclemma/.hudson/jobs/test-downloads/workspace/.maven/repo/org/eclipse/eclemma/org.eclipse.eclemma.ui/2.3.4-SNAPSHOT/org.eclipse.eclemma.ui-2.3.4-SNAPSHOT-p2artifacts.xml
[INFO] 
[INFO] --- tycho-p2-plugin:0.22.0:update-local-index (default-update-local-index) @ org.eclipse.eclemma.ui ---
[INFO]                                                                         
[INFO] ------------------------------------------------------------------------
[INFO] Building org.eclipse.eclemma.doc 2.3.4-SNAPSHOT
[INFO] ------------------------------------------------------------------------
[INFO] 
[INFO] --- maven-clean-plugin:2.5:clean (default-clean) @ org.eclipse.eclemma.doc ---
[INFO] Deleting /jobs/genie.eclemma/test-downloads/workspace/org.eclipse.eclemma.doc/target
[INFO] 
[INFO] --- tycho-packaging-plugin:0.22.0:build-qualifier (default-build-qualifier) @ org.eclipse.eclemma.doc ---
[INFO] The project's OSGi version is 2.3.4.201609011800
[INFO] 
[INFO] --- tycho-packaging-plugin:0.22.0:validate-id (default-validate-id) @ org.eclipse.eclemma.doc ---
[INFO] 
[INFO] --- tycho-packaging-plugin:0.22.0:validate-version (default-validate-version) @ org.eclipse.eclemma.doc ---
[INFO] 
[INFO] --- jacoco-maven-plugin:0.7.7.201606060606:prepare-agent (default) @ org.eclipse.eclemma.doc ---
[INFO] argLine set to -javaagent:/home/hudson/genie.eclemma/.hudson/jobs/test-downloads/workspace/.maven/repo/org/jacoco/org.jacoco.agent/0.7.7.201606060606/org.jacoco.agent-0.7.7.201606060606-runtime.jar=destfile=/jobs/genie.eclemma/test-downloads/workspace/org.eclipse.eclemma.doc/../target/jacoco.exec,includes=org.eclipse.eclemma.*,sessionid=org.eclipse.eclemma.doc
[INFO] 
[INFO] --- maven-resources-plugin:2.4.3:resources (default-resources) @ org.eclipse.eclemma.doc ---
[INFO] Using 'UTF-8' encoding to copy filtered resources.
[INFO] skip non existing resourceDirectory /jobs/genie.eclemma/test-downloads/workspace/org.eclipse.eclemma.doc/src/main/resources
[INFO] 
[INFO] --- tycho-compiler-plugin:0.22.0:compile (default-compile) @ org.eclipse.eclemma.doc ---
[INFO] 
[INFO] --- maven-resources-plugin:2.4.3:testResources (default-testResources) @ org.eclipse.eclemma.doc ---
[INFO] Using 'UTF-8' encoding to copy filtered resources.
[INFO] skip non existing resourceDirectory /jobs/genie.eclemma/test-downloads/workspace/org.eclipse.eclemma.doc/src/test/resources
[INFO] 
[INFO] --- target-platform-configuration:0.22.0:target-platform (default-target-platform) @ org.eclipse.eclemma.doc ---
[INFO] 
[INFO] --- tycho-packaging-plugin:0.22.0:package-plugin (default-package-plugin) @ org.eclipse.eclemma.doc ---
[INFO] Building jar: /jobs/genie.eclemma/test-downloads/workspace/org.eclipse.eclemma.doc/target/org.eclipse.eclemma.doc-2.3.4-SNAPSHOT.jar
[INFO] 
[INFO] --- tycho-p2-plugin:0.22.0:p2-metadata-default (default-p2-metadata-default) @ org.eclipse.eclemma.doc ---
[INFO] 
[INFO] --- maven-install-plugin:2.3.1:install (default-install) @ org.eclipse.eclemma.doc ---
[INFO] Installing /jobs/genie.eclemma/test-downloads/workspace/org.eclipse.eclemma.doc/target/org.eclipse.eclemma.doc-2.3.4-SNAPSHOT.jar to /home/hudson/genie.eclemma/.hudson/jobs/test-downloads/workspace/.maven/repo/org/eclipse/eclemma/org.eclipse.eclemma.doc/2.3.4-SNAPSHOT/org.eclipse.eclemma.doc-2.3.4-SNAPSHOT.jar
[INFO] Installing /jobs/genie.eclemma/test-downloads/workspace/org.eclipse.eclemma.doc/pom.xml to /home/hudson/genie.eclemma/.hudson/jobs/test-downloads/workspace/.maven/repo/org/eclipse/eclemma/org.eclipse.eclemma.doc/2.3.4-SNAPSHOT/org.eclipse.eclemma.doc-2.3.4-SNAPSHOT.pom
[INFO] Installing /jobs/genie.eclemma/test-downloads/workspace/org.eclipse.eclemma.doc/target/p2content.xml to /home/hudson/genie.eclemma/.hudson/jobs/test-downloads/workspace/.maven/repo/org/eclipse/eclemma/org.eclipse.eclemma.doc/2.3.4-SNAPSHOT/org.eclipse.eclemma.doc-2.3.4-SNAPSHOT-p2metadata.xml
[INFO] Installing /jobs/genie.eclemma/test-downloads/workspace/org.eclipse.eclemma.doc/target/p2artifacts.xml to /home/hudson/genie.eclemma/.hudson/jobs/test-downloads/workspace/.maven/repo/org/eclipse/eclemma/org.eclipse.eclemma.doc/2.3.4-SNAPSHOT/org.eclipse.eclemma.doc-2.3.4-SNAPSHOT-p2artifacts.xml
[INFO] 
[INFO] --- tycho-p2-plugin:0.22.0:update-local-index (default-update-local-index) @ org.eclipse.eclemma.doc ---
[INFO]                                                                         
[INFO] ------------------------------------------------------------------------
[INFO] Building org.eclipse.eclemma.feature 2.3.4-SNAPSHOT
[INFO] ------------------------------------------------------------------------
[INFO] 
[INFO] --- maven-clean-plugin:2.5:clean (default-clean) @ org.eclipse.eclemma.feature ---
[INFO] Deleting /jobs/genie.eclemma/test-downloads/workspace/org.eclipse.eclemma.feature/target
[INFO] 
[INFO] --- tycho-packaging-plugin:0.22.0:build-qualifier-aggregator (default-build-qualifier-aggregator) @ org.eclipse.eclemma.feature ---
[INFO] The project's OSGi version is 2.3.4.201609011800
[INFO] 
[INFO] --- tycho-packaging-plugin:0.22.0:validate-id (default-validate-id) @ org.eclipse.eclemma.feature ---
[INFO] 
[INFO] --- tycho-packaging-plugin:0.22.0:validate-version (default-validate-version) @ org.eclipse.eclemma.feature ---
[INFO] 
[INFO] --- jacoco-maven-plugin:0.7.7.201606060606:prepare-agent (default) @ org.eclipse.eclemma.feature ---
[INFO] argLine set to -javaagent:/home/hudson/genie.eclemma/.hudson/jobs/test-downloads/workspace/.maven/repo/org/jacoco/org.jacoco.agent/0.7.7.201606060606/org.jacoco.agent-0.7.7.201606060606-runtime.jar=destfile=/jobs/genie.eclemma/test-downloads/workspace/org.eclipse.eclemma.feature/../target/jacoco.exec,includes=org.eclipse.eclemma.*,sessionid=org.eclipse.eclemma.feature
[INFO] 
[INFO] --- target-platform-configuration:0.22.0:target-platform (default-target-platform) @ org.eclipse.eclemma.feature ---
[INFO] 
[INFO] --- tycho-packaging-plugin:0.22.0:package-feature (default-package-feature) @ org.eclipse.eclemma.feature ---
[INFO] Building jar: /jobs/genie.eclemma/test-downloads/workspace/org.eclipse.eclemma.feature/target/org.eclipse.eclemma.feature-2.3.4-SNAPSHOT.jar
[INFO] 
[INFO] --- tycho-p2-plugin:0.22.0:p2-metadata-default (default-p2-metadata-default) @ org.eclipse.eclemma.feature ---
[INFO] 
[INFO] --- tycho-p2-plugin:0.22.0:feature-p2-metadata (default-feature-p2-metadata) @ org.eclipse.eclemma.feature ---
[INFO] 
[INFO] --- maven-install-plugin:2.3.1:install (default-install) @ org.eclipse.eclemma.feature ---
[INFO] Installing /jobs/genie.eclemma/test-downloads/workspace/org.eclipse.eclemma.feature/target/org.eclipse.eclemma.feature-2.3.4-SNAPSHOT.jar to /home/hudson/genie.eclemma/.hudson/jobs/test-downloads/workspace/.maven/repo/org/eclipse/eclemma/org.eclipse.eclemma.feature/2.3.4-SNAPSHOT/org.eclipse.eclemma.feature-2.3.4-SNAPSHOT.jar
[INFO] Installing /jobs/genie.eclemma/test-downloads/workspace/org.eclipse.eclemma.feature/pom.xml to /home/hudson/genie.eclemma/.hudson/jobs/test-downloads/workspace/.maven/repo/org/eclipse/eclemma/org.eclipse.eclemma.feature/2.3.4-SNAPSHOT/org.eclipse.eclemma.feature-2.3.4-SNAPSHOT.pom
[INFO] Installing /jobs/genie.eclemma/test-downloads/workspace/org.eclipse.eclemma.feature/target/p2content.xml to /home/hudson/genie.eclemma/.hudson/jobs/test-downloads/workspace/.maven/repo/org/eclipse/eclemma/org.eclipse.eclemma.feature/2.3.4-SNAPSHOT/org.eclipse.eclemma.feature-2.3.4-SNAPSHOT-p2metadata.xml
[INFO] Installing /jobs/genie.eclemma/test-downloads/workspace/org.eclipse.eclemma.feature/target/p2artifacts.xml to /home/hudson/genie.eclemma/.hudson/jobs/test-downloads/workspace/.maven/repo/org/eclipse/eclemma/org.eclipse.eclemma.feature/2.3.4-SNAPSHOT/org.eclipse.eclemma.feature-2.3.4-SNAPSHOT-p2artifacts.xml
[INFO] 
[INFO] --- tycho-p2-plugin:0.22.0:update-local-index (default-update-local-index) @ org.eclipse.eclemma.feature ---
[INFO]                                                                         
[INFO] ------------------------------------------------------------------------
[INFO] Building EclEmma 2.3.4-SNAPSHOT
[INFO] ------------------------------------------------------------------------
[INFO] 
[INFO] --- maven-clean-plugin:2.5:clean (default-clean) @ EclEmma ---
[INFO] Deleting /jobs/genie.eclemma/test-downloads/workspace/org.eclipse.eclemma.site/target
[INFO] 
[INFO] --- tycho-packaging-plugin:0.22.0:build-qualifier-aggregator (default-build-qualifier-aggregator) @ EclEmma ---
[INFO] The project's OSGi version is 2.3.4.201609011800
[INFO] 
[INFO] --- maven-clean-plugin:2.5:clean (default-clean-1) @ EclEmma ---
[INFO] 
[INFO] --- jacoco-maven-plugin:0.7.7.201606060606:prepare-agent (default) @ EclEmma ---
[INFO] argLine set to -javaagent:/home/hudson/genie.eclemma/.hudson/jobs/test-downloads/workspace/.maven/repo/org/jacoco/org.jacoco.agent/0.7.7.201606060606/org.jacoco.agent-0.7.7.201606060606-runtime.jar=destfile=/jobs/genie.eclemma/test-downloads/workspace/org.eclipse.eclemma.site/../target/jacoco.exec,includes=org.eclipse.eclemma.*,sessionid=EclEmma
[INFO] 
[INFO] --- maven-resources-plugin:2.4.3:resources (default-resources) @ EclEmma ---
[INFO] Using 'UTF-8' encoding to copy filtered resources.
[INFO] skip non existing resourceDirectory /jobs/genie.eclemma/test-downloads/workspace/org.eclipse.eclemma.site/src/main/resources
[INFO] 
[INFO] --- target-platform-configuration:0.22.0:target-platform (default-target-platform) @ EclEmma ---
[INFO] 
[INFO] --- tycho-p2-publisher-plugin:0.22.0:publish-products (default-publish-products) @ EclEmma ---
[INFO] 
[INFO] --- tycho-p2-publisher-plugin:0.22.0:publish-categories (default-publish-categories) @ EclEmma ---
[INFO] 
[INFO] --- tycho-p2-publisher-plugin:0.22.0:attach-artifacts (default-attach-artifacts) @ EclEmma ---
[INFO] 
[INFO] --- tycho-p2-repository-plugin:0.22.0:assemble-repository (default-assemble-repository) @ EclEmma ---
[INFO] 
[INFO] --- tycho-p2-repository-plugin:0.22.0:archive-repository (default-archive-repository) @ EclEmma ---
[INFO] Building zip: /jobs/genie.eclemma/test-downloads/workspace/org.eclipse.eclemma.site/target/EclEmma-2.3.4-SNAPSHOT.zip
[INFO] 
[INFO] --- maven-install-plugin:2.3.1:install (default-install) @ EclEmma ---
[INFO] Installing /jobs/genie.eclemma/test-downloads/workspace/org.eclipse.eclemma.site/target/EclEmma-2.3.4-SNAPSHOT.zip to /home/hudson/genie.eclemma/.hudson/jobs/test-downloads/workspace/.maven/repo/org/eclipse/eclemma/EclEmma/2.3.4-SNAPSHOT/EclEmma-2.3.4-SNAPSHOT.zip
[INFO] Installing /jobs/genie.eclemma/test-downloads/workspace/org.eclipse.eclemma.site/pom.xml to /home/hudson/genie.eclemma/.hudson/jobs/test-downloads/workspace/.maven/repo/org/eclipse/eclemma/EclEmma/2.3.4-SNAPSHOT/EclEmma-2.3.4-SNAPSHOT.pom
[INFO] Installing /jobs/genie.eclemma/test-downloads/workspace/org.eclipse.eclemma.site/target/p2content.xml to /home/hudson/genie.eclemma/.hudson/jobs/test-downloads/workspace/.maven/repo/org/eclipse/eclemma/EclEmma/2.3.4-SNAPSHOT/EclEmma-2.3.4-SNAPSHOT-p2metadata.xml
[INFO] Installing /jobs/genie.eclemma/test-downloads/workspace/org.eclipse.eclemma.site/target/p2artifacts.xml to /home/hudson/genie.eclemma/.hudson/jobs/test-downloads/workspace/.maven/repo/org/eclipse/eclemma/EclEmma/2.3.4-SNAPSHOT/EclEmma-2.3.4-SNAPSHOT-p2artifacts.xml
[INFO] 
[INFO] --- tycho-p2-plugin:0.22.0:update-local-index (default-update-local-index) @ EclEmma ---
[INFO] 
[INFO] --- maven-antrun-plugin:1.6:run (publish) @ EclEmma ---
[INFO] Executing tasks

main:
     [copy] Copying 11 files to /home/data/httpd/download.eclipse.org/eclemma/updates-master
[INFO] ------------------------------------------------------------------------
[INFO] Reactor Summary:
[INFO] 
[INFO] EclEmma ............................................ SUCCESS [  0.582 s]
[INFO] org.eclipse.eclemma.target ......................... SUCCESS [  0.494 s]
[INFO] org.eclipse.eclemma.asm ............................ SUCCESS [  1.565 s]
[INFO] org.eclipse.eclemma.core ........................... SUCCESS [  1.358 s]
[INFO] org.eclipse.eclemma.core.test ...................... SUCCESS [01:26 min]
[INFO] org.eclipse.eclemma.debug.ui.compatibility ......... SUCCESS [  0.289 s]
[INFO] org.eclipse.eclemma.ui ............................. SUCCESS [  1.029 s]
[INFO] org.eclipse.eclemma.doc ............................ SUCCESS [  0.183 s]
[INFO] org.eclipse.eclemma.feature ........................ SUCCESS [  0.326 s]
[INFO] EclEmma ............................................ FAILURE [  2.677 s]
[INFO] eclemma ............................................ SKIPPED
[INFO] ------------------------------------------------------------------------
[INFO] BUILD FAILURE
[INFO] ------------------------------------------------------------------------
[INFO] Total time: 01:45 min
[INFO] Finished at: 2016-09-01T14:01:44-04:00
[INFO] Final Memory: 70M/1911M
[INFO] ------------------------------------------------------------------------
[INFO] o.h.m.e.h.MavenExecutionResultHandler - Build failed with exception(s)
[INFO] o.h.m.e.h.MavenExecutionResultHandler - [1] org.apache.maven.lifecycle.LifecycleExecutionException: Failed to execute goal org.apache.maven.plugins:maven-antrun-plugin:1.6:run (publish) on project EclEmma: An Ant BuildException has occured: Failed to copy /jobs/genie.eclemma/test-downloads/workspace/org.eclipse.eclemma.site/target/repository/plugins/org.eclipse.eclemma.asm_2.3.4.201609011800.jar to /home/data/httpd/download.eclipse.org/eclemma/updates-master/plugins/org.eclipse.eclemma.asm_2.3.4.201609011800.jar due to failed to create the parent directory for /home/data/httpd/download.eclipse.org/eclemma/updates-master/plugins/org.eclipse.eclemma.asm_2.3.4.201609011800.jar
[DEBUG] Closing connection to remote
[ERROR] Failed to execute goal org.apache.maven.plugins:maven-antrun-plugin:1.6:run (publish) on project EclEmma: An Ant BuildException has occured: Failed to copy /jobs/genie.eclemma/test-downloads/workspace/org.eclipse.eclemma.site/target/repository/plugins/org.eclipse.eclemma.asm_2.3.4.201609011800.jar to /home/data/httpd/download.eclipse.org/eclemma/updates-master/plugins/org.eclipse.eclemma.asm_2.3.4.201609011800.jar due to failed to create the parent directory for /home/data/httpd/download.eclipse.org/eclemma/updates-master/plugins/org.eclipse.eclemma.asm_2.3.4.201609011800.jar -> [Help 1]
org.apache.maven.lifecycle.LifecycleExecutionException: Failed to execute goal org.apache.maven.plugins:maven-antrun-plugin:1.6:run (publish) on project EclEmma: An Ant BuildException has occured: Failed to copy /jobs/genie.eclemma/test-downloads/workspace/org.eclipse.eclemma.site/target/repository/plugins/org.eclipse.eclemma.asm_2.3.4.201609011800.jar to /home/data/httpd/download.eclipse.org/eclemma/updates-master/plugins/org.eclipse.eclemma.asm_2.3.4.201609011800.jar due to failed to create the parent directory for /home/data/httpd/download.eclipse.org/eclemma/updates-master/plugins/org.eclipse.eclemma.asm_2.3.4.201609011800.jar
	at org.apache.maven.lifecycle.internal.MojoExecutor.execute(MojoExecutor.java:212)
	at org.apache.maven.lifecycle.internal.MojoExecutor.execute(MojoExecutor.java:153)
	at org.apache.maven.lifecycle.internal.MojoExecutor.execute(MojoExecutor.java:145)
	at org.apache.maven.lifecycle.internal.LifecycleModuleBuilder.buildProject(LifecycleModuleBuilder.java:116)
	at org.apache.maven.lifecycle.internal.LifecycleModuleBuilder.buildProject(LifecycleModuleBuilder.java:80)
	at org.apache.maven.lifecycle.internal.builder.singlethreaded.SingleThreadedBuilder.build(SingleThreadedBuilder.java:51)
	at org.apache.maven.lifecycle.internal.LifecycleStarter.execute(LifecycleStarter.java:128)
	at org.apache.maven.DefaultMaven.doExecute(DefaultMaven.java:307)
	at org.apache.maven.DefaultMaven.doExecute(DefaultMaven.java:193)
	at org.apache.maven.DefaultMaven.execute(DefaultMaven.java:106)
	at org.apache.maven.cli.MavenCli.execute(MavenCli.java:863)
	at org.apache.maven.cli.MavenCli.doMain(MavenCli.java:288)
	at org.apache.maven.cli.MavenCli.main(MavenCli.java:199)
	at sun.reflect.NativeMethodAccessorImpl.invoke0(Native Method)
	at sun.reflect.NativeMethodAccessorImpl.invoke(NativeMethodAccessorImpl.java:57)
	at sun.reflect.DelegatingMethodAccessorImpl.invoke(DelegatingMethodAccessorImpl.java:43)
	at java.lang.reflect.Method.invoke(Method.java:606)
	at org.codehaus.plexus.classworlds.launcher.Launcher.launchEnhanced(Launcher.java:289)
	at org.codehaus.plexus.classworlds.launcher.Launcher.launch(Launcher.java:229)
	at org.codehaus.plexus.classworlds.launcher.Launcher.mainWithExitCode(Launcher.java:415)
	at org.codehaus.plexus.classworlds.launcher.Launcher.main(Launcher.java:356)
Caused by: org.apache.maven.plugin.MojoExecutionException: An Ant BuildException has occured: Failed to copy /jobs/genie.eclemma/test-downloads/workspace/org.eclipse.eclemma.site/target/repository/plugins/org.eclipse.eclemma.asm_2.3.4.201609011800.jar to /home/data/httpd/download.eclipse.org/eclemma/updates-master/plugins/org.eclipse.eclemma.asm_2.3.4.201609011800.jar due to failed to create the parent directory for /home/data/httpd/download.eclipse.org/eclemma/updates-master/plugins/org.eclipse.eclemma.asm_2.3.4.201609011800.jar
	at org.apache.maven.plugin.antrun.AntRunMojo.execute(AntRunMojo.java:283)
	at org.apache.maven.plugin.DefaultBuildPluginManager.executeMojo(DefaultBuildPluginManager.java:134)
	at org.apache.maven.lifecycle.internal.MojoExecutor.execute(MojoExecutor.java:207)
	... 20 more
Caused by: /jobs/genie.eclemma/test-downloads/workspace/org.eclipse.eclemma.site/target/antrun/build-main.xml:9: Failed to copy /jobs/genie.eclemma/test-downloads/workspace/org.eclipse.eclemma.site/target/repository/plugins/org.eclipse.eclemma.asm_2.3.4.201609011800.jar to /home/data/httpd/download.eclipse.org/eclemma/updates-master/plugins/org.eclipse.eclemma.asm_2.3.4.201609011800.jar due to failed to create the parent directory for /home/data/httpd/download.eclipse.org/eclemma/updates-master/plugins/org.eclipse.eclemma.asm_2.3.4.201609011800.jar
	at org.apache.tools.ant.taskdefs.Copy.doFileOperations(Copy.java:853)
	at org.apache.tools.ant.taskdefs.Copy.execute(Copy.java:523)
	at org.apache.tools.ant.UnknownElement.execute(UnknownElement.java:291)
	at sun.reflect.NativeMethodAccessorImpl.invoke0(Native Method)
	at sun.reflect.NativeMethodAccessorImpl.invoke(NativeMethodAccessorImpl.java:57)
	at sun.reflect.DelegatingMethodAccessorImpl.invoke(DelegatingMethodAccessorImpl.java:43)
	at java.lang.reflect.Method.invoke(Method.java:606)
	at org.apache.tools.ant.dispatch.DispatchUtils.execute(DispatchUtils.java:106)
	at org.apache.tools.ant.Task.perform(Task.java:348)
	at org.apache.tools.ant.Target.execute(Target.java:390)
	at org.apache.tools.ant.Target.performTasks(Target.java:411)
	at org.apache.tools.ant.Project.executeSortedTargets(Project.java:1397)
	at org.apache.tools.ant.Project.executeTarget(Project.java:1366)
	at org.apache.maven.plugin.antrun.AntRunMojo.execute(AntRunMojo.java:270)
	... 22 more
Caused by: java.io.IOException: failed to create the parent directory for /home/data/httpd/download.eclipse.org/eclemma/updates-master/plugins/org.eclipse.eclemma.asm_2.3.4.201609011800.jar
	at org.apache.tools.ant.util.ResourceUtils.copyResource(ResourceUtils.java:456)
	at org.apache.tools.ant.util.FileUtils.copyFile(FileUtils.java:519)
	at org.apache.tools.ant.util.FileUtils.copyFile(FileUtils.java:481)
	at org.apache.tools.ant.util.FileUtils.copyFile(FileUtils.java:310)
	at org.apache.tools.ant.taskdefs.Copy.doFileOperations(Copy.java:841)
	... 35 more
[ERROR] 
[ERROR] Re-run Maven using the -X switch to enable full debug logging.
[ERROR] 
[ERROR] For more information about the errors and possible solutions, please read the following articles:
[ERROR] [Help 1] http://cwiki.apache.org/confluence/display/MAVEN/MojoExecutionException
[ERROR] 
[ERROR] After correcting the problems, you can resume the build with the command
[ERROR]   mvn <goals> -rf :EclEmma
[DEBUG] Waiting for process to finish
[DEBUG] Result: 1
Finished: FAILURE