AbortedConsole Output

Skipping 1,505 KB.. Full Log
ic.RemoteServiceTest)  Time elapsed: 5.411 sec
testFireAsynch(org.eclipse.ecf.tests.remoteservice.generic.RemoteServiceTest)  Time elapsed: 10.412 sec
testGetProxy(org.eclipse.ecf.tests.remoteservice.generic.RemoteServiceTest)  Time elapsed: 10.417 sec
testGetServiceReferences(org.eclipse.ecf.tests.remoteservice.generic.RemoteServiceTest)  Time elapsed: 10.414 sec
testUnregisterService(org.eclipse.ecf.tests.remoteservice.generic.RemoteServiceTest)  Time elapsed: 10.415 sec
testProxy(org.eclipse.ecf.tests.remoteservice.generic.RemoteServiceTest)  Time elapsed: 10.42 sec
testAsyncResult(org.eclipse.ecf.tests.remoteservice.generic.RemoteServiceTest)  Time elapsed: 10.415 sec
testGetServiceReferencesWithFilter(org.eclipse.ecf.tests.remoteservice.generic.RemoteServiceTest)  Time elapsed: 10.412 sec
testCallSynch(org.eclipse.ecf.tests.remoteservice.generic.RemoteServiceTest)  Time elapsed: 10.418 sec
testGetProxyNoRemoteServiceProxy(org.eclipse.ecf.tests.remoteservice.generic.RemoteServiceTest)  Time elapsed: 10.418 sec
testCallAsynch(org.eclipse.ecf.tests.remoteservice.generic.RemoteServiceTest)  Time elapsed: 10.415 sec
testRemoteServiceAdapters(org.eclipse.ecf.tests.remoteservice.generic.RemoteServiceTest)  Time elapsed: 5.411 sec
testBadCallSynch(org.eclipse.ecf.tests.remoteservice.generic.RemoteServiceTest)  Time elapsed: 10.432 sec
testGetServiceReferencesWithFilterFail(org.eclipse.ecf.tests.remoteservice.generic.RemoteServiceTest)  Time elapsed: 10.412 sec
testRegisterService(org.eclipse.ecf.tests.remoteservice.generic.RemoteServiceTest)  Time elapsed: 5.411 sec
Running org.eclipse.ecf.tests.remoteservice.generic.GenericLocalRemoteServiceTest
Tests run: 3, Failures: 0, Errors: 0, Skipped: 0, Time elapsed: 0.007 sec - in org.eclipse.ecf.tests.remoteservice.generic.GenericLocalRemoteServiceTest
testGetAllRemoteServiceReferencesEmpty(org.eclipse.ecf.tests.remoteservice.generic.GenericLocalRemoteServiceTest)  Time elapsed: 0.002 sec
testGetAllLocalRemoteServiceReference(org.eclipse.ecf.tests.remoteservice.generic.GenericLocalRemoteServiceTest)  Time elapsed: 0.002 sec
testGetLocalRemoteServiceReferences(org.eclipse.ecf.tests.remoteservice.generic.GenericLocalRemoteServiceTest)  Time elapsed: 0.001 sec

Results :

Failed tests: 
  GenericConcatConsumerTest>AbstractConcatConsumerTestCase.testGetService:189->AbstractConcatConsumerTestCase.getRemoteService:107->AbstractConcatConsumerTestCase.getRemoteServiceReferences:122 connect problem
  GenericConcatConsumerTest>AbstractConcatConsumerTestCase.testFireAsynch:288->AbstractConcatConsumerTestCase.getRemoteService:107->AbstractConcatConsumerTestCase.getRemoteServiceReferences:122 connect problem
  GenericConcatConsumerTest>AbstractConcatConsumerTestCase.testGetServiceReferences:139->AbstractConcatConsumerTestCase.getRemoteServiceReferences:122 connect problem
  GenericConcatConsumerTest>AbstractConcatConsumerTestCase.testProxy:298->AbstractConcatConsumerTestCase.getRemoteService:107->AbstractConcatConsumerTestCase.getRemoteServiceReferences:122 connect problem
  GenericConcatConsumerTest>AbstractConcatConsumerTestCase.testAsyncResult:310->AbstractConcatConsumerTestCase.getRemoteService:107->AbstractConcatConsumerTestCase.getRemoteServiceReferences:122 connect problem
  GenericConcatConsumerTest>AbstractConcatConsumerTestCase.testCallSynch:195->AbstractConcatConsumerTestCase.getRemoteService:107->AbstractConcatConsumerTestCase.getRemoteServiceReferences:122 connect problem
  GenericConcatConsumerTest>AbstractConcatConsumerTestCase.testGetRemoteServiceWithLocallyRegisteredService:346->AbstractConcatConsumerTestCase.getRemoteService:107->AbstractConcatConsumerTestCase.getRemoteServiceReferences:122 connect problem
  GenericConcatConsumerTest>AbstractConcatConsumerTestCase.testGetRemoteServiceIDs:147->AbstractConcatConsumerTestCase.getRemoteServiceReferences:122 connect problem
  GenericConcatConsumerTest>AbstractConcatConsumerTestCase.testCallAsynch:277->AbstractConcatConsumerTestCase.getRemoteService:107->AbstractConcatConsumerTestCase.getRemoteServiceReferences:122 connect problem
  GenericConcatConsumerTest>AbstractConcatConsumerTestCase.testGetRSReference:269->AbstractConcatConsumerTestCase.getRemoteServiceReferences:122 connect problem
  GenericConcatConsumerTest>AbstractConcatConsumerTestCase.testGetRemoteServiceReferenceServiceID:173->AbstractConcatConsumerTestCase.getRemoteServiceReferences:122 connect problem
  GenericConcatConsumerTest>AbstractConcatConsumerTestCase.testGetRemoteServiceReferenceObjectClass:160->AbstractConcatConsumerTestCase.getRemoteServiceReferences:122 connect problem

Tests run: 77, Failures: 12, Errors: 0, Skipped: 0

[ERROR] There are test failures.

Please refer to /home/hudson/genie.ecf/.hudson/workspace/ecf-tycho.master-mars/tests/bundles/org.eclipse.ecf.tests.remoteservice.generic/target/surefire-reports for the individual test results.
[JENKINS] Recording test results
[INFO] 
[INFO] --- tycho-pack200a-plugin:0.26.0:normalize (pack200-normalize) @ org.eclipse.ecf.tests.remoteservice.generic ---
[INFO] Pack200 normalizing jar /home/hudson/genie.ecf/.hudson/workspace/ecf-tycho.master-mars/tests/bundles/org.eclipse.ecf.tests.remoteservice.generic/target/org.eclipse.ecf.tests.remoteservice.generic-2.1.0-SNAPSHOT.jar
[INFO] 
[INFO] --- eclipse-jarsigner-plugin:1.1.3:sign (sign) @ org.eclipse.ecf.tests.remoteservice.generic ---
[INFO] Signing jar: /home/hudson/genie.ecf/.hudson/workspace/ecf-tycho.master-mars/tests/bundles/org.eclipse.ecf.tests.remoteservice.generic/target/org.eclipse.ecf.tests.remoteservice.generic-2.1.0-SNAPSHOT.jar
[INFO] Signing jar: /home/hudson/genie.ecf/.hudson/workspace/ecf-tycho.master-mars/tests/bundles/org.eclipse.ecf.tests.remoteservice.generic/target/org.eclipse.ecf.tests.remoteservice.generic-2.1.0-SNAPSHOT-sources.jar
[INFO] 
[INFO] --- tycho-pack200b-plugin:0.26.0:pack (pack200-pack) @ org.eclipse.ecf.tests.remoteservice.generic ---
[INFO] Pack200 packing jar /home/hudson/genie.ecf/.hudson/workspace/ecf-tycho.master-mars/tests/bundles/org.eclipse.ecf.tests.remoteservice.generic/target/org.eclipse.ecf.tests.remoteservice.generic-2.1.0-SNAPSHOT.jar
[INFO] 
[INFO] --- tycho-p2-plugin:0.26.0:p2-metadata (p2-metadata) @ org.eclipse.ecf.tests.remoteservice.generic ---
Started calculate disk usage of build
Finished Calculation of disk usage of build in 0 seconds
Started calculate disk usage of workspace
Finished Calculation of disk usage of workspace in 0 seconds
[INFO]                                                                         
[INFO] ------------------------------------------------------------------------
[INFO] Building org.eclipse.ecf.tests.remoteservice.r-osgi 1.0.0-SNAPSHOT
[INFO] ------------------------------------------------------------------------
[INFO] 
[INFO] --- maven-clean-plugin:3.0.0:clean (default-clean) @ org.eclipse.ecf.tests.remoteservice.r-osgi ---
[INFO] Deleting /home/hudson/genie.ecf/.hudson/workspace/ecf-tycho.master-mars/tests/bundles/org.eclipse.ecf.tests.remoteservice.r-osgi/target
[INFO] 
[INFO] --- tycho-packaging-plugin:0.26.0:build-qualifier (default-build-qualifier) @ org.eclipse.ecf.tests.remoteservice.r-osgi ---
[INFO] The project's OSGi version is 1.0.0.v20160926-1048
[INFO] 
[INFO] --- tycho-packaging-plugin:0.26.0:validate-id (default-validate-id) @ org.eclipse.ecf.tests.remoteservice.r-osgi ---
[INFO] 
[INFO] --- tycho-packaging-plugin:0.26.0:validate-version (default-validate-version) @ org.eclipse.ecf.tests.remoteservice.r-osgi ---
[INFO] 
[INFO] --- maven-resources-plugin:2.4.3:resources (default-resources) @ org.eclipse.ecf.tests.remoteservice.r-osgi ---
[INFO] Using 'ISO-8859-1' encoding to copy filtered resources.
[INFO] skip non existing resourceDirectory /home/hudson/genie.ecf/.hudson/workspace/ecf-tycho.master-mars/tests/bundles/org.eclipse.ecf.tests.remoteservice.r-osgi/src/main/resources
[INFO] 
[INFO] --- tycho-compiler-plugin:0.26.0:compile (default-compile) @ org.eclipse.ecf.tests.remoteservice.r-osgi ---
[INFO] Compiling 3 source files to /home/hudson/genie.ecf/.hudson/workspace/ecf-tycho.master-mars/tests/bundles/org.eclipse.ecf.tests.remoteservice.r-osgi/target/classes
[INFO] 
[INFO] --- maven-resources-plugin:2.4.3:testResources (default-testResources) @ org.eclipse.ecf.tests.remoteservice.r-osgi ---
[INFO] Using 'ISO-8859-1' encoding to copy filtered resources.
[INFO] skip non existing resourceDirectory /home/hudson/genie.ecf/.hudson/workspace/ecf-tycho.master-mars/tests/bundles/org.eclipse.ecf.tests.remoteservice.r-osgi/src/test/resources
[INFO] 
[INFO] --- tycho-source-plugin:0.26.0:plugin-source (plugin-source) @ org.eclipse.ecf.tests.remoteservice.r-osgi ---
[INFO] Building jar: /home/hudson/genie.ecf/.hudson/workspace/ecf-tycho.master-mars/tests/bundles/org.eclipse.ecf.tests.remoteservice.r-osgi/target/org.eclipse.ecf.tests.remoteservice.r-osgi-1.0.0-SNAPSHOT-sources.jar
[INFO] 
[INFO] --- target-platform-configuration:0.26.0:target-platform (default-target-platform) @ org.eclipse.ecf.tests.remoteservice.r-osgi ---
[INFO] 
[INFO] --- tycho-packaging-plugin:0.26.0:package-plugin (default-package-plugin) @ org.eclipse.ecf.tests.remoteservice.r-osgi ---
[INFO] Building jar: /home/hudson/genie.ecf/.hudson/workspace/ecf-tycho.master-mars/tests/bundles/org.eclipse.ecf.tests.remoteservice.r-osgi/target/org.eclipse.ecf.tests.remoteservice.r-osgi-1.0.0-SNAPSHOT.jar
[INFO] 
[INFO] --- tycho-p2-plugin:0.26.0:p2-metadata-default (default-p2-metadata-default) @ org.eclipse.ecf.tests.remoteservice.r-osgi ---
[INFO] 
[INFO] --- tycho-source-feature-plugin:0.26.0:source-feature (source-feature) @ org.eclipse.ecf.tests.remoteservice.r-osgi ---
[INFO] 
[INFO] --- tycho-p2-plugin:0.26.0:p2-metadata (attach-p2-metadata) @ org.eclipse.ecf.tests.remoteservice.r-osgi ---
[INFO] 
[INFO] --- tycho-surefire-plugin:0.26.0:test (default-test) @ org.eclipse.ecf.tests.remoteservice.r-osgi ---
[INFO] Expected eclipse log file: /home/hudson/genie.ecf/.hudson/workspace/ecf-tycho.master-mars/tests/bundles/org.eclipse.ecf.tests.remoteservice.r-osgi/target/work/data/.metadata/.log
[INFO] Command line:
	[/opt/public/common/jdk1.8.0_121.x64/jre/bin/java, -Dosgi.noShutdown=false, -Dosgi.os=linux, -Dosgi.ws=gtk, -Dosgi.arch=x86_64, -Dosgi.clean=true, -jar, /home/hudson/genie.ecf/.hudson/workspace/ecf-tycho.master-mars/.repository/p2/osgi/bundle/org.eclipse.equinox.launcher/1.3.100.v20150511-1540/org.eclipse.equinox.launcher-1.3.100.v20150511-1540.jar, -data, /home/hudson/genie.ecf/.hudson/workspace/ecf-tycho.master-mars/tests/bundles/org.eclipse.ecf.tests.remoteservice.r-osgi/target/work/data, -install, /home/hudson/genie.ecf/.hudson/workspace/ecf-tycho.master-mars/tests/bundles/org.eclipse.ecf.tests.remoteservice.r-osgi/target/work, -configuration, /home/hudson/genie.ecf/.hudson/workspace/ecf-tycho.master-mars/tests/bundles/org.eclipse.ecf.tests.remoteservice.r-osgi/target/work/configuration, -application, org.eclipse.tycho.surefire.osgibooter.headlesstest, -testproperties, /home/hudson/genie.ecf/.hudson/workspace/ecf-tycho.master-mars/tests/bundles/org.eclipse.ecf.tests.remoteservice.r-osgi/target/surefire.properties]

-------------------------------------------------------
 T E S T S
-------------------------------------------------------
Running org.eclipse.ecf.tests.remoteservice.r_osgi.ROsgiConcatConsumerTest
Tests run: 15, Failures: 11, Errors: 0, Skipped: 0, Time elapsed: 5.314 sec <<< FAILURE! - in org.eclipse.ecf.tests.remoteservice.r_osgi.ROsgiConcatConsumerTest
testGetRemoteServiceWithLocallyRegisteredService(org.eclipse.ecf.tests.remoteservice.r_osgi.ROsgiConcatConsumerTest)  Time elapsed: 0.01 sec
testGetNamespace(org.eclipse.ecf.tests.remoteservice.r_osgi.ROsgiConcatConsumerTest)  Time elapsed: 0.001 sec
testGetService(org.eclipse.ecf.tests.remoteservice.r_osgi.ROsgiConcatConsumerTest)  Time elapsed: 0.099 sec  <<< FAILURE!
junit.framework.AssertionFailedError: null
	at junit.framework.Assert.fail(Assert.java:55)
	at junit.framework.Assert.assertTrue(Assert.java:22)
	at junit.framework.Assert.assertNotNull(Assert.java:256)
	at junit.framework.Assert.assertNotNull(Assert.java:248)
	at junit.framework.TestCase.assertNotNull(TestCase.java:417)
	at org.eclipse.ecf.tests.remoteservice.AbstractConcatConsumerTestCase.testGetService(AbstractConcatConsumerTestCase.java:191)
	at sun.reflect.NativeMethodAccessorImpl.invoke0(Native Method)
	at sun.reflect.NativeMethodAccessorImpl.invoke(NativeMethodAccessorImpl.java:62)
	at sun.reflect.DelegatingMethodAccessorImpl.invoke(DelegatingMethodAccessorImpl.java:43)
	at java.lang.reflect.Method.invoke(Method.java:498)
	at junit.framework.TestCase.runTest(TestCase.java:176)
	at junit.framework.TestCase.runBare(TestCase.java:141)
	at junit.framework.TestResult$1.protect(TestResult.java:122)
	at junit.framework.TestResult.runProtected(TestResult.java:142)
	at junit.framework.TestResult.run(TestResult.java:125)
	at junit.framework.TestCase.run(TestCase.java:129)
	at junit.framework.TestSuite.runTest(TestSuite.java:252)
	at junit.framework.TestSuite.run(TestSuite.java:247)
	at org.junit.internal.runners.JUnit38ClassRunner.run(JUnit38ClassRunner.java:86)
	at org.apache.maven.surefire.junit4.JUnit4Provider.execute(JUnit4Provider.java:264)
	at org.apache.maven.surefire.junit4.JUnit4Provider.executeTestSet(JUnit4Provider.java:153)
	at org.apache.maven.surefire.junit4.JUnit4Provider.invoke(JUnit4Provider.java:124)
	at sun.reflect.NativeMethodAccessorImpl.invoke0(Native Method)
	at sun.reflect.NativeMethodAccessorImpl.invoke(NativeMethodAccessorImpl.java:62)
	at sun.reflect.DelegatingMethodAccessorImpl.invoke(DelegatingMethodAccessorImpl.java:43)
	at java.lang.reflect.Method.invoke(Method.java:498)
	at org.apache.maven.surefire.util.ReflectionUtils.invokeMethodWithArray2(ReflectionUtils.java:208)
	at org.apache.maven.surefire.booter.ProviderFactory$ProviderProxy.invoke(ProviderFactory.java:156)
	at org.apache.maven.surefire.booter.ProviderFactory.invokeProvider(ProviderFactory.java:82)
	at org.eclipse.tycho.surefire.osgibooter.OsgiSurefireBooter.run(OsgiSurefireBooter.java:95)
	at org.eclipse.tycho.surefire.osgibooter.HeadlessTestApplication.run(HeadlessTestApplication.java:21)
	at sun.reflect.NativeMethodAccessorImpl.invoke0(Native Method)
	at sun.reflect.NativeMethodAccessorImpl.invoke(NativeMethodAccessorImpl.java:62)
	at sun.reflect.DelegatingMethodAccessorImpl.invoke(DelegatingMethodAccessorImpl.java:43)
	at java.lang.reflect.Method.invoke(Method.java:498)
	at org.eclipse.equinox.internal.app.EclipseAppContainer.callMethodWithException(EclipseAppContainer.java:587)
	at org.eclipse.equinox.internal.app.EclipseAppHandle.run(EclipseAppHandle.java:198)
	at org.eclipse.core.runtime.internal.adaptor.EclipseAppLauncher.runApplication(EclipseAppLauncher.java:134)
	at org.eclipse.core.runtime.internal.adaptor.EclipseAppLauncher.start(EclipseAppLauncher.java:104)
	at org.eclipse.core.runtime.adaptor.EclipseStarter.run(EclipseStarter.java:380)
	at org.eclipse.core.runtime.adaptor.EclipseStarter.run(EclipseStarter.java:235)
	at sun.reflect.NativeMethodAccessorImpl.invoke0(Native Method)
	at sun.reflect.NativeMethodAccessorImpl.invoke(NativeMethodAccessorImpl.java:62)
	at sun.reflect.DelegatingMethodAccessorImpl.invoke(DelegatingMethodAccessorImpl.java:43)
	at java.lang.reflect.Method.invoke(Method.java:498)
	at org.eclipse.equinox.launcher.Main.invokeFramework(Main.java:669)
	at org.eclipse.equinox.launcher.Main.basicRun(Main.java:608)
	at org.eclipse.equinox.launcher.Main.run(Main.java:1515)
	at org.eclipse.equinox.launcher.Main.main(Main.java:1488)

testFireAsynch(org.eclipse.ecf.tests.remoteservice.r_osgi.ROsgiConcatConsumerTest)  Time elapsed: 0.003 sec  <<< FAILURE!
junit.framework.AssertionFailedError: null
	at junit.framework.Assert.fail(Assert.java:55)
	at junit.framework.Assert.assertTrue(Assert.java:22)
	at junit.framework.Assert.assertNotNull(Assert.java:256)
	at junit.framework.Assert.assertNotNull(Assert.java:248)
	at junit.framework.TestCase.assertNotNull(TestCase.java:417)
	at org.eclipse.ecf.tests.remoteservice.AbstractConcatConsumerTestCase.testFireAsynch(AbstractConcatConsumerTestCase.java:290)
	at sun.reflect.NativeMethodAccessorImpl.invoke0(Native Method)
	at sun.reflect.NativeMethodAccessorImpl.invoke(NativeMethodAccessorImpl.java:62)
	at sun.reflect.DelegatingMethodAccessorImpl.invoke(DelegatingMethodAccessorImpl.java:43)
	at java.lang.reflect.Method.invoke(Method.java:498)
	at junit.framework.TestCase.runTest(TestCase.java:176)
	at junit.framework.TestCase.runBare(TestCase.java:141)
	at junit.framework.TestResult$1.protect(TestResult.java:122)
	at junit.framework.TestResult.runProtected(TestResult.java:142)
	at junit.framework.TestResult.run(TestResult.java:125)
	at junit.framework.TestCase.run(TestCase.java:129)
	at junit.framework.TestSuite.runTest(TestSuite.java:252)
	at junit.framework.TestSuite.run(TestSuite.java:247)
	at org.junit.internal.runners.JUnit38ClassRunner.run(JUnit38ClassRunner.java:86)
	at org.apache.maven.surefire.junit4.JUnit4Provider.execute(JUnit4Provider.java:264)
	at org.apache.maven.surefire.junit4.JUnit4Provider.executeTestSet(JUnit4Provider.java:153)
	at org.apache.maven.surefire.junit4.JUnit4Provider.invoke(JUnit4Provider.java:124)
	at sun.reflect.NativeMethodAccessorImpl.invoke0(Native Method)
	at sun.reflect.NativeMethodAccessorImpl.invoke(NativeMethodAccessorImpl.java:62)
	at sun.reflect.DelegatingMethodAccessorImpl.invoke(DelegatingMethodAccessorImpl.java:43)
	at java.lang.reflect.Method.invoke(Method.java:498)
	at org.apache.maven.surefire.util.ReflectionUtils.invokeMethodWithArray2(ReflectionUtils.java:208)
	at org.apache.maven.surefire.booter.ProviderFactory$ProviderProxy.invoke(ProviderFactory.java:156)
	at org.apache.maven.surefire.booter.ProviderFactory.invokeProvider(ProviderFactory.java:82)
	at org.eclipse.tycho.surefire.osgibooter.OsgiSurefireBooter.run(OsgiSurefireBooter.java:95)
	at org.eclipse.tycho.surefire.osgibooter.HeadlessTestApplication.run(HeadlessTestApplication.java:21)
	at sun.reflect.NativeMethodAccessorImpl.invoke0(Native Method)
	at sun.reflect.NativeMethodAccessorImpl.invoke(NativeMethodAccessorImpl.java:62)
	at sun.reflect.DelegatingMethodAccessorImpl.invoke(DelegatingMethodAccessorImpl.java:43)
	at java.lang.reflect.Method.invoke(Method.java:498)
	at org.eclipse.equinox.internal.app.EclipseAppContainer.callMethodWithException(EclipseAppContainer.java:587)
	at org.eclipse.equinox.internal.app.EclipseAppHandle.run(EclipseAppHandle.java:198)
	at org.eclipse.core.runtime.internal.adaptor.EclipseAppLauncher.runApplication(EclipseAppLauncher.java:134)
	at org.eclipse.core.runtime.internal.adaptor.EclipseAppLauncher.start(EclipseAppLauncher.java:104)
	at org.eclipse.core.runtime.adaptor.EclipseStarter.run(EclipseStarter.java:380)
	at org.eclipse.core.runtime.adaptor.EclipseStarter.run(EclipseStarter.java:235)
	at sun.reflect.NativeMethodAccessorImpl.invoke0(Native Method)
	at sun.reflect.NativeMethodAccessorImpl.invoke(NativeMethodAccessorImpl.java:62)
	at sun.reflect.DelegatingMethodAccessorImpl.invoke(DelegatingMethodAccessorImpl.java:43)
	at java.lang.reflect.Method.invoke(Method.java:498)
	at org.eclipse.equinox.launcher.Main.invokeFramework(Main.java:669)
	at org.eclipse.equinox.launcher.Main.basicRun(Main.java:608)
	at org.eclipse.equinox.launcher.Main.run(Main.java:1515)
	at org.eclipse.equinox.launcher.Main.main(Main.java:1488)

testGetServiceReferences(org.eclipse.ecf.tests.remoteservice.r_osgi.ROsgiConcatConsumerTest)  Time elapsed: 0.002 sec  <<< FAILURE!
junit.framework.AssertionFailedError: null
	at junit.framework.Assert.fail(Assert.java:55)
	at junit.framework.Assert.assertTrue(Assert.java:22)
	at junit.framework.Assert.assertTrue(Assert.java:31)
	at junit.framework.TestCase.assertTrue(TestCase.java:201)
	at org.eclipse.ecf.tests.remoteservice.AbstractConcatConsumerTestCase.testGetServiceReferences(AbstractConcatConsumerTestCase.java:142)
	at sun.reflect.NativeMethodAccessorImpl.invoke0(Native Method)
	at sun.reflect.NativeMethodAccessorImpl.invoke(NativeMethodAccessorImpl.java:62)
	at sun.reflect.DelegatingMethodAccessorImpl.invoke(DelegatingMethodAccessorImpl.java:43)
	at java.lang.reflect.Method.invoke(Method.java:498)
	at junit.framework.TestCase.runTest(TestCase.java:176)
	at junit.framework.TestCase.runBare(TestCase.java:141)
	at junit.framework.TestResult$1.protect(TestResult.java:122)
	at junit.framework.TestResult.runProtected(TestResult.java:142)
	at junit.framework.TestResult.run(TestResult.java:125)
	at junit.framework.TestCase.run(TestCase.java:129)
	at junit.framework.TestSuite.runTest(TestSuite.java:252)
	at junit.framework.TestSuite.run(TestSuite.java:247)
	at org.junit.internal.runners.JUnit38ClassRunner.run(JUnit38ClassRunner.java:86)
	at org.apache.maven.surefire.junit4.JUnit4Provider.execute(JUnit4Provider.java:264)
	at org.apache.maven.surefire.junit4.JUnit4Provider.executeTestSet(JUnit4Provider.java:153)
	at org.apache.maven.surefire.junit4.JUnit4Provider.invoke(JUnit4Provider.java:124)
	at sun.reflect.NativeMethodAccessorImpl.invoke0(Native Method)
	at sun.reflect.NativeMethodAccessorImpl.invoke(NativeMethodAccessorImpl.java:62)
	at sun.reflect.DelegatingMethodAccessorImpl.invoke(DelegatingMethodAccessorImpl.java:43)
	at java.lang.reflect.Method.invoke(Method.java:498)
	at org.apache.maven.surefire.util.ReflectionUtils.invokeMethodWithArray2(ReflectionUtils.java:208)
	at org.apache.maven.surefire.booter.ProviderFactory$ProviderProxy.invoke(ProviderFactory.java:156)
	at org.apache.maven.surefire.booter.ProviderFactory.invokeProvider(ProviderFactory.java:82)
	at org.eclipse.tycho.surefire.osgibooter.OsgiSurefireBooter.run(OsgiSurefireBooter.java:95)
	at org.eclipse.tycho.surefire.osgibooter.HeadlessTestApplication.run(HeadlessTestApplication.java:21)
	at sun.reflect.NativeMethodAccessorImpl.invoke0(Native Method)
	at sun.reflect.NativeMethodAccessorImpl.invoke(NativeMethodAccessorImpl.java:62)
	at sun.reflect.DelegatingMethodAccessorImpl.invoke(DelegatingMethodAccessorImpl.java:43)
	at java.lang.reflect.Method.invoke(Method.java:498)
	at org.eclipse.equinox.internal.app.EclipseAppContainer.callMethodWithException(EclipseAppContainer.java:587)
	at org.eclipse.equinox.internal.app.EclipseAppHandle.run(EclipseAppHandle.java:198)
	at org.eclipse.core.runtime.internal.adaptor.EclipseAppLauncher.runApplication(EclipseAppLauncher.java:134)
	at org.eclipse.core.runtime.internal.adaptor.EclipseAppLauncher.start(EclipseAppLauncher.java:104)
	at org.eclipse.core.runtime.adaptor.EclipseStarter.run(EclipseStarter.java:380)
	at org.eclipse.core.runtime.adaptor.EclipseStarter.run(EclipseStarter.java:235)
	at sun.reflect.NativeMethodAccessorImpl.invoke0(Native Method)
	at sun.reflect.NativeMethodAccessorImpl.invoke(NativeMethodAccessorImpl.java:62)
	at sun.reflect.DelegatingMethodAccessorImpl.invoke(DelegatingMethodAccessorImpl.java:43)
	at java.lang.reflect.Method.invoke(Method.java:498)
	at org.eclipse.equinox.launcher.Main.invokeFramework(Main.java:669)
	at org.eclipse.equinox.launcher.Main.basicRun(Main.java:608)
	at org.eclipse.equinox.launcher.Main.run(Main.java:1515)
	at org.eclipse.equinox.launcher.Main.main(Main.java:1488)

testProxy(org.eclipse.ecf.tests.remoteservice.r_osgi.ROsgiConcatConsumerTest)  Time elapsed: 0.003 sec  <<< FAILURE!
junit.framework.AssertionFailedError: null
	at junit.framework.Assert.fail(Assert.java:55)
	at junit.framework.Assert.assertTrue(Assert.java:22)
	at junit.framework.Assert.assertNotNull(Assert.java:256)
	at junit.framework.Assert.assertNotNull(Assert.java:248)
	at junit.framework.TestCase.assertNotNull(TestCase.java:417)
	at org.eclipse.ecf.tests.remoteservice.AbstractConcatConsumerTestCase.testProxy(AbstractConcatConsumerTestCase.java:300)
	at sun.reflect.NativeMethodAccessorImpl.invoke0(Native Method)
	at sun.reflect.NativeMethodAccessorImpl.invoke(NativeMethodAccessorImpl.java:62)
	at sun.reflect.DelegatingMethodAccessorImpl.invoke(DelegatingMethodAccessorImpl.java:43)
	at java.lang.reflect.Method.invoke(Method.java:498)
	at junit.framework.TestCase.runTest(TestCase.java:176)
	at junit.framework.TestCase.runBare(TestCase.java:141)
	at junit.framework.TestResult$1.protect(TestResult.java:122)
	at junit.framework.TestResult.runProtected(TestResult.java:142)
	at junit.framework.TestResult.run(TestResult.java:125)
	at junit.framework.TestCase.run(TestCase.java:129)
	at junit.framework.TestSuite.runTest(TestSuite.java:252)
	at junit.framework.TestSuite.run(TestSuite.java:247)
	at org.junit.internal.runners.JUnit38ClassRunner.run(JUnit38ClassRunner.java:86)
	at org.apache.maven.surefire.junit4.JUnit4Provider.execute(JUnit4Provider.java:264)
	at org.apache.maven.surefire.junit4.JUnit4Provider.executeTestSet(JUnit4Provider.java:153)
	at org.apache.maven.surefire.junit4.JUnit4Provider.invoke(JUnit4Provider.java:124)
	at sun.reflect.NativeMethodAccessorImpl.invoke0(Native Method)
	at sun.reflect.NativeMethodAccessorImpl.invoke(NativeMethodAccessorImpl.java:62)
	at sun.reflect.DelegatingMethodAccessorImpl.invoke(DelegatingMethodAccessorImpl.java:43)
	at java.lang.reflect.Method.invoke(Method.java:498)
	at org.apache.maven.surefire.util.ReflectionUtils.invokeMethodWithArray2(ReflectionUtils.java:208)
	at org.apache.maven.surefire.booter.ProviderFactory$ProviderProxy.invoke(ProviderFactory.java:156)
	at org.apache.maven.surefire.booter.ProviderFactory.invokeProvider(ProviderFactory.java:82)
	at org.eclipse.tycho.surefire.osgibooter.OsgiSurefireBooter.run(OsgiSurefireBooter.java:95)
	at org.eclipse.tycho.surefire.osgibooter.HeadlessTestApplication.run(HeadlessTestApplication.java:21)
	at sun.reflect.NativeMethodAccessorImpl.invoke0(Native Method)
	at sun.reflect.NativeMethodAccessorImpl.invoke(NativeMethodAccessorImpl.java:62)
	at sun.reflect.DelegatingMethodAccessorImpl.invoke(DelegatingMethodAccessorImpl.java:43)
	at java.lang.reflect.Method.invoke(Method.java:498)
	at org.eclipse.equinox.internal.app.EclipseAppContainer.callMethodWithException(EclipseAppContainer.java:587)
	at org.eclipse.equinox.internal.app.EclipseAppHandle.run(EclipseAppHandle.java:198)
	at org.eclipse.core.runtime.internal.adaptor.EclipseAppLauncher.runApplication(EclipseAppLauncher.java:134)
	at org.eclipse.core.runtime.internal.adaptor.EclipseAppLauncher.start(EclipseAppLauncher.java:104)
	at org.eclipse.core.runtime.adaptor.EclipseStarter.run(EclipseStarter.java:380)
	at org.eclipse.core.runtime.adaptor.EclipseStarter.run(EclipseStarter.java:235)
	at sun.reflect.NativeMethodAccessorImpl.invoke0(Native Method)
	at sun.reflect.NativeMethodAccessorImpl.invoke(NativeMethodAccessorImpl.java:62)
	at sun.reflect.DelegatingMethodAccessorImpl.invoke(DelegatingMethodAccessorImpl.java:43)
	at java.lang.reflect.Method.invoke(Method.java:498)
	at org.eclipse.equinox.launcher.Main.invokeFramework(Main.java:669)
	at org.eclipse.equinox.launcher.Main.basicRun(Main.java:608)
	at org.eclipse.equinox.launcher.Main.run(Main.java:1515)
	at org.eclipse.equinox.launcher.Main.main(Main.java:1488)

testAsyncResult(org.eclipse.ecf.tests.remoteservice.r_osgi.ROsgiConcatConsumerTest)  Time elapsed: 0.003 sec  <<< FAILURE!
junit.framework.AssertionFailedError: null
	at junit.framework.Assert.fail(Assert.java:55)
	at junit.framework.Assert.assertTrue(Assert.java:22)
	at junit.framework.Assert.assertNotNull(Assert.java:256)
	at junit.framework.Assert.assertNotNull(Assert.java:248)
	at junit.framework.TestCase.assertNotNull(TestCase.java:417)
	at org.eclipse.ecf.tests.remoteservice.AbstractConcatConsumerTestCase.testAsyncResult(AbstractConcatConsumerTestCase.java:312)
	at sun.reflect.NativeMethodAccessorImpl.invoke0(Native Method)
	at sun.reflect.NativeMethodAccessorImpl.invoke(NativeMethodAccessorImpl.java:62)
	at sun.reflect.DelegatingMethodAccessorImpl.invoke(DelegatingMethodAccessorImpl.java:43)
	at java.lang.reflect.Method.invoke(Method.java:498)
	at junit.framework.TestCase.runTest(TestCase.java:176)
	at junit.framework.TestCase.runBare(TestCase.java:141)
	at junit.framework.TestResult$1.protect(TestResult.java:122)
	at junit.framework.TestResult.runProtected(TestResult.java:142)
	at junit.framework.TestResult.run(TestResult.java:125)
	at junit.framework.TestCase.run(TestCase.java:129)
	at junit.framework.TestSuite.runTest(TestSuite.java:252)
	at junit.framework.TestSuite.run(TestSuite.java:247)
	at org.junit.internal.runners.JUnit38ClassRunner.run(JUnit38ClassRunner.java:86)
	at org.apache.maven.surefire.junit4.JUnit4Provider.execute(JUnit4Provider.java:264)
	at org.apache.maven.surefire.junit4.JUnit4Provider.executeTestSet(JUnit4Provider.java:153)
	at org.apache.maven.surefire.junit4.JUnit4Provider.invoke(JUnit4Provider.java:124)
	at sun.reflect.NativeMethodAccessorImpl.invoke0(Native Method)
	at sun.reflect.NativeMethodAccessorImpl.invoke(NativeMethodAccessorImpl.java:62)
	at sun.reflect.DelegatingMethodAccessorImpl.invoke(DelegatingMethodAccessorImpl.java:43)
	at java.lang.reflect.Method.invoke(Method.java:498)
	at org.apache.maven.surefire.util.ReflectionUtils.invokeMethodWithArray2(ReflectionUtils.java:208)
	at org.apache.maven.surefire.booter.ProviderFactory$ProviderProxy.invoke(ProviderFactory.java:156)
	at org.apache.maven.surefire.booter.ProviderFactory.invokeProvider(ProviderFactory.java:82)
	at org.eclipse.tycho.surefire.osgibooter.OsgiSurefireBooter.run(OsgiSurefireBooter.java:95)
	at org.eclipse.tycho.surefire.osgibooter.HeadlessTestApplication.run(HeadlessTestApplication.java:21)
	at sun.reflect.NativeMethodAccessorImpl.invoke0(Native Method)
	at sun.reflect.NativeMethodAccessorImpl.invoke(NativeMethodAccessorImpl.java:62)
	at sun.reflect.DelegatingMethodAccessorImpl.invoke(DelegatingMethodAccessorImpl.java:43)
	at java.lang.reflect.Method.invoke(Method.java:498)
	at org.eclipse.equinox.internal.app.EclipseAppContainer.callMethodWithException(EclipseAppContainer.java:587)
	at org.eclipse.equinox.internal.app.EclipseAppHandle.run(EclipseAppHandle.java:198)
	at org.eclipse.core.runtime.internal.adaptor.EclipseAppLauncher.runApplication(EclipseAppLauncher.java:134)
	at org.eclipse.core.runtime.internal.adaptor.EclipseAppLauncher.start(EclipseAppLauncher.java:104)
	at org.eclipse.core.runtime.adaptor.EclipseStarter.run(EclipseStarter.java:380)
	at org.eclipse.core.runtime.adaptor.EclipseStarter.run(EclipseStarter.java:235)
	at sun.reflect.NativeMethodAccessorImpl.invoke0(Native Method)
	at sun.reflect.NativeMethodAccessorImpl.invoke(NativeMethodAccessorImpl.java:62)
	at sun.reflect.DelegatingMethodAccessorImpl.invoke(DelegatingMethodAccessorImpl.java:43)
	at java.lang.reflect.Method.invoke(Method.java:498)
	at org.eclipse.equinox.launcher.Main.invokeFramework(Main.java:669)
	at org.eclipse.equinox.launcher.Main.basicRun(Main.java:608)
	at org.eclipse.equinox.launcher.Main.run(Main.java:1515)
	at org.eclipse.equinox.launcher.Main.main(Main.java:1488)

testGetRSNamespace(org.eclipse.ecf.tests.remoteservice.r_osgi.ROsgiConcatConsumerTest)  Time elapsed: 0.001 sec
testGetLocallyRegisteredService(org.eclipse.ecf.tests.remoteservice.r_osgi.ROsgiConcatConsumerTest)  Time elapsed: 5.027 sec
testCallSynch(org.eclipse.ecf.tests.remoteservice.r_osgi.ROsgiConcatConsumerTest)  Time elapsed: 0.007 sec  <<< FAILURE!
junit.framework.AssertionFailedError: null
	at junit.framework.Assert.fail(Assert.java:55)
	at junit.framework.Assert.assertTrue(Assert.java:22)
	at junit.framework.Assert.assertNotNull(Assert.java:256)
	at junit.framework.Assert.assertNotNull(Assert.java:248)
	at junit.framework.TestCase.assertNotNull(TestCase.java:417)
	at org.eclipse.ecf.tests.remoteservice.AbstractConcatConsumerTestCase.testCallSynch(AbstractConcatConsumerTestCase.java:197)
	at sun.reflect.NativeMethodAccessorImpl.invoke0(Native Method)
	at sun.reflect.NativeMethodAccessorImpl.invoke(NativeMethodAccessorImpl.java:62)
	at sun.reflect.DelegatingMethodAccessorImpl.invoke(DelegatingMethodAccessorImpl.java:43)
	at java.lang.reflect.Method.invoke(Method.java:498)
	at junit.framework.TestCase.runTest(TestCase.java:176)
	at junit.framework.TestCase.runBare(TestCase.java:141)
	at junit.framework.TestResult$1.protect(TestResult.java:122)
	at junit.framework.TestResult.runProtected(TestResult.java:142)
	at junit.framework.TestResult.run(TestResult.java:125)
	at junit.framework.TestCase.run(TestCase.java:129)
	at junit.framework.TestSuite.runTest(TestSuite.java:252)
	at junit.framework.TestSuite.run(TestSuite.java:247)
	at org.junit.internal.runners.JUnit38ClassRunner.run(JUnit38ClassRunner.java:86)
	at org.apache.maven.surefire.junit4.JUnit4Provider.execute(JUnit4Provider.java:264)
	at org.apache.maven.surefire.junit4.JUnit4Provider.executeTestSet(JUnit4Provider.java:153)
	at org.apache.maven.surefire.junit4.JUnit4Provider.invoke(JUnit4Provider.java:124)
	at sun.reflect.NativeMethodAccessorImpl.invoke0(Native Method)
	at sun.reflect.NativeMethodAccessorImpl.invoke(NativeMethodAccessorImpl.java:62)
	at sun.reflect.DelegatingMethodAccessorImpl.invoke(DelegatingMethodAccessorImpl.java:43)
	at java.lang.reflect.Method.invoke(Method.java:498)
	at org.apache.maven.surefire.util.ReflectionUtils.invokeMethodWithArray2(ReflectionUtils.java:208)
	at org.apache.maven.surefire.booter.ProviderFactory$ProviderProxy.invoke(ProviderFactory.java:156)
	at org.apache.maven.surefire.booter.ProviderFactory.invokeProvider(ProviderFactory.java:82)
	at org.eclipse.tycho.surefire.osgibooter.OsgiSurefireBooter.run(OsgiSurefireBooter.java:95)
	at org.eclipse.tycho.surefire.osgibooter.HeadlessTestApplication.run(HeadlessTestApplication.java:21)
	at sun.reflect.NativeMethodAccessorImpl.invoke0(Native Method)
	at sun.reflect.NativeMethodAccessorImpl.invoke(NativeMethodAccessorImpl.java:62)
	at sun.reflect.DelegatingMethodAccessorImpl.invoke(DelegatingMethodAccessorImpl.java:43)
	at java.lang.reflect.Method.invoke(Method.java:498)
	at org.eclipse.equinox.internal.app.EclipseAppContainer.callMethodWithException(EclipseAppContainer.java:587)
	at org.eclipse.equinox.internal.app.EclipseAppHandle.run(EclipseAppHandle.java:198)
	at org.eclipse.core.runtime.internal.adaptor.EclipseAppLauncher.runApplication(EclipseAppLauncher.java:134)
	at org.eclipse.core.runtime.internal.adaptor.EclipseAppLauncher.start(EclipseAppLauncher.java:104)
	at org.eclipse.core.runtime.adaptor.EclipseStarter.run(EclipseStarter.java:380)
	at org.eclipse.core.runtime.adaptor.EclipseStarter.run(EclipseStarter.java:235)
	at sun.reflect.NativeMethodAccessorImpl.invoke0(Native Method)
	at sun.reflect.NativeMethodAccessorImpl.invoke(NativeMethodAccessorImpl.java:62)
	at sun.reflect.DelegatingMethodAccessorImpl.invoke(DelegatingMethodAccessorImpl.java:43)
	at java.lang.reflect.Method.invoke(Method.java:498)
	at org.eclipse.equinox.launcher.Main.invokeFramework(Main.java:669)
	at org.eclipse.equinox.launcher.Main.basicRun(Main.java:608)
	at org.eclipse.equinox.launcher.Main.run(Main.java:1515)
	at org.eclipse.equinox.launcher.Main.main(Main.java:1488)

testGetRemoteServiceIDs(org.eclipse.ecf.tests.remoteservice.r_osgi.ROsgiConcatConsumerTest)  Time elapsed: 0.041 sec  <<< FAILURE!
junit.framework.AssertionFailedError: null
	at junit.framework.Assert.fail(Assert.java:55)
	at junit.framework.Assert.assertTrue(Assert.java:22)
	at junit.framework.Assert.assertTrue(Assert.java:31)
	at junit.framework.TestCase.assertTrue(TestCase.java:201)
	at org.eclipse.ecf.tests.remoteservice.AbstractConcatConsumerTestCase.testGetRemoteServiceIDs(AbstractConcatConsumerTestCase.java:150)
	at sun.reflect.NativeMethodAccessorImpl.invoke0(Native Method)
	at sun.reflect.NativeMethodAccessorImpl.invoke(NativeMethodAccessorImpl.java:62)
	at sun.reflect.DelegatingMethodAccessorImpl.invoke(DelegatingMethodAccessorImpl.java:43)
	at java.lang.reflect.Method.invoke(Method.java:498)
	at junit.framework.TestCase.runTest(TestCase.java:176)
	at junit.framework.TestCase.runBare(TestCase.java:141)
	at junit.framework.TestResult$1.protect(TestResult.java:122)
	at junit.framework.TestResult.runProtected(TestResult.java:142)
	at junit.framework.TestResult.run(TestResult.java:125)
	at junit.framework.TestCase.run(TestCase.java:129)
	at junit.framework.TestSuite.runTest(TestSuite.java:252)
	at junit.framework.TestSuite.run(TestSuite.java:247)
	at org.junit.internal.runners.JUnit38ClassRunner.run(JUnit38ClassRunner.java:86)
	at org.apache.maven.surefire.junit4.JUnit4Provider.execute(JUnit4Provider.java:264)
	at org.apache.maven.surefire.junit4.JUnit4Provider.executeTestSet(JUnit4Provider.java:153)
	at org.apache.maven.surefire.junit4.JUnit4Provider.invoke(JUnit4Provider.java:124)
	at sun.reflect.NativeMethodAccessorImpl.invoke0(Native Method)
	at sun.reflect.NativeMethodAccessorImpl.invoke(NativeMethodAccessorImpl.java:62)
	at sun.reflect.DelegatingMethodAccessorImpl.invoke(DelegatingMethodAccessorImpl.java:43)
	at java.lang.reflect.Method.invoke(Method.java:498)
	at org.apache.maven.surefire.util.ReflectionUtils.invokeMethodWithArray2(ReflectionUtils.java:208)
	at org.apache.maven.surefire.booter.ProviderFactory$ProviderProxy.invoke(ProviderFactory.java:156)
	at org.apache.maven.surefire.booter.ProviderFactory.invokeProvider(ProviderFactory.java:82)
	at org.eclipse.tycho.surefire.osgibooter.OsgiSurefireBooter.run(OsgiSurefireBooter.java:95)
	at org.eclipse.tycho.surefire.osgibooter.HeadlessTestApplication.run(HeadlessTestApplication.java:21)
	at sun.reflect.NativeMethodAccessorImpl.invoke0(Native Method)
	at sun.reflect.NativeMethodAccessorImpl.invoke(NativeMethodAccessorImpl.java:62)
	at sun.reflect.DelegatingMethodAccessorImpl.invoke(DelegatingMethodAccessorImpl.java:43)
	at java.lang.reflect.Method.invoke(Method.java:498)
	at org.eclipse.equinox.internal.app.EclipseAppContainer.callMethodWithException(EclipseAppContainer.java:587)
	at org.eclipse.equinox.internal.app.EclipseAppHandle.run(EclipseAppHandle.java:198)
	at org.eclipse.core.runtime.internal.adaptor.EclipseAppLauncher.runApplication(EclipseAppLauncher.java:134)
	at org.eclipse.core.runtime.internal.adaptor.EclipseAppLauncher.start(EclipseAppLauncher.java:104)
	at org.eclipse.core.runtime.adaptor.EclipseStarter.run(EclipseStarter.java:380)
	at org.eclipse.core.runtime.adaptor.EclipseStarter.run(EclipseStarter.java:235)
	at sun.reflect.NativeMethodAccessorImpl.invoke0(Native Method)
	at sun.reflect.NativeMethodAccessorImpl.invoke(NativeMethodAccessorImpl.java:62)
	at sun.reflect.DelegatingMethodAccessorImpl.invoke(DelegatingMethodAccessorImpl.java:43)
	at java.lang.reflect.Method.invoke(Method.java:498)
	at org.eclipse.equinox.launcher.Main.invokeFramework(Main.java:669)
	at org.eclipse.equinox.launcher.Main.basicRun(Main.java:608)
	at org.eclipse.equinox.launcher.Main.run(Main.java:1515)
	at org.eclipse.equinox.launcher.Main.main(Main.java:1488)

testCallAsynch(org.eclipse.ecf.tests.remoteservice.r_osgi.ROsgiConcatConsumerTest)  Time elapsed: 0.004 sec  <<< FAILURE!
junit.framework.AssertionFailedError: null
	at junit.framework.Assert.fail(Assert.java:55)
	at junit.framework.Assert.assertTrue(Assert.java:22)
	at junit.framework.Assert.assertNotNull(Assert.java:256)
	at junit.framework.Assert.assertNotNull(Assert.java:248)
	at junit.framework.TestCase.assertNotNull(TestCase.java:417)
	at org.eclipse.ecf.tests.remoteservice.AbstractConcatConsumerTestCase.testCallAsynch(AbstractConcatConsumerTestCase.java:279)
	at sun.reflect.NativeMethodAccessorImpl.invoke0(Native Method)
	at sun.reflect.NativeMethodAccessorImpl.invoke(NativeMethodAccessorImpl.java:62)
	at sun.reflect.DelegatingMethodAccessorImpl.invoke(DelegatingMethodAccessorImpl.java:43)
	at java.lang.reflect.Method.invoke(Method.java:498)
	at junit.framework.TestCase.runTest(TestCase.java:176)
	at junit.framework.TestCase.runBare(TestCase.java:141)
	at junit.framework.TestResult$1.protect(TestResult.java:122)
	at junit.framework.TestResult.runProtected(TestResult.java:142)
	at junit.framework.TestResult.run(TestResult.java:125)
	at junit.framework.TestCase.run(TestCase.java:129)
	at junit.framework.TestSuite.runTest(TestSuite.java:252)
	at junit.framework.TestSuite.run(TestSuite.java:247)
	at org.junit.internal.runners.JUnit38ClassRunner.run(JUnit38ClassRunner.java:86)
	at org.apache.maven.surefire.junit4.JUnit4Provider.execute(JUnit4Provider.java:264)
	at org.apache.maven.surefire.junit4.JUnit4Provider.executeTestSet(JUnit4Provider.java:153)
	at org.apache.maven.surefire.junit4.JUnit4Provider.invoke(JUnit4Provider.java:124)
	at sun.reflect.NativeMethodAccessorImpl.invoke0(Native Method)
	at sun.reflect.NativeMethodAccessorImpl.invoke(NativeMethodAccessorImpl.java:62)
	at sun.reflect.DelegatingMethodAccessorImpl.invoke(DelegatingMethodAccessorImpl.java:43)
	at java.lang.reflect.Method.invoke(Method.java:498)
	at org.apache.maven.surefire.util.ReflectionUtils.invokeMethodWithArray2(ReflectionUtils.java:208)
	at org.apache.maven.surefire.booter.ProviderFactory$ProviderProxy.invoke(ProviderFactory.java:156)
	at org.apache.maven.surefire.booter.ProviderFactory.invokeProvider(ProviderFactory.java:82)
	at org.eclipse.tycho.surefire.osgibooter.OsgiSurefireBooter.run(OsgiSurefireBooter.java:95)
	at org.eclipse.tycho.surefire.osgibooter.HeadlessTestApplication.run(HeadlessTestApplication.java:21)
	at sun.reflect.NativeMethodAccessorImpl.invoke0(Native Method)
	at sun.reflect.NativeMethodAccessorImpl.invoke(NativeMethodAccessorImpl.java:62)
	at sun.reflect.DelegatingMethodAccessorImpl.invoke(DelegatingMethodAccessorImpl.java:43)
	at java.lang.reflect.Method.invoke(Method.java:498)
	at org.eclipse.equinox.internal.app.EclipseAppContainer.callMethodWithException(EclipseAppContainer.java:587)
	at org.eclipse.equinox.internal.app.EclipseAppHandle.run(EclipseAppHandle.java:198)
	at org.eclipse.core.runtime.internal.adaptor.EclipseAppLauncher.runApplication(EclipseAppLauncher.java:134)
	at org.eclipse.core.runtime.internal.adaptor.EclipseAppLauncher.start(EclipseAppLauncher.java:104)
	at org.eclipse.core.runtime.adaptor.EclipseStarter.run(EclipseStarter.java:380)
	at org.eclipse.core.runtime.adaptor.EclipseStarter.run(EclipseStarter.java:235)
	at sun.reflect.NativeMethodAccessorImpl.invoke0(Native Method)
	at sun.reflect.NativeMethodAccessorImpl.invoke(NativeMethodAccessorImpl.java:62)
	at sun.reflect.DelegatingMethodAccessorImpl.invoke(DelegatingMethodAccessorImpl.java:43)
	at java.lang.reflect.Method.invoke(Method.java:498)
	at org.eclipse.equinox.launcher.Main.invokeFramework(Main.java:669)
	at org.eclipse.equinox.launcher.Main.basicRun(Main.java:608)
	at org.eclipse.equinox.launcher.Main.run(Main.java:1515)
	at org.eclipse.equinox.launcher.Main.main(Main.java:1488)

testGetRSReference(org.eclipse.ecf.tests.remoteservice.r_osgi.ROsgiConcatConsumerTest)  Time elapsed: 0.004 sec  <<< FAILURE!
junit.framework.AssertionFailedError: null
	at junit.framework.Assert.fail(Assert.java:55)
	at junit.framework.Assert.assertTrue(Assert.java:22)
	at junit.framework.Assert.assertNotNull(Assert.java:256)
	at junit.framework.Assert.assertNotNull(Assert.java:248)
	at junit.framework.TestCase.assertNotNull(TestCase.java:417)
	at org.eclipse.ecf.tests.remoteservice.AbstractConcatConsumerTestCase.testGetRSReference(AbstractConcatConsumerTestCase.java:272)
	at sun.reflect.NativeMethodAccessorImpl.invoke0(Native Method)
	at sun.reflect.NativeMethodAccessorImpl.invoke(NativeMethodAccessorImpl.java:62)
	at sun.reflect.DelegatingMethodAccessorImpl.invoke(DelegatingMethodAccessorImpl.java:43)
	at java.lang.reflect.Method.invoke(Method.java:498)
	at junit.framework.TestCase.runTest(TestCase.java:176)
	at junit.framework.TestCase.runBare(TestCase.java:141)
	at junit.framework.TestResult$1.protect(TestResult.java:122)
	at junit.framework.TestResult.runProtected(TestResult.java:142)
	at junit.framework.TestResult.run(TestResult.java:125)
	at junit.framework.TestCase.run(TestCase.java:129)
	at junit.framework.TestSuite.runTest(TestSuite.java:252)
	at junit.framework.TestSuite.run(TestSuite.java:247)
	at org.junit.internal.runners.JUnit38ClassRunner.run(JUnit38ClassRunner.java:86)
	at org.apache.maven.surefire.junit4.JUnit4Provider.execute(JUnit4Provider.java:264)
	at org.apache.maven.surefire.junit4.JUnit4Provider.executeTestSet(JUnit4Provider.java:153)
	at org.apache.maven.surefire.junit4.JUnit4Provider.invoke(JUnit4Provider.java:124)
	at sun.reflect.NativeMethodAccessorImpl.invoke0(Native Method)
	at sun.reflect.NativeMethodAccessorImpl.invoke(NativeMethodAccessorImpl.java:62)
	at sun.reflect.DelegatingMethodAccessorImpl.invoke(DelegatingMethodAccessorImpl.java:43)
	at java.lang.reflect.Method.invoke(Method.java:498)
	at org.apache.maven.surefire.util.ReflectionUtils.invokeMethodWithArray2(ReflectionUtils.java:208)
	at org.apache.maven.surefire.booter.ProviderFactory$ProviderProxy.invoke(ProviderFactory.java:156)
	at org.apache.maven.surefire.booter.ProviderFactory.invokeProvider(ProviderFactory.java:82)
	at org.eclipse.tycho.surefire.osgibooter.OsgiSurefireBooter.run(OsgiSurefireBooter.java:95)
	at org.eclipse.tycho.surefire.osgibooter.HeadlessTestApplication.run(HeadlessTestApplication.java:21)
	at sun.reflect.NativeMethodAccessorImpl.invoke0(Native Method)
	at sun.reflect.NativeMethodAccessorImpl.invoke(NativeMethodAccessorImpl.java:62)
	at sun.reflect.DelegatingMethodAccessorImpl.invoke(DelegatingMethodAccessorImpl.java:43)
	at java.lang.reflect.Method.invoke(Method.java:498)
	at org.eclipse.equinox.internal.app.EclipseAppContainer.callMethodWithException(EclipseAppContainer.java:587)
	at org.eclipse.equinox.internal.app.EclipseAppHandle.run(EclipseAppHandle.java:198)
	at org.eclipse.core.runtime.internal.adaptor.EclipseAppLauncher.runApplication(EclipseAppLauncher.java:134)
	at org.eclipse.core.runtime.internal.adaptor.EclipseAppLauncher.start(EclipseAppLauncher.java:104)
	at org.eclipse.core.runtime.adaptor.EclipseStarter.run(EclipseStarter.java:380)
	at org.eclipse.core.runtime.adaptor.EclipseStarter.run(EclipseStarter.java:235)
	at sun.reflect.NativeMethodAccessorImpl.invoke0(Native Method)
	at sun.reflect.NativeMethodAccessorImpl.invoke(NativeMethodAccessorImpl.java:62)
	at sun.reflect.DelegatingMethodAccessorImpl.invoke(DelegatingMethodAccessorImpl.java:43)
	at java.lang.reflect.Method.invoke(Method.java:498)
	at org.eclipse.equinox.launcher.Main.invokeFramework(Main.java:669)
	at org.eclipse.equinox.launcher.Main.basicRun(Main.java:608)
	at org.eclipse.equinox.launcher.Main.run(Main.java:1515)
	at org.eclipse.equinox.launcher.Main.main(Main.java:1488)

testGetRemoteServiceReferenceServiceID(org.eclipse.ecf.tests.remoteservice.r_osgi.ROsgiConcatConsumerTest)  Time elapsed: 0.004 sec  <<< FAILURE!
junit.framework.AssertionFailedError: null
	at junit.framework.Assert.fail(Assert.java:55)
	at junit.framework.Assert.assertTrue(Assert.java:22)
	at junit.framework.Assert.assertTrue(Assert.java:31)
	at junit.framework.TestCase.assertTrue(TestCase.java:201)
	at org.eclipse.ecf.tests.remoteservice.AbstractConcatConsumerTestCase.testGetRemoteServiceReferenceServiceID(AbstractConcatConsumerTestCase.java:176)
	at sun.reflect.NativeMethodAccessorImpl.invoke0(Native Method)
	at sun.reflect.NativeMethodAccessorImpl.invoke(NativeMethodAccessorImpl.java:62)
	at sun.reflect.DelegatingMethodAccessorImpl.invoke(DelegatingMethodAccessorImpl.java:43)
	at java.lang.reflect.Method.invoke(Method.java:498)
	at junit.framework.TestCase.runTest(TestCase.java:176)
	at junit.framework.TestCase.runBare(TestCase.java:141)
	at junit.framework.TestResult$1.protect(TestResult.java:122)
	at junit.framework.TestResult.runProtected(TestResult.java:142)
	at junit.framework.TestResult.run(TestResult.java:125)
	at junit.framework.TestCase.run(TestCase.java:129)
	at junit.framework.TestSuite.runTest(TestSuite.java:252)
	at junit.framework.TestSuite.run(TestSuite.java:247)
	at org.junit.internal.runners.JUnit38ClassRunner.run(JUnit38ClassRunner.java:86)
	at org.apache.maven.surefire.junit4.JUnit4Provider.execute(JUnit4Provider.java:264)
	at org.apache.maven.surefire.junit4.JUnit4Provider.executeTestSet(JUnit4Provider.java:153)
	at org.apache.maven.surefire.junit4.JUnit4Provider.invoke(JUnit4Provider.java:124)
	at sun.reflect.NativeMethodAccessorImpl.invoke0(Native Method)
	at sun.reflect.NativeMethodAccessorImpl.invoke(NativeMethodAccessorImpl.java:62)
	at sun.reflect.DelegatingMethodAccessorImpl.invoke(DelegatingMethodAccessorImpl.java:43)
	at java.lang.reflect.Method.invoke(Method.java:498)
	at org.apache.maven.surefire.util.ReflectionUtils.invokeMethodWithArray2(ReflectionUtils.java:208)
	at org.apache.maven.surefire.booter.ProviderFactory$ProviderProxy.invoke(ProviderFactory.java:156)
	at org.apache.maven.surefire.booter.ProviderFactory.invokeProvider(ProviderFactory.java:82)
	at org.eclipse.tycho.surefire.osgibooter.OsgiSurefireBooter.run(OsgiSurefireBooter.java:95)
	at org.eclipse.tycho.surefire.osgibooter.HeadlessTestApplication.run(HeadlessTestApplication.java:21)
	at sun.reflect.NativeMethodAccessorImpl.invoke0(Native Method)
	at sun.reflect.NativeMethodAccessorImpl.invoke(NativeMethodAccessorImpl.java:62)
	at sun.reflect.DelegatingMethodAccessorImpl.invoke(DelegatingMethodAccessorImpl.java:43)
	at java.lang.reflect.Method.invoke(Method.java:498)
	at org.eclipse.equinox.internal.app.EclipseAppContainer.callMethodWithException(EclipseAppContainer.java:587)
	at org.eclipse.equinox.internal.app.EclipseAppHandle.run(EclipseAppHandle.java:198)
	at org.eclipse.core.runtime.internal.adaptor.EclipseAppLauncher.runApplication(EclipseAppLauncher.java:134)
	at org.eclipse.core.runtime.internal.adaptor.EclipseAppLauncher.start(EclipseAppLauncher.java:104)
	at org.eclipse.core.runtime.adaptor.EclipseStarter.run(EclipseStarter.java:380)
	at org.eclipse.core.runtime.adaptor.EclipseStarter.run(EclipseStarter.java:235)
	at sun.reflect.NativeMethodAccessorImpl.invoke0(Native Method)
	at sun.reflect.NativeMethodAccessorImpl.invoke(NativeMethodAccessorImpl.java:62)
	at sun.reflect.DelegatingMethodAccessorImpl.invoke(DelegatingMethodAccessorImpl.java:43)
	at java.lang.reflect.Method.invoke(Method.java:498)
	at org.eclipse.equinox.launcher.Main.invokeFramework(Main.java:669)
	at org.eclipse.equinox.launcher.Main.basicRun(Main.java:608)
	at org.eclipse.equinox.launcher.Main.run(Main.java:1515)
	at org.eclipse.equinox.launcher.Main.main(Main.java:1488)

testGetRemoteServiceReferenceObjectClass(org.eclipse.ecf.tests.remoteservice.r_osgi.ROsgiConcatConsumerTest)  Time elapsed: 0.004 sec  <<< FAILURE!
junit.framework.AssertionFailedError: null
	at junit.framework.Assert.fail(Assert.java:55)
	at junit.framework.Assert.assertTrue(Assert.java:22)
	at junit.framework.Assert.assertTrue(Assert.java:31)
	at junit.framework.TestCase.assertTrue(TestCase.java:201)
	at org.eclipse.ecf.tests.remoteservice.AbstractConcatConsumerTestCase.testGetRemoteServiceReferenceObjectClass(AbstractConcatConsumerTestCase.java:162)
	at sun.reflect.NativeMethodAccessorImpl.invoke0(Native Method)
	at sun.reflect.NativeMethodAccessorImpl.invoke(NativeMethodAccessorImpl.java:62)
	at sun.reflect.DelegatingMethodAccessorImpl.invoke(DelegatingMethodAccessorImpl.java:43)
	at java.lang.reflect.Method.invoke(Method.java:498)
	at junit.framework.TestCase.runTest(TestCase.java:176)
	at junit.framework.TestCase.runBare(TestCase.java:141)
	at junit.framework.TestResult$1.protect(TestResult.java:122)
	at junit.framework.TestResult.runProtected(TestResult.java:142)
	at junit.framework.TestResult.run(TestResult.java:125)
	at junit.framework.TestCase.run(TestCase.java:129)
	at junit.framework.TestSuite.runTest(TestSuite.java:252)
	at junit.framework.TestSuite.run(TestSuite.java:247)
	at org.junit.internal.runners.JUnit38ClassRunner.run(JUnit38ClassRunner.java:86)
	at org.apache.maven.surefire.junit4.JUnit4Provider.execute(JUnit4Provider.java:264)
	at org.apache.maven.surefire.junit4.JUnit4Provider.executeTestSet(JUnit4Provider.java:153)
	at org.apache.maven.surefire.junit4.JUnit4Provider.invoke(JUnit4Provider.java:124)
	at sun.reflect.NativeMethodAccessorImpl.invoke0(Native Method)
	at sun.reflect.NativeMethodAccessorImpl.invoke(NativeMethodAccessorImpl.java:62)
	at sun.reflect.DelegatingMethodAccessorImpl.invoke(DelegatingMethodAccessorImpl.java:43)
	at java.lang.reflect.Method.invoke(Method.java:498)
	at org.apache.maven.surefire.util.ReflectionUtils.invokeMethodWithArray2(ReflectionUtils.java:208)
	at org.apache.maven.surefire.booter.ProviderFactory$ProviderProxy.invoke(ProviderFactory.java:156)
	at org.apache.maven.surefire.booter.ProviderFactory.invokeProvider(ProviderFactory.java:82)
	at org.eclipse.tycho.surefire.osgibooter.OsgiSurefireBooter.run(OsgiSurefireBooter.java:95)
	at org.eclipse.tycho.surefire.osgibooter.HeadlessTestApplication.run(HeadlessTestApplication.java:21)
	at sun.reflect.NativeMethodAccessorImpl.invoke0(Native Method)
	at sun.reflect.NativeMethodAccessorImpl.invoke(NativeMethodAccessorImpl.java:62)
	at sun.reflect.DelegatingMethodAccessorImpl.invoke(DelegatingMethodAccessorImpl.java:43)
	at java.lang.reflect.Method.invoke(Method.java:498)
	at org.eclipse.equinox.internal.app.EclipseAppContainer.callMethodWithException(EclipseAppContainer.java:587)
	at org.eclipse.equinox.internal.app.EclipseAppHandle.run(EclipseAppHandle.java:198)
	at org.eclipse.core.runtime.internal.adaptor.EclipseAppLauncher.runApplication(EclipseAppLauncher.java:134)
	at org.eclipse.core.runtime.internal.adaptor.EclipseAppLauncher.start(EclipseAppLauncher.java:104)
	at org.eclipse.core.runtime.adaptor.EclipseStarter.run(EclipseStarter.java:380)
	at org.eclipse.core.runtime.adaptor.EclipseStarter.run(EclipseStarter.java:235)
	at sun.reflect.NativeMethodAccessorImpl.invoke0(Native Method)
	at sun.reflect.NativeMethodAccessorImpl.invoke(NativeMethodAccessorImpl.java:62)
	at sun.reflect.DelegatingMethodAccessorImpl.invoke(DelegatingMethodAccessorImpl.java:43)
	at java.lang.reflect.Method.invoke(Method.java:498)
	at org.eclipse.equinox.launcher.Main.invokeFramework(Main.java:669)
	at org.eclipse.equinox.launcher.Main.basicRun(Main.java:608)
	at org.eclipse.equinox.launcher.Main.run(Main.java:1515)
	at org.eclipse.equinox.launcher.Main.main(Main.java:1488)


Results :

Failed tests: 
  ROsgiConcatConsumerTest>AbstractConcatConsumerTestCase.testGetService:191 null
  ROsgiConcatConsumerTest>AbstractConcatConsumerTestCase.testFireAsynch:290 null
  ROsgiConcatConsumerTest>AbstractConcatConsumerTestCase.testGetServiceReferences:142 null
  ROsgiConcatConsumerTest>AbstractConcatConsumerTestCase.testProxy:300 null
  ROsgiConcatConsumerTest>AbstractConcatConsumerTestCase.testAsyncResult:312 null
  ROsgiConcatConsumerTest>AbstractConcatConsumerTestCase.testCallSynch:197 null
  ROsgiConcatConsumerTest>AbstractConcatConsumerTestCase.testGetRemoteServiceIDs:150 null
  ROsgiConcatConsumerTest>AbstractConcatConsumerTestCase.testCallAsynch:279 null
  ROsgiConcatConsumerTest>AbstractConcatConsumerTestCase.testGetRSReference:272 null
  ROsgiConcatConsumerTest>AbstractConcatConsumerTestCase.testGetRemoteServiceReferenceServiceID:176 null
  ROsgiConcatConsumerTest>AbstractConcatConsumerTestCase.testGetRemoteServiceReferenceObjectClass:162 null

Tests run: 15, Failures: 11, Errors: 0, Skipped: 0

[ERROR] There are test failures.

Please refer to /home/hudson/genie.ecf/.hudson/workspace/ecf-tycho.master-mars/tests/bundles/org.eclipse.ecf.tests.remoteservice.r-osgi/target/surefire-reports for the individual test results.
[JENKINS] Recording test results
[INFO] 
[INFO] --- tycho-pack200a-plugin:0.26.0:normalize (pack200-normalize) @ org.eclipse.ecf.tests.remoteservice.r-osgi ---
[INFO] Pack200 normalizing jar /home/hudson/genie.ecf/.hudson/workspace/ecf-tycho.master-mars/tests/bundles/org.eclipse.ecf.tests.remoteservice.r-osgi/target/org.eclipse.ecf.tests.remoteservice.r-osgi-1.0.0-SNAPSHOT.jar
[INFO] 
[INFO] --- eclipse-jarsigner-plugin:1.1.3:sign (sign) @ org.eclipse.ecf.tests.remoteservice.r-osgi ---
[INFO] Signing jar: /home/hudson/genie.ecf/.hudson/workspace/ecf-tycho.master-mars/tests/bundles/org.eclipse.ecf.tests.remoteservice.r-osgi/target/org.eclipse.ecf.tests.remoteservice.r-osgi-1.0.0-SNAPSHOT.jar
[INFO] Signing jar: /home/hudson/genie.ecf/.hudson/workspace/ecf-tycho.master-mars/tests/bundles/org.eclipse.ecf.tests.remoteservice.r-osgi/target/org.eclipse.ecf.tests.remoteservice.r-osgi-1.0.0-SNAPSHOT-sources.jar
[INFO] 
[INFO] --- tycho-pack200b-plugin:0.26.0:pack (pack200-pack) @ org.eclipse.ecf.tests.remoteservice.r-osgi ---
[INFO] Pack200 packing jar /home/hudson/genie.ecf/.hudson/workspace/ecf-tycho.master-mars/tests/bundles/org.eclipse.ecf.tests.remoteservice.r-osgi/target/org.eclipse.ecf.tests.remoteservice.r-osgi-1.0.0-SNAPSHOT.jar
[INFO] 
[INFO] --- tycho-p2-plugin:0.26.0:p2-metadata (p2-metadata) @ org.eclipse.ecf.tests.remoteservice.r-osgi ---
Started calculate disk usage of build
Finished Calculation of disk usage of build in 0 seconds
Started calculate disk usage of workspace
Finished Calculation of disk usage of workspace in 0 seconds
[INFO]                                                                         
[INFO] ------------------------------------------------------------------------
[INFO] Building org.eclipse.ecf.tests.osgi.services.distribution.generic 1.0.0-SNAPSHOT
[INFO] ------------------------------------------------------------------------
[INFO] 
[INFO] --- maven-clean-plugin:3.0.0:clean (default-clean) @ org.eclipse.ecf.tests.osgi.services.distribution.generic ---
[INFO] Deleting /home/hudson/genie.ecf/.hudson/workspace/ecf-tycho.master-mars/tests/bundles/org.eclipse.ecf.tests.osgi.services.distribution.generic/target
[INFO] 
[INFO] --- tycho-packaging-plugin:0.26.0:build-qualifier (default-build-qualifier) @ org.eclipse.ecf.tests.osgi.services.distribution.generic ---
[INFO] The project's OSGi version is 1.0.0.v20160926-1048
[INFO] 
[INFO] --- tycho-packaging-plugin:0.26.0:validate-id (default-validate-id) @ org.eclipse.ecf.tests.osgi.services.distribution.generic ---
[INFO] 
[INFO] --- tycho-packaging-plugin:0.26.0:validate-version (default-validate-version) @ org.eclipse.ecf.tests.osgi.services.distribution.generic ---
[INFO] 
[INFO] --- maven-resources-plugin:2.4.3:resources (default-resources) @ org.eclipse.ecf.tests.osgi.services.distribution.generic ---
[INFO] Using 'ISO-8859-1' encoding to copy filtered resources.
[INFO] skip non existing resourceDirectory /home/hudson/genie.ecf/.hudson/workspace/ecf-tycho.master-mars/tests/bundles/org.eclipse.ecf.tests.osgi.services.distribution.generic/src/main/resources
[INFO] 
[INFO] --- tycho-compiler-plugin:0.26.0:compile (default-compile) @ org.eclipse.ecf.tests.osgi.services.distribution.generic ---
[INFO] Compiling 3 source files to /home/hudson/genie.ecf/.hudson/workspace/ecf-tycho.master-mars/tests/bundles/org.eclipse.ecf.tests.osgi.services.distribution.generic/target/classes
[INFO] 
[INFO] --- maven-resources-plugin:2.4.3:testResources (default-testResources) @ org.eclipse.ecf.tests.osgi.services.distribution.generic ---
[INFO] Using 'ISO-8859-1' encoding to copy filtered resources.
[INFO] skip non existing resourceDirectory /home/hudson/genie.ecf/.hudson/workspace/ecf-tycho.master-mars/tests/bundles/org.eclipse.ecf.tests.osgi.services.distribution.generic/src/test/resources
[INFO] 
[INFO] --- tycho-source-plugin:0.26.0:plugin-source (plugin-source) @ org.eclipse.ecf.tests.osgi.services.distribution.generic ---
[INFO] Building jar: /home/hudson/genie.ecf/.hudson/workspace/ecf-tycho.master-mars/tests/bundles/org.eclipse.ecf.tests.osgi.services.distribution.generic/target/org.eclipse.ecf.tests.osgi.services.distribution.generic-1.0.0-SNAPSHOT-sources.jar
[INFO] 
[INFO] --- target-platform-configuration:0.26.0:target-platform (default-target-platform) @ org.eclipse.ecf.tests.osgi.services.distribution.generic ---
[INFO] 
[INFO] --- tycho-packaging-plugin:0.26.0:package-plugin (default-package-plugin) @ org.eclipse.ecf.tests.osgi.services.distribution.generic ---
[INFO] Building jar: /home/hudson/genie.ecf/.hudson/workspace/ecf-tycho.master-mars/tests/bundles/org.eclipse.ecf.tests.osgi.services.distribution.generic/target/org.eclipse.ecf.tests.osgi.services.distribution.generic-1.0.0-SNAPSHOT.jar
[INFO] 
[INFO] --- tycho-p2-plugin:0.26.0:p2-metadata-default (default-p2-metadata-default) @ org.eclipse.ecf.tests.osgi.services.distribution.generic ---
[INFO] 
[INFO] --- tycho-source-feature-plugin:0.26.0:source-feature (source-feature) @ org.eclipse.ecf.tests.osgi.services.distribution.generic ---
[INFO] 
[INFO] --- tycho-p2-plugin:0.26.0:p2-metadata (attach-p2-metadata) @ org.eclipse.ecf.tests.osgi.services.distribution.generic ---
[INFO] 
[INFO] --- tycho-surefire-plugin:0.26.0:test (default-test) @ org.eclipse.ecf.tests.osgi.services.distribution.generic ---
[INFO] Expected eclipse log file: /home/hudson/genie.ecf/.hudson/workspace/ecf-tycho.master-mars/tests/bundles/org.eclipse.ecf.tests.osgi.services.distribution.generic/target/work/data/.metadata/.log
[INFO] Command line:
	[/opt/public/common/jdk1.8.0_121.x64/jre/bin/java, -Dosgi.noShutdown=false, -Dosgi.os=linux, -Dosgi.ws=gtk, -Dosgi.arch=x86_64, -Dosgi.clean=true, -Dnet.mdns.interface=127.0.0.1, -Dnet.mdns.port=65354, -Dorg.eclipse.ecf.osgi.services.discovery.allowLoopbackReference=true, -jar, /home/hudson/genie.ecf/.hudson/workspace/ecf-tycho.master-mars/.repository/p2/osgi/bundle/org.eclipse.equinox.launcher/1.3.100.v20150511-1540/org.eclipse.equinox.launcher-1.3.100.v20150511-1540.jar, -data, /home/hudson/genie.ecf/.hudson/workspace/ecf-tycho.master-mars/tests/bundles/org.eclipse.ecf.tests.osgi.services.distribution.generic/target/work/data, -install, /home/hudson/genie.ecf/.hudson/workspace/ecf-tycho.master-mars/tests/bundles/org.eclipse.ecf.tests.osgi.services.distribution.generic/target/work, -configuration, /home/hudson/genie.ecf/.hudson/workspace/ecf-tycho.master-mars/tests/bundles/org.eclipse.ecf.tests.osgi.services.distribution.generic/target/work/configuration, -application, org.eclipse.tycho.surefire.osgibooter.headlesstest, -testproperties, /home/hudson/genie.ecf/.hudson/workspace/ecf-tycho.master-mars/tests/bundles/org.eclipse.ecf.tests.osgi.services.distribution.generic/target/surefire.properties]

-------------------------------------------------------
 T E S T S
-------------------------------------------------------
Running org.eclipse.ecf.tests.osgi.services.distribution.generic.GenericRemoteServiceRegisterTest
====starting org.eclipse.ecf.tests.osgi.services.distribution.generic.GenericRemoteServiceRegisterTest.testRegisterOnExistingServerWithIdentity====
====ending org.eclipse.ecf.tests.osgi.services.distribution.generic.GenericRemoteServiceRegisterTest.testRegisterOnExistingServerWithIdentity====
====starting org.eclipse.ecf.tests.osgi.services.distribution.generic.GenericRemoteServiceRegisterTest.testRegisterOnExistingServerWithMissingExportedExtraIntents====
====ending org.eclipse.ecf.tests.osgi.services.distribution.generic.GenericRemoteServiceRegisterTest.testRegisterOnExistingServerWithMissingExportedExtraIntents====
====starting org.eclipse.ecf.tests.osgi.services.distribution.generic.GenericRemoteServiceRegisterTest.testRegisterOnExistingServerWithIntents====
====ending org.eclipse.ecf.tests.osgi.services.distribution.generic.GenericRemoteServiceRegisterTest.testRegisterOnExistingServerWithIntents====
====starting org.eclipse.ecf.tests.osgi.services.distribution.generic.GenericRemoteServiceRegisterTest.testRegisterOnExistingServerWithMissingIntents====
====ending org.eclipse.ecf.tests.osgi.services.distribution.generic.GenericRemoteServiceRegisterTest.testRegisterOnExistingServerWithMissingIntents====
====starting org.eclipse.ecf.tests.osgi.services.distribution.generic.GenericRemoteServiceRegisterTest.testRegisterOnExistingServerWithMissingExportedIntents====
====ending org.eclipse.ecf.tests.osgi.services.distribution.generic.GenericRemoteServiceRegisterTest.testRegisterOnExistingServerWithMissingExportedIntents====
====starting org.eclipse.ecf.tests.osgi.services.distribution.generic.GenericRemoteServiceRegisterTest.testRegisterOnCreatedServerWithIdentity====
====ending org.eclipse.ecf.tests.osgi.services.distribution.generic.GenericRemoteServiceRegisterTest.testRegisterOnCreatedServerWithIdentity====
====starting org.eclipse.ecf.tests.osgi.services.distribution.generic.GenericRemoteServiceRegisterTest.testRegisterOnExistingServerWithExportedIntents====
====ending org.eclipse.ecf.tests.osgi.services.distribution.generic.GenericRemoteServiceRegisterTest.testRegisterOnExistingServerWithExportedIntents====
====starting org.eclipse.ecf.tests.osgi.services.distribution.generic.GenericRemoteServiceRegisterTest.testRegisterOnExistingServerWithContainerID====
====ending org.eclipse.ecf.tests.osgi.services.distribution.generic.GenericRemoteServiceRegisterTest.testRegisterOnExistingServerWithContainerID====
====starting org.eclipse.ecf.tests.osgi.services.distribution.generic.GenericRemoteServiceRegisterTest.testRegisterOnCreatedServer====
====ending org.eclipse.ecf.tests.osgi.services.distribution.generic.GenericRemoteServiceRegisterTest.testRegisterOnCreatedServer====
====starting org.eclipse.ecf.tests.osgi.services.distribution.generic.GenericRemoteServiceRegisterTest.testRegisterOnExistingServer====
====ending org.eclipse.ecf.tests.osgi.services.distribution.generic.GenericRemoteServiceRegisterTest.testRegisterOnExistingServer====
====starting org.eclipse.ecf.tests.osgi.services.distribution.generic.GenericRemoteServiceRegisterTest.testRegisterOnExistingServerWithExportedExtraIntents====
====ending org.eclipse.ecf.tests.osgi.services.distribution.generic.GenericRemoteServiceRegisterTest.testRegisterOnExistingServerWithExportedExtraIntents====
Tests run: 11, Failures: 0, Errors: 0, Skipped: 0, Time elapsed: 228.534 sec - in org.eclipse.ecf.tests.osgi.services.distribution.generic.GenericRemoteServiceRegisterTest
testRegisterOnExistingServerWithIdentity(org.eclipse.ecf.tests.osgi.services.distribution.generic.GenericRemoteServiceRegisterTest)  Time elapsed: 21.286 sec
testRegisterOnExistingServerWithMissingExportedExtraIntents(org.eclipse.ecf.tests.osgi.services.distribution.generic.GenericRemoteServiceRegisterTest)  Time elapsed: 20.006 sec
testRegisterOnExistingServerWithIntents(org.eclipse.ecf.tests.osgi.services.distribution.generic.GenericRemoteServiceRegisterTest)  Time elapsed: 21.023 sec
testRegisterOnExistingServerWithMissingIntents(org.eclipse.ecf.tests.osgi.services.distribution.generic.GenericRemoteServiceRegisterTest)  Time elapsed: 20.006 sec
testRegisterOnExistingServerWithMissingExportedIntents(org.eclipse.ecf.tests.osgi.services.distribution.generic.GenericRemoteServiceRegisterTest)  Time elapsed: 20.033 sec
testRegisterOnCreatedServerWithIdentity(org.eclipse.ecf.tests.osgi.services.distribution.generic.GenericRemoteServiceRegisterTest)  Time elapsed: 21.033 sec
testRegisterOnExistingServerWithExportedIntents(org.eclipse.ecf.tests.osgi.services.distribution.generic.GenericRemoteServiceRegisterTest)  Time elapsed: 21.025 sec
testRegisterOnExistingServerWithContainerID(org.eclipse.ecf.tests.osgi.services.distribution.generic.GenericRemoteServiceRegisterTest)  Time elapsed: 21.021 sec
testRegisterOnCreatedServer(org.eclipse.ecf.tests.osgi.services.distribution.generic.GenericRemoteServiceRegisterTest)  Time elapsed: 21.023 sec
testRegisterOnExistingServer(org.eclipse.ecf.tests.osgi.services.distribution.generic.GenericRemoteServiceRegisterTest)  Time elapsed: 21.023 sec
testRegisterOnExistingServerWithExportedExtraIntents(org.eclipse.ecf.tests.osgi.services.distribution.generic.GenericRemoteServiceRegisterTest)  Time elapsed: 21.02 sec
Running org.eclipse.ecf.tests.osgi.services.distribution.generic.GenericTwoRemoteServiceAccessTest
====starting org.eclipse.ecf.tests.osgi.services.distribution.generic.GenericTwoRemoteServiceAccessTest.testProxyWithService1====
====starting org.eclipse.ecf.tests.osgi.services.distribution.generic.GenericTwoRemoteServiceAccessTest.testProxyWithService2====
====starting org.eclipse.ecf.tests.osgi.services.distribution.generic.GenericTwoRemoteServiceAccessTest.testGetRemoteService2Reference====
====starting org.eclipse.ecf.tests.osgi.services.distribution.generic.GenericTwoRemoteServiceAccessTest.testGetRemoteService1Reference====
Tests run: 4, Failures: 4, Errors: 0, Skipped: 0, Time elapsed: 124.975 sec <<< FAILURE! - in org.eclipse.ecf.tests.osgi.services.distribution.generic.GenericTwoRemoteServiceAccessTest
testProxyWithService1(org.eclipse.ecf.tests.osgi.services.distribution.generic.GenericTwoRemoteServiceAccessTest)  Time elapsed: 31.264 sec  <<< FAILURE!
junit.framework.AssertionFailedError: No valid service reference found. Bundle state of the ECF distribution bundle is ACTIVE
	at junit.framework.Assert.fail(Assert.java:57)
	at junit.framework.TestCase.fail(TestCase.java:227)
	at org.eclipse.ecf.tests.osgi.services.distribution.AbstractDistributionTest.assertReferencesValid(AbstractDistributionTest.java:218)
	at org.eclipse.ecf.tests.osgi.services.distribution.AbstractDistributionTest.assertReferencesValidAndFirstHasCorrectType(AbstractDistributionTest.java:201)
	at org.eclipse.ecf.tests.osgi.services.distribution.AbstractTwoRemoteServiceAccessTest.testProxyWithService1(AbstractTwoRemoteServiceAccessTest.java:124)
	at sun.reflect.NativeMethodAccessorImpl.invoke0(Native Method)
	at sun.reflect.NativeMethodAccessorImpl.invoke(NativeMethodAccessorImpl.java:62)
	at sun.reflect.DelegatingMethodAccessorImpl.invoke(DelegatingMethodAccessorImpl.java:43)
	at java.lang.reflect.Method.invoke(Method.java:498)
	at junit.framework.TestCase.runTest(TestCase.java:176)
	at junit.framework.TestCase.runBare(TestCase.java:141)
	at junit.framework.TestResult$1.protect(TestResult.java:122)
	at junit.framework.TestResult.runProtected(TestResult.java:142)
	at junit.framework.TestResult.run(TestResult.java:125)
	at junit.framework.TestCase.run(TestCase.java:129)
	at junit.framework.TestSuite.runTest(TestSuite.java:252)
	at junit.framework.TestSuite.run(TestSuite.java:247)
	at org.junit.internal.runners.JUnit38ClassRunner.run(JUnit38ClassRunner.java:86)
	at org.apache.maven.surefire.junit4.JUnit4Provider.execute(JUnit4Provider.java:264)
	at org.apache.maven.surefire.junit4.JUnit4Provider.executeTestSet(JUnit4Provider.java:153)
	at org.apache.maven.surefire.junit4.JUnit4Provider.invoke(JUnit4Provider.java:124)
	at sun.reflect.NativeMethodAccessorImpl.invoke0(Native Method)
	at sun.reflect.NativeMethodAccessorImpl.invoke(NativeMethodAccessorImpl.java:62)
	at sun.reflect.DelegatingMethodAccessorImpl.invoke(DelegatingMethodAccessorImpl.java:43)
	at java.lang.reflect.Method.invoke(Method.java:498)
	at org.apache.maven.surefire.util.ReflectionUtils.invokeMethodWithArray2(ReflectionUtils.java:208)
	at org.apache.maven.surefire.booter.ProviderFactory$ProviderProxy.invoke(ProviderFactory.java:156)
	at org.apache.maven.surefire.booter.ProviderFactory.invokeProvider(ProviderFactory.java:82)
	at org.eclipse.tycho.surefire.osgibooter.OsgiSurefireBooter.run(OsgiSurefireBooter.java:95)
	at org.eclipse.tycho.surefire.osgibooter.HeadlessTestApplication.run(HeadlessTestApplication.java:21)
	at sun.reflect.NativeMethodAccessorImpl.invoke0(Native Method)
	at sun.reflect.NativeMethodAccessorImpl.invoke(NativeMethodAccessorImpl.java:62)
	at sun.reflect.DelegatingMethodAccessorImpl.invoke(DelegatingMethodAccessorImpl.java:43)
	at java.lang.reflect.Method.invoke(Method.java:498)
	at org.eclipse.equinox.internal.app.EclipseAppContainer.callMethodWithException(EclipseAppContainer.java:587)
	at org.eclipse.equinox.internal.app.EclipseAppHandle.run(EclipseAppHandle.java:198)
	at org.eclipse.core.runtime.internal.adaptor.EclipseAppLauncher.runApplication(EclipseAppLauncher.java:134)
	at org.eclipse.core.runtime.internal.adaptor.EclipseAppLauncher.start(EclipseAppLauncher.java:104)
	at org.eclipse.core.runtime.adaptor.EclipseStarter.run(EclipseStarter.java:380)
	at org.eclipse.core.runtime.adaptor.EclipseStarter.run(EclipseStarter.java:235)
	at sun.reflect.NativeMethodAccessorImpl.invoke0(Native Method)
	at sun.reflect.NativeMethodAccessorImpl.invoke(NativeMethodAccessorImpl.java:62)
	at sun.reflect.DelegatingMethodAccessorImpl.invoke(DelegatingMethodAccessorImpl.java:43)
	at java.lang.reflect.Method.invoke(Method.java:498)
	at org.eclipse.equinox.launcher.Main.invokeFramework(Main.java:669)
	at org.eclipse.equinox.launcher.Main.basicRun(Main.java:608)
	at org.eclipse.equinox.launcher.Main.run(Main.java:1515)
	at org.eclipse.equinox.launcher.Main.main(Main.java:1488)

testProxyWithService2(org.eclipse.ecf.tests.osgi.services.distribution.generic.GenericTwoRemoteServiceAccessTest)  Time elapsed: 31.232 sec  <<< FAILURE!
junit.framework.AssertionFailedError: No valid service reference found. Bundle state of the ECF distribution bundle is ACTIVE
	at junit.framework.Assert.fail(Assert.java:57)
	at junit.framework.TestCase.fail(TestCase.java:227)
	at org.eclipse.ecf.tests.osgi.services.distribution.AbstractDistributionTest.assertReferencesValid(AbstractDistributionTest.java:218)
	at org.eclipse.ecf.tests.osgi.services.distribution.AbstractDistributionTest.assertReferencesValidAndFirstHasCorrectType(AbstractDistributionTest.java:201)
	at org.eclipse.ecf.tests.osgi.services.distribution.AbstractTwoRemoteServiceAccessTest.testProxyWithService2(AbstractTwoRemoteServiceAccessTest.java:145)
	at sun.reflect.NativeMethodAccessorImpl.invoke0(Native Method)
	at sun.reflect.NativeMethodAccessorImpl.invoke(NativeMethodAccessorImpl.java:62)
	at sun.reflect.DelegatingMethodAccessorImpl.invoke(DelegatingMethodAccessorImpl.java:43)
	at java.lang.reflect.Method.invoke(Method.java:498)
	at junit.framework.TestCase.runTest(TestCase.java:176)
	at junit.framework.TestCase.runBare(TestCase.java:141)
	at junit.framework.TestResult$1.protect(TestResult.java:122)
	at junit.framework.TestResult.runProtected(TestResult.java:142)
	at junit.framework.TestResult.run(TestResult.java:125)
	at junit.framework.TestCase.run(TestCase.java:129)
	at junit.framework.TestSuite.runTest(TestSuite.java:252)
	at junit.framework.TestSuite.run(TestSuite.java:247)
	at org.junit.internal.runners.JUnit38ClassRunner.run(JUnit38ClassRunner.java:86)
	at org.apache.maven.surefire.junit4.JUnit4Provider.execute(JUnit4Provider.java:264)
	at org.apache.maven.surefire.junit4.JUnit4Provider.executeTestSet(JUnit4Provider.java:153)
	at org.apache.maven.surefire.junit4.JUnit4Provider.invoke(JUnit4Provider.java:124)
	at sun.reflect.NativeMethodAccessorImpl.invoke0(Native Method)
	at sun.reflect.NativeMethodAccessorImpl.invoke(NativeMethodAccessorImpl.java:62)
	at sun.reflect.DelegatingMethodAccessorImpl.invoke(DelegatingMethodAccessorImpl.java:43)
	at java.lang.reflect.Method.invoke(Method.java:498)
	at org.apache.maven.surefire.util.ReflectionUtils.invokeMethodWithArray2(ReflectionUtils.java:208)
	at org.apache.maven.surefire.booter.ProviderFactory$ProviderProxy.invoke(ProviderFactory.java:156)
	at org.apache.maven.surefire.booter.ProviderFactory.invokeProvider(ProviderFactory.java:82)
	at org.eclipse.tycho.surefire.osgibooter.OsgiSurefireBooter.run(OsgiSurefireBooter.java:95)
	at org.eclipse.tycho.surefire.osgibooter.HeadlessTestApplication.run(HeadlessTestApplication.java:21)
	at sun.reflect.NativeMethodAccessorImpl.invoke0(Native Method)
	at sun.reflect.NativeMethodAccessorImpl.invoke(NativeMethodAccessorImpl.java:62)
	at sun.reflect.DelegatingMethodAccessorImpl.invoke(DelegatingMethodAccessorImpl.java:43)
	at java.lang.reflect.Method.invoke(Method.java:498)
	at org.eclipse.equinox.internal.app.EclipseAppContainer.callMethodWithException(EclipseAppContainer.java:587)
	at org.eclipse.equinox.internal.app.EclipseAppHandle.run(EclipseAppHandle.java:198)
	at org.eclipse.core.runtime.internal.adaptor.EclipseAppLauncher.runApplication(EclipseAppLauncher.java:134)
	at org.eclipse.core.runtime.internal.adaptor.EclipseAppLauncher.start(EclipseAppLauncher.java:104)
	at org.eclipse.core.runtime.adaptor.EclipseStarter.run(EclipseStarter.java:380)
	at org.eclipse.core.runtime.adaptor.EclipseStarter.run(EclipseStarter.java:235)
	at sun.reflect.NativeMethodAccessorImpl.invoke0(Native Method)
	at sun.reflect.NativeMethodAccessorImpl.invoke(NativeMethodAccessorImpl.java:62)
	at sun.reflect.DelegatingMethodAccessorImpl.invoke(DelegatingMethodAccessorImpl.java:43)
	at java.lang.reflect.Method.invoke(Method.java:498)
	at org.eclipse.equinox.launcher.Main.invokeFramework(Main.java:669)
	at org.eclipse.equinox.launcher.Main.basicRun(Main.java:608)
	at org.eclipse.equinox.launcher.Main.run(Main.java:1515)
	at org.eclipse.equinox.launcher.Main.main(Main.java:1488)

testGetRemoteService2Reference(org.eclipse.ecf.tests.osgi.services.distribution.generic.GenericTwoRemoteServiceAccessTest)  Time elapsed: 31.238 sec  <<< FAILURE!
junit.framework.AssertionFailedError: No valid service reference found. Bundle state of the ECF distribution bundle is ACTIVE
	at junit.framework.Assert.fail(Assert.java:57)
	at junit.framework.TestCase.fail(TestCase.java:227)
	at org.eclipse.ecf.tests.osgi.services.distribution.AbstractDistributionTest.assertReferencesValid(AbstractDistributionTest.java:218)
	at org.eclipse.ecf.tests.osgi.services.distribution.AbstractDistributionTest.assertReferencesValidAndFirstHasCorrectType(AbstractDistributionTest.java:201)
	at org.eclipse.ecf.tests.osgi.services.distribution.AbstractTwoRemoteServiceAccessTest.testGetRemoteService2Reference(AbstractTwoRemoteServiceAccessTest.java:110)
	at sun.reflect.NativeMethodAccessorImpl.invoke0(Native Method)
	at sun.reflect.NativeMethodAccessorImpl.invoke(NativeMethodAccessorImpl.java:62)
	at sun.reflect.DelegatingMethodAccessorImpl.invoke(DelegatingMethodAccessorImpl.java:43)
	at java.lang.reflect.Method.invoke(Method.java:498)
	at junit.framework.TestCase.runTest(TestCase.java:176)
	at junit.framework.TestCase.runBare(TestCase.java:141)
	at junit.framework.TestResult$1.protect(TestResult.java:122)
	at junit.framework.TestResult.runProtected(TestResult.java:142)
	at junit.framework.TestResult.run(TestResult.java:125)
	at junit.framework.TestCase.run(TestCase.java:129)
	at junit.framework.TestSuite.runTest(TestSuite.java:252)
	at junit.framework.TestSuite.run(TestSuite.java:247)
	at org.junit.internal.runners.JUnit38ClassRunner.run(JUnit38ClassRunner.java:86)
	at org.apache.maven.surefire.junit4.JUnit4Provider.execute(JUnit4Provider.java:264)
	at org.apache.maven.surefire.junit4.JUnit4Provider.executeTestSet(JUnit4Provider.java:153)
	at org.apache.maven.surefire.junit4.JUnit4Provider.invoke(JUnit4Provider.java:124)
	at sun.reflect.NativeMethodAccessorImpl.invoke0(Native Method)
	at sun.reflect.NativeMethodAccessorImpl.invoke(NativeMethodAccessorImpl.java:62)
	at sun.reflect.DelegatingMethodAccessorImpl.invoke(DelegatingMethodAccessorImpl.java:43)
	at java.lang.reflect.Method.invoke(Method.java:498)
	at org.apache.maven.surefire.util.ReflectionUtils.invokeMethodWithArray2(ReflectionUtils.java:208)
	at org.apache.maven.surefire.booter.ProviderFactory$ProviderProxy.invoke(ProviderFactory.java:156)
	at org.apache.maven.surefire.booter.ProviderFactory.invokeProvider(ProviderFactory.java:82)
	at org.eclipse.tycho.surefire.osgibooter.OsgiSurefireBooter.run(OsgiSurefireBooter.java:95)
	at org.eclipse.tycho.surefire.osgibooter.HeadlessTestApplication.run(HeadlessTestApplication.java:21)
	at sun.reflect.NativeMethodAccessorImpl.invoke0(Native Method)
	at sun.reflect.NativeMethodAccessorImpl.invoke(NativeMethodAccessorImpl.java:62)
	at sun.reflect.DelegatingMethodAccessorImpl.invoke(DelegatingMethodAccessorImpl.java:43)
	at java.lang.reflect.Method.invoke(Method.java:498)
	at org.eclipse.equinox.internal.app.EclipseAppContainer.callMethodWithException(EclipseAppContainer.java:587)
	at org.eclipse.equinox.internal.app.EclipseAppHandle.run(EclipseAppHandle.java:198)
	at org.eclipse.core.runtime.internal.adaptor.EclipseAppLauncher.runApplication(EclipseAppLauncher.java:134)
	at org.eclipse.core.runtime.internal.adaptor.EclipseAppLauncher.start(EclipseAppLauncher.java:104)
	at org.eclipse.core.runtime.adaptor.EclipseStarter.run(EclipseStarter.java:380)
	at org.eclipse.core.runtime.adaptor.EclipseStarter.run(EclipseStarter.java:235)
	at sun.reflect.NativeMethodAccessorImpl.invoke0(Native Method)
	at sun.reflect.NativeMethodAccessorImpl.invoke(NativeMethodAccessorImpl.java:62)
	at sun.reflect.DelegatingMethodAccessorImpl.invoke(DelegatingMethodAccessorImpl.java:43)
	at java.lang.reflect.Method.invoke(Method.java:498)
	at org.eclipse.equinox.launcher.Main.invokeFramework(Main.java:669)
	at org.eclipse.equinox.launcher.Main.basicRun(Main.java:608)
	at org.eclipse.equinox.launcher.Main.run(Main.java:1515)
	at org.eclipse.equinox.launcher.Main.main(Main.java:1488)

testGetRemoteService1Reference(org.eclipse.ecf.tests.osgi.services.distribution.generic.GenericTwoRemoteServiceAccessTest)  Time elapsed: 31.232 sec  <<< FAILURE!
junit.framework.AssertionFailedError: No valid service reference found. Bundle state of the ECF distribution bundle is ACTIVE
	at junit.framework.Assert.fail(Assert.java:57)
	at junit.framework.TestCase.fail(TestCase.java:227)
	at org.eclipse.ecf.tests.osgi.services.distribution.AbstractDistributionTest.assertReferencesValid(AbstractDistributionTest.java:218)
	at org.eclipse.ecf.tests.osgi.services.distribution.AbstractDistributionTest.assertReferencesValidAndFirstHasCorrectType(AbstractDistributionTest.java:201)
	at org.eclipse.ecf.tests.osgi.services.distribution.AbstractTwoRemoteServiceAccessTest.testGetRemoteService1Reference(AbstractTwoRemoteServiceAccessTest.java:97)
	at sun.reflect.NativeMethodAccessorImpl.invoke0(Native Method)
	at sun.reflect.NativeMethodAccessorImpl.invoke(NativeMethodAccessorImpl.java:62)
	at sun.reflect.DelegatingMethodAccessorImpl.invoke(DelegatingMethodAccessorImpl.java:43)
	at java.lang.reflect.Method.invoke(Method.java:498)
	at junit.framework.TestCase.runTest(TestCase.java:176)
	at junit.framework.TestCase.runBare(TestCase.java:141)
	at junit.framework.TestResult$1.protect(TestResult.java:122)
	at junit.framework.TestResult.runProtected(TestResult.java:142)
	at junit.framework.TestResult.run(TestResult.java:125)
	at junit.framework.TestCase.run(TestCase.java:129)
	at junit.framework.TestSuite.runTest(TestSuite.java:252)
	at junit.framework.TestSuite.run(TestSuite.java:247)
	at org.junit.internal.runners.JUnit38ClassRunner.run(JUnit38ClassRunner.java:86)
	at org.apache.maven.surefire.junit4.JUnit4Provider.execute(JUnit4Provider.java:264)
	at org.apache.maven.surefire.junit4.JUnit4Provider.executeTestSet(JUnit4Provider.java:153)
	at org.apache.maven.surefire.junit4.JUnit4Provider.invoke(JUnit4Provider.java:124)
	at sun.reflect.NativeMethodAccessorImpl.invoke0(Native Method)
	at sun.reflect.NativeMethodAccessorImpl.invoke(NativeMethodAccessorImpl.java:62)
	at sun.reflect.DelegatingMethodAccessorImpl.invoke(DelegatingMethodAccessorImpl.java:43)
	at java.lang.reflect.Method.invoke(Method.java:498)
	at org.apache.maven.surefire.util.ReflectionUtils.invokeMethodWithArray2(ReflectionUtils.java:208)
	at org.apache.maven.surefire.booter.ProviderFactory$ProviderProxy.invoke(ProviderFactory.java:156)
	at org.apache.maven.surefire.booter.ProviderFactory.invokeProvider(ProviderFactory.java:82)
	at org.eclipse.tycho.surefire.osgibooter.OsgiSurefireBooter.run(OsgiSurefireBooter.java:95)
	at org.eclipse.tycho.surefire.osgibooter.HeadlessTestApplication.run(HeadlessTestApplication.java:21)
	at sun.reflect.NativeMethodAccessorImpl.invoke0(Native Method)
	at sun.reflect.NativeMethodAccessorImpl.invoke(NativeMethodAccessorImpl.java:62)
	at sun.reflect.DelegatingMethodAccessorImpl.invoke(DelegatingMethodAccessorImpl.java:43)
	at java.lang.reflect.Method.invoke(Method.java:498)
	at org.eclipse.equinox.internal.app.EclipseAppContainer.callMethodWithException(EclipseAppContainer.java:587)
	at org.eclipse.equinox.internal.app.EclipseAppHandle.run(EclipseAppHandle.java:198)
	at org.eclipse.core.runtime.internal.adaptor.EclipseAppLauncher.runApplication(EclipseAppLauncher.java:134)
	at org.eclipse.core.runtime.internal.adaptor.EclipseAppLauncher.start(EclipseAppLauncher.java:104)
	at org.eclipse.core.runtime.adaptor.EclipseStarter.run(EclipseStarter.java:380)
	at org.eclipse.core.runtime.adaptor.EclipseStarter.run(EclipseStarter.java:235)
	at sun.reflect.NativeMethodAccessorImpl.invoke0(Native Method)
	at sun.reflect.NativeMethodAccessorImpl.invoke(NativeMethodAccessorImpl.java:62)
	at sun.reflect.DelegatingMethodAccessorImpl.invoke(DelegatingMethodAccessorImpl.java:43)
	at java.lang.reflect.Method.invoke(Method.java:498)
	at org.eclipse.equinox.launcher.Main.invokeFramework(Main.java:669)
	at org.eclipse.equinox.launcher.Main.basicRun(Main.java:608)
	at org.eclipse.equinox.launcher.Main.run(Main.java:1515)
	at org.eclipse.equinox.launcher.Main.main(Main.java:1488)

Running org.eclipse.ecf.tests.osgi.services.distribution.generic.GenericRemoteServiceAccessTest
====starting org.eclipse.ecf.tests.osgi.services.distribution.generic.GenericRemoteServiceAccessTest.testProxy====
====starting org.eclipse.ecf.tests.osgi.services.distribution.generic.GenericRemoteServiceAccessTest.testCallAsync====
====starting org.eclipse.ecf.tests.osgi.services.distribution.generic.GenericRemoteServiceAccessTest.testFireAsync====
====starting org.eclipse.ecf.tests.osgi.services.distribution.generic.GenericRemoteServiceAccessTest.testCallFuture====
====starting org.eclipse.ecf.tests.osgi.services.distribution.generic.GenericRemoteServiceAccessTest.testCallSync====
====starting org.eclipse.ecf.tests.osgi.services.distribution.generic.GenericRemoteServiceAccessTest.testCallSyncFromProxy====
====starting org.eclipse.ecf.tests.osgi.services.distribution.generic.GenericRemoteServiceAccessTest.testGetRemoteServiceReference====
====starting org.eclipse.ecf.tests.osgi.services.distribution.generic.GenericRemoteServiceAccessTest.testGetRemoteServiceReferenceWithExtraProperties====
Tests run: 8, Failures: 8, Errors: 0, Skipped: 0, Time elapsed: 329.875 sec <<< FAILURE! - in org.eclipse.ecf.tests.osgi.services.distribution.generic.GenericRemoteServiceAccessTest
testProxy(org.eclipse.ecf.tests.osgi.services.distribution.generic.GenericRemoteServiceAccessTest)  Time elapsed: 41.23 sec  <<< FAILURE!
junit.framework.AssertionFailedError: No valid service reference found. Bundle state of the ECF distribution bundle is ACTIVE
	at junit.framework.Assert.fail(Assert.java:57)
	at junit.framework.TestCase.fail(TestCase.java:227)
	at org.eclipse.ecf.tests.osgi.services.distribution.AbstractDistributionTest.assertReferencesValid(AbstractDistributionTest.java:218)
	at org.eclipse.ecf.tests.osgi.services.distribution.AbstractDistributionTest.assertReferencesValidAndFirstHasCorrectType(AbstractDistributionTest.java:201)
	at org.eclipse.ecf.tests.osgi.services.distribution.AbstractRemoteServiceAccessTest.testProxy(AbstractRemoteServiceAccessTest.java:140)
	at sun.reflect.NativeMethodAccessorImpl.invoke0(Native Method)
	at sun.reflect.NativeMethodAccessorImpl.invoke(NativeMethodAccessorImpl.java:62)
	at sun.reflect.DelegatingMethodAccessorImpl.invoke(DelegatingMethodAccessorImpl.java:43)
	at java.lang.reflect.Method.invoke(Method.java:498)
	at junit.framework.TestCase.runTest(TestCase.java:176)
	at junit.framework.TestCase.runBare(TestCase.java:141)
	at junit.framework.TestResult$1.protect(TestResult.java:122)
	at junit.framework.TestResult.runProtected(TestResult.java:142)
	at junit.framework.TestResult.run(TestResult.java:125)
	at junit.framework.TestCase.run(TestCase.java:129)
	at junit.framework.TestSuite.runTest(TestSuite.java:252)
	at junit.framework.TestSuite.run(TestSuite.java:247)
	at org.junit.internal.runners.JUnit38ClassRunner.run(JUnit38ClassRunner.java:86)
	at org.apache.maven.surefire.junit4.JUnit4Provider.execute(JUnit4Provider.java:264)
	at org.apache.maven.surefire.junit4.JUnit4Provider.executeTestSet(JUnit4Provider.java:153)
	at org.apache.maven.surefire.junit4.JUnit4Provider.invoke(JUnit4Provider.java:124)
	at sun.reflect.NativeMethodAccessorImpl.invoke0(Native Method)
	at sun.reflect.NativeMethodAccessorImpl.invoke(NativeMethodAccessorImpl.java:62)
	at sun.reflect.DelegatingMethodAccessorImpl.invoke(DelegatingMethodAccessorImpl.java:43)
	at java.lang.reflect.Method.invoke(Method.java:498)
	at org.apache.maven.surefire.util.ReflectionUtils.invokeMethodWithArray2(ReflectionUtils.java:208)
	at org.apache.maven.surefire.booter.ProviderFactory$ProviderProxy.invoke(ProviderFactory.java:156)
	at org.apache.maven.surefire.booter.ProviderFactory.invokeProvider(ProviderFactory.java:82)
	at org.eclipse.tycho.surefire.osgibooter.OsgiSurefireBooter.run(OsgiSurefireBooter.java:95)
	at org.eclipse.tycho.surefire.osgibooter.HeadlessTestApplication.run(HeadlessTestApplication.java:21)
	at sun.reflect.NativeMethodAccessorImpl.invoke0(Native Method)
	at sun.reflect.NativeMethodAccessorImpl.invoke(NativeMethodAccessorImpl.java:62)
	at sun.reflect.DelegatingMethodAccessorImpl.invoke(DelegatingMethodAccessorImpl.java:43)
	at java.lang.reflect.Method.invoke(Method.java:498)
	at org.eclipse.equinox.internal.app.EclipseAppContainer.callMethodWithException(EclipseAppContainer.java:587)
	at org.eclipse.equinox.internal.app.EclipseAppHandle.run(EclipseAppHandle.java:198)
	at org.eclipse.core.runtime.internal.adaptor.EclipseAppLauncher.runApplication(EclipseAppLauncher.java:134)
	at org.eclipse.core.runtime.internal.adaptor.EclipseAppLauncher.start(EclipseAppLauncher.java:104)
	at org.eclipse.core.runtime.adaptor.EclipseStarter.run(EclipseStarter.java:380)
	at org.eclipse.core.runtime.adaptor.EclipseStarter.run(EclipseStarter.java:235)
	at sun.reflect.NativeMethodAccessorImpl.invoke0(Native Method)
	at sun.reflect.NativeMethodAccessorImpl.invoke(NativeMethodAccessorImpl.java:62)
	at sun.reflect.DelegatingMethodAccessorImpl.invoke(DelegatingMethodAccessorImpl.java:43)
	at java.lang.reflect.Method.invoke(Method.java:498)
	at org.eclipse.equinox.launcher.Main.invokeFramework(Main.java:669)
	at org.eclipse.equinox.launcher.Main.basicRun(Main.java:608)
	at org.eclipse.equinox.launcher.Main.run(Main.java:1515)
	at org.eclipse.equinox.launcher.Main.main(Main.java:1488)

testCallAsync(org.eclipse.ecf.tests.osgi.services.distribution.generic.GenericRemoteServiceAccessTest)  Time elapsed: 41.229 sec  <<< FAILURE!
junit.framework.AssertionFailedError: No valid service reference found. Bundle state of the ECF distribution bundle is ACTIVE
	at junit.framework.Assert.fail(Assert.java:57)
	at junit.framework.TestCase.fail(TestCase.java:227)
	at org.eclipse.ecf.tests.osgi.services.distribution.AbstractDistributionTest.assertReferencesValid(AbstractDistributionTest.java:218)
	at org.eclipse.ecf.tests.osgi.services.distribution.AbstractRemoteServiceAccessTest.testCallAsync(AbstractRemoteServiceAccessTest.java:203)
	at sun.reflect.NativeMethodAccessorImpl.invoke0(Native Method)
	at sun.reflect.NativeMethodAccessorImpl.invoke(NativeMethodAccessorImpl.java:62)
	at sun.reflect.DelegatingMethodAccessorImpl.invoke(DelegatingMethodAccessorImpl.java:43)
	at java.lang.reflect.Method.invoke(Method.java:498)
	at junit.framework.TestCase.runTest(TestCase.java:176)
	at junit.framework.TestCase.runBare(TestCase.java:141)
	at junit.framework.TestResult$1.protect(TestResult.java:122)
	at junit.framework.TestResult.runProtected(TestResult.java:142)
	at junit.framework.TestResult.run(TestResult.java:125)
	at junit.framework.TestCase.run(TestCase.java:129)
	at junit.framework.TestSuite.runTest(TestSuite.java:252)
	at junit.framework.TestSuite.run(TestSuite.java:247)
	at org.junit.internal.runners.JUnit38ClassRunner.run(JUnit38ClassRunner.java:86)
	at org.apache.maven.surefire.junit4.JUnit4Provider.execute(JUnit4Provider.java:264)
	at org.apache.maven.surefire.junit4.JUnit4Provider.executeTestSet(JUnit4Provider.java:153)
	at org.apache.maven.surefire.junit4.JUnit4Provider.invoke(JUnit4Provider.java:124)
	at sun.reflect.NativeMethodAccessorImpl.invoke0(Native Method)
	at sun.reflect.NativeMethodAccessorImpl.invoke(NativeMethodAccessorImpl.java:62)
	at sun.reflect.DelegatingMethodAccessorImpl.invoke(DelegatingMethodAccessorImpl.java:43)
	at java.lang.reflect.Method.invoke(Method.java:498)
	at org.apache.maven.surefire.util.ReflectionUtils.invokeMethodWithArray2(ReflectionUtils.java:208)
	at org.apache.maven.surefire.booter.ProviderFactory$ProviderProxy.invoke(ProviderFactory.java:156)
	at org.apache.maven.surefire.booter.ProviderFactory.invokeProvider(ProviderFactory.java:82)
	at org.eclipse.tycho.surefire.osgibooter.OsgiSurefireBooter.run(OsgiSurefireBooter.java:95)
	at org.eclipse.tycho.surefire.osgibooter.HeadlessTestApplication.run(HeadlessTestApplication.java:21)
	at sun.reflect.NativeMethodAccessorImpl.invoke0(Native Method)
	at sun.reflect.NativeMethodAccessorImpl.invoke(NativeMethodAccessorImpl.java:62)
	at sun.reflect.DelegatingMethodAccessorImpl.invoke(DelegatingMethodAccessorImpl.java:43)
	at java.lang.reflect.Method.invoke(Method.java:498)
	at org.eclipse.equinox.internal.app.EclipseAppContainer.callMethodWithException(EclipseAppContainer.java:587)
	at org.eclipse.equinox.internal.app.EclipseAppHandle.run(EclipseAppHandle.java:198)
	at org.eclipse.core.runtime.internal.adaptor.EclipseAppLauncher.runApplication(EclipseAppLauncher.java:134)
	at org.eclipse.core.runtime.internal.adaptor.EclipseAppLauncher.start(EclipseAppLauncher.java:104)
	at org.eclipse.core.runtime.adaptor.EclipseStarter.run(EclipseStarter.java:380)
	at org.eclipse.core.runtime.adaptor.EclipseStarter.run(EclipseStarter.java:235)
	at sun.reflect.NativeMethodAccessorImpl.invoke0(Native Method)
	at sun.reflect.NativeMethodAccessorImpl.invoke(NativeMethodAccessorImpl.java:62)
	at sun.reflect.DelegatingMethodAccessorImpl.invoke(DelegatingMethodAccessorImpl.java:43)
	at java.lang.reflect.Method.invoke(Method.java:498)
	at org.eclipse.equinox.launcher.Main.invokeFramework(Main.java:669)
	at org.eclipse.equinox.launcher.Main.basicRun(Main.java:608)
	at org.eclipse.equinox.launcher.Main.run(Main.java:1515)
	at org.eclipse.equinox.launcher.Main.main(Main.java:1488)

testFireAsync(org.eclipse.ecf.tests.osgi.services.distribution.generic.GenericRemoteServiceAccessTest)  Time elapsed: 41.233 sec  <<< FAILURE!
junit.framework.AssertionFailedError: No valid service reference found. Bundle state of the ECF distribution bundle is ACTIVE
	at junit.framework.Assert.fail(Assert.java:57)
	at junit.framework.TestCase.fail(TestCase.java:227)
	at org.eclipse.ecf.tests.osgi.services.distribution.AbstractDistributionTest.assertReferencesValid(AbstractDistributionTest.java:218)
	at org.eclipse.ecf.tests.osgi.services.distribution.AbstractRemoteServiceAccessTest.testFireAsync(AbstractRemoteServiceAccessTest.java:255)
	at sun.reflect.NativeMethodAccessorImpl.invoke0(Native Method)
	at sun.reflect.NativeMethodAccessorImpl.invoke(NativeMethodAccessorImpl.java:62)
	at sun.reflect.DelegatingMethodAccessorImpl.invoke(DelegatingMethodAccessorImpl.java:43)
	at java.lang.reflect.Method.invoke(Method.java:498)
	at junit.framework.TestCase.runTest(TestCase.java:176)
	at junit.framework.TestCase.runBare(TestCase.java:141)
	at junit.framework.TestResult$1.protect(TestResult.java:122)
	at junit.framework.TestResult.runProtected(TestResult.java:142)
	at junit.framework.TestResult.run(TestResult.java:125)
	at junit.framework.TestCase.run(TestCase.java:129)
	at junit.framework.TestSuite.runTest(TestSuite.java:252)
	at junit.framework.TestSuite.run(TestSuite.java:247)
	at org.junit.internal.runners.JUnit38ClassRunner.run(JUnit38ClassRunner.java:86)
	at org.apache.maven.surefire.junit4.JUnit4Provider.execute(JUnit4Provider.java:264)
	at org.apache.maven.surefire.junit4.JUnit4Provider.executeTestSet(JUnit4Provider.java:153)
	at org.apache.maven.surefire.junit4.JUnit4Provider.invoke(JUnit4Provider.java:124)
	at sun.reflect.NativeMethodAccessorImpl.invoke0(Native Method)
	at sun.reflect.NativeMethodAccessorImpl.invoke(NativeMethodAccessorImpl.java:62)
	at sun.reflect.DelegatingMethodAccessorImpl.invoke(DelegatingMethodAccessorImpl.java:43)
	at java.lang.reflect.Method.invoke(Method.java:498)
	at org.apache.maven.surefire.util.ReflectionUtils.invokeMethodWithArray2(ReflectionUtils.java:208)
	at org.apache.maven.surefire.booter.ProviderFactory$ProviderProxy.invoke(ProviderFactory.java:156)
	at org.apache.maven.surefire.booter.ProviderFactory.invokeProvider(ProviderFactory.java:82)
	at org.eclipse.tycho.surefire.osgibooter.OsgiSurefireBooter.run(OsgiSurefireBooter.java:95)
	at org.eclipse.tycho.surefire.osgibooter.HeadlessTestApplication.run(HeadlessTestApplication.java:21)
	at sun.reflect.NativeMethodAccessorImpl.invoke0(Native Method)
	at sun.reflect.NativeMethodAccessorImpl.invoke(NativeMethodAccessorImpl.java:62)
	at sun.reflect.DelegatingMethodAccessorImpl.invoke(DelegatingMethodAccessorImpl.java:43)
	at java.lang.reflect.Method.invoke(Method.java:498)
	at org.eclipse.equinox.internal.app.EclipseAppContainer.callMethodWithException(EclipseAppContainer.java:587)
	at org.eclipse.equinox.internal.app.EclipseAppHandle.run(EclipseAppHandle.java:198)
	at org.eclipse.core.runtime.internal.adaptor.EclipseAppLauncher.runApplication(EclipseAppLauncher.java:134)
	at org.eclipse.core.runtime.internal.adaptor.EclipseAppLauncher.start(EclipseAppLauncher.java:104)
	at org.eclipse.core.runtime.adaptor.EclipseStarter.run(EclipseStarter.java:380)
	at org.eclipse.core.runtime.adaptor.EclipseStarter.run(EclipseStarter.java:235)
	at sun.reflect.NativeMethodAccessorImpl.invoke0(Native Method)
	at sun.reflect.NativeMethodAccessorImpl.invoke(NativeMethodAccessorImpl.java:62)
	at sun.reflect.DelegatingMethodAccessorImpl.invoke(DelegatingMethodAccessorImpl.java:43)
	at java.lang.reflect.Method.invoke(Method.java:498)
	at org.eclipse.equinox.launcher.Main.invokeFramework(Main.java:669)
	at org.eclipse.equinox.launcher.Main.basicRun(Main.java:608)
	at org.eclipse.equinox.launcher.Main.run(Main.java:1515)
	at org.eclipse.equinox.launcher.Main.main(Main.java:1488)

testCallFuture(org.eclipse.ecf.tests.osgi.services.distribution.generic.GenericRemoteServiceAccessTest)  Time elapsed: 41.236 sec  <<< FAILURE!
junit.framework.AssertionFailedError: No valid service reference found. Bundle state of the ECF distribution bundle is ACTIVE
	at junit.framework.Assert.fail(Assert.java:57)
	at junit.framework.TestCase.fail(TestCase.java:227)
	at org.eclipse.ecf.tests.osgi.services.distribution.AbstractDistributionTest.assertReferencesValid(AbstractDistributionTest.java:218)
	at org.eclipse.ecf.tests.osgi.services.distribution.AbstractRemoteServiceAccessTest.testCallFuture(AbstractRemoteServiceAccessTest.java:233)
	at sun.reflect.NativeMethodAccessorImpl.invoke0(Native Method)
	at sun.reflect.NativeMethodAccessorImpl.invoke(NativeMethodAccessorImpl.java:62)
	at sun.reflect.DelegatingMethodAccessorImpl.invoke(DelegatingMethodAccessorImpl.java:43)
	at java.lang.reflect.Method.invoke(Method.java:498)
	at junit.framework.TestCase.runTest(TestCase.java:176)
	at junit.framework.TestCase.runBare(TestCase.java:141)
	at junit.framework.TestResult$1.protect(TestResult.java:122)
	at junit.framework.TestResult.runProtected(TestResult.java:142)
	at junit.framework.TestResult.run(TestResult.java:125)
	at junit.framework.TestCase.run(TestCase.java:129)
	at junit.framework.TestSuite.runTest(TestSuite.java:252)
	at junit.framework.TestSuite.run(TestSuite.java:247)
	at org.junit.internal.runners.JUnit38ClassRunner.run(JUnit38ClassRunner.java:86)
	at org.apache.maven.surefire.junit4.JUnit4Provider.execute(JUnit4Provider.java:264)
	at org.apache.maven.surefire.junit4.JUnit4Provider.executeTestSet(JUnit4Provider.java:153)
	at org.apache.maven.surefire.junit4.JUnit4Provider.invoke(JUnit4Provider.java:124)
	at sun.reflect.NativeMethodAccessorImpl.invoke0(Native Method)
	at sun.reflect.NativeMethodAccessorImpl.invoke(NativeMethodAccessorImpl.java:62)
	at sun.reflect.DelegatingMethodAccessorImpl.invoke(DelegatingMethodAccessorImpl.java:43)
	at java.lang.reflect.Method.invoke(Method.java:498)
	at org.apache.maven.surefire.util.ReflectionUtils.invokeMethodWithArray2(ReflectionUtils.java:208)
	at org.apache.maven.surefire.booter.ProviderFactory$ProviderProxy.invoke(ProviderFactory.java:156)
	at org.apache.maven.surefire.booter.ProviderFactory.invokeProvider(ProviderFactory.java:82)
	at org.eclipse.tycho.surefire.osgibooter.OsgiSurefireBooter.run(OsgiSurefireBooter.java:95)
	at org.eclipse.tycho.surefire.osgibooter.HeadlessTestApplication.run(HeadlessTestApplication.java:21)
	at sun.reflect.NativeMethodAccessorImpl.invoke0(Native Method)
	at sun.reflect.NativeMethodAccessorImpl.invoke(NativeMethodAccessorImpl.java:62)
	at sun.reflect.DelegatingMethodAccessorImpl.invoke(DelegatingMethodAccessorImpl.java:43)
	at java.lang.reflect.Method.invoke(Method.java:498)
	at org.eclipse.equinox.internal.app.EclipseAppContainer.callMethodWithException(EclipseAppContainer.java:587)
	at org.eclipse.equinox.internal.app.EclipseAppHandle.run(EclipseAppHandle.java:198)
	at org.eclipse.core.runtime.internal.adaptor.EclipseAppLauncher.runApplication(EclipseAppLauncher.java:134)
	at org.eclipse.core.runtime.internal.adaptor.EclipseAppLauncher.start(EclipseAppLauncher.java:104)
	at org.eclipse.core.runtime.adaptor.EclipseStarter.run(EclipseStarter.java:380)
	at org.eclipse.core.runtime.adaptor.EclipseStarter.run(EclipseStarter.java:235)
	at sun.reflect.NativeMethodAccessorImpl.invoke0(Native Method)
	at sun.reflect.NativeMethodAccessorImpl.invoke(NativeMethodAccessorImpl.java:62)
	at sun.reflect.DelegatingMethodAccessorImpl.invoke(DelegatingMethodAccessorImpl.java:43)
	at java.lang.reflect.Method.invoke(Method.java:498)
	at org.eclipse.equinox.launcher.Main.invokeFramework(Main.java:669)
	at org.eclipse.equinox.launcher.Main.basicRun(Main.java:608)
	at org.eclipse.equinox.launcher.Main.run(Main.java:1515)
	at org.eclipse.equinox.launcher.Main.main(Main.java:1488)

testCallSync(org.eclipse.ecf.tests.osgi.services.distribution.generic.GenericRemoteServiceAccessTest)  Time elapsed: 41.236 sec  <<< FAILURE!
junit.framework.AssertionFailedError: No valid service reference found. Bundle state of the ECF distribution bundle is ACTIVE
	at junit.framework.Assert.fail(Assert.java:57)
	at junit.framework.TestCase.fail(TestCase.java:227)
	at org.eclipse.ecf.tests.osgi.services.distribution.AbstractDistributionTest.assertReferencesValid(AbstractDistributionTest.java:218)
	at org.eclipse.ecf.tests.osgi.services.distribution.AbstractDistributionTest.assertReferencesValidAndFirstHasCorrectType(AbstractDistributionTest.java:201)
	at org.eclipse.ecf.tests.osgi.services.distribution.AbstractRemoteServiceAccessTest.testCallSync(AbstractRemoteServiceAccessTest.java:183)
	at sun.reflect.NativeMethodAccessorImpl.invoke0(Native Method)
	at sun.reflect.NativeMethodAccessorImpl.invoke(NativeMethodAccessorImpl.java:62)
	at sun.reflect.DelegatingMethodAccessorImpl.invoke(DelegatingMethodAccessorImpl.java:43)
	at java.lang.reflect.Method.invoke(Method.java:498)
	at junit.framework.TestCase.runTest(TestCase.java:176)
	at junit.framework.TestCase.runBare(TestCase.java:141)
	at junit.framework.TestResult$1.protect(TestResult.java:122)
	at junit.framework.TestResult.runProtected(TestResult.java:142)
	at junit.framework.TestResult.run(TestResult.java:125)
	at junit.framework.TestCase.run(TestCase.java:129)
	at junit.framework.TestSuite.runTest(TestSuite.java:252)
	at junit.framework.TestSuite.run(TestSuite.java:247)
	at org.junit.internal.runners.JUnit38ClassRunner.run(JUnit38ClassRunner.java:86)
	at org.apache.maven.surefire.junit4.JUnit4Provider.execute(JUnit4Provider.java:264)
	at org.apache.maven.surefire.junit4.JUnit4Provider.executeTestSet(JUnit4Provider.java:153)
	at org.apache.maven.surefire.junit4.JUnit4Provider.invoke(JUnit4Provider.java:124)
	at sun.reflect.NativeMethodAccessorImpl.invoke0(Native Method)
	at sun.reflect.NativeMethodAccessorImpl.invoke(NativeMethodAccessorImpl.java:62)
	at sun.reflect.DelegatingMethodAccessorImpl.invoke(DelegatingMethodAccessorImpl.java:43)
	at java.lang.reflect.Method.invoke(Method.java:498)
	at org.apache.maven.surefire.util.ReflectionUtils.invokeMethodWithArray2(ReflectionUtils.java:208)
	at org.apache.maven.surefire.booter.ProviderFactory$ProviderProxy.invoke(ProviderFactory.java:156)
	at org.apache.maven.surefire.booter.ProviderFactory.invokeProvider(ProviderFactory.java:82)
	at org.eclipse.tycho.surefire.osgibooter.OsgiSurefireBooter.run(OsgiSurefireBooter.java:95)
	at org.eclipse.tycho.surefire.osgibooter.HeadlessTestApplication.run(HeadlessTestApplication.java:21)
	at sun.reflect.NativeMethodAccessorImpl.invoke0(Native Method)
	at sun.reflect.NativeMethodAccessorImpl.invoke(NativeMethodAccessorImpl.java:62)
	at sun.reflect.DelegatingMethodAccessorImpl.invoke(DelegatingMethodAccessorImpl.java:43)
	at java.lang.reflect.Method.invoke(Method.java:498)
	at org.eclipse.equinox.internal.app.EclipseAppContainer.callMethodWithException(EclipseAppContainer.java:587)
	at org.eclipse.equinox.internal.app.EclipseAppHandle.run(EclipseAppHandle.java:198)
	at org.eclipse.core.runtime.internal.adaptor.EclipseAppLauncher.runApplication(EclipseAppLauncher.java:134)
	at org.eclipse.core.runtime.internal.adaptor.EclipseAppLauncher.start(EclipseAppLauncher.java:104)
	at org.eclipse.core.runtime.adaptor.EclipseStarter.run(EclipseStarter.java:380)
	at org.eclipse.core.runtime.adaptor.EclipseStarter.run(EclipseStarter.java:235)
	at sun.reflect.NativeMethodAccessorImpl.invoke0(Native Method)
	at sun.reflect.NativeMethodAccessorImpl.invoke(NativeMethodAccessorImpl.java:62)
	at sun.reflect.DelegatingMethodAccessorImpl.invoke(DelegatingMethodAccessorImpl.java:43)
	at java.lang.reflect.Method.invoke(Method.java:498)
	at org.eclipse.equinox.launcher.Main.invokeFramework(Main.java:669)
	at org.eclipse.equinox.launcher.Main.basicRun(Main.java:608)
	at org.eclipse.equinox.launcher.Main.run(Main.java:1515)
	at org.eclipse.equinox.launcher.Main.main(Main.java:1488)

testCallSyncFromProxy(org.eclipse.ecf.tests.osgi.services.distribution.generic.GenericRemoteServiceAccessTest)  Time elapsed: 41.231 sec  <<< FAILURE!
junit.framework.AssertionFailedError: No valid service reference found. Bundle state of the ECF distribution bundle is ACTIVE
	at junit.framework.Assert.fail(Assert.java:57)
	at junit.framework.TestCase.fail(TestCase.java:227)
	at org.eclipse.ecf.tests.osgi.services.distribution.AbstractDistributionTest.assertReferencesValid(AbstractDistributionTest.java:218)
	at org.eclipse.ecf.tests.osgi.services.distribution.AbstractDistributionTest.assertReferencesValidAndFirstHasCorrectType(AbstractDistributionTest.java:201)
	at org.eclipse.ecf.tests.osgi.services.distribution.AbstractRemoteServiceAccessTest.testCallSyncFromProxy(AbstractRemoteServiceAccessTest.java:159)
	at sun.reflect.NativeMethodAccessorImpl.invoke0(Native Method)
	at sun.reflect.NativeMethodAccessorImpl.invoke(NativeMethodAccessorImpl.java:62)
	at sun.reflect.DelegatingMethodAccessorImpl.invoke(DelegatingMethodAccessorImpl.java:43)
	at java.lang.reflect.Method.invoke(Method.java:498)
	at junit.framework.TestCase.runTest(TestCase.java:176)
	at junit.framework.TestCase.runBare(TestCase.java:141)
	at junit.framework.TestResult$1.protect(TestResult.java:122)
	at junit.framework.TestResult.runProtected(TestResult.java:142)
	at junit.framework.TestResult.run(TestResult.java:125)
	at junit.framework.TestCase.run(TestCase.java:129)
	at junit.framework.TestSuite.runTest(TestSuite.java:252)
	at junit.framework.TestSuite.run(TestSuite.java:247)
	at org.junit.internal.runners.JUnit38ClassRunner.run(JUnit38ClassRunner.java:86)
	at org.apache.maven.surefire.junit4.JUnit4Provider.execute(JUnit4Provider.java:264)
	at org.apache.maven.surefire.junit4.JUnit4Provider.executeTestSet(JUnit4Provider.java:153)
	at org.apache.maven.surefire.junit4.JUnit4Provider.invoke(JUnit4Provider.java:124)
	at sun.reflect.NativeMethodAccessorImpl.invoke0(Native Method)
	at sun.reflect.NativeMethodAccessorImpl.invoke(NativeMethodAccessorImpl.java:62)
	at sun.reflect.DelegatingMethodAccessorImpl.invoke(DelegatingMethodAccessorImpl.java:43)
	at java.lang.reflect.Method.invoke(Method.java:498)
	at org.apache.maven.surefire.util.ReflectionUtils.invokeMethodWithArray2(ReflectionUtils.java:208)
	at org.apache.maven.surefire.booter.ProviderFactory$ProviderProxy.invoke(ProviderFactory.java:156)
	at org.apache.maven.surefire.booter.ProviderFactory.invokeProvider(ProviderFactory.java:82)
	at org.eclipse.tycho.surefire.osgibooter.OsgiSurefireBooter.run(OsgiSurefireBooter.java:95)
	at org.eclipse.tycho.surefire.osgibooter.HeadlessTestApplication.run(HeadlessTestApplication.java:21)
	at sun.reflect.NativeMethodAccessorImpl.invoke0(Native Method)
	at sun.reflect.NativeMethodAccessorImpl.invoke(NativeMethodAccessorImpl.java:62)
	at sun.reflect.DelegatingMethodAccessorImpl.invoke(DelegatingMethodAccessorImpl.java:43)
	at java.lang.reflect.Method.invoke(Method.java:498)
	at org.eclipse.equinox.internal.app.EclipseAppContainer.callMethodWithException(EclipseAppContainer.java:587)
	at org.eclipse.equinox.internal.app.EclipseAppHandle.run(EclipseAppHandle.java:198)
	at org.eclipse.core.runtime.internal.adaptor.EclipseAppLauncher.runApplication(EclipseAppLauncher.java:134)
	at org.eclipse.core.runtime.internal.adaptor.EclipseAppLauncher.start(EclipseAppLauncher.java:104)
	at org.eclipse.core.runtime.adaptor.EclipseStarter.run(EclipseStarter.java:380)
	at org.eclipse.core.runtime.adaptor.EclipseStarter.run(EclipseStarter.java:235)
	at sun.reflect.NativeMethodAccessorImpl.invoke0(Native Method)
	at sun.reflect.NativeMethodAccessorImpl.invoke(NativeMethodAccessorImpl.java:62)
	at sun.reflect.DelegatingMethodAccessorImpl.invoke(DelegatingMethodAccessorImpl.java:43)
	at java.lang.reflect.Method.invoke(Method.java:498)
	at org.eclipse.equinox.launcher.Main.invokeFramework(Main.java:669)
	at org.eclipse.equinox.launcher.Main.basicRun(Main.java:608)
	at org.eclipse.equinox.launcher.Main.run(Main.java:1515)
	at org.eclipse.equinox.launcher.Main.main(Main.java:1488)

testGetRemoteServiceReference(org.eclipse.ecf.tests.osgi.services.distribution.generic.GenericRemoteServiceAccessTest)  Time elapsed: 41.233 sec  <<< FAILURE!
junit.framework.AssertionFailedError: No valid service reference found. Bundle state of the ECF distribution bundle is ACTIVE
	at junit.framework.Assert.fail(Assert.java:57)
	at junit.framework.TestCase.fail(TestCase.java:227)
	at org.eclipse.ecf.tests.osgi.services.distribution.AbstractDistributionTest.assertReferencesValid(AbstractDistributionTest.java:218)
	at org.eclipse.ecf.tests.osgi.services.distribution.AbstractDistributionTest.assertReferencesValidAndFirstHasCorrectType(AbstractDistributionTest.java:201)
	at org.eclipse.ecf.tests.osgi.services.distribution.AbstractRemoteServiceAccessTest.testGetRemoteServiceReference(AbstractRemoteServiceAccessTest.java:101)
	at sun.reflect.NativeMethodAccessorImpl.invoke0(Native Method)
	at sun.reflect.NativeMethodAccessorImpl.invoke(NativeMethodAccessorImpl.java:62)
	at sun.reflect.DelegatingMethodAccessorImpl.invoke(DelegatingMethodAccessorImpl.java:43)
	at java.lang.reflect.Method.invoke(Method.java:498)
	at junit.framework.TestCase.runTest(TestCase.java:176)
	at junit.framework.TestCase.runBare(TestCase.java:141)
	at junit.framework.TestResult$1.protect(TestResult.java:122)
	at junit.framework.TestResult.runProtected(TestResult.java:142)
	at junit.framework.TestResult.run(TestResult.java:125)
	at junit.framework.TestCase.run(TestCase.java:129)
	at junit.framework.TestSuite.runTest(TestSuite.java:252)
	at junit.framework.TestSuite.run(TestSuite.java:247)
	at org.junit.internal.runners.JUnit38ClassRunner.run(JUnit38ClassRunner.java:86)
	at org.apache.maven.surefire.junit4.JUnit4Provider.execute(JUnit4Provider.java:264)
	at org.apache.maven.surefire.junit4.JUnit4Provider.executeTestSet(JUnit4Provider.java:153)
	at org.apache.maven.surefire.junit4.JUnit4Provider.invoke(JUnit4Provider.java:124)
	at sun.reflect.NativeMethodAccessorImpl.invoke0(Native Method)
	at sun.reflect.NativeMethodAccessorImpl.invoke(NativeMethodAccessorImpl.java:62)
	at sun.reflect.DelegatingMethodAccessorImpl.invoke(DelegatingMethodAccessorImpl.java:43)
	at java.lang.reflect.Method.invoke(Method.java:498)
	at org.apache.maven.surefire.util.ReflectionUtils.invokeMethodWithArray2(ReflectionUtils.java:208)
	at org.apache.maven.surefire.booter.ProviderFactory$ProviderProxy.invoke(ProviderFactory.java:156)
	at org.apache.maven.surefire.booter.ProviderFactory.invokeProvider(ProviderFactory.java:82)
	at org.eclipse.tycho.surefire.osgibooter.OsgiSurefireBooter.run(OsgiSurefireBooter.java:95)
	at org.eclipse.tycho.surefire.osgibooter.HeadlessTestApplication.run(HeadlessTestApplication.java:21)
	at sun.reflect.NativeMethodAccessorImpl.invoke0(Native Method)
	at sun.reflect.NativeMethodAccessorImpl.invoke(NativeMethodAccessorImpl.java:62)
	at sun.reflect.DelegatingMethodAccessorImpl.invoke(DelegatingMethodAccessorImpl.java:43)
	at java.lang.reflect.Method.invoke(Method.java:498)
	at org.eclipse.equinox.internal.app.EclipseAppContainer.callMethodWithException(EclipseAppContainer.java:587)
	at org.eclipse.equinox.internal.app.EclipseAppHandle.run(EclipseAppHandle.java:198)
	at org.eclipse.core.runtime.internal.adaptor.EclipseAppLauncher.runApplication(EclipseAppLauncher.java:134)
	at org.eclipse.core.runtime.internal.adaptor.EclipseAppLauncher.start(EclipseAppLauncher.java:104)
	at org.eclipse.core.runtime.adaptor.EclipseStarter.run(EclipseStarter.java:380)
	at org.eclipse.core.runtime.adaptor.EclipseStarter.run(EclipseStarter.java:235)
	at sun.reflect.NativeMethodAccessorImpl.invoke0(Native Method)
	at sun.reflect.NativeMethodAccessorImpl.invoke(NativeMethodAccessorImpl.java:62)
	at sun.reflect.DelegatingMethodAccessorImpl.invoke(DelegatingMethodAccessorImpl.java:43)
	at java.lang.reflect.Method.invoke(Method.java:498)
	at org.eclipse.equinox.launcher.Main.invokeFramework(Main.java:669)
	at org.eclipse.equinox.launcher.Main.basicRun(Main.java:608)
	at org.eclipse.equinox.launcher.Main.run(Main.java:1515)
	at org.eclipse.equinox.launcher.Main.main(Main.java:1488)

testGetRemoteServiceReferenceWithExtraProperties(org.eclipse.ecf.tests.osgi.services.distribution.generic.GenericRemoteServiceAccessTest)  Time elapsed: 41.234 sec  <<< FAILURE!
junit.framework.AssertionFailedError: No valid service reference found. Bundle state of the ECF distribution bundle is ACTIVE
	at junit.framework.Assert.fail(Assert.java:57)
	at junit.framework.TestCase.fail(TestCase.java:227)
	at org.eclipse.ecf.tests.osgi.services.distribution.AbstractDistributionTest.assertReferencesValid(AbstractDistributionTest.java:218)
	at org.eclipse.ecf.tests.osgi.services.distribution.AbstractDistributionTest.assertReferencesValidAndFirstHasCorrectType(AbstractDistributionTest.java:201)
	at org.eclipse.ecf.tests.osgi.services.distribution.AbstractRemoteServiceAccessTest.testGetRemoteServiceReferenceWithExtraProperties(AbstractRemoteServiceAccessTest.java:122)
	at sun.reflect.NativeMethodAccessorImpl.invoke0(Native Method)
	at sun.reflect.NativeMethodAccessorImpl.invoke(NativeMethodAccessorImpl.java:62)
	at sun.reflect.DelegatingMethodAccessorImpl.invoke(DelegatingMethodAccessorImpl.java:43)
	at java.lang.reflect.Method.invoke(Method.java:498)
	at junit.framework.TestCase.runTest(TestCase.java:176)
	at junit.framework.TestCase.runBare(TestCase.java:141)
	at junit.framework.TestResult$1.protect(TestResult.java:122)
	at junit.framework.TestResult.runProtected(TestResult.java:142)
	at junit.framework.TestResult.run(TestResult.java:125)
	at junit.framework.TestCase.run(TestCase.java:129)
	at junit.framework.TestSuite.runTest(TestSuite.java:252)
	at junit.framework.TestSuite.run(TestSuite.java:247)
	at org.junit.internal.runners.JUnit38ClassRunner.run(JUnit38ClassRunner.java:86)
	at org.apache.maven.surefire.junit4.JUnit4Provider.execute(JUnit4Provider.java:264)
	at org.apache.maven.surefire.junit4.JUnit4Provider.executeTestSet(JUnit4Provider.java:153)
	at org.apache.maven.surefire.junit4.JUnit4Provider.invoke(JUnit4Provider.java:124)
	at sun.reflect.NativeMethodAccessorImpl.invoke0(Native Method)
	at sun.reflect.NativeMethodAccessorImpl.invoke(NativeMethodAccessorImpl.java:62)
	at sun.reflect.DelegatingMethodAccessorImpl.invoke(DelegatingMethodAccessorImpl.java:43)
	at java.lang.reflect.Method.invoke(Method.java:498)
	at org.apache.maven.surefire.util.ReflectionUtils.invokeMethodWithArray2(ReflectionUtils.java:208)
	at org.apache.maven.surefire.booter.ProviderFactory$ProviderProxy.invoke(ProviderFactory.java:156)
	at org.apache.maven.surefire.booter.ProviderFactory.invokeProvider(ProviderFactory.java:82)
	at org.eclipse.tycho.surefire.osgibooter.OsgiSurefireBooter.run(OsgiSurefireBooter.java:95)
	at org.eclipse.tycho.surefire.osgibooter.HeadlessTestApplication.run(HeadlessTestApplication.java:21)
	at sun.reflect.NativeMethodAccessorImpl.invoke0(Native Method)
	at sun.reflect.NativeMethodAccessorImpl.invoke(NativeMethodAccessorImpl.java:62)
	at sun.reflect.DelegatingMethodAccessorImpl.invoke(DelegatingMethodAccessorImpl.java:43)
	at java.lang.reflect.Method.invoke(Method.java:498)
	at org.eclipse.equinox.internal.app.EclipseAppContainer.callMethodWithException(EclipseAppContainer.java:587)
	at org.eclipse.equinox.internal.app.EclipseAppHandle.run(EclipseAppHandle.java:198)
	at org.eclipse.core.runtime.internal.adaptor.EclipseAppLauncher.runApplication(EclipseAppLauncher.java:134)
	at org.eclipse.core.runtime.internal.adaptor.EclipseAppLauncher.start(EclipseAppLauncher.java:104)
	at org.eclipse.core.runtime.adaptor.EclipseStarter.run(EclipseStarter.java:380)
	at org.eclipse.core.runtime.adaptor.EclipseStarter.run(EclipseStarter.java:235)
	at sun.reflect.NativeMethodAccessorImpl.invoke0(Native Method)
	at sun.reflect.NativeMethodAccessorImpl.invoke(NativeMethodAccessorImpl.java:62)
	at sun.reflect.DelegatingMethodAccessorImpl.invoke(DelegatingMethodAccessorImpl.java:43)
	at java.lang.reflect.Method.invoke(Method.java:498)
	at org.eclipse.equinox.launcher.Main.invokeFramework(Main.java:669)
	at org.eclipse.equinox.launcher.Main.basicRun(Main.java:608)
	at org.eclipse.equinox.launcher.Main.run(Main.java:1515)
	at org.eclipse.equinox.launcher.Main.main(Main.java:1488)


Results :

Failed tests: 
  GenericTwoRemoteServiceAccessTest>AbstractTwoRemoteServiceAccessTest.testProxyWithService1:124->AbstractDistributionTest.assertReferencesValidAndFirstHasCorrectType:201->AbstractDistributionTest.assertReferencesValid:218 No valid service reference found. Bundle state of the ECF distribution bundle is ACTIVE
  GenericTwoRemoteServiceAccessTest>AbstractTwoRemoteServiceAccessTest.testProxyWithService2:145->AbstractDistributionTest.assertReferencesValidAndFirstHasCorrectType:201->AbstractDistributionTest.assertReferencesValid:218 No valid service reference found. Bundle state of the ECF distribution bundle is ACTIVE
  GenericTwoRemoteServiceAccessTest>AbstractTwoRemoteServiceAccessTest.testGetRemoteService2Reference:110->AbstractDistributionTest.assertReferencesValidAndFirstHasCorrectType:201->AbstractDistributionTest.assertReferencesValid:218 No valid service reference found. Bundle state of the ECF distribution bundle is ACTIVE
  GenericTwoRemoteServiceAccessTest>AbstractTwoRemoteServiceAccessTest.testGetRemoteService1Reference:97->AbstractDistributionTest.assertReferencesValidAndFirstHasCorrectType:201->AbstractDistributionTest.assertReferencesValid:218 No valid service reference found. Bundle state of the ECF distribution bundle is ACTIVE
  GenericRemoteServiceAccessTest>AbstractRemoteServiceAccessTest.testProxy:140->AbstractDistributionTest.assertReferencesValidAndFirstHasCorrectType:201->AbstractDistributionTest.assertReferencesValid:218 No valid service reference found. Bundle state of the ECF distribution bundle is ACTIVE
  GenericRemoteServiceAccessTest>AbstractRemoteServiceAccessTest.testCallAsync:203->AbstractDistributionTest.assertReferencesValid:218 No valid service reference found. Bundle state of the ECF distribution bundle is ACTIVE
  GenericRemoteServiceAccessTest>AbstractRemoteServiceAccessTest.testFireAsync:255->AbstractDistributionTest.assertReferencesValid:218 No valid service reference found. Bundle state of the ECF distribution bundle is ACTIVE
  GenericRemoteServiceAccessTest>AbstractRemoteServiceAccessTest.testCallFuture:233->AbstractDistributionTest.assertReferencesValid:218 No valid service reference found. Bundle state of the ECF distribution bundle is ACTIVE
  GenericRemoteServiceAccessTest>AbstractRemoteServiceAccessTest.testCallSync:183->AbstractDistributionTest.assertReferencesValidAndFirstHasCorrectType:201->AbstractDistributionTest.assertReferencesValid:218 No valid service reference found. Bundle state of the ECF distribution bundle is ACTIVE
  GenericRemoteServiceAccessTest>AbstractRemoteServiceAccessTest.testCallSyncFromProxy:159->AbstractDistributionTest.assertReferencesValidAndFirstHasCorrectType:201->AbstractDistributionTest.assertReferencesValid:218 No valid service reference found. Bundle state of the ECF distribution bundle is ACTIVE
  GenericRemoteServiceAccessTest>AbstractRemoteServiceAccessTest.testGetRemoteServiceReference:101->AbstractDistributionTest.assertReferencesValidAndFirstHasCorrectType:201->AbstractDistributionTest.assertReferencesValid:218 No valid service reference found. Bundle state of the ECF distribution bundle is ACTIVE
  GenericRemoteServiceAccessTest>AbstractRemoteServiceAccessTest.testGetRemoteServiceReferenceWithExtraProperties:122->AbstractDistributionTest.assertReferencesValidAndFirstHasCorrectType:201->AbstractDistributionTest.assertReferencesValid:218 No valid service reference found. Bundle state of the ECF distribution bundle is ACTIVE

Tests run: 23, Failures: 12, Errors: 0, Skipped: 0

[ERROR] There are test failures.

Please refer to /home/hudson/genie.ecf/.hudson/workspace/ecf-tycho.master-mars/tests/bundles/org.eclipse.ecf.tests.osgi.services.distribution.generic/target/surefire-reports for the individual test results.
[JENKINS] Recording test results
[INFO] 
[INFO] --- tycho-pack200a-plugin:0.26.0:normalize (pack200-normalize) @ org.eclipse.ecf.tests.osgi.services.distribution.generic ---
[INFO] Pack200 normalizing jar /home/hudson/genie.ecf/.hudson/workspace/ecf-tycho.master-mars/tests/bundles/org.eclipse.ecf.tests.osgi.services.distribution.generic/target/org.eclipse.ecf.tests.osgi.services.distribution.generic-1.0.0-SNAPSHOT.jar
[INFO] 
[INFO] --- eclipse-jarsigner-plugin:1.1.3:sign (sign) @ org.eclipse.ecf.tests.osgi.services.distribution.generic ---
[INFO] Signing jar: /home/hudson/genie.ecf/.hudson/workspace/ecf-tycho.master-mars/tests/bundles/org.eclipse.ecf.tests.osgi.services.distribution.generic/target/org.eclipse.ecf.tests.osgi.services.distribution.generic-1.0.0-SNAPSHOT.jar
[INFO] Signing jar: /home/hudson/genie.ecf/.hudson/workspace/ecf-tycho.master-mars/tests/bundles/org.eclipse.ecf.tests.osgi.services.distribution.generic/target/org.eclipse.ecf.tests.osgi.services.distribution.generic-1.0.0-SNAPSHOT-sources.jar
[INFO] 
[INFO] --- tycho-pack200b-plugin:0.26.0:pack (pack200-pack) @ org.eclipse.ecf.tests.osgi.services.distribution.generic ---
[INFO] Pack200 packing jar /home/hudson/genie.ecf/.hudson/workspace/ecf-tycho.master-mars/tests/bundles/org.eclipse.ecf.tests.osgi.services.distribution.generic/target/org.eclipse.ecf.tests.osgi.services.distribution.generic-1.0.0-SNAPSHOT.jar
[INFO] 
[INFO] --- tycho-p2-plugin:0.26.0:p2-metadata (p2-metadata) @ org.eclipse.ecf.tests.osgi.services.distribution.generic ---
Started calculate disk usage of build
Finished Calculation of disk usage of build in 0 seconds
Started calculate disk usage of workspace
Finished Calculation of disk usage of workspace in 0 seconds
[INFO]                                                                         
[INFO] ------------------------------------------------------------------------
[INFO] Building org.eclipse.ecf.tests.osgi.services.distribution.r-osgi 1.0.0-SNAPSHOT
[INFO] ------------------------------------------------------------------------
[INFO] 
[INFO] --- maven-clean-plugin:3.0.0:clean (default-clean) @ org.eclipse.ecf.tests.osgi.services.distribution.r-osgi ---
[INFO] Deleting /home/hudson/genie.ecf/.hudson/workspace/ecf-tycho.master-mars/tests/bundles/org.eclipse.ecf.tests.osgi.services.distribution.r-osgi/target
[INFO] 
[INFO] --- tycho-packaging-plugin:0.26.0:build-qualifier (default-build-qualifier) @ org.eclipse.ecf.tests.osgi.services.distribution.r-osgi ---
[INFO] The project's OSGi version is 1.0.0.v20160926-1048
[INFO] 
[INFO] --- tycho-packaging-plugin:0.26.0:validate-id (default-validate-id) @ org.eclipse.ecf.tests.osgi.services.distribution.r-osgi ---
[INFO] 
[INFO] --- tycho-packaging-plugin:0.26.0:validate-version (default-validate-version) @ org.eclipse.ecf.tests.osgi.services.distribution.r-osgi ---
[INFO] 
[INFO] --- maven-resources-plugin:2.4.3:resources (default-resources) @ org.eclipse.ecf.tests.osgi.services.distribution.r-osgi ---
[INFO] Using 'ISO-8859-1' encoding to copy filtered resources.
[INFO] skip non existing resourceDirectory /home/hudson/genie.ecf/.hudson/workspace/ecf-tycho.master-mars/tests/bundles/org.eclipse.ecf.tests.osgi.services.distribution.r-osgi/src/main/resources
[INFO] 
[INFO] --- tycho-compiler-plugin:0.26.0:compile (default-compile) @ org.eclipse.ecf.tests.osgi.services.distribution.r-osgi ---
[INFO] Compiling 3 source files to /home/hudson/genie.ecf/.hudson/workspace/ecf-tycho.master-mars/tests/bundles/org.eclipse.ecf.tests.osgi.services.distribution.r-osgi/target/classes
[INFO] 
[INFO] --- maven-resources-plugin:2.4.3:testResources (default-testResources) @ org.eclipse.ecf.tests.osgi.services.distribution.r-osgi ---
[INFO] Using 'ISO-8859-1' encoding to copy filtered resources.
[INFO] skip non existing resourceDirectory /home/hudson/genie.ecf/.hudson/workspace/ecf-tycho.master-mars/tests/bundles/org.eclipse.ecf.tests.osgi.services.distribution.r-osgi/src/test/resources
[INFO] 
[INFO] --- tycho-source-plugin:0.26.0:plugin-source (plugin-source) @ org.eclipse.ecf.tests.osgi.services.distribution.r-osgi ---
[INFO] Building jar: /home/hudson/genie.ecf/.hudson/workspace/ecf-tycho.master-mars/tests/bundles/org.eclipse.ecf.tests.osgi.services.distribution.r-osgi/target/org.eclipse.ecf.tests.osgi.services.distribution.r-osgi-1.0.0-SNAPSHOT-sources.jar
[INFO] 
[INFO] --- target-platform-configuration:0.26.0:target-platform (default-target-platform) @ org.eclipse.ecf.tests.osgi.services.distribution.r-osgi ---
[INFO] 
[INFO] --- tycho-packaging-plugin:0.26.0:package-plugin (default-package-plugin) @ org.eclipse.ecf.tests.osgi.services.distribution.r-osgi ---
[INFO] Building jar: /home/hudson/genie.ecf/.hudson/workspace/ecf-tycho.master-mars/tests/bundles/org.eclipse.ecf.tests.osgi.services.distribution.r-osgi/target/org.eclipse.ecf.tests.osgi.services.distribution.r-osgi-1.0.0-SNAPSHOT.jar
[INFO] 
[INFO] --- tycho-p2-plugin:0.26.0:p2-metadata-default (default-p2-metadata-default) @ org.eclipse.ecf.tests.osgi.services.distribution.r-osgi ---
[INFO] 
[INFO] --- tycho-source-feature-plugin:0.26.0:source-feature (source-feature) @ org.eclipse.ecf.tests.osgi.services.distribution.r-osgi ---
[INFO] 
[INFO] --- tycho-p2-plugin:0.26.0:p2-metadata (attach-p2-metadata) @ org.eclipse.ecf.tests.osgi.services.distribution.r-osgi ---
[INFO] 
[INFO] --- tycho-surefire-plugin:0.26.0:test (default-test) @ org.eclipse.ecf.tests.osgi.services.distribution.r-osgi ---
[INFO] Expected eclipse log file: /home/hudson/genie.ecf/.hudson/workspace/ecf-tycho.master-mars/tests/bundles/org.eclipse.ecf.tests.osgi.services.distribution.r-osgi/target/work/data/.metadata/.log
[INFO] Command line:
	[/opt/public/common/jdk1.8.0_121.x64/jre/bin/java, -Dosgi.noShutdown=false, -Dosgi.os=linux, -Dosgi.ws=gtk, -Dosgi.arch=x86_64, -Dosgi.clean=true, -Dnet.mdns.interface=127.0.0.1, -Dnet.mdns.port=65354, -Dorg.eclipse.ecf.osgi.services.discovery.allowLoopbackReference=true, -jar, /home/hudson/genie.ecf/.hudson/workspace/ecf-tycho.master-mars/.repository/p2/osgi/bundle/org.eclipse.equinox.launcher/1.3.100.v20150511-1540/org.eclipse.equinox.launcher-1.3.100.v20150511-1540.jar, -data, /home/hudson/genie.ecf/.hudson/workspace/ecf-tycho.master-mars/tests/bundles/org.eclipse.ecf.tests.osgi.services.distribution.r-osgi/target/work/data, -install, /home/hudson/genie.ecf/.hudson/workspace/ecf-tycho.master-mars/tests/bundles/org.eclipse.ecf.tests.osgi.services.distribution.r-osgi/target/work, -configuration, /home/hudson/genie.ecf/.hudson/workspace/ecf-tycho.master-mars/tests/bundles/org.eclipse.ecf.tests.osgi.services.distribution.r-osgi/target/work/configuration, -application, org.eclipse.tycho.surefire.osgibooter.headlesstest, -testproperties, /home/hudson/genie.ecf/.hudson/workspace/ecf-tycho.master-mars/tests/bundles/org.eclipse.ecf.tests.osgi.services.distribution.r-osgi/target/surefire.properties]

-------------------------------------------------------
 T E S T S
-------------------------------------------------------
Running org.eclipse.ecf.tests.osgi.services.distribution.r_osgi.R_OSGiRemoteServiceRegisterTest
====starting org.eclipse.ecf.tests.osgi.services.distribution.r_osgi.R_OSGiRemoteServiceRegisterTest.testRegisterOnExistingServerWithIdentity====
log4j:WARN No appenders could be found for logger (org.apache.zookeeper.server.ZooKeeperServer).
log4j:WARN Please initialize the log4j system properly.
SERVICE.concat(Eclipse ,sucks) returning Eclipse sucks
SERVICE.concat(ECF ,sucks) returning ECF sucks
SERVICE.concat(ECF AsynchResults ,are cool) returning ECF AsynchResults are cool
SERVICE.concat(Eclipse ,is cool) returning Eclipse is cool
SERVICE.concat(ECF ,is cool) returning ECF is cool
[WARNING] Failed to notify spy hudson.maven.Maven3Builder$JenkinsEventSpy: Invalid object ID 71 iota=160
[WARNING] Failed to notify spy hudson.maven.Maven3Builder$JenkinsEventSpy: Invalid object ID 71 iota=160
[WARNING] Failed to notify spy hudson.maven.Maven3Builder$JenkinsEventSpy: Invalid object ID 8 iota=160
[INFO] ------------------------------------------------------------------------
[INFO] Reactor Summary:
[INFO] 
[INFO] Eclipse Communication Framework .................... SUCCESS [  2.069 s]
[INFO] org.eclipse.ecf.doc ................................ SUCCESS [  7.414 s]
[INFO] com.mycorp.examples.timeservice .................... SUCCESS [  6.738 s]
[INFO] com.mycorp.examples.timeservice.async .............. SUCCESS [  3.885 s]
[INFO] org.eclipse.ecf.identity ........................... SUCCESS [  5.183 s]
[INFO] org.eclipse.ecf .................................... SUCCESS [  5.501 s]
[INFO] org.eclipse.ecf.discovery .......................... SUCCESS [  4.697 s]
[INFO] org.eclipse.ecf.osgi.services.remoteserviceadmin.proxy SUCCESS [  3.741 s]
[INFO] org.eclipse.ecf.remoteservice.asyncproxy ........... SUCCESS [  3.698 s]
[INFO] org.eclipse.ecf.remoteservice ...................... SUCCESS [  6.153 s]
[INFO] org.eclipse.osgi.services.remoteserviceadmin ....... SUCCESS [  4.593 s]
[INFO] org.eclipse.ecf.osgi.services.remoteserviceadmin ... SUCCESS [  6.565 s]
[INFO] com.mycorp.examples.timeservice.consumer ........... SUCCESS [  3.720 s]
[INFO] com.mycorp.examples.timeservice.consumer.ds ........ SUCCESS [  5.188 s]
[INFO] com.mycorp.examples.timeservice.consumer.ds.async .. SUCCESS [  4.513 s]
[INFO] com.mycorp.examples.timeservice.consumer.filediscovery SUCCESS [  3.553 s]
[INFO] com.mycorp.examples.timeservice.consumer.filediscovery.rest SUCCESS [  3.625 s]
[INFO] com.mycorp.examples.timeservice.host ............... SUCCESS [  3.915 s]
[INFO] org.eclipse.ecf.remoteservice.rest ................. SUCCESS [  4.370 s]
[INFO] com.mycorp.examples.timeservice.provider.rest.consumer SUCCESS [  3.853 s]
[INFO] org.eclipse.ecf.sharedobject ....................... SUCCESS [  4.989 s]
[INFO] org.eclipse.ecf.provider ........................... SUCCESS [  5.365 s]
[INFO] org.eclipse.ecf.provider.remoteservice ............. SUCCESS [  4.765 s]
[INFO] org.eclipse.ecf.remoteservice.servlet .............. SUCCESS [  4.161 s]
[INFO] com.mycorp.examples.timeservice.provider.rest.host . SUCCESS [  3.822 s]
[INFO] org.eclipse.ecf.presence ........................... SUCCESS [  5.186 s]
[INFO] org.eclipse.ecf.filetransfer ....................... SUCCESS [  4.541 s]
[INFO] org.jivesoftware.smack ............................. SUCCESS [ 13.881 s]
[INFO] org.eclipse.ecf.provider.xmpp ...................... SUCCESS [  5.353 s]
[INFO] org.eclipse.ecf.ui ................................. SUCCESS [  6.758 s]
[INFO] org.eclipse.ecf.presence.ui ........................ SUCCESS [  6.452 s]
[INFO] org.eclipse.ecf.example.clients .................... SUCCESS [  4.351 s]
[INFO] org.eclipse.ecf.datashare .......................... SUCCESS [  3.889 s]
[INFO] org.eclipse.ecf.provider.datashare ................. SUCCESS [  4.097 s]
[INFO] org.eclipse.ecf.example.collab.editor .............. SUCCESS [  3.967 s]
[INFO] org.eclipse.ecf.server.generic ..................... SUCCESS [  4.838 s]
[INFO] org.eclipse.ecf.example.collab ..................... SUCCESS [  6.978 s]
[INFO] org.eclipse.ecf.remoteservice.eventadmin ........... SUCCESS [  4.041 s]
[INFO] org.eclipse.ecf.examples.eventadmin.app ............ SUCCESS [  3.593 s]
[INFO] org.eclipse.ecf.examples.remoteservices.hello.consumer.edef SUCCESS [  3.514 s]
[INFO] org.eclipse.ecf.examples.remoteservices.hello ...... SUCCESS [  3.481 s]
[INFO] org.eclipse.ecf.osgi.services.distribution ......... SUCCESS [  3.987 s]
[INFO] org.eclipse.ecf.examples.remoteservices.hello.consumer SUCCESS [  3.806 s]
[INFO] org.eclipse.ecf.examples.remoteservices.hello.ds.consumer SUCCESS [  4.028 s]
[INFO] org.eclipse.ecf.examples.remoteservices.hello.host . SUCCESS [  3.817 s]
[INFO] org.eclipse.ecf.remoteservice.rest.synd ............ SUCCESS [  3.632 s]
[INFO] org.eclipse.ecf.examples.remoteservices.rest.rss ... SUCCESS [  4.079 s]
[INFO] org.eclipse.ecf.console ............................ SUCCESS [  3.958 s]
[INFO] org.eclipse.ecf.discovery.ui.model ................. SUCCESS [  4.591 s]
[INFO] org.eclipse.ecf.discovery.ui.edit .................. SUCCESS [  4.050 s]
[INFO] org.eclipse.ecf.discovery.ui ....................... SUCCESS [  4.391 s]
[INFO] org.eclipse.ecf.discovery.ui.browser ............... SUCCESS [  4.051 s]
[INFO] org.eclipse.ecf.discovery.ui.properties ............ SUCCESS [  4.074 s]
[INFO] org.eclipse.ecf.discovery.ui.properties.tabbed ..... SUCCESS [  4.154 s]
[INFO] org.eclipse.ecf.discovery.ui.userinput ............. SUCCESS [  4.210 s]
[INFO] org.eclipse.ecf.sync ............................... SUCCESS [  4.329 s]
[INFO] org.eclipse.ecf.docshare ........................... SUCCESS [  4.581 s]
[INFO] org.eclipse.ecf.filetransfer.ui .................... SUCCESS [  4.723 s]
[INFO] org.eclipse.ecf.presence.bot ....................... SUCCESS [  4.100 s]
[INFO] org.eclipse.ecf.presence.collab.ui ................. SUCCESS [  4.745 s]
[INFO] org.eclipse.ecf.remoteservice.asyncproxy ........... SUCCESS [  4.063 s]
[INFO] org.eclipse.ecf.remoteservice.soap ................. SUCCESS [  3.647 s]
[INFO] org.eclipse.ecf.remoteservice.ui ................... SUCCESS [  6.405 s]
[INFO] org.eclipse.ecf.ssl ................................ SUCCESS [  4.477 s]
[INFO] org.eclipse.ecf.storage ............................ SUCCESS [  5.579 s]
[INFO] org.eclipse.ecf.telephony.call ..................... SUCCESS [  4.286 s]
[INFO] org.eclipse.ecf.telephony.call.ui .................. SUCCESS [  3.934 s]
[INFO] org.eclipse.ecf.ui.capabilities .................... SUCCESS [  4.005 s]
[INFO] org.eclipse.team.ecf.core .......................... SUCCESS [  4.126 s]
[INFO] org.eclipse.team.ecf.ui ............................ SUCCESS [  5.210 s]
[INFO] ch.ethz.iks.r_osgi.remote .......................... SUCCESS [  5.653 s]
[INFO] ch.ethz.iks.slp .................................... SUCCESS [  5.195 s]
[INFO] org.eclipse.ecf.protocol.bittorrent ................ SUCCESS [  4.345 s]
[INFO] org.eclipse.ecf.protocol.msn ....................... SUCCESS [  5.322 s]
[INFO] org.eclipse.ecf.provider.filetransfer .............. SUCCESS [  5.206 s]
[INFO] org.eclipse.ecf.provider.bittorrent ................ SUCCESS [  4.321 s]
[INFO] org.eclipse.ecf.provider.bittorrent.ui ............. SUCCESS [  4.916 s]
[INFO] org.eclipse.ecf.provider.datashare.nio ............. SUCCESS [  4.173 s]
[INFO] org.eclipse.ecf.provider.discovery ................. SUCCESS [  3.899 s]
[INFO] org.eclipse.ecf.provider.dnssd ..................... SUCCESS [  3.489 s]
[INFO] org.eclipse.ecf.provider.filetransfer.efs .......... SUCCESS [  3.979 s]
[INFO] org.eclipse.ecf.provider.filetransfer.httpclient4 .. SUCCESS [  4.558 s]
[INFO] org.eclipse.ecf.provider.filetransfer.httpclient4.ssl SUCCESS [  3.946 s]
[INFO] org.eclipse.ecf.provider.filetransfer.scp .......... SUCCESS [  3.856 s]
[INFO] org.eclipse.ecf.provider.filetransfer.ssl .......... SUCCESS [  3.653 s]
[INFO] org.eclipse.ecf.provider.irc ....................... SUCCESS [  5.472 s]
[INFO] org.eclipse.ecf.provider.irc.ui .................... SUCCESS [  4.691 s]
[INFO] org.eclipse.ecf.provider.jmdns ..................... SUCCESS [  4.826 s]
[INFO] org.eclipse.ecf.provider.jslp ...................... SUCCESS [  4.089 s]
[INFO] org.eclipse.ecf.provider.msn ....................... SUCCESS [  5.070 s]
[INFO] org.eclipse.ecf.provider.msn.ui .................... SUCCESS [  4.496 s]
[INFO] org.eclipse.ecf.provider.r_osgi .................... SUCCESS [  4.566 s]
[INFO] org.eclipse.ecf.provider.ui ........................ SUCCESS [  4.943 s]
[INFO] org.eclipse.ecf.provider.xmpp.datashare ............ SUCCESS [  3.251 s]
[INFO] org.eclipse.ecf.provider.xmpp.remoteservice ........ SUCCESS [  3.895 s]
[INFO] org.eclipse.ecf.provider.xmpp.ui ................... SUCCESS [  4.835 s]
[INFO] org.eclipse.ecf.provider.zookeeper ................. SUCCESS [  4.327 s]
[INFO] org.eclipse.ecf.server ............................. SUCCESS [  3.597 s]
[INFO] org.eclipse.ecf.sharedobject.feature ............... SUCCESS [  4.159 s]
[INFO] org.eclipse.ecf.provider.generic.feature ........... SUCCESS [  3.382 s]
[INFO] org.eclipse.ecf.remoteservice.feature .............. SUCCESS [  3.075 s]
[INFO] org.eclipse.ecf.provider.generic.remoteservice.feature SUCCESS [  3.266 s]
[INFO] org.eclipse.ecf.server.generic.feature ............. SUCCESS [  3.318 s]
[INFO] org.eclipse.ecf.tests .............................. SUCCESS [ 15.027 s]
[INFO] org.eclipse.ecf.tests.datashare .................... SUCCESS [ 15.077 s]
[INFO] org.eclipse.ecf.tests.presence ..................... SUCCESS [  7.173 s]
[INFO] org.eclipse.ecf.tests.protocol.msn ................. SUCCESS [  6.640 s]
[INFO] org.eclipse.ecf.tests.provider.datashare.nio ....... SUCCESS [  7.261 s]
[INFO] org.eclipse.ecf.tests.remoteservice ................ SUCCESS [  6.940 s]
[INFO] org.eclipse.ecf.tests.sharedobject ................. SUCCESS [ 36.615 s]
[INFO] org.eclipse.ecf.tests.provider.xmpp ................ SUCCESS [  01:33 h]
[INFO] org.eclipse.ecf.tests.storage ...................... SUCCESS [  7.082 s]
[INFO] org.eclipse.ecf.tests.sync ......................... SUCCESS [  6.775 s]
[INFO] org.eclipse.ecf.tests.osgi.services.distribution ... SUCCESS [  7.209 s]
[INFO] org.eclipse.ecf.tests.discovery .................... SUCCESS [  6.833 s]
[INFO] org.eclipse.ecf.tests.remoteservice.generic ........ SUCCESS [08:37 min]
[INFO] org.eclipse.ecf.tests.remoteservice.r-osgi ......... SUCCESS [ 12.976 s]
[INFO] org.eclipse.ecf.tests.osgi.services.distribution.generic SUCCESS [11:31 min]
[INFO] org.eclipse.ecf.tests.osgi.services.distribution.r-osgi FAILURE [  10:03 h]
[INFO] org.eclipse.ecf.remoteservices.tooling.pde ......... SKIPPED
[INFO] org.eclipse.ecf.console.feature .................... SKIPPED
[INFO] org.eclipse.ecf.discovery.feature .................. SKIPPED
[INFO] org.eclipse.ecf.discovery.jmdns.feature ............ SKIPPED
[INFO] org.eclipse.ecf.eventadmin.feature ................. SKIPPED
[INFO] org.eclipse.ecf.osgi.services.feature .............. SKIPPED
[INFO] org.eclipse.ecf.remoteservice.rosgi.feature ........ SKIPPED
[INFO] org.eclipse.ecf.remoteservice.servlet.feature ...... SKIPPED
[INFO] org.eclipse.ecf.remoteservice.sdk.feature .......... SKIPPED
[INFO] org.eclipse.ecf.eventadmin.examples.feature ........ SKIPPED
[INFO] org.eclipse.ecf.remoteservice.examples.feature ..... SKIPPED
[INFO] org.eclipse.ecf.remoteservice.sdk.examples.feature . SKIPPED
[INFO] org.eclipse.ecf.core ............................... SKIPPED
[INFO] org.eclipse.ecf.core.feature ....................... SKIPPED
[INFO] org.eclipse.ecf.core.ssl.feature ................... SKIPPED
[INFO] org.eclipse.ecf.datashare.feature .................. SKIPPED
[INFO] org.eclipse.ecf.discovery.dnssd.feature ............ SKIPPED
[INFO] org.eclipse.ecf.discovery.slp.feature .............. SKIPPED
[INFO] org.eclipse.ecf.discovery.zookeeper.feature ........ SKIPPED
[INFO] org.eclipse.ecf.docshare.feature ................... SKIPPED
[INFO] org.eclipse.ecf.filetransfer.feature ............... SKIPPED
[INFO] org.eclipse.ecf.filetransfer.httpclient4.feature ... SKIPPED
[INFO] org.eclipse.ecf.filetransfer.ssl.feature ........... SKIPPED
[INFO] org.eclipse.ecf.filetransfer.httpclient4.ssl.feature SKIPPED
[INFO] org.eclipse.ecf.presence.feature ................... SKIPPED
[INFO] org.eclipse.ecf.provider.generic.datashare.feature . SKIPPED
[INFO] org.eclipse.ecf.remoteservice.rest.feature ......... SKIPPED
[INFO] org.eclipse.ecf.remoteservice.rest.synd.feature .... SKIPPED
[INFO] org.eclipse.ecf.remoteservice.soap.feature ......... SKIPPED
[INFO] org.eclipse.ecf.tests.feature ...................... SKIPPED
[INFO] org.eclipse.ecf.xmpp.feature ....................... SKIPPED
[INFO] ECF Target Platform Definitions .................... SKIPPED
[INFO] ECF p2 Repository .................................. SKIPPED
[INFO] ------------------------------------------------------------------------
[INFO] BUILD FAILURE
[INFO] ------------------------------------------------------------------------
[INFO] Total time: 12:10 h
[INFO] Finished at: 2017-03-23T05:20:08-04:00
[INFO] Final Memory: 196M/4402M
[INFO] ------------------------------------------------------------------------
[ERROR] Failed to execute goal org.eclipse.tycho:tycho-surefire-plugin:0.26.0:test (default-test) on project org.eclipse.ecf.tests.osgi.services.distribution.r-osgi: An unexpected error occured while launching the test runtime (return code -559038737). See log for details. -> [Help 1]
[ERROR] 
[ERROR] To see the full stack trace of the errors, re-run Maven with the -e switch.
[ERROR] Re-run Maven using the -X switch to enable full debug logging.
[ERROR] 
[ERROR] For more information about the errors and possible solutions, please read the following articles:
[ERROR] [Help 1] http://cwiki.apache.org/confluence/display/MAVEN/MojoFailureException
[ERROR] 
[ERROR] After correcting the problems, you can resume the build with the command
[ERROR]   mvn <goals> -rf :org.eclipse.ecf.tests.osgi.services.distribution.r-osgi
Build was aborted
Aborted by Mat Booth
channel stopped
Skipped archiving because build is not successful
Started calculate disk usage of build
Finished Calculation of disk usage of build in 0 seconds
Started calculate disk usage of workspace
Finished Calculation of disk usage of workspace in  3 second
Finished: ABORTED