FailedConsole Output

Skipping 967 KB.. Full Log
10-26T21:45:36.666Z] [INFO] Fetching org.apache.lucene.analyzers-smartcn_6.1.0.v20161115-1612.jar.pack.gz from http://download.eclipse.org/releases/oxygen/201804111000/plugins/ (3.42MB)
17:45:37 [2020-10-26T21:45:37.593Z] [INFO] Fetching org.eclipse.jdt.ui_3.13.100.v20180330-0726.jar.pack.gz from http://download.eclipse.org/releases/oxygen/201804111000/plugins/ (4.04MB)
17:45:37 [2020-10-26T21:45:37.593Z] [INFO] Fetching org.eclipse.jdt.ui_3.13.100.v20180330-0726.jar.pack.gz from http://download.eclipse.org/releases/oxygen/201804111000/plugins/ (4.04MB)
17:45:40 [2020-10-26T21:45:40.108Z] [INFO] Fetching org.eclipse.jdt.core_3.13.102.v20180330-0919.jar from http://download.eclipse.org/releases/oxygen/201804111000/plugins/ (6.44MB)
17:45:40 [2020-10-26T21:45:40.108Z] [INFO] Fetching org.eclipse.jdt.core_3.13.102.v20180330-0919.jar from http://download.eclipse.org/releases/oxygen/201804111000/plugins/ (6.44MB)
17:45:40 [2020-10-26T21:45:40.108Z] [INFO] Fetching org.objectweb.asm_6.0.0.v20180116-1719.jar.pack.gz from http://download.eclipse.org/releases/oxygen/201804111000/plugins/ (59.48kB)
17:45:40 [2020-10-26T21:45:40.108Z] [INFO] Fetching org.objectweb.asm_6.0.0.v20180116-1719.jar.pack.gz from http://download.eclipse.org/releases/oxygen/201804111000/plugins/ (59.48kB)
17:45:40 [2020-10-26T21:45:40.363Z] [INFO] Fetching org.eclipse.help.ui_4.1.0.v20170311-0931.jar.pack.gz from http://download.eclipse.org/releases/oxygen/201804111000/plugins/ (149.73kB)
17:45:40 [2020-10-26T21:45:40.363Z] [INFO] Fetching org.eclipse.help.ui_4.1.0.v20170311-0931.jar.pack.gz from http://download.eclipse.org/releases/oxygen/201804111000/plugins/ (149.73kB)
17:45:40 [2020-10-26T21:45:40.619Z] [INFO] Fetching org.eclipse.help.webapp_3.9.1.v20170816-0843.jar.pack.gz from http://download.eclipse.org/releases/oxygen/201804111000/plugins/ (239.54kB)
17:45:40 [2020-10-26T21:45:40.619Z] [INFO] Fetching org.eclipse.help.webapp_3.9.1.v20170816-0843.jar.pack.gz from http://download.eclipse.org/releases/oxygen/201804111000/plugins/ (239.54kB)
17:45:40 [2020-10-26T21:45:40.619Z] [INFO] Fetching org.eclipse.equinox.http.jetty_3.4.0.v20170503-2025.jar.pack.gz from http://download.eclipse.org/releases/oxygen/201804111000/plugins/ (15.83kB)
17:45:40 [2020-10-26T21:45:40.876Z] [INFO] Fetching org.eclipse.equinox.http.jetty_3.4.0.v20170503-2025.jar.pack.gz from http://download.eclipse.org/releases/oxygen/201804111000/plugins/ (15.83kB)
17:45:40 [2020-10-26T21:45:40.876Z] [INFO] Fetching org.eclipse.ui.browser_3.6.100.v20170418-1342.jar.pack.gz from http://download.eclipse.org/releases/oxygen/201804111000/plugins/ (96.68kB)
17:45:40 [2020-10-26T21:45:40.876Z] [INFO] Fetching org.eclipse.ui.browser_3.6.100.v20170418-1342.jar.pack.gz from http://download.eclipse.org/releases/oxygen/201804111000/plugins/ (96.68kB)
17:45:41 [2020-10-26T21:45:41.131Z] [INFO] Fetching org.eclipse.equinox.http.servlet_1.4.0.v20170524-1452.jar.pack.gz from http://download.eclipse.org/releases/oxygen/201804111000/plugins/ (67.86kB)
17:45:41 [2020-10-26T21:45:41.131Z] [INFO] Fetching org.eclipse.equinox.http.servlet_1.4.0.v20170524-1452.jar.pack.gz from http://download.eclipse.org/releases/oxygen/201804111000/plugins/ (67.86kB)
17:45:41 [2020-10-26T21:45:41.131Z] [INFO] Fetching org.eclipse.jetty.http_9.4.8.v20171121.jar.pack.gz from http://download.eclipse.org/releases/oxygen/201804111000/plugins/ (132.79kB)
17:45:41 [2020-10-26T21:45:41.131Z] [INFO] Fetching org.eclipse.jetty.http_9.4.8.v20171121.jar.pack.gz from http://download.eclipse.org/releases/oxygen/201804111000/plugins/ (132.79kB)
17:45:41 [2020-10-26T21:45:41.387Z] [INFO] Fetching org.eclipse.jetty.server_9.4.8.v20171121.jar.pack.gz from http://download.eclipse.org/releases/oxygen/201804111000/plugins/ (453.73kB)
17:45:41 [2020-10-26T21:45:41.387Z] [INFO] Fetching org.eclipse.jetty.server_9.4.8.v20171121.jar.pack.gz from http://download.eclipse.org/releases/oxygen/201804111000/plugins/ (453.73kB)
17:45:41 [2020-10-26T21:45:41.643Z] [INFO] Fetching org.eclipse.jetty.servlet_9.4.8.v20171121.jar.pack.gz from http://download.eclipse.org/releases/oxygen/201804111000/plugins/ (90.14kB)
17:45:41 [2020-10-26T21:45:41.643Z] [INFO] Fetching org.eclipse.jetty.servlet_9.4.8.v20171121.jar.pack.gz from http://download.eclipse.org/releases/oxygen/201804111000/plugins/ (90.14kB)
17:45:41 [2020-10-26T21:45:41.643Z] [INFO] Fetching org.eclipse.jetty.util_9.4.8.v20171121.jar.pack.gz from http://download.eclipse.org/releases/oxygen/201804111000/plugins/ (363.63kB)
17:45:41 [2020-10-26T21:45:41.643Z] [INFO] Fetching org.eclipse.jetty.util_9.4.8.v20171121.jar.pack.gz from http://download.eclipse.org/releases/oxygen/201804111000/plugins/ (363.63kB)
17:45:41 [2020-10-26T21:45:41.898Z] [INFO] Fetching org.eclipse.equinox.http.registry_1.1.400.v20150715-1528.jar.pack.gz from http://download.eclipse.org/releases/oxygen/201804111000/plugins/ (18.46kB)
17:45:41 [2020-10-26T21:45:41.898Z] [INFO] Fetching org.eclipse.equinox.http.registry_1.1.400.v20150715-1528.jar.pack.gz from http://download.eclipse.org/releases/oxygen/201804111000/plugins/ (18.46kB)
17:45:41 [2020-10-26T21:45:41.898Z] [INFO] Fetching org.eclipse.equinox.jsp.jasper_1.0.500.v20150119-1358.jar.pack.gz from http://download.eclipse.org/releases/oxygen/201804111000/plugins/ (13.34kB)
17:45:42 [2020-10-26T21:45:42.155Z] [INFO] Fetching org.eclipse.equinox.jsp.jasper_1.0.500.v20150119-1358.jar.pack.gz from http://download.eclipse.org/releases/oxygen/201804111000/plugins/ (13.34kB)
17:45:42 [2020-10-26T21:45:42.155Z] [INFO] Fetching org.eclipse.equinox.jsp.jasper.registry_1.0.300.v20130327-1442.jar.pack.gz from http://download.eclipse.org/releases/oxygen/201804111000/plugins/ (8.05kB)
17:45:42 [2020-10-26T21:45:42.155Z] [INFO] Fetching org.eclipse.equinox.jsp.jasper.registry_1.0.300.v20130327-1442.jar.pack.gz from http://download.eclipse.org/releases/oxygen/201804111000/plugins/ (8.05kB)
17:45:42 [2020-10-26T21:45:42.411Z] [INFO] Fetching org.eclipse.help.base_4.2.153.v20180330-0640.jar.pack.gz from http://download.eclipse.org/releases/oxygen/201804111000/plugins/ (161.68kB)
17:45:42 [2020-10-26T21:45:42.411Z] [INFO] Fetching org.eclipse.help.base_4.2.153.v20180330-0640.jar.pack.gz from http://download.eclipse.org/releases/oxygen/201804111000/plugins/ (161.68kB)
17:45:42 [2020-10-26T21:45:42.411Z] [INFO] Fetching org.eclipse.jdt.core.manipulation_1.9.100.v20180321-0831.jar.pack.gz from http://download.eclipse.org/releases/oxygen/201804111000/plugins/ (99.42kB)
17:45:42 [2020-10-26T21:45:42.666Z] [INFO] Fetching org.eclipse.jdt.core.manipulation_1.9.100.v20180321-0831.jar.pack.gz from http://download.eclipse.org/releases/oxygen/201804111000/plugins/ (99.42kB)
17:45:42 [2020-10-26T21:45:42.666Z] [INFO] Fetching org.eclipse.jdt.launching_3.9.100.v20180323-1351.jar.pack.gz from http://download.eclipse.org/releases/oxygen/201804111000/plugins/ (127.62kB)
17:45:42 [2020-10-26T21:45:42.666Z] [INFO] Fetching org.eclipse.jdt.launching_3.9.100.v20180323-1351.jar.pack.gz from http://download.eclipse.org/releases/oxygen/201804111000/plugins/ (127.62kB)
17:45:42 [2020-10-26T21:45:42.921Z] [INFO] Fetching org.eclipse.jdt.debug_3.11.50.v20170920-1717.jar.pack.gz from http://download.eclipse.org/releases/oxygen/201804111000/plugins/ (912.26kB)
17:45:42 [2020-10-26T21:45:42.921Z] [INFO] Fetching org.eclipse.jdt.debug_3.11.50.v20170920-1717.jar.pack.gz from http://download.eclipse.org/releases/oxygen/201804111000/plugins/ (912.26kB)
17:45:43 [2020-10-26T21:45:43.177Z] [INFO] Fetching org.eclipse.jetty.io_9.4.8.v20171121.jar.pack.gz from http://download.eclipse.org/releases/oxygen/201804111000/plugins/ (93.07kB)
17:45:43 [2020-10-26T21:45:43.177Z] [INFO] Fetching org.eclipse.jetty.io_9.4.8.v20171121.jar.pack.gz from http://download.eclipse.org/releases/oxygen/201804111000/plugins/ (93.07kB)
17:45:43 [2020-10-26T21:45:43.177Z] [INFO] Fetching org.eclipse.jetty.security_9.4.8.v20171121.jar.pack.gz from http://download.eclipse.org/releases/oxygen/201804111000/plugins/ (70.52kB)
17:45:43 [2020-10-26T21:45:43.177Z] [INFO] Fetching org.eclipse.jetty.security_9.4.8.v20171121.jar.pack.gz from http://download.eclipse.org/releases/oxygen/201804111000/plugins/ (70.52kB)
17:45:43 [2020-10-26T21:45:43.433Z] [WARNING] The following locally built units have been used to resolve project dependencies:
17:45:43 [2020-10-26T21:45:43.433Z] [WARNING]   org.eclipse.ease/0.8.0.I202010051129
17:45:43 [2020-10-26T21:45:43.433Z] [WARNING]   org.eclipse.ease.ui.completions.java/0.8.0.I202010061535
17:45:43 [2020-10-26T21:45:43.433Z] [WARNING]   org.eclipse.ease.ui/0.8.0.I202010061535
17:45:43 [2020-10-26T21:45:43.433Z] [WARNING]   org.eclipse.ease.classloader/0.8.0.I202010061535
17:45:43 [2020-10-26T21:45:43.433Z] [INFO] Resolving class path of MavenProject: org.eclipse.ease:org.eclipse.ease.ui.test:0.8.0-SNAPSHOT @ /home/jenkins/agent/workspace/ease.verify.core.target.oxygen/tests/org.eclipse.ease.ui.test/pom.xml
17:45:43 [2020-10-26T21:45:43.433Z] [WARNING] The project org.eclipse.ease:org.eclipse.ease.releng:pom:0.8.0-SNAPSHOT uses prerequisites which is only intended for maven-plugin projects but not for non maven-plugin projects. For such purposes you should use the maven-enforcer-plugin. See https://maven.apache.org/enforcer/enforcer-rules/requireMavenVersion.html
17:45:43 [2020-10-26T21:45:43.433Z] [WARNING] [jenkins-event-spy] Unexpected Maven project file name 'target-tests-pom.xml', problems may occur
17:45:43 [2020-10-26T21:45:43.433Z] [INFO] ------------------------------------------------------------------------
17:45:43 [2020-10-26T21:45:43.433Z] [INFO] Reactor Build Order:
17:45:43 [2020-10-26T21:45:43.433Z] [INFO] 
17:45:43 [2020-10-26T21:45:43.434Z] [INFO] org.eclipse.ease.releng                                            [pom]
17:45:43 [2020-10-26T21:45:43.434Z] [INFO] org.eclipse.ease.releng.target               [eclipse-target-definition]
17:45:43 [2020-10-26T21:45:43.434Z] [INFO] org.eclipse.ease.test                              [eclipse-test-plugin]
17:45:43 [2020-10-26T21:45:43.434Z] [INFO] org.eclipse.ease.lang.javascript.nashorn.test      [eclipse-test-plugin]
17:45:43 [2020-10-26T21:45:43.434Z] [INFO] org.eclipse.ease.lang.javascript.rhino.test        [eclipse-test-plugin]
17:45:43 [2020-10-26T21:45:43.434Z] [INFO] org.eclipse.ease.lang.javascript.test              [eclipse-test-plugin]
17:45:43 [2020-10-26T21:45:43.434Z] [INFO] org.eclipse.ease.lang.python.test                  [eclipse-test-plugin]
17:45:43 [2020-10-26T21:45:43.434Z] [INFO] org.eclipse.ease.lang.python.jython.test           [eclipse-test-plugin]
17:45:43 [2020-10-26T21:45:43.434Z] [INFO] org.eclipse.ease.lang.python.py4j.test             [eclipse-test-plugin]
17:45:43 [2020-10-26T21:45:43.434Z] [INFO] org.eclipse.ease.lang.scriptarchive.test           [eclipse-test-plugin]
17:45:43 [2020-10-26T21:45:43.434Z] [INFO] org.eclipse.ease.ui.test                           [eclipse-test-plugin]
17:45:43 [2020-10-26T21:45:43.434Z] [WARNING] [jenkins-event-spy] Unexpected Maven project file name 'target-tests-pom.xml', problems may occur
17:45:43 [2020-10-26T21:45:43.434Z] [INFO] 
17:45:43 [2020-10-26T21:45:43.434Z] [INFO] --------------< org.eclipse.ease:org.eclipse.ease.releng >--------------
17:45:43 [2020-10-26T21:45:43.434Z] [INFO] Building org.eclipse.ease.releng 0.8.0-SNAPSHOT                   [1/11]
17:45:43 [2020-10-26T21:45:43.434Z] [INFO] --------------------------------[ pom ]---------------------------------
17:45:43 [2020-10-26T21:45:43.434Z] [WARNING] [jenkins-event-spy] Unexpected Maven project file name 'target-tests-pom.xml', problems may occur
17:45:43 [2020-10-26T21:45:43.434Z] [INFO] 
17:45:43 [2020-10-26T21:45:43.434Z] [INFO] ----------< org.eclipse.ease:org.eclipse.ease.releng.target >-----------
17:45:43 [2020-10-26T21:45:43.434Z] [INFO] Building org.eclipse.ease.releng.target 0.8.0-SNAPSHOT            [2/11]
17:45:43 [2020-10-26T21:45:43.434Z] [INFO] ---------------------[ eclipse-target-definition ]----------------------
17:45:43 [2020-10-26T21:45:43.434Z] [INFO] 
17:45:43 [2020-10-26T21:45:43.434Z] [INFO] --- tycho-source-plugin:1.5.0:plugin-source (plugin-source) @ org.eclipse.ease.releng.target ---
17:45:43 [2020-10-26T21:45:43.434Z] [INFO] 
17:45:43 [2020-10-26T21:45:43.434Z] [INFO] --- tycho-packaging-plugin:1.5.0:package-target-definition (default-package-target-definition) @ org.eclipse.ease.releng.target ---
17:45:43 [2020-10-26T21:45:43.698Z] [INFO] 
17:45:43 [2020-10-26T21:45:43.698Z] [INFO] --- tycho-source-feature-plugin:1.5.0:source-feature (source-feature) @ org.eclipse.ease.releng.target ---
17:45:43 [2020-10-26T21:45:43.698Z] [INFO] 
17:45:43 [2020-10-26T21:45:43.698Z] [INFO] --- tycho-p2-plugin:1.5.0:p2-metadata (attached-p2-metadata) @ org.eclipse.ease.releng.target ---
17:45:43 [2020-10-26T21:45:43.698Z] [INFO] 
17:45:43 [2020-10-26T21:45:43.698Z] [INFO] ---------------< org.eclipse.ease:org.eclipse.ease.test >---------------
17:45:43 [2020-10-26T21:45:43.698Z] [INFO] Building org.eclipse.ease.test 0.8.0-SNAPSHOT                     [3/11]
17:45:43 [2020-10-26T21:45:43.698Z] [INFO] ------------------------[ eclipse-test-plugin ]-------------------------
17:45:43 [2020-10-26T21:45:43.698Z] [INFO] 
17:45:43 [2020-10-26T21:45:43.698Z] [INFO] --- tycho-packaging-plugin:1.5.0:build-qualifier (default-build-qualifier) @ org.eclipse.ease.test ---
17:45:43 [2020-10-26T21:45:43.698Z] [INFO] The project's OSGi version is 0.8.0.I201910171213
17:45:43 [2020-10-26T21:45:43.698Z] [INFO] 
17:45:43 [2020-10-26T21:45:43.698Z] [INFO] --- tycho-packaging-plugin:1.5.0:validate-id (default-validate-id) @ org.eclipse.ease.test ---
17:45:43 [2020-10-26T21:45:43.698Z] [INFO] 
17:45:43 [2020-10-26T21:45:43.698Z] [INFO] --- tycho-packaging-plugin:1.5.0:validate-version (default-validate-version) @ org.eclipse.ease.test ---
17:45:43 [2020-10-26T21:45:43.698Z] [INFO] 
17:45:43 [2020-10-26T21:45:43.698Z] [INFO] --- maven-resources-plugin:2.4.3:resources (default-resources) @ org.eclipse.ease.test ---
17:45:43 [2020-10-26T21:45:43.698Z] [INFO] Using 'UTF-8' encoding to copy filtered resources.
17:45:43 [2020-10-26T21:45:43.698Z] [INFO] skip non existing resourceDirectory /home/jenkins/agent/workspace/ease.verify.core.target.oxygen/tests/org.eclipse.ease.test/src/main/resources
17:45:43 [2020-10-26T21:45:43.698Z] [INFO] 
17:45:43 [2020-10-26T21:45:43.698Z] [INFO] --- tycho-compiler-plugin:1.5.0:compile (default-compile) @ org.eclipse.ease.test ---
17:45:43 [2020-10-26T21:45:43.995Z] [INFO] Nothing to compile - all classes are up to date
17:45:43 [2020-10-26T21:45:43.995Z] [INFO] 
17:45:43 [2020-10-26T21:45:43.995Z] [INFO] --- maven-resources-plugin:2.4.3:testResources (default-testResources) @ org.eclipse.ease.test ---
17:45:43 [2020-10-26T21:45:43.995Z] [INFO] Using 'UTF-8' encoding to copy filtered resources.
17:45:43 [2020-10-26T21:45:43.995Z] [INFO] skip non existing resourceDirectory /home/jenkins/agent/workspace/ease.verify.core.target.oxygen/tests/org.eclipse.ease.test/src/test/resources
17:45:43 [2020-10-26T21:45:43.995Z] [INFO] 
17:45:43 [2020-10-26T21:45:43.995Z] [INFO] --- tycho-source-plugin:1.5.0:plugin-source (plugin-source) @ org.eclipse.ease.test ---
17:45:43 [2020-10-26T21:45:43.995Z] [INFO] Building jar: /home/jenkins/agent/workspace/ease.verify.core.target.oxygen/tests/org.eclipse.ease.test/target/org.eclipse.ease.test-0.8.0-SNAPSHOT-sources.jar
17:45:43 [2020-10-26T21:45:43.995Z] [INFO] 
17:45:43 [2020-10-26T21:45:43.995Z] [INFO] --- target-platform-configuration:1.5.0:target-platform (default-target-platform) @ org.eclipse.ease.test ---
17:45:43 [2020-10-26T21:45:43.995Z] [INFO] 
17:45:43 [2020-10-26T21:45:43.996Z] [INFO] --- tycho-packaging-plugin:1.5.0:package-plugin (default-package-plugin) @ org.eclipse.ease.test ---
17:45:43 [2020-10-26T21:45:43.996Z] [INFO] Building jar: /home/jenkins/agent/workspace/ease.verify.core.target.oxygen/tests/org.eclipse.ease.test/target/org.eclipse.ease.test-0.8.0-SNAPSHOT.jar
17:45:44 [2020-10-26T21:45:44.250Z] [INFO] 
17:45:44 [2020-10-26T21:45:44.250Z] [INFO] --- tycho-p2-plugin:1.5.0:p2-metadata-default (default-p2-metadata-default) @ org.eclipse.ease.test ---
17:45:44 [2020-10-26T21:45:44.250Z] [INFO] 
17:45:44 [2020-10-26T21:45:44.251Z] [INFO] --- tycho-source-feature-plugin:1.5.0:source-feature (source-feature) @ org.eclipse.ease.test ---
17:45:44 [2020-10-26T21:45:44.251Z] [INFO] 
17:45:44 [2020-10-26T21:45:44.251Z] [INFO] --- tycho-p2-plugin:1.5.0:p2-metadata (attached-p2-metadata) @ org.eclipse.ease.test ---
17:45:44 [2020-10-26T21:45:44.251Z] [INFO] 
17:45:44 [2020-10-26T21:45:44.251Z] [INFO] --- tycho-surefire-plugin:1.5.0:test (default-test) @ org.eclipse.ease.test ---
17:45:44 [2020-10-26T21:45:44.251Z] [INFO] Expected eclipse log file: /home/jenkins/agent/workspace/ease.verify.core.target.oxygen/tests/org.eclipse.ease.test/target/work/data/.metadata/.log
17:45:44 [2020-10-26T21:45:44.251Z] [INFO] Command line:
17:45:44 [2020-10-26T21:45:44.251Z] 	[/opt/tools/java/openjdk/jdk-11/11.0.2+9/bin/java, -Dosgi.noShutdown=false, -Dosgi.os=linux, -Dosgi.ws=gtk, -Dosgi.arch=x86_64, -Dosgi.clean=true, -jar, /home/jenkins/.m2/repository/p2/osgi/bundle/org.eclipse.equinox.launcher/1.4.0.v20161219-1356/org.eclipse.equinox.launcher-1.4.0.v20161219-1356.jar, -data, /home/jenkins/agent/workspace/ease.verify.core.target.oxygen/tests/org.eclipse.ease.test/target/work/data, -install, /home/jenkins/agent/workspace/ease.verify.core.target.oxygen/tests/org.eclipse.ease.test/target/work, -configuration, /home/jenkins/agent/workspace/ease.verify.core.target.oxygen/tests/org.eclipse.ease.test/target/work/configuration, -application, org.eclipse.tycho.surefire.osgibooter.headlesstest, -testproperties, /home/jenkins/agent/workspace/ease.verify.core.target.oxygen/tests/org.eclipse.ease.test/target/surefire.properties]
17:45:44 [2020-10-26T21:45:44.251Z] Picked up JAVA_TOOL_OPTIONS: -Dmaven.ext.class.path="/home/jenkins/agent/workspace/ease.verify.core.target.oxygen@tmp/withMaven2e82bf04/pipeline-maven-spy.jar" -Dorg.jenkinsci.plugins.pipeline.maven.reportsFolder="/home/jenkins/agent/workspace/ease.verify.core.target.oxygen@tmp/withMaven2e82bf04" 
17:45:46 [2020-10-26T21:45:46.159Z] Running org.eclipse.ease.sign.SignatureHelperTest
17:45:46 [2020-10-26T21:45:46.159Z] Tests run: 1, Failures: 0, Errors: 0, Skipped: 0, Time elapsed: 0.024 s - in org.eclipse.ease.sign.SignatureHelperTest
17:45:46 [2020-10-26T21:45:46.159Z] certificateTest(org.eclipse.ease.sign.SignatureHelperTest)  Time elapsed: 0.007 s
17:45:46 [2020-10-26T21:45:46.159Z] Running org.eclipse.ease.sign.VerifySignatureTest
17:45:46 [2020-10-26T21:45:46.159Z] WARNING: An illegal reflective access operation has occurred
17:45:46 [2020-10-26T21:45:46.159Z] WARNING: Illegal reflective access by org.mockito.cglib.core.ReflectUtils$2 (file:/home/jenkins/.m2/repository/p2/osgi/bundle/org.mockito/1.9.5.v201605172210/org.mockito-1.9.5.v201605172210.jar) to method java.lang.ClassLoader.defineClass(java.lang.String,byte[],int,int,java.security.ProtectionDomain)
17:45:46 [2020-10-26T21:45:46.159Z] WARNING: Please consider reporting this to the maintainers of org.mockito.cglib.core.ReflectUtils$2
17:45:46 [2020-10-26T21:45:46.159Z] WARNING: Use --illegal-access=warn to enable warnings of further illegal reflective access operations
17:45:46 [2020-10-26T21:45:46.159Z] WARNING: All illegal access operations will be denied in a future release
17:45:46 [2020-10-26T21:45:46.159Z] Tests run: 1, Failures: 0, Errors: 0, Skipped: 0, Time elapsed: 0.06 s - in org.eclipse.ease.sign.VerifySignatureTest
17:45:46 [2020-10-26T21:45:46.159Z] testWithNonCodeParserScriptType(org.eclipse.ease.sign.VerifySignatureTest)  Time elapsed: 0.059 s
17:45:46 [2020-10-26T21:45:46.159Z] Running org.eclipse.ease.AbstractCodeFactoryTest
17:45:46 [2020-10-26T21:45:46.159Z] Tests run: 1, Failures: 0, Errors: 0, Skipped: 0, Time elapsed: 0.016 s - in org.eclipse.ease.AbstractCodeFactoryTest
17:45:46 [2020-10-26T21:45:46.159Z] createNewKeywordHeader(org.eclipse.ease.AbstractCodeFactoryTest)  Time elapsed: 0.016 s
17:45:46 [2020-10-26T21:45:46.159Z] Running org.eclipse.ease.adapters.ScriptableAdapterTest
17:45:46 [2020-10-26T21:45:46.159Z] Tests run: 5, Failures: 0, Errors: 0, Skipped: 0, Time elapsed: 0.071 s - in org.eclipse.ease.adapters.ScriptableAdapterTest
17:45:46 [2020-10-26T21:45:46.159Z] adaptURI(org.eclipse.ease.adapters.ScriptableAdapterTest)  Time elapsed: 0.067 s
17:45:46 [2020-10-26T21:45:46.159Z] adaptURL(org.eclipse.ease.adapters.ScriptableAdapterTest)  Time elapsed: 0.001 s
17:45:46 [2020-10-26T21:45:46.159Z] adaptWorkspaceFile(org.eclipse.ease.adapters.ScriptableAdapterTest)  Time elapsed: 0 s
17:45:46 [2020-10-26T21:45:46.159Z] getAdapterList(org.eclipse.ease.adapters.ScriptableAdapterTest)  Time elapsed: 0.001 s
17:45:46 [2020-10-26T21:45:46.159Z] adaptFilesystemFile(org.eclipse.ease.adapters.ScriptableAdapterTest)  Time elapsed: 0 s
17:45:46 [2020-10-26T21:45:46.159Z] Running org.eclipse.ease.tools.ResourceToolsTest
17:45:46 [2020-10-26T21:45:46.159Z] Tests run: 47, Failures: 0, Errors: 0, Skipped: 0, Time elapsed: 0.054 s - in org.eclipse.ease.tools.ResourceToolsTest
17:45:46 [2020-10-26T21:45:46.159Z] resolveScriptLocation(org.eclipse.ease.tools.ResourceToolsTest)  Time elapsed: 0.018 s
17:45:46 [2020-10-26T21:45:46.159Z] getWorkspaceInputStream(org.eclipse.ease.tools.ResourceToolsTest)  Time elapsed: 0 s
17:45:46 [2020-10-26T21:45:46.159Z] resolvePlatformURI(org.eclipse.ease.tools.ResourceToolsTest)  Time elapsed: 0 s
17:45:46 [2020-10-26T21:45:46.159Z] resolveScriptLocationWithSpacesInPath(org.eclipse.ease.tools.ResourceToolsTest)  Time elapsed: 0.003 s
17:45:46 [2020-10-26T21:45:46.159Z] resolveURL(org.eclipse.ease.tools.ResourceToolsTest)  Time elapsed: 0 s
17:45:46 [2020-10-26T21:45:46.159Z] invalidIsAbsolute(org.eclipse.ease.tools.ResourceToolsTest)  Time elapsed: 0 s
17:45:46 [2020-10-26T21:45:46.159Z] getFilesystemInputStream(org.eclipse.ease.tools.ResourceToolsTest)  Time elapsed: 0.001 s
17:45:46 [2020-10-26T21:45:46.159Z] toRelativeLocationInWorkspace(org.eclipse.ease.tools.ResourceToolsTest)  Time elapsed: 0 s
17:45:46 [2020-10-26T21:45:46.159Z] checkOperatingSystem(org.eclipse.ease.tools.ResourceToolsTest)  Time elapsed: 0 s
17:45:46 [2020-10-26T21:45:46.159Z] inputStreamToString(org.eclipse.ease.tools.ResourceToolsTest)  Time elapsed: 0 s
17:45:46 [2020-10-26T21:45:46.159Z] fileSystemToAbsoluteLocationOnLinux(org.eclipse.ease.tools.ResourceToolsTest)  Time elapsed: 0 s
17:45:46 [2020-10-26T21:45:46.159Z] exists(org.eclipse.ease.tools.ResourceToolsTest)  Time elapsed: 0 s
17:45:46 [2020-10-26T21:45:46.159Z] resolveRelativeInWorkspace(org.eclipse.ease.tools.ResourceToolsTest)  Time elapsed: 0 s
17:45:46 [2020-10-26T21:45:46.159Z] isFile(org.eclipse.ease.tools.ResourceToolsTest)  Time elapsed: 0 s
17:45:46 [2020-10-26T21:45:46.159Z] invalidToFile(org.eclipse.ease.tools.ResourceToolsTest)  Time elapsed: 0.001 s
17:45:46 [2020-10-26T21:45:46.159Z] resolveAbsoluteInFileSystem(org.eclipse.ease.tools.ResourceToolsTest)  Time elapsed: 0 s
17:45:46 [2020-10-26T21:45:46.159Z] resolveWindowsRoot(org.eclipse.ease.tools.ResourceToolsTest)  Time elapsed: 0 s
17:45:46 [2020-10-26T21:45:46.159Z] resolveRelativeInFileSystemOnWindows(org.eclipse.ease.tools.ResourceToolsTest)  Time elapsed: 0.001 s
17:45:46 [2020-10-26T21:45:46.159Z] isAbsoluteFileSystemPathOnWindows(org.eclipse.ease.tools.ResourceToolsTest)  Time elapsed: 0 s
17:45:46 [2020-10-26T21:45:46.159Z] readerToString(org.eclipse.ease.tools.ResourceToolsTest)  Time elapsed: 0 s
17:45:46 [2020-10-26T21:45:46.159Z] workspaceFileToString(org.eclipse.ease.tools.ResourceToolsTest)  Time elapsed: 0 s
17:45:46 [2020-10-26T21:45:46.159Z] toFile(org.eclipse.ease.tools.ResourceToolsTest)  Time elapsed: 0 s
17:45:46 [2020-10-26T21:45:46.159Z] toProjectRelativeLocation(org.eclipse.ease.tools.ResourceToolsTest)  Time elapsed: 0.001 s
17:45:46 [2020-10-26T21:45:46.159Z] getInvalidInputStream(org.eclipse.ease.tools.ResourceToolsTest)  Time elapsed: 0.003 s
17:45:46 [2020-10-26T21:45:46.159Z] resolveRelativeInFileSystemOnLinux(org.eclipse.ease.tools.ResourceToolsTest)  Time elapsed: 0 s
17:45:46 [2020-10-26T21:45:46.159Z] isFolder(org.eclipse.ease.tools.ResourceToolsTest)  Time elapsed: 0 s
17:45:46 [2020-10-26T21:45:46.159Z] fileSystemToAbsoluteLocationOnWindows(org.eclipse.ease.tools.ResourceToolsTest)  Time elapsed: 0 s
17:45:46 [2020-10-26T21:45:46.159Z] isAbsoluteWorkspacePath(org.eclipse.ease.tools.ResourceToolsTest)  Time elapsed: 0 s
17:45:46 [2020-10-26T21:45:46.159Z] isAbsoluteFileSystemPathOnLinux(org.eclipse.ease.tools.ResourceToolsTest)  Time elapsed: 0 s
17:45:46 [2020-10-26T21:45:46.159Z] resolveInvalid(org.eclipse.ease.tools.ResourceToolsTest)  Time elapsed: 0 s
17:45:46 [2020-10-26T21:45:46.159Z] resolveAbsoluteInFileSystemOnWindows(org.eclipse.ease.tools.ResourceToolsTest)  Time elapsed: 0 s
17:45:46 [2020-10-26T21:45:46.160Z] resolveScriptLocationWithSpacesInDomain(org.eclipse.ease.tools.ResourceToolsTest)  Time elapsed: 0 s
17:45:46 [2020-10-26T21:45:46.160Z] resolveRelativefromWorkspaceToFilesystem(org.eclipse.ease.tools.ResourceToolsTest)  Time elapsed: 0 s
17:45:46 [2020-10-26T21:45:46.160Z] resolveRelativeWithoutBaseFile(org.eclipse.ease.tools.ResourceToolsTest)  Time elapsed: 0 s
17:45:46 [2020-10-26T21:45:46.160Z] resolveInWorkspace(org.eclipse.ease.tools.ResourceToolsTest)  Time elapsed: 0.001 s
17:45:46 [2020-10-26T21:45:46.160Z] resolveScriptLocationWithSpecialCharactersInPath(org.eclipse.ease.tools.ResourceToolsTest)  Time elapsed: 0 s
17:45:46 [2020-10-26T21:45:46.160Z] filesystemFileToString(org.eclipse.ease.tools.ResourceToolsTest)  Time elapsed: 0 s
17:45:46 [2020-10-26T21:45:46.160Z] createURI(org.eclipse.ease.tools.ResourceToolsTest)  Time elapsed: 0 s
17:45:46 [2020-10-26T21:45:46.160Z] uriToAbsoluteLocation(org.eclipse.ease.tools.ResourceToolsTest)  Time elapsed: 0 s
17:45:46 [2020-10-26T21:45:46.160Z] createFolder(org.eclipse.ease.tools.ResourceToolsTest)  Time elapsed: 0.004 s
17:45:46 [2020-10-26T21:45:46.160Z] workspaceToAbsoluteLocation(org.eclipse.ease.tools.ResourceToolsTest)  Time elapsed: 0 s
17:45:46 [2020-10-26T21:45:46.160Z] resolveAbsoluteInFileSystemOnLinux(org.eclipse.ease.tools.ResourceToolsTest)  Time elapsed: 0 s
17:45:46 [2020-10-26T21:45:46.160Z] invalidToString(org.eclipse.ease.tools.ResourceToolsTest)  Time elapsed: 0 s
17:45:46 [2020-10-26T21:45:46.160Z] resolveRelativeURIs(org.eclipse.ease.tools.ResourceToolsTest)  Time elapsed: 0.001 s
17:45:46 [2020-10-26T21:45:46.160Z] resolveRelativeInFileSystem(org.eclipse.ease.tools.ResourceToolsTest)  Time elapsed: 0 s
17:45:46 [2020-10-26T21:45:46.160Z] resolveScriptLocationWithSpecialCharactersInDomain(org.eclipse.ease.tools.ResourceToolsTest)  Time elapsed: 0.003 s
17:45:46 [2020-10-26T21:45:46.160Z] isAbsoluteURL(org.eclipse.ease.tools.ResourceToolsTest)  Time elapsed: 0 s
17:45:46 [2020-10-26T21:45:46.160Z] Running org.eclipse.ease.tools.RunnableWithResultTest
17:45:46 [2020-10-26T21:45:46.160Z] Tests run: 2, Failures: 0, Errors: 0, Skipped: 0, Time elapsed: 0.001 s - in org.eclipse.ease.tools.RunnableWithResultTest
17:45:46 [2020-10-26T21:45:46.160Z] testException(org.eclipse.ease.tools.RunnableWithResultTest)  Time elapsed: 0 s
17:45:46 [2020-10-26T21:45:46.160Z] testResult(org.eclipse.ease.tools.RunnableWithResultTest)  Time elapsed: 0 s
17:45:46 [2020-10-26T21:45:46.160Z] Running org.eclipse.ease.tools.StringToolsTest
17:45:46 [2020-10-26T21:45:46.160Z] Tests run: 8, Failures: 0, Errors: 0, Skipped: 0, Time elapsed: 0.003 s - in org.eclipse.ease.tools.StringToolsTest
17:45:46 [2020-10-26T21:45:46.160Z] parseArgumentsNull(org.eclipse.ease.tools.StringToolsTest)  Time elapsed: 0.001 s
17:45:46 [2020-10-26T21:45:46.160Z] parseArgumentsQuotedSingle(org.eclipse.ease.tools.StringToolsTest)  Time elapsed: 0 s
17:45:46 [2020-10-26T21:45:46.160Z] parseArgumentsEmpty(org.eclipse.ease.tools.StringToolsTest)  Time elapsed: 0 s
17:45:46 [2020-10-26T21:45:46.160Z] parseArgumentsMixedMultiple(org.eclipse.ease.tools.StringToolsTest)  Time elapsed: 0 s
17:45:46 [2020-10-26T21:45:46.160Z] parseArgumentsMixedMultipleLines(org.eclipse.ease.tools.StringToolsTest)  Time elapsed: 0.001 s
17:45:46 [2020-10-26T21:45:46.160Z] parseArgumentsNonQuotedMultiple(org.eclipse.ease.tools.StringToolsTest)  Time elapsed: 0 s
17:45:46 [2020-10-26T21:45:46.160Z] parseArgumentsNonQuotedSingle(org.eclipse.ease.tools.StringToolsTest)  Time elapsed: 0 s
17:45:46 [2020-10-26T21:45:46.160Z] parseArgumentsQuotedMultiple(org.eclipse.ease.tools.StringToolsTest)  Time elapsed: 0 s
17:45:46 [2020-10-26T21:45:46.160Z] Running org.eclipse.ease.ScriptTest
17:45:46 [2020-10-26T21:45:46.160Z] Tests run: 13, Failures: 0, Errors: 0, Skipped: 0, Time elapsed: 0.009 s - in org.eclipse.ease.ScriptTest
17:45:46 [2020-10-26T21:45:46.160Z] codeFromScriptable(org.eclipse.ease.ScriptTest)  Time elapsed: 0.005 s
17:45:46 [2020-10-26T21:45:46.160Z] codeFromFilesystemFile(org.eclipse.ease.ScriptTest)  Time elapsed: 0.001 s
17:45:46 [2020-10-26T21:45:46.160Z] getCodeStream(org.eclipse.ease.ScriptTest)  Time elapsed: 0 s
17:45:46 [2020-10-26T21:45:46.160Z] getFile(org.eclipse.ease.ScriptTest)  Time elapsed: 0 s
17:45:46 [2020-10-26T21:45:46.160Z] codeFromStringBuilder(org.eclipse.ease.ScriptTest)  Time elapsed: 0 s
17:45:46 [2020-10-26T21:45:46.160Z] getResult(org.eclipse.ease.ScriptTest)  Time elapsed: 0 s
17:45:46 [2020-10-26T21:45:46.160Z] getException(org.eclipse.ease.ScriptTest)  Time elapsed: 0 s
17:45:46 [2020-10-26T21:45:46.160Z] codeFromWorkspaceFile(org.eclipse.ease.ScriptTest)  Time elapsed: 0 s
17:45:46 [2020-10-26T21:45:46.160Z] codeFromInputStream(org.eclipse.ease.ScriptTest)  Time elapsed: 0 s
17:45:46 [2020-10-26T21:45:46.160Z] getTitle(org.eclipse.ease.ScriptTest)  Time elapsed: 0 s
17:45:46 [2020-10-26T21:45:46.160Z] getCommand(org.eclipse.ease.ScriptTest)  Time elapsed: 0 s
17:45:46 [2020-10-26T21:45:46.160Z] codeFromReader(org.eclipse.ease.ScriptTest)  Time elapsed: 0 s
17:45:46 [2020-10-26T21:45:46.160Z] codeFromString(org.eclipse.ease.ScriptTest)  Time elapsed: 0 s
17:45:46 [2020-10-26T21:45:46.160Z] Running org.eclipse.ease.AbstractScriptEngineTest
17:45:51 [2020-10-26T21:45:51.404Z] testorg.eclipse.ease.ScriptExecutionException: Engine got terminated
17:45:52 [2020-10-26T21:45:52.331Z] java.lang.RuntimeException: ERROR
17:45:52 [2020-10-26T21:45:52.331Z] 	at org.eclipse.ease.AbstractScriptEngineTest$MockedScriptEngine.execute(AbstractScriptEngineTest.java:73)
17:45:52 [2020-10-26T21:45:52.331Z] 	at org.eclipse.ease.AbstractScriptEngine.inject(AbstractScriptEngine.java:224)
17:45:52 [2020-10-26T21:45:52.331Z] 	at org.eclipse.ease.AbstractScriptEngine.run(AbstractScriptEngine.java:274)
17:45:52 [2020-10-26T21:45:52.331Z] 	at org.eclipse.core.internal.jobs.Worker.run(Worker.java:56)
17:45:53 [2020-10-26T21:45:53.257Z] 1Tests run: 17, Failures: 0, Errors: 0, Skipped: 0, Time elapsed: 7.022 s - in org.eclipse.ease.AbstractScriptEngineTest
17:45:53 [2020-10-26T21:45:53.257Z] extractEmptyArguments(org.eclipse.ease.AbstractScriptEngineTest)  Time elapsed: 0.001 s
17:45:53 [2020-10-26T21:45:53.257Z] setNotNullOutputStream(org.eclipse.ease.AbstractScriptEngineTest)  Time elapsed: 0 s
17:45:53 [2020-10-26T21:45:53.257Z] terminateViaMonitorCancellation(org.eclipse.ease.AbstractScriptEngineTest)  Time elapsed: 1.205 s
17:45:53 [2020-10-26T21:45:53.257Z] inject(org.eclipse.ease.AbstractScriptEngineTest)  Time elapsed: 0.001 s
17:45:53 [2020-10-26T21:45:53.257Z] extractArguments(org.eclipse.ease.AbstractScriptEngineTest)  Time elapsed: 0 s
17:45:53 [2020-10-26T21:45:53.257Z] executeSync(org.eclipse.ease.AbstractScriptEngineTest)  Time elapsed: 1.001 s
17:45:53 [2020-10-26T21:45:53.257Z] setNotNullErrorStream(org.eclipse.ease.AbstractScriptEngineTest)  Time elapsed: 0.001 s
17:45:53 [2020-10-26T21:45:53.257Z] setNullErrorStream(org.eclipse.ease.AbstractScriptEngineTest)  Time elapsed: 0 s
17:45:53 [2020-10-26T21:45:53.257Z] isJob(org.eclipse.ease.AbstractScriptEngineTest)  Time elapsed: 0 s
17:45:53 [2020-10-26T21:45:53.257Z] streamsAvailable(org.eclipse.ease.AbstractScriptEngineTest)  Time elapsed: 0 s
17:45:53 [2020-10-26T21:45:53.257Z] executeValidCodeAndTerminate(org.eclipse.ease.AbstractScriptEngineTest)  Time elapsed: 1.001 s
17:45:53 [2020-10-26T21:45:53.257Z] setNullOutputStream(org.eclipse.ease.AbstractScriptEngineTest)  Time elapsed: 0 s
17:45:53 [2020-10-26T21:45:53.257Z] terminateMultipleTimes(org.eclipse.ease.AbstractScriptEngineTest)  Time elapsed: 0.602 s
17:45:53 [2020-10-26T21:45:53.257Z] engineTerminatesWhenIdle(org.eclipse.ease.AbstractScriptEngineTest)  Time elapsed: 1.001 s
17:45:53 [2020-10-26T21:45:53.257Z] terminateViaTerminateMethod(org.eclipse.ease.AbstractScriptEngineTest)  Time elapsed: 0.202 s
17:45:53 [2020-10-26T21:45:53.257Z] terminateViaMethodCallback(org.eclipse.ease.AbstractScriptEngineTest)  Time elapsed: 1.002 s
17:45:53 [2020-10-26T21:45:53.258Z] executeErrorCodeAndTerminate(org.eclipse.ease.AbstractScriptEngineTest)  Time elapsed: 1.002 s
17:45:53 [2020-10-26T21:45:53.258Z] Running org.eclipse.ease.ScriptResultTest
17:45:53 [2020-10-26T21:45:53.258Z] Tests run: 4, Failures: 0, Errors: 0, Skipped: 0, Time elapsed: 0.001 s - in org.eclipse.ease.ScriptResultTest
17:45:53 [2020-10-26T21:45:53.258Z] hasException(org.eclipse.ease.ScriptResultTest)  Time elapsed: 0 s
17:45:53 [2020-10-26T21:45:53.258Z] getResult(org.eclipse.ease.ScriptResultTest)  Time elapsed: 0 s
17:45:53 [2020-10-26T21:45:53.258Z] getException(org.eclipse.ease.ScriptResultTest)  Time elapsed: 0 s
17:45:53 [2020-10-26T21:45:53.258Z] isReady(org.eclipse.ease.ScriptResultTest)  Time elapsed: 0 s
17:45:53 [2020-10-26T21:45:53.258Z] Running org.eclipse.ease.AbstractCodeParserTest
17:45:53 [2020-10-26T21:45:53.258Z] Tests run: 5, Failures: 0, Errors: 0, Skipped: 0, Time elapsed: 0.001 s - in org.eclipse.ease.AbstractCodeParserTest
17:45:53 [2020-10-26T21:45:53.258Z] parseCode(org.eclipse.ease.AbstractCodeParserTest)  Time elapsed: 0 s
17:45:53 [2020-10-26T21:45:53.258Z] parseLineHeader(org.eclipse.ease.AbstractCodeParserTest)  Time elapsed: 0 s
17:45:53 [2020-10-26T21:45:53.258Z] parseBlockAfterWhitespace(org.eclipse.ease.AbstractCodeParserTest)  Time elapsed: 0 s
17:45:53 [2020-10-26T21:45:53.258Z] parseEmpty(org.eclipse.ease.AbstractCodeParserTest)  Time elapsed: 0 s
17:45:53 [2020-10-26T21:45:53.258Z] parseBlockHeader(org.eclipse.ease.AbstractCodeParserTest)  Time elapsed: 0 s
17:45:53 [2020-10-26T21:45:53.258Z] Running org.eclipse.ease.AbstractReplScriptEngineTest
17:45:58 [2020-10-26T21:45:58.500Z] testorg.eclipse.ease.ScriptExecutionException: Engine got terminated
17:45:58 [2020-10-26T21:45:58.500Z] java.lang.RuntimeException: ERROR
17:45:58 [2020-10-26T21:45:58.500Z] 	at org.eclipse.ease.AbstractReplScriptEngineTest$MockedScriptEngine.execute(AbstractReplScriptEngineTest.java:61)
17:45:58 [2020-10-26T21:45:58.500Z] 	at org.eclipse.ease.AbstractScriptEngine.inject(AbstractScriptEngine.java:224)
17:45:58 [2020-10-26T21:45:58.500Z] 	at org.eclipse.ease.AbstractScriptEngine.run(AbstractScriptEngine.java:274)
17:45:58 [2020-10-26T21:45:58.500Z] 	at org.eclipse.core.internal.jobs.Worker.run(Worker.java:56)
17:45:59 [2020-10-26T21:45:59.061Z] Hello worldHello world1Tests run: 20, Failures: 0, Errors: 0, Skipped: 0, Time elapsed: 5.652 s - in org.eclipse.ease.AbstractReplScriptEngineTest
17:45:59 [2020-10-26T21:45:59.061Z] terminateOnIdleAfterSchedule(org.eclipse.ease.AbstractReplScriptEngineTest)  Time elapsed: 0.025 s
17:45:59 [2020-10-26T21:45:59.061Z] terminateEngine(org.eclipse.ease.AbstractReplScriptEngineTest)  Time elapsed: 1.001 s
17:45:59 [2020-10-26T21:45:59.061Z] keepRunningOnIdle(org.eclipse.ease.AbstractReplScriptEngineTest)  Time elapsed: 1.001 s
17:45:59 [2020-10-26T21:45:59.061Z] extractEmptyArguments(org.eclipse.ease.AbstractReplScriptEngineTest)  Time elapsed: 0.001 s
17:45:59 [2020-10-26T21:45:59.061Z] setNotNullOutputStream(org.eclipse.ease.AbstractReplScriptEngineTest)  Time elapsed: 0 s
17:45:59 [2020-10-26T21:45:59.061Z] terminateViaMonitorCancellation(org.eclipse.ease.AbstractReplScriptEngineTest)  Time elapsed: 0.102 s
17:45:59 [2020-10-26T21:45:59.061Z] inject(org.eclipse.ease.AbstractReplScriptEngineTest)  Time elapsed: 0.001 s
17:45:59 [2020-10-26T21:45:59.061Z] extractArguments(org.eclipse.ease.AbstractReplScriptEngineTest)  Time elapsed: 0 s
17:45:59 [2020-10-26T21:45:59.061Z] executeSync(org.eclipse.ease.AbstractReplScriptEngineTest)  Time elapsed: 0.001 s
17:45:59 [2020-10-26T21:45:59.061Z] setNotNullErrorStream(org.eclipse.ease.AbstractReplScriptEngineTest)  Time elapsed: 0 s
17:45:59 [2020-10-26T21:45:59.061Z] setNullErrorStream(org.eclipse.ease.AbstractReplScriptEngineTest)  Time elapsed: 0 s
17:45:59 [2020-10-26T21:45:59.061Z] isJob(org.eclipse.ease.AbstractReplScriptEngineTest)  Time elapsed: 0 s
17:45:59 [2020-10-26T21:45:59.061Z] streamsAvailable(org.eclipse.ease.AbstractReplScriptEngineTest)  Time elapsed: 0 s
17:45:59 [2020-10-26T21:45:59.061Z] executeValidCodeAndTerminate(org.eclipse.ease.AbstractReplScriptEngineTest)  Time elapsed: 1.001 s
17:45:59 [2020-10-26T21:45:59.061Z] setNullOutputStream(org.eclipse.ease.AbstractReplScriptEngineTest)  Time elapsed: 0 s
17:45:59 [2020-10-26T21:45:59.061Z] terminateMultipleTimes(org.eclipse.ease.AbstractReplScriptEngineTest)  Time elapsed: 0.302 s
17:45:59 [2020-10-26T21:45:59.061Z] engineTerminatesWhenIdle(org.eclipse.ease.AbstractReplScriptEngineTest)  Time elapsed: 1.001 s
17:45:59 [2020-10-26T21:45:59.061Z] terminateViaTerminateMethod(org.eclipse.ease.AbstractReplScriptEngineTest)  Time elapsed: 0.202 s
17:45:59 [2020-10-26T21:45:59.061Z] terminateViaMethodCallback(org.eclipse.ease.AbstractReplScriptEngineTest)  Time elapsed: 0.001 s
17:45:59 [2020-10-26T21:45:59.061Z] executeErrorCodeAndTerminate(org.eclipse.ease.AbstractReplScriptEngineTest)  Time elapsed: 1.002 s
17:45:59 [2020-10-26T21:45:59.061Z] 
17:45:59 [2020-10-26T21:45:59.061Z] Results:
17:45:59 [2020-10-26T21:45:59.061Z] 
17:45:59 [2020-10-26T21:45:59.061Z] Tests run: 124, Failures: 0, Errors: 0, Skipped: 0
17:45:59 [2020-10-26T21:45:59.061Z] 
17:45:59 [2020-10-26T21:45:59.316Z] [INFO] All tests passed!
17:45:59 [2020-10-26T21:45:59.316Z] [INFO] 
17:45:59 [2020-10-26T21:45:59.316Z] [INFO] ---< org.eclipse.ease:org.eclipse.ease.lang.javascript.nashorn.test >---
17:45:59 [2020-10-26T21:45:59.316Z] [INFO] Building org.eclipse.ease.lang.javascript.nashorn.test 0.8.0-SNAPSHOT [4/11]
17:45:59 [2020-10-26T21:45:59.316Z] [INFO] ------------------------[ eclipse-test-plugin ]-------------------------
17:45:59 [2020-10-26T21:45:59.316Z] [INFO] 
17:45:59 [2020-10-26T21:45:59.316Z] [INFO] --- tycho-packaging-plugin:1.5.0:build-qualifier (default-build-qualifier) @ org.eclipse.ease.lang.javascript.nashorn.test ---
17:45:59 [2020-10-26T21:45:59.316Z] [INFO] The project's OSGi version is 0.8.0.I201910171213
17:45:59 [2020-10-26T21:45:59.316Z] [INFO] 
17:45:59 [2020-10-26T21:45:59.316Z] [INFO] --- tycho-packaging-plugin:1.5.0:validate-id (default-validate-id) @ org.eclipse.ease.lang.javascript.nashorn.test ---
17:45:59 [2020-10-26T21:45:59.316Z] [INFO] 
17:45:59 [2020-10-26T21:45:59.316Z] [INFO] --- tycho-packaging-plugin:1.5.0:validate-version (default-validate-version) @ org.eclipse.ease.lang.javascript.nashorn.test ---
17:45:59 [2020-10-26T21:45:59.316Z] [INFO] 
17:45:59 [2020-10-26T21:45:59.316Z] [INFO] --- maven-resources-plugin:2.4.3:resources (default-resources) @ org.eclipse.ease.lang.javascript.nashorn.test ---
17:45:59 [2020-10-26T21:45:59.316Z] [INFO] Using 'UTF-8' encoding to copy filtered resources.
17:45:59 [2020-10-26T21:45:59.316Z] [INFO] skip non existing resourceDirectory /home/jenkins/agent/workspace/ease.verify.core.target.oxygen/tests/org.eclipse.ease.lang.javascript.nashorn.test/src/main/resources
17:45:59 [2020-10-26T21:45:59.316Z] [INFO] 
17:45:59 [2020-10-26T21:45:59.316Z] [INFO] --- tycho-compiler-plugin:1.5.0:compile (default-compile) @ org.eclipse.ease.lang.javascript.nashorn.test ---
17:45:59 [2020-10-26T21:45:59.316Z] [INFO] Nothing to compile - all classes are up to date
17:45:59 [2020-10-26T21:45:59.316Z] [INFO] 
17:45:59 [2020-10-26T21:45:59.316Z] [INFO] --- maven-resources-plugin:2.4.3:testResources (default-testResources) @ org.eclipse.ease.lang.javascript.nashorn.test ---
17:45:59 [2020-10-26T21:45:59.317Z] [INFO] Using 'UTF-8' encoding to copy filtered resources.
17:45:59 [2020-10-26T21:45:59.317Z] [INFO] skip non existing resourceDirectory /home/jenkins/agent/workspace/ease.verify.core.target.oxygen/tests/org.eclipse.ease.lang.javascript.nashorn.test/src/test/resources
17:45:59 [2020-10-26T21:45:59.317Z] [INFO] 
17:45:59 [2020-10-26T21:45:59.317Z] [INFO] --- tycho-source-plugin:1.5.0:plugin-source (plugin-source) @ org.eclipse.ease.lang.javascript.nashorn.test ---
17:45:59 [2020-10-26T21:45:59.317Z] [WARNING] Bundle-Vendor header not found in /home/jenkins/agent/workspace/ease.verify.core.target.oxygen/tests/org.eclipse.ease.lang.javascript.nashorn.test/META-INF/MANIFEST.MF, fallback to 'unknown' for source bundle
17:45:59 [2020-10-26T21:45:59.317Z] [INFO] Building jar: /home/jenkins/agent/workspace/ease.verify.core.target.oxygen/tests/org.eclipse.ease.lang.javascript.nashorn.test/target/org.eclipse.ease.lang.javascript.nashorn.test-0.8.0-SNAPSHOT-sources.jar
17:45:59 [2020-10-26T21:45:59.317Z] [INFO] 
17:45:59 [2020-10-26T21:45:59.317Z] [INFO] --- target-platform-configuration:1.5.0:target-platform (default-target-platform) @ org.eclipse.ease.lang.javascript.nashorn.test ---
17:45:59 [2020-10-26T21:45:59.317Z] [INFO] 
17:45:59 [2020-10-26T21:45:59.317Z] [INFO] --- tycho-packaging-plugin:1.5.0:package-plugin (default-package-plugin) @ org.eclipse.ease.lang.javascript.nashorn.test ---
17:45:59 [2020-10-26T21:45:59.317Z] [INFO] Building jar: /home/jenkins/agent/workspace/ease.verify.core.target.oxygen/tests/org.eclipse.ease.lang.javascript.nashorn.test/target/org.eclipse.ease.lang.javascript.nashorn.test-0.8.0-SNAPSHOT.jar
17:45:59 [2020-10-26T21:45:59.317Z] [INFO] 
17:45:59 [2020-10-26T21:45:59.317Z] [INFO] --- tycho-p2-plugin:1.5.0:p2-metadata-default (default-p2-metadata-default) @ org.eclipse.ease.lang.javascript.nashorn.test ---
17:45:59 [2020-10-26T21:45:59.573Z] [INFO] 
17:45:59 [2020-10-26T21:45:59.573Z] [INFO] --- tycho-source-feature-plugin:1.5.0:source-feature (source-feature) @ org.eclipse.ease.lang.javascript.nashorn.test ---
17:45:59 [2020-10-26T21:45:59.573Z] [INFO] 
17:45:59 [2020-10-26T21:45:59.573Z] [INFO] --- tycho-p2-plugin:1.5.0:p2-metadata (attached-p2-metadata) @ org.eclipse.ease.lang.javascript.nashorn.test ---
17:45:59 [2020-10-26T21:45:59.573Z] [INFO] 
17:45:59 [2020-10-26T21:45:59.573Z] [INFO] --- tycho-surefire-plugin:1.5.0:test (default-test) @ org.eclipse.ease.lang.javascript.nashorn.test ---
17:45:59 [2020-10-26T21:45:59.573Z] [INFO] Expected eclipse log file: /home/jenkins/agent/workspace/ease.verify.core.target.oxygen/tests/org.eclipse.ease.lang.javascript.nashorn.test/target/work/data/.metadata/.log
17:45:59 [2020-10-26T21:45:59.573Z] [INFO] Command line:
17:45:59 [2020-10-26T21:45:59.573Z] 	[/opt/tools/java/openjdk/jdk-11/11.0.2+9/bin/java, -Dosgi.noShutdown=false, -Dosgi.os=linux, -Dosgi.ws=gtk, -Dosgi.arch=x86_64, -Dosgi.clean=true, -jar, /home/jenkins/.m2/repository/p2/osgi/bundle/org.eclipse.equinox.launcher/1.4.0.v20161219-1356/org.eclipse.equinox.launcher-1.4.0.v20161219-1356.jar, -data, /home/jenkins/agent/workspace/ease.verify.core.target.oxygen/tests/org.eclipse.ease.lang.javascript.nashorn.test/target/work/data, -install, /home/jenkins/agent/workspace/ease.verify.core.target.oxygen/tests/org.eclipse.ease.lang.javascript.nashorn.test/target/work, -configuration, /home/jenkins/agent/workspace/ease.verify.core.target.oxygen/tests/org.eclipse.ease.lang.javascript.nashorn.test/target/work/configuration, -application, org.eclipse.tycho.surefire.osgibooter.headlesstest, -testproperties, /home/jenkins/agent/workspace/ease.verify.core.target.oxygen/tests/org.eclipse.ease.lang.javascript.nashorn.test/target/surefire.properties]
17:45:59 [2020-10-26T21:45:59.573Z] Picked up JAVA_TOOL_OPTIONS: -Dmaven.ext.class.path="/home/jenkins/agent/workspace/ease.verify.core.target.oxygen@tmp/withMaven2e82bf04/pipeline-maven-spy.jar" -Dorg.jenkinsci.plugins.pipeline.maven.reportsFolder="/home/jenkins/agent/workspace/ease.verify.core.target.oxygen@tmp/withMaven2e82bf04" 
17:46:00 [2020-10-26T21:46:00.938Z] Running org.eclipse.ease.lang.javascript.nashorn.NashornEnvironmentTest
17:46:01 [2020-10-26T21:46:01.198Z] Warning: Nashorn engine is planned to be removed from a future JDK release
17:46:01 [2020-10-26T21:46:01.454Z] Warning: Nashorn engine is planned to be removed from a future JDK release
17:46:01 [2020-10-26T21:46:01.709Z] Warning: Nashorn engine is planned to be removed from a future JDK release
17:46:01 [2020-10-26T21:46:01.709Z] WARNING: An illegal reflective access operation has occurred
17:46:01 [2020-10-26T21:46:01.709Z] WARNING: Illegal reflective access by org.mockito.cglib.core.ReflectUtils$2 (file:/home/jenkins/.m2/repository/p2/osgi/bundle/org.mockito/1.9.5.v201605172210/org.mockito-1.9.5.v201605172210.jar) to method java.lang.ClassLoader.defineClass(java.lang.String,byte[],int,int,java.security.ProtectionDomain)
17:46:01 [2020-10-26T21:46:01.709Z] WARNING: Please consider reporting this to the maintainers of org.mockito.cglib.core.ReflectUtils$2
17:46:01 [2020-10-26T21:46:01.709Z] WARNING: Use --illegal-access=warn to enable warnings of further illegal reflective access operations
17:46:01 [2020-10-26T21:46:01.709Z] WARNING: All illegal access operations will be denied in a future release
17:46:01 [2020-10-26T21:46:01.709Z] Warning: Nashorn engine is planned to be removed from a future JDK release
17:46:01 [2020-10-26T21:46:01.709Z] Warning: Nashorn engine is planned to be removed from a future JDK release
17:46:01 [2020-10-26T21:46:01.964Z] Tests run: 5, Failures: 0, Errors: 0, Skipped: 0, Time elapsed: 0.98 s - in org.eclipse.ease.lang.javascript.nashorn.NashornEnvironmentTest
17:46:01 [2020-10-26T21:46:01.964Z] reloadEnvironment(org.eclipse.ease.lang.javascript.nashorn.NashornEnvironmentTest)  Time elapsed: 0.591 s
17:46:01 [2020-10-26T21:46:01.965Z] bootstrappedEnvironment(org.eclipse.ease.lang.javascript.nashorn.NashornEnvironmentTest)  Time elapsed: 0.073 s
17:46:01 [2020-10-26T21:46:01.965Z] postMethodCallback(org.eclipse.ease.lang.javascript.nashorn.NashornEnvironmentTest)  Time elapsed: 0.122 s
17:46:01 [2020-10-26T21:46:01.965Z] preMethodCallback(org.eclipse.ease.lang.javascript.nashorn.NashornEnvironmentTest)  Time elapsed: 0.068 s
17:46:01 [2020-10-26T21:46:01.965Z] reloadFunctionDefinitions(org.eclipse.ease.lang.javascript.nashorn.NashornEnvironmentTest)  Time elapsed: 0.102 s
17:46:01 [2020-10-26T21:46:01.965Z] 
17:46:01 [2020-10-26T21:46:01.965Z] Results:
17:46:01 [2020-10-26T21:46:01.965Z] 
17:46:01 [2020-10-26T21:46:01.965Z] Tests run: 5, Failures: 0, Errors: 0, Skipped: 0
17:46:01 [2020-10-26T21:46:01.965Z] 
17:46:02 [2020-10-26T21:46:02.526Z] [INFO] All tests passed!
17:46:02 [2020-10-26T21:46:02.526Z] [INFO] 
17:46:02 [2020-10-26T21:46:02.526Z] [INFO] ----< org.eclipse.ease:org.eclipse.ease.lang.javascript.rhino.test >----
17:46:02 [2020-10-26T21:46:02.526Z] [INFO] Building org.eclipse.ease.lang.javascript.rhino.test 0.8.0-SNAPSHOT [5/11]
17:46:02 [2020-10-26T21:46:02.526Z] [INFO] ------------------------[ eclipse-test-plugin ]-------------------------
17:46:02 [2020-10-26T21:46:02.526Z] [INFO] 
17:46:02 [2020-10-26T21:46:02.526Z] [INFO] --- tycho-packaging-plugin:1.5.0:build-qualifier (default-build-qualifier) @ org.eclipse.ease.lang.javascript.rhino.test ---
17:46:02 [2020-10-26T21:46:02.781Z] [INFO] The project's OSGi version is 0.8.0.I201911291239
17:46:02 [2020-10-26T21:46:02.781Z] [INFO] 
17:46:02 [2020-10-26T21:46:02.781Z] [INFO] --- tycho-packaging-plugin:1.5.0:validate-id (default-validate-id) @ org.eclipse.ease.lang.javascript.rhino.test ---
17:46:02 [2020-10-26T21:46:02.782Z] [INFO] 
17:46:02 [2020-10-26T21:46:02.782Z] [INFO] --- tycho-packaging-plugin:1.5.0:validate-version (default-validate-version) @ org.eclipse.ease.lang.javascript.rhino.test ---
17:46:02 [2020-10-26T21:46:02.782Z] [INFO] 
17:46:02 [2020-10-26T21:46:02.782Z] [INFO] --- maven-resources-plugin:2.4.3:resources (default-resources) @ org.eclipse.ease.lang.javascript.rhino.test ---
17:46:02 [2020-10-26T21:46:02.782Z] [INFO] Using 'UTF-8' encoding to copy filtered resources.
17:46:02 [2020-10-26T21:46:02.782Z] [INFO] skip non existing resourceDirectory /home/jenkins/agent/workspace/ease.verify.core.target.oxygen/tests/org.eclipse.ease.lang.javascript.rhino.test/src/main/resources
17:46:02 [2020-10-26T21:46:02.782Z] [INFO] 
17:46:02 [2020-10-26T21:46:02.782Z] [INFO] --- tycho-compiler-plugin:1.5.0:compile (default-compile) @ org.eclipse.ease.lang.javascript.rhino.test ---
17:46:02 [2020-10-26T21:46:02.782Z] [INFO] Nothing to compile - all classes are up to date
17:46:02 [2020-10-26T21:46:02.782Z] [INFO] 
17:46:02 [2020-10-26T21:46:02.782Z] [INFO] --- maven-resources-plugin:2.4.3:testResources (default-testResources) @ org.eclipse.ease.lang.javascript.rhino.test ---
17:46:02 [2020-10-26T21:46:02.782Z] [INFO] Using 'UTF-8' encoding to copy filtered resources.
17:46:02 [2020-10-26T21:46:02.782Z] [INFO] skip non existing resourceDirectory /home/jenkins/agent/workspace/ease.verify.core.target.oxygen/tests/org.eclipse.ease.lang.javascript.rhino.test/src/test/resources
17:46:02 [2020-10-26T21:46:02.782Z] [INFO] 
17:46:02 [2020-10-26T21:46:02.782Z] [INFO] --- tycho-source-plugin:1.5.0:plugin-source (plugin-source) @ org.eclipse.ease.lang.javascript.rhino.test ---
17:46:02 [2020-10-26T21:46:02.782Z] [WARNING] Bundle-Vendor header not found in /home/jenkins/agent/workspace/ease.verify.core.target.oxygen/tests/org.eclipse.ease.lang.javascript.rhino.test/META-INF/MANIFEST.MF, fallback to 'unknown' for source bundle
17:46:02 [2020-10-26T21:46:02.782Z] [INFO] Building jar: /home/jenkins/agent/workspace/ease.verify.core.target.oxygen/tests/org.eclipse.ease.lang.javascript.rhino.test/target/org.eclipse.ease.lang.javascript.rhino.test-0.8.0-SNAPSHOT-sources.jar
17:46:02 [2020-10-26T21:46:02.782Z] [INFO] 
17:46:02 [2020-10-26T21:46:02.782Z] [INFO] --- target-platform-configuration:1.5.0:target-platform (default-target-platform) @ org.eclipse.ease.lang.javascript.rhino.test ---
17:46:02 [2020-10-26T21:46:02.782Z] [INFO] 
17:46:02 [2020-10-26T21:46:02.782Z] [INFO] --- tycho-packaging-plugin:1.5.0:package-plugin (default-package-plugin) @ org.eclipse.ease.lang.javascript.rhino.test ---
17:46:02 [2020-10-26T21:46:02.782Z] [INFO] Building jar: /home/jenkins/agent/workspace/ease.verify.core.target.oxygen/tests/org.eclipse.ease.lang.javascript.rhino.test/target/org.eclipse.ease.lang.javascript.rhino.test-0.8.0-SNAPSHOT.jar
17:46:02 [2020-10-26T21:46:02.782Z] [INFO] 
17:46:02 [2020-10-26T21:46:02.782Z] [INFO] --- tycho-p2-plugin:1.5.0:p2-metadata-default (default-p2-metadata-default) @ org.eclipse.ease.lang.javascript.rhino.test ---
17:46:02 [2020-10-26T21:46:02.782Z] [INFO] 
17:46:02 [2020-10-26T21:46:02.782Z] [INFO] --- tycho-source-feature-plugin:1.5.0:source-feature (source-feature) @ org.eclipse.ease.lang.javascript.rhino.test ---
17:46:02 [2020-10-26T21:46:02.782Z] [INFO] 
17:46:02 [2020-10-26T21:46:02.782Z] [INFO] --- tycho-p2-plugin:1.5.0:p2-metadata (attached-p2-metadata) @ org.eclipse.ease.lang.javascript.rhino.test ---
17:46:02 [2020-10-26T21:46:02.782Z] [INFO] 
17:46:02 [2020-10-26T21:46:02.782Z] [INFO] --- tycho-surefire-plugin:1.5.0:test (default-test) @ org.eclipse.ease.lang.javascript.rhino.test ---
17:46:02 [2020-10-26T21:46:02.782Z] [INFO] Expected eclipse log file: /home/jenkins/agent/workspace/ease.verify.core.target.oxygen/tests/org.eclipse.ease.lang.javascript.rhino.test/target/work/data/.metadata/.log
17:46:02 [2020-10-26T21:46:02.782Z] [INFO] Command line:
17:46:02 [2020-10-26T21:46:02.782Z] 	[/opt/tools/java/openjdk/jdk-11/11.0.2+9/bin/java, -Dosgi.noShutdown=false, -Dosgi.os=linux, -Dosgi.ws=gtk, -Dosgi.arch=x86_64, -Dosgi.clean=true, -jar, /home/jenkins/.m2/repository/p2/osgi/bundle/org.eclipse.equinox.launcher/1.4.0.v20161219-1356/org.eclipse.equinox.launcher-1.4.0.v20161219-1356.jar, -data, /home/jenkins/agent/workspace/ease.verify.core.target.oxygen/tests/org.eclipse.ease.lang.javascript.rhino.test/target/work/data, -install, /home/jenkins/agent/workspace/ease.verify.core.target.oxygen/tests/org.eclipse.ease.lang.javascript.rhino.test/target/work, -configuration, /home/jenkins/agent/workspace/ease.verify.core.target.oxygen/tests/org.eclipse.ease.lang.javascript.rhino.test/target/work/configuration, -application, org.eclipse.tycho.surefire.osgibooter.headlesstest, -testproperties, /home/jenkins/agent/workspace/ease.verify.core.target.oxygen/tests/org.eclipse.ease.lang.javascript.rhino.test/target/surefire.properties]
17:46:02 [2020-10-26T21:46:02.782Z] Picked up JAVA_TOOL_OPTIONS: -Dmaven.ext.class.path="/home/jenkins/agent/workspace/ease.verify.core.target.oxygen@tmp/withMaven2e82bf04/pipeline-maven-spy.jar" -Dorg.jenkinsci.plugins.pipeline.maven.reportsFolder="/home/jenkins/agent/workspace/ease.verify.core.target.oxygen@tmp/withMaven2e82bf04" 
17:46:04 [2020-10-26T21:46:04.670Z] Running org.eclipse.ease.lang.javascript.rhino.RhinoDebugTest
17:46:04 [2020-10-26T21:46:04.670Z] WARNING: An illegal reflective access operation has occurred
17:46:04 [2020-10-26T21:46:04.670Z] WARNING: Illegal reflective access by org.mockito.cglib.core.ReflectUtils$2 (file:/home/jenkins/.m2/repository/p2/osgi/bundle/org.mockito/1.9.5.v201605172210/org.mockito-1.9.5.v201605172210.jar) to method java.lang.ClassLoader.defineClass(java.lang.String,byte[],int,int,java.security.ProtectionDomain)
17:46:04 [2020-10-26T21:46:04.670Z] WARNING: Please consider reporting this to the maintainers of org.mockito.cglib.core.ReflectUtils$2
17:46:04 [2020-10-26T21:46:04.670Z] WARNING: Use --illegal-access=warn to enable warnings of further illegal reflective access operations
17:46:04 [2020-10-26T21:46:04.670Z] WARNING: All illegal access operations will be denied in a future release
17:46:04 [2020-10-26T21:46:04.670Z] Start of script
17:46:04 [2020-10-26T21:46:04.670Z] include file start
17:46:04 [2020-10-26T21:46:04.670Z] Include file processed
17:46:04 [2020-10-26T21:46:04.670Z] line after include file
17:46:04 [2020-10-26T21:46:04.670Z] Result of testMethod = 5
17:46:04 [2020-10-26T21:46:04.670Z] End of script
17:46:04 [2020-10-26T21:46:04.925Z] Start of script
17:46:04 [2020-10-26T21:46:04.925Z] include file start
17:46:04 [2020-10-26T21:46:04.925Z] Include file processed
17:46:04 [2020-10-26T21:46:04.925Z] line after include file
17:46:04 [2020-10-26T21:46:04.925Z] Result of testMethod = 5
17:46:04 [2020-10-26T21:46:04.925Z] End of script
17:46:04 [2020-10-26T21:46:04.925Z] Start of script
17:46:04 [2020-10-26T21:46:04.925Z] include file start
17:46:04 [2020-10-26T21:46:04.925Z] Include file processed
17:46:04 [2020-10-26T21:46:04.925Z] line after include file
17:46:04 [2020-10-26T21:46:04.925Z] Result of testMethod = 5
17:46:05 [2020-10-26T21:46:05.486Z] Start of script
17:46:05 [2020-10-26T21:46:05.486Z] include file start
17:46:05 [2020-10-26T21:46:05.486Z] Include file processed
17:46:05 [2020-10-26T21:46:05.486Z] line after include file
17:46:05 [2020-10-26T21:46:05.486Z] Result of testMethod = 5
17:46:05 [2020-10-26T21:46:05.486Z] End of script
17:46:05 [2020-10-26T21:46:05.741Z] Start of script
17:46:05 [2020-10-26T21:46:05.741Z] include file start
17:46:05 [2020-10-26T21:46:05.741Z] Include file processed
17:46:05 [2020-10-26T21:46:05.741Z] line after include file
17:46:05 [2020-10-26T21:46:05.741Z] Result of testMethod = 5
17:46:05 [2020-10-26T21:46:05.741Z] End of script
17:46:05 [2020-10-26T21:46:05.996Z] Start of script
17:46:05 [2020-10-26T21:46:05.996Z] include file start
17:46:05 [2020-10-26T21:46:05.996Z] Include file processed
17:46:05 [2020-10-26T21:46:05.996Z] line after include file
17:46:06 [2020-10-26T21:46:06.252Z] Result of testMethod = 5
17:46:06 [2020-10-26T21:46:06.252Z] End of script
17:46:06 [2020-10-26T21:46:06.252Z] Start of script
17:46:06 [2020-10-26T21:46:06.252Z] include file start
17:46:06 [2020-10-26T21:46:06.252Z] Include file processed
17:46:06 [2020-10-26T21:46:06.252Z] line after include file
17:46:06 [2020-10-26T21:46:06.252Z] Result of testMethod = 5
17:46:06 [2020-10-26T21:46:06.508Z] Start of script
17:46:06 [2020-10-26T21:46:06.508Z] include file start
17:46:06 [2020-10-26T21:46:06.508Z] Include file processed
17:46:06 [2020-10-26T21:46:06.508Z] line after include file
17:46:06 [2020-10-26T21:46:06.764Z] Result of testMethod = 5
17:46:06 [2020-10-26T21:46:06.764Z] End of script
17:46:06 [2020-10-26T21:46:06.764Z] Start of script
17:46:06 [2020-10-26T21:46:06.764Z] include file start
17:46:06 [2020-10-26T21:46:06.764Z] Include file processed
17:46:06 [2020-10-26T21:46:06.764Z] line after include file
17:46:06 [2020-10-26T21:46:06.764Z] Result of testMethod = 5
17:46:07 [2020-10-26T21:46:07.019Z] End of script
17:46:07 [2020-10-26T21:46:07.019Z] Start of script
17:46:07 [2020-10-26T21:46:07.019Z] include file start
17:46:07 [2020-10-26T21:46:07.019Z] Include file processed
17:46:07 [2020-10-26T21:46:07.019Z] line after include file
17:46:07 [2020-10-26T21:46:07.580Z] Start of script
17:46:07 [2020-10-26T21:46:07.580Z] include file start
17:46:07 [2020-10-26T21:46:07.580Z] Include file processed
17:46:07 [2020-10-26T21:46:07.580Z] line after include file
17:46:07 [2020-10-26T21:46:07.580Z] Result of testMethod = 5
17:46:07 [2020-10-26T21:46:07.580Z] End of script
17:46:07 [2020-10-26T21:46:07.580Z] Start of script
17:46:07 [2020-10-26T21:46:07.580Z] include file start
17:46:07 [2020-10-26T21:46:07.580Z] Include file processed
17:46:07 [2020-10-26T21:46:07.580Z] line after include file
17:46:07 [2020-10-26T21:46:07.836Z] Result of testMethod = 5
17:46:07 [2020-10-26T21:46:07.836Z] End of script
17:46:08 [2020-10-26T21:46:08.091Z] Start of script
17:46:08 [2020-10-26T21:46:08.347Z] include file start
17:46:08 [2020-10-26T21:46:08.347Z] Include file processed
17:46:08 [2020-10-26T21:46:08.347Z] line after include file
17:46:08 [2020-10-26T21:46:08.347Z] Result of testMethod = 5
17:46:08 [2020-10-26T21:46:08.347Z] End of script
17:46:08 [2020-10-26T21:46:08.347Z] Start of script
17:46:08 [2020-10-26T21:46:08.347Z] include file start
17:46:08 [2020-10-26T21:46:08.347Z] Include file processed
17:46:08 [2020-10-26T21:46:08.347Z] line after include file
17:46:08 [2020-10-26T21:46:08.602Z] Result of testMethod = 5
17:46:08 [2020-10-26T21:46:08.602Z] End of script
17:46:08 [2020-10-26T21:46:08.602Z] Start of script
17:46:08 [2020-10-26T21:46:08.602Z] include file start
17:46:08 [2020-10-26T21:46:08.602Z] Include file processed
17:46:08 [2020-10-26T21:46:08.602Z] line after include file
17:46:08 [2020-10-26T21:46:08.602Z] Result of testMethod = 5
17:46:09 [2020-10-26T21:46:09.164Z] Start of script
17:46:09 [2020-10-26T21:46:09.164Z] include file start
17:46:09 [2020-10-26T21:46:09.164Z] Include file processed
17:46:09 [2020-10-26T21:46:09.164Z] line after include file
17:46:09 [2020-10-26T21:46:09.164Z] Result of testMethod = 5
17:46:09 [2020-10-26T21:46:09.164Z] End of script
17:46:09 [2020-10-26T21:46:09.420Z] Start of script
17:46:09 [2020-10-26T21:46:09.420Z] include file start
17:46:09 [2020-10-26T21:46:09.420Z] Include file processed
17:46:09 [2020-10-26T21:46:09.420Z] line after include file
17:46:09 [2020-10-26T21:46:09.420Z] Result of testMethod = 5
17:46:09 [2020-10-26T21:46:09.675Z] End of script
17:46:09 [2020-10-26T21:46:09.675Z] Start of script
17:46:09 [2020-10-26T21:46:09.675Z] include file start
17:46:09 [2020-10-26T21:46:09.675Z] Include file processed
17:46:09 [2020-10-26T21:46:09.675Z] line after include file
17:46:09 [2020-10-26T21:46:09.930Z] Result of testMethod = 5
17:46:09 [2020-10-26T21:46:09.931Z] End of script
17:46:10 [2020-10-26T21:46:10.186Z] Start of script
17:46:10 [2020-10-26T21:46:10.186Z] include file start
17:46:10 [2020-10-26T21:46:10.186Z] Include file processed
17:46:10 [2020-10-26T21:46:10.186Z] line after include file
17:46:10 [2020-10-26T21:46:10.442Z] Result of testMethod = 5
17:46:10 [2020-10-26T21:46:10.442Z] End of script
17:46:10 [2020-10-26T21:46:10.442Z] Start of script
17:46:10 [2020-10-26T21:46:10.442Z] include file start
17:46:10 [2020-10-26T21:46:10.442Z] Include file processed
17:46:10 [2020-10-26T21:46:10.442Z] line after include file
17:46:10 [2020-10-26T21:46:10.442Z] Result of testMethod = 5
17:46:11 [2020-10-26T21:46:11.003Z] Start of script
17:46:11 [2020-10-26T21:46:11.004Z] include file start
17:46:11 [2020-10-26T21:46:11.004Z] Include file processed
17:46:11 [2020-10-26T21:46:11.004Z] line after include file
17:46:11 [2020-10-26T21:46:11.004Z] Result of testMethod = 5
17:46:11 [2020-10-26T21:46:11.004Z] End of script
17:46:11 [2020-10-26T21:46:11.004Z] Start of script
17:46:11 [2020-10-26T21:46:11.004Z] include file start
17:46:11 [2020-10-26T21:46:11.004Z] Include file processed
17:46:11 [2020-10-26T21:46:11.004Z] line after include file
17:46:11 [2020-10-26T21:46:11.259Z] Result of testMethod = 5
17:46:11 [2020-10-26T21:46:11.259Z] End of script
17:46:11 [2020-10-26T21:46:11.259Z] Start of script
17:46:11 [2020-10-26T21:46:11.259Z] include file start
17:46:11 [2020-10-26T21:46:11.259Z] Include file processed
17:46:11 [2020-10-26T21:46:11.259Z] line after include file
17:46:11 [2020-10-26T21:46:11.259Z] Result of testMethod = 5
17:46:11 [2020-10-26T21:46:11.259Z] End of script
17:46:11 [2020-10-26T21:46:11.514Z] Start of script
17:46:11 [2020-10-26T21:46:11.514Z] include file start
17:46:11 [2020-10-26T21:46:11.514Z] Include file processed
17:46:11 [2020-10-26T21:46:11.770Z] line after include file
17:46:11 [2020-10-26T21:46:11.770Z] Result of testMethod = 5
17:46:11 [2020-10-26T21:46:11.770Z] End of script
17:46:11 [2020-10-26T21:46:11.770Z] Start of script
17:46:11 [2020-10-26T21:46:11.770Z] include file start
17:46:11 [2020-10-26T21:46:11.770Z] Include file processed
17:46:11 [2020-10-26T21:46:11.770Z] line after include file
17:46:12 [2020-10-26T21:46:12.026Z] Start of script
17:46:12 [2020-10-26T21:46:12.282Z] include file start
17:46:12 [2020-10-26T21:46:12.282Z] Include file processed
17:46:12 [2020-10-26T21:46:12.282Z] line after include file
17:46:12 [2020-10-26T21:46:12.282Z] Result of testMethod = 5
17:46:12 [2020-10-26T21:46:12.282Z] End of script
17:46:12 [2020-10-26T21:46:12.282Z] Start of script
17:46:12 [2020-10-26T21:46:12.282Z] include file start
17:46:12 [2020-10-26T21:46:12.282Z] Include file processed
17:46:12 [2020-10-26T21:46:12.282Z] line after include file
17:46:12 [2020-10-26T21:46:12.282Z] Result of testMethod = 5
17:46:12 [2020-10-26T21:46:12.844Z] Start of script
17:46:12 [2020-10-26T21:46:12.844Z] include file start
17:46:12 [2020-10-26T21:46:12.844Z] Include file processed
17:46:12 [2020-10-26T21:46:12.844Z] line after include file
17:46:12 [2020-10-26T21:46:12.844Z] Result of testMethod = 5
17:46:12 [2020-10-26T21:46:12.844Z] End of script
17:46:12 [2020-10-26T21:46:12.844Z] Start of script
17:46:12 [2020-10-26T21:46:12.844Z] include file start
17:46:12 [2020-10-26T21:46:12.844Z] Include file processed
17:46:12 [2020-10-26T21:46:12.844Z] line after include file
17:46:13 [2020-10-26T21:46:13.100Z] Result of testMethod = 5
17:46:13 [2020-10-26T21:46:13.100Z] End of script
17:46:13 [2020-10-26T21:46:13.100Z] Start of script
17:46:13 [2020-10-26T21:46:13.100Z] include file start
17:46:13 [2020-10-26T21:46:13.100Z] Include file processed
17:46:13 [2020-10-26T21:46:13.100Z] line after include file
17:46:13 [2020-10-26T21:46:13.356Z] Result of testMethod = 5
17:46:13 [2020-10-26T21:46:13.356Z] End of script
17:46:13 [2020-10-26T21:46:13.612Z] Start of script
17:46:13 [2020-10-26T21:46:13.612Z] include file start
17:46:13 [2020-10-26T21:46:13.612Z] Include file processed
17:46:13 [2020-10-26T21:46:13.612Z] line after include file
17:46:13 [2020-10-26T21:46:13.612Z] Result of testMethod = 5
17:46:13 [2020-10-26T21:46:13.612Z] End of script
17:46:13 [2020-10-26T21:46:13.612Z] Start of script
17:46:13 [2020-10-26T21:46:13.612Z] include file start
17:46:13 [2020-10-26T21:46:13.612Z] Include file processed
17:46:13 [2020-10-26T21:46:13.612Z] line after include file
17:46:13 [2020-10-26T21:46:13.612Z] Result of testMethod = 5
17:46:14 [2020-10-26T21:46:14.174Z] Start of script
17:46:14 [2020-10-26T21:46:14.174Z] include file start
17:46:14 [2020-10-26T21:46:14.174Z] Include file processed
17:46:14 [2020-10-26T21:46:14.174Z] line after include file
17:46:14 [2020-10-26T21:46:14.174Z] Result of testMethod = 5
17:46:14 [2020-10-26T21:46:14.174Z] End of script
17:46:14 [2020-10-26T21:46:14.174Z] Start of script
17:46:14 [2020-10-26T21:46:14.174Z] include file start
17:46:14 [2020-10-26T21:46:14.174Z] Include file processed
17:46:14 [2020-10-26T21:46:14.174Z] line after include file
17:46:14 [2020-10-26T21:46:14.174Z] Result of testMethod = 5
17:46:14 [2020-10-26T21:46:14.735Z] Start of script
17:46:14 [2020-10-26T21:46:14.736Z] include file start
17:46:14 [2020-10-26T21:46:14.736Z] Include file processed
17:46:14 [2020-10-26T21:46:14.736Z] line after include file
17:46:14 [2020-10-26T21:46:14.736Z] Result of testMethod = 5
17:46:14 [2020-10-26T21:46:14.736Z] End of script
17:46:14 [2020-10-26T21:46:14.991Z] Start of script
17:46:14 [2020-10-26T21:46:14.991Z] include file start
17:46:14 [2020-10-26T21:46:14.991Z] Include file processed
17:46:14 [2020-10-26T21:46:14.991Z] line after include file
17:46:15 [2020-10-26T21:46:15.247Z] Result of testMethod = 5
17:46:15 [2020-10-26T21:46:15.247Z] End of script
17:46:15 [2020-10-26T21:46:15.247Z] Start of script
17:46:15 [2020-10-26T21:46:15.247Z] include file start
17:46:15 [2020-10-26T21:46:15.247Z] Include file processed
17:46:15 [2020-10-26T21:46:15.247Z] line after include file
17:46:15 [2020-10-26T21:46:15.247Z] Result of testMethod = 5
17:46:15 [2020-10-26T21:46:15.247Z] End of script
17:46:15 [2020-10-26T21:46:15.503Z] Tests run: 42, Failures: 0, Errors: 0, Skipped: 0, Time elapsed: 11.079 s - in org.eclipse.ease.lang.javascript.rhino.RhinoDebugTest
17:46:15 [2020-10-26T21:46:15.503Z] disconnectProcessInSuspendedState(org.eclipse.ease.lang.javascript.rhino.RhinoDebugTest)  Time elapsed: 0.341 s
17:46:15 [2020-10-26T21:46:15.503Z] stepReturnIncludeCommand(org.eclipse.ease.lang.javascript.rhino.RhinoDebugTest)  Time elapsed: 0.21 s
17:46:15 [2020-10-26T21:46:15.503Z] arrayVariableSorting(org.eclipse.ease.lang.javascript.rhino.RhinoDebugTest)  Time elapsed: 0.309 s
17:46:15 [2020-10-26T21:46:15.503Z] stepOverOnDebugTarget(org.eclipse.ease.lang.javascript.rhino.RhinoDebugTest)  Time elapsed: 0.309 s
17:46:15 [2020-10-26T21:46:15.503Z] hasDebugTarget(org.eclipse.ease.lang.javascript.rhino.RhinoDebugTest)  Time elapsed: 0.107 s
17:46:15 [2020-10-26T21:46:15.503Z] disconnectThreadInSuspendedState(org.eclipse.ease.lang.javascript.rhino.RhinoDebugTest)  Time elapsed: 0.214 s
17:46:15 [2020-10-26T21:46:15.503Z] stepReturnOnDebugTarget(org.eclipse.ease.lang.javascript.rhino.RhinoDebugTest)  Time elapsed: 0.311 s
17:46:15 [2020-10-26T21:46:15.503Z] nullVariable(org.eclipse.ease.lang.javascript.rhino.RhinoDebugTest)  Time elapsed: 0.308 s
17:46:15 [2020-10-26T21:46:15.503Z] stepOverOnStackFrame(org.eclipse.ease.lang.javascript.rhino.RhinoDebugTest)  Time elapsed: 0.308 s
17:46:15 [2020-10-26T21:46:15.503Z] resumeOnDebugTarget(org.eclipse.ease.lang.javascript.rhino.RhinoDebugTest)  Time elapsed: 0.207 s
17:46:15 [2020-10-26T21:46:15.503Z] modifyVariableKeepingType(org.eclipse.ease.lang.javascript.rhino.RhinoDebugTest)  Time elapsed: 0.406 s
17:46:15 [2020-10-26T21:46:15.503Z] resumeOnLastIncludeLine(org.eclipse.ease.lang.javascript.rhino.RhinoDebugTest)  Time elapsed: 0.208 s
17:46:15 [2020-10-26T21:46:15.503Z] stepReturnOnStackFrame(org.eclipse.ease.lang.javascript.rhino.RhinoDebugTest)  Time elapsed: 0.308 s
17:46:15 [2020-10-26T21:46:15.503Z] terminateStackFrameInSuspendedState(org.eclipse.ease.lang.javascript.rhino.RhinoDebugTest)  Time elapsed: 0.207 s
17:46:15 [2020-10-26T21:46:15.503Z] breakpointLocation(org.eclipse.ease.lang.javascript.rhino.RhinoDebugTest)  Time elapsed: 0.207 s
17:46:15 [2020-10-26T21:46:15.503Z] stepReturnOnThread(org.eclipse.ease.lang.javascript.rhino.RhinoDebugTest)  Time elapsed: 0.308 s
17:46:15 [2020-10-26T21:46:15.503Z] javaClassVariable(org.eclipse.ease.lang.javascript.rhino.RhinoDebugTest)  Time elapsed: 0.308 s
17:46:15 [2020-10-26T21:46:15.503Z] stepIntoOnThread(org.eclipse.ease.lang.javascript.rhino.RhinoDebugTest)  Time elapsed: 0.307 s
17:46:15 [2020-10-26T21:46:15.503Z] terminateThreadInSuspendedState(org.eclipse.ease.lang.javascript.rhino.RhinoDebugTest)  Time elapsed: 0.207 s
17:46:15 [2020-10-26T21:46:15.503Z] resumeOnThread(org.eclipse.ease.lang.javascript.rhino.RhinoDebugTest)  Time elapsed: 0.206 s
17:46:15 [2020-10-26T21:46:15.503Z] stepIntoOnStackFrame(org.eclipse.ease.lang.javascript.rhino.RhinoDebugTest)  Time elapsed: 0.306 s
17:46:15 [2020-10-26T21:46:15.503Z] terminateProcessInSuspendedState(org.eclipse.ease.lang.javascript.rhino.RhinoDebugTest)  Time elapsed: 0.205 s
17:46:15 [2020-10-26T21:46:15.503Z] stepOverOnProcess(org.eclipse.ease.lang.javascript.rhino.RhinoDebugTest)  Time elapsed: 0.307 s
17:46:15 [2020-10-26T21:46:15.503Z] nativeArrayVariable(org.eclipse.ease.lang.javascript.rhino.RhinoDebugTest)  Time elapsed: 0.306 s
17:46:15 [2020-10-26T21:46:15.503Z] disconnectDebugTargetInSuspendedState(org.eclipse.ease.lang.javascript.rhino.RhinoDebugTest)  Time elapsed: 0.206 s
17:46:15 [2020-10-26T21:46:15.503Z] stepIntoOnProcess(org.eclipse.ease.lang.javascript.rhino.RhinoDebugTest)  Time elapsed: 0.306 s
17:46:15 [2020-10-26T21:46:15.503Z] terminatedState(org.eclipse.ease.lang.javascript.rhino.RhinoDebugTest)  Time elapsed: 0.105 s
17:46:15 [2020-10-26T21:46:15.503Z] stepOverIncludeCommand(org.eclipse.ease.lang.javascript.rhino.RhinoDebugTest)  Time elapsed: 0.305 s
17:46:15 [2020-10-26T21:46:15.503Z] innerScopeVariableBeforeOuterScopeVariable(org.eclipse.ease.lang.javascript.rhino.RhinoDebugTest)  Time elapsed: 0.306 s
17:46:15 [2020-10-26T21:46:15.503Z] stepIntoIncludeCommand(org.eclipse.ease.lang.javascript.rhino.RhinoDebugTest)  Time elapsed: 0.304 s
17:46:15 [2020-10-26T21:46:15.503Z] primitiveStringVariable(org.eclipse.ease.lang.javascript.rhino.RhinoDebugTest)  Time elapsed: 0.306 s
17:46:15 [2020-10-26T21:46:15.503Z] resumeOnProcess(org.eclipse.ease.lang.javascript.rhino.RhinoDebugTest)  Time elapsed: 0.205 s
17:46:15 [2020-10-26T21:46:15.503Z] stepIntoOnDebugTarget(org.eclipse.ease.lang.javascript.rhino.RhinoDebugTest)  Time elapsed: 0.306 s
17:46:15 [2020-10-26T21:46:15.503Z] stepOverOnThread(org.eclipse.ease.lang.javascript.rhino.RhinoDebugTest)  Time elapsed: 0.306 s
17:46:15 [2020-10-26T21:46:15.503Z] suspendedState(org.eclipse.ease.lang.javascript.rhino.RhinoDebugTest)  Time elapsed: 0.205 s
17:46:15 [2020-10-26T21:46:15.504Z] primitiveDoubleVariable(org.eclipse.ease.lang.javascript.rhino.RhinoDebugTest)  Time elapsed: 0.305 s
17:46:15 [2020-10-26T21:46:15.504Z] resumeOnStackFrame(org.eclipse.ease.lang.javascript.rhino.RhinoDebugTest)  Time elapsed: 0.206 s
17:46:15 [2020-10-26T21:46:15.504Z] nativeObjectVariable(org.eclipse.ease.lang.javascript.rhino.RhinoDebugTest)  Time elapsed: 0.305 s
17:46:15 [2020-10-26T21:46:15.504Z] terminateDebugTargetInSuspendedState(org.eclipse.ease.lang.javascript.rhino.RhinoDebugTest)  Time elapsed: 0.206 s
17:46:15 [2020-10-26T21:46:15.504Z] disconnectStackFrameInSuspendedState(org.eclipse.ease.lang.javascript.rhino.RhinoDebugTest)  Time elapsed: 0.206 s
17:46:15 [2020-10-26T21:46:15.504Z] stepReturnOnProcess(org.eclipse.ease.lang.javascript.rhino.RhinoDebugTest)  Time elapsed: 0.306 s
17:46:15 [2020-10-26T21:46:15.504Z] evaluateWatchExpression(org.eclipse.ease.lang.javascript.rhino.RhinoDebugTest)  Time elapsed: 0.207 s
17:46:15 [2020-10-26T21:46:15.504Z] Running org.eclipse.ease.lang.javascript.rhino.RhinoEnvironmentTest
17:46:15 [2020-10-26T21:46:15.504Z] Tests run: 5, Failures: 0, Errors: 0, Skipped: 0, Time elapsed: 0.103 s - in org.eclipse.ease.lang.javascript.rhino.RhinoEnvironmentTest
17:46:15 [2020-10-26T21:46:15.504Z] reloadEnvironment(org.eclipse.ease.lang.javascript.rhino.RhinoEnvironmentTest)  Time elapsed: 0.047 s
17:46:15 [2020-10-26T21:46:15.504Z] bootstrappedEnvironment(org.eclipse.ease.lang.javascript.rhino.RhinoEnvironmentTest)  Time elapsed: 0.01 s
17:46:15 [2020-10-26T21:46:15.504Z] postMethodCallback(org.eclipse.ease.lang.javascript.rhino.RhinoEnvironmentTest)  Time elapsed: 0.014 s
17:46:15 [2020-10-26T21:46:15.504Z] preMethodCallback(org.eclipse.ease.lang.javascript.rhino.RhinoEnvironmentTest)  Time elapsed: 0.01 s
17:46:15 [2020-10-26T21:46:15.504Z] reloadFunctionDefinitions(org.eclipse.ease.lang.javascript.rhino.RhinoEnvironmentTest)  Time elapsed: 0.02 s
17:46:15 [2020-10-26T21:46:15.504Z] Running org.eclipse.ease.lang.javascript.rhino.RhinoScriptEngineTest
17:46:15 [2020-10-26T21:46:15.760Z] org.eclipse.ease.ScriptExecutionException: JavaError: NotThere cannot be found by org.mozilla.javascript_1.7.5.v201504281450
17:46:15 [2020-10-26T21:46:15.760Z] 	at <unknown source>
17:46:15 [2020-10-26T21:46:15.760Z] 
17:46:15 [2020-10-26T21:46:15.760Z] Java Stacktrace:
17:46:15 [2020-10-26T21:46:15.760Z] java.lang.ClassNotFoundException: NotThere cannot be found by org.mozilla.javascript_1.7.5.v201504281450
17:46:15 [2020-10-26T21:46:15.760Z] 	at org.eclipse.osgi.internal.loader.BundleLoader.findClassInternal(BundleLoader.java:484)
17:46:15 [2020-10-26T21:46:15.760Z] 	at org.eclipse.osgi.internal.loader.BundleLoader.findClass(BundleLoader.java:395)
17:46:15 [2020-10-26T21:46:15.760Z] 	at org.eclipse.osgi.internal.loader.BundleLoader.findClass(BundleLoader.java:387)
17:46:15 [2020-10-26T21:46:15.760Z] 	at org.eclipse.osgi.internal.loader.ModuleClassLoader.loadClass(ModuleClassLoader.java:150)
17:46:15 [2020-10-26T21:46:15.760Z] 	at java.base/java.lang.ClassLoader.loadClass(ClassLoader.java:521)
17:46:15 [2020-10-26T21:46:15.760Z] 	at java.base/java.lang.Class.forName0(Native Method)
17:46:15 [2020-10-26T21:46:15.760Z] 	at java.base/java.lang.Class.forName(Class.java:315)
17:46:15 [2020-10-26T21:46:15.760Z] 	at java.base/jdk.internal.reflect.NativeMethodAccessorImpl.invoke0(Native Method)
17:46:15 [2020-10-26T21:46:15.760Z] 	at java.base/jdk.internal.reflect.NativeMethodAccessorImpl.invoke(NativeMethodAccessorImpl.java:62)
17:46:15 [2020-10-26T21:46:15.760Z] 	at java.base/jdk.internal.reflect.DelegatingMethodAccessorImpl.invoke(DelegatingMethodAccessorImpl.java:43)
17:46:15 [2020-10-26T21:46:15.760Z] 	at java.base/java.lang.reflect.Method.invoke(Method.java:566)
17:46:15 [2020-10-26T21:46:15.760Z] 	at org.mozilla.javascript.MemberBox.invoke(MemberBox.java:126)
17:46:15 [2020-10-26T21:46:15.760Z] 	at org.mozilla.javascript.NativeJavaMethod.call(NativeJavaMethod.java:225)
17:46:15 [2020-10-26T21:46:15.760Z] 	at org.mozilla.javascript.optimizer.OptRuntime.call1(OptRuntime.java:32)
17:46:15 [2020-10-26T21:46:15.760Z] 	at org.mozilla.javascript.gen.c_27._c_script_0(Unknown Source)
17:46:15 [2020-10-26T21:46:15.760Z] 	at org.mozilla.javascript.gen.c_27.call(Unknown Source)
17:46:15 [2020-10-26T21:46:15.760Z] 	at org.mozilla.javascript.ContextFactory.doTopCall(ContextFactory.java:394)
17:46:15 [2020-10-26T21:46:15.760Z] 	at org.mozilla.javascript.ScriptRuntime.doTopCall(ScriptRuntime.java:3091)
17:46:15 [2020-10-26T21:46:15.760Z] 	at org.mozilla.javascript.gen.c_27.call(Unknown Source)
17:46:15 [2020-10-26T21:46:15.760Z] 	at org.mozilla.javascript.gen.c_27.exec(Unknown Source)
17:46:15 [2020-10-26T21:46:15.760Z] 	at org.mozilla.javascript.Context.evaluateReader(Context.java:1110)
17:46:15 [2020-10-26T21:46:15.760Z] 	at org.eclipse.ease.lang.javascript.rhino.RhinoScriptEngine.internalExecute(RhinoScriptEngine.java:222)
17:46:15 [2020-10-26T21:46:15.760Z] 	at org.eclipse.ease.lang.javascript.rhino.RhinoScriptEngine.execute(RhinoScriptEngine.java:201)
17:46:15 [2020-10-26T21:46:15.760Z] 	at org.eclipse.ease.AbstractScriptEngine.inject(AbstractScriptEngine.java:224)
17:46:15 [2020-10-26T21:46:15.760Z] 	at org.eclipse.ease.AbstractScriptEngine.run(AbstractScriptEngine.java:274)
17:46:15 [2020-10-26T21:46:15.760Z] 	at org.eclipse.core.internal.jobs.Worker.run(Worker.java:56)
17:46:15 [2020-10-26T21:46:15.760Z] org.eclipse.ease.ScriptExecutionException: TypeError: Cannot call method "foobar" of undefined
17:46:15 [2020-10-26T21:46:15.760Z] 	at <unknown source>
17:46:15 [2020-10-26T21:46:15.760Z] org.eclipse.ease.ScriptExecutionException: ScriptException: test
17:46:15 [2020-10-26T21:46:15.760Z] 	at <unknown source>
17:46:15 [2020-10-26T21:46:15.761Z] org.eclipse.ease.ScriptExecutionException: JavaError: java.lang.Exception
17:46:15 [2020-10-26T21:46:15.761Z] 	at <unknown source>
17:46:15 [2020-10-26T21:46:15.761Z] 
17:46:15 [2020-10-26T21:46:15.761Z] Java Stacktrace:
17:46:15 [2020-10-26T21:46:15.761Z] java.lang.Exception
17:46:15 [2020-10-26T21:46:15.761Z] 	at java.base/jdk.internal.reflect.NativeConstructorAccessorImpl.newInstance0(Native Method)
17:46:15 [2020-10-26T21:46:15.761Z] 	at java.base/jdk.internal.reflect.NativeConstructorAccessorImpl.newInstance(NativeConstructorAccessorImpl.java:62)
17:46:15 [2020-10-26T21:46:15.761Z] 	at java.base/jdk.internal.reflect.DelegatingConstructorAccessorImpl.newInstance(DelegatingConstructorAccessorImpl.java:45)
17:46:15 [2020-10-26T21:46:15.761Z] 	at java.base/java.lang.reflect.Constructor.newInstance(Constructor.java:490)
17:46:15 [2020-10-26T21:46:15.761Z] 	at org.mozilla.javascript.MemberBox.newInstance(MemberBox.java:159)
17:46:15 [2020-10-26T21:46:15.761Z] 	at org.mozilla.javascript.NativeJavaClass.constructInternal(NativeJavaClass.java:266)
17:46:15 [2020-10-26T21:46:15.761Z] 	at org.mozilla.javascript.NativeJavaClass.constructSpecific(NativeJavaClass.java:205)
17:46:15 [2020-10-26T21:46:15.761Z] 	at org.mozilla.javascript.NativeJavaClass.construct(NativeJavaClass.java:166)
17:46:15 [2020-10-26T21:46:15.761Z] 	at org.mozilla.javascript.ScriptRuntime.newObject(ScriptRuntime.java:2349)
17:46:15 [2020-10-26T21:46:15.761Z] 	at org.mozilla.javascript.gen.c_45._c_script_0(Unknown Source)
17:46:15 [2020-10-26T21:46:15.761Z] 	at org.mozilla.javascript.gen.c_45.call(Unknown Source)
17:46:15 [2020-10-26T21:46:15.761Z] 	at org.mozilla.javascript.ContextFactory.doTopCall(ContextFactory.java:394)
17:46:15 [2020-10-26T21:46:15.761Z] 	at org.mozilla.javascript.ScriptRuntime.doTopCall(ScriptRuntime.java:3091)
17:46:15 [2020-10-26T21:46:15.761Z] 	at org.mozilla.javascript.gen.c_45.call(Unknown Source)
17:46:15 [2020-10-26T21:46:15.761Z] 	at org.mozilla.javascript.gen.c_45.exec(Unknown Source)
17:46:15 [2020-10-26T21:46:15.761Z] 	at org.mozilla.javascript.Context.evaluateReader(Context.java:1110)
17:46:15 [2020-10-26T21:46:15.761Z] 	at org.eclipse.ease.lang.javascript.rhino.RhinoScriptEngine.internalExecute(RhinoScriptEngine.java:222)
17:46:15 [2020-10-26T21:46:15.761Z] 	at org.eclipse.ease.lang.javascript.rhino.RhinoScriptEngine.execute(RhinoScriptEngine.java:201)
17:46:15 [2020-10-26T21:46:15.761Z] 	at org.eclipse.ease.AbstractScriptEngine.inject(AbstractScriptEngine.java:224)
17:46:15 [2020-10-26T21:46:15.761Z] 	at org.eclipse.ease.AbstractScriptEngine.run(AbstractScriptEngine.java:274)
17:46:15 [2020-10-26T21:46:15.761Z] 	at org.eclipse.core.internal.jobs.Worker.run(Worker.java:56)
17:46:15 [2020-10-26T21:46:15.761Z] org.eclipse.ease.ScriptExecutionException: ScriptException: JavaScript
17:46:15 [2020-10-26T21:46:15.761Z] 	at <unknown source>
17:46:15 [2020-10-26T21:46:15.761Z] org.eclipse.ease.ScriptExecutionException: SyntaxError: unterminated string literal (#1)
17:46:15 [2020-10-26T21:46:15.761Z] 'asdf
17:46:15 [2020-10-26T21:46:15.761Z]     ^
17:46:15 [2020-10-26T21:46:15.761Z] 	at <unknown source>
17:46:15 [2020-10-26T21:46:15.761Z] Tests run: 11, Failures: 0, Errors: 0, Skipped: 0, Time elapsed: 0.111 s - in org.eclipse.ease.lang.javascript.rhino.RhinoScriptEngineTest
17:46:15 [2020-10-26T21:46:15.761Z] causeWrappedException(org.eclipse.ease.lang.javascript.rhino.RhinoScriptEngineTest)  Time elapsed: 0.01 s
17:46:15 [2020-10-26T21:46:15.761Z] optionalModuleParameters(org.eclipse.ease.lang.javascript.rhino.RhinoScriptEngineTest)  Time elapsed: 0.007 s
17:46:15 [2020-10-26T21:46:15.761Z] simpleScriptCode(org.eclipse.ease.lang.javascript.rhino.RhinoScriptEngineTest)  Time elapsed: 0.007 s
17:46:15 [2020-10-26T21:46:15.761Z] causeRuntimeErrorException(org.eclipse.ease.lang.javascript.rhino.RhinoScriptEngineTest)  Time elapsed: 0.01 s
17:46:15 [2020-10-26T21:46:15.761Z] callModuleCode(org.eclipse.ease.lang.javascript.rhino.RhinoScriptEngineTest)  Time elapsed: 0.007 s
17:46:15 [2020-10-26T21:46:15.761Z] throwJavaClass(org.eclipse.ease.lang.javascript.rhino.RhinoScriptEngineTest)  Time elapsed: 0.008 s
17:46:15 [2020-10-26T21:46:15.761Z] throwJavaException(org.eclipse.ease.lang.javascript.rhino.RhinoScriptEngineTest)  Time elapsed: 0.007 s
17:46:15 [2020-10-26T21:46:15.761Z] accessJavaClasses(org.eclipse.ease.lang.javascript.rhino.RhinoScriptEngineTest)  Time elapsed: 0.007 s
17:46:15 [2020-10-26T21:46:15.761Z] accessEclipseClasses(org.eclipse.ease.lang.javascript.rhino.RhinoScriptEngineTest)  Time elapsed: 0.007 s
17:46:15 [2020-10-26T21:46:15.761Z] throwJavaScriptException(org.eclipse.ease.lang.javascript.rhino.RhinoScriptEngineTest)  Time elapsed: 0.033 s
17:46:15 [2020-10-26T21:46:15.761Z] causeSyntaxErrorException(org.eclipse.ease.lang.javascript.rhino.RhinoScriptEngineTest)  Time elapsed: 0.006 s
17:46:15 [2020-10-26T21:46:15.761Z] Running org.eclipse.ease.lang.javascript.rhino.RhinoDebuggerEngineTest
17:46:15 [2020-10-26T21:46:15.761Z] org.eclipse.ease.ScriptExecutionException: JavaError: NotThere cannot be found by org.mozilla.javascript_1.7.5.v201504281450
17:46:15 [2020-10-26T21:46:15.761Z] 
17:46:15 [2020-10-26T21:46:15.761Z] Java Stacktrace:
17:46:15 [2020-10-26T21:46:15.761Z] java.lang.ClassNotFoundException: NotThere cannot be found by org.mozilla.javascript_1.7.5.v201504281450
17:46:15 [2020-10-26T21:46:15.761Z] 	at org.eclipse.osgi.internal.loader.BundleLoader.findClassInternal(BundleLoader.java:484)
17:46:15 [2020-10-26T21:46:15.761Z] 	at org.eclipse.osgi.internal.loader.BundleLoader.findClass(BundleLoader.java:395)
17:46:15 [2020-10-26T21:46:15.761Z] 	at org.eclipse.osgi.internal.loader.BundleLoader.findClass(BundleLoader.java:387)
17:46:15 [2020-10-26T21:46:15.761Z] 	at org.eclipse.osgi.internal.loader.ModuleClassLoader.loadClass(ModuleClassLoader.java:150)
17:46:15 [2020-10-26T21:46:15.761Z] 	at java.base/java.lang.ClassLoader.loadClass(ClassLoader.java:521)
17:46:15 [2020-10-26T21:46:15.761Z] 	at java.base/java.lang.Class.forName0(Native Method)
17:46:15 [2020-10-26T21:46:15.761Z] 	at java.base/java.lang.Class.forName(Class.java:315)
17:46:15 [2020-10-26T21:46:15.761Z] 	at java.base/jdk.internal.reflect.NativeMethodAccessorImpl.invoke0(Native Method)
17:46:15 [2020-10-26T21:46:15.761Z] 	at java.base/jdk.internal.reflect.NativeMethodAccessorImpl.invoke(NativeMethodAccessorImpl.java:62)
17:46:15 [2020-10-26T21:46:15.761Z] 	at java.base/jdk.internal.reflect.DelegatingMethodAccessorImpl.invoke(DelegatingMethodAccessorImpl.java:43)
17:46:15 [2020-10-26T21:46:15.761Z] 	at java.base/java.lang.reflect.Method.invoke(Method.java:566)
17:46:15 [2020-10-26T21:46:15.761Z] 	at org.mozilla.javascript.MemberBox.invoke(MemberBox.java:126)
17:46:15 [2020-10-26T21:46:15.761Z] 	at org.mozilla.javascript.NativeJavaMethod.call(NativeJavaMethod.java:225)
17:46:15 [2020-10-26T21:46:15.761Z] 	at org.mozilla.javascript.Interpreter.interpretLoop(Interpreter.java:1473)
17:46:15 [2020-10-26T21:46:15.761Z] 	at org.mozilla.javascript.Interpreter.interpret(Interpreter.java:815)
17:46:15 [2020-10-26T21:46:15.761Z] 	at org.mozilla.javascript.InterpretedFunction.call(InterpretedFunction.java:109)
17:46:15 [2020-10-26T21:46:15.761Z] 	at org.mozilla.javascript.ContextFactory.doTopCall(ContextFactory.java:394)
17:46:15 [2020-10-26T21:46:15.761Z] 	at org.mozilla.javascript.ScriptRuntime.doTopCall(ScriptRuntime.java:3091)
17:46:15 [2020-10-26T21:46:15.761Z] 	at org.mozilla.javascript.InterpretedFunction.exec(InterpretedFunction.java:120)
17:46:15 [2020-10-26T21:46:15.761Z] 	at org.mozilla.javascript.Context.evaluateReader(Context.java:1110)
17:46:15 [2020-10-26T21:46:15.761Z] 	at org.eclipse.ease.lang.javascript.rhino.RhinoScriptEngine.internalExecute(RhinoScriptEngine.java:222)
17:46:15 [2020-10-26T21:46:15.761Z] 	at org.eclipse.ease.lang.javascript.rhino.RhinoScriptEngine.execute(RhinoScriptEngine.java:201)
17:46:15 [2020-10-26T21:46:15.761Z] 	at org.eclipse.ease.AbstractScriptEngine.inject(AbstractScriptEngine.java:224)
17:46:15 [2020-10-26T21:46:15.761Z] 	at org.eclipse.ease.AbstractScriptEngine.run(AbstractScriptEngine.java:274)
17:46:15 [2020-10-26T21:46:15.761Z] 	at org.eclipse.core.internal.jobs.Worker.run(Worker.java:56)
17:46:15 [2020-10-26T21:46:15.761Z] org.eclipse.ease.ScriptExecutionException: TypeError: Cannot call method "foobar" of undefined
17:46:15 [2020-10-26T21:46:15.761Z] org.eclipse.ease.ScriptExecutionException: ScriptException: test
17:46:15 [2020-10-26T21:46:15.761Z] org.eclipse.ease.ScriptExecutionException: JavaError: java.lang.Exception
17:46:15 [2020-10-26T21:46:15.762Z] 
17:46:15 [2020-10-26T21:46:15.762Z] Java Stacktrace:
17:46:15 [2020-10-26T21:46:15.762Z] java.lang.Exception
17:46:15 [2020-10-26T21:46:15.762Z] 	at java.base/jdk.internal.reflect.NativeConstructorAccessorImpl.newInstance0(Native Method)
17:46:15 [2020-10-26T21:46:15.762Z] 	at java.base/jdk.internal.reflect.NativeConstructorAccessorImpl.newInstance(NativeConstructorAccessorImpl.java:62)
17:46:15 [2020-10-26T21:46:15.762Z] 	at java.base/jdk.internal.reflect.DelegatingConstructorAccessorImpl.newInstance(DelegatingConstructorAccessorImpl.java:45)
17:46:15 [2020-10-26T21:46:15.762Z] 	at java.base/java.lang.reflect.Constructor.newInstance(Constructor.java:490)
17:46:15 [2020-10-26T21:46:15.762Z] 	at org.mozilla.javascript.MemberBox.newInstance(MemberBox.java:159)
17:46:15 [2020-10-26T21:46:15.762Z] 	at org.mozilla.javascript.NativeJavaClass.constructInternal(NativeJavaClass.java:266)
17:46:15 [2020-10-26T21:46:15.762Z] 	at org.mozilla.javascript.NativeJavaClass.constructSpecific(NativeJavaClass.java:205)
17:46:15 [2020-10-26T21:46:15.762Z] 	at org.mozilla.javascript.NativeJavaClass.construct(NativeJavaClass.java:166)
17:46:15 [2020-10-26T21:46:15.762Z] 	at org.mozilla.javascript.Interpreter.interpretLoop(Interpreter.java:1519)
17:46:15 [2020-10-26T21:46:15.762Z] 	at org.mozilla.javascript.Interpreter.interpret(Interpreter.java:815)
17:46:15 [2020-10-26T21:46:15.762Z] 	at org.mozilla.javascript.InterpretedFunction.call(InterpretedFunction.java:109)
17:46:15 [2020-10-26T21:46:15.762Z] 	at org.mozilla.javascript.ContextFactory.doTopCall(ContextFactory.java:394)
17:46:15 [2020-10-26T21:46:15.762Z] 	at org.mozilla.javascript.ScriptRuntime.doTopCall(ScriptRuntime.java:3091)
17:46:15 [2020-10-26T21:46:15.762Z] 	at org.mozilla.javascript.InterpretedFunction.exec(InterpretedFunction.java:120)
17:46:15 [2020-10-26T21:46:15.762Z] 	at org.mozilla.javascript.Context.evaluateReader(Context.java:1110)
17:46:15 [2020-10-26T21:46:15.762Z] 	at org.eclipse.ease.lang.javascript.rhino.RhinoScriptEngine.internalExecute(RhinoScriptEngine.java:222)
17:46:15 [2020-10-26T21:46:15.762Z] 	at org.eclipse.ease.lang.javascript.rhino.RhinoScriptEngine.execute(RhinoScriptEngine.java:201)
17:46:15 [2020-10-26T21:46:15.762Z] 	at org.eclipse.ease.AbstractScriptEngine.inject(AbstractScriptEngine.java:224)
17:46:15 [2020-10-26T21:46:15.762Z] 	at org.eclipse.ease.AbstractScriptEngine.run(AbstractScriptEngine.java:274)
17:46:15 [2020-10-26T21:46:15.762Z] 	at org.eclipse.core.internal.jobs.Worker.run(Worker.java:56)
17:46:16 [2020-10-26T21:46:16.018Z] org.eclipse.ease.ScriptExecutionException: ScriptException: JavaScript
17:46:16 [2020-10-26T21:46:16.018Z] org.eclipse.ease.ScriptExecutionException: SyntaxError: unterminated string literal (#1)
17:46:16 [2020-10-26T21:46:16.018Z] 'asdf
17:46:16 [2020-10-26T21:46:16.018Z]     ^
17:46:16 [2020-10-26T21:46:16.018Z] 	at <unknown source>:1
17:46:16 [2020-10-26T21:46:16.018Z] Tests run: 12, Failures: 0, Errors: 0, Skipped: 0, Time elapsed: 0.191 s - in org.eclipse.ease.lang.javascript.rhino.RhinoDebuggerEngineTest
17:46:16 [2020-10-26T21:46:16.018Z] getExceptionStackTrace(org.eclipse.ease.lang.javascript.rhino.RhinoDebuggerEngineTest)  Time elapsed: 0.019 s
17:46:16 [2020-10-26T21:46:16.018Z] causeWrappedException(org.eclipse.ease.lang.javascript.rhino.RhinoDebuggerEngineTest)  Time elapsed: 0.014 s
17:46:16 [2020-10-26T21:46:16.018Z] optionalModuleParameters(org.eclipse.ease.lang.javascript.rhino.RhinoDebuggerEngineTest)  Time elapsed: 0.011 s
17:46:16 [2020-10-26T21:46:16.018Z] simpleScriptCode(org.eclipse.ease.lang.javascript.rhino.RhinoDebuggerEngineTest)  Time elapsed: 0.008 s
17:46:16 [2020-10-26T21:46:16.018Z] causeRuntimeErrorException(org.eclipse.ease.lang.javascript.rhino.RhinoDebuggerEngineTest)  Time elapsed: 0.037 s
17:46:16 [2020-10-26T21:46:16.018Z] callModuleCode(org.eclipse.ease.lang.javascript.rhino.RhinoDebuggerEngineTest)  Time elapsed: 0.01 s
17:46:16 [2020-10-26T21:46:16.018Z] throwJavaClass(org.eclipse.ease.lang.javascript.rhino.RhinoDebuggerEngineTest)  Time elapsed: 0.01 s
17:46:16 [2020-10-26T21:46:16.018Z] throwJavaException(org.eclipse.ease.lang.javascript.rhino.RhinoDebuggerEngineTest)  Time elapsed: 0.01 s
17:46:16 [2020-10-26T21:46:16.018Z] accessJavaClasses(org.eclipse.ease.lang.javascript.rhino.RhinoDebuggerEngineTest)  Time elapsed: 0.012 s
17:46:16 [2020-10-26T21:46:16.018Z] accessEclipseClasses(org.eclipse.ease.lang.javascript.rhino.RhinoDebuggerEngineTest)  Time elapsed: 0.011 s
17:46:16 [2020-10-26T21:46:16.018Z] throwJavaScriptException(org.eclipse.ease.lang.javascript.rhino.RhinoDebuggerEngineTest)  Time elapsed: 0.037 s
17:46:16 [2020-10-26T21:46:16.018Z] causeSyntaxErrorException(org.eclipse.ease.lang.javascript.rhino.RhinoDebuggerEngineTest)  Time elapsed: 0.009 s
17:46:16 [2020-10-26T21:46:16.018Z] 
17:46:16 [2020-10-26T21:46:16.018Z] Results:
17:46:16 [2020-10-26T21:46:16.018Z] 
17:46:16 [2020-10-26T21:46:16.018Z] Tests run: 70, Failures: 0, Errors: 0, Skipped: 0
17:46:16 [2020-10-26T21:46:16.018Z] 
17:46:16 [2020-10-26T21:46:16.599Z] [INFO] All tests passed!
17:46:16 [2020-10-26T21:46:16.599Z] [INFO] 
17:46:16 [2020-10-26T21:46:16.599Z] [INFO] -------< org.eclipse.ease:org.eclipse.ease.lang.javascript.test >-------
17:46:16 [2020-10-26T21:46:16.599Z] [INFO] Building org.eclipse.ease.lang.javascript.test 0.8.0-SNAPSHOT     [6/11]
17:46:16 [2020-10-26T21:46:16.599Z] [INFO] ------------------------[ eclipse-test-plugin ]-------------------------
17:46:16 [2020-10-26T21:46:16.599Z] [INFO] 
17:46:16 [2020-10-26T21:46:16.599Z] [INFO] --- tycho-packaging-plugin:1.5.0:build-qualifier (default-build-qualifier) @ org.eclipse.ease.lang.javascript.test ---
17:46:16 [2020-10-26T21:46:16.599Z] [INFO] The project's OSGi version is 0.8.0.I201910171213
17:46:16 [2020-10-26T21:46:16.599Z] [INFO] 
17:46:16 [2020-10-26T21:46:16.599Z] [INFO] --- tycho-packaging-plugin:1.5.0:validate-id (default-validate-id) @ org.eclipse.ease.lang.javascript.test ---
17:46:16 [2020-10-26T21:46:16.599Z] [INFO] 
17:46:16 [2020-10-26T21:46:16.599Z] [INFO] --- tycho-packaging-plugin:1.5.0:validate-version (default-validate-version) @ org.eclipse.ease.lang.javascript.test ---
17:46:16 [2020-10-26T21:46:16.599Z] [INFO] 
17:46:16 [2020-10-26T21:46:16.599Z] [INFO] --- maven-resources-plugin:2.4.3:resources (default-resources) @ org.eclipse.ease.lang.javascript.test ---
17:46:16 [2020-10-26T21:46:16.599Z] [INFO] Using 'UTF-8' encoding to copy filtered resources.
17:46:16 [2020-10-26T21:46:16.599Z] [INFO] skip non existing resourceDirectory /home/jenkins/agent/workspace/ease.verify.core.target.oxygen/tests/org.eclipse.ease.lang.javascript.test/src/main/resources
17:46:16 [2020-10-26T21:46:16.599Z] [INFO] 
17:46:16 [2020-10-26T21:46:16.599Z] [INFO] --- tycho-compiler-plugin:1.5.0:compile (default-compile) @ org.eclipse.ease.lang.javascript.test ---
17:46:16 [2020-10-26T21:46:16.599Z] [INFO] Nothing to compile - all classes are up to date
17:46:16 [2020-10-26T21:46:16.599Z] [INFO] 
17:46:16 [2020-10-26T21:46:16.599Z] [INFO] --- maven-resources-plugin:2.4.3:testResources (default-testResources) @ org.eclipse.ease.lang.javascript.test ---
17:46:16 [2020-10-26T21:46:16.599Z] [INFO] Using 'UTF-8' encoding to copy filtered resources.
17:46:16 [2020-10-26T21:46:16.599Z] [INFO] skip non existing resourceDirectory /home/jenkins/agent/workspace/ease.verify.core.target.oxygen/tests/org.eclipse.ease.lang.javascript.test/src/test/resources
17:46:16 [2020-10-26T21:46:16.599Z] [INFO] 
17:46:16 [2020-10-26T21:46:16.599Z] [INFO] --- tycho-source-plugin:1.5.0:plugin-source (plugin-source) @ org.eclipse.ease.lang.javascript.test ---
17:46:16 [2020-10-26T21:46:16.599Z] [WARNING] Bundle-Vendor header not found in /home/jenkins/agent/workspace/ease.verify.core.target.oxygen/tests/org.eclipse.ease.lang.javascript.test/META-INF/MANIFEST.MF, fallback to 'unknown' for source bundle
17:46:16 [2020-10-26T21:46:16.599Z] [INFO] Building jar: /home/jenkins/agent/workspace/ease.verify.core.target.oxygen/tests/org.eclipse.ease.lang.javascript.test/target/org.eclipse.ease.lang.javascript.test-0.8.0-SNAPSHOT-sources.jar
17:46:16 [2020-10-26T21:46:16.599Z] [INFO] 
17:46:16 [2020-10-26T21:46:16.599Z] [INFO] --- target-platform-configuration:1.5.0:target-platform (default-target-platform) @ org.eclipse.ease.lang.javascript.test ---
17:46:16 [2020-10-26T21:46:16.599Z] [INFO] 
17:46:16 [2020-10-26T21:46:16.600Z] [INFO] --- tycho-packaging-plugin:1.5.0:package-plugin (default-package-plugin) @ org.eclipse.ease.lang.javascript.test ---
17:46:16 [2020-10-26T21:46:16.600Z] [INFO] Building jar: /home/jenkins/agent/workspace/ease.verify.core.target.oxygen/tests/org.eclipse.ease.lang.javascript.test/target/org.eclipse.ease.lang.javascript.test-0.8.0-SNAPSHOT.jar
17:46:16 [2020-10-26T21:46:16.600Z] [INFO] 
17:46:16 [2020-10-26T21:46:16.600Z] [INFO] --- tycho-p2-plugin:1.5.0:p2-metadata-default (default-p2-metadata-default) @ org.eclipse.ease.lang.javascript.test ---
17:46:16 [2020-10-26T21:46:16.600Z] [INFO] 
17:46:16 [2020-10-26T21:46:16.600Z] [INFO] --- tycho-source-feature-plugin:1.5.0:source-feature (source-feature) @ org.eclipse.ease.lang.javascript.test ---
17:46:16 [2020-10-26T21:46:16.600Z] [INFO] 
17:46:16 [2020-10-26T21:46:16.600Z] [INFO] --- tycho-p2-plugin:1.5.0:p2-metadata (attached-p2-metadata) @ org.eclipse.ease.lang.javascript.test ---
17:46:16 [2020-10-26T21:46:16.600Z] [INFO] 
17:46:16 [2020-10-26T21:46:16.600Z] [INFO] --- tycho-surefire-plugin:1.5.0:test (default-test) @ org.eclipse.ease.lang.javascript.test ---
17:46:16 [2020-10-26T21:46:16.600Z] [INFO] Expected eclipse log file: /home/jenkins/agent/workspace/ease.verify.core.target.oxygen/tests/org.eclipse.ease.lang.javascript.test/target/work/data/.metadata/.log
17:46:16 [2020-10-26T21:46:16.600Z] [INFO] Command line:
17:46:16 [2020-10-26T21:46:16.600Z] 	[/opt/tools/java/openjdk/jdk-11/11.0.2+9/bin/java, -Dosgi.noShutdown=false, -Dosgi.os=linux, -Dosgi.ws=gtk, -Dosgi.arch=x86_64, -Dosgi.clean=true, -jar, /home/jenkins/.m2/repository/p2/osgi/bundle/org.eclipse.equinox.launcher/1.4.0.v20161219-1356/org.eclipse.equinox.launcher-1.4.0.v20161219-1356.jar, -data, /home/jenkins/agent/workspace/ease.verify.core.target.oxygen/tests/org.eclipse.ease.lang.javascript.test/target/work/data, -install, /home/jenkins/agent/workspace/ease.verify.core.target.oxygen/tests/org.eclipse.ease.lang.javascript.test/target/work, -configuration, /home/jenkins/agent/workspace/ease.verify.core.target.oxygen/tests/org.eclipse.ease.lang.javascript.test/target/work/configuration, -application, org.eclipse.tycho.surefire.osgibooter.headlesstest, -testproperties, /home/jenkins/agent/workspace/ease.verify.core.target.oxygen/tests/org.eclipse.ease.lang.javascript.test/target/surefire.properties]
17:46:16 [2020-10-26T21:46:16.600Z] Picked up JAVA_TOOL_OPTIONS: -Dmaven.ext.class.path="/home/jenkins/agent/workspace/ease.verify.core.target.oxygen@tmp/withMaven2e82bf04/pipeline-maven-spy.jar" -Dorg.jenkinsci.plugins.pipeline.maven.reportsFolder="/home/jenkins/agent/workspace/ease.verify.core.target.oxygen@tmp/withMaven2e82bf04" 
17:46:18 [2020-10-26T21:46:18.488Z] Running org.eclipse.ease.lang.javascript.JavaScriptCompletionContextTest
17:46:18 [2020-10-26T21:46:18.488Z] Tests run: 8, Failures: 0, Errors: 0, Skipped: 0, Time elapsed: 0.222 s - in org.eclipse.ease.lang.javascript.JavaScriptCompletionContextTest
17:46:18 [2020-10-26T21:46:18.488Z] verifyStaticClassTypes(org.eclipse.ease.lang.javascript.JavaScriptCompletionContextTest)  Time elapsed: 0.005 s
17:46:18 [2020-10-26T21:46:18.488Z] verifyClassInstanceTypes(org.eclipse.ease.lang.javascript.JavaScriptCompletionContextTest)  Time elapsed: 0.016 s
17:46:18 [2020-10-26T21:46:18.488Z] verifyTypesForScriptEngine(org.eclipse.ease.lang.javascript.JavaScriptCompletionContextTest)  Time elapsed: 0.105 s
17:46:18 [2020-10-26T21:46:18.488Z] verifyPackageTypes(org.eclipse.ease.lang.javascript.JavaScriptCompletionContextTest)  Time elapsed: 0 s
17:46:18 [2020-10-26T21:46:18.488Z] definedVariableTypes(org.eclipse.ease.lang.javascript.JavaScriptCompletionContextTest)  Time elapsed: 0.001 s
17:46:18 [2020-10-26T21:46:18.488Z] verifyStringLiteralTypes(org.eclipse.ease.lang.javascript.JavaScriptCompletionContextTest)  Time elapsed: 0 s
17:46:18 [2020-10-26T21:46:18.488Z] verifyUnknownTypes(org.eclipse.ease.lang.javascript.JavaScriptCompletionContextTest)  Time elapsed: 0 s
17:46:18 [2020-10-26T21:46:18.488Z] verifyNoneTypes(org.eclipse.ease.lang.javascript.JavaScriptCompletionContextTest)  Time elapsed: 0 s
17:46:18 [2020-10-26T21:46:18.488Z] Running org.eclipse.ease.lang.javascript.JavaScriptCodeFactoryTest
17:46:18 [2020-10-26T21:46:18.488Z] Tests run: 1, Failures: 0, Errors: 0, Skipped: 0, Time elapsed: 0.002 s - in org.eclipse.ease.lang.javascript.JavaScriptCodeFactoryTest
17:46:18 [2020-10-26T21:46:18.488Z] testCommentCreator(org.eclipse.ease.lang.javascript.JavaScriptCodeFactoryTest)  Time elapsed: 0.001 s
17:46:18 [2020-10-26T21:46:18.488Z] 
17:46:18 [2020-10-26T21:46:18.488Z] Results:
17:46:18 [2020-10-26T21:46:18.488Z] 
17:46:18 [2020-10-26T21:46:18.488Z] Tests run: 9, Failures: 0, Errors: 0, Skipped: 0
17:46:18 [2020-10-26T21:46:18.488Z] 
17:46:18 [2020-10-26T21:46:18.744Z] [INFO] All tests passed!
17:46:18 [2020-10-26T21:46:18.744Z] [INFO] 
17:46:18 [2020-10-26T21:46:18.744Z] [INFO] ---------< org.eclipse.ease:org.eclipse.ease.lang.python.test >---------
17:46:18 [2020-10-26T21:46:18.744Z] [INFO] Building org.eclipse.ease.lang.python.test 0.8.0-SNAPSHOT         [7/11]
17:46:18 [2020-10-26T21:46:18.744Z] [INFO] ------------------------[ eclipse-test-plugin ]-------------------------
17:46:18 [2020-10-26T21:46:18.744Z] [INFO] 
17:46:18 [2020-10-26T21:46:18.744Z] [INFO] --- tycho-packaging-plugin:1.5.0:build-qualifier (default-build-qualifier) @ org.eclipse.ease.lang.python.test ---
17:46:18 [2020-10-26T21:46:18.744Z] [INFO] The project's OSGi version is 0.8.0.I201910171213
17:46:18 [2020-10-26T21:46:18.744Z] [INFO] 
17:46:18 [2020-10-26T21:46:18.744Z] [INFO] --- tycho-packaging-plugin:1.5.0:validate-id (default-validate-id) @ org.eclipse.ease.lang.python.test ---
17:46:18 [2020-10-26T21:46:18.744Z] [INFO] 
17:46:18 [2020-10-26T21:46:18.744Z] [INFO] --- tycho-packaging-plugin:1.5.0:validate-version (default-validate-version) @ org.eclipse.ease.lang.python.test ---
17:46:18 [2020-10-26T21:46:18.744Z] [INFO] 
17:46:18 [2020-10-26T21:46:18.744Z] [INFO] --- maven-resources-plugin:2.4.3:resources (default-resources) @ org.eclipse.ease.lang.python.test ---
17:46:18 [2020-10-26T21:46:18.744Z] [INFO] Using 'UTF-8' encoding to copy filtered resources.
17:46:18 [2020-10-26T21:46:18.745Z] [INFO] skip non existing resourceDirectory /home/jenkins/agent/workspace/ease.verify.core.target.oxygen/tests/org.eclipse.ease.lang.python.test/src/main/resources
17:46:18 [2020-10-26T21:46:18.745Z] [INFO] 
17:46:18 [2020-10-26T21:46:18.745Z] [INFO] --- tycho-compiler-plugin:1.5.0:compile (default-compile) @ org.eclipse.ease.lang.python.test ---
17:46:18 [2020-10-26T21:46:18.745Z] [INFO] Nothing to compile - all classes are up to date
17:46:18 [2020-10-26T21:46:18.745Z] [INFO] 
17:46:18 [2020-10-26T21:46:18.745Z] [INFO] --- maven-resources-plugin:2.4.3:testResources (default-testResources) @ org.eclipse.ease.lang.python.test ---
17:46:18 [2020-10-26T21:46:18.745Z] [INFO] Using 'UTF-8' encoding to copy filtered resources.
17:46:18 [2020-10-26T21:46:18.745Z] [INFO] skip non existing resourceDirectory /home/jenkins/agent/workspace/ease.verify.core.target.oxygen/tests/org.eclipse.ease.lang.python.test/src/test/resources
17:46:18 [2020-10-26T21:46:18.745Z] [INFO] 
17:46:18 [2020-10-26T21:46:18.745Z] [INFO] --- tycho-source-plugin:1.5.0:plugin-source (plugin-source) @ org.eclipse.ease.lang.python.test ---
17:46:18 [2020-10-26T21:46:18.745Z] [WARNING] Bundle-Vendor header not found in /home/jenkins/agent/workspace/ease.verify.core.target.oxygen/tests/org.eclipse.ease.lang.python.test/META-INF/MANIFEST.MF, fallback to 'unknown' for source bundle
17:46:18 [2020-10-26T21:46:18.745Z] [INFO] Building jar: /home/jenkins/agent/workspace/ease.verify.core.target.oxygen/tests/org.eclipse.ease.lang.python.test/target/org.eclipse.ease.lang.python.test-0.8.0-SNAPSHOT-sources.jar
17:46:18 [2020-10-26T21:46:18.745Z] [INFO] 
17:46:18 [2020-10-26T21:46:18.745Z] [INFO] --- target-platform-configuration:1.5.0:target-platform (default-target-platform) @ org.eclipse.ease.lang.python.test ---
17:46:18 [2020-10-26T21:46:18.745Z] [INFO] 
17:46:18 [2020-10-26T21:46:18.745Z] [INFO] --- tycho-packaging-plugin:1.5.0:package-plugin (default-package-plugin) @ org.eclipse.ease.lang.python.test ---
17:46:18 [2020-10-26T21:46:18.745Z] [INFO] Building jar: /home/jenkins/agent/workspace/ease.verify.core.target.oxygen/tests/org.eclipse.ease.lang.python.test/target/org.eclipse.ease.lang.python.test-0.8.0-SNAPSHOT.jar
17:46:18 [2020-10-26T21:46:18.745Z] [INFO] 
17:46:18 [2020-10-26T21:46:18.745Z] [INFO] --- tycho-p2-plugin:1.5.0:p2-metadata-default (default-p2-metadata-default) @ org.eclipse.ease.lang.python.test ---
17:46:18 [2020-10-26T21:46:18.745Z] [INFO] 
17:46:18 [2020-10-26T21:46:18.745Z] [INFO] --- tycho-source-feature-plugin:1.5.0:source-feature (source-feature) @ org.eclipse.ease.lang.python.test ---
17:46:18 [2020-10-26T21:46:18.745Z] [INFO] 
17:46:18 [2020-10-26T21:46:18.745Z] [INFO] --- tycho-p2-plugin:1.5.0:p2-metadata (attached-p2-metadata) @ org.eclipse.ease.lang.python.test ---
17:46:19 [2020-10-26T21:46:19.000Z] [INFO] 
17:46:19 [2020-10-26T21:46:19.000Z] [INFO] --- tycho-surefire-plugin:1.5.0:test (default-test) @ org.eclipse.ease.lang.python.test ---
17:46:19 [2020-10-26T21:46:19.000Z] [INFO] Expected eclipse log file: /home/jenkins/agent/workspace/ease.verify.core.target.oxygen/tests/org.eclipse.ease.lang.python.test/target/work/data/.metadata/.log
17:46:19 [2020-10-26T21:46:19.000Z] [INFO] Command line:
17:46:19 [2020-10-26T21:46:19.000Z] 	[/opt/tools/java/openjdk/jdk-11/11.0.2+9/bin/java, -Dosgi.noShutdown=false, -Dosgi.os=linux, -Dosgi.ws=gtk, -Dosgi.arch=x86_64, -Dosgi.clean=true, -jar, /home/jenkins/.m2/repository/p2/osgi/bundle/org.eclipse.equinox.launcher/1.4.0.v20161219-1356/org.eclipse.equinox.launcher-1.4.0.v20161219-1356.jar, -data, /home/jenkins/agent/workspace/ease.verify.core.target.oxygen/tests/org.eclipse.ease.lang.python.test/target/work/data, -install, /home/jenkins/agent/workspace/ease.verify.core.target.oxygen/tests/org.eclipse.ease.lang.python.test/target/work, -configuration, /home/jenkins/agent/workspace/ease.verify.core.target.oxygen/tests/org.eclipse.ease.lang.python.test/target/work/configuration, -application, org.eclipse.tycho.surefire.osgibooter.headlesstest, -testproperties, /home/jenkins/agent/workspace/ease.verify.core.target.oxygen/tests/org.eclipse.ease.lang.python.test/target/surefire.properties]
17:46:19 [2020-10-26T21:46:19.000Z] Picked up JAVA_TOOL_OPTIONS: -Dmaven.ext.class.path="/home/jenkins/agent/workspace/ease.verify.core.target.oxygen@tmp/withMaven2e82bf04/pipeline-maven-spy.jar" -Dorg.jenkinsci.plugins.pipeline.maven.reportsFolder="/home/jenkins/agent/workspace/ease.verify.core.target.oxygen@tmp/withMaven2e82bf04" 
17:46:20 [2020-10-26T21:46:20.921Z] Running org.eclipse.ease.lang.python.PythonCodeFactoryTest
17:46:20 [2020-10-26T21:46:20.921Z] Tests run: 1, Failures: 0, Errors: 0, Skipped: 0, Time elapsed: 0.033 s - in org.eclipse.ease.lang.python.PythonCodeFactoryTest
17:46:20 [2020-10-26T21:46:20.921Z] testCommentCreator(org.eclipse.ease.lang.python.PythonCodeFactoryTest)  Time elapsed: 0.003 s
17:46:20 [2020-10-26T21:46:20.921Z] 
17:46:20 [2020-10-26T21:46:20.921Z] Results:
17:46:20 [2020-10-26T21:46:20.921Z] 
17:46:20 [2020-10-26T21:46:20.921Z] Tests run: 1, Failures: 0, Errors: 0, Skipped: 0
17:46:20 [2020-10-26T21:46:20.921Z] 
17:46:20 [2020-10-26T21:46:20.921Z] [INFO] All tests passed!
17:46:20 [2020-10-26T21:46:20.921Z] [INFO] 
17:46:20 [2020-10-26T21:46:20.921Z] [INFO] -----< org.eclipse.ease:org.eclipse.ease.lang.python.jython.test >------
17:46:20 [2020-10-26T21:46:20.921Z] [INFO] Building org.eclipse.ease.lang.python.jython.test 0.8.0-SNAPSHOT  [8/11]
17:46:20 [2020-10-26T21:46:20.921Z] [INFO] ------------------------[ eclipse-test-plugin ]-------------------------
17:46:20 [2020-10-26T21:46:20.921Z] [INFO] 
17:46:20 [2020-10-26T21:46:20.921Z] [INFO] --- tycho-packaging-plugin:1.5.0:build-qualifier (default-build-qualifier) @ org.eclipse.ease.lang.python.jython.test ---
17:46:20 [2020-10-26T21:46:20.921Z] [INFO] The project's OSGi version is 0.8.0.I201911291239
17:46:20 [2020-10-26T21:46:20.921Z] [INFO] 
17:46:20 [2020-10-26T21:46:20.921Z] [INFO] --- tycho-packaging-plugin:1.5.0:validate-id (default-validate-id) @ org.eclipse.ease.lang.python.jython.test ---
17:46:20 [2020-10-26T21:46:20.921Z] [INFO] 
17:46:20 [2020-10-26T21:46:20.921Z] [INFO] --- tycho-packaging-plugin:1.5.0:validate-version (default-validate-version) @ org.eclipse.ease.lang.python.jython.test ---
17:46:20 [2020-10-26T21:46:20.921Z] [INFO] 
17:46:20 [2020-10-26T21:46:20.921Z] [INFO] --- maven-resources-plugin:2.4.3:resources (default-resources) @ org.eclipse.ease.lang.python.jython.test ---
17:46:20 [2020-10-26T21:46:20.921Z] [INFO] Using 'UTF-8' encoding to copy filtered resources.
17:46:20 [2020-10-26T21:46:20.921Z] [INFO] skip non existing resourceDirectory /home/jenkins/agent/workspace/ease.verify.core.target.oxygen/tests/org.eclipse.ease.lang.python.jython.test/src/main/resources
17:46:20 [2020-10-26T21:46:20.921Z] [INFO] 
17:46:20 [2020-10-26T21:46:20.921Z] [INFO] --- tycho-compiler-plugin:1.5.0:compile (default-compile) @ org.eclipse.ease.lang.python.jython.test ---
17:46:20 [2020-10-26T21:46:20.921Z] [INFO] Nothing to compile - all classes are up to date
17:46:20 [2020-10-26T21:46:20.921Z] [INFO] 
17:46:20 [2020-10-26T21:46:20.922Z] [INFO] --- maven-resources-plugin:2.4.3:testResources (default-testResources) @ org.eclipse.ease.lang.python.jython.test ---
17:46:21 [2020-10-26T21:46:21.196Z] [INFO] Using 'UTF-8' encoding to copy filtered resources.
17:46:21 [2020-10-26T21:46:21.196Z] [INFO] skip non existing resourceDirectory /home/jenkins/agent/workspace/ease.verify.core.target.oxygen/tests/org.eclipse.ease.lang.python.jython.test/src/test/resources
17:46:21 [2020-10-26T21:46:21.196Z] [INFO] 
17:46:21 [2020-10-26T21:46:21.196Z] [INFO] --- tycho-source-plugin:1.5.0:plugin-source (plugin-source) @ org.eclipse.ease.lang.python.jython.test ---
17:46:21 [2020-10-26T21:46:21.196Z] [WARNING] Bundle-Vendor header not found in /home/jenkins/agent/workspace/ease.verify.core.target.oxygen/tests/org.eclipse.ease.lang.python.jython.test/META-INF/MANIFEST.MF, fallback to 'unknown' for source bundle
17:46:21 [2020-10-26T21:46:21.196Z] [INFO] Building jar: /home/jenkins/agent/workspace/ease.verify.core.target.oxygen/tests/org.eclipse.ease.lang.python.jython.test/target/org.eclipse.ease.lang.python.jython.test-0.8.0-SNAPSHOT-sources.jar
17:46:21 [2020-10-26T21:46:21.196Z] [INFO] 
17:46:21 [2020-10-26T21:46:21.196Z] [INFO] --- target-platform-configuration:1.5.0:target-platform (default-target-platform) @ org.eclipse.ease.lang.python.jython.test ---
17:46:21 [2020-10-26T21:46:21.196Z] [INFO] 
17:46:21 [2020-10-26T21:46:21.196Z] [INFO] --- tycho-packaging-plugin:1.5.0:package-plugin (default-package-plugin) @ org.eclipse.ease.lang.python.jython.test ---
17:46:21 [2020-10-26T21:46:21.196Z] [INFO] Building jar: /home/jenkins/agent/workspace/ease.verify.core.target.oxygen/tests/org.eclipse.ease.lang.python.jython.test/target/org.eclipse.ease.lang.python.jython.test-0.8.0-SNAPSHOT.jar
17:46:21 [2020-10-26T21:46:21.196Z] [INFO] 
17:46:21 [2020-10-26T21:46:21.196Z] [INFO] --- tycho-p2-plugin:1.5.0:p2-metadata-default (default-p2-metadata-default) @ org.eclipse.ease.lang.python.jython.test ---
17:46:21 [2020-10-26T21:46:21.196Z] [INFO] 
17:46:21 [2020-10-26T21:46:21.196Z] [INFO] --- tycho-source-feature-plugin:1.5.0:source-feature (source-feature) @ org.eclipse.ease.lang.python.jython.test ---
17:46:21 [2020-10-26T21:46:21.196Z] [INFO] 
17:46:21 [2020-10-26T21:46:21.196Z] [INFO] --- tycho-p2-plugin:1.5.0:p2-metadata (attached-p2-metadata) @ org.eclipse.ease.lang.python.jython.test ---
17:46:21 [2020-10-26T21:46:21.196Z] [INFO] 
17:46:21 [2020-10-26T21:46:21.196Z] [INFO] --- tycho-surefire-plugin:1.5.0:test (default-test) @ org.eclipse.ease.lang.python.jython.test ---
17:46:21 [2020-10-26T21:46:21.757Z] [INFO] Expected eclipse log file: /home/jenkins/agent/workspace/ease.verify.core.target.oxygen/tests/org.eclipse.ease.lang.python.jython.test/target/work/data/.metadata/.log
17:46:21 [2020-10-26T21:46:21.757Z] [INFO] Command line:
17:46:21 [2020-10-26T21:46:21.757Z] 	[/opt/tools/java/openjdk/jdk-11/11.0.2+9/bin/java, -Dosgi.noShutdown=false, -Dosgi.os=linux, -Dosgi.ws=gtk, -Dosgi.arch=x86_64, -Dosgi.clean=true, -jar, /home/jenkins/.m2/repository/p2/osgi/bundle/org.eclipse.equinox.launcher/1.4.0.v20161219-1356/org.eclipse.equinox.launcher-1.4.0.v20161219-1356.jar, -data, /home/jenkins/agent/workspace/ease.verify.core.target.oxygen/tests/org.eclipse.ease.lang.python.jython.test/target/work/data, -install, /home/jenkins/agent/workspace/ease.verify.core.target.oxygen/tests/org.eclipse.ease.lang.python.jython.test/target/work, -configuration, /home/jenkins/agent/workspace/ease.verify.core.target.oxygen/tests/org.eclipse.ease.lang.python.jython.test/target/work/configuration, -application, org.eclipse.tycho.surefire.osgibooter.headlesstest, -testproperties, /home/jenkins/agent/workspace/ease.verify.core.target.oxygen/tests/org.eclipse.ease.lang.python.jython.test/target/surefire.properties]
17:46:21 [2020-10-26T21:46:21.757Z] Picked up JAVA_TOOL_OPTIONS: -Dmaven.ext.class.path="/home/jenkins/agent/workspace/ease.verify.core.target.oxygen@tmp/withMaven2e82bf04/pipeline-maven-spy.jar" -Dorg.jenkinsci.plugins.pipeline.maven.reportsFolder="/home/jenkins/agent/workspace/ease.verify.core.target.oxygen@tmp/withMaven2e82bf04" 
17:46:23 [2020-10-26T21:46:23.135Z] WARNING: An illegal reflective access operation has occurred
17:46:23 [2020-10-26T21:46:23.135Z] WARNING: Illegal reflective access by org.python.core.PySystemState (file:/home/jenkins/agent/workspace/ease.verify.core.target.oxygen/tests/org.eclipse.ease.lang.python.jython.test/target/work/plugins/org.jython_2.7.0.I201609090924/jython.jar) to method java.io.Console.encoding()
17:46:23 [2020-10-26T21:46:23.135Z] WARNING: Please consider reporting this to the maintainers of org.python.core.PySystemState
17:46:23 [2020-10-26T21:46:23.135Z] WARNING: Use --illegal-access=warn to enable warnings of further illegal reflective access operations
17:46:23 [2020-10-26T21:46:23.135Z] WARNING: All illegal access operations will be denied in a future release
17:46:23 [2020-10-26T21:46:23.398Z] Running org.eclipse.ease.lang.python.jython.debugger.JythonDebugTest
17:46:24 [2020-10-26T21:46:24.761Z] Start of script
17:46:24 [2020-10-26T21:46:24.761Z] include file start
17:46:24 [2020-10-26T21:46:24.761Z] include file processed
17:46:24 [2020-10-26T21:46:24.761Z] Result of testMethod = 5
17:46:24 [2020-10-26T21:46:24.761Z] End of script
17:46:24 [2020-10-26T21:46:24.761Z] Start of script
17:46:25 [2020-10-26T21:46:25.017Z] include file start
17:46:25 [2020-10-26T21:46:25.017Z] include file processed
17:46:25 [2020-10-26T21:46:25.017Z] Result of testMethod = 5
17:46:25 [2020-10-26T21:46:25.017Z] End of script
17:46:25 [2020-10-26T21:46:25.017Z] Start of script
17:46:25 [2020-10-26T21:46:25.017Z] include file start
17:46:25 [2020-10-26T21:46:25.017Z] include file processed
17:46:25 [2020-10-26T21:46:25.017Z] Result of testMethod = 5
17:46:25 [2020-10-26T21:46:25.273Z] Traceback (most recent call last):
17:46:25 [2020-10-26T21:46:25.273Z]   File "(none)", line 184, in run
17:46:25 [2020-10-26T21:46:25.273Z]   File "__ref_L/Debug Test/Main.py_eadpleawgy", line 23, in <module>
17:46:25 [2020-10-26T21:46:25.273Z]   File "(none)", line 161, in trace_dispatch
17:46:25 [2020-10-26T21:46:25.273Z] org.eclipse.ease.ExitException: 
17:46:25 [2020-10-26T21:46:25.273Z] 
17:46:25 [2020-10-26T21:46:25.273Z] org.eclipse.ease.ExitException: org.eclipse.ease.ExitException: 
17:46:25 [2020-10-26T21:46:25.273Z] Start of script
17:46:25 [2020-10-26T21:46:25.273Z] include file start
17:46:25 [2020-10-26T21:46:25.273Z] include file processed
17:46:25 [2020-10-26T21:46:25.528Z] Result of testMethod = 5
17:46:25 [2020-10-26T21:46:25.528Z] End of script
17:46:25 [2020-10-26T21:46:25.783Z] Start of script
17:46:25 [2020-10-26T21:46:25.783Z] include file start
17:46:25 [2020-10-26T21:46:25.783Z] include file processed
17:46:25 [2020-10-26T21:46:25.783Z] Result of testMethod = 5
17:46:25 [2020-10-26T21:46:25.783Z] End of script
17:46:26 [2020-10-26T21:46:26.040Z] Start of script
17:46:26 [2020-10-26T21:46:26.040Z] include file start
17:46:26 [2020-10-26T21:46:26.040Z] include file processed
17:46:26 [2020-10-26T21:46:26.040Z] Result of testMethod = 5
17:46:26 [2020-10-26T21:46:26.040Z] End of script
17:46:26 [2020-10-26T21:46:26.296Z] Start of script
17:46:26 [2020-10-26T21:46:26.296Z] include file start
17:46:26 [2020-10-26T21:46:26.296Z] include file processed
17:46:26 [2020-10-26T21:46:26.296Z] Result of testMethod = 5
17:46:26 [2020-10-26T21:46:26.551Z] Traceback (most recent call last):
17:46:26 [2020-10-26T21:46:26.551Z]   File "(none)", line 184, in run
17:46:26 [2020-10-26T21:46:26.551Z]   File "__ref_L/Debug Test/Main.py_tzpivxdccm", line 23, in <module>
17:46:26 [2020-10-26T21:46:26.551Z]   File "(none)", line 161, in trace_dispatch
17:46:26 [2020-10-26T21:46:26.551Z] org.eclipse.ease.ExitException: 
17:46:26 [2020-10-26T21:46:26.551Z] 
17:46:26 [2020-10-26T21:46:26.551Z] org.eclipse.ease.ExitException: org.eclipse.ease.ExitException: 
17:46:26 [2020-10-26T21:46:26.551Z] Start of script
17:46:26 [2020-10-26T21:46:26.551Z] include file start
17:46:26 [2020-10-26T21:46:26.551Z] include file processed
17:46:26 [2020-10-26T21:46:26.807Z] Result of testMethod = 5
17:46:26 [2020-10-26T21:46:26.807Z] End of script
17:46:26 [2020-10-26T21:46:26.807Z] Start of script
17:46:26 [2020-10-26T21:46:26.807Z] include file start
17:46:26 [2020-10-26T21:46:26.807Z] include file processed
17:46:26 [2020-10-26T21:46:26.807Z] Result of testMethod = 5
17:46:27 [2020-10-26T21:46:27.063Z] End of script
17:46:27 [2020-10-26T21:46:27.063Z] Start of script
17:46:27 [2020-10-26T21:46:27.063Z] include file start
17:46:27 [2020-10-26T21:46:27.063Z] include file processed
17:46:27 [2020-10-26T21:46:27.625Z] Traceback (most recent call last):
17:46:27 [2020-10-26T21:46:27.625Z]   File "(none)", line 184, in run
17:46:27 [2020-10-26T21:46:27.625Z]   File "__ref_L/Debug Test/Main.py_joepkvgokd", line 22, in <module>
17:46:27 [2020-10-26T21:46:27.625Z]   File "(none)", line 161, in trace_dispatch
17:46:27 [2020-10-26T21:46:27.625Z] org.eclipse.ease.ExitException: 
17:46:27 [2020-10-26T21:46:27.625Z] 
17:46:27 [2020-10-26T21:46:27.625Z] org.eclipse.ease.ExitException: org.eclipse.ease.ExitException: 
17:46:27 [2020-10-26T21:46:27.625Z] Start of script
17:46:27 [2020-10-26T21:46:27.625Z] include file start
17:46:27 [2020-10-26T21:46:27.625Z] include file processed
17:46:27 [2020-10-26T21:46:27.625Z] Result of testMethod = 5
17:46:27 [2020-10-26T21:46:27.625Z] End of script
17:46:27 [2020-10-26T21:46:27.880Z] Start of script
17:46:27 [2020-10-26T21:46:27.880Z] include file start
17:46:27 [2020-10-26T21:46:27.880Z] include file processed
17:46:27 [2020-10-26T21:46:27.880Z] Result of testMethod = 5
17:46:27 [2020-10-26T21:46:27.880Z] End of script
17:46:28 [2020-10-26T21:46:28.136Z] Traceback (most recent call last):
17:46:28 [2020-10-26T21:46:28.136Z]   File "(none)", line 184, in run
17:46:28 [2020-10-26T21:46:28.136Z]   File "__ref_L/Debug Test/Main.py_pnmxeltjvx", line 1, in <module>
17:46:28 [2020-10-26T21:46:28.136Z]   File "(none)", line 161, in trace_dispatch
17:46:28 [2020-10-26T21:46:28.136Z] org.eclipse.ease.ExitException: 
17:46:28 [2020-10-26T21:46:28.136Z] 
17:46:28 [2020-10-26T21:46:28.136Z] org.eclipse.ease.ExitException: org.eclipse.ease.ExitException: 
17:46:28 [2020-10-26T21:46:28.391Z] Start of script
17:46:28 [2020-10-26T21:46:28.391Z] include file start
17:46:28 [2020-10-26T21:46:28.391Z] include file processed
17:46:28 [2020-10-26T21:46:28.391Z] Result of testMethod = 5
17:46:28 [2020-10-26T21:46:28.391Z] End of script
17:46:28 [2020-10-26T21:46:28.647Z] Start of script
17:46:28 [2020-10-26T21:46:28.647Z] include file start
17:46:28 [2020-10-26T21:46:28.647Z] include file processed
17:46:28 [2020-10-26T21:46:28.647Z] Result of testMethod = 5
17:46:28 [2020-10-26T21:46:28.647Z] End of script
17:46:28 [2020-10-26T21:46:28.905Z] Start of script
17:46:28 [2020-10-26T21:46:28.905Z] include file start
17:46:28 [2020-10-26T21:46:28.905Z] include file processed
17:46:28 [2020-10-26T21:46:28.905Z] Result of testMethod = 5
17:46:29 [2020-10-26T21:46:29.162Z] Traceback (most recent call last):
17:46:29 [2020-10-26T21:46:29.162Z]   File "(none)", line 184, in run
17:46:29 [2020-10-26T21:46:29.162Z]   File "__ref_L/Debug Test/Main.py_zebkoffssq", line 23, in <module>
17:46:29 [2020-10-26T21:46:29.162Z]   File "(none)", line 161, in trace_dispatch
17:46:29 [2020-10-26T21:46:29.162Z] org.eclipse.ease.ExitException: 
17:46:29 [2020-10-26T21:46:29.162Z] 
17:46:29 [2020-10-26T21:46:29.162Z] org.eclipse.ease.ExitException: org.eclipse.ease.ExitException: 
17:46:29 [2020-10-26T21:46:29.162Z] Start of script
17:46:29 [2020-10-26T21:46:29.162Z] include file start
17:46:29 [2020-10-26T21:46:29.162Z] include file processed
17:46:29 [2020-10-26T21:46:29.417Z] Result of testMethod = 5
17:46:29 [2020-10-26T21:46:29.417Z] End of script
17:46:29 [2020-10-26T21:46:29.673Z] Traceback (most recent call last):
17:46:29 [2020-10-26T21:46:29.673Z]   File "(none)", line 184, in run
17:46:29 [2020-10-26T21:46:29.673Z]   File "__ref_L/Debug Test/Main.py_geehzfjtkl", line 1, in <module>
17:46:29 [2020-10-26T21:46:29.673Z]   File "(none)", line 161, in trace_dispatch
17:46:29 [2020-10-26T21:46:29.673Z] org.eclipse.ease.ExitException: 
17:46:29 [2020-10-26T21:46:29.673Z] 
17:46:29 [2020-10-26T21:46:29.673Z] org.eclipse.ease.ExitException: org.eclipse.ease.ExitException: 
17:46:29 [2020-10-26T21:46:29.673Z] Start of script
17:46:29 [2020-10-26T21:46:29.673Z] include file start
17:46:29 [2020-10-26T21:46:29.673Z] include file processed
17:46:29 [2020-10-26T21:46:29.673Z] Result of testMethod = 5
17:46:29 [2020-10-26T21:46:29.673Z] End of script
17:46:29 [2020-10-26T21:46:29.929Z] Start of script
17:46:29 [2020-10-26T21:46:29.929Z] include file start
17:46:29 [2020-10-26T21:46:29.929Z] include file processed
17:46:30 [2020-10-26T21:46:30.185Z] Result of testMethod = 5
17:46:30 [2020-10-26T21:46:30.185Z] End of script
17:46:30 [2020-10-26T21:46:30.185Z] Traceback (most recent call last):
17:46:30 [2020-10-26T21:46:30.185Z]   File "(none)", line 184, in run
17:46:30 [2020-10-26T21:46:30.185Z]   File "__ref_L/Debug Test/Main.py_anbutoobow", line 1, in <module>
17:46:30 [2020-10-26T21:46:30.185Z]   File "(none)", line 161, in trace_dispatch
17:46:30 [2020-10-26T21:46:30.185Z] org.eclipse.ease.ExitException: 
17:46:30 [2020-10-26T21:46:30.185Z] 
17:46:30 [2020-10-26T21:46:30.185Z] org.eclipse.ease.ExitException: org.eclipse.ease.ExitException: 
17:46:30 [2020-10-26T21:46:30.442Z] Start of script
17:46:30 [2020-10-26T21:46:30.442Z] include file start
17:46:30 [2020-10-26T21:46:30.442Z] include file processed
17:46:30 [2020-10-26T21:46:30.697Z] Result of testMethod = 5
17:46:30 [2020-10-26T21:46:30.697Z] End of script
17:46:30 [2020-10-26T21:46:30.697Z] Start of script
17:46:30 [2020-10-26T21:46:30.697Z] include file start
17:46:30 [2020-10-26T21:46:30.697Z] include file processed
17:46:30 [2020-10-26T21:46:30.697Z] Result of testMethod = 5
17:46:30 [2020-10-26T21:46:30.953Z] Traceback (most recent call last):
17:46:30 [2020-10-26T21:46:30.953Z]   File "(none)", line 184, in run
17:46:30 [2020-10-26T21:46:30.953Z]   File "__ref_L/Debug Test/Main.py_kqnxurlcep", line 23, in <module>
17:46:30 [2020-10-26T21:46:30.953Z]   File "(none)", line 161, in trace_dispatch
17:46:30 [2020-10-26T21:46:30.953Z] org.eclipse.ease.ExitException: 
17:46:30 [2020-10-26T21:46:30.953Z] 
17:46:30 [2020-10-26T21:46:30.953Z] org.eclipse.ease.ExitException: org.eclipse.ease.ExitException: 
17:46:31 [2020-10-26T21:46:31.208Z] Start of script
17:46:31 [2020-10-26T21:46:31.208Z] include file start
17:46:31 [2020-10-26T21:46:31.208Z] include file processed
17:46:31 [2020-10-26T21:46:31.208Z] Result of testMethod = 5
17:46:31 [2020-10-26T21:46:31.208Z] End of script
17:46:31 [2020-10-26T21:46:31.208Z] Start of script
17:46:31 [2020-10-26T21:46:31.208Z] include file start
17:46:31 [2020-10-26T21:46:31.208Z] include file processed
17:46:31 [2020-10-26T21:46:31.463Z] Result of testMethod = 5
17:46:31 [2020-10-26T21:46:31.463Z] End of script
17:46:31 [2020-10-26T21:46:31.463Z] Start of script
17:46:31 [2020-10-26T21:46:31.463Z] include file start
17:46:31 [2020-10-26T21:46:31.463Z] include file processed
17:46:31 [2020-10-26T21:46:31.463Z] Result of testMethod = 5
17:46:31 [2020-10-26T21:46:31.463Z] End of script
17:46:31 [2020-10-26T21:46:31.719Z] Start of script
17:46:31 [2020-10-26T21:46:31.719Z] include file start
17:46:31 [2020-10-26T21:46:31.719Z] include file processed
17:46:31 [2020-10-26T21:46:31.719Z] Result of testMethod = 5
17:46:31 [2020-10-26T21:46:31.719Z] End of script
17:46:31 [2020-10-26T21:46:31.975Z] Start of script
17:46:31 [2020-10-26T21:46:31.975Z] include file start
17:46:31 [2020-10-26T21:46:31.975Z] include file processed
17:46:32 [2020-10-26T21:46:32.231Z] Traceback (most recent call last):
17:46:32 [2020-10-26T21:46:32.231Z]   File "(none)", line 184, in run
17:46:32 [2020-10-26T21:46:32.231Z]   File "__ref_L/Debug Test/Main.py_cprtpkssdw", line 21, in <module>
17:46:32 [2020-10-26T21:46:32.231Z]   File "__ref_L/Debug Test/Main.py_cprtpkssdw", line 18, in testMethod
17:46:32 [2020-10-26T21:46:32.231Z]   File "(none)", line 161, in trace_dispatch
17:46:32 [2020-10-26T21:46:32.231Z] org.eclipse.ease.ExitException: 
17:46:32 [2020-10-26T21:46:32.231Z] 
17:46:32 [2020-10-26T21:46:32.231Z] org.eclipse.ease.ExitException: org.eclipse.ease.ExitException: 
17:46:32 [2020-10-26T21:46:32.231Z] Start of script
17:46:32 [2020-10-26T21:46:32.487Z] include file start
17:46:32 [2020-10-26T21:46:32.487Z] include file processed
17:46:32 [2020-10-26T21:46:32.487Z] Result of testMethod = 5
17:46:32 [2020-10-26T21:46:32.487Z] End of script
17:46:32 [2020-10-26T21:46:32.487Z] Start of script
17:46:32 [2020-10-26T21:46:32.487Z] include file start
17:46:32 [2020-10-26T21:46:32.487Z] include file processed
17:46:32 [2020-10-26T21:46:32.487Z] Result of testMethod = 5
17:46:32 [2020-10-26T21:46:32.743Z] Traceback (most recent call last):
17:46:32 [2020-10-26T21:46:32.743Z]   File "(none)", line 184, in run
17:46:32 [2020-10-26T21:46:32.743Z]   File "__ref_L/Debug Test/Main.py_pucwrmocom", line 23, in <module>
17:46:32 [2020-10-26T21:46:32.743Z]   File "(none)", line 161, in trace_dispatch
17:46:32 [2020-10-26T21:46:32.744Z] org.eclipse.ease.ExitException: 
17:46:32 [2020-10-26T21:46:32.744Z] 
17:46:32 [2020-10-26T21:46:32.744Z] org.eclipse.ease.ExitException: org.eclipse.ease.ExitException: 
17:46:32 [2020-10-26T21:46:32.744Z] Start of script
17:46:32 [2020-10-26T21:46:32.744Z] include file start
17:46:32 [2020-10-26T21:46:32.744Z] include file processed
17:46:32 [2020-10-26T21:46:32.744Z] Result of testMethod = 5
17:46:33 [2020-10-26T21:46:33.000Z] End of script
17:46:33 [2020-10-26T21:46:33.000Z] Start of script
17:46:33 [2020-10-26T21:46:33.000Z] include file start
17:46:33 [2020-10-26T21:46:33.000Z] include file processed
17:46:33 [2020-10-26T21:46:33.257Z] Result of testMethod = 5
17:46:33 [2020-10-26T21:46:33.257Z] End of script
17:46:33 [2020-10-26T21:46:33.257Z] Start of script
17:46:33 [2020-10-26T21:46:33.257Z] include file start
17:46:33 [2020-10-26T21:46:33.257Z] include file processed
17:46:33 [2020-10-26T21:46:33.512Z] Result of testMethod = 5
17:46:33 [2020-10-26T21:46:33.512Z] End of script
17:46:33 [2020-10-26T21:46:33.768Z] Start of script
17:46:33 [2020-10-26T21:46:33.768Z] include file start
17:46:33 [2020-10-26T21:46:33.768Z] include file processed
17:46:33 [2020-10-26T21:46:33.768Z] Result of testMethod = 5
17:46:33 [2020-10-26T21:46:33.768Z] End of script
17:46:33 [2020-10-26T21:46:33.768Z] Start of script
17:46:33 [2020-10-26T21:46:33.768Z] include file start
17:46:33 [2020-10-26T21:46:33.768Z] include file processed
17:46:33 [2020-10-26T21:46:33.768Z] Result of testMethod = 5
17:46:34 [2020-10-26T21:46:34.024Z] Traceback (most recent call last):
17:46:34 [2020-10-26T21:46:34.024Z]   File "(none)", line 184, in run
17:46:34 [2020-10-26T21:46:34.024Z]   File "__ref_L/Debug Test/Main.py_jibiqixkwx", line 23, in <module>
17:46:34 [2020-10-26T21:46:34.024Z]   File "(none)", line 161, in trace_dispatch
17:46:34 [2020-10-26T21:46:34.024Z] org.eclipse.ease.ExitException: 
17:46:34 [2020-10-26T21:46:34.024Z] 
17:46:34 [2020-10-26T21:46:34.024Z] org.eclipse.ease.ExitException: org.eclipse.ease.ExitException: 
17:46:34 [2020-10-26T21:46:34.279Z] Start of script
17:46:34 [2020-10-26T21:46:34.279Z] include file start
17:46:34 [2020-10-26T21:46:34.279Z] include file processed
17:46:34 [2020-10-26T21:46:34.279Z] Result of testMethod = 5
17:46:34 [2020-10-26T21:46:34.279Z] End of script
17:46:34 [2020-10-26T21:46:34.279Z] Start of script
17:46:34 [2020-10-26T21:46:34.279Z] include file start
17:46:34 [2020-10-26T21:46:34.279Z] include file processed
17:46:34 [2020-10-26T21:46:34.279Z] Result of testMethod = 5
17:46:34 [2020-10-26T21:46:34.535Z] Traceback (most recent call last):
17:46:34 [2020-10-26T21:46:34.535Z]   File "(none)", line 184, in run
17:46:34 [2020-10-26T21:46:34.535Z]   File "__ref_L/Debug Test/Main.py_anecunyqwm", line 23, in <module>
17:46:34 [2020-10-26T21:46:34.535Z]   File "(none)", line 161, in trace_dispatch
17:46:34 [2020-10-26T21:46:34.535Z] org.eclipse.ease.ExitException: 
17:46:34 [2020-10-26T21:46:34.535Z] 
17:46:34 [2020-10-26T21:46:34.535Z] org.eclipse.ease.ExitException: org.eclipse.ease.ExitException: 
17:46:34 [2020-10-26T21:46:34.790Z] Traceback (most recent call last):
17:46:34 [2020-10-26T21:46:34.790Z]   File "(none)", line 184, in run
17:46:34 [2020-10-26T21:46:34.790Z]   File "__ref_L/Debug Test/Main.py_qakbyhnwif", line 1, in <module>
17:46:34 [2020-10-26T21:46:34.790Z]   File "(none)", line 161, in trace_dispatch
17:46:34 [2020-10-26T21:46:34.790Z] org.eclipse.ease.ExitException: 
17:46:34 [2020-10-26T21:46:34.790Z] 
17:46:34 [2020-10-26T21:46:34.790Z] org.eclipse.ease.ExitException: org.eclipse.ease.ExitException: 
17:46:35 [2020-10-26T21:46:35.045Z] Start of script
17:46:35 [2020-10-26T21:46:35.045Z] include file start
17:46:35 [2020-10-26T21:46:35.045Z] include file processed
17:46:35 [2020-10-26T21:46:35.045Z] Result of testMethod = 5
17:46:35 [2020-10-26T21:46:35.045Z] End of script
17:46:35 [2020-10-26T21:46:35.045Z] Start of script
17:46:35 [2020-10-26T21:46:35.045Z] include file start
17:46:35 [2020-10-26T21:46:35.045Z] include file processed
17:46:35 [2020-10-26T21:46:35.300Z] Result of testMethod = 5
17:46:35 [2020-10-26T21:46:35.300Z] End of script
17:46:35 [2020-10-26T21:46:35.300Z] Start of script
17:46:35 [2020-10-26T21:46:35.300Z] include file start
17:46:35 [2020-10-26T21:46:35.300Z] include file processed
17:46:35 [2020-10-26T21:46:35.300Z] Result of testMethod = 5
17:46:35 [2020-10-26T21:46:35.556Z] End of script
17:46:35 [2020-10-26T21:46:35.556Z] Tests run: 42, Failures: 1, Errors: 0, Skipped: 0, Time elapsed: 12.137 s <<< FAILURE! - in org.eclipse.ease.lang.python.jython.debugger.JythonDebugTest
17:46:35 [2020-10-26T21:46:35.556Z] disconnectProcessInSuspendedState(org.eclipse.ease.lang.python.jython.debugger.JythonDebugTest)  Time elapsed: 1.326 s  <<< FAILURE!
17:46:35 [2020-10-26T21:46:35.556Z] java.lang.AssertionError: expected:<1> but was:<0>
17:46:35 [2020-10-26T21:46:35.556Z] 
17:46:35 [2020-10-26T21:46:35.556Z] stepReturnIncludeCommand(org.eclipse.ease.lang.python.jython.debugger.JythonDebugTest)  Time elapsed: 0.213 s
17:46:35 [2020-10-26T21:46:35.556Z] arrayVariableSorting(org.eclipse.ease.lang.python.jython.debugger.JythonDebugTest)  Time elapsed: 0.311 s
17:46:35 [2020-10-26T21:46:35.556Z] stepOverOnDebugTarget(org.eclipse.ease.lang.python.jython.debugger.JythonDebugTest)  Time elapsed: 0.309 s
17:46:35 [2020-10-26T21:46:35.556Z] hasDebugTarget(org.eclipse.ease.lang.python.jython.debugger.JythonDebugTest)  Time elapsed: 0.105 s
17:46:35 [2020-10-26T21:46:35.556Z] disconnectThreadInSuspendedState(org.eclipse.ease.lang.python.jython.debugger.JythonDebugTest)  Time elapsed: 0.213 s
17:46:35 [2020-10-26T21:46:35.556Z] stepReturnOnDebugTarget(org.eclipse.ease.lang.python.jython.debugger.JythonDebugTest)  Time elapsed: 0.309 s
17:46:35 [2020-10-26T21:46:35.556Z] nullVariable(org.eclipse.ease.lang.python.jython.debugger.JythonDebugTest)  Time elapsed: 0.309 s
17:46:35 [2020-10-26T21:46:35.556Z] stepOverOnStackFrame(org.eclipse.ease.lang.python.jython.debugger.JythonDebugTest)  Time elapsed: 0.309 s
17:46:35 [2020-10-26T21:46:35.556Z] resumeOnDebugTarget(org.eclipse.ease.lang.python.jython.debugger.JythonDebugTest)  Time elapsed: 0.207 s
17:46:35 [2020-10-26T21:46:35.556Z] modifyVariableKeepingType(org.eclipse.ease.lang.python.jython.debugger.JythonDebugTest)  Time elapsed: 0.507 s
17:46:35 [2020-10-26T21:46:35.556Z] resumeOnLastIncludeLine(org.eclipse.ease.lang.python.jython.debugger.JythonDebugTest)  Time elapsed: 0.207 s
17:46:35 [2020-10-26T21:46:35.556Z] stepReturnOnStackFrame(org.eclipse.ease.lang.python.jython.debugger.JythonDebugTest)  Time elapsed: 0.307 s
17:46:35 [2020-10-26T21:46:35.556Z] terminateStackFrameInSuspendedState(org.eclipse.ease.lang.python.jython.debugger.JythonDebugTest)  Time elapsed: 0.207 s
17:46:35 [2020-10-26T21:46:35.556Z] breakpointLocation(org.eclipse.ease.lang.python.jython.debugger.JythonDebugTest)  Time elapsed: 0.206 s
17:46:35 [2020-10-26T21:46:35.556Z] stepReturnOnThread(org.eclipse.ease.lang.python.jython.debugger.JythonDebugTest)  Time elapsed: 0.307 s
17:46:35 [2020-10-26T21:46:35.556Z] javaClassVariable(org.eclipse.ease.lang.python.jython.debugger.JythonDebugTest)  Time elapsed: 0.308 s
17:46:35 [2020-10-26T21:46:35.556Z] stepIntoOnThread(org.eclipse.ease.lang.python.jython.debugger.JythonDebugTest)  Time elapsed: 0.307 s
17:46:35 [2020-10-26T21:46:35.556Z] terminateThreadInSuspendedState(org.eclipse.ease.lang.python.jython.debugger.JythonDebugTest)  Time elapsed: 0.207 s
17:46:35 [2020-10-26T21:46:35.556Z] resumeOnThread(org.eclipse.ease.lang.python.jython.debugger.JythonDebugTest)  Time elapsed: 0.207 s
17:46:35 [2020-10-26T21:46:35.556Z] stepIntoOnStackFrame(org.eclipse.ease.lang.python.jython.debugger.JythonDebugTest)  Time elapsed: 0.307 s
17:46:35 [2020-10-26T21:46:35.556Z] terminateProcessInSuspendedState(org.eclipse.ease.lang.python.jython.debugger.JythonDebugTest)  Time elapsed: 0.206 s
17:46:35 [2020-10-26T21:46:35.556Z] stepOverOnProcess(org.eclipse.ease.lang.python.jython.debugger.JythonDebugTest)  Time elapsed: 0.307 s
17:46:35 [2020-10-26T21:46:35.556Z] nativeArrayVariable(org.eclipse.ease.lang.python.jython.debugger.JythonDebugTest)  Time elapsed: 0.306 s
17:46:35 [2020-10-26T21:46:35.556Z] disconnectDebugTargetInSuspendedState(org.eclipse.ease.lang.python.jython.debugger.JythonDebugTest)  Time elapsed: 0.206 s
17:46:35 [2020-10-26T21:46:35.556Z] stepIntoOnProcess(org.eclipse.ease.lang.python.jython.debugger.JythonDebugTest)  Time elapsed: 0.306 s
17:46:35 [2020-10-26T21:46:35.556Z] terminatedState(org.eclipse.ease.lang.python.jython.debugger.JythonDebugTest)  Time elapsed: 0.105 s
17:46:35 [2020-10-26T21:46:35.556Z] stepOverIncludeCommand(org.eclipse.ease.lang.python.jython.debugger.JythonDebugTest)  Time elapsed: 0.304 s
17:46:35 [2020-10-26T21:46:35.556Z] innerScopeVariableBeforeOuterScopeVariable(org.eclipse.ease.lang.python.jython.debugger.JythonDebugTest)  Time elapsed: 0.306 s
17:46:35 [2020-10-26T21:46:35.556Z] stepIntoIncludeCommand(org.eclipse.ease.lang.python.jython.debugger.JythonDebugTest)  Time elapsed: 0.304 s
17:46:35 [2020-10-26T21:46:35.556Z] primitiveStringVariable(org.eclipse.ease.lang.python.jython.debugger.JythonDebugTest)  Time elapsed: 0.306 s
17:46:35 [2020-10-26T21:46:35.556Z] resumeOnProcess(org.eclipse.ease.lang.python.jython.debugger.JythonDebugTest)  Time elapsed: 0.205 s
17:46:35 [2020-10-26T21:46:35.556Z] stepIntoOnDebugTarget(org.eclipse.ease.lang.python.jython.debugger.JythonDebugTest)  Time elapsed: 0.306 s
17:46:35 [2020-10-26T21:46:35.556Z] stepOverOnThread(org.eclipse.ease.lang.python.jython.debugger.JythonDebugTest)  Time elapsed: 0.306 s
17:46:35 [2020-10-26T21:46:35.556Z] suspendedState(org.eclipse.ease.lang.python.jython.debugger.JythonDebugTest)  Time elapsed: 0.207 s
17:46:35 [2020-10-26T21:46:35.556Z] primitiveDoubleVariable(org.eclipse.ease.lang.python.jython.debugger.JythonDebugTest)  Time elapsed: 0.306 s
17:46:35 [2020-10-26T21:46:35.556Z] resumeOnStackFrame(org.eclipse.ease.lang.python.jython.debugger.JythonDebugTest)  Time elapsed: 0.206 s
17:46:35 [2020-10-26T21:46:35.556Z] nativeObjectVariable(org.eclipse.ease.lang.python.jython.debugger.JythonDebugTest)  Time elapsed: 0.306 s
17:46:35 [2020-10-26T21:46:35.556Z] terminateDebugTargetInSuspendedState(org.eclipse.ease.lang.python.jython.debugger.JythonDebugTest)  Time elapsed: 0.206 s
17:46:35 [2020-10-26T21:46:35.556Z] disconnectStackFrameInSuspendedState(org.eclipse.ease.lang.python.jython.debugger.JythonDebugTest)  Time elapsed: 0.206 s
17:46:35 [2020-10-26T21:46:35.557Z] stepReturnOnProcess(org.eclipse.ease.lang.python.jython.debugger.JythonDebugTest)  Time elapsed: 0.306 s
17:46:35 [2020-10-26T21:46:35.557Z] evaluateWatchExpression(org.eclipse.ease.lang.python.jython.debugger.JythonDebugTest)  Time elapsed: 0.208 s
17:46:35 [2020-10-26T21:46:35.557Z] 
17:46:35 [2020-10-26T21:46:35.557Z] Results:
17:46:35 [2020-10-26T21:46:35.557Z] 
17:46:35 [2020-10-26T21:46:35.557Z] Failures: 
17:46:35 [2020-10-26T21:46:35.557Z]   JythonDebugTest>AbstractDebugTest.disconnectProcessInSuspendedState:523->AbstractDebugTest.disconnectTestTemplate:513 expected:<1> but was:<0>
17:46:35 [2020-10-26T21:46:35.557Z] 
17:46:35 [2020-10-26T21:46:35.557Z] Tests run: 42, Failures: 1, Errors: 0, Skipped: 0
17:46:35 [2020-10-26T21:46:35.557Z] 
17:46:36 [2020-10-26T21:46:36.117Z] [INFO] ------------------------------------------------------------------------
17:46:36 [2020-10-26T21:46:36.117Z] [INFO] Reactor Summary for org.eclipse.ease.releng 0.8.0-SNAPSHOT:
17:46:36 [2020-10-26T21:46:36.118Z] [INFO] 
17:46:36 [2020-10-26T21:46:36.118Z] [INFO] org.eclipse.ease.releng ............................ SUCCESS [  0.002 s]
17:46:36 [2020-10-26T21:46:36.118Z] [INFO] org.eclipse.ease.releng.target ..................... SUCCESS [  0.134 s]
17:46:36 [2020-10-26T21:46:36.118Z] [INFO] org.eclipse.ease.test .............................. SUCCESS [ 15.795 s]
17:46:36 [2020-10-26T21:46:36.118Z] [INFO] org.eclipse.ease.lang.javascript.nashorn.test ...... SUCCESS [  3.245 s]
17:46:36 [2020-10-26T21:46:36.118Z] [INFO] org.eclipse.ease.lang.javascript.rhino.test ........ SUCCESS [ 13.785 s]
17:46:36 [2020-10-26T21:46:36.118Z] [INFO] org.eclipse.ease.lang.javascript.test .............. SUCCESS [  2.401 s]
17:46:36 [2020-10-26T21:46:36.118Z] [INFO] org.eclipse.ease.lang.python.test .................. SUCCESS [  2.208 s]
17:46:36 [2020-10-26T21:46:36.118Z] [INFO] org.eclipse.ease.lang.python.jython.test ........... FAILURE [ 15.035 s]
17:46:36 [2020-10-26T21:46:36.118Z] [INFO] org.eclipse.ease.lang.python.py4j.test ............. SKIPPED
17:46:36 [2020-10-26T21:46:36.118Z] [INFO] org.eclipse.ease.lang.scriptarchive.test ........... SKIPPED
17:46:36 [2020-10-26T21:46:36.118Z] [INFO] org.eclipse.ease.ui.test ........................... SKIPPED
17:46:36 [2020-10-26T21:46:36.118Z] [INFO] ------------------------------------------------------------------------
17:46:36 [2020-10-26T21:46:36.118Z] [INFO] BUILD FAILURE
17:46:36 [2020-10-26T21:46:36.118Z] [INFO] ------------------------------------------------------------------------
17:46:36 [2020-10-26T21:46:36.118Z] [INFO] Total time:  01:42 min
17:46:36 [2020-10-26T21:46:36.118Z] [INFO] Finished at: 2020-10-26T21:46:35Z
17:46:36 [2020-10-26T21:46:36.118Z] [INFO] ------------------------------------------------------------------------
17:46:36 [2020-10-26T21:46:36.118Z] [WARNING] [jenkins-event-spy] Unexpected Maven project file name 'target-tests-pom.xml', problems may occur
17:46:36 [2020-10-26T21:46:36.118Z] [INFO] [jenkins-event-spy] Generated /home/jenkins/agent/workspace/ease.verify.core.target.oxygen@tmp/withMaven2e82bf04/maven-spy-20201026-214453-217644710132202732435.log
17:46:36 [2020-10-26T21:46:36.118Z] [ERROR] Failed to execute goal org.eclipse.tycho:tycho-surefire-plugin:1.5.0:test (default-test) on project org.eclipse.ease.lang.python.jython.test: There are test failures.
17:46:36 [2020-10-26T21:46:36.118Z] [ERROR] 
17:46:36 [2020-10-26T21:46:36.118Z] [ERROR] Please refer to /home/jenkins/agent/workspace/ease.verify.core.target.oxygen/tests/org.eclipse.ease.lang.python.jython.test/target/surefire-reports for the individual test results.
17:46:36 [2020-10-26T21:46:36.118Z] [ERROR] -> [Help 1]
17:46:36 [2020-10-26T21:46:36.118Z] [ERROR] 
17:46:36 [2020-10-26T21:46:36.118Z] [ERROR] To see the full stack trace of the errors, re-run Maven with the -e switch.
17:46:36 [2020-10-26T21:46:36.118Z] [ERROR] Re-run Maven using the -X switch to enable full debug logging.
17:46:36 [2020-10-26T21:46:36.118Z] [ERROR] 
17:46:36 [2020-10-26T21:46:36.118Z] [ERROR] For more information about the errors and possible solutions, please read the following articles:
17:46:36 [2020-10-26T21:46:36.118Z] [ERROR] [Help 1] http://cwiki.apache.org/confluence/display/MAVEN/MojoFailureException
17:46:36 [2020-10-26T21:46:36.118Z] [ERROR] 
17:46:36 [2020-10-26T21:46:36.118Z] [ERROR] After correcting the problems, you can resume the build with the command
17:46:36 [2020-10-26T21:46:36.118Z] [ERROR]   mvn <args> -rf :org.eclipse.ease.lang.python.jython.test
[Pipeline] }
17:46:36 [2020-10-26T21:46:36.730Z] [withMaven] Publishers: Pipeline Graph Publisher: 3 ms
[Pipeline] // withMaven
[Pipeline] }
[Pipeline] // stage
[Pipeline] stage
[Pipeline] { (Declarative: Post Actions)
[Pipeline] archiveArtifacts
17:46:36 [2020-10-26T21:46:36.758Z] Archiving artifacts
[Pipeline] emailext
17:46:49 [2020-10-26T21:46:49.347Z] Sending email to: christian.pontesegger@web.de
[Pipeline] }
[Pipeline] // stage
[Pipeline] }
[Pipeline] // timeout
[Pipeline] }
[Pipeline] // timestamps
[Pipeline] }
[Pipeline] // node
[Pipeline] End of Pipeline
ERROR: script returned exit code 1
Finished: FAILURE