SuccessConsole Output

Skipping 499 KB.. Full Log
lective access by org.mockito.cglib.core.ReflectUtils$2 (file:/home/jenkins/.m2/repository/p2/osgi/bundle/org.mockito/1.9.5.v201605172210/org.mockito-1.9.5.v201605172210.jar) to method java.lang.ClassLoader.defineClass(java.lang.String,byte[],int,int,java.security.ProtectionDomain)
23:06:38 [2020-11-28T04:06:38.748Z] WARNING: Please consider reporting this to the maintainers of org.mockito.cglib.core.ReflectUtils$2
23:06:38 [2020-11-28T04:06:38.748Z] WARNING: Use --illegal-access=warn to enable warnings of further illegal reflective access operations
23:06:38 [2020-11-28T04:06:38.748Z] WARNING: All illegal access operations will be denied in a future release
23:06:39 [2020-11-28T04:06:39.005Z] Start of script
23:06:39 [2020-11-28T04:06:39.005Z] include file start
23:06:39 [2020-11-28T04:06:39.005Z] Include file processed
23:06:39 [2020-11-28T04:06:39.005Z] line after include file
23:06:39 [2020-11-28T04:06:39.005Z] Result of testMethod = 5
23:06:39 [2020-11-28T04:06:39.005Z] End of script
23:06:39 [2020-11-28T04:06:39.261Z] Start of script
23:06:39 [2020-11-28T04:06:39.261Z] include file start
23:06:39 [2020-11-28T04:06:39.261Z] Include file processed
23:06:39 [2020-11-28T04:06:39.261Z] line after include file
23:06:39 [2020-11-28T04:06:39.261Z] Result of testMethod = 5
23:06:39 [2020-11-28T04:06:39.261Z] End of script
23:06:39 [2020-11-28T04:06:39.261Z] Start of script
23:06:39 [2020-11-28T04:06:39.261Z] include file start
23:06:39 [2020-11-28T04:06:39.261Z] Include file processed
23:06:39 [2020-11-28T04:06:39.261Z] line after include file
23:06:39 [2020-11-28T04:06:39.261Z] Result of testMethod = 5
23:06:39 [2020-11-28T04:06:39.823Z] Start of script
23:06:39 [2020-11-28T04:06:39.823Z] include file start
23:06:39 [2020-11-28T04:06:39.823Z] Include file processed
23:06:39 [2020-11-28T04:06:39.823Z] line after include file
23:06:39 [2020-11-28T04:06:39.823Z] Result of testMethod = 5
23:06:39 [2020-11-28T04:06:39.823Z] End of script
23:06:40 [2020-11-28T04:06:40.079Z] Start of script
23:06:40 [2020-11-28T04:06:40.079Z] include file start
23:06:40 [2020-11-28T04:06:40.079Z] Include file processed
23:06:40 [2020-11-28T04:06:40.079Z] line after include file
23:06:40 [2020-11-28T04:06:40.079Z] Result of testMethod = 5
23:06:40 [2020-11-28T04:06:40.079Z] End of script
23:06:40 [2020-11-28T04:06:40.336Z] Start of script
23:06:40 [2020-11-28T04:06:40.336Z] include file start
23:06:40 [2020-11-28T04:06:40.336Z] Include file processed
23:06:40 [2020-11-28T04:06:40.336Z] line after include file
23:06:40 [2020-11-28T04:06:40.591Z] Result of testMethod = 5
23:06:40 [2020-11-28T04:06:40.591Z] End of script
23:06:40 [2020-11-28T04:06:40.591Z] Start of script
23:06:40 [2020-11-28T04:06:40.591Z] include file start
23:06:40 [2020-11-28T04:06:40.591Z] Include file processed
23:06:40 [2020-11-28T04:06:40.591Z] line after include file
23:06:40 [2020-11-28T04:06:40.591Z] Result of testMethod = 5
23:06:40 [2020-11-28T04:06:40.848Z] Start of script
23:06:40 [2020-11-28T04:06:40.848Z] include file start
23:06:40 [2020-11-28T04:06:40.848Z] Include file processed
23:06:40 [2020-11-28T04:06:40.848Z] line after include file
23:06:41 [2020-11-28T04:06:41.103Z] Result of testMethod = 5
23:06:41 [2020-11-28T04:06:41.103Z] End of script
23:06:41 [2020-11-28T04:06:41.360Z] Start of script
23:06:41 [2020-11-28T04:06:41.360Z] include file start
23:06:41 [2020-11-28T04:06:41.360Z] Include file processed
23:06:41 [2020-11-28T04:06:41.360Z] line after include file
23:06:41 [2020-11-28T04:06:41.360Z] Result of testMethod = 5
23:06:41 [2020-11-28T04:06:41.360Z] End of script
23:06:41 [2020-11-28T04:06:41.360Z] Start of script
23:06:41 [2020-11-28T04:06:41.360Z] include file start
23:06:41 [2020-11-28T04:06:41.360Z] Include file processed
23:06:41 [2020-11-28T04:06:41.360Z] line after include file
23:06:41 [2020-11-28T04:06:41.921Z] Start of script
23:06:41 [2020-11-28T04:06:41.922Z] include file start
23:06:41 [2020-11-28T04:06:41.922Z] Include file processed
23:06:41 [2020-11-28T04:06:41.922Z] line after include file
23:06:41 [2020-11-28T04:06:41.922Z] Result of testMethod = 5
23:06:41 [2020-11-28T04:06:41.922Z] End of script
23:06:42 [2020-11-28T04:06:42.177Z] Start of script
23:06:42 [2020-11-28T04:06:42.177Z] include file start
23:06:42 [2020-11-28T04:06:42.177Z] Include file processed
23:06:42 [2020-11-28T04:06:42.177Z] line after include file
23:06:42 [2020-11-28T04:06:42.177Z] Result of testMethod = 5
23:06:42 [2020-11-28T04:06:42.177Z] End of script
23:06:42 [2020-11-28T04:06:42.740Z] Start of script
23:06:42 [2020-11-28T04:06:42.740Z] include file start
23:06:42 [2020-11-28T04:06:42.740Z] Include file processed
23:06:42 [2020-11-28T04:06:42.740Z] line after include file
23:06:42 [2020-11-28T04:06:42.740Z] Result of testMethod = 5
23:06:42 [2020-11-28T04:06:42.740Z] End of script
23:06:42 [2020-11-28T04:06:42.740Z] Start of script
23:06:42 [2020-11-28T04:06:42.740Z] include file start
23:06:42 [2020-11-28T04:06:42.740Z] Include file processed
23:06:42 [2020-11-28T04:06:42.740Z] line after include file
23:06:42 [2020-11-28T04:06:42.996Z] Result of testMethod = 5
23:06:42 [2020-11-28T04:06:42.996Z] End of script
23:06:42 [2020-11-28T04:06:42.996Z] Start of script
23:06:42 [2020-11-28T04:06:42.996Z] include file start
23:06:42 [2020-11-28T04:06:42.996Z] Include file processed
23:06:42 [2020-11-28T04:06:42.996Z] line after include file
23:06:42 [2020-11-28T04:06:42.996Z] Result of testMethod = 5
23:06:43 [2020-11-28T04:06:43.559Z] Start of script
23:06:43 [2020-11-28T04:06:43.559Z] include file start
23:06:43 [2020-11-28T04:06:43.559Z] Include file processed
23:06:43 [2020-11-28T04:06:43.559Z] line after include file
23:06:43 [2020-11-28T04:06:43.559Z] Result of testMethod = 5
23:06:43 [2020-11-28T04:06:43.559Z] End of script
23:06:43 [2020-11-28T04:06:43.814Z] Start of script
23:06:43 [2020-11-28T04:06:43.814Z] include file start
23:06:43 [2020-11-28T04:06:43.814Z] Include file processed
23:06:43 [2020-11-28T04:06:43.814Z] line after include file
23:06:43 [2020-11-28T04:06:43.814Z] Result of testMethod = 5
23:06:44 [2020-11-28T04:06:44.070Z] End of script
23:06:44 [2020-11-28T04:06:44.070Z] Start of script
23:06:44 [2020-11-28T04:06:44.070Z] include file start
23:06:44 [2020-11-28T04:06:44.070Z] Include file processed
23:06:44 [2020-11-28T04:06:44.070Z] line after include file
23:06:44 [2020-11-28T04:06:44.326Z] Result of testMethod = 5
23:06:44 [2020-11-28T04:06:44.326Z] End of script
23:06:44 [2020-11-28T04:06:44.582Z] Start of script
23:06:44 [2020-11-28T04:06:44.582Z] include file start
23:06:44 [2020-11-28T04:06:44.582Z] Include file processed
23:06:44 [2020-11-28T04:06:44.582Z] line after include file
23:06:44 [2020-11-28T04:06:44.838Z] Result of testMethod = 5
23:06:44 [2020-11-28T04:06:44.838Z] End of script
23:06:44 [2020-11-28T04:06:44.838Z] Start of script
23:06:44 [2020-11-28T04:06:44.838Z] include file start
23:06:44 [2020-11-28T04:06:44.838Z] Include file processed
23:06:44 [2020-11-28T04:06:44.838Z] line after include file
23:06:44 [2020-11-28T04:06:44.838Z] Result of testMethod = 5
23:06:45 [2020-11-28T04:06:45.400Z] Start of script
23:06:45 [2020-11-28T04:06:45.400Z] include file start
23:06:45 [2020-11-28T04:06:45.400Z] Include file processed
23:06:45 [2020-11-28T04:06:45.400Z] line after include file
23:06:45 [2020-11-28T04:06:45.400Z] Result of testMethod = 5
23:06:45 [2020-11-28T04:06:45.400Z] End of script
23:06:45 [2020-11-28T04:06:45.400Z] Start of script
23:06:45 [2020-11-28T04:06:45.400Z] include file start
23:06:45 [2020-11-28T04:06:45.400Z] Include file processed
23:06:45 [2020-11-28T04:06:45.400Z] line after include file
23:06:45 [2020-11-28T04:06:45.656Z] Result of testMethod = 5
23:06:45 [2020-11-28T04:06:45.657Z] End of script
23:06:45 [2020-11-28T04:06:45.657Z] Start of script
23:06:45 [2020-11-28T04:06:45.657Z] include file start
23:06:45 [2020-11-28T04:06:45.657Z] Include file processed
23:06:45 [2020-11-28T04:06:45.657Z] line after include file
23:06:45 [2020-11-28T04:06:45.657Z] Result of testMethod = 5
23:06:45 [2020-11-28T04:06:45.657Z] End of script
23:06:45 [2020-11-28T04:06:45.913Z] Start of script
23:06:45 [2020-11-28T04:06:45.913Z] include file start
23:06:45 [2020-11-28T04:06:45.913Z] Include file processed
23:06:46 [2020-11-28T04:06:46.169Z] line after include file
23:06:46 [2020-11-28T04:06:46.169Z] Result of testMethod = 5
23:06:46 [2020-11-28T04:06:46.169Z] End of script
23:06:46 [2020-11-28T04:06:46.169Z] Start of script
23:06:46 [2020-11-28T04:06:46.169Z] include file start
23:06:46 [2020-11-28T04:06:46.169Z] Include file processed
23:06:46 [2020-11-28T04:06:46.169Z] line after include file
23:06:46 [2020-11-28T04:06:46.424Z] Start of script
23:06:46 [2020-11-28T04:06:46.680Z] include file start
23:06:46 [2020-11-28T04:06:46.680Z] Include file processed
23:06:46 [2020-11-28T04:06:46.680Z] line after include file
23:06:46 [2020-11-28T04:06:46.680Z] Result of testMethod = 5
23:06:46 [2020-11-28T04:06:46.680Z] End of script
23:06:46 [2020-11-28T04:06:46.680Z] Start of script
23:06:46 [2020-11-28T04:06:46.680Z] include file start
23:06:46 [2020-11-28T04:06:46.680Z] Include file processed
23:06:46 [2020-11-28T04:06:46.680Z] line after include file
23:06:46 [2020-11-28T04:06:46.680Z] Result of testMethod = 5
23:06:47 [2020-11-28T04:06:47.256Z] Start of script
23:06:47 [2020-11-28T04:06:47.256Z] include file start
23:06:47 [2020-11-28T04:06:47.256Z] Include file processed
23:06:47 [2020-11-28T04:06:47.256Z] line after include file
23:06:47 [2020-11-28T04:06:47.257Z] Result of testMethod = 5
23:06:47 [2020-11-28T04:06:47.257Z] End of script
23:06:47 [2020-11-28T04:06:47.257Z] Start of script
23:06:47 [2020-11-28T04:06:47.257Z] include file start
23:06:47 [2020-11-28T04:06:47.257Z] Include file processed
23:06:47 [2020-11-28T04:06:47.257Z] line after include file
23:06:47 [2020-11-28T04:06:47.512Z] Result of testMethod = 5
23:06:47 [2020-11-28T04:06:47.512Z] End of script
23:06:47 [2020-11-28T04:06:47.512Z] Start of script
23:06:47 [2020-11-28T04:06:47.512Z] include file start
23:06:47 [2020-11-28T04:06:47.512Z] Include file processed
23:06:47 [2020-11-28T04:06:47.512Z] line after include file
23:06:47 [2020-11-28T04:06:47.769Z] Result of testMethod = 5
23:06:47 [2020-11-28T04:06:47.769Z] End of script
23:06:48 [2020-11-28T04:06:48.025Z] Start of script
23:06:48 [2020-11-28T04:06:48.025Z] include file start
23:06:48 [2020-11-28T04:06:48.025Z] Include file processed
23:06:48 [2020-11-28T04:06:48.025Z] line after include file
23:06:48 [2020-11-28T04:06:48.025Z] Result of testMethod = 5
23:06:48 [2020-11-28T04:06:48.025Z] End of script
23:06:48 [2020-11-28T04:06:48.025Z] Start of script
23:06:48 [2020-11-28T04:06:48.025Z] include file start
23:06:48 [2020-11-28T04:06:48.025Z] Include file processed
23:06:48 [2020-11-28T04:06:48.025Z] line after include file
23:06:48 [2020-11-28T04:06:48.025Z] Result of testMethod = 5
23:06:48 [2020-11-28T04:06:48.588Z] Start of script
23:06:48 [2020-11-28T04:06:48.588Z] include file start
23:06:48 [2020-11-28T04:06:48.588Z] Include file processed
23:06:48 [2020-11-28T04:06:48.588Z] line after include file
23:06:48 [2020-11-28T04:06:48.588Z] Result of testMethod = 5
23:06:48 [2020-11-28T04:06:48.588Z] End of script
23:06:48 [2020-11-28T04:06:48.588Z] Start of script
23:06:48 [2020-11-28T04:06:48.588Z] include file start
23:06:48 [2020-11-28T04:06:48.588Z] Include file processed
23:06:48 [2020-11-28T04:06:48.588Z] line after include file
23:06:48 [2020-11-28T04:06:48.588Z] Result of testMethod = 5
23:06:49 [2020-11-28T04:06:49.150Z] Start of script
23:06:49 [2020-11-28T04:06:49.150Z] include file start
23:06:49 [2020-11-28T04:06:49.150Z] Include file processed
23:06:49 [2020-11-28T04:06:49.150Z] line after include file
23:06:49 [2020-11-28T04:06:49.150Z] Result of testMethod = 5
23:06:49 [2020-11-28T04:06:49.150Z] End of script
23:06:49 [2020-11-28T04:06:49.406Z] Start of script
23:06:49 [2020-11-28T04:06:49.406Z] include file start
23:06:49 [2020-11-28T04:06:49.406Z] Include file processed
23:06:49 [2020-11-28T04:06:49.406Z] line after include file
23:06:49 [2020-11-28T04:06:49.663Z] Result of testMethod = 5
23:06:49 [2020-11-28T04:06:49.663Z] End of script
23:06:49 [2020-11-28T04:06:49.663Z] Start of script
23:06:49 [2020-11-28T04:06:49.663Z] include file start
23:06:49 [2020-11-28T04:06:49.663Z] Include file processed
23:06:49 [2020-11-28T04:06:49.663Z] line after include file
23:06:49 [2020-11-28T04:06:49.663Z] Result of testMethod = 5
23:06:49 [2020-11-28T04:06:49.663Z] End of script
23:06:49 [2020-11-28T04:06:49.919Z] Tests run: 42, Failures: 0, Errors: 0, Skipped: 0, Time elapsed: 11.054 s - in org.eclipse.ease.lang.javascript.rhino.RhinoDebugTest
23:06:49 [2020-11-28T04:06:49.919Z] disconnectProcessInSuspendedState(org.eclipse.ease.lang.javascript.rhino.RhinoDebugTest)  Time elapsed: 0.357 s
23:06:49 [2020-11-28T04:06:49.919Z] stepReturnIncludeCommand(org.eclipse.ease.lang.javascript.rhino.RhinoDebugTest)  Time elapsed: 0.21 s
23:06:49 [2020-11-28T04:06:49.919Z] arrayVariableSorting(org.eclipse.ease.lang.javascript.rhino.RhinoDebugTest)  Time elapsed: 0.309 s
23:06:49 [2020-11-28T04:06:49.919Z] stepOverOnDebugTarget(org.eclipse.ease.lang.javascript.rhino.RhinoDebugTest)  Time elapsed: 0.31 s
23:06:49 [2020-11-28T04:06:49.919Z] hasDebugTarget(org.eclipse.ease.lang.javascript.rhino.RhinoDebugTest)  Time elapsed: 0.105 s
23:06:49 [2020-11-28T04:06:49.919Z] disconnectThreadInSuspendedState(org.eclipse.ease.lang.javascript.rhino.RhinoDebugTest)  Time elapsed: 0.208 s
23:06:49 [2020-11-28T04:06:49.919Z] stepReturnOnDebugTarget(org.eclipse.ease.lang.javascript.rhino.RhinoDebugTest)  Time elapsed: 0.309 s
23:06:49 [2020-11-28T04:06:49.919Z] nullVariable(org.eclipse.ease.lang.javascript.rhino.RhinoDebugTest)  Time elapsed: 0.308 s
23:06:49 [2020-11-28T04:06:49.919Z] stepOverOnStackFrame(org.eclipse.ease.lang.javascript.rhino.RhinoDebugTest)  Time elapsed: 0.309 s
23:06:49 [2020-11-28T04:06:49.919Z] resumeOnDebugTarget(org.eclipse.ease.lang.javascript.rhino.RhinoDebugTest)  Time elapsed: 0.207 s
23:06:49 [2020-11-28T04:06:49.919Z] modifyVariableKeepingType(org.eclipse.ease.lang.javascript.rhino.RhinoDebugTest)  Time elapsed: 0.407 s
23:06:49 [2020-11-28T04:06:49.919Z] resumeOnLastIncludeLine(org.eclipse.ease.lang.javascript.rhino.RhinoDebugTest)  Time elapsed: 0.208 s
23:06:49 [2020-11-28T04:06:49.919Z] stepReturnOnStackFrame(org.eclipse.ease.lang.javascript.rhino.RhinoDebugTest)  Time elapsed: 0.307 s
23:06:49 [2020-11-28T04:06:49.919Z] terminateStackFrameInSuspendedState(org.eclipse.ease.lang.javascript.rhino.RhinoDebugTest)  Time elapsed: 0.207 s
23:06:49 [2020-11-28T04:06:49.919Z] breakpointLocation(org.eclipse.ease.lang.javascript.rhino.RhinoDebugTest)  Time elapsed: 0.207 s
23:06:49 [2020-11-28T04:06:49.919Z] stepReturnOnThread(org.eclipse.ease.lang.javascript.rhino.RhinoDebugTest)  Time elapsed: 0.308 s
23:06:49 [2020-11-28T04:06:49.919Z] javaClassVariable(org.eclipse.ease.lang.javascript.rhino.RhinoDebugTest)  Time elapsed: 0.307 s
23:06:49 [2020-11-28T04:06:49.919Z] stepIntoOnThread(org.eclipse.ease.lang.javascript.rhino.RhinoDebugTest)  Time elapsed: 0.308 s
23:06:49 [2020-11-28T04:06:49.919Z] terminateThreadInSuspendedState(org.eclipse.ease.lang.javascript.rhino.RhinoDebugTest)  Time elapsed: 0.206 s
23:06:49 [2020-11-28T04:06:49.919Z] resumeOnThread(org.eclipse.ease.lang.javascript.rhino.RhinoDebugTest)  Time elapsed: 0.206 s
23:06:49 [2020-11-28T04:06:49.919Z] stepIntoOnStackFrame(org.eclipse.ease.lang.javascript.rhino.RhinoDebugTest)  Time elapsed: 0.307 s
23:06:49 [2020-11-28T04:06:49.919Z] terminateProcessInSuspendedState(org.eclipse.ease.lang.javascript.rhino.RhinoDebugTest)  Time elapsed: 0.206 s
23:06:49 [2020-11-28T04:06:49.919Z] stepOverOnProcess(org.eclipse.ease.lang.javascript.rhino.RhinoDebugTest)  Time elapsed: 0.307 s
23:06:49 [2020-11-28T04:06:49.919Z] nativeArrayVariable(org.eclipse.ease.lang.javascript.rhino.RhinoDebugTest)  Time elapsed: 0.307 s
23:06:49 [2020-11-28T04:06:49.919Z] disconnectDebugTargetInSuspendedState(org.eclipse.ease.lang.javascript.rhino.RhinoDebugTest)  Time elapsed: 0.207 s
23:06:49 [2020-11-28T04:06:49.919Z] stepIntoOnProcess(org.eclipse.ease.lang.javascript.rhino.RhinoDebugTest)  Time elapsed: 0.308 s
23:06:49 [2020-11-28T04:06:49.919Z] terminatedState(org.eclipse.ease.lang.javascript.rhino.RhinoDebugTest)  Time elapsed: 0.105 s
23:06:49 [2020-11-28T04:06:49.919Z] stepOverIncludeCommand(org.eclipse.ease.lang.javascript.rhino.RhinoDebugTest)  Time elapsed: 0.306 s
23:06:49 [2020-11-28T04:06:49.919Z] innerScopeVariableBeforeOuterScopeVariable(org.eclipse.ease.lang.javascript.rhino.RhinoDebugTest)  Time elapsed: 0.307 s
23:06:49 [2020-11-28T04:06:49.919Z] stepIntoIncludeCommand(org.eclipse.ease.lang.javascript.rhino.RhinoDebugTest)  Time elapsed: 0.306 s
23:06:49 [2020-11-28T04:06:49.919Z] primitiveStringVariable(org.eclipse.ease.lang.javascript.rhino.RhinoDebugTest)  Time elapsed: 0.306 s
23:06:49 [2020-11-28T04:06:49.919Z] resumeOnProcess(org.eclipse.ease.lang.javascript.rhino.RhinoDebugTest)  Time elapsed: 0.21 s
23:06:49 [2020-11-28T04:06:49.919Z] stepIntoOnDebugTarget(org.eclipse.ease.lang.javascript.rhino.RhinoDebugTest)  Time elapsed: 0.306 s
23:06:49 [2020-11-28T04:06:49.919Z] stepOverOnThread(org.eclipse.ease.lang.javascript.rhino.RhinoDebugTest)  Time elapsed: 0.307 s
23:06:49 [2020-11-28T04:06:49.919Z] suspendedState(org.eclipse.ease.lang.javascript.rhino.RhinoDebugTest)  Time elapsed: 0.206 s
23:06:49 [2020-11-28T04:06:49.919Z] primitiveDoubleVariable(org.eclipse.ease.lang.javascript.rhino.RhinoDebugTest)  Time elapsed: 0.305 s
23:06:49 [2020-11-28T04:06:49.920Z] resumeOnStackFrame(org.eclipse.ease.lang.javascript.rhino.RhinoDebugTest)  Time elapsed: 0.206 s
23:06:49 [2020-11-28T04:06:49.920Z] nativeObjectVariable(org.eclipse.ease.lang.javascript.rhino.RhinoDebugTest)  Time elapsed: 0.306 s
23:06:49 [2020-11-28T04:06:49.920Z] terminateDebugTargetInSuspendedState(org.eclipse.ease.lang.javascript.rhino.RhinoDebugTest)  Time elapsed: 0.206 s
23:06:49 [2020-11-28T04:06:49.920Z] disconnectStackFrameInSuspendedState(org.eclipse.ease.lang.javascript.rhino.RhinoDebugTest)  Time elapsed: 0.206 s
23:06:49 [2020-11-28T04:06:49.920Z] stepReturnOnProcess(org.eclipse.ease.lang.javascript.rhino.RhinoDebugTest)  Time elapsed: 0.306 s
23:06:49 [2020-11-28T04:06:49.920Z] evaluateWatchExpression(org.eclipse.ease.lang.javascript.rhino.RhinoDebugTest)  Time elapsed: 0.208 s
23:06:49 [2020-11-28T04:06:49.920Z] Running org.eclipse.ease.lang.javascript.rhino.RhinoDebuggerEngineTest
23:06:49 [2020-11-28T04:06:49.920Z] org.eclipse.ease.ScriptExecutionException: JavaError: NotThere cannot be found by org.mozilla.javascript_1.7.10.v20190430-1943
23:06:49 [2020-11-28T04:06:49.920Z] 
23:06:49 [2020-11-28T04:06:49.920Z] Java Stacktrace:
23:06:49 [2020-11-28T04:06:49.920Z] java.lang.ClassNotFoundException: NotThere cannot be found by org.mozilla.javascript_1.7.10.v20190430-1943
23:06:49 [2020-11-28T04:06:49.920Z] 	at org.eclipse.osgi.internal.loader.BundleLoader.findClass(BundleLoader.java:516)
23:06:49 [2020-11-28T04:06:49.920Z] 	at org.eclipse.osgi.internal.loader.ModuleClassLoader.loadClass(ModuleClassLoader.java:171)
23:06:49 [2020-11-28T04:06:49.920Z] 	at java.base/java.lang.ClassLoader.loadClass(ClassLoader.java:521)
23:06:49 [2020-11-28T04:06:49.920Z] 	at java.base/java.lang.Class.forName0(Native Method)
23:06:49 [2020-11-28T04:06:49.920Z] 	at java.base/java.lang.Class.forName(Class.java:315)
23:06:49 [2020-11-28T04:06:49.920Z] 	at java.base/jdk.internal.reflect.NativeMethodAccessorImpl.invoke0(Native Method)
23:06:49 [2020-11-28T04:06:49.920Z] 	at java.base/jdk.internal.reflect.NativeMethodAccessorImpl.invoke(NativeMethodAccessorImpl.java:62)
23:06:49 [2020-11-28T04:06:49.920Z] 	at java.base/jdk.internal.reflect.DelegatingMethodAccessorImpl.invoke(DelegatingMethodAccessorImpl.java:43)
23:06:49 [2020-11-28T04:06:49.920Z] 	at java.base/java.lang.reflect.Method.invoke(Method.java:566)
23:06:49 [2020-11-28T04:06:49.920Z] 	at org.mozilla.javascript.MemberBox.invoke(MemberBox.java:126)
23:06:49 [2020-11-28T04:06:49.920Z] 	at org.mozilla.javascript.NativeJavaMethod.call(NativeJavaMethod.java:225)
23:06:49 [2020-11-28T04:06:49.920Z] 	at org.mozilla.javascript.Interpreter.interpretLoop(Interpreter.java:1573)
23:06:49 [2020-11-28T04:06:49.920Z] 	at org.mozilla.javascript.Interpreter.interpret(Interpreter.java:911)
23:06:49 [2020-11-28T04:06:49.920Z] 	at org.mozilla.javascript.InterpretedFunction.call(InterpretedFunction.java:109)
23:06:49 [2020-11-28T04:06:49.920Z] 	at org.mozilla.javascript.ContextFactory.doTopCall(ContextFactory.java:405)
23:06:49 [2020-11-28T04:06:49.920Z] 	at org.mozilla.javascript.ScriptRuntime.doTopCall(ScriptRuntime.java:3508)
23:06:49 [2020-11-28T04:06:49.920Z] 	at org.mozilla.javascript.InterpretedFunction.exec(InterpretedFunction.java:120)
23:06:49 [2020-11-28T04:06:49.920Z] 	at org.mozilla.javascript.Context.evaluateReader(Context.java:1293)
23:06:49 [2020-11-28T04:06:49.920Z] 	at org.eclipse.ease.lang.javascript.rhino.RhinoScriptEngine.internalExecute(RhinoScriptEngine.java:222)
23:06:49 [2020-11-28T04:06:49.920Z] 	at org.eclipse.ease.lang.javascript.rhino.RhinoScriptEngine.execute(RhinoScriptEngine.java:201)
23:06:49 [2020-11-28T04:06:49.920Z] 	at org.eclipse.ease.AbstractScriptEngine.inject(AbstractScriptEngine.java:224)
23:06:49 [2020-11-28T04:06:49.920Z] 	at org.eclipse.ease.AbstractScriptEngine.run(AbstractScriptEngine.java:274)
23:06:49 [2020-11-28T04:06:49.920Z] 	at org.eclipse.core.internal.jobs.Worker.run(Worker.java:63)
23:06:49 [2020-11-28T04:06:49.920Z] org.eclipse.ease.ScriptExecutionException: TypeError: Cannot call method "foobar" of undefined
23:06:49 [2020-11-28T04:06:49.920Z] org.eclipse.ease.ScriptExecutionException: ScriptException: test
23:06:49 [2020-11-28T04:06:49.920Z] org.eclipse.ease.ScriptExecutionException: JavaError: java.lang.Exception
23:06:49 [2020-11-28T04:06:49.920Z] 
23:06:49 [2020-11-28T04:06:49.920Z] Java Stacktrace:
23:06:49 [2020-11-28T04:06:49.920Z] java.lang.Exception
23:06:49 [2020-11-28T04:06:49.920Z] 	at java.base/jdk.internal.reflect.NativeConstructorAccessorImpl.newInstance0(Native Method)
23:06:49 [2020-11-28T04:06:49.920Z] 	at java.base/jdk.internal.reflect.NativeConstructorAccessorImpl.newInstance(NativeConstructorAccessorImpl.java:62)
23:06:49 [2020-11-28T04:06:49.920Z] 	at java.base/jdk.internal.reflect.DelegatingConstructorAccessorImpl.newInstance(DelegatingConstructorAccessorImpl.java:45)
23:06:49 [2020-11-28T04:06:49.920Z] 	at java.base/java.lang.reflect.Constructor.newInstance(Constructor.java:490)
23:06:49 [2020-11-28T04:06:49.920Z] 	at org.mozilla.javascript.MemberBox.newInstance(MemberBox.java:159)
23:06:49 [2020-11-28T04:06:49.920Z] 	at org.mozilla.javascript.NativeJavaClass.constructInternal(NativeJavaClass.java:266)
23:06:49 [2020-11-28T04:06:49.920Z] 	at org.mozilla.javascript.NativeJavaClass.constructSpecific(NativeJavaClass.java:205)
23:06:49 [2020-11-28T04:06:49.920Z] 	at org.mozilla.javascript.NativeJavaClass.construct(NativeJavaClass.java:166)
23:06:49 [2020-11-28T04:06:49.920Z] 	at org.mozilla.javascript.Interpreter.interpretLoop(Interpreter.java:1617)
23:06:49 [2020-11-28T04:06:49.920Z] 	at org.mozilla.javascript.Interpreter.interpret(Interpreter.java:911)
23:06:49 [2020-11-28T04:06:49.920Z] 	at org.mozilla.javascript.InterpretedFunction.call(InterpretedFunction.java:109)
23:06:49 [2020-11-28T04:06:49.920Z] 	at org.mozilla.javascript.ContextFactory.doTopCall(ContextFactory.java:405)
23:06:49 [2020-11-28T04:06:49.920Z] 	at org.mozilla.javascript.ScriptRuntime.doTopCall(ScriptRuntime.java:3508)
23:06:49 [2020-11-28T04:06:49.920Z] 	at org.mozilla.javascript.InterpretedFunction.exec(InterpretedFunction.java:120)
23:06:49 [2020-11-28T04:06:49.920Z] 	at org.mozilla.javascript.Context.evaluateReader(Context.java:1293)
23:06:49 [2020-11-28T04:06:49.920Z] 	at org.eclipse.ease.lang.javascript.rhino.RhinoScriptEngine.internalExecute(RhinoScriptEngine.java:222)
23:06:49 [2020-11-28T04:06:49.920Z] 	at org.eclipse.ease.lang.javascript.rhino.RhinoScriptEngine.execute(RhinoScriptEngine.java:201)
23:06:49 [2020-11-28T04:06:49.920Z] 	at org.eclipse.ease.AbstractScriptEngine.inject(AbstractScriptEngine.java:224)
23:06:49 [2020-11-28T04:06:49.921Z] 	at org.eclipse.ease.AbstractScriptEngine.run(AbstractScriptEngine.java:274)
23:06:49 [2020-11-28T04:06:49.921Z] 	at org.eclipse.core.internal.jobs.Worker.run(Worker.java:63)
23:06:49 [2020-11-28T04:06:49.921Z] org.eclipse.ease.ScriptExecutionException: ScriptException: JavaScript
23:06:49 [2020-11-28T04:06:49.921Z] org.eclipse.ease.ScriptExecutionException: SyntaxError: unterminated string literal (#1)
23:06:49 [2020-11-28T04:06:49.921Z] 'asdf
23:06:49 [2020-11-28T04:06:49.921Z]     ^
23:06:49 [2020-11-28T04:06:49.921Z] 	at <unknown source>:1
23:06:50 [2020-11-28T04:06:50.177Z] Tests run: 12, Failures: 0, Errors: 0, Skipped: 0, Time elapsed: 0.154 s - in org.eclipse.ease.lang.javascript.rhino.RhinoDebuggerEngineTest
23:06:50 [2020-11-28T04:06:50.177Z] getExceptionStackTrace(org.eclipse.ease.lang.javascript.rhino.RhinoDebuggerEngineTest)  Time elapsed: 0.018 s
23:06:50 [2020-11-28T04:06:50.177Z] causeWrappedException(org.eclipse.ease.lang.javascript.rhino.RhinoDebuggerEngineTest)  Time elapsed: 0.012 s
23:06:50 [2020-11-28T04:06:50.177Z] optionalModuleParameters(org.eclipse.ease.lang.javascript.rhino.RhinoDebuggerEngineTest)  Time elapsed: 0.009 s
23:06:50 [2020-11-28T04:06:50.177Z] simpleScriptCode(org.eclipse.ease.lang.javascript.rhino.RhinoDebuggerEngineTest)  Time elapsed: 0.01 s
23:06:50 [2020-11-28T04:06:50.177Z] causeRuntimeErrorException(org.eclipse.ease.lang.javascript.rhino.RhinoDebuggerEngineTest)  Time elapsed: 0.044 s
23:06:50 [2020-11-28T04:06:50.177Z] callModuleCode(org.eclipse.ease.lang.javascript.rhino.RhinoDebuggerEngineTest)  Time elapsed: 0.009 s
23:06:50 [2020-11-28T04:06:50.177Z] throwJavaClass(org.eclipse.ease.lang.javascript.rhino.RhinoDebuggerEngineTest)  Time elapsed: 0.008 s
23:06:50 [2020-11-28T04:06:50.177Z] throwJavaException(org.eclipse.ease.lang.javascript.rhino.RhinoDebuggerEngineTest)  Time elapsed: 0.01 s
23:06:50 [2020-11-28T04:06:50.177Z] accessJavaClasses(org.eclipse.ease.lang.javascript.rhino.RhinoDebuggerEngineTest)  Time elapsed: 0.008 s
23:06:50 [2020-11-28T04:06:50.177Z] accessEclipseClasses(org.eclipse.ease.lang.javascript.rhino.RhinoDebuggerEngineTest)  Time elapsed: 0.009 s
23:06:50 [2020-11-28T04:06:50.177Z] throwJavaScriptException(org.eclipse.ease.lang.javascript.rhino.RhinoDebuggerEngineTest)  Time elapsed: 0.009 s
23:06:50 [2020-11-28T04:06:50.177Z] causeSyntaxErrorException(org.eclipse.ease.lang.javascript.rhino.RhinoDebuggerEngineTest)  Time elapsed: 0.007 s
23:06:50 [2020-11-28T04:06:50.177Z] Running org.eclipse.ease.lang.javascript.rhino.RhinoEnvironmentTest
23:06:50 [2020-11-28T04:06:50.177Z] Tests run: 5, Failures: 0, Errors: 0, Skipped: 0, Time elapsed: 0.062 s - in org.eclipse.ease.lang.javascript.rhino.RhinoEnvironmentTest
23:06:50 [2020-11-28T04:06:50.177Z] reloadEnvironment(org.eclipse.ease.lang.javascript.rhino.RhinoEnvironmentTest)  Time elapsed: 0.014 s
23:06:50 [2020-11-28T04:06:50.177Z] bootstrappedEnvironment(org.eclipse.ease.lang.javascript.rhino.RhinoEnvironmentTest)  Time elapsed: 0.007 s
23:06:50 [2020-11-28T04:06:50.177Z] postMethodCallback(org.eclipse.ease.lang.javascript.rhino.RhinoEnvironmentTest)  Time elapsed: 0.013 s
23:06:50 [2020-11-28T04:06:50.177Z] preMethodCallback(org.eclipse.ease.lang.javascript.rhino.RhinoEnvironmentTest)  Time elapsed: 0.014 s
23:06:50 [2020-11-28T04:06:50.177Z] reloadFunctionDefinitions(org.eclipse.ease.lang.javascript.rhino.RhinoEnvironmentTest)  Time elapsed: 0.013 s
23:06:50 [2020-11-28T04:06:50.177Z] 
23:06:50 [2020-11-28T04:06:50.177Z] Results:
23:06:50 [2020-11-28T04:06:50.177Z] 
23:06:50 [2020-11-28T04:06:50.177Z] Tests run: 70, Failures: 0, Errors: 0, Skipped: 0
23:06:50 [2020-11-28T04:06:50.177Z] 
23:06:50 [2020-11-28T04:06:50.739Z] [INFO] All tests passed!
23:06:50 [2020-11-28T04:06:50.739Z] [INFO] 
23:06:50 [2020-11-28T04:06:50.739Z] [INFO] --- maven-install-plugin:2.3.1:install (default-install) @ org.eclipse.ease.lang.javascript.rhino.test ---
23:06:50 [2020-11-28T04:06:50.739Z] [INFO] Installing /home/jenkins/agent/workspace/ease.verify.core.target.luna/tests/org.eclipse.ease.lang.javascript.rhino.test/target/org.eclipse.ease.lang.javascript.rhino.test-0.8.0-SNAPSHOT.jar to /home/jenkins/.m2/repository/org/eclipse/ease/org.eclipse.ease.lang.javascript.rhino.test/0.8.0-SNAPSHOT/org.eclipse.ease.lang.javascript.rhino.test-0.8.0-SNAPSHOT.jar
23:06:50 [2020-11-28T04:06:50.739Z] [INFO] Installing /home/jenkins/agent/workspace/ease.verify.core.target.luna/tests/org.eclipse.ease.lang.javascript.rhino.test/pom.xml to /home/jenkins/.m2/repository/org/eclipse/ease/org.eclipse.ease.lang.javascript.rhino.test/0.8.0-SNAPSHOT/org.eclipse.ease.lang.javascript.rhino.test-0.8.0-SNAPSHOT.pom
23:06:50 [2020-11-28T04:06:50.740Z] [INFO] Installing /home/jenkins/agent/workspace/ease.verify.core.target.luna/tests/org.eclipse.ease.lang.javascript.rhino.test/target/org.eclipse.ease.lang.javascript.rhino.test-0.8.0-SNAPSHOT-sources.jar to /home/jenkins/.m2/repository/org/eclipse/ease/org.eclipse.ease.lang.javascript.rhino.test/0.8.0-SNAPSHOT/org.eclipse.ease.lang.javascript.rhino.test-0.8.0-SNAPSHOT-sources.jar
23:06:50 [2020-11-28T04:06:50.740Z] [INFO] Installing /home/jenkins/agent/workspace/ease.verify.core.target.luna/tests/org.eclipse.ease.lang.javascript.rhino.test/target/p2content.xml to /home/jenkins/.m2/repository/org/eclipse/ease/org.eclipse.ease.lang.javascript.rhino.test/0.8.0-SNAPSHOT/org.eclipse.ease.lang.javascript.rhino.test-0.8.0-SNAPSHOT-p2metadata.xml
23:06:50 [2020-11-28T04:06:50.740Z] [INFO] Installing /home/jenkins/agent/workspace/ease.verify.core.target.luna/tests/org.eclipse.ease.lang.javascript.rhino.test/target/p2artifacts.xml to /home/jenkins/.m2/repository/org/eclipse/ease/org.eclipse.ease.lang.javascript.rhino.test/0.8.0-SNAPSHOT/org.eclipse.ease.lang.javascript.rhino.test-0.8.0-SNAPSHOT-p2artifacts.xml
23:06:50 [2020-11-28T04:06:50.740Z] [INFO] Installing /home/jenkins/agent/workspace/ease.verify.core.target.luna/tests/org.eclipse.ease.lang.javascript.rhino.test/target/p2content.xml to /home/jenkins/.m2/repository/org/eclipse/ease/org.eclipse.ease.lang.javascript.rhino.test/0.8.0-SNAPSHOT/org.eclipse.ease.lang.javascript.rhino.test-0.8.0-SNAPSHOT-p2metadata.xml
23:06:50 [2020-11-28T04:06:50.740Z] [INFO] Installing /home/jenkins/agent/workspace/ease.verify.core.target.luna/tests/org.eclipse.ease.lang.javascript.rhino.test/target/p2artifacts.xml to /home/jenkins/.m2/repository/org/eclipse/ease/org.eclipse.ease.lang.javascript.rhino.test/0.8.0-SNAPSHOT/org.eclipse.ease.lang.javascript.rhino.test-0.8.0-SNAPSHOT-p2artifacts.xml
23:06:50 [2020-11-28T04:06:50.740Z] [INFO] 
23:06:50 [2020-11-28T04:06:50.740Z] [INFO] --- tycho-p2-plugin:1.5.0:update-local-index (default-update-local-index) @ org.eclipse.ease.lang.javascript.rhino.test ---
23:06:50 [2020-11-28T04:06:50.740Z] [INFO] 
23:06:50 [2020-11-28T04:06:50.740Z] [INFO] -------< org.eclipse.ease:org.eclipse.ease.lang.javascript.test >-------
23:06:50 [2020-11-28T04:06:50.740Z] [INFO] Building org.eclipse.ease.lang.javascript.test 0.8.0-SNAPSHOT    [41/48]
23:06:50 [2020-11-28T04:06:50.740Z] [INFO] ------------------------[ eclipse-test-plugin ]-------------------------
23:06:50 [2020-11-28T04:06:50.740Z] [INFO] 
23:06:50 [2020-11-28T04:06:50.740Z] [INFO] --- maven-clean-plugin:2.5:clean (default-clean) @ org.eclipse.ease.lang.javascript.test ---
23:06:50 [2020-11-28T04:06:50.740Z] [INFO] 
23:06:50 [2020-11-28T04:06:50.740Z] [INFO] --- tycho-packaging-plugin:1.5.0:build-qualifier (default-build-qualifier) @ org.eclipse.ease.lang.javascript.test ---
23:06:50 [2020-11-28T04:06:50.740Z] [INFO] The project's OSGi version is 0.8.0.I201910171213
23:06:50 [2020-11-28T04:06:50.740Z] [INFO] 
23:06:50 [2020-11-28T04:06:50.740Z] [INFO] --- tycho-packaging-plugin:1.5.0:validate-id (default-validate-id) @ org.eclipse.ease.lang.javascript.test ---
23:06:50 [2020-11-28T04:06:50.740Z] [INFO] 
23:06:50 [2020-11-28T04:06:50.740Z] [INFO] --- tycho-packaging-plugin:1.5.0:validate-version (default-validate-version) @ org.eclipse.ease.lang.javascript.test ---
23:06:50 [2020-11-28T04:06:50.740Z] [INFO] 
23:06:50 [2020-11-28T04:06:50.740Z] [INFO] --- maven-resources-plugin:2.4.3:resources (default-resources) @ org.eclipse.ease.lang.javascript.test ---
23:06:50 [2020-11-28T04:06:50.740Z] [INFO] Using 'UTF-8' encoding to copy filtered resources.
23:06:50 [2020-11-28T04:06:50.740Z] [INFO] skip non existing resourceDirectory /home/jenkins/agent/workspace/ease.verify.core.target.luna/tests/org.eclipse.ease.lang.javascript.test/src/main/resources
23:06:50 [2020-11-28T04:06:50.740Z] [INFO] 
23:06:50 [2020-11-28T04:06:50.740Z] [INFO] --- tycho-compiler-plugin:1.5.0:compile (default-compile) @ org.eclipse.ease.lang.javascript.test ---
23:06:50 [2020-11-28T04:06:50.740Z] [INFO] Compiling 2 source files to /home/jenkins/agent/workspace/ease.verify.core.target.luna/tests/org.eclipse.ease.lang.javascript.test/target/classes
23:06:51 [2020-11-28T04:06:51.018Z] [INFO] 
23:06:51 [2020-11-28T04:06:51.018Z] [INFO] --- maven-resources-plugin:2.4.3:testResources (default-testResources) @ org.eclipse.ease.lang.javascript.test ---
23:06:51 [2020-11-28T04:06:51.018Z] [INFO] Using 'UTF-8' encoding to copy filtered resources.
23:06:51 [2020-11-28T04:06:51.018Z] [INFO] skip non existing resourceDirectory /home/jenkins/agent/workspace/ease.verify.core.target.luna/tests/org.eclipse.ease.lang.javascript.test/src/test/resources
23:06:51 [2020-11-28T04:06:51.018Z] [INFO] 
23:06:51 [2020-11-28T04:06:51.018Z] [INFO] --- tycho-source-plugin:1.5.0:plugin-source (plugin-source) @ org.eclipse.ease.lang.javascript.test ---
23:06:51 [2020-11-28T04:06:51.018Z] [WARNING] Bundle-Vendor header not found in /home/jenkins/agent/workspace/ease.verify.core.target.luna/tests/org.eclipse.ease.lang.javascript.test/META-INF/MANIFEST.MF, fallback to 'unknown' for source bundle
23:06:51 [2020-11-28T04:06:51.018Z] [INFO] Building jar: /home/jenkins/agent/workspace/ease.verify.core.target.luna/tests/org.eclipse.ease.lang.javascript.test/target/org.eclipse.ease.lang.javascript.test-0.8.0-SNAPSHOT-sources.jar
23:06:51 [2020-11-28T04:06:51.018Z] [INFO] 
23:06:51 [2020-11-28T04:06:51.018Z] [INFO] --- target-platform-configuration:1.5.0:target-platform (default-target-platform) @ org.eclipse.ease.lang.javascript.test ---
23:06:51 [2020-11-28T04:06:51.018Z] [INFO] 
23:06:51 [2020-11-28T04:06:51.019Z] [INFO] --- tycho-packaging-plugin:1.5.0:package-plugin (default-package-plugin) @ org.eclipse.ease.lang.javascript.test ---
23:06:51 [2020-11-28T04:06:51.019Z] [INFO] Building jar: /home/jenkins/agent/workspace/ease.verify.core.target.luna/tests/org.eclipse.ease.lang.javascript.test/target/org.eclipse.ease.lang.javascript.test-0.8.0-SNAPSHOT.jar
23:06:51 [2020-11-28T04:06:51.019Z] [INFO] 
23:06:51 [2020-11-28T04:06:51.019Z] [INFO] --- tycho-p2-plugin:1.5.0:p2-metadata-default (default-p2-metadata-default) @ org.eclipse.ease.lang.javascript.test ---
23:06:51 [2020-11-28T04:06:51.019Z] [INFO] 
23:06:51 [2020-11-28T04:06:51.019Z] [INFO] --- tycho-source-feature-plugin:1.5.0:source-feature (source-feature) @ org.eclipse.ease.lang.javascript.test ---
23:06:51 [2020-11-28T04:06:51.019Z] [INFO] 
23:06:51 [2020-11-28T04:06:51.019Z] [INFO] --- tycho-p2-plugin:1.5.0:p2-metadata (attached-p2-metadata) @ org.eclipse.ease.lang.javascript.test ---
23:06:51 [2020-11-28T04:06:51.019Z] [INFO] 
23:06:51 [2020-11-28T04:06:51.019Z] [INFO] --- tycho-surefire-plugin:1.5.0:test (default-test) @ org.eclipse.ease.lang.javascript.test ---
23:06:51 [2020-11-28T04:06:51.019Z] [INFO] Expected eclipse log file: /home/jenkins/agent/workspace/ease.verify.core.target.luna/tests/org.eclipse.ease.lang.javascript.test/target/work/data/.metadata/.log
23:06:51 [2020-11-28T04:06:51.019Z] [INFO] Command line:
23:06:51 [2020-11-28T04:06:51.019Z] 	[/opt/tools/java/openjdk/jdk-11/11.0.2+9/bin/java, -Dosgi.noShutdown=false, -Dosgi.os=linux, -Dosgi.ws=gtk, -Dosgi.arch=x86_64, -Dosgi.clean=true, -jar, /home/jenkins/.m2/repository/p2/osgi/bundle/org.eclipse.equinox.launcher/1.5.800.v20200727-1323/org.eclipse.equinox.launcher-1.5.800.v20200727-1323.jar, -data, /home/jenkins/agent/workspace/ease.verify.core.target.luna/tests/org.eclipse.ease.lang.javascript.test/target/work/data, -install, /home/jenkins/agent/workspace/ease.verify.core.target.luna/tests/org.eclipse.ease.lang.javascript.test/target/work, -configuration, /home/jenkins/agent/workspace/ease.verify.core.target.luna/tests/org.eclipse.ease.lang.javascript.test/target/work/configuration, -application, org.eclipse.tycho.surefire.osgibooter.headlesstest, -testproperties, /home/jenkins/agent/workspace/ease.verify.core.target.luna/tests/org.eclipse.ease.lang.javascript.test/target/surefire.properties]
23:06:51 [2020-11-28T04:06:51.019Z] Picked up JAVA_TOOL_OPTIONS: -Dmaven.ext.class.path="/home/jenkins/agent/workspace/ease.verify.core.target.luna@tmp/withMavenea4e87b2/pipeline-maven-spy.jar" -Dorg.jenkinsci.plugins.pipeline.maven.reportsFolder="/home/jenkins/agent/workspace/ease.verify.core.target.luna@tmp/withMavenea4e87b2" 
23:06:52 [2020-11-28T04:06:52.944Z] Running org.eclipse.ease.lang.javascript.JavaScriptCodeFactoryTest
23:06:52 [2020-11-28T04:06:52.944Z] Tests run: 1, Failures: 0, Errors: 0, Skipped: 0, Time elapsed: 0.146 s - in org.eclipse.ease.lang.javascript.JavaScriptCodeFactoryTest
23:06:52 [2020-11-28T04:06:52.944Z] testCommentCreator(org.eclipse.ease.lang.javascript.JavaScriptCodeFactoryTest)  Time elapsed: 0.003 s
23:06:52 [2020-11-28T04:06:52.944Z] Running org.eclipse.ease.lang.javascript.JavaScriptCompletionContextTest
23:06:52 [2020-11-28T04:06:52.944Z] Tests run: 8, Failures: 0, Errors: 0, Skipped: 0, Time elapsed: 0.116 s - in org.eclipse.ease.lang.javascript.JavaScriptCompletionContextTest
23:06:52 [2020-11-28T04:06:52.944Z] verifyStaticClassTypes(org.eclipse.ease.lang.javascript.JavaScriptCompletionContextTest)  Time elapsed: 0.003 s
23:06:52 [2020-11-28T04:06:52.944Z] verifyClassInstanceTypes(org.eclipse.ease.lang.javascript.JavaScriptCompletionContextTest)  Time elapsed: 0.005 s
23:06:52 [2020-11-28T04:06:52.944Z] verifyTypesForScriptEngine(org.eclipse.ease.lang.javascript.JavaScriptCompletionContextTest)  Time elapsed: 0.103 s
23:06:52 [2020-11-28T04:06:52.944Z] verifyPackageTypes(org.eclipse.ease.lang.javascript.JavaScriptCompletionContextTest)  Time elapsed: 0 s
23:06:52 [2020-11-28T04:06:52.944Z] definedVariableTypes(org.eclipse.ease.lang.javascript.JavaScriptCompletionContextTest)  Time elapsed: 0 s
23:06:52 [2020-11-28T04:06:52.944Z] verifyStringLiteralTypes(org.eclipse.ease.lang.javascript.JavaScriptCompletionContextTest)  Time elapsed: 0 s
23:06:52 [2020-11-28T04:06:52.944Z] verifyUnknownTypes(org.eclipse.ease.lang.javascript.JavaScriptCompletionContextTest)  Time elapsed: 0.001 s
23:06:52 [2020-11-28T04:06:52.944Z] verifyNoneTypes(org.eclipse.ease.lang.javascript.JavaScriptCompletionContextTest)  Time elapsed: 0 s
23:06:52 [2020-11-28T04:06:52.944Z] 
23:06:52 [2020-11-28T04:06:52.944Z] Results:
23:06:52 [2020-11-28T04:06:52.944Z] 
23:06:52 [2020-11-28T04:06:52.944Z] Tests run: 9, Failures: 0, Errors: 0, Skipped: 0
23:06:52 [2020-11-28T04:06:52.944Z] 
23:06:53 [2020-11-28T04:06:53.506Z] [INFO] All tests passed!
23:06:53 [2020-11-28T04:06:53.506Z] [INFO] 
23:06:53 [2020-11-28T04:06:53.506Z] [INFO] --- maven-install-plugin:2.3.1:install (default-install) @ org.eclipse.ease.lang.javascript.test ---
23:06:53 [2020-11-28T04:06:53.506Z] [INFO] Installing /home/jenkins/agent/workspace/ease.verify.core.target.luna/tests/org.eclipse.ease.lang.javascript.test/target/org.eclipse.ease.lang.javascript.test-0.8.0-SNAPSHOT.jar to /home/jenkins/.m2/repository/org/eclipse/ease/org.eclipse.ease.lang.javascript.test/0.8.0-SNAPSHOT/org.eclipse.ease.lang.javascript.test-0.8.0-SNAPSHOT.jar
23:06:53 [2020-11-28T04:06:53.506Z] [INFO] Installing /home/jenkins/agent/workspace/ease.verify.core.target.luna/tests/org.eclipse.ease.lang.javascript.test/pom.xml to /home/jenkins/.m2/repository/org/eclipse/ease/org.eclipse.ease.lang.javascript.test/0.8.0-SNAPSHOT/org.eclipse.ease.lang.javascript.test-0.8.0-SNAPSHOT.pom
23:06:53 [2020-11-28T04:06:53.507Z] [INFO] Installing /home/jenkins/agent/workspace/ease.verify.core.target.luna/tests/org.eclipse.ease.lang.javascript.test/target/org.eclipse.ease.lang.javascript.test-0.8.0-SNAPSHOT-sources.jar to /home/jenkins/.m2/repository/org/eclipse/ease/org.eclipse.ease.lang.javascript.test/0.8.0-SNAPSHOT/org.eclipse.ease.lang.javascript.test-0.8.0-SNAPSHOT-sources.jar
23:06:53 [2020-11-28T04:06:53.507Z] [INFO] Installing /home/jenkins/agent/workspace/ease.verify.core.target.luna/tests/org.eclipse.ease.lang.javascript.test/target/p2content.xml to /home/jenkins/.m2/repository/org/eclipse/ease/org.eclipse.ease.lang.javascript.test/0.8.0-SNAPSHOT/org.eclipse.ease.lang.javascript.test-0.8.0-SNAPSHOT-p2metadata.xml
23:06:53 [2020-11-28T04:06:53.507Z] [INFO] Installing /home/jenkins/agent/workspace/ease.verify.core.target.luna/tests/org.eclipse.ease.lang.javascript.test/target/p2artifacts.xml to /home/jenkins/.m2/repository/org/eclipse/ease/org.eclipse.ease.lang.javascript.test/0.8.0-SNAPSHOT/org.eclipse.ease.lang.javascript.test-0.8.0-SNAPSHOT-p2artifacts.xml
23:06:53 [2020-11-28T04:06:53.507Z] [INFO] Installing /home/jenkins/agent/workspace/ease.verify.core.target.luna/tests/org.eclipse.ease.lang.javascript.test/target/p2content.xml to /home/jenkins/.m2/repository/org/eclipse/ease/org.eclipse.ease.lang.javascript.test/0.8.0-SNAPSHOT/org.eclipse.ease.lang.javascript.test-0.8.0-SNAPSHOT-p2metadata.xml
23:06:53 [2020-11-28T04:06:53.507Z] [INFO] Installing /home/jenkins/agent/workspace/ease.verify.core.target.luna/tests/org.eclipse.ease.lang.javascript.test/target/p2artifacts.xml to /home/jenkins/.m2/repository/org/eclipse/ease/org.eclipse.ease.lang.javascript.test/0.8.0-SNAPSHOT/org.eclipse.ease.lang.javascript.test-0.8.0-SNAPSHOT-p2artifacts.xml
23:06:53 [2020-11-28T04:06:53.507Z] [INFO] 
23:06:53 [2020-11-28T04:06:53.507Z] [INFO] --- tycho-p2-plugin:1.5.0:update-local-index (default-update-local-index) @ org.eclipse.ease.lang.javascript.test ---
23:06:53 [2020-11-28T04:06:53.507Z] [INFO] 
23:06:53 [2020-11-28T04:06:53.507Z] [INFO] ---------< org.eclipse.ease:org.eclipse.ease.lang.python.test >---------
23:06:53 [2020-11-28T04:06:53.507Z] [INFO] Building org.eclipse.ease.lang.python.test 0.8.0-SNAPSHOT        [42/48]
23:06:53 [2020-11-28T04:06:53.507Z] [INFO] ------------------------[ eclipse-test-plugin ]-------------------------
23:06:53 [2020-11-28T04:06:53.507Z] [INFO] 
23:06:53 [2020-11-28T04:06:53.507Z] [INFO] --- maven-clean-plugin:2.5:clean (default-clean) @ org.eclipse.ease.lang.python.test ---
23:06:53 [2020-11-28T04:06:53.507Z] [INFO] 
23:06:53 [2020-11-28T04:06:53.507Z] [INFO] --- tycho-packaging-plugin:1.5.0:build-qualifier (default-build-qualifier) @ org.eclipse.ease.lang.python.test ---
23:06:53 [2020-11-28T04:06:53.507Z] [INFO] The project's OSGi version is 0.8.0.I201910171213
23:06:53 [2020-11-28T04:06:53.507Z] [INFO] 
23:06:53 [2020-11-28T04:06:53.507Z] [INFO] --- tycho-packaging-plugin:1.5.0:validate-id (default-validate-id) @ org.eclipse.ease.lang.python.test ---
23:06:53 [2020-11-28T04:06:53.507Z] [INFO] 
23:06:53 [2020-11-28T04:06:53.507Z] [INFO] --- tycho-packaging-plugin:1.5.0:validate-version (default-validate-version) @ org.eclipse.ease.lang.python.test ---
23:06:53 [2020-11-28T04:06:53.507Z] [INFO] 
23:06:53 [2020-11-28T04:06:53.507Z] [INFO] --- maven-resources-plugin:2.4.3:resources (default-resources) @ org.eclipse.ease.lang.python.test ---
23:06:53 [2020-11-28T04:06:53.507Z] [INFO] Using 'UTF-8' encoding to copy filtered resources.
23:06:53 [2020-11-28T04:06:53.507Z] [INFO] skip non existing resourceDirectory /home/jenkins/agent/workspace/ease.verify.core.target.luna/tests/org.eclipse.ease.lang.python.test/src/main/resources
23:06:53 [2020-11-28T04:06:53.507Z] [INFO] 
23:06:53 [2020-11-28T04:06:53.507Z] [INFO] --- tycho-compiler-plugin:1.5.0:compile (default-compile) @ org.eclipse.ease.lang.python.test ---
23:06:53 [2020-11-28T04:06:53.507Z] [INFO] Compiling 1 source file to /home/jenkins/agent/workspace/ease.verify.core.target.luna/tests/org.eclipse.ease.lang.python.test/target/classes
23:06:53 [2020-11-28T04:06:53.763Z] [INFO] 
23:06:53 [2020-11-28T04:06:53.763Z] [INFO] --- maven-resources-plugin:2.4.3:testResources (default-testResources) @ org.eclipse.ease.lang.python.test ---
23:06:53 [2020-11-28T04:06:53.763Z] [INFO] Using 'UTF-8' encoding to copy filtered resources.
23:06:53 [2020-11-28T04:06:53.763Z] [INFO] skip non existing resourceDirectory /home/jenkins/agent/workspace/ease.verify.core.target.luna/tests/org.eclipse.ease.lang.python.test/src/test/resources
23:06:53 [2020-11-28T04:06:53.763Z] [INFO] 
23:06:53 [2020-11-28T04:06:53.763Z] [INFO] --- tycho-source-plugin:1.5.0:plugin-source (plugin-source) @ org.eclipse.ease.lang.python.test ---
23:06:53 [2020-11-28T04:06:53.763Z] [WARNING] Bundle-Vendor header not found in /home/jenkins/agent/workspace/ease.verify.core.target.luna/tests/org.eclipse.ease.lang.python.test/META-INF/MANIFEST.MF, fallback to 'unknown' for source bundle
23:06:53 [2020-11-28T04:06:53.764Z] [INFO] Building jar: /home/jenkins/agent/workspace/ease.verify.core.target.luna/tests/org.eclipse.ease.lang.python.test/target/org.eclipse.ease.lang.python.test-0.8.0-SNAPSHOT-sources.jar
23:06:53 [2020-11-28T04:06:53.764Z] [INFO] 
23:06:53 [2020-11-28T04:06:53.764Z] [INFO] --- target-platform-configuration:1.5.0:target-platform (default-target-platform) @ org.eclipse.ease.lang.python.test ---
23:06:53 [2020-11-28T04:06:53.764Z] [INFO] 
23:06:53 [2020-11-28T04:06:53.764Z] [INFO] --- tycho-packaging-plugin:1.5.0:package-plugin (default-package-plugin) @ org.eclipse.ease.lang.python.test ---
23:06:53 [2020-11-28T04:06:53.764Z] [INFO] Building jar: /home/jenkins/agent/workspace/ease.verify.core.target.luna/tests/org.eclipse.ease.lang.python.test/target/org.eclipse.ease.lang.python.test-0.8.0-SNAPSHOT.jar
23:06:53 [2020-11-28T04:06:53.764Z] [INFO] 
23:06:53 [2020-11-28T04:06:53.764Z] [INFO] --- tycho-p2-plugin:1.5.0:p2-metadata-default (default-p2-metadata-default) @ org.eclipse.ease.lang.python.test ---
23:06:53 [2020-11-28T04:06:53.764Z] [INFO] 
23:06:53 [2020-11-28T04:06:53.764Z] [INFO] --- tycho-source-feature-plugin:1.5.0:source-feature (source-feature) @ org.eclipse.ease.lang.python.test ---
23:06:53 [2020-11-28T04:06:53.764Z] [INFO] 
23:06:53 [2020-11-28T04:06:53.764Z] [INFO] --- tycho-p2-plugin:1.5.0:p2-metadata (attached-p2-metadata) @ org.eclipse.ease.lang.python.test ---
23:06:53 [2020-11-28T04:06:53.764Z] [INFO] 
23:06:53 [2020-11-28T04:06:53.764Z] [INFO] --- tycho-surefire-plugin:1.5.0:test (default-test) @ org.eclipse.ease.lang.python.test ---
23:06:53 [2020-11-28T04:06:53.764Z] [INFO] Expected eclipse log file: /home/jenkins/agent/workspace/ease.verify.core.target.luna/tests/org.eclipse.ease.lang.python.test/target/work/data/.metadata/.log
23:06:53 [2020-11-28T04:06:53.764Z] [INFO] Command line:
23:06:53 [2020-11-28T04:06:53.764Z] 	[/opt/tools/java/openjdk/jdk-11/11.0.2+9/bin/java, -Dosgi.noShutdown=false, -Dosgi.os=linux, -Dosgi.ws=gtk, -Dosgi.arch=x86_64, -Dosgi.clean=true, -jar, /home/jenkins/.m2/repository/p2/osgi/bundle/org.eclipse.equinox.launcher/1.5.800.v20200727-1323/org.eclipse.equinox.launcher-1.5.800.v20200727-1323.jar, -data, /home/jenkins/agent/workspace/ease.verify.core.target.luna/tests/org.eclipse.ease.lang.python.test/target/work/data, -install, /home/jenkins/agent/workspace/ease.verify.core.target.luna/tests/org.eclipse.ease.lang.python.test/target/work, -configuration, /home/jenkins/agent/workspace/ease.verify.core.target.luna/tests/org.eclipse.ease.lang.python.test/target/work/configuration, -application, org.eclipse.tycho.surefire.osgibooter.headlesstest, -testproperties, /home/jenkins/agent/workspace/ease.verify.core.target.luna/tests/org.eclipse.ease.lang.python.test/target/surefire.properties]
23:06:53 [2020-11-28T04:06:53.764Z] Picked up JAVA_TOOL_OPTIONS: -Dmaven.ext.class.path="/home/jenkins/agent/workspace/ease.verify.core.target.luna@tmp/withMavenea4e87b2/pipeline-maven-spy.jar" -Dorg.jenkinsci.plugins.pipeline.maven.reportsFolder="/home/jenkins/agent/workspace/ease.verify.core.target.luna@tmp/withMavenea4e87b2" 
23:06:55 [2020-11-28T04:06:55.653Z] Running org.eclipse.ease.lang.python.PythonCodeFactoryTest
23:06:55 [2020-11-28T04:06:55.653Z] Tests run: 1, Failures: 0, Errors: 0, Skipped: 0, Time elapsed: 0.039 s - in org.eclipse.ease.lang.python.PythonCodeFactoryTest
23:06:55 [2020-11-28T04:06:55.653Z] testCommentCreator(org.eclipse.ease.lang.python.PythonCodeFactoryTest)  Time elapsed: 0.003 s
23:06:55 [2020-11-28T04:06:55.653Z] 
23:06:55 [2020-11-28T04:06:55.653Z] Results:
23:06:55 [2020-11-28T04:06:55.653Z] 
23:06:55 [2020-11-28T04:06:55.653Z] Tests run: 1, Failures: 0, Errors: 0, Skipped: 0
23:06:55 [2020-11-28T04:06:55.653Z] 
23:06:55 [2020-11-28T04:06:55.909Z] [INFO] All tests passed!
23:06:55 [2020-11-28T04:06:55.909Z] [INFO] 
23:06:55 [2020-11-28T04:06:55.909Z] [INFO] --- maven-install-plugin:2.3.1:install (default-install) @ org.eclipse.ease.lang.python.test ---
23:06:55 [2020-11-28T04:06:55.909Z] [INFO] Installing /home/jenkins/agent/workspace/ease.verify.core.target.luna/tests/org.eclipse.ease.lang.python.test/target/org.eclipse.ease.lang.python.test-0.8.0-SNAPSHOT.jar to /home/jenkins/.m2/repository/org/eclipse/ease/org.eclipse.ease.lang.python.test/0.8.0-SNAPSHOT/org.eclipse.ease.lang.python.test-0.8.0-SNAPSHOT.jar
23:06:55 [2020-11-28T04:06:55.909Z] [INFO] Installing /home/jenkins/agent/workspace/ease.verify.core.target.luna/tests/org.eclipse.ease.lang.python.test/pom.xml to /home/jenkins/.m2/repository/org/eclipse/ease/org.eclipse.ease.lang.python.test/0.8.0-SNAPSHOT/org.eclipse.ease.lang.python.test-0.8.0-SNAPSHOT.pom
23:06:55 [2020-11-28T04:06:55.909Z] [INFO] Installing /home/jenkins/agent/workspace/ease.verify.core.target.luna/tests/org.eclipse.ease.lang.python.test/target/org.eclipse.ease.lang.python.test-0.8.0-SNAPSHOT-sources.jar to /home/jenkins/.m2/repository/org/eclipse/ease/org.eclipse.ease.lang.python.test/0.8.0-SNAPSHOT/org.eclipse.ease.lang.python.test-0.8.0-SNAPSHOT-sources.jar
23:06:55 [2020-11-28T04:06:55.910Z] [INFO] Installing /home/jenkins/agent/workspace/ease.verify.core.target.luna/tests/org.eclipse.ease.lang.python.test/target/p2content.xml to /home/jenkins/.m2/repository/org/eclipse/ease/org.eclipse.ease.lang.python.test/0.8.0-SNAPSHOT/org.eclipse.ease.lang.python.test-0.8.0-SNAPSHOT-p2metadata.xml
23:06:55 [2020-11-28T04:06:55.910Z] [INFO] Installing /home/jenkins/agent/workspace/ease.verify.core.target.luna/tests/org.eclipse.ease.lang.python.test/target/p2artifacts.xml to /home/jenkins/.m2/repository/org/eclipse/ease/org.eclipse.ease.lang.python.test/0.8.0-SNAPSHOT/org.eclipse.ease.lang.python.test-0.8.0-SNAPSHOT-p2artifacts.xml
23:06:55 [2020-11-28T04:06:55.910Z] [INFO] Installing /home/jenkins/agent/workspace/ease.verify.core.target.luna/tests/org.eclipse.ease.lang.python.test/target/p2content.xml to /home/jenkins/.m2/repository/org/eclipse/ease/org.eclipse.ease.lang.python.test/0.8.0-SNAPSHOT/org.eclipse.ease.lang.python.test-0.8.0-SNAPSHOT-p2metadata.xml
23:06:55 [2020-11-28T04:06:55.910Z] [INFO] Installing /home/jenkins/agent/workspace/ease.verify.core.target.luna/tests/org.eclipse.ease.lang.python.test/target/p2artifacts.xml to /home/jenkins/.m2/repository/org/eclipse/ease/org.eclipse.ease.lang.python.test/0.8.0-SNAPSHOT/org.eclipse.ease.lang.python.test-0.8.0-SNAPSHOT-p2artifacts.xml
23:06:55 [2020-11-28T04:06:55.910Z] [INFO] 
23:06:55 [2020-11-28T04:06:55.910Z] [INFO] --- tycho-p2-plugin:1.5.0:update-local-index (default-update-local-index) @ org.eclipse.ease.lang.python.test ---
23:06:55 [2020-11-28T04:06:55.910Z] [INFO] 
23:06:55 [2020-11-28T04:06:55.910Z] [INFO] -----< org.eclipse.ease:org.eclipse.ease.lang.python.jython.test >------
23:06:55 [2020-11-28T04:06:55.910Z] [INFO] Building org.eclipse.ease.lang.python.jython.test 0.8.0-SNAPSHOT [43/48]
23:06:55 [2020-11-28T04:06:55.910Z] [INFO] ------------------------[ eclipse-test-plugin ]-------------------------
23:06:55 [2020-11-28T04:06:55.910Z] [INFO] 
23:06:55 [2020-11-28T04:06:55.910Z] [INFO] --- maven-clean-plugin:2.5:clean (default-clean) @ org.eclipse.ease.lang.python.jython.test ---
23:06:55 [2020-11-28T04:06:55.910Z] [INFO] 
23:06:55 [2020-11-28T04:06:55.910Z] [INFO] --- tycho-packaging-plugin:1.5.0:build-qualifier (default-build-qualifier) @ org.eclipse.ease.lang.python.jython.test ---
23:06:55 [2020-11-28T04:06:55.910Z] [INFO] The project's OSGi version is 0.8.0.I201911291239
23:06:55 [2020-11-28T04:06:55.910Z] [INFO] 
23:06:55 [2020-11-28T04:06:55.910Z] [INFO] --- tycho-packaging-plugin:1.5.0:validate-id (default-validate-id) @ org.eclipse.ease.lang.python.jython.test ---
23:06:55 [2020-11-28T04:06:55.910Z] [INFO] 
23:06:55 [2020-11-28T04:06:55.910Z] [INFO] --- tycho-packaging-plugin:1.5.0:validate-version (default-validate-version) @ org.eclipse.ease.lang.python.jython.test ---
23:06:55 [2020-11-28T04:06:55.910Z] [INFO] 
23:06:55 [2020-11-28T04:06:55.910Z] [INFO] --- maven-resources-plugin:2.4.3:resources (default-resources) @ org.eclipse.ease.lang.python.jython.test ---
23:06:55 [2020-11-28T04:06:55.910Z] [INFO] Using 'UTF-8' encoding to copy filtered resources.
23:06:55 [2020-11-28T04:06:55.910Z] [INFO] skip non existing resourceDirectory /home/jenkins/agent/workspace/ease.verify.core.target.luna/tests/org.eclipse.ease.lang.python.jython.test/src/main/resources
23:06:55 [2020-11-28T04:06:55.910Z] [INFO] 
23:06:55 [2020-11-28T04:06:55.910Z] [INFO] --- tycho-compiler-plugin:1.5.0:compile (default-compile) @ org.eclipse.ease.lang.python.jython.test ---
23:06:55 [2020-11-28T04:06:55.910Z] [INFO] Compiling 1 source file to /home/jenkins/agent/workspace/ease.verify.core.target.luna/tests/org.eclipse.ease.lang.python.jython.test/target/classes
23:06:56 [2020-11-28T04:06:56.166Z] [INFO] 
23:06:56 [2020-11-28T04:06:56.166Z] [INFO] --- maven-resources-plugin:2.4.3:testResources (default-testResources) @ org.eclipse.ease.lang.python.jython.test ---
23:06:56 [2020-11-28T04:06:56.166Z] [INFO] Using 'UTF-8' encoding to copy filtered resources.
23:06:56 [2020-11-28T04:06:56.166Z] [INFO] skip non existing resourceDirectory /home/jenkins/agent/workspace/ease.verify.core.target.luna/tests/org.eclipse.ease.lang.python.jython.test/src/test/resources
23:06:56 [2020-11-28T04:06:56.166Z] [INFO] 
23:06:56 [2020-11-28T04:06:56.166Z] [INFO] --- tycho-source-plugin:1.5.0:plugin-source (plugin-source) @ org.eclipse.ease.lang.python.jython.test ---
23:06:56 [2020-11-28T04:06:56.166Z] [WARNING] Bundle-Vendor header not found in /home/jenkins/agent/workspace/ease.verify.core.target.luna/tests/org.eclipse.ease.lang.python.jython.test/META-INF/MANIFEST.MF, fallback to 'unknown' for source bundle
23:06:56 [2020-11-28T04:06:56.166Z] [INFO] Building jar: /home/jenkins/agent/workspace/ease.verify.core.target.luna/tests/org.eclipse.ease.lang.python.jython.test/target/org.eclipse.ease.lang.python.jython.test-0.8.0-SNAPSHOT-sources.jar
23:06:56 [2020-11-28T04:06:56.166Z] [INFO] 
23:06:56 [2020-11-28T04:06:56.166Z] [INFO] --- target-platform-configuration:1.5.0:target-platform (default-target-platform) @ org.eclipse.ease.lang.python.jython.test ---
23:06:56 [2020-11-28T04:06:56.166Z] [INFO] 
23:06:56 [2020-11-28T04:06:56.166Z] [INFO] --- tycho-packaging-plugin:1.5.0:package-plugin (default-package-plugin) @ org.eclipse.ease.lang.python.jython.test ---
23:06:56 [2020-11-28T04:06:56.166Z] [INFO] Building jar: /home/jenkins/agent/workspace/ease.verify.core.target.luna/tests/org.eclipse.ease.lang.python.jython.test/target/org.eclipse.ease.lang.python.jython.test-0.8.0-SNAPSHOT.jar
23:06:56 [2020-11-28T04:06:56.166Z] [INFO] 
23:06:56 [2020-11-28T04:06:56.166Z] [INFO] --- tycho-p2-plugin:1.5.0:p2-metadata-default (default-p2-metadata-default) @ org.eclipse.ease.lang.python.jython.test ---
23:06:56 [2020-11-28T04:06:56.166Z] [INFO] 
23:06:56 [2020-11-28T04:06:56.166Z] [INFO] --- tycho-source-feature-plugin:1.5.0:source-feature (source-feature) @ org.eclipse.ease.lang.python.jython.test ---
23:06:56 [2020-11-28T04:06:56.166Z] [INFO] 
23:06:56 [2020-11-28T04:06:56.166Z] [INFO] --- tycho-p2-plugin:1.5.0:p2-metadata (attached-p2-metadata) @ org.eclipse.ease.lang.python.jython.test ---
23:06:56 [2020-11-28T04:06:56.166Z] [INFO] 
23:06:56 [2020-11-28T04:06:56.166Z] [INFO] --- tycho-surefire-plugin:1.5.0:test (default-test) @ org.eclipse.ease.lang.python.jython.test ---
23:06:56 [2020-11-28T04:06:56.728Z] [INFO] Expected eclipse log file: /home/jenkins/agent/workspace/ease.verify.core.target.luna/tests/org.eclipse.ease.lang.python.jython.test/target/work/data/.metadata/.log
23:06:56 [2020-11-28T04:06:56.728Z] [INFO] Command line:
23:06:56 [2020-11-28T04:06:56.728Z] 	[/opt/tools/java/openjdk/jdk-11/11.0.2+9/bin/java, -Dosgi.noShutdown=false, -Dosgi.os=linux, -Dosgi.ws=gtk, -Dosgi.arch=x86_64, -Dosgi.clean=true, -jar, /home/jenkins/.m2/repository/p2/osgi/bundle/org.eclipse.equinox.launcher/1.5.800.v20200727-1323/org.eclipse.equinox.launcher-1.5.800.v20200727-1323.jar, -data, /home/jenkins/agent/workspace/ease.verify.core.target.luna/tests/org.eclipse.ease.lang.python.jython.test/target/work/data, -install, /home/jenkins/agent/workspace/ease.verify.core.target.luna/tests/org.eclipse.ease.lang.python.jython.test/target/work, -configuration, /home/jenkins/agent/workspace/ease.verify.core.target.luna/tests/org.eclipse.ease.lang.python.jython.test/target/work/configuration, -application, org.eclipse.tycho.surefire.osgibooter.headlesstest, -testproperties, /home/jenkins/agent/workspace/ease.verify.core.target.luna/tests/org.eclipse.ease.lang.python.jython.test/target/surefire.properties]
23:06:56 [2020-11-28T04:06:56.728Z] Picked up JAVA_TOOL_OPTIONS: -Dmaven.ext.class.path="/home/jenkins/agent/workspace/ease.verify.core.target.luna@tmp/withMavenea4e87b2/pipeline-maven-spy.jar" -Dorg.jenkinsci.plugins.pipeline.maven.reportsFolder="/home/jenkins/agent/workspace/ease.verify.core.target.luna@tmp/withMavenea4e87b2" 
23:06:58 [2020-11-28T04:06:58.647Z] WARNING: An illegal reflective access operation has occurred
23:06:58 [2020-11-28T04:06:58.647Z] WARNING: Illegal reflective access by org.python.core.PySystemState (file:/home/jenkins/agent/workspace/ease.verify.core.target.luna/tests/org.eclipse.ease.lang.python.jython.test/target/work/plugins/org.jython_2.7.0.I201609090924/jython.jar) to method java.io.Console.encoding()
23:06:58 [2020-11-28T04:06:58.647Z] WARNING: Please consider reporting this to the maintainers of org.python.core.PySystemState
23:06:58 [2020-11-28T04:06:58.647Z] WARNING: Use --illegal-access=warn to enable warnings of further illegal reflective access operations
23:06:58 [2020-11-28T04:06:58.647Z] WARNING: All illegal access operations will be denied in a future release
23:06:58 [2020-11-28T04:06:58.647Z] Running org.eclipse.ease.lang.python.jython.debugger.JythonDebugTest
23:07:00 [2020-11-28T04:07:00.029Z] Start of script
23:07:00 [2020-11-28T04:07:00.029Z] include file start
23:07:00 [2020-11-28T04:07:00.029Z] include file processed
23:07:00 [2020-11-28T04:07:00.029Z] Result of testMethod = 5
23:07:00 [2020-11-28T04:07:00.029Z] End of script
23:07:00 [2020-11-28T04:07:00.285Z] Start of script
23:07:00 [2020-11-28T04:07:00.285Z] include file start
23:07:00 [2020-11-28T04:07:00.285Z] include file processed
23:07:00 [2020-11-28T04:07:00.285Z] Result of testMethod = 5
23:07:00 [2020-11-28T04:07:00.285Z] End of script
23:07:00 [2020-11-28T04:07:00.285Z] Start of script
23:07:00 [2020-11-28T04:07:00.541Z] include file start
23:07:00 [2020-11-28T04:07:00.541Z] include file processed
23:07:00 [2020-11-28T04:07:00.541Z] Result of testMethod = 5
23:07:00 [2020-11-28T04:07:00.541Z] Traceback (most recent call last):
23:07:00 [2020-11-28T04:07:00.541Z]   File "(none)", line 184, in run
23:07:00 [2020-11-28T04:07:00.541Z]   File "__ref_L/Debug Test/Main.py_htugwmgxlv", line 23, in <module>
23:07:00 [2020-11-28T04:07:00.541Z]   File "(none)", line 161, in trace_dispatch
23:07:00 [2020-11-28T04:07:00.541Z] org.eclipse.ease.ExitException: 
23:07:00 [2020-11-28T04:07:00.541Z] 
23:07:00 [2020-11-28T04:07:00.541Z] org.eclipse.ease.ExitException: org.eclipse.ease.ExitException: 
23:07:00 [2020-11-28T04:07:00.798Z] Start of script
23:07:00 [2020-11-28T04:07:00.798Z] include file start
23:07:00 [2020-11-28T04:07:00.798Z] include file processed
23:07:00 [2020-11-28T04:07:00.798Z] Result of testMethod = 5
23:07:00 [2020-11-28T04:07:00.798Z] End of script
23:07:01 [2020-11-28T04:07:01.359Z] Start of script
23:07:01 [2020-11-28T04:07:01.359Z] include file start
23:07:01 [2020-11-28T04:07:01.359Z] include file processed
23:07:01 [2020-11-28T04:07:01.359Z] Result of testMethod = 5
23:07:01 [2020-11-28T04:07:01.359Z] End of script
23:07:01 [2020-11-28T04:07:01.360Z] Start of script
23:07:01 [2020-11-28T04:07:01.360Z] include file start
23:07:01 [2020-11-28T04:07:01.360Z] include file processed
23:07:01 [2020-11-28T04:07:01.615Z] Result of testMethod = 5
23:07:01 [2020-11-28T04:07:01.615Z] End of script
23:07:01 [2020-11-28T04:07:01.615Z] Start of script
23:07:01 [2020-11-28T04:07:01.615Z] include file start
23:07:01 [2020-11-28T04:07:01.615Z] include file processed
23:07:01 [2020-11-28T04:07:01.615Z] Result of testMethod = 5
23:07:01 [2020-11-28T04:07:01.871Z] Traceback (most recent call last):
23:07:01 [2020-11-28T04:07:01.871Z]   File "(none)", line 184, in run
23:07:01 [2020-11-28T04:07:01.871Z]   File "__ref_L/Debug Test/Main.py_zcqweursgp", line 23, in <module>
23:07:01 [2020-11-28T04:07:01.871Z]   File "(none)", line 161, in trace_dispatch
23:07:01 [2020-11-28T04:07:01.871Z] org.eclipse.ease.ExitException: 
23:07:01 [2020-11-28T04:07:01.871Z] 
23:07:01 [2020-11-28T04:07:01.871Z] org.eclipse.ease.ExitException: org.eclipse.ease.ExitException: 
23:07:01 [2020-11-28T04:07:01.871Z] Start of script
23:07:01 [2020-11-28T04:07:01.871Z] include file start
23:07:01 [2020-11-28T04:07:01.871Z] include file processed
23:07:02 [2020-11-28T04:07:02.126Z] Result of testMethod = 5
23:07:02 [2020-11-28T04:07:02.126Z] End of script
23:07:02 [2020-11-28T04:07:02.382Z] Start of script
23:07:02 [2020-11-28T04:07:02.382Z] include file start
23:07:02 [2020-11-28T04:07:02.382Z] include file processed
23:07:02 [2020-11-28T04:07:02.382Z] Result of testMethod = 5
23:07:02 [2020-11-28T04:07:02.382Z] End of script
23:07:02 [2020-11-28T04:07:02.382Z] Start of script
23:07:02 [2020-11-28T04:07:02.382Z] include file start
23:07:02 [2020-11-28T04:07:02.382Z] include file processed
23:07:02 [2020-11-28T04:07:02.943Z] Traceback (most recent call last):
23:07:02 [2020-11-28T04:07:02.943Z]   File "(none)", line 184, in run
23:07:02 [2020-11-28T04:07:02.943Z]   File "__ref_L/Debug Test/Main.py_wwofwmzjdv", line 22, in <module>
23:07:02 [2020-11-28T04:07:02.943Z]   File "(none)", line 161, in trace_dispatch
23:07:02 [2020-11-28T04:07:02.943Z] org.eclipse.ease.ExitException: 
23:07:02 [2020-11-28T04:07:02.943Z] 
23:07:02 [2020-11-28T04:07:02.943Z] org.eclipse.ease.ExitException: org.eclipse.ease.ExitException: 
23:07:02 [2020-11-28T04:07:02.943Z] Start of script
23:07:02 [2020-11-28T04:07:02.943Z] include file start
23:07:02 [2020-11-28T04:07:02.943Z] include file processed
23:07:02 [2020-11-28T04:07:02.943Z] Result of testMethod = 5
23:07:02 [2020-11-28T04:07:02.943Z] End of script
23:07:03 [2020-11-28T04:07:03.199Z] Start of script
23:07:03 [2020-11-28T04:07:03.199Z] include file start
23:07:03 [2020-11-28T04:07:03.199Z] include file processed
23:07:03 [2020-11-28T04:07:03.455Z] Result of testMethod = 5
23:07:03 [2020-11-28T04:07:03.455Z] End of script
23:07:03 [2020-11-28T04:07:03.455Z] Traceback (most recent call last):
23:07:03 [2020-11-28T04:07:03.455Z]   File "(none)", line 184, in run
23:07:03 [2020-11-28T04:07:03.455Z]   File "__ref_L/Debug Test/Main.py_mcskpotekr", line 1, in <module>
23:07:03 [2020-11-28T04:07:03.455Z]   File "(none)", line 161, in trace_dispatch
23:07:03 [2020-11-28T04:07:03.455Z] org.eclipse.ease.ExitException: 
23:07:03 [2020-11-28T04:07:03.455Z] 
23:07:03 [2020-11-28T04:07:03.455Z] org.eclipse.ease.ExitException: org.eclipse.ease.ExitException: 
23:07:03 [2020-11-28T04:07:03.711Z] Start of script
23:07:03 [2020-11-28T04:07:03.711Z] include file start
23:07:03 [2020-11-28T04:07:03.711Z] include file processed
23:07:03 [2020-11-28T04:07:03.711Z] Result of testMethod = 5
23:07:03 [2020-11-28T04:07:03.711Z] End of script
23:07:03 [2020-11-28T04:07:03.966Z] Start of script
23:07:03 [2020-11-28T04:07:03.966Z] include file start
23:07:03 [2020-11-28T04:07:03.966Z] include file processed
23:07:03 [2020-11-28T04:07:03.966Z] Result of testMethod = 5
23:07:03 [2020-11-28T04:07:03.966Z] End of script
23:07:04 [2020-11-28T04:07:04.222Z] Start of script
23:07:04 [2020-11-28T04:07:04.222Z] include file start
23:07:04 [2020-11-28T04:07:04.222Z] include file processed
23:07:04 [2020-11-28T04:07:04.222Z] Result of testMethod = 5
23:07:04 [2020-11-28T04:07:04.479Z] Traceback (most recent call last):
23:07:04 [2020-11-28T04:07:04.479Z]   File "(none)", line 184, in run
23:07:04 [2020-11-28T04:07:04.479Z]   File "__ref_L/Debug Test/Main.py_myjwswbrre", line 23, in <module>
23:07:04 [2020-11-28T04:07:04.479Z]   File "(none)", line 161, in trace_dispatch
23:07:04 [2020-11-28T04:07:04.479Z] org.eclipse.ease.ExitException: 
23:07:04 [2020-11-28T04:07:04.479Z] 
23:07:04 [2020-11-28T04:07:04.479Z] org.eclipse.ease.ExitException: org.eclipse.ease.ExitException: 
23:07:04 [2020-11-28T04:07:04.479Z] Start of script
23:07:04 [2020-11-28T04:07:04.479Z] include file start
23:07:04 [2020-11-28T04:07:04.479Z] include file processed
23:07:04 [2020-11-28T04:07:04.742Z] Result of testMethod = 5
23:07:04 [2020-11-28T04:07:04.742Z] End of script
23:07:05 [2020-11-28T04:07:05.019Z] Traceback (most recent call last):
23:07:05 [2020-11-28T04:07:05.019Z]   File "(none)", line 184, in run
23:07:05 [2020-11-28T04:07:05.019Z]   File "__ref_L/Debug Test/Main.py_mjmougtnlo", line 1, in <module>
23:07:05 [2020-11-28T04:07:05.019Z]   File "(none)", line 161, in trace_dispatch
23:07:05 [2020-11-28T04:07:05.019Z] org.eclipse.ease.ExitException: 
23:07:05 [2020-11-28T04:07:05.019Z] 
23:07:05 [2020-11-28T04:07:05.019Z] org.eclipse.ease.ExitException: org.eclipse.ease.ExitException: 
23:07:05 [2020-11-28T04:07:05.019Z] Start of script
23:07:05 [2020-11-28T04:07:05.019Z] include file start
23:07:05 [2020-11-28T04:07:05.019Z] include file processed
23:07:05 [2020-11-28T04:07:05.019Z] Result of testMethod = 5
23:07:05 [2020-11-28T04:07:05.019Z] End of script
23:07:05 [2020-11-28T04:07:05.284Z] Start of script
23:07:05 [2020-11-28T04:07:05.285Z] include file start
23:07:05 [2020-11-28T04:07:05.285Z] include file processed
23:07:05 [2020-11-28T04:07:05.540Z] Result of testMethod = 5
23:07:05 [2020-11-28T04:07:05.540Z] End of script
23:07:05 [2020-11-28T04:07:05.540Z] Traceback (most recent call last):
23:07:05 [2020-11-28T04:07:05.540Z]   File "(none)", line 184, in run
23:07:05 [2020-11-28T04:07:05.540Z]   File "__ref_L/Debug Test/Main.py_sbrrpdljea", line 1, in <module>
23:07:05 [2020-11-28T04:07:05.540Z]   File "(none)", line 161, in trace_dispatch
23:07:05 [2020-11-28T04:07:05.540Z] org.eclipse.ease.ExitException: 
23:07:05 [2020-11-28T04:07:05.540Z] 
23:07:05 [2020-11-28T04:07:05.540Z] org.eclipse.ease.ExitException: org.eclipse.ease.ExitException: 
23:07:05 [2020-11-28T04:07:05.797Z] Start of script
23:07:05 [2020-11-28T04:07:05.797Z] include file start
23:07:05 [2020-11-28T04:07:05.797Z] include file processed
23:07:06 [2020-11-28T04:07:06.055Z] Result of testMethod = 5
23:07:06 [2020-11-28T04:07:06.055Z] End of script
23:07:06 [2020-11-28T04:07:06.055Z] Start of script
23:07:06 [2020-11-28T04:07:06.055Z] include file start
23:07:06 [2020-11-28T04:07:06.055Z] include file processed
23:07:06 [2020-11-28T04:07:06.055Z] Result of testMethod = 5
23:07:06 [2020-11-28T04:07:06.311Z] Traceback (most recent call last):
23:07:06 [2020-11-28T04:07:06.311Z]   File "(none)", line 184, in run
23:07:06 [2020-11-28T04:07:06.311Z]   File "__ref_L/Debug Test/Main.py_aodowolnpw", line 23, in <module>
23:07:06 [2020-11-28T04:07:06.311Z]   File "(none)", line 161, in trace_dispatch
23:07:06 [2020-11-28T04:07:06.311Z] org.eclipse.ease.ExitException: 
23:07:06 [2020-11-28T04:07:06.311Z] 
23:07:06 [2020-11-28T04:07:06.311Z] org.eclipse.ease.ExitException: org.eclipse.ease.ExitException: 
23:07:06 [2020-11-28T04:07:06.567Z] Start of script
23:07:06 [2020-11-28T04:07:06.567Z] include file start
23:07:06 [2020-11-28T04:07:06.567Z] include file processed
23:07:06 [2020-11-28T04:07:06.567Z] Result of testMethod = 5
23:07:06 [2020-11-28T04:07:06.567Z] End of script
23:07:06 [2020-11-28T04:07:06.567Z] Start of script
23:07:06 [2020-11-28T04:07:06.567Z] include file start
23:07:06 [2020-11-28T04:07:06.567Z] include file processed
23:07:06 [2020-11-28T04:07:06.823Z] Result of testMethod = 5
23:07:06 [2020-11-28T04:07:06.823Z] End of script
23:07:06 [2020-11-28T04:07:06.823Z] Start of script
23:07:06 [2020-11-28T04:07:06.823Z] include file start
23:07:06 [2020-11-28T04:07:06.823Z] include file processed
23:07:06 [2020-11-28T04:07:06.823Z] Result of testMethod = 5
23:07:06 [2020-11-28T04:07:06.823Z] End of script
23:07:07 [2020-11-28T04:07:07.079Z] Start of script
23:07:07 [2020-11-28T04:07:07.079Z] include file start
23:07:07 [2020-11-28T04:07:07.079Z] include file processed
23:07:07 [2020-11-28T04:07:07.079Z] Result of testMethod = 5
23:07:07 [2020-11-28T04:07:07.079Z] End of script
23:07:07 [2020-11-28T04:07:07.335Z] Start of script
23:07:07 [2020-11-28T04:07:07.335Z] include file start
23:07:07 [2020-11-28T04:07:07.335Z] include file processed
23:07:07 [2020-11-28T04:07:07.591Z] Traceback (most recent call last):
23:07:07 [2020-11-28T04:07:07.591Z]   File "(none)", line 184, in run
23:07:07 [2020-11-28T04:07:07.591Z]   File "__ref_L/Debug Test/Main.py_tcusqjldka", line 21, in <module>
23:07:07 [2020-11-28T04:07:07.591Z]   File "__ref_L/Debug Test/Main.py_tcusqjldka", line 18, in testMethod
23:07:07 [2020-11-28T04:07:07.591Z]   File "(none)", line 161, in trace_dispatch
23:07:07 [2020-11-28T04:07:07.591Z] org.eclipse.ease.ExitException: 
23:07:07 [2020-11-28T04:07:07.591Z] 
23:07:07 [2020-11-28T04:07:07.591Z] org.eclipse.ease.ExitException: org.eclipse.ease.ExitException: 
23:07:07 [2020-11-28T04:07:07.591Z] Start of script
23:07:07 [2020-11-28T04:07:07.846Z] include file start
23:07:07 [2020-11-28T04:07:07.846Z] include file processed
23:07:07 [2020-11-28T04:07:07.846Z] Result of testMethod = 5
23:07:07 [2020-11-28T04:07:07.846Z] End of script
23:07:07 [2020-11-28T04:07:07.846Z] Start of script
23:07:07 [2020-11-28T04:07:07.846Z] include file start
23:07:07 [2020-11-28T04:07:07.846Z] include file processed
23:07:07 [2020-11-28T04:07:07.846Z] Result of testMethod = 5
23:07:08 [2020-11-28T04:07:08.101Z] Traceback (most recent call last):
23:07:08 [2020-11-28T04:07:08.101Z]   File "(none)", line 184, in run
23:07:08 [2020-11-28T04:07:08.101Z]   File "__ref_L/Debug Test/Main.py_iwsigmxjjv", line 23, in <module>
23:07:08 [2020-11-28T04:07:08.101Z]   File "(none)", line 161, in trace_dispatch
23:07:08 [2020-11-28T04:07:08.101Z] org.eclipse.ease.ExitException: 
23:07:08 [2020-11-28T04:07:08.101Z] 
23:07:08 [2020-11-28T04:07:08.101Z] org.eclipse.ease.ExitException: org.eclipse.ease.ExitException: 
23:07:08 [2020-11-28T04:07:08.101Z] Start of script
23:07:08 [2020-11-28T04:07:08.102Z] include file start
23:07:08 [2020-11-28T04:07:08.102Z] include file processed
23:07:08 [2020-11-28T04:07:08.102Z] Result of testMethod = 5
23:07:08 [2020-11-28T04:07:08.359Z] End of script
23:07:08 [2020-11-28T04:07:08.359Z] Start of script
23:07:08 [2020-11-28T04:07:08.359Z] include file start
23:07:08 [2020-11-28T04:07:08.359Z] include file processed
23:07:08 [2020-11-28T04:07:08.615Z] Result of testMethod = 5
23:07:08 [2020-11-28T04:07:08.615Z] End of script
23:07:08 [2020-11-28T04:07:08.615Z] Start of script
23:07:08 [2020-11-28T04:07:08.615Z] include file start
23:07:08 [2020-11-28T04:07:08.615Z] include file processed
23:07:08 [2020-11-28T04:07:08.870Z] Result of testMethod = 5
23:07:08 [2020-11-28T04:07:08.870Z] End of script
23:07:09 [2020-11-28T04:07:09.126Z] Start of script
23:07:09 [2020-11-28T04:07:09.126Z] include file start
23:07:09 [2020-11-28T04:07:09.126Z] include file processed
23:07:09 [2020-11-28T04:07:09.126Z] Result of testMethod = 5
23:07:09 [2020-11-28T04:07:09.126Z] End of script
23:07:09 [2020-11-28T04:07:09.126Z] Start of script
23:07:09 [2020-11-28T04:07:09.126Z] include file start
23:07:09 [2020-11-28T04:07:09.126Z] include file processed
23:07:09 [2020-11-28T04:07:09.126Z] Result of testMethod = 5
23:07:09 [2020-11-28T04:07:09.383Z] Traceback (most recent call last):
23:07:09 [2020-11-28T04:07:09.383Z]   File "(none)", line 184, in run
23:07:09 [2020-11-28T04:07:09.383Z]   File "__ref_L/Debug Test/Main.py_rotledvjtp", line 23, in <module>
23:07:09 [2020-11-28T04:07:09.383Z]   File "(none)", line 161, in trace_dispatch
23:07:09 [2020-11-28T04:07:09.383Z] org.eclipse.ease.ExitException: 
23:07:09 [2020-11-28T04:07:09.383Z] 
23:07:09 [2020-11-28T04:07:09.383Z] org.eclipse.ease.ExitException: org.eclipse.ease.ExitException: 
23:07:09 [2020-11-28T04:07:09.639Z] Start of script
23:07:09 [2020-11-28T04:07:09.639Z] include file start
23:07:09 [2020-11-28T04:07:09.639Z] include file processed
23:07:09 [2020-11-28T04:07:09.639Z] Result of testMethod = 5
23:07:09 [2020-11-28T04:07:09.639Z] End of script
23:07:09 [2020-11-28T04:07:09.639Z] Start of script
23:07:09 [2020-11-28T04:07:09.639Z] include file start
23:07:09 [2020-11-28T04:07:09.639Z] include file processed
23:07:09 [2020-11-28T04:07:09.639Z] Result of testMethod = 5
23:07:09 [2020-11-28T04:07:09.894Z] Traceback (most recent call last):
23:07:09 [2020-11-28T04:07:09.895Z]   File "(none)", line 184, in run
23:07:09 [2020-11-28T04:07:09.895Z]   File "__ref_L/Debug Test/Main.py_yojmqjcasa", line 23, in <module>
23:07:09 [2020-11-28T04:07:09.895Z]   File "(none)", line 161, in trace_dispatch
23:07:09 [2020-11-28T04:07:09.895Z] org.eclipse.ease.ExitException: 
23:07:09 [2020-11-28T04:07:09.895Z] 
23:07:09 [2020-11-28T04:07:09.895Z] org.eclipse.ease.ExitException: org.eclipse.ease.ExitException: 
23:07:10 [2020-11-28T04:07:10.151Z] Traceback (most recent call last):
23:07:10 [2020-11-28T04:07:10.151Z]   File "(none)", line 184, in run
23:07:10 [2020-11-28T04:07:10.151Z]   File "__ref_L/Debug Test/Main.py_gzazfzeiiv", line 1, in <module>
23:07:10 [2020-11-28T04:07:10.151Z]   File "(none)", line 161, in trace_dispatch
23:07:10 [2020-11-28T04:07:10.151Z] org.eclipse.ease.ExitException: 
23:07:10 [2020-11-28T04:07:10.151Z] 
23:07:10 [2020-11-28T04:07:10.151Z] org.eclipse.ease.ExitException: org.eclipse.ease.ExitException: 
23:07:10 [2020-11-28T04:07:10.407Z] Start of script
23:07:10 [2020-11-28T04:07:10.407Z] include file start
23:07:10 [2020-11-28T04:07:10.407Z] include file processed
23:07:10 [2020-11-28T04:07:10.407Z] Result of testMethod = 5
23:07:10 [2020-11-28T04:07:10.407Z] End of script
23:07:10 [2020-11-28T04:07:10.407Z] Start of script
23:07:10 [2020-11-28T04:07:10.407Z] include file start
23:07:10 [2020-11-28T04:07:10.407Z] include file processed
23:07:10 [2020-11-28T04:07:10.666Z] Result of testMethod = 5
23:07:10 [2020-11-28T04:07:10.666Z] End of script
23:07:10 [2020-11-28T04:07:10.666Z] Start of script
23:07:10 [2020-11-28T04:07:10.666Z] include file start
23:07:10 [2020-11-28T04:07:10.666Z] include file processed
23:07:10 [2020-11-28T04:07:10.666Z] Result of testMethod = 5
23:07:10 [2020-11-28T04:07:10.922Z] End of script
23:07:10 [2020-11-28T04:07:10.922Z] Tests run: 42, Failures: 0, Errors: 0, Skipped: 0, Time elapsed: 12.383 s - in org.eclipse.ease.lang.python.jython.debugger.JythonDebugTest
23:07:10 [2020-11-28T04:07:10.922Z] disconnectProcessInSuspendedState(org.eclipse.ease.lang.python.jython.debugger.JythonDebugTest)  Time elapsed: 1.556 s
23:07:10 [2020-11-28T04:07:10.922Z] stepReturnIncludeCommand(org.eclipse.ease.lang.python.jython.debugger.JythonDebugTest)  Time elapsed: 0.211 s
23:07:10 [2020-11-28T04:07:10.922Z] arrayVariableSorting(org.eclipse.ease.lang.python.jython.debugger.JythonDebugTest)  Time elapsed: 0.308 s
23:07:10 [2020-11-28T04:07:10.922Z] stepOverOnDebugTarget(org.eclipse.ease.lang.python.jython.debugger.JythonDebugTest)  Time elapsed: 0.31 s
23:07:10 [2020-11-28T04:07:10.922Z] hasDebugTarget(org.eclipse.ease.lang.python.jython.debugger.JythonDebugTest)  Time elapsed: 0.106 s
23:07:10 [2020-11-28T04:07:10.922Z] disconnectThreadInSuspendedState(org.eclipse.ease.lang.python.jython.debugger.JythonDebugTest)  Time elapsed: 0.208 s
23:07:10 [2020-11-28T04:07:10.922Z] stepReturnOnDebugTarget(org.eclipse.ease.lang.python.jython.debugger.JythonDebugTest)  Time elapsed: 0.308 s
23:07:10 [2020-11-28T04:07:10.922Z] nullVariable(org.eclipse.ease.lang.python.jython.debugger.JythonDebugTest)  Time elapsed: 0.308 s
23:07:10 [2020-11-28T04:07:10.922Z] stepOverOnStackFrame(org.eclipse.ease.lang.python.jython.debugger.JythonDebugTest)  Time elapsed: 0.308 s
23:07:10 [2020-11-28T04:07:10.922Z] resumeOnDebugTarget(org.eclipse.ease.lang.python.jython.debugger.JythonDebugTest)  Time elapsed: 0.209 s
23:07:10 [2020-11-28T04:07:10.922Z] modifyVariableKeepingType(org.eclipse.ease.lang.python.jython.debugger.JythonDebugTest)  Time elapsed: 0.507 s
23:07:10 [2020-11-28T04:07:10.922Z] resumeOnLastIncludeLine(org.eclipse.ease.lang.python.jython.debugger.JythonDebugTest)  Time elapsed: 0.207 s
23:07:10 [2020-11-28T04:07:10.922Z] stepReturnOnStackFrame(org.eclipse.ease.lang.python.jython.debugger.JythonDebugTest)  Time elapsed: 0.308 s
23:07:10 [2020-11-28T04:07:10.922Z] terminateStackFrameInSuspendedState(org.eclipse.ease.lang.python.jython.debugger.JythonDebugTest)  Time elapsed: 0.208 s
23:07:10 [2020-11-28T04:07:10.922Z] breakpointLocation(org.eclipse.ease.lang.python.jython.debugger.JythonDebugTest)  Time elapsed: 0.206 s
23:07:10 [2020-11-28T04:07:10.922Z] stepReturnOnThread(org.eclipse.ease.lang.python.jython.debugger.JythonDebugTest)  Time elapsed: 0.308 s
23:07:10 [2020-11-28T04:07:10.922Z] javaClassVariable(org.eclipse.ease.lang.python.jython.debugger.JythonDebugTest)  Time elapsed: 0.308 s
23:07:10 [2020-11-28T04:07:10.922Z] stepIntoOnThread(org.eclipse.ease.lang.python.jython.debugger.JythonDebugTest)  Time elapsed: 0.32 s
23:07:10 [2020-11-28T04:07:10.922Z] terminateThreadInSuspendedState(org.eclipse.ease.lang.python.jython.debugger.JythonDebugTest)  Time elapsed: 0.206 s
23:07:10 [2020-11-28T04:07:10.922Z] resumeOnThread(org.eclipse.ease.lang.python.jython.debugger.JythonDebugTest)  Time elapsed: 0.207 s
23:07:10 [2020-11-28T04:07:10.923Z] stepIntoOnStackFrame(org.eclipse.ease.lang.python.jython.debugger.JythonDebugTest)  Time elapsed: 0.306 s
23:07:10 [2020-11-28T04:07:10.923Z] terminateProcessInSuspendedState(org.eclipse.ease.lang.python.jython.debugger.JythonDebugTest)  Time elapsed: 0.206 s
23:07:10 [2020-11-28T04:07:10.923Z] stepOverOnProcess(org.eclipse.ease.lang.python.jython.debugger.JythonDebugTest)  Time elapsed: 0.307 s
23:07:10 [2020-11-28T04:07:10.923Z] nativeArrayVariable(org.eclipse.ease.lang.python.jython.debugger.JythonDebugTest)  Time elapsed: 0.306 s
23:07:10 [2020-11-28T04:07:10.923Z] disconnectDebugTargetInSuspendedState(org.eclipse.ease.lang.python.jython.debugger.JythonDebugTest)  Time elapsed: 0.206 s
23:07:10 [2020-11-28T04:07:10.923Z] stepIntoOnProcess(org.eclipse.ease.lang.python.jython.debugger.JythonDebugTest)  Time elapsed: 0.307 s
23:07:10 [2020-11-28T04:07:10.923Z] terminatedState(org.eclipse.ease.lang.python.jython.debugger.JythonDebugTest)  Time elapsed: 0.105 s
23:07:10 [2020-11-28T04:07:10.923Z] stepOverIncludeCommand(org.eclipse.ease.lang.python.jython.debugger.JythonDebugTest)  Time elapsed: 0.305 s
23:07:10 [2020-11-28T04:07:10.923Z] innerScopeVariableBeforeOuterScopeVariable(org.eclipse.ease.lang.python.jython.debugger.JythonDebugTest)  Time elapsed: 0.306 s
23:07:10 [2020-11-28T04:07:10.923Z] stepIntoIncludeCommand(org.eclipse.ease.lang.python.jython.debugger.JythonDebugTest)  Time elapsed: 0.304 s
23:07:10 [2020-11-28T04:07:10.923Z] primitiveStringVariable(org.eclipse.ease.lang.python.jython.debugger.JythonDebugTest)  Time elapsed: 0.306 s
23:07:10 [2020-11-28T04:07:10.923Z] resumeOnProcess(org.eclipse.ease.lang.python.jython.debugger.JythonDebugTest)  Time elapsed: 0.206 s
23:07:10 [2020-11-28T04:07:10.923Z] stepIntoOnDebugTarget(org.eclipse.ease.lang.python.jython.debugger.JythonDebugTest)  Time elapsed: 0.306 s
23:07:10 [2020-11-28T04:07:10.923Z] stepOverOnThread(org.eclipse.ease.lang.python.jython.debugger.JythonDebugTest)  Time elapsed: 0.308 s
23:07:10 [2020-11-28T04:07:10.923Z] suspendedState(org.eclipse.ease.lang.python.jython.debugger.JythonDebugTest)  Time elapsed: 0.205 s
23:07:10 [2020-11-28T04:07:10.923Z] primitiveDoubleVariable(org.eclipse.ease.lang.python.jython.debugger.JythonDebugTest)  Time elapsed: 0.307 s
23:07:10 [2020-11-28T04:07:10.923Z] resumeOnStackFrame(org.eclipse.ease.lang.python.jython.debugger.JythonDebugTest)  Time elapsed: 0.214 s
23:07:10 [2020-11-28T04:07:10.923Z] nativeObjectVariable(org.eclipse.ease.lang.python.jython.debugger.JythonDebugTest)  Time elapsed: 0.306 s
23:07:10 [2020-11-28T04:07:10.923Z] terminateDebugTargetInSuspendedState(org.eclipse.ease.lang.python.jython.debugger.JythonDebugTest)  Time elapsed: 0.206 s
23:07:10 [2020-11-28T04:07:10.923Z] disconnectStackFrameInSuspendedState(org.eclipse.ease.lang.python.jython.debugger.JythonDebugTest)  Time elapsed: 0.206 s
23:07:10 [2020-11-28T04:07:10.923Z] stepReturnOnProcess(org.eclipse.ease.lang.python.jython.debugger.JythonDebugTest)  Time elapsed: 0.305 s
23:07:10 [2020-11-28T04:07:10.923Z] evaluateWatchExpression(org.eclipse.ease.lang.python.jython.debugger.JythonDebugTest)  Time elapsed: 0.207 s
23:07:10 [2020-11-28T04:07:10.923Z] 
23:07:10 [2020-11-28T04:07:10.923Z] Results:
23:07:10 [2020-11-28T04:07:10.923Z] 
23:07:10 [2020-11-28T04:07:10.923Z] Tests run: 42, Failures: 0, Errors: 0, Skipped: 0
23:07:10 [2020-11-28T04:07:10.923Z] 
23:07:11 [2020-11-28T04:07:11.485Z] [INFO] All tests passed!
23:07:11 [2020-11-28T04:07:11.485Z] [INFO] 
23:07:11 [2020-11-28T04:07:11.485Z] [INFO] --- maven-install-plugin:2.3.1:install (default-install) @ org.eclipse.ease.lang.python.jython.test ---
23:07:11 [2020-11-28T04:07:11.485Z] [INFO] Installing /home/jenkins/agent/workspace/ease.verify.core.target.luna/tests/org.eclipse.ease.lang.python.jython.test/target/org.eclipse.ease.lang.python.jython.test-0.8.0-SNAPSHOT.jar to /home/jenkins/.m2/repository/org/eclipse/ease/org.eclipse.ease.lang.python.jython.test/0.8.0-SNAPSHOT/org.eclipse.ease.lang.python.jython.test-0.8.0-SNAPSHOT.jar
23:07:11 [2020-11-28T04:07:11.485Z] [INFO] Installing /home/jenkins/agent/workspace/ease.verify.core.target.luna/tests/org.eclipse.ease.lang.python.jython.test/pom.xml to /home/jenkins/.m2/repository/org/eclipse/ease/org.eclipse.ease.lang.python.jython.test/0.8.0-SNAPSHOT/org.eclipse.ease.lang.python.jython.test-0.8.0-SNAPSHOT.pom
23:07:11 [2020-11-28T04:07:11.485Z] [INFO] Installing /home/jenkins/agent/workspace/ease.verify.core.target.luna/tests/org.eclipse.ease.lang.python.jython.test/target/org.eclipse.ease.lang.python.jython.test-0.8.0-SNAPSHOT-sources.jar to /home/jenkins/.m2/repository/org/eclipse/ease/org.eclipse.ease.lang.python.jython.test/0.8.0-SNAPSHOT/org.eclipse.ease.lang.python.jython.test-0.8.0-SNAPSHOT-sources.jar
23:07:11 [2020-11-28T04:07:11.485Z] [INFO] Installing /home/jenkins/agent/workspace/ease.verify.core.target.luna/tests/org.eclipse.ease.lang.python.jython.test/target/p2content.xml to /home/jenkins/.m2/repository/org/eclipse/ease/org.eclipse.ease.lang.python.jython.test/0.8.0-SNAPSHOT/org.eclipse.ease.lang.python.jython.test-0.8.0-SNAPSHOT-p2metadata.xml
23:07:11 [2020-11-28T04:07:11.485Z] [INFO] Installing /home/jenkins/agent/workspace/ease.verify.core.target.luna/tests/org.eclipse.ease.lang.python.jython.test/target/p2artifacts.xml to /home/jenkins/.m2/repository/org/eclipse/ease/org.eclipse.ease.lang.python.jython.test/0.8.0-SNAPSHOT/org.eclipse.ease.lang.python.jython.test-0.8.0-SNAPSHOT-p2artifacts.xml
23:07:11 [2020-11-28T04:07:11.485Z] [INFO] Installing /home/jenkins/agent/workspace/ease.verify.core.target.luna/tests/org.eclipse.ease.lang.python.jython.test/target/p2content.xml to /home/jenkins/.m2/repository/org/eclipse/ease/org.eclipse.ease.lang.python.jython.test/0.8.0-SNAPSHOT/org.eclipse.ease.lang.python.jython.test-0.8.0-SNAPSHOT-p2metadata.xml
23:07:11 [2020-11-28T04:07:11.485Z] [INFO] Installing /home/jenkins/agent/workspace/ease.verify.core.target.luna/tests/org.eclipse.ease.lang.python.jython.test/target/p2artifacts.xml to /home/jenkins/.m2/repository/org/eclipse/ease/org.eclipse.ease.lang.python.jython.test/0.8.0-SNAPSHOT/org.eclipse.ease.lang.python.jython.test-0.8.0-SNAPSHOT-p2artifacts.xml
23:07:11 [2020-11-28T04:07:11.485Z] [INFO] 
23:07:11 [2020-11-28T04:07:11.485Z] [INFO] --- tycho-p2-plugin:1.5.0:update-local-index (default-update-local-index) @ org.eclipse.ease.lang.python.jython.test ---
23:07:11 [2020-11-28T04:07:11.485Z] [INFO] 
23:07:11 [2020-11-28T04:07:11.485Z] [INFO] -----< org.eclipse.ease:org.eclipse.ease.lang.scriptarchive.test >------
23:07:11 [2020-11-28T04:07:11.485Z] [INFO] Building org.eclipse.ease.lang.scriptarchive.test 0.8.0-SNAPSHOT [44/48]
23:07:11 [2020-11-28T04:07:11.485Z] [INFO] ------------------------[ eclipse-test-plugin ]-------------------------
23:07:11 [2020-11-28T04:07:11.485Z] [INFO] 
23:07:11 [2020-11-28T04:07:11.485Z] [INFO] --- maven-clean-plugin:2.5:clean (default-clean) @ org.eclipse.ease.lang.scriptarchive.test ---
23:07:11 [2020-11-28T04:07:11.485Z] [INFO] 
23:07:11 [2020-11-28T04:07:11.486Z] [INFO] --- tycho-packaging-plugin:1.5.0:build-qualifier (default-build-qualifier) @ org.eclipse.ease.lang.scriptarchive.test ---
23:07:11 [2020-11-28T04:07:11.486Z] [INFO] The project's OSGi version is 0.8.0.I201910171213
23:07:11 [2020-11-28T04:07:11.486Z] [INFO] 
23:07:11 [2020-11-28T04:07:11.486Z] [INFO] --- tycho-packaging-plugin:1.5.0:validate-id (default-validate-id) @ org.eclipse.ease.lang.scriptarchive.test ---
23:07:11 [2020-11-28T04:07:11.486Z] [INFO] 
23:07:11 [2020-11-28T04:07:11.486Z] [INFO] --- tycho-packaging-plugin:1.5.0:validate-version (default-validate-version) @ org.eclipse.ease.lang.scriptarchive.test ---
23:07:11 [2020-11-28T04:07:11.486Z] [INFO] 
23:07:11 [2020-11-28T04:07:11.486Z] [INFO] --- maven-resources-plugin:2.4.3:resources (default-resources) @ org.eclipse.ease.lang.scriptarchive.test ---
23:07:11 [2020-11-28T04:07:11.486Z] [INFO] Using 'UTF-8' encoding to copy filtered resources.
23:07:11 [2020-11-28T04:07:11.486Z] [INFO] skip non existing resourceDirectory /home/jenkins/agent/workspace/ease.verify.core.target.luna/tests/org.eclipse.ease.lang.scriptarchive.test/src/main/resources
23:07:11 [2020-11-28T04:07:11.486Z] [INFO] 
23:07:11 [2020-11-28T04:07:11.486Z] [INFO] --- tycho-compiler-plugin:1.5.0:compile (default-compile) @ org.eclipse.ease.lang.scriptarchive.test ---
23:07:11 [2020-11-28T04:07:11.486Z] [INFO] Compiling 1 source file to /home/jenkins/agent/workspace/ease.verify.core.target.luna/tests/org.eclipse.ease.lang.scriptarchive.test/target/classes
23:07:11 [2020-11-28T04:07:11.743Z] [INFO] 
23:07:11 [2020-11-28T04:07:11.743Z] [INFO] --- maven-resources-plugin:2.4.3:testResources (default-testResources) @ org.eclipse.ease.lang.scriptarchive.test ---
23:07:11 [2020-11-28T04:07:11.743Z] [INFO] Using 'UTF-8' encoding to copy filtered resources.
23:07:11 [2020-11-28T04:07:11.743Z] [INFO] skip non existing resourceDirectory /home/jenkins/agent/workspace/ease.verify.core.target.luna/tests/org.eclipse.ease.lang.scriptarchive.test/src/test/resources
23:07:11 [2020-11-28T04:07:11.743Z] [INFO] 
23:07:11 [2020-11-28T04:07:11.743Z] [INFO] --- tycho-source-plugin:1.5.0:plugin-source (plugin-source) @ org.eclipse.ease.lang.scriptarchive.test ---
23:07:11 [2020-11-28T04:07:11.743Z] [INFO] Building jar: /home/jenkins/agent/workspace/ease.verify.core.target.luna/tests/org.eclipse.ease.lang.scriptarchive.test/target/org.eclipse.ease.lang.scriptarchive.test-0.8.0-SNAPSHOT-sources.jar
23:07:11 [2020-11-28T04:07:11.743Z] [INFO] 
23:07:11 [2020-11-28T04:07:11.743Z] [INFO] --- target-platform-configuration:1.5.0:target-platform (default-target-platform) @ org.eclipse.ease.lang.scriptarchive.test ---
23:07:11 [2020-11-28T04:07:11.743Z] [INFO] 
23:07:11 [2020-11-28T04:07:11.743Z] [INFO] --- tycho-packaging-plugin:1.5.0:package-plugin (default-package-plugin) @ org.eclipse.ease.lang.scriptarchive.test ---
23:07:11 [2020-11-28T04:07:11.743Z] [INFO] Building jar: /home/jenkins/agent/workspace/ease.verify.core.target.luna/tests/org.eclipse.ease.lang.scriptarchive.test/target/org.eclipse.ease.lang.scriptarchive.test-0.8.0-SNAPSHOT.jar
23:07:11 [2020-11-28T04:07:11.743Z] [INFO] 
23:07:11 [2020-11-28T04:07:11.743Z] [INFO] --- tycho-p2-plugin:1.5.0:p2-metadata-default (default-p2-metadata-default) @ org.eclipse.ease.lang.scriptarchive.test ---
23:07:11 [2020-11-28T04:07:11.743Z] [INFO] 
23:07:11 [2020-11-28T04:07:11.743Z] [INFO] --- tycho-source-feature-plugin:1.5.0:source-feature (source-feature) @ org.eclipse.ease.lang.scriptarchive.test ---
23:07:11 [2020-11-28T04:07:11.743Z] [INFO] 
23:07:11 [2020-11-28T04:07:11.743Z] [INFO] --- tycho-p2-plugin:1.5.0:p2-metadata (attached-p2-metadata) @ org.eclipse.ease.lang.scriptarchive.test ---
23:07:11 [2020-11-28T04:07:11.743Z] [INFO] 
23:07:11 [2020-11-28T04:07:11.743Z] [INFO] --- tycho-surefire-plugin:1.5.0:test (default-test) @ org.eclipse.ease.lang.scriptarchive.test ---
23:07:11 [2020-11-28T04:07:11.743Z] [INFO] Expected eclipse log file: /home/jenkins/agent/workspace/ease.verify.core.target.luna/tests/org.eclipse.ease.lang.scriptarchive.test/target/work/data/.metadata/.log
23:07:11 [2020-11-28T04:07:11.743Z] [INFO] Command line:
23:07:11 [2020-11-28T04:07:11.743Z] 	[/opt/tools/java/openjdk/jdk-11/11.0.2+9/bin/java, -Dosgi.noShutdown=false, -Dosgi.os=linux, -Dosgi.ws=gtk, -Dosgi.arch=x86_64, -Dosgi.clean=true, -jar, /home/jenkins/.m2/repository/p2/osgi/bundle/org.eclipse.equinox.launcher/1.5.800.v20200727-1323/org.eclipse.equinox.launcher-1.5.800.v20200727-1323.jar, -data, /home/jenkins/agent/workspace/ease.verify.core.target.luna/tests/org.eclipse.ease.lang.scriptarchive.test/target/work/data, -install, /home/jenkins/agent/workspace/ease.verify.core.target.luna/tests/org.eclipse.ease.lang.scriptarchive.test/target/work, -configuration, /home/jenkins/agent/workspace/ease.verify.core.target.luna/tests/org.eclipse.ease.lang.scriptarchive.test/target/work/configuration, -application, org.eclipse.tycho.surefire.osgibooter.headlesstest, -testproperties, /home/jenkins/agent/workspace/ease.verify.core.target.luna/tests/org.eclipse.ease.lang.scriptarchive.test/target/surefire.properties]
23:07:11 [2020-11-28T04:07:11.743Z] Picked up JAVA_TOOL_OPTIONS: -Dmaven.ext.class.path="/home/jenkins/agent/workspace/ease.verify.core.target.luna@tmp/withMavenea4e87b2/pipeline-maven-spy.jar" -Dorg.jenkinsci.plugins.pipeline.maven.reportsFolder="/home/jenkins/agent/workspace/ease.verify.core.target.luna@tmp/withMavenea4e87b2" 
23:07:13 [2020-11-28T04:07:13.681Z] Running org.eclipse.ease.lang.scriptarchive.ArchiveEngineTest
23:07:13 [2020-11-28T04:07:13.681Z] We are running from a zip file!
23:07:13 [2020-11-28T04:07:13.937Z] org.eclipse.ease.ScriptExecutionException: SyntaxError: missing ; before statement (workspace://__EASE_ScriptArchive_1/scripts/Master.js#3)
23:07:13 [2020-11-28T04:07:13.937Z] this is an error
23:07:13 [2020-11-28T04:07:13.937Z]        ^
23:07:13 [2020-11-28T04:07:13.937Z] 	at Master.js,workspace://__EASE_ScriptArchive_1/scripts/Master.js
23:07:13 [2020-11-28T04:07:13.937Z] org.eclipse.ease.ScriptExecutionException: SyntaxError: missing ; before statement (workspace://__EASE_ScriptArchive_1/scripts/Master.js#3)
23:07:13 [2020-11-28T04:07:13.937Z] this is an error
23:07:13 [2020-11-28T04:07:13.937Z]        ^
23:07:13 [2020-11-28T04:07:13.937Z] 	at Master.js,workspace://__EASE_ScriptArchive_1/scripts/Master.js
23:07:13 [2020-11-28T04:07:13.937Z] Tests run: 7, Failures: 0, Errors: 0, Skipped: 0, Time elapsed: 0.416 s - in org.eclipse.ease.lang.scriptarchive.ArchiveEngineTest
23:07:13 [2020-11-28T04:07:13.937Z] executeWithManifest(org.eclipse.ease.lang.scriptarchive.ArchiveEngineTest)  Time elapsed: 0.291 s
23:07:13 [2020-11-28T04:07:13.937Z] zipFileRegistration(org.eclipse.ease.lang.scriptarchive.ArchiveEngineTest)  Time elapsed: 0.006 s
23:07:13 [2020-11-28T04:07:13.937Z] engineIdRegistration(org.eclipse.ease.lang.scriptarchive.ArchiveEngineTest)  Time elapsed: 0 s
23:07:13 [2020-11-28T04:07:13.937Z] jarFileRegistration(org.eclipse.ease.lang.scriptarchive.ArchiveEngineTest)  Time elapsed: 0 s
23:07:13 [2020-11-28T04:07:13.937Z] sarFileRegistration(org.eclipse.ease.lang.scriptarchive.ArchiveEngineTest)  Time elapsed: 0 s
23:07:13 [2020-11-28T04:07:13.937Z] executeWithErrors(org.eclipse.ease.lang.scriptarchive.ArchiveEngineTest)  Time elapsed: 0.069 s
23:07:13 [2020-11-28T04:07:13.937Z] executeWithIncludes(org.eclipse.ease.lang.scriptarchive.ArchiveEngineTest)  Time elapsed: 0.029 s
23:07:13 [2020-11-28T04:07:13.937Z] 
23:07:13 [2020-11-28T04:07:13.937Z] Results:
23:07:13 [2020-11-28T04:07:13.937Z] 
23:07:13 [2020-11-28T04:07:13.937Z] Tests run: 7, Failures: 0, Errors: 0, Skipped: 0
23:07:13 [2020-11-28T04:07:13.937Z] 
23:07:14 [2020-11-28T04:07:14.499Z] [INFO] All tests passed!
23:07:14 [2020-11-28T04:07:14.499Z] [INFO] 
23:07:14 [2020-11-28T04:07:14.499Z] [INFO] --- maven-install-plugin:2.3.1:install (default-install) @ org.eclipse.ease.lang.scriptarchive.test ---
23:07:14 [2020-11-28T04:07:14.499Z] [INFO] Installing /home/jenkins/agent/workspace/ease.verify.core.target.luna/tests/org.eclipse.ease.lang.scriptarchive.test/target/org.eclipse.ease.lang.scriptarchive.test-0.8.0-SNAPSHOT.jar to /home/jenkins/.m2/repository/org/eclipse/ease/org.eclipse.ease.lang.scriptarchive.test/0.8.0-SNAPSHOT/org.eclipse.ease.lang.scriptarchive.test-0.8.0-SNAPSHOT.jar
23:07:14 [2020-11-28T04:07:14.499Z] [INFO] Installing /home/jenkins/agent/workspace/ease.verify.core.target.luna/tests/org.eclipse.ease.lang.scriptarchive.test/pom.xml to /home/jenkins/.m2/repository/org/eclipse/ease/org.eclipse.ease.lang.scriptarchive.test/0.8.0-SNAPSHOT/org.eclipse.ease.lang.scriptarchive.test-0.8.0-SNAPSHOT.pom
23:07:14 [2020-11-28T04:07:14.499Z] [INFO] Installing /home/jenkins/agent/workspace/ease.verify.core.target.luna/tests/org.eclipse.ease.lang.scriptarchive.test/target/org.eclipse.ease.lang.scriptarchive.test-0.8.0-SNAPSHOT-sources.jar to /home/jenkins/.m2/repository/org/eclipse/ease/org.eclipse.ease.lang.scriptarchive.test/0.8.0-SNAPSHOT/org.eclipse.ease.lang.scriptarchive.test-0.8.0-SNAPSHOT-sources.jar
23:07:14 [2020-11-28T04:07:14.499Z] [INFO] Installing /home/jenkins/agent/workspace/ease.verify.core.target.luna/tests/org.eclipse.ease.lang.scriptarchive.test/target/p2content.xml to /home/jenkins/.m2/repository/org/eclipse/ease/org.eclipse.ease.lang.scriptarchive.test/0.8.0-SNAPSHOT/org.eclipse.ease.lang.scriptarchive.test-0.8.0-SNAPSHOT-p2metadata.xml
23:07:14 [2020-11-28T04:07:14.499Z] [INFO] Installing /home/jenkins/agent/workspace/ease.verify.core.target.luna/tests/org.eclipse.ease.lang.scriptarchive.test/target/p2artifacts.xml to /home/jenkins/.m2/repository/org/eclipse/ease/org.eclipse.ease.lang.scriptarchive.test/0.8.0-SNAPSHOT/org.eclipse.ease.lang.scriptarchive.test-0.8.0-SNAPSHOT-p2artifacts.xml
23:07:14 [2020-11-28T04:07:14.499Z] [INFO] Installing /home/jenkins/agent/workspace/ease.verify.core.target.luna/tests/org.eclipse.ease.lang.scriptarchive.test/target/p2content.xml to /home/jenkins/.m2/repository/org/eclipse/ease/org.eclipse.ease.lang.scriptarchive.test/0.8.0-SNAPSHOT/org.eclipse.ease.lang.scriptarchive.test-0.8.0-SNAPSHOT-p2metadata.xml
23:07:14 [2020-11-28T04:07:14.499Z] [INFO] Installing /home/jenkins/agent/workspace/ease.verify.core.target.luna/tests/org.eclipse.ease.lang.scriptarchive.test/target/p2artifacts.xml to /home/jenkins/.m2/repository/org/eclipse/ease/org.eclipse.ease.lang.scriptarchive.test/0.8.0-SNAPSHOT/org.eclipse.ease.lang.scriptarchive.test-0.8.0-SNAPSHOT-p2artifacts.xml
23:07:14 [2020-11-28T04:07:14.499Z] [INFO] 
23:07:14 [2020-11-28T04:07:14.499Z] [INFO] --- tycho-p2-plugin:1.5.0:update-local-index (default-update-local-index) @ org.eclipse.ease.lang.scriptarchive.test ---
23:07:14 [2020-11-28T04:07:14.499Z] [INFO] 
23:07:14 [2020-11-28T04:07:14.499Z] [INFO] --------< org.eclipse.ease:org.eclipse.ease.lang.unittest.test >--------
23:07:14 [2020-11-28T04:07:14.499Z] [INFO] Building org.eclipse.ease.lang.unittest.test 0.8.0-SNAPSHOT      [45/48]
23:07:14 [2020-11-28T04:07:14.499Z] [INFO] ------------------------[ eclipse-test-plugin ]-------------------------
23:07:14 [2020-11-28T04:07:14.499Z] [INFO] 
23:07:14 [2020-11-28T04:07:14.756Z] [INFO] --- maven-clean-plugin:2.5:clean (default-clean) @ org.eclipse.ease.lang.unittest.test ---
23:07:14 [2020-11-28T04:07:14.756Z] [INFO] 
23:07:14 [2020-11-28T04:07:14.756Z] [INFO] --- tycho-packaging-plugin:1.5.0:build-qualifier (default-build-qualifier) @ org.eclipse.ease.lang.unittest.test ---
23:07:14 [2020-11-28T04:07:14.756Z] [INFO] The project's OSGi version is 0.8.0.I202009240747
23:07:14 [2020-11-28T04:07:14.756Z] [INFO] 
23:07:14 [2020-11-28T04:07:14.756Z] [INFO] --- tycho-packaging-plugin:1.5.0:validate-id (default-validate-id) @ org.eclipse.ease.lang.unittest.test ---
23:07:14 [2020-11-28T04:07:14.756Z] [INFO] 
23:07:14 [2020-11-28T04:07:14.756Z] [INFO] --- tycho-packaging-plugin:1.5.0:validate-version (default-validate-version) @ org.eclipse.ease.lang.unittest.test ---
23:07:14 [2020-11-28T04:07:14.756Z] [INFO] 
23:07:14 [2020-11-28T04:07:14.756Z] [INFO] --- maven-resources-plugin:2.4.3:resources (default-resources) @ org.eclipse.ease.lang.unittest.test ---
23:07:14 [2020-11-28T04:07:14.756Z] [INFO] Using 'UTF-8' encoding to copy filtered resources.
23:07:14 [2020-11-28T04:07:14.756Z] [INFO] skip non existing resourceDirectory /home/jenkins/agent/workspace/ease.verify.core.target.luna/tests/org.eclipse.ease.lang.unittest.test/src/main/resources
23:07:14 [2020-11-28T04:07:14.756Z] [INFO] 
23:07:14 [2020-11-28T04:07:14.756Z] [INFO] --- tycho-compiler-plugin:1.5.0:compile (default-compile) @ org.eclipse.ease.lang.unittest.test ---
23:07:14 [2020-11-28T04:07:14.756Z] [INFO] Compiling 3 source files to /home/jenkins/agent/workspace/ease.verify.core.target.luna/tests/org.eclipse.ease.lang.unittest.test/target/classes
23:07:14 [2020-11-28T04:07:14.756Z] [INFO] 
23:07:14 [2020-11-28T04:07:14.756Z] [INFO] --- maven-resources-plugin:2.4.3:testResources (default-testResources) @ org.eclipse.ease.lang.unittest.test ---
23:07:14 [2020-11-28T04:07:14.756Z] [INFO] Using 'UTF-8' encoding to copy filtered resources.
23:07:14 [2020-11-28T04:07:14.756Z] [INFO] skip non existing resourceDirectory /home/jenkins/agent/workspace/ease.verify.core.target.luna/tests/org.eclipse.ease.lang.unittest.test/src/test/resources
23:07:14 [2020-11-28T04:07:14.756Z] [INFO] 
23:07:14 [2020-11-28T04:07:14.756Z] [INFO] --- tycho-source-plugin:1.5.0:plugin-source (plugin-source) @ org.eclipse.ease.lang.unittest.test ---
23:07:14 [2020-11-28T04:07:14.756Z] [WARNING] Bundle-Name header not found in /home/jenkins/agent/workspace/ease.verify.core.target.luna/tests/org.eclipse.ease.lang.unittest.test/META-INF/MANIFEST.MF, fallback to Bundle-SymbolicName for source bundle
23:07:14 [2020-11-28T04:07:14.756Z] [WARNING] Bundle-Vendor header not found in /home/jenkins/agent/workspace/ease.verify.core.target.luna/tests/org.eclipse.ease.lang.unittest.test/META-INF/MANIFEST.MF, fallback to 'unknown' for source bundle
23:07:14 [2020-11-28T04:07:14.756Z] [INFO] Building jar: /home/jenkins/agent/workspace/ease.verify.core.target.luna/tests/org.eclipse.ease.lang.unittest.test/target/org.eclipse.ease.lang.unittest.test-0.8.0-SNAPSHOT-sources.jar
23:07:14 [2020-11-28T04:07:14.757Z] [INFO] 
23:07:14 [2020-11-28T04:07:14.757Z] [INFO] --- target-platform-configuration:1.5.0:target-platform (default-target-platform) @ org.eclipse.ease.lang.unittest.test ---
23:07:14 [2020-11-28T04:07:14.757Z] [INFO] 
23:07:14 [2020-11-28T04:07:14.757Z] [INFO] --- tycho-packaging-plugin:1.5.0:package-plugin (default-package-plugin) @ org.eclipse.ease.lang.unittest.test ---
23:07:14 [2020-11-28T04:07:14.757Z] [INFO] Building jar: /home/jenkins/agent/workspace/ease.verify.core.target.luna/tests/org.eclipse.ease.lang.unittest.test/target/org.eclipse.ease.lang.unittest.test-0.8.0-SNAPSHOT.jar
23:07:14 [2020-11-28T04:07:14.757Z] [INFO] 
23:07:14 [2020-11-28T04:07:14.757Z] [INFO] --- tycho-p2-plugin:1.5.0:p2-metadata-default (default-p2-metadata-default) @ org.eclipse.ease.lang.unittest.test ---
23:07:14 [2020-11-28T04:07:14.757Z] [INFO] 
23:07:14 [2020-11-28T04:07:14.757Z] [INFO] --- tycho-source-feature-plugin:1.5.0:source-feature (source-feature) @ org.eclipse.ease.lang.unittest.test ---
23:07:14 [2020-11-28T04:07:14.757Z] [INFO] 
23:07:14 [2020-11-28T04:07:14.757Z] [INFO] --- tycho-p2-plugin:1.5.0:p2-metadata (attached-p2-metadata) @ org.eclipse.ease.lang.unittest.test ---
23:07:14 [2020-11-28T04:07:14.757Z] [INFO] 
23:07:14 [2020-11-28T04:07:14.757Z] [INFO] --- tycho-surefire-plugin:1.5.0:test (default-test) @ org.eclipse.ease.lang.unittest.test ---
23:07:14 [2020-11-28T04:07:14.757Z] [INFO] Expected eclipse log file: /home/jenkins/agent/workspace/ease.verify.core.target.luna/tests/org.eclipse.ease.lang.unittest.test/target/work/data/.metadata/.log
23:07:14 [2020-11-28T04:07:14.757Z] [INFO] Command line:
23:07:14 [2020-11-28T04:07:14.757Z] 	[/opt/tools/java/openjdk/jdk-11/11.0.2+9/bin/java, -Dosgi.noShutdown=false, -Dosgi.os=linux, -Dosgi.ws=gtk, -Dosgi.arch=x86_64, -Dosgi.clean=true, -jar, /home/jenkins/.m2/repository/p2/osgi/bundle/org.eclipse.equinox.launcher/1.5.800.v20200727-1323/org.eclipse.equinox.launcher-1.5.800.v20200727-1323.jar, -data, /home/jenkins/agent/workspace/ease.verify.core.target.luna/tests/org.eclipse.ease.lang.unittest.test/target/work/data, -install, /home/jenkins/agent/workspace/ease.verify.core.target.luna/tests/org.eclipse.ease.lang.unittest.test/target/work, -configuration, /home/jenkins/agent/workspace/ease.verify.core.target.luna/tests/org.eclipse.ease.lang.unittest.test/target/work/configuration, -application, org.eclipse.tycho.surefire.osgibooter.headlesstest, -testproperties, /home/jenkins/agent/workspace/ease.verify.core.target.luna/tests/org.eclipse.ease.lang.unittest.test/target/surefire.properties]
23:07:14 [2020-11-28T04:07:14.757Z] Picked up JAVA_TOOL_OPTIONS: -Dmaven.ext.class.path="/home/jenkins/agent/workspace/ease.verify.core.target.luna@tmp/withMavenea4e87b2/pipeline-maven-spy.jar" -Dorg.jenkinsci.plugins.pipeline.maven.reportsFolder="/home/jenkins/agent/workspace/ease.verify.core.target.luna@tmp/withMavenea4e87b2" 
23:07:16 [2020-11-28T04:07:16.682Z] Running org.eclipse.ease.lang.unittest.ClassicJavaScriptTest
23:07:18 [2020-11-28T04:07:18.122Z] Tests run: 7, Failures: 0, Errors: 0, Skipped: 0, Time elapsed: 1.435 s - in org.eclipse.ease.lang.unittest.ClassicJavaScriptTest
23:07:18 [2020-11-28T04:07:18.122Z] folderStatus(org.eclipse.ease.lang.unittest.ClassicJavaScriptTest)  Time elapsed: 0.614 s
23:07:18 [2020-11-28T04:07:18.122Z] errorTestStatus(org.eclipse.ease.lang.unittest.ClassicJavaScriptTest)  Time elapsed: 0.141 s
23:07:18 [2020-11-28T04:07:18.122Z] failureTestStatus(org.eclipse.ease.lang.unittest.ClassicJavaScriptTest)  Time elapsed: 0.145 s
23:07:18 [2020-11-28T04:07:18.122Z] verifyOutput(org.eclipse.ease.lang.unittest.ClassicJavaScriptTest)  Time elapsed: 0.138 s
23:07:18 [2020-11-28T04:07:18.122Z] suiteStatus(org.eclipse.ease.lang.unittest.ClassicJavaScriptTest)  Time elapsed: 0.107 s
23:07:18 [2020-11-28T04:07:18.122Z] ignoreTestStatus(org.eclipse.ease.lang.unittest.ClassicJavaScriptTest)  Time elapsed: 0.113 s
23:07:18 [2020-11-28T04:07:18.122Z] passTestStatus(org.eclipse.ease.lang.unittest.ClassicJavaScriptTest)  Time elapsed: 0.1 s
23:07:18 [2020-11-28T04:07:18.122Z] Running org.eclipse.ease.lang.unittest.ModernJavaScriptTest
23:07:19 [2020-11-28T04:07:19.051Z] Tests run: 8, Failures: 0, Errors: 0, Skipped: 0, Time elapsed: 0.8 s - in org.eclipse.ease.lang.unittest.ModernJavaScriptTest
23:07:19 [2020-11-28T04:07:19.051Z] folderStatus(org.eclipse.ease.lang.unittest.ModernJavaScriptTest)  Time elapsed: 0.129 s
23:07:19 [2020-11-28T04:07:19.051Z] verifyOutput(org.eclipse.ease.lang.unittest.ModernJavaScriptTest)  Time elapsed: 0.115 s
23:07:19 [2020-11-28T04:07:19.051Z] suiteStatus(org.eclipse.ease.lang.unittest.ModernJavaScriptTest)  Time elapsed: 0.103 s
23:07:19 [2020-11-28T04:07:19.051Z] ignoreTestStatus(org.eclipse.ease.lang.unittest.ModernJavaScriptTest)  Time elapsed: 0.1 s
23:07:19 [2020-11-28T04:07:19.051Z] ignoreTestClassStatus(org.eclipse.ease.lang.unittest.ModernJavaScriptTest)  Time elapsed: 0.097 s
23:07:19 [2020-11-28T04:07:19.051Z] failureTestClassStatus(org.eclipse.ease.lang.unittest.ModernJavaScriptTest)  Time elapsed: 0.091 s
23:07:19 [2020-11-28T04:07:19.051Z] errorTestClassStatus(org.eclipse.ease.lang.unittest.ModernJavaScriptTest)  Time elapsed: 0.082 s
23:07:19 [2020-11-28T04:07:19.051Z] passTestClassStatus(org.eclipse.ease.lang.unittest.ModernJavaScriptTest)  Time elapsed: 0.082 s
23:07:19 [2020-11-28T04:07:19.051Z] 
23:07:19 [2020-11-28T04:07:19.051Z] Results:
23:07:19 [2020-11-28T04:07:19.051Z] 
23:07:19 [2020-11-28T04:07:19.051Z] Tests run: 15, Failures: 0, Errors: 0, Skipped: 0
23:07:19 [2020-11-28T04:07:19.051Z] 
23:07:19 [2020-11-28T04:07:19.614Z] [INFO] All tests passed!
23:07:19 [2020-11-28T04:07:19.614Z] [INFO] 
23:07:19 [2020-11-28T04:07:19.614Z] [INFO] --- maven-install-plugin:2.3.1:install (default-install) @ org.eclipse.ease.lang.unittest.test ---
23:07:19 [2020-11-28T04:07:19.614Z] [INFO] Installing /home/jenkins/agent/workspace/ease.verify.core.target.luna/tests/org.eclipse.ease.lang.unittest.test/target/org.eclipse.ease.lang.unittest.test-0.8.0-SNAPSHOT.jar to /home/jenkins/.m2/repository/org/eclipse/ease/org.eclipse.ease.lang.unittest.test/0.8.0-SNAPSHOT/org.eclipse.ease.lang.unittest.test-0.8.0-SNAPSHOT.jar
23:07:19 [2020-11-28T04:07:19.614Z] [INFO] Installing /home/jenkins/agent/workspace/ease.verify.core.target.luna/tests/org.eclipse.ease.lang.unittest.test/pom.xml to /home/jenkins/.m2/repository/org/eclipse/ease/org.eclipse.ease.lang.unittest.test/0.8.0-SNAPSHOT/org.eclipse.ease.lang.unittest.test-0.8.0-SNAPSHOT.pom
23:07:19 [2020-11-28T04:07:19.614Z] [INFO] Installing /home/jenkins/agent/workspace/ease.verify.core.target.luna/tests/org.eclipse.ease.lang.unittest.test/target/org.eclipse.ease.lang.unittest.test-0.8.0-SNAPSHOT-sources.jar to /home/jenkins/.m2/repository/org/eclipse/ease/org.eclipse.ease.lang.unittest.test/0.8.0-SNAPSHOT/org.eclipse.ease.lang.unittest.test-0.8.0-SNAPSHOT-sources.jar
23:07:19 [2020-11-28T04:07:19.614Z] [INFO] Installing /home/jenkins/agent/workspace/ease.verify.core.target.luna/tests/org.eclipse.ease.lang.unittest.test/target/p2content.xml to /home/jenkins/.m2/repository/org/eclipse/ease/org.eclipse.ease.lang.unittest.test/0.8.0-SNAPSHOT/org.eclipse.ease.lang.unittest.test-0.8.0-SNAPSHOT-p2metadata.xml
23:07:19 [2020-11-28T04:07:19.614Z] [INFO] Installing /home/jenkins/agent/workspace/ease.verify.core.target.luna/tests/org.eclipse.ease.lang.unittest.test/target/p2artifacts.xml to /home/jenkins/.m2/repository/org/eclipse/ease/org.eclipse.ease.lang.unittest.test/0.8.0-SNAPSHOT/org.eclipse.ease.lang.unittest.test-0.8.0-SNAPSHOT-p2artifacts.xml
23:07:19 [2020-11-28T04:07:19.614Z] [INFO] Installing /home/jenkins/agent/workspace/ease.verify.core.target.luna/tests/org.eclipse.ease.lang.unittest.test/target/p2content.xml to /home/jenkins/.m2/repository/org/eclipse/ease/org.eclipse.ease.lang.unittest.test/0.8.0-SNAPSHOT/org.eclipse.ease.lang.unittest.test-0.8.0-SNAPSHOT-p2metadata.xml
23:07:19 [2020-11-28T04:07:19.614Z] [INFO] Installing /home/jenkins/agent/workspace/ease.verify.core.target.luna/tests/org.eclipse.ease.lang.unittest.test/target/p2artifacts.xml to /home/jenkins/.m2/repository/org/eclipse/ease/org.eclipse.ease.lang.unittest.test/0.8.0-SNAPSHOT/org.eclipse.ease.lang.unittest.test-0.8.0-SNAPSHOT-p2artifacts.xml
23:07:19 [2020-11-28T04:07:19.614Z] [INFO] 
23:07:19 [2020-11-28T04:07:19.614Z] [INFO] --- tycho-p2-plugin:1.5.0:update-local-index (default-update-local-index) @ org.eclipse.ease.lang.unittest.test ---
23:07:19 [2020-11-28T04:07:19.614Z] [INFO] 
23:07:19 [2020-11-28T04:07:19.614Z] [INFO] ---------< org.eclipse.ease:org.eclipse.ease.ui.scripts.test >----------
23:07:19 [2020-11-28T04:07:19.614Z] [INFO] Building org.eclipse.ease.ui.scripts.test 0.8.0-SNAPSHOT         [46/48]
23:07:19 [2020-11-28T04:07:19.614Z] [INFO] ------------------------[ eclipse-test-plugin ]-------------------------
23:07:19 [2020-11-28T04:07:19.614Z] [INFO] 
23:07:19 [2020-11-28T04:07:19.614Z] [INFO] --- maven-clean-plugin:2.5:clean (default-clean) @ org.eclipse.ease.ui.scripts.test ---
23:07:19 [2020-11-28T04:07:19.614Z] [INFO] 
23:07:19 [2020-11-28T04:07:19.614Z] [INFO] --- tycho-packaging-plugin:1.5.0:build-qualifier (default-build-qualifier) @ org.eclipse.ease.ui.scripts.test ---
23:07:19 [2020-11-28T04:07:19.614Z] [INFO] The project's OSGi version is 0.8.0.I202009240747
23:07:19 [2020-11-28T04:07:19.614Z] [INFO] 
23:07:19 [2020-11-28T04:07:19.614Z] [INFO] --- tycho-packaging-plugin:1.5.0:validate-id (default-validate-id) @ org.eclipse.ease.ui.scripts.test ---
23:07:19 [2020-11-28T04:07:19.614Z] [INFO] 
23:07:19 [2020-11-28T04:07:19.614Z] [INFO] --- tycho-packaging-plugin:1.5.0:validate-version (default-validate-version) @ org.eclipse.ease.ui.scripts.test ---
23:07:19 [2020-11-28T04:07:19.614Z] [INFO] 
23:07:19 [2020-11-28T04:07:19.614Z] [INFO] --- maven-resources-plugin:2.4.3:resources (default-resources) @ org.eclipse.ease.ui.scripts.test ---
23:07:19 [2020-11-28T04:07:19.614Z] [INFO] Using 'UTF-8' encoding to copy filtered resources.
23:07:19 [2020-11-28T04:07:19.614Z] [INFO] skip non existing resourceDirectory /home/jenkins/agent/workspace/ease.verify.core.target.luna/tests/org.eclipse.ease.ui.scripts.test/src/main/resources
23:07:19 [2020-11-28T04:07:19.615Z] [INFO] 
23:07:19 [2020-11-28T04:07:19.615Z] [INFO] --- tycho-compiler-plugin:1.5.0:compile (default-compile) @ org.eclipse.ease.ui.scripts.test ---
23:07:19 [2020-11-28T04:07:19.615Z] [INFO] Compiling 1 source file to /home/jenkins/agent/workspace/ease.verify.core.target.luna/tests/org.eclipse.ease.ui.scripts.test/target/classes
23:07:19 [2020-11-28T04:07:19.919Z] [INFO] 
23:07:19 [2020-11-28T04:07:19.919Z] [INFO] --- maven-resources-plugin:2.4.3:testResources (default-testResources) @ org.eclipse.ease.ui.scripts.test ---
23:07:19 [2020-11-28T04:07:19.919Z] [INFO] Using 'UTF-8' encoding to copy filtered resources.
23:07:19 [2020-11-28T04:07:19.919Z] [INFO] skip non existing resourceDirectory /home/jenkins/agent/workspace/ease.verify.core.target.luna/tests/org.eclipse.ease.ui.scripts.test/src/test/resources
23:07:19 [2020-11-28T04:07:19.919Z] [INFO] 
23:07:19 [2020-11-28T04:07:19.919Z] [INFO] --- tycho-source-plugin:1.5.0:plugin-source (plugin-source) @ org.eclipse.ease.ui.scripts.test ---
23:07:19 [2020-11-28T04:07:19.919Z] [INFO] Building jar: /home/jenkins/agent/workspace/ease.verify.core.target.luna/tests/org.eclipse.ease.ui.scripts.test/target/org.eclipse.ease.ui.scripts.test-0.8.0-SNAPSHOT-sources.jar
23:07:19 [2020-11-28T04:07:19.919Z] [INFO] 
23:07:19 [2020-11-28T04:07:19.919Z] [INFO] --- target-platform-configuration:1.5.0:target-platform (default-target-platform) @ org.eclipse.ease.ui.scripts.test ---
23:07:19 [2020-11-28T04:07:19.919Z] [INFO] 
23:07:19 [2020-11-28T04:07:19.919Z] [INFO] --- tycho-packaging-plugin:1.5.0:package-plugin (default-package-plugin) @ org.eclipse.ease.ui.scripts.test ---
23:07:19 [2020-11-28T04:07:19.919Z] [INFO] Building jar: /home/jenkins/agent/workspace/ease.verify.core.target.luna/tests/org.eclipse.ease.ui.scripts.test/target/org.eclipse.ease.ui.scripts.test-0.8.0-SNAPSHOT.jar
23:07:19 [2020-11-28T04:07:19.919Z] [INFO] 
23:07:19 [2020-11-28T04:07:19.919Z] [INFO] --- tycho-p2-plugin:1.5.0:p2-metadata-default (default-p2-metadata-default) @ org.eclipse.ease.ui.scripts.test ---
23:07:19 [2020-11-28T04:07:19.919Z] [INFO] 
23:07:19 [2020-11-28T04:07:19.919Z] [INFO] --- tycho-source-feature-plugin:1.5.0:source-feature (source-feature) @ org.eclipse.ease.ui.scripts.test ---
23:07:19 [2020-11-28T04:07:19.919Z] [INFO] 
23:07:19 [2020-11-28T04:07:19.919Z] [INFO] --- tycho-p2-plugin:1.5.0:p2-metadata (attached-p2-metadata) @ org.eclipse.ease.ui.scripts.test ---
23:07:19 [2020-11-28T04:07:19.919Z] [INFO] 
23:07:19 [2020-11-28T04:07:19.919Z] [INFO] --- tycho-surefire-plugin:1.5.0:test (default-test) @ org.eclipse.ease.ui.scripts.test ---
23:07:19 [2020-11-28T04:07:19.919Z] [INFO] Expected eclipse log file: /home/jenkins/agent/workspace/ease.verify.core.target.luna/tests/org.eclipse.ease.ui.scripts.test/target/work/data/.metadata/.log
23:07:19 [2020-11-28T04:07:19.919Z] [INFO] Command line:
23:07:19 [2020-11-28T04:07:19.919Z] 	[/opt/tools/java/openjdk/jdk-11/11.0.2+9/bin/java, -Dosgi.noShutdown=false, -Dosgi.os=linux, -Dosgi.ws=gtk, -Dosgi.arch=x86_64, -Dosgi.clean=true, -jar, /home/jenkins/.m2/repository/p2/osgi/bundle/org.eclipse.equinox.launcher/1.5.800.v20200727-1323/org.eclipse.equinox.launcher-1.5.800.v20200727-1323.jar, -data, /home/jenkins/agent/workspace/ease.verify.core.target.luna/tests/org.eclipse.ease.ui.scripts.test/target/work/data, -install, /home/jenkins/agent/workspace/ease.verify.core.target.luna/tests/org.eclipse.ease.ui.scripts.test/target/work, -configuration, /home/jenkins/agent/workspace/ease.verify.core.target.luna/tests/org.eclipse.ease.ui.scripts.test/target/work/configuration, -application, org.eclipse.tycho.surefire.osgibooter.headlesstest, -testproperties, /home/jenkins/agent/workspace/ease.verify.core.target.luna/tests/org.eclipse.ease.ui.scripts.test/target/surefire.properties]
23:07:19 [2020-11-28T04:07:19.920Z] Picked up JAVA_TOOL_OPTIONS: -Dmaven.ext.class.path="/home/jenkins/agent/workspace/ease.verify.core.target.luna@tmp/withMavenea4e87b2/pipeline-maven-spy.jar" -Dorg.jenkinsci.plugins.pipeline.maven.reportsFolder="/home/jenkins/agent/workspace/ease.verify.core.target.luna@tmp/withMavenea4e87b2" 
23:07:21 [2020-11-28T04:07:21.854Z] Running org.eclipse.ease.ui.scripts.expressions.definitions.ExpressionFactoryTest
23:07:21 [2020-11-28T04:07:21.854Z] Tests run: 14, Failures: 0, Errors: 0, Skipped: 0, Time elapsed: 0.03 s - in org.eclipse.ease.ui.scripts.expressions.definitions.ExpressionFactoryTest
23:07:21 [2020-11-28T04:07:21.854Z] loadClassWithExpression  Time elapsed: 0.009 s
23:07:21 [2020-11-28T04:07:21.854Z] createWithExpression  Time elapsed: 0.001 s
23:07:21 [2020-11-28T04:07:21.854Z] createReferenceExpression  Time elapsed: 0.001 s
23:07:21 [2020-11-28T04:07:21.854Z] loadClassReferenceExpression  Time elapsed: 0.001 s
23:07:21 [2020-11-28T04:07:21.854Z] loadClassTestExpression  Time elapsed: 0.001 s
23:07:21 [2020-11-28T04:07:21.854Z] createEqualsExpression  Time elapsed: 0.001 s
23:07:21 [2020-11-28T04:07:21.854Z] loadClassCountExpression  Time elapsed: 0.001 s
23:07:21 [2020-11-28T04:07:21.854Z] loadClassOrExpression  Time elapsed: 0 s
23:07:21 [2020-11-28T04:07:21.854Z] createTestExpression  Time elapsed: 0.003 s
23:07:21 [2020-11-28T04:07:21.854Z] createOrExpression  Time elapsed: 0.001 s
23:07:21 [2020-11-28T04:07:21.854Z] loadClassAndExpression  Time elapsed: 0 s
23:07:21 [2020-11-28T04:07:21.854Z] createAndExpression  Time elapsed: 0 s
23:07:21 [2020-11-28T04:07:21.854Z] loadClassEqualsExpression  Time elapsed: 0.001 s
23:07:21 [2020-11-28T04:07:21.854Z] createCountExpression  Time elapsed: 0.001 s
23:07:21 [2020-11-28T04:07:21.854Z] 
23:07:21 [2020-11-28T04:07:21.854Z] Results:
23:07:21 [2020-11-28T04:07:21.854Z] 
23:07:21 [2020-11-28T04:07:21.854Z] Tests run: 14, Failures: 0, Errors: 0, Skipped: 0
23:07:21 [2020-11-28T04:07:21.854Z] 
23:07:22 [2020-11-28T04:07:22.420Z] [INFO] All tests passed!
23:07:22 [2020-11-28T04:07:22.420Z] [INFO] 
23:07:22 [2020-11-28T04:07:22.420Z] [INFO] --- maven-install-plugin:2.3.1:install (default-install) @ org.eclipse.ease.ui.scripts.test ---
23:07:22 [2020-11-28T04:07:22.420Z] [INFO] Installing /home/jenkins/agent/workspace/ease.verify.core.target.luna/tests/org.eclipse.ease.ui.scripts.test/target/org.eclipse.ease.ui.scripts.test-0.8.0-SNAPSHOT.jar to /home/jenkins/.m2/repository/org/eclipse/ease/org.eclipse.ease.ui.scripts.test/0.8.0-SNAPSHOT/org.eclipse.ease.ui.scripts.test-0.8.0-SNAPSHOT.jar
23:07:22 [2020-11-28T04:07:22.420Z] [INFO] Installing /home/jenkins/agent/workspace/ease.verify.core.target.luna/tests/org.eclipse.ease.ui.scripts.test/pom.xml to /home/jenkins/.m2/repository/org/eclipse/ease/org.eclipse.ease.ui.scripts.test/0.8.0-SNAPSHOT/org.eclipse.ease.ui.scripts.test-0.8.0-SNAPSHOT.pom
23:07:22 [2020-11-28T04:07:22.420Z] [INFO] Installing /home/jenkins/agent/workspace/ease.verify.core.target.luna/tests/org.eclipse.ease.ui.scripts.test/target/org.eclipse.ease.ui.scripts.test-0.8.0-SNAPSHOT-sources.jar to /home/jenkins/.m2/repository/org/eclipse/ease/org.eclipse.ease.ui.scripts.test/0.8.0-SNAPSHOT/org.eclipse.ease.ui.scripts.test-0.8.0-SNAPSHOT-sources.jar
23:07:22 [2020-11-28T04:07:22.420Z] [INFO] Installing /home/jenkins/agent/workspace/ease.verify.core.target.luna/tests/org.eclipse.ease.ui.scripts.test/target/p2content.xml to /home/jenkins/.m2/repository/org/eclipse/ease/org.eclipse.ease.ui.scripts.test/0.8.0-SNAPSHOT/org.eclipse.ease.ui.scripts.test-0.8.0-SNAPSHOT-p2metadata.xml
23:07:22 [2020-11-28T04:07:22.420Z] [INFO] Installing /home/jenkins/agent/workspace/ease.verify.core.target.luna/tests/org.eclipse.ease.ui.scripts.test/target/p2artifacts.xml to /home/jenkins/.m2/repository/org/eclipse/ease/org.eclipse.ease.ui.scripts.test/0.8.0-SNAPSHOT/org.eclipse.ease.ui.scripts.test-0.8.0-SNAPSHOT-p2artifacts.xml
23:07:22 [2020-11-28T04:07:22.420Z] [INFO] Installing /home/jenkins/agent/workspace/ease.verify.core.target.luna/tests/org.eclipse.ease.ui.scripts.test/target/p2content.xml to /home/jenkins/.m2/repository/org/eclipse/ease/org.eclipse.ease.ui.scripts.test/0.8.0-SNAPSHOT/org.eclipse.ease.ui.scripts.test-0.8.0-SNAPSHOT-p2metadata.xml
23:07:22 [2020-11-28T04:07:22.420Z] [INFO] Installing /home/jenkins/agent/workspace/ease.verify.core.target.luna/tests/org.eclipse.ease.ui.scripts.test/target/p2artifacts.xml to /home/jenkins/.m2/repository/org/eclipse/ease/org.eclipse.ease.ui.scripts.test/0.8.0-SNAPSHOT/org.eclipse.ease.ui.scripts.test-0.8.0-SNAPSHOT-p2artifacts.xml
23:07:22 [2020-11-28T04:07:22.420Z] [INFO] 
23:07:22 [2020-11-28T04:07:22.420Z] [INFO] --- tycho-p2-plugin:1.5.0:update-local-index (default-update-local-index) @ org.eclipse.ease.ui.scripts.test ---
23:07:22 [2020-11-28T04:07:22.421Z] [INFO] 
23:07:22 [2020-11-28T04:07:22.421Z] [INFO] -------------< org.eclipse.ease:org.eclipse.ease.ui.test >--------------
23:07:22 [2020-11-28T04:07:22.421Z] [INFO] Building org.eclipse.ease.ui.test 0.8.0-SNAPSHOT                 [47/48]
23:07:22 [2020-11-28T04:07:22.421Z] [INFO] ------------------------[ eclipse-test-plugin ]-------------------------
23:07:22 [2020-11-28T04:07:22.421Z] [INFO] 
23:07:22 [2020-11-28T04:07:22.421Z] [INFO] --- maven-clean-plugin:2.5:clean (default-clean) @ org.eclipse.ease.ui.test ---
23:07:22 [2020-11-28T04:07:22.421Z] [INFO] 
23:07:22 [2020-11-28T04:07:22.421Z] [INFO] --- tycho-packaging-plugin:1.5.0:build-qualifier (default-build-qualifier) @ org.eclipse.ease.ui.test ---
23:07:22 [2020-11-28T04:07:22.421Z] [INFO] The project's OSGi version is 0.8.0.I201910171213
23:07:22 [2020-11-28T04:07:22.421Z] [INFO] 
23:07:22 [2020-11-28T04:07:22.421Z] [INFO] --- tycho-packaging-plugin:1.5.0:validate-id (default-validate-id) @ org.eclipse.ease.ui.test ---
23:07:22 [2020-11-28T04:07:22.421Z] [INFO] 
23:07:22 [2020-11-28T04:07:22.421Z] [INFO] --- tycho-packaging-plugin:1.5.0:validate-version (default-validate-version) @ org.eclipse.ease.ui.test ---
23:07:22 [2020-11-28T04:07:22.421Z] [INFO] 
23:07:22 [2020-11-28T04:07:22.421Z] [INFO] --- maven-resources-plugin:2.4.3:resources (default-resources) @ org.eclipse.ease.ui.test ---
23:07:22 [2020-11-28T04:07:22.421Z] [INFO] Using 'UTF-8' encoding to copy filtered resources.
23:07:22 [2020-11-28T04:07:22.421Z] [INFO] skip non existing resourceDirectory /home/jenkins/agent/workspace/ease.verify.core.target.luna/tests/org.eclipse.ease.ui.test/src/main/resources
23:07:22 [2020-11-28T04:07:22.421Z] [INFO] 
23:07:22 [2020-11-28T04:07:22.421Z] [INFO] --- tycho-compiler-plugin:1.5.0:compile (default-compile) @ org.eclipse.ease.ui.test ---
23:07:22 [2020-11-28T04:07:22.421Z] [INFO] Compiling 6 source files to /home/jenkins/agent/workspace/ease.verify.core.target.luna/tests/org.eclipse.ease.ui.test/target/classes
23:07:22 [2020-11-28T04:07:22.421Z] [INFO] 
23:07:22 [2020-11-28T04:07:22.421Z] [INFO] --- maven-resources-plugin:2.4.3:testResources (default-testResources) @ org.eclipse.ease.ui.test ---
23:07:22 [2020-11-28T04:07:22.421Z] [INFO] Using 'UTF-8' encoding to copy filtered resources.
23:07:22 [2020-11-28T04:07:22.421Z] [INFO] skip non existing resourceDirectory /home/jenkins/agent/workspace/ease.verify.core.target.luna/tests/org.eclipse.ease.ui.test/src/test/resources
23:07:22 [2020-11-28T04:07:22.421Z] [INFO] 
23:07:22 [2020-11-28T04:07:22.421Z] [INFO] --- tycho-source-plugin:1.5.0:plugin-source (plugin-source) @ org.eclipse.ease.ui.test ---
23:07:22 [2020-11-28T04:07:22.421Z] [WARNING] Bundle-Vendor header not found in /home/jenkins/agent/workspace/ease.verify.core.target.luna/tests/org.eclipse.ease.ui.test/META-INF/MANIFEST.MF, fallback to 'unknown' for source bundle
23:07:22 [2020-11-28T04:07:22.421Z] [INFO] Building jar: /home/jenkins/agent/workspace/ease.verify.core.target.luna/tests/org.eclipse.ease.ui.test/target/org.eclipse.ease.ui.test-0.8.0-SNAPSHOT-sources.jar
23:07:22 [2020-11-28T04:07:22.421Z] [INFO] 
23:07:22 [2020-11-28T04:07:22.421Z] [INFO] --- target-platform-configuration:1.5.0:target-platform (default-target-platform) @ org.eclipse.ease.ui.test ---
23:07:22 [2020-11-28T04:07:22.421Z] [INFO] 
23:07:22 [2020-11-28T04:07:22.421Z] [INFO] --- tycho-packaging-plugin:1.5.0:package-plugin (default-package-plugin) @ org.eclipse.ease.ui.test ---
23:07:22 [2020-11-28T04:07:22.421Z] [INFO] Building jar: /home/jenkins/agent/workspace/ease.verify.core.target.luna/tests/org.eclipse.ease.ui.test/target/org.eclipse.ease.ui.test-0.8.0-SNAPSHOT.jar
23:07:22 [2020-11-28T04:07:22.421Z] [INFO] 
23:07:22 [2020-11-28T04:07:22.421Z] [INFO] --- tycho-p2-plugin:1.5.0:p2-metadata-default (default-p2-metadata-default) @ org.eclipse.ease.ui.test ---
23:07:22 [2020-11-28T04:07:22.421Z] [INFO] 
23:07:22 [2020-11-28T04:07:22.421Z] [INFO] --- tycho-source-feature-plugin:1.5.0:source-feature (source-feature) @ org.eclipse.ease.ui.test ---
23:07:22 [2020-11-28T04:07:22.421Z] [INFO] 
23:07:22 [2020-11-28T04:07:22.421Z] [INFO] --- tycho-p2-plugin:1.5.0:p2-metadata (attached-p2-metadata) @ org.eclipse.ease.ui.test ---
23:07:22 [2020-11-28T04:07:22.421Z] [INFO] 
23:07:22 [2020-11-28T04:07:22.421Z] [INFO] --- tycho-surefire-plugin:1.5.0:test (default-test) @ org.eclipse.ease.ui.test ---
23:07:22 [2020-11-28T04:07:22.718Z] [INFO] Expected eclipse log file: /home/jenkins/agent/workspace/ease.verify.core.target.luna/tests/org.eclipse.ease.ui.test/target/work/data/.metadata/.log
23:07:22 [2020-11-28T04:07:22.718Z] [INFO] Command line:
23:07:22 [2020-11-28T04:07:22.718Z] 	[/opt/tools/java/openjdk/jdk-11/11.0.2+9/bin/java, -Dosgi.noShutdown=false, -Dosgi.os=linux, -Dosgi.ws=gtk, -Dosgi.arch=x86_64, -Dosgi.clean=true, -jar, /home/jenkins/.m2/repository/p2/osgi/bundle/org.eclipse.equinox.launcher/1.5.800.v20200727-1323/org.eclipse.equinox.launcher-1.5.800.v20200727-1323.jar, -data, /home/jenkins/agent/workspace/ease.verify.core.target.luna/tests/org.eclipse.ease.ui.test/target/work/data, -install, /home/jenkins/agent/workspace/ease.verify.core.target.luna/tests/org.eclipse.ease.ui.test/target/work, -configuration, /home/jenkins/agent/workspace/ease.verify.core.target.luna/tests/org.eclipse.ease.ui.test/target/work/configuration, -application, org.eclipse.tycho.surefire.osgibooter.headlesstest, -testproperties, /home/jenkins/agent/workspace/ease.verify.core.target.luna/tests/org.eclipse.ease.ui.test/target/surefire.properties]
23:07:22 [2020-11-28T04:07:22.718Z] Picked up JAVA_TOOL_OPTIONS: -Dmaven.ext.class.path="/home/jenkins/agent/workspace/ease.verify.core.target.luna@tmp/withMavenea4e87b2/pipeline-maven-spy.jar" -Dorg.jenkinsci.plugins.pipeline.maven.reportsFolder="/home/jenkins/agent/workspace/ease.verify.core.target.luna@tmp/withMavenea4e87b2" 
23:07:24 [2020-11-28T04:07:24.640Z] Running org.eclipse.ease.ui.help.hovers.ModuleHelpTest
23:07:24 [2020-11-28T04:07:24.640Z] Tests run: 4, Failures: 0, Errors: 0, Skipped: 4, Time elapsed: 0.066 s - in org.eclipse.ease.ui.help.hovers.ModuleHelpTest
23:07:24 [2020-11-28T04:07:24.640Z] getModuleHelpLocation(org.eclipse.ease.ui.help.hovers.ModuleHelpTest) skipped
23:07:24 [2020-11-28T04:07:24.640Z] getModuleHelp(org.eclipse.ease.ui.help.hovers.ModuleHelpTest) skipped
23:07:24 [2020-11-28T04:07:24.640Z] getMethodHelp(org.eclipse.ease.ui.help.hovers.ModuleHelpTest) skipped
23:07:24 [2020-11-28T04:07:24.640Z] getConstantHelp(org.eclipse.ease.ui.help.hovers.ModuleHelpTest) skipped
23:07:24 [2020-11-28T04:07:24.640Z] Running org.eclipse.ease.ui.completions.java.provider.JavaClassCompletionsProviderTest
23:07:24 [2020-11-28T04:07:24.640Z] WARNING: An illegal reflective access operation has occurred
23:07:24 [2020-11-28T04:07:24.640Z] WARNING: Illegal reflective access by org.mockito.cglib.core.ReflectUtils$2 (file:/home/jenkins/.m2/repository/p2/osgi/bundle/org.mockito/1.9.5.v201605172210/org.mockito-1.9.5.v201605172210.jar) to method java.lang.ClassLoader.defineClass(java.lang.String,byte[],int,int,java.security.ProtectionDomain)
23:07:24 [2020-11-28T04:07:24.640Z] WARNING: Please consider reporting this to the maintainers of org.mockito.cglib.core.ReflectUtils$2
23:07:24 [2020-11-28T04:07:24.640Z] WARNING: Use --illegal-access=warn to enable warnings of further illegal reflective access operations
23:07:24 [2020-11-28T04:07:24.640Z] WARNING: All illegal access operations will be denied in a future release
23:07:31 [2020-11-28T04:07:31.179Z] Tests run: 6, Failures: 0, Errors: 0, Skipped: 0, Time elapsed: 6.201 s - in org.eclipse.ease.ui.completions.java.provider.JavaClassCompletionsProviderTest
23:07:31 [2020-11-28T04:07:31.179Z] containsPackageFileCompletion(org.eclipse.ease.ui.completions.java.provider.JavaClassCompletionsProviderTest)  Time elapsed: 0.087 s
23:07:31 [2020-11-28T04:07:31.179Z] containsGlobalFileCompletion(org.eclipse.ease.ui.completions.java.provider.JavaClassCompletionsProviderTest)  Time elapsed: 0.154 s
23:07:31 [2020-11-28T04:07:31.179Z] containsJavaLangPackageProposal(org.eclipse.ease.ui.completions.java.provider.JavaClassCompletionsProviderTest)  Time elapsed: 0.49 s
23:07:31 [2020-11-28T04:07:31.179Z] containsOrgRootPackageProposal(org.eclipse.ease.ui.completions.java.provider.JavaClassCompletionsProviderTest)  Time elapsed: 0.008 s
23:07:31 [2020-11-28T04:07:31.179Z] containsJavaRootPackageProposal(org.eclipse.ease.ui.completions.java.provider.JavaClassCompletionsProviderTest)  Time elapsed: 0.007 s
23:07:31 [2020-11-28T04:07:31.179Z] containsOrgEclipsePackageProposal(org.eclipse.ease.ui.completions.java.provider.JavaClassCompletionsProviderTest)  Time elapsed: 0.062 s
23:07:31 [2020-11-28T04:07:31.179Z] Running org.eclipse.ease.ui.completions.java.provider.JavaPackagesCompletionsProviderTest
23:07:36 [2020-11-28T04:07:36.427Z] Tests run: 4, Failures: 0, Errors: 0, Skipped: 0, Time elapsed: 5.116 s - in org.eclipse.ease.ui.completions.java.provider.JavaPackagesCompletionsProviderTest
23:07:36 [2020-11-28T04:07:36.427Z] containsJavaLangPackageProposal(org.eclipse.ease.ui.completions.java.provider.JavaPackagesCompletionsProviderTest)  Time elapsed: 0.046 s
23:07:36 [2020-11-28T04:07:36.427Z] containsOrgRootPackageProposal(org.eclipse.ease.ui.completions.java.provider.JavaPackagesCompletionsProviderTest)  Time elapsed: 0.006 s
23:07:36 [2020-11-28T04:07:36.427Z] containsJavaRootPackageProposal(org.eclipse.ease.ui.completions.java.provider.JavaPackagesCompletionsProviderTest)  Time elapsed: 0.005 s
23:07:36 [2020-11-28T04:07:36.427Z] containsOrgEclipsePackageProposal(org.eclipse.ease.ui.completions.java.provider.JavaPackagesCompletionsProviderTest)  Time elapsed: 0.052 s
23:07:36 [2020-11-28T04:07:36.427Z] Running org.eclipse.ease.ui.completion.CompletionContextTest
23:07:36 [2020-11-28T04:07:36.427Z] Tests run: 9, Failures: 0, Errors: 0, Skipped: 0, Time elapsed: 0.005 s - in org.eclipse.ease.ui.completion.CompletionContextTest
23:07:36 [2020-11-28T04:07:36.427Z] resolveStaticClass(org.eclipse.ease.ui.completion.CompletionContextTest)  Time elapsed: 0.001 s
23:07:36 [2020-11-28T04:07:36.427Z] resolveClassWithFilter(org.eclipse.ease.ui.completion.CompletionContextTest)  Time elapsed: 0.001 s
23:07:36 [2020-11-28T04:07:36.427Z] simplifyCalls(org.eclipse.ease.ui.completion.CompletionContextTest)  Time elapsed: 0 s
23:07:36 [2020-11-28T04:07:36.427Z] resolveClass(org.eclipse.ease.ui.completion.CompletionContextTest)  Time elapsed: 0 s
23:07:36 [2020-11-28T04:07:36.427Z] replaceEscapedStringLiterals(org.eclipse.ease.ui.completion.CompletionContextTest)  Time elapsed: 0 s
23:07:36 [2020-11-28T04:07:36.427Z] replaceSimpleStringLiterals(org.eclipse.ease.ui.completion.CompletionContextTest)  Time elapsed: 0 s
23:07:36 [2020-11-28T04:07:36.427Z] resolveStaticClassWithFilter(org.eclipse.ease.ui.completion.CompletionContextTest)  Time elapsed: 0 s
23:07:36 [2020-11-28T04:07:36.427Z] resolveClassWithParameters(org.eclipse.ease.ui.completion.CompletionContextTest)  Time elapsed: 0.001 s
23:07:36 [2020-11-28T04:07:36.427Z] replaceMultipleStringLiterals(org.eclipse.ease.ui.completion.CompletionContextTest)  Time elapsed: 0 s
23:07:36 [2020-11-28T04:07:36.427Z] Running org.eclipse.ease.ui.completion.provider.AbstractFileLocationCompletionProviderTest
23:07:36 [2020-11-28T04:07:36.427Z] Tests run: 8, Failures: 0, Errors: 0, Skipped: 8, Time elapsed: 0.001 s - in org.eclipse.ease.ui.completion.provider.AbstractFileLocationCompletionProviderTest
23:07:36 [2020-11-28T04:07:36.427Z] workspaceProjectProposals(org.eclipse.ease.ui.completion.provider.AbstractFileLocationCompletionProviderTest) skipped
23:07:36 [2020-11-28T04:07:36.427Z] checkOperatingSystem(org.eclipse.ease.ui.completion.provider.AbstractFileLocationCompletionProviderTest) skipped
23:07:36 [2020-11-28T04:07:36.427Z] absoluteRootWorkspaceProposals(org.eclipse.ease.ui.completion.provider.AbstractFileLocationCompletionProviderTest) skipped
23:07:36 [2020-11-28T04:07:36.427Z] workspaceFolderProposals(org.eclipse.ease.ui.completion.provider.AbstractFileLocationCompletionProviderTest) skipped
23:07:36 [2020-11-28T04:07:36.427Z] fileSystemFolderProposals(org.eclipse.ease.ui.completion.provider.AbstractFileLocationCompletionProviderTest) skipped
23:07:36 [2020-11-28T04:07:36.427Z] workspaceProposals(org.eclipse.ease.ui.completion.provider.AbstractFileLocationCompletionProviderTest) skipped
23:07:36 [2020-11-28T04:07:36.428Z] relativeRootWorkspaceProposals(org.eclipse.ease.ui.completion.provider.AbstractFileLocationCompletionProviderTest) skipped
23:07:36 [2020-11-28T04:07:36.428Z] fileSystemRootProposals(org.eclipse.ease.ui.completion.provider.AbstractFileLocationCompletionProviderTest) skipped
23:07:36 [2020-11-28T04:07:36.428Z] 
23:07:36 [2020-11-28T04:07:36.428Z] Results:
23:07:36 [2020-11-28T04:07:36.428Z] 
23:07:36 [2020-11-28T04:07:36.428Z] Tests run: 31, Failures: 0, Errors: 0, Skipped: 12
23:07:36 [2020-11-28T04:07:36.428Z] 
23:07:36 [2020-11-28T04:07:36.989Z] [INFO] All tests passed!
23:07:36 [2020-11-28T04:07:36.989Z] [INFO] 
23:07:36 [2020-11-28T04:07:36.989Z] [INFO] --- maven-install-plugin:2.3.1:install (default-install) @ org.eclipse.ease.ui.test ---
23:07:36 [2020-11-28T04:07:36.989Z] [INFO] Installing /home/jenkins/agent/workspace/ease.verify.core.target.luna/tests/org.eclipse.ease.ui.test/target/org.eclipse.ease.ui.test-0.8.0-SNAPSHOT.jar to /home/jenkins/.m2/repository/org/eclipse/ease/org.eclipse.ease.ui.test/0.8.0-SNAPSHOT/org.eclipse.ease.ui.test-0.8.0-SNAPSHOT.jar
23:07:36 [2020-11-28T04:07:36.990Z] [INFO] Installing /home/jenkins/agent/workspace/ease.verify.core.target.luna/tests/org.eclipse.ease.ui.test/pom.xml to /home/jenkins/.m2/repository/org/eclipse/ease/org.eclipse.ease.ui.test/0.8.0-SNAPSHOT/org.eclipse.ease.ui.test-0.8.0-SNAPSHOT.pom
23:07:36 [2020-11-28T04:07:36.990Z] [INFO] Installing /home/jenkins/agent/workspace/ease.verify.core.target.luna/tests/org.eclipse.ease.ui.test/target/org.eclipse.ease.ui.test-0.8.0-SNAPSHOT-sources.jar to /home/jenkins/.m2/repository/org/eclipse/ease/org.eclipse.ease.ui.test/0.8.0-SNAPSHOT/org.eclipse.ease.ui.test-0.8.0-SNAPSHOT-sources.jar
23:07:36 [2020-11-28T04:07:36.990Z] [INFO] Installing /home/jenkins/agent/workspace/ease.verify.core.target.luna/tests/org.eclipse.ease.ui.test/target/p2content.xml to /home/jenkins/.m2/repository/org/eclipse/ease/org.eclipse.ease.ui.test/0.8.0-SNAPSHOT/org.eclipse.ease.ui.test-0.8.0-SNAPSHOT-p2metadata.xml
23:07:36 [2020-11-28T04:07:36.990Z] [INFO] Installing /home/jenkins/agent/workspace/ease.verify.core.target.luna/tests/org.eclipse.ease.ui.test/target/p2artifacts.xml to /home/jenkins/.m2/repository/org/eclipse/ease/org.eclipse.ease.ui.test/0.8.0-SNAPSHOT/org.eclipse.ease.ui.test-0.8.0-SNAPSHOT-p2artifacts.xml
23:07:36 [2020-11-28T04:07:36.990Z] [INFO] Installing /home/jenkins/agent/workspace/ease.verify.core.target.luna/tests/org.eclipse.ease.ui.test/target/p2content.xml to /home/jenkins/.m2/repository/org/eclipse/ease/org.eclipse.ease.ui.test/0.8.0-SNAPSHOT/org.eclipse.ease.ui.test-0.8.0-SNAPSHOT-p2metadata.xml
23:07:36 [2020-11-28T04:07:36.990Z] [INFO] Installing /home/jenkins/agent/workspace/ease.verify.core.target.luna/tests/org.eclipse.ease.ui.test/target/p2artifacts.xml to /home/jenkins/.m2/repository/org/eclipse/ease/org.eclipse.ease.ui.test/0.8.0-SNAPSHOT/org.eclipse.ease.ui.test-0.8.0-SNAPSHOT-p2artifacts.xml
23:07:36 [2020-11-28T04:07:36.990Z] [INFO] 
23:07:36 [2020-11-28T04:07:36.990Z] [INFO] --- tycho-p2-plugin:1.5.0:update-local-index (default-update-local-index) @ org.eclipse.ease.ui.test ---
23:07:36 [2020-11-28T04:07:36.990Z] [INFO] 
23:07:36 [2020-11-28T04:07:36.990Z] [INFO] ---------------------< org.eclipse.ease:ease.core >---------------------
23:07:36 [2020-11-28T04:07:36.990Z] [INFO] Building EASE (Incubation) 0.4.0-SNAPSHOT                        [48/48]
23:07:36 [2020-11-28T04:07:36.990Z] [INFO] --------------------------------[ pom ]---------------------------------
23:07:36 [2020-11-28T04:07:36.990Z] [INFO] 
23:07:36 [2020-11-28T04:07:36.990Z] [INFO] --- maven-clean-plugin:2.5:clean (default-clean) @ ease.core ---
23:07:36 [2020-11-28T04:07:36.990Z] [INFO] 
23:07:36 [2020-11-28T04:07:36.990Z] [INFO] --- maven-install-plugin:2.4:install (default-install) @ ease.core ---
23:07:36 [2020-11-28T04:07:36.990Z] [INFO] Installing /home/jenkins/agent/workspace/ease.verify.core.target.luna/pom.xml to /home/jenkins/.m2/repository/org/eclipse/ease/ease.core/0.4.0-SNAPSHOT/ease.core-0.4.0-SNAPSHOT.pom
23:07:36 [2020-11-28T04:07:36.990Z] [INFO] ------------------------------------------------------------------------
23:07:36 [2020-11-28T04:07:36.990Z] [INFO] Reactor Summary:
23:07:36 [2020-11-28T04:07:36.990Z] [INFO] 
23:07:36 [2020-11-28T04:07:36.990Z] [INFO] org.eclipse.ease.releng 0.8.0-SNAPSHOT ............. SUCCESS [  0.895 s]
23:07:36 [2020-11-28T04:07:36.990Z] [INFO] org.eclipse.ease.classloader 0.8.0-SNAPSHOT ........ SUCCESS [  6.225 s]
23:07:36 [2020-11-28T04:07:36.990Z] [INFO] org.eclipse.ease 0.8.0-SNAPSHOT .................... SUCCESS [  1.254 s]
23:07:36 [2020-11-28T04:07:36.990Z] [INFO] org.eclipse.ease.ui 0.8.0-SNAPSHOT ................. SUCCESS [  1.199 s]
23:07:36 [2020-11-28T04:07:36.990Z] [INFO] org.eclipse.ease.ui.completions.java 0.8.0-SNAPSHOT  SUCCESS [  0.329 s]
23:07:36 [2020-11-28T04:07:36.990Z] [INFO] org.eclipse.ease.ui.scripts 0.8.0-SNAPSHOT ......... SUCCESS [  0.997 s]
23:07:36 [2020-11-28T04:07:36.990Z] [INFO] org.eclipse.ease.lang.javascript 0.8.0-SNAPSHOT .... SUCCESS [  0.287 s]
23:07:36 [2020-11-28T04:07:36.990Z] [INFO] org.eclipse.ease.lang.scriptarchive 0.8.0-SNAPSHOT . SUCCESS [  0.152 s]
23:07:36 [2020-11-28T04:07:36.990Z] [INFO] org.eclipse.ease.lang.python 0.8.0-SNAPSHOT ........ SUCCESS [  0.368 s]
23:07:36 [2020-11-28T04:07:36.990Z] [INFO] org.eclipse.ease.lang.python.py4j 0.8.0-SNAPSHOT ... SUCCESS [  0.224 s]
23:07:36 [2020-11-28T04:07:36.990Z] [INFO] org.eclipse.ease.lang.groovy 0.8.0-SNAPSHOT ........ SUCCESS [  0.263 s]
23:07:36 [2020-11-28T04:07:36.990Z] [INFO] org.eclipse.ease.lang.groovy.interpreter 0.8.0-SNAPSHOT SUCCESS [  0.209 s]
23:07:36 [2020-11-28T04:07:36.990Z] [INFO] org.eclipse.ease.lang.unittest 0.8.0-SNAPSHOT ...... SUCCESS [  0.906 s]
23:07:36 [2020-11-28T04:07:36.990Z] [INFO] org.eclipse.ease.lang.unittest.ui 0.8.0-SNAPSHOT ... SUCCESS [  0.405 s]
23:07:36 [2020-11-28T04:07:36.990Z] [INFO] org.eclipse.ease.lang.ruby 0.8.0-SNAPSHOT .......... SUCCESS [  0.270 s]
23:07:36 [2020-11-28T04:07:36.990Z] [INFO] org.eclipse.ease.lang.ruby.jruby 0.8.0-SNAPSHOT .... SUCCESS [  0.194 s]
23:07:36 [2020-11-28T04:07:36.990Z] [INFO] org.eclipse.ease.lang.javascript.nashorn 0.8.0-SNAPSHOT SUCCESS [  0.337 s]
23:07:36 [2020-11-28T04:07:36.990Z] [INFO] org.eclipse.ease.lang.javascript.rhino 0.8.0-SNAPSHOT SUCCESS [  0.375 s]
23:07:36 [2020-11-28T04:07:36.990Z] [INFO] org.eclipse.ease.lang.python.jython 0.8.0-SNAPSHOT . SUCCESS [  0.283 s]
23:07:36 [2020-11-28T04:07:36.990Z] [INFO] org.eclipse.ease.lang.javascript.ui 0.8.0-SNAPSHOT . SUCCESS [  0.243 s]
23:07:36 [2020-11-28T04:07:36.990Z] [INFO] org.eclipse.ease.lang.jvm.compiled 0.8.0-SNAPSHOT .. SUCCESS [  0.209 s]
23:07:36 [2020-11-28T04:07:36.990Z] [INFO] org.eclipse.ease.lang.scriptarchive.ui 0.8.0-SNAPSHOT SUCCESS [  0.299 s]
23:07:36 [2020-11-28T04:07:36.990Z] [INFO] org.eclipse.ease.help 0.8.0-SNAPSHOT ............... SUCCESS [  0.164 s]
23:07:36 [2020-11-28T04:07:36.991Z] [INFO] org.eclipse.ease.feature 0.8.0-SNAPSHOT ............ SUCCESS [  0.127 s]
23:07:36 [2020-11-28T04:07:36.991Z] [INFO] org.eclipse.ease.ui.feature 0.8.0-SNAPSHOT ......... SUCCESS [  0.234 s]
23:07:36 [2020-11-28T04:07:36.991Z] [INFO] org.eclipse.ease.lang.javascript.feature 0.8.0-SNAPSHOT SUCCESS [  0.070 s]
23:07:36 [2020-11-28T04:07:36.991Z] [INFO] org.eclipse.ease.lang.python.feature 0.8.0-SNAPSHOT  SUCCESS [  0.080 s]
23:07:36 [2020-11-28T04:07:36.991Z] [INFO] org.eclipse.ease.python.jython.feature 0.8.0-SNAPSHOT SUCCESS [  0.110 s]
23:07:36 [2020-11-28T04:07:36.991Z] [INFO] org.eclipse.ease.lang.python.py4j.feature 0.8.0-SNAPSHOT SUCCESS [  0.102 s]
23:07:36 [2020-11-28T04:07:36.991Z] [INFO] org.eclipse.ease.lang.jvm.feature 0.8.0-SNAPSHOT ... SUCCESS [  0.084 s]
23:07:36 [2020-11-28T04:07:36.991Z] [INFO] org.eclipse.ease.lang.groovy.feature 0.8.0-SNAPSHOT  SUCCESS [  0.084 s]
23:07:36 [2020-11-28T04:07:36.991Z] [INFO] org.eclipse.ease.lang.ruby.feature 0.8.0-SNAPSHOT .. SUCCESS [  0.093 s]
23:07:36 [2020-11-28T04:07:36.991Z] [INFO] org.eclipse.ease.lang.scriptarchive.feature 0.8.0-SNAPSHOT SUCCESS [  0.103 s]
23:07:36 [2020-11-28T04:07:36.991Z] [INFO] org.eclipse.ease.lang.unittest.feature 0.8.0-SNAPSHOT SUCCESS [  0.049 s]
23:07:36 [2020-11-28T04:07:36.991Z] [INFO] org.eclipse.ease.releng.target 0.8.0-SNAPSHOT ...... SUCCESS [  0.046 s]
23:07:36 [2020-11-28T04:07:36.991Z] [INFO] org.eclipse.ease.releng.p2 0.8.0-SNAPSHOT .......... SUCCESS [  2.834 s]
23:07:36 [2020-11-28T04:07:36.991Z] [INFO] org.eclipse.ease.testhelper 0.8.0-SNAPSHOT ......... SUCCESS [  0.206 s]
23:07:36 [2020-11-28T04:07:36.991Z] [INFO] org.eclipse.ease.test 0.8.0-SNAPSHOT ............... SUCCESS [ 16.776 s]
23:07:36 [2020-11-28T04:07:36.991Z] [INFO] org.eclipse.ease.lang.javascript.nashorn.test 0.8.0-SNAPSHOT SUCCESS [  3.349 s]
23:07:36 [2020-11-28T04:07:36.991Z] [INFO] org.eclipse.ease.lang.javascript.rhino.test 0.8.0-SNAPSHOT SUCCESS [ 15.060 s]
23:07:36 [2020-11-28T04:07:36.991Z] [INFO] org.eclipse.ease.lang.javascript.test 0.8.0-SNAPSHOT SUCCESS [  2.775 s]
23:07:36 [2020-11-28T04:07:36.991Z] [INFO] org.eclipse.ease.lang.python.test 0.8.0-SNAPSHOT ... SUCCESS [  2.451 s]
23:07:36 [2020-11-28T04:07:36.991Z] [INFO] org.eclipse.ease.lang.python.jython.test 0.8.0-SNAPSHOT SUCCESS [ 15.575 s]
23:07:36 [2020-11-28T04:07:36.991Z] [INFO] org.eclipse.ease.lang.scriptarchive.test 0.8.0-SNAPSHOT SUCCESS [  3.044 s]
23:07:36 [2020-11-28T04:07:36.991Z] [INFO] org.eclipse.ease.lang.unittest.test 0.8.0-SNAPSHOT . SUCCESS [  5.053 s]
23:07:36 [2020-11-28T04:07:36.991Z] [INFO] org.eclipse.ease.ui.scripts.test 0.8.0-SNAPSHOT .... SUCCESS [  2.688 s]
23:07:36 [2020-11-28T04:07:36.991Z] [INFO] org.eclipse.ease.ui.test 0.8.0-SNAPSHOT ............ SUCCESS [ 14.516 s]
23:07:36 [2020-11-28T04:07:36.991Z] [INFO] EASE (Incubation) 0.4.0-SNAPSHOT ................... SUCCESS [  0.165 s]
23:07:36 [2020-11-28T04:07:36.991Z] [INFO] ------------------------------------------------------------------------
23:07:36 [2020-11-28T04:07:36.991Z] [INFO] BUILD SUCCESS
23:07:36 [2020-11-28T04:07:36.991Z] [INFO] ------------------------------------------------------------------------
23:07:36 [2020-11-28T04:07:36.991Z] [INFO] Total time:  04:06 min
23:07:36 [2020-11-28T04:07:36.991Z] [INFO] Finished at: 2020-11-28T04:07:36Z
23:07:36 [2020-11-28T04:07:36.991Z] [INFO] ------------------------------------------------------------------------
23:07:36 [2020-11-28T04:07:36.991Z] [INFO] [jenkins-event-spy] Generated /home/jenkins/agent/workspace/ease.verify.core.target.luna@tmp/withMavenea4e87b2/maven-spy-20201128-040330-7249177486468937969312.log