FailedConsole Output

Skipping 618 KB.. Full Log
:1.5.0:p2-metadata (attached-p2-metadata) @ org.eclipse.ease.lang.unittest.test ---
23:07:22 [2020-10-17T03:07:22.625Z] [INFO] 
23:07:22 [2020-10-17T03:07:22.625Z] [INFO] --- tycho-surefire-plugin:1.5.0:test (default-test) @ org.eclipse.ease.lang.unittest.test ---
23:07:22 [2020-10-17T03:07:22.625Z] [INFO] Expected eclipse log file: /home/jenkins/agent/workspace/ease.verify.core.target.luna/tests/org.eclipse.ease.lang.unittest.test/target/work/data/.metadata/.log
23:07:22 [2020-10-17T03:07:22.625Z] [INFO] Command line:
23:07:22 [2020-10-17T03:07:22.625Z] 	[/opt/tools/java/openjdk/jdk-11/11.0.2+9/bin/java, -Dosgi.noShutdown=false, -Dosgi.os=linux, -Dosgi.ws=gtk, -Dosgi.arch=x86_64, -Dosgi.clean=true, -jar, /home/jenkins/.m2/repository/p2/osgi/bundle/org.eclipse.equinox.launcher/1.5.800.v20200727-1323/org.eclipse.equinox.launcher-1.5.800.v20200727-1323.jar, -data, /home/jenkins/agent/workspace/ease.verify.core.target.luna/tests/org.eclipse.ease.lang.unittest.test/target/work/data, -install, /home/jenkins/agent/workspace/ease.verify.core.target.luna/tests/org.eclipse.ease.lang.unittest.test/target/work, -configuration, /home/jenkins/agent/workspace/ease.verify.core.target.luna/tests/org.eclipse.ease.lang.unittest.test/target/work/configuration, -application, org.eclipse.tycho.surefire.osgibooter.headlesstest, -testproperties, /home/jenkins/agent/workspace/ease.verify.core.target.luna/tests/org.eclipse.ease.lang.unittest.test/target/surefire.properties]
23:07:22 [2020-10-17T03:07:22.625Z] Picked up JAVA_TOOL_OPTIONS: -Dmaven.ext.class.path="/home/jenkins/agent/workspace/ease.verify.core.target.luna@tmp/withMavenc1dd92fb/pipeline-maven-spy.jar" -Dorg.jenkinsci.plugins.pipeline.maven.reportsFolder="/home/jenkins/agent/workspace/ease.verify.core.target.luna@tmp/withMavenc1dd92fb" 
23:07:25 [2020-10-17T03:07:25.181Z] Running org.eclipse.ease.lang.unittest.ClassicJavaScriptTest
23:07:26 [2020-10-17T03:07:26.146Z] Tests run: 7, Failures: 0, Errors: 0, Skipped: 0, Time elapsed: 1.4 s - in org.eclipse.ease.lang.unittest.ClassicJavaScriptTest
23:07:26 [2020-10-17T03:07:26.146Z] folderStatus(org.eclipse.ease.lang.unittest.ClassicJavaScriptTest)  Time elapsed: 0.618 s
23:07:26 [2020-10-17T03:07:26.146Z] errorTestStatus(org.eclipse.ease.lang.unittest.ClassicJavaScriptTest)  Time elapsed: 0.175 s
23:07:26 [2020-10-17T03:07:26.146Z] failureTestStatus(org.eclipse.ease.lang.unittest.ClassicJavaScriptTest)  Time elapsed: 0.114 s
23:07:26 [2020-10-17T03:07:26.146Z] verifyOutput(org.eclipse.ease.lang.unittest.ClassicJavaScriptTest)  Time elapsed: 0.113 s
23:07:26 [2020-10-17T03:07:26.146Z] suiteStatus(org.eclipse.ease.lang.unittest.ClassicJavaScriptTest)  Time elapsed: 0.103 s
23:07:26 [2020-10-17T03:07:26.146Z] ignoreTestStatus(org.eclipse.ease.lang.unittest.ClassicJavaScriptTest)  Time elapsed: 0.102 s
23:07:26 [2020-10-17T03:07:26.146Z] passTestStatus(org.eclipse.ease.lang.unittest.ClassicJavaScriptTest)  Time elapsed: 0.103 s
23:07:26 [2020-10-17T03:07:26.146Z] Running org.eclipse.ease.lang.unittest.ModernJavaScriptTest
23:07:27 [2020-10-17T03:07:27.073Z] Tests run: 8, Failures: 0, Errors: 0, Skipped: 0, Time elapsed: 0.73 s - in org.eclipse.ease.lang.unittest.ModernJavaScriptTest
23:07:27 [2020-10-17T03:07:27.073Z] folderStatus(org.eclipse.ease.lang.unittest.ModernJavaScriptTest)  Time elapsed: 0.13 s
23:07:27 [2020-10-17T03:07:27.073Z] verifyOutput(org.eclipse.ease.lang.unittest.ModernJavaScriptTest)  Time elapsed: 0.105 s
23:07:27 [2020-10-17T03:07:27.073Z] suiteStatus(org.eclipse.ease.lang.unittest.ModernJavaScriptTest)  Time elapsed: 0.095 s
23:07:27 [2020-10-17T03:07:27.073Z] ignoreTestStatus(org.eclipse.ease.lang.unittest.ModernJavaScriptTest)  Time elapsed: 0.088 s
23:07:27 [2020-10-17T03:07:27.073Z] ignoreTestClassStatus(org.eclipse.ease.lang.unittest.ModernJavaScriptTest)  Time elapsed: 0.081 s
23:07:27 [2020-10-17T03:07:27.073Z] failureTestClassStatus(org.eclipse.ease.lang.unittest.ModernJavaScriptTest)  Time elapsed: 0.064 s
23:07:27 [2020-10-17T03:07:27.073Z] errorTestClassStatus(org.eclipse.ease.lang.unittest.ModernJavaScriptTest)  Time elapsed: 0.087 s
23:07:27 [2020-10-17T03:07:27.073Z] passTestClassStatus(org.eclipse.ease.lang.unittest.ModernJavaScriptTest)  Time elapsed: 0.078 s
23:07:27 [2020-10-17T03:07:27.074Z] 
23:07:27 [2020-10-17T03:07:27.074Z] Results:
23:07:27 [2020-10-17T03:07:27.074Z] 
23:07:27 [2020-10-17T03:07:27.074Z] Tests run: 15, Failures: 0, Errors: 0, Skipped: 0
23:07:27 [2020-10-17T03:07:27.074Z] 
23:07:27 [2020-10-17T03:07:27.635Z] [INFO] All tests passed!
23:07:27 [2020-10-17T03:07:27.635Z] [INFO] 
23:07:27 [2020-10-17T03:07:27.635Z] [INFO] --- maven-install-plugin:2.3.1:install (default-install) @ org.eclipse.ease.lang.unittest.test ---
23:07:27 [2020-10-17T03:07:27.635Z] [INFO] Installing /home/jenkins/agent/workspace/ease.verify.core.target.luna/tests/org.eclipse.ease.lang.unittest.test/target/org.eclipse.ease.lang.unittest.test-0.8.0-SNAPSHOT.jar to /home/jenkins/.m2/repository/org/eclipse/ease/org.eclipse.ease.lang.unittest.test/0.8.0-SNAPSHOT/org.eclipse.ease.lang.unittest.test-0.8.0-SNAPSHOT.jar
23:07:27 [2020-10-17T03:07:27.635Z] [INFO] Installing /home/jenkins/agent/workspace/ease.verify.core.target.luna/tests/org.eclipse.ease.lang.unittest.test/pom.xml to /home/jenkins/.m2/repository/org/eclipse/ease/org.eclipse.ease.lang.unittest.test/0.8.0-SNAPSHOT/org.eclipse.ease.lang.unittest.test-0.8.0-SNAPSHOT.pom
23:07:27 [2020-10-17T03:07:27.635Z] [INFO] Installing /home/jenkins/agent/workspace/ease.verify.core.target.luna/tests/org.eclipse.ease.lang.unittest.test/target/org.eclipse.ease.lang.unittest.test-0.8.0-SNAPSHOT-sources.jar to /home/jenkins/.m2/repository/org/eclipse/ease/org.eclipse.ease.lang.unittest.test/0.8.0-SNAPSHOT/org.eclipse.ease.lang.unittest.test-0.8.0-SNAPSHOT-sources.jar
23:07:27 [2020-10-17T03:07:27.635Z] [INFO] Installing /home/jenkins/agent/workspace/ease.verify.core.target.luna/tests/org.eclipse.ease.lang.unittest.test/target/p2content.xml to /home/jenkins/.m2/repository/org/eclipse/ease/org.eclipse.ease.lang.unittest.test/0.8.0-SNAPSHOT/org.eclipse.ease.lang.unittest.test-0.8.0-SNAPSHOT-p2metadata.xml
23:07:27 [2020-10-17T03:07:27.635Z] [INFO] Installing /home/jenkins/agent/workspace/ease.verify.core.target.luna/tests/org.eclipse.ease.lang.unittest.test/target/p2artifacts.xml to /home/jenkins/.m2/repository/org/eclipse/ease/org.eclipse.ease.lang.unittest.test/0.8.0-SNAPSHOT/org.eclipse.ease.lang.unittest.test-0.8.0-SNAPSHOT-p2artifacts.xml
23:07:27 [2020-10-17T03:07:27.635Z] [INFO] Installing /home/jenkins/agent/workspace/ease.verify.core.target.luna/tests/org.eclipse.ease.lang.unittest.test/target/p2content.xml to /home/jenkins/.m2/repository/org/eclipse/ease/org.eclipse.ease.lang.unittest.test/0.8.0-SNAPSHOT/org.eclipse.ease.lang.unittest.test-0.8.0-SNAPSHOT-p2metadata.xml
23:07:27 [2020-10-17T03:07:27.635Z] [INFO] Installing /home/jenkins/agent/workspace/ease.verify.core.target.luna/tests/org.eclipse.ease.lang.unittest.test/target/p2artifacts.xml to /home/jenkins/.m2/repository/org/eclipse/ease/org.eclipse.ease.lang.unittest.test/0.8.0-SNAPSHOT/org.eclipse.ease.lang.unittest.test-0.8.0-SNAPSHOT-p2artifacts.xml
23:07:27 [2020-10-17T03:07:27.635Z] [INFO] 
23:07:27 [2020-10-17T03:07:27.635Z] [INFO] --- tycho-p2-plugin:1.5.0:update-local-index (default-update-local-index) @ org.eclipse.ease.lang.unittest.test ---
23:07:27 [2020-10-17T03:07:27.635Z] [INFO] 
23:07:27 [2020-10-17T03:07:27.635Z] [INFO] ---------< org.eclipse.ease:org.eclipse.ease.ui.scripts.test >----------
23:07:27 [2020-10-17T03:07:27.635Z] [INFO] Building org.eclipse.ease.ui.scripts.test 0.8.0-SNAPSHOT         [46/48]
23:07:27 [2020-10-17T03:07:27.635Z] [INFO] ------------------------[ eclipse-test-plugin ]-------------------------
23:07:27 [2020-10-17T03:07:27.635Z] [INFO] 
23:07:27 [2020-10-17T03:07:27.635Z] [INFO] --- maven-clean-plugin:2.5:clean (default-clean) @ org.eclipse.ease.ui.scripts.test ---
23:07:27 [2020-10-17T03:07:27.635Z] [INFO] 
23:07:27 [2020-10-17T03:07:27.635Z] [INFO] --- tycho-packaging-plugin:1.5.0:build-qualifier (default-build-qualifier) @ org.eclipse.ease.ui.scripts.test ---
23:07:27 [2020-10-17T03:07:27.635Z] [INFO] The project's OSGi version is 0.8.0.I202009240747
23:07:27 [2020-10-17T03:07:27.635Z] [INFO] 
23:07:27 [2020-10-17T03:07:27.635Z] [INFO] --- tycho-packaging-plugin:1.5.0:validate-id (default-validate-id) @ org.eclipse.ease.ui.scripts.test ---
23:07:27 [2020-10-17T03:07:27.635Z] [INFO] 
23:07:27 [2020-10-17T03:07:27.635Z] [INFO] --- tycho-packaging-plugin:1.5.0:validate-version (default-validate-version) @ org.eclipse.ease.ui.scripts.test ---
23:07:27 [2020-10-17T03:07:27.635Z] [INFO] 
23:07:27 [2020-10-17T03:07:27.635Z] [INFO] --- maven-resources-plugin:2.4.3:resources (default-resources) @ org.eclipse.ease.ui.scripts.test ---
23:07:27 [2020-10-17T03:07:27.635Z] [INFO] Using 'UTF-8' encoding to copy filtered resources.
23:07:27 [2020-10-17T03:07:27.636Z] [INFO] skip non existing resourceDirectory /home/jenkins/agent/workspace/ease.verify.core.target.luna/tests/org.eclipse.ease.ui.scripts.test/src/main/resources
23:07:27 [2020-10-17T03:07:27.636Z] [INFO] 
23:07:27 [2020-10-17T03:07:27.636Z] [INFO] --- tycho-compiler-plugin:1.5.0:compile (default-compile) @ org.eclipse.ease.ui.scripts.test ---
23:07:27 [2020-10-17T03:07:27.636Z] [INFO] Compiling 1 source file to /home/jenkins/agent/workspace/ease.verify.core.target.luna/tests/org.eclipse.ease.ui.scripts.test/target/classes
23:07:27 [2020-10-17T03:07:27.636Z] [INFO] 
23:07:27 [2020-10-17T03:07:27.636Z] [INFO] --- maven-resources-plugin:2.4.3:testResources (default-testResources) @ org.eclipse.ease.ui.scripts.test ---
23:07:27 [2020-10-17T03:07:27.636Z] [INFO] Using 'UTF-8' encoding to copy filtered resources.
23:07:27 [2020-10-17T03:07:27.636Z] [INFO] skip non existing resourceDirectory /home/jenkins/agent/workspace/ease.verify.core.target.luna/tests/org.eclipse.ease.ui.scripts.test/src/test/resources
23:07:27 [2020-10-17T03:07:27.636Z] [INFO] 
23:07:27 [2020-10-17T03:07:27.636Z] [INFO] --- tycho-source-plugin:1.5.0:plugin-source (plugin-source) @ org.eclipse.ease.ui.scripts.test ---
23:07:27 [2020-10-17T03:07:27.636Z] [INFO] Building jar: /home/jenkins/agent/workspace/ease.verify.core.target.luna/tests/org.eclipse.ease.ui.scripts.test/target/org.eclipse.ease.ui.scripts.test-0.8.0-SNAPSHOT-sources.jar
23:07:27 [2020-10-17T03:07:27.636Z] [INFO] 
23:07:27 [2020-10-17T03:07:27.636Z] [INFO] --- target-platform-configuration:1.5.0:target-platform (default-target-platform) @ org.eclipse.ease.ui.scripts.test ---
23:07:27 [2020-10-17T03:07:27.636Z] [INFO] 
23:07:27 [2020-10-17T03:07:27.636Z] [INFO] --- tycho-packaging-plugin:1.5.0:package-plugin (default-package-plugin) @ org.eclipse.ease.ui.scripts.test ---
23:07:27 [2020-10-17T03:07:27.636Z] [INFO] Building jar: /home/jenkins/agent/workspace/ease.verify.core.target.luna/tests/org.eclipse.ease.ui.scripts.test/target/org.eclipse.ease.ui.scripts.test-0.8.0-SNAPSHOT.jar
23:07:27 [2020-10-17T03:07:27.636Z] [INFO] 
23:07:27 [2020-10-17T03:07:27.636Z] [INFO] --- tycho-p2-plugin:1.5.0:p2-metadata-default (default-p2-metadata-default) @ org.eclipse.ease.ui.scripts.test ---
23:07:27 [2020-10-17T03:07:27.636Z] [INFO] 
23:07:27 [2020-10-17T03:07:27.636Z] [INFO] --- tycho-source-feature-plugin:1.5.0:source-feature (source-feature) @ org.eclipse.ease.ui.scripts.test ---
23:07:27 [2020-10-17T03:07:27.636Z] [INFO] 
23:07:27 [2020-10-17T03:07:27.636Z] [INFO] --- tycho-p2-plugin:1.5.0:p2-metadata (attached-p2-metadata) @ org.eclipse.ease.ui.scripts.test ---
23:07:27 [2020-10-17T03:07:27.636Z] [INFO] 
23:07:27 [2020-10-17T03:07:27.636Z] [INFO] --- tycho-surefire-plugin:1.5.0:test (default-test) @ org.eclipse.ease.ui.scripts.test ---
23:07:27 [2020-10-17T03:07:27.636Z] [INFO] Expected eclipse log file: /home/jenkins/agent/workspace/ease.verify.core.target.luna/tests/org.eclipse.ease.ui.scripts.test/target/work/data/.metadata/.log
23:07:27 [2020-10-17T03:07:27.636Z] [INFO] Command line:
23:07:27 [2020-10-17T03:07:27.636Z] 	[/opt/tools/java/openjdk/jdk-11/11.0.2+9/bin/java, -Dosgi.noShutdown=false, -Dosgi.os=linux, -Dosgi.ws=gtk, -Dosgi.arch=x86_64, -Dosgi.clean=true, -jar, /home/jenkins/.m2/repository/p2/osgi/bundle/org.eclipse.equinox.launcher/1.5.800.v20200727-1323/org.eclipse.equinox.launcher-1.5.800.v20200727-1323.jar, -data, /home/jenkins/agent/workspace/ease.verify.core.target.luna/tests/org.eclipse.ease.ui.scripts.test/target/work/data, -install, /home/jenkins/agent/workspace/ease.verify.core.target.luna/tests/org.eclipse.ease.ui.scripts.test/target/work, -configuration, /home/jenkins/agent/workspace/ease.verify.core.target.luna/tests/org.eclipse.ease.ui.scripts.test/target/work/configuration, -application, org.eclipse.tycho.surefire.osgibooter.headlesstest, -testproperties, /home/jenkins/agent/workspace/ease.verify.core.target.luna/tests/org.eclipse.ease.ui.scripts.test/target/surefire.properties]
23:07:27 [2020-10-17T03:07:27.636Z] Picked up JAVA_TOOL_OPTIONS: -Dmaven.ext.class.path="/home/jenkins/agent/workspace/ease.verify.core.target.luna@tmp/withMavenc1dd92fb/pipeline-maven-spy.jar" -Dorg.jenkinsci.plugins.pipeline.maven.reportsFolder="/home/jenkins/agent/workspace/ease.verify.core.target.luna@tmp/withMavenc1dd92fb" 
23:07:29 [2020-10-17T03:07:29.541Z] Running org.eclipse.ease.ui.scripts.expressions.definitions.ExpressionFactoryTest
23:07:29 [2020-10-17T03:07:29.541Z] Tests run: 14, Failures: 0, Errors: 0, Skipped: 0, Time elapsed: 0.022 s - in org.eclipse.ease.ui.scripts.expressions.definitions.ExpressionFactoryTest
23:07:29 [2020-10-17T03:07:29.541Z] loadClassWithExpression  Time elapsed: 0.007 s
23:07:29 [2020-10-17T03:07:29.541Z] createWithExpression  Time elapsed: 0 s
23:07:29 [2020-10-17T03:07:29.541Z] createReferenceExpression  Time elapsed: 0.001 s
23:07:29 [2020-10-17T03:07:29.541Z] loadClassReferenceExpression  Time elapsed: 0.001 s
23:07:29 [2020-10-17T03:07:29.541Z] loadClassTestExpression  Time elapsed: 0 s
23:07:29 [2020-10-17T03:07:29.541Z] createEqualsExpression  Time elapsed: 0 s
23:07:29 [2020-10-17T03:07:29.541Z] loadClassCountExpression  Time elapsed: 0.001 s
23:07:29 [2020-10-17T03:07:29.541Z] loadClassOrExpression  Time elapsed: 0.001 s
23:07:29 [2020-10-17T03:07:29.541Z] createTestExpression  Time elapsed: 0.002 s
23:07:29 [2020-10-17T03:07:29.541Z] createOrExpression  Time elapsed: 0.001 s
23:07:29 [2020-10-17T03:07:29.541Z] loadClassAndExpression  Time elapsed: 0 s
23:07:29 [2020-10-17T03:07:29.541Z] createAndExpression  Time elapsed: 0.001 s
23:07:29 [2020-10-17T03:07:29.541Z] loadClassEqualsExpression  Time elapsed: 0 s
23:07:29 [2020-10-17T03:07:29.541Z] createCountExpression  Time elapsed: 0 s
23:07:29 [2020-10-17T03:07:29.541Z] 
23:07:29 [2020-10-17T03:07:29.541Z] Results:
23:07:29 [2020-10-17T03:07:29.541Z] 
23:07:29 [2020-10-17T03:07:29.541Z] Tests run: 14, Failures: 0, Errors: 0, Skipped: 0
23:07:29 [2020-10-17T03:07:29.541Z] 
23:07:30 [2020-10-17T03:07:30.102Z] [INFO] All tests passed!
23:07:30 [2020-10-17T03:07:30.102Z] [INFO] 
23:07:30 [2020-10-17T03:07:30.102Z] [INFO] --- maven-install-plugin:2.3.1:install (default-install) @ org.eclipse.ease.ui.scripts.test ---
23:07:30 [2020-10-17T03:07:30.102Z] [INFO] Installing /home/jenkins/agent/workspace/ease.verify.core.target.luna/tests/org.eclipse.ease.ui.scripts.test/target/org.eclipse.ease.ui.scripts.test-0.8.0-SNAPSHOT.jar to /home/jenkins/.m2/repository/org/eclipse/ease/org.eclipse.ease.ui.scripts.test/0.8.0-SNAPSHOT/org.eclipse.ease.ui.scripts.test-0.8.0-SNAPSHOT.jar
23:07:30 [2020-10-17T03:07:30.103Z] [INFO] Installing /home/jenkins/agent/workspace/ease.verify.core.target.luna/tests/org.eclipse.ease.ui.scripts.test/pom.xml to /home/jenkins/.m2/repository/org/eclipse/ease/org.eclipse.ease.ui.scripts.test/0.8.0-SNAPSHOT/org.eclipse.ease.ui.scripts.test-0.8.0-SNAPSHOT.pom
23:07:30 [2020-10-17T03:07:30.103Z] [INFO] Installing /home/jenkins/agent/workspace/ease.verify.core.target.luna/tests/org.eclipse.ease.ui.scripts.test/target/org.eclipse.ease.ui.scripts.test-0.8.0-SNAPSHOT-sources.jar to /home/jenkins/.m2/repository/org/eclipse/ease/org.eclipse.ease.ui.scripts.test/0.8.0-SNAPSHOT/org.eclipse.ease.ui.scripts.test-0.8.0-SNAPSHOT-sources.jar
23:07:30 [2020-10-17T03:07:30.103Z] [INFO] Installing /home/jenkins/agent/workspace/ease.verify.core.target.luna/tests/org.eclipse.ease.ui.scripts.test/target/p2content.xml to /home/jenkins/.m2/repository/org/eclipse/ease/org.eclipse.ease.ui.scripts.test/0.8.0-SNAPSHOT/org.eclipse.ease.ui.scripts.test-0.8.0-SNAPSHOT-p2metadata.xml
23:07:30 [2020-10-17T03:07:30.103Z] [INFO] Installing /home/jenkins/agent/workspace/ease.verify.core.target.luna/tests/org.eclipse.ease.ui.scripts.test/target/p2artifacts.xml to /home/jenkins/.m2/repository/org/eclipse/ease/org.eclipse.ease.ui.scripts.test/0.8.0-SNAPSHOT/org.eclipse.ease.ui.scripts.test-0.8.0-SNAPSHOT-p2artifacts.xml
23:07:30 [2020-10-17T03:07:30.103Z] [INFO] Installing /home/jenkins/agent/workspace/ease.verify.core.target.luna/tests/org.eclipse.ease.ui.scripts.test/target/p2content.xml to /home/jenkins/.m2/repository/org/eclipse/ease/org.eclipse.ease.ui.scripts.test/0.8.0-SNAPSHOT/org.eclipse.ease.ui.scripts.test-0.8.0-SNAPSHOT-p2metadata.xml
23:07:30 [2020-10-17T03:07:30.103Z] [INFO] Installing /home/jenkins/agent/workspace/ease.verify.core.target.luna/tests/org.eclipse.ease.ui.scripts.test/target/p2artifacts.xml to /home/jenkins/.m2/repository/org/eclipse/ease/org.eclipse.ease.ui.scripts.test/0.8.0-SNAPSHOT/org.eclipse.ease.ui.scripts.test-0.8.0-SNAPSHOT-p2artifacts.xml
23:07:30 [2020-10-17T03:07:30.103Z] [INFO] 
23:07:30 [2020-10-17T03:07:30.103Z] [INFO] --- tycho-p2-plugin:1.5.0:update-local-index (default-update-local-index) @ org.eclipse.ease.ui.scripts.test ---
23:07:30 [2020-10-17T03:07:30.103Z] [INFO] 
23:07:30 [2020-10-17T03:07:30.103Z] [INFO] -------------< org.eclipse.ease:org.eclipse.ease.ui.test >--------------
23:07:30 [2020-10-17T03:07:30.103Z] [INFO] Building org.eclipse.ease.ui.test 0.8.0-SNAPSHOT                 [47/48]
23:07:30 [2020-10-17T03:07:30.103Z] [INFO] ------------------------[ eclipse-test-plugin ]-------------------------
23:07:30 [2020-10-17T03:07:30.103Z] [INFO] 
23:07:30 [2020-10-17T03:07:30.103Z] [INFO] --- maven-clean-plugin:2.5:clean (default-clean) @ org.eclipse.ease.ui.test ---
23:07:30 [2020-10-17T03:07:30.103Z] [INFO] 
23:07:30 [2020-10-17T03:07:30.103Z] [INFO] --- tycho-packaging-plugin:1.5.0:build-qualifier (default-build-qualifier) @ org.eclipse.ease.ui.test ---
23:07:30 [2020-10-17T03:07:30.103Z] [INFO] The project's OSGi version is 0.8.0.I201910171213
23:07:30 [2020-10-17T03:07:30.103Z] [INFO] 
23:07:30 [2020-10-17T03:07:30.103Z] [INFO] --- tycho-packaging-plugin:1.5.0:validate-id (default-validate-id) @ org.eclipse.ease.ui.test ---
23:07:30 [2020-10-17T03:07:30.103Z] [INFO] 
23:07:30 [2020-10-17T03:07:30.103Z] [INFO] --- tycho-packaging-plugin:1.5.0:validate-version (default-validate-version) @ org.eclipse.ease.ui.test ---
23:07:30 [2020-10-17T03:07:30.103Z] [INFO] 
23:07:30 [2020-10-17T03:07:30.103Z] [INFO] --- maven-resources-plugin:2.4.3:resources (default-resources) @ org.eclipse.ease.ui.test ---
23:07:30 [2020-10-17T03:07:30.103Z] [INFO] Using 'UTF-8' encoding to copy filtered resources.
23:07:30 [2020-10-17T03:07:30.103Z] [INFO] skip non existing resourceDirectory /home/jenkins/agent/workspace/ease.verify.core.target.luna/tests/org.eclipse.ease.ui.test/src/main/resources
23:07:30 [2020-10-17T03:07:30.103Z] [INFO] 
23:07:30 [2020-10-17T03:07:30.103Z] [INFO] --- tycho-compiler-plugin:1.5.0:compile (default-compile) @ org.eclipse.ease.ui.test ---
23:07:30 [2020-10-17T03:07:30.103Z] [INFO] Compiling 6 source files to /home/jenkins/agent/workspace/ease.verify.core.target.luna/tests/org.eclipse.ease.ui.test/target/classes
23:07:30 [2020-10-17T03:07:30.359Z] [INFO] 
23:07:30 [2020-10-17T03:07:30.359Z] [INFO] --- maven-resources-plugin:2.4.3:testResources (default-testResources) @ org.eclipse.ease.ui.test ---
23:07:30 [2020-10-17T03:07:30.359Z] [INFO] Using 'UTF-8' encoding to copy filtered resources.
23:07:30 [2020-10-17T03:07:30.359Z] [INFO] skip non existing resourceDirectory /home/jenkins/agent/workspace/ease.verify.core.target.luna/tests/org.eclipse.ease.ui.test/src/test/resources
23:07:30 [2020-10-17T03:07:30.359Z] [INFO] 
23:07:30 [2020-10-17T03:07:30.359Z] [INFO] --- tycho-source-plugin:1.5.0:plugin-source (plugin-source) @ org.eclipse.ease.ui.test ---
23:07:30 [2020-10-17T03:07:30.359Z] [WARNING] Bundle-Vendor header not found in /home/jenkins/agent/workspace/ease.verify.core.target.luna/tests/org.eclipse.ease.ui.test/META-INF/MANIFEST.MF, fallback to 'unknown' for source bundle
23:07:30 [2020-10-17T03:07:30.359Z] [INFO] Building jar: /home/jenkins/agent/workspace/ease.verify.core.target.luna/tests/org.eclipse.ease.ui.test/target/org.eclipse.ease.ui.test-0.8.0-SNAPSHOT-sources.jar
23:07:30 [2020-10-17T03:07:30.359Z] [INFO] 
23:07:30 [2020-10-17T03:07:30.359Z] [INFO] --- target-platform-configuration:1.5.0:target-platform (default-target-platform) @ org.eclipse.ease.ui.test ---
23:07:30 [2020-10-17T03:07:30.359Z] [INFO] 
23:07:30 [2020-10-17T03:07:30.359Z] [INFO] --- tycho-packaging-plugin:1.5.0:package-plugin (default-package-plugin) @ org.eclipse.ease.ui.test ---
23:07:30 [2020-10-17T03:07:30.359Z] [INFO] Building jar: /home/jenkins/agent/workspace/ease.verify.core.target.luna/tests/org.eclipse.ease.ui.test/target/org.eclipse.ease.ui.test-0.8.0-SNAPSHOT.jar
23:07:30 [2020-10-17T03:07:30.359Z] [INFO] 
23:07:30 [2020-10-17T03:07:30.359Z] [INFO] --- tycho-p2-plugin:1.5.0:p2-metadata-default (default-p2-metadata-default) @ org.eclipse.ease.ui.test ---
23:07:30 [2020-10-17T03:07:30.359Z] [INFO] 
23:07:30 [2020-10-17T03:07:30.359Z] [INFO] --- tycho-source-feature-plugin:1.5.0:source-feature (source-feature) @ org.eclipse.ease.ui.test ---
23:07:30 [2020-10-17T03:07:30.359Z] [INFO] 
23:07:30 [2020-10-17T03:07:30.359Z] [INFO] --- tycho-p2-plugin:1.5.0:p2-metadata (attached-p2-metadata) @ org.eclipse.ease.ui.test ---
23:07:30 [2020-10-17T03:07:30.359Z] [INFO] 
23:07:30 [2020-10-17T03:07:30.359Z] [INFO] --- tycho-surefire-plugin:1.5.0:test (default-test) @ org.eclipse.ease.ui.test ---
23:07:30 [2020-10-17T03:07:30.359Z] [INFO] Expected eclipse log file: /home/jenkins/agent/workspace/ease.verify.core.target.luna/tests/org.eclipse.ease.ui.test/target/work/data/.metadata/.log
23:07:30 [2020-10-17T03:07:30.359Z] [INFO] Command line:
23:07:30 [2020-10-17T03:07:30.359Z] 	[/opt/tools/java/openjdk/jdk-11/11.0.2+9/bin/java, -Dosgi.noShutdown=false, -Dosgi.os=linux, -Dosgi.ws=gtk, -Dosgi.arch=x86_64, -Dosgi.clean=true, -jar, /home/jenkins/.m2/repository/p2/osgi/bundle/org.eclipse.equinox.launcher/1.5.800.v20200727-1323/org.eclipse.equinox.launcher-1.5.800.v20200727-1323.jar, -data, /home/jenkins/agent/workspace/ease.verify.core.target.luna/tests/org.eclipse.ease.ui.test/target/work/data, -install, /home/jenkins/agent/workspace/ease.verify.core.target.luna/tests/org.eclipse.ease.ui.test/target/work, -configuration, /home/jenkins/agent/workspace/ease.verify.core.target.luna/tests/org.eclipse.ease.ui.test/target/work/configuration, -application, org.eclipse.tycho.surefire.osgibooter.headlesstest, -testproperties, /home/jenkins/agent/workspace/ease.verify.core.target.luna/tests/org.eclipse.ease.ui.test/target/surefire.properties]
23:07:30 [2020-10-17T03:07:30.359Z] Picked up JAVA_TOOL_OPTIONS: -Dmaven.ext.class.path="/home/jenkins/agent/workspace/ease.verify.core.target.luna@tmp/withMavenc1dd92fb/pipeline-maven-spy.jar" -Dorg.jenkinsci.plugins.pipeline.maven.reportsFolder="/home/jenkins/agent/workspace/ease.verify.core.target.luna@tmp/withMavenc1dd92fb" 
23:07:32 [2020-10-17T03:07:32.264Z] Running org.eclipse.ease.ui.help.hovers.ModuleHelpTest
23:07:32 [2020-10-17T03:07:32.264Z] Tests run: 4, Failures: 0, Errors: 0, Skipped: 4, Time elapsed: 0.02 s - in org.eclipse.ease.ui.help.hovers.ModuleHelpTest
23:07:32 [2020-10-17T03:07:32.264Z] getModuleHelpLocation(org.eclipse.ease.ui.help.hovers.ModuleHelpTest) skipped
23:07:32 [2020-10-17T03:07:32.264Z] getModuleHelp(org.eclipse.ease.ui.help.hovers.ModuleHelpTest) skipped
23:07:32 [2020-10-17T03:07:32.264Z] getMethodHelp(org.eclipse.ease.ui.help.hovers.ModuleHelpTest) skipped
23:07:32 [2020-10-17T03:07:32.264Z] getConstantHelp(org.eclipse.ease.ui.help.hovers.ModuleHelpTest) skipped
23:07:32 [2020-10-17T03:07:32.264Z] Running org.eclipse.ease.ui.completions.java.provider.JavaClassCompletionsProviderTest
23:07:32 [2020-10-17T03:07:32.264Z] WARNING: An illegal reflective access operation has occurred
23:07:32 [2020-10-17T03:07:32.264Z] WARNING: Illegal reflective access by org.mockito.cglib.core.ReflectUtils$2 (file:/home/jenkins/.m2/repository/p2/osgi/bundle/org.mockito/1.9.5.v201605172210/org.mockito-1.9.5.v201605172210.jar) to method java.lang.ClassLoader.defineClass(java.lang.String,byte[],int,int,java.security.ProtectionDomain)
23:07:32 [2020-10-17T03:07:32.264Z] WARNING: Please consider reporting this to the maintainers of org.mockito.cglib.core.ReflectUtils$2
23:07:32 [2020-10-17T03:07:32.264Z] WARNING: Use --illegal-access=warn to enable warnings of further illegal reflective access operations
23:07:32 [2020-10-17T03:07:32.264Z] WARNING: All illegal access operations will be denied in a future release
23:07:40 [2020-10-17T03:07:40.827Z] Tests run: 6, Failures: 0, Errors: 0, Skipped: 0, Time elapsed: 7.459 s - in org.eclipse.ease.ui.completions.java.provider.JavaClassCompletionsProviderTest
23:07:40 [2020-10-17T03:07:40.827Z] containsPackageFileCompletion(org.eclipse.ease.ui.completions.java.provider.JavaClassCompletionsProviderTest)  Time elapsed: 0.092 s
23:07:40 [2020-10-17T03:07:40.827Z] containsGlobalFileCompletion(org.eclipse.ease.ui.completions.java.provider.JavaClassCompletionsProviderTest)  Time elapsed: 0.252 s
23:07:40 [2020-10-17T03:07:40.827Z] containsJavaLangPackageProposal(org.eclipse.ease.ui.completions.java.provider.JavaClassCompletionsProviderTest)  Time elapsed: 1.274 s
23:07:40 [2020-10-17T03:07:40.827Z] containsOrgRootPackageProposal(org.eclipse.ease.ui.completions.java.provider.JavaClassCompletionsProviderTest)  Time elapsed: 0.068 s
23:07:40 [2020-10-17T03:07:40.827Z] containsJavaRootPackageProposal(org.eclipse.ease.ui.completions.java.provider.JavaClassCompletionsProviderTest)  Time elapsed: 0.074 s
23:07:40 [2020-10-17T03:07:40.827Z] containsOrgEclipsePackageProposal(org.eclipse.ease.ui.completions.java.provider.JavaClassCompletionsProviderTest)  Time elapsed: 0.309 s
23:07:40 [2020-10-17T03:07:40.827Z] Running org.eclipse.ease.ui.completions.java.provider.JavaPackagesCompletionsProviderTest
23:07:44 [2020-10-17T03:07:44.993Z] Tests run: 4, Failures: 0, Errors: 0, Skipped: 0, Time elapsed: 5.121 s - in org.eclipse.ease.ui.completions.java.provider.JavaPackagesCompletionsProviderTest
23:07:44 [2020-10-17T03:07:44.993Z] containsJavaLangPackageProposal(org.eclipse.ease.ui.completions.java.provider.JavaPackagesCompletionsProviderTest)  Time elapsed: 0.049 s
23:07:44 [2020-10-17T03:07:44.993Z] containsOrgRootPackageProposal(org.eclipse.ease.ui.completions.java.provider.JavaPackagesCompletionsProviderTest)  Time elapsed: 0.006 s
23:07:44 [2020-10-17T03:07:44.993Z] containsJavaRootPackageProposal(org.eclipse.ease.ui.completions.java.provider.JavaPackagesCompletionsProviderTest)  Time elapsed: 0.006 s
23:07:44 [2020-10-17T03:07:44.993Z] containsOrgEclipsePackageProposal(org.eclipse.ease.ui.completions.java.provider.JavaPackagesCompletionsProviderTest)  Time elapsed: 0.051 s
23:07:44 [2020-10-17T03:07:44.993Z] Running org.eclipse.ease.ui.completion.CompletionContextTest
23:07:44 [2020-10-17T03:07:44.993Z] Tests run: 9, Failures: 0, Errors: 0, Skipped: 0, Time elapsed: 0.005 s - in org.eclipse.ease.ui.completion.CompletionContextTest
23:07:44 [2020-10-17T03:07:44.993Z] resolveStaticClass(org.eclipse.ease.ui.completion.CompletionContextTest)  Time elapsed: 0.002 s
23:07:44 [2020-10-17T03:07:44.993Z] resolveClassWithFilter(org.eclipse.ease.ui.completion.CompletionContextTest)  Time elapsed: 0.001 s
23:07:44 [2020-10-17T03:07:44.993Z] simplifyCalls(org.eclipse.ease.ui.completion.CompletionContextTest)  Time elapsed: 0 s
23:07:44 [2020-10-17T03:07:44.993Z] resolveClass(org.eclipse.ease.ui.completion.CompletionContextTest)  Time elapsed: 0 s
23:07:44 [2020-10-17T03:07:44.993Z] replaceEscapedStringLiterals(org.eclipse.ease.ui.completion.CompletionContextTest)  Time elapsed: 0 s
23:07:44 [2020-10-17T03:07:44.993Z] replaceSimpleStringLiterals(org.eclipse.ease.ui.completion.CompletionContextTest)  Time elapsed: 0 s
23:07:44 [2020-10-17T03:07:44.993Z] resolveStaticClassWithFilter(org.eclipse.ease.ui.completion.CompletionContextTest)  Time elapsed: 0 s
23:07:44 [2020-10-17T03:07:44.993Z] resolveClassWithParameters(org.eclipse.ease.ui.completion.CompletionContextTest)  Time elapsed: 0.001 s
23:07:44 [2020-10-17T03:07:44.993Z] replaceMultipleStringLiterals(org.eclipse.ease.ui.completion.CompletionContextTest)  Time elapsed: 0 s
23:07:44 [2020-10-17T03:07:44.993Z] Running org.eclipse.ease.ui.completion.provider.AbstractFileLocationCompletionProviderTest
23:07:44 [2020-10-17T03:07:44.993Z] Tests run: 8, Failures: 0, Errors: 0, Skipped: 8, Time elapsed: 0.002 s - in org.eclipse.ease.ui.completion.provider.AbstractFileLocationCompletionProviderTest
23:07:44 [2020-10-17T03:07:44.993Z] workspaceProjectProposals(org.eclipse.ease.ui.completion.provider.AbstractFileLocationCompletionProviderTest) skipped
23:07:44 [2020-10-17T03:07:44.994Z] checkOperatingSystem(org.eclipse.ease.ui.completion.provider.AbstractFileLocationCompletionProviderTest) skipped
23:07:44 [2020-10-17T03:07:44.994Z] absoluteRootWorkspaceProposals(org.eclipse.ease.ui.completion.provider.AbstractFileLocationCompletionProviderTest) skipped
23:07:44 [2020-10-17T03:07:44.994Z] workspaceFolderProposals(org.eclipse.ease.ui.completion.provider.AbstractFileLocationCompletionProviderTest) skipped
23:07:44 [2020-10-17T03:07:44.994Z] fileSystemFolderProposals(org.eclipse.ease.ui.completion.provider.AbstractFileLocationCompletionProviderTest) skipped
23:07:44 [2020-10-17T03:07:44.994Z] workspaceProposals(org.eclipse.ease.ui.completion.provider.AbstractFileLocationCompletionProviderTest) skipped
23:07:44 [2020-10-17T03:07:44.994Z] relativeRootWorkspaceProposals(org.eclipse.ease.ui.completion.provider.AbstractFileLocationCompletionProviderTest) skipped
23:07:44 [2020-10-17T03:07:44.994Z] fileSystemRootProposals(org.eclipse.ease.ui.completion.provider.AbstractFileLocationCompletionProviderTest) skipped
23:07:44 [2020-10-17T03:07:44.994Z] 
23:07:44 [2020-10-17T03:07:44.994Z] Results:
23:07:44 [2020-10-17T03:07:44.994Z] 
23:07:44 [2020-10-17T03:07:44.994Z] Tests run: 31, Failures: 0, Errors: 0, Skipped: 12
23:07:44 [2020-10-17T03:07:44.994Z] 
23:07:45 [2020-10-17T03:07:45.921Z] [INFO] All tests passed!
23:07:45 [2020-10-17T03:07:45.921Z] [INFO] 
23:07:45 [2020-10-17T03:07:45.921Z] [INFO] --- maven-install-plugin:2.3.1:install (default-install) @ org.eclipse.ease.ui.test ---
23:07:45 [2020-10-17T03:07:45.921Z] [INFO] Installing /home/jenkins/agent/workspace/ease.verify.core.target.luna/tests/org.eclipse.ease.ui.test/target/org.eclipse.ease.ui.test-0.8.0-SNAPSHOT.jar to /home/jenkins/.m2/repository/org/eclipse/ease/org.eclipse.ease.ui.test/0.8.0-SNAPSHOT/org.eclipse.ease.ui.test-0.8.0-SNAPSHOT.jar
23:07:45 [2020-10-17T03:07:45.921Z] [INFO] Installing /home/jenkins/agent/workspace/ease.verify.core.target.luna/tests/org.eclipse.ease.ui.test/pom.xml to /home/jenkins/.m2/repository/org/eclipse/ease/org.eclipse.ease.ui.test/0.8.0-SNAPSHOT/org.eclipse.ease.ui.test-0.8.0-SNAPSHOT.pom
23:07:45 [2020-10-17T03:07:45.921Z] [INFO] Installing /home/jenkins/agent/workspace/ease.verify.core.target.luna/tests/org.eclipse.ease.ui.test/target/org.eclipse.ease.ui.test-0.8.0-SNAPSHOT-sources.jar to /home/jenkins/.m2/repository/org/eclipse/ease/org.eclipse.ease.ui.test/0.8.0-SNAPSHOT/org.eclipse.ease.ui.test-0.8.0-SNAPSHOT-sources.jar
23:07:45 [2020-10-17T03:07:45.921Z] [INFO] Installing /home/jenkins/agent/workspace/ease.verify.core.target.luna/tests/org.eclipse.ease.ui.test/target/p2content.xml to /home/jenkins/.m2/repository/org/eclipse/ease/org.eclipse.ease.ui.test/0.8.0-SNAPSHOT/org.eclipse.ease.ui.test-0.8.0-SNAPSHOT-p2metadata.xml
23:07:45 [2020-10-17T03:07:45.921Z] [INFO] Installing /home/jenkins/agent/workspace/ease.verify.core.target.luna/tests/org.eclipse.ease.ui.test/target/p2artifacts.xml to /home/jenkins/.m2/repository/org/eclipse/ease/org.eclipse.ease.ui.test/0.8.0-SNAPSHOT/org.eclipse.ease.ui.test-0.8.0-SNAPSHOT-p2artifacts.xml
23:07:45 [2020-10-17T03:07:45.921Z] [INFO] Installing /home/jenkins/agent/workspace/ease.verify.core.target.luna/tests/org.eclipse.ease.ui.test/target/p2content.xml to /home/jenkins/.m2/repository/org/eclipse/ease/org.eclipse.ease.ui.test/0.8.0-SNAPSHOT/org.eclipse.ease.ui.test-0.8.0-SNAPSHOT-p2metadata.xml
23:07:45 [2020-10-17T03:07:45.921Z] [INFO] Installing /home/jenkins/agent/workspace/ease.verify.core.target.luna/tests/org.eclipse.ease.ui.test/target/p2artifacts.xml to /home/jenkins/.m2/repository/org/eclipse/ease/org.eclipse.ease.ui.test/0.8.0-SNAPSHOT/org.eclipse.ease.ui.test-0.8.0-SNAPSHOT-p2artifacts.xml
23:07:45 [2020-10-17T03:07:45.921Z] [INFO] 
23:07:45 [2020-10-17T03:07:45.921Z] [INFO] --- tycho-p2-plugin:1.5.0:update-local-index (default-update-local-index) @ org.eclipse.ease.ui.test ---
23:07:45 [2020-10-17T03:07:45.921Z] [INFO] 
23:07:45 [2020-10-17T03:07:45.921Z] [INFO] ---------------------< org.eclipse.ease:ease.core >---------------------
23:07:45 [2020-10-17T03:07:45.921Z] [INFO] Building EASE (Incubation) 0.4.0-SNAPSHOT                        [48/48]
23:07:45 [2020-10-17T03:07:45.921Z] [INFO] --------------------------------[ pom ]---------------------------------
23:07:45 [2020-10-17T03:07:45.921Z] [INFO] 
23:07:45 [2020-10-17T03:07:45.921Z] [INFO] --- maven-clean-plugin:2.5:clean (default-clean) @ ease.core ---
23:07:45 [2020-10-17T03:07:45.921Z] [INFO] 
23:07:45 [2020-10-17T03:07:45.921Z] [INFO] --- maven-install-plugin:2.4:install (default-install) @ ease.core ---
23:07:46 [2020-10-17T03:07:46.177Z] [INFO] Installing /home/jenkins/agent/workspace/ease.verify.core.target.luna/pom.xml to /home/jenkins/.m2/repository/org/eclipse/ease/ease.core/0.4.0-SNAPSHOT/ease.core-0.4.0-SNAPSHOT.pom
23:07:46 [2020-10-17T03:07:46.177Z] [INFO] ------------------------------------------------------------------------
23:07:46 [2020-10-17T03:07:46.177Z] [INFO] Reactor Summary:
23:07:46 [2020-10-17T03:07:46.177Z] [INFO] 
23:07:46 [2020-10-17T03:07:46.177Z] [INFO] org.eclipse.ease.releng 0.8.0-SNAPSHOT ............. SUCCESS [  1.063 s]
23:07:46 [2020-10-17T03:07:46.177Z] [INFO] org.eclipse.ease.classloader 0.8.0-SNAPSHOT ........ SUCCESS [  5.795 s]
23:07:46 [2020-10-17T03:07:46.177Z] [INFO] org.eclipse.ease 0.8.0-SNAPSHOT .................... SUCCESS [  1.372 s]
23:07:46 [2020-10-17T03:07:46.177Z] [INFO] org.eclipse.ease.ui 0.8.0-SNAPSHOT ................. SUCCESS [  1.301 s]
23:07:46 [2020-10-17T03:07:46.177Z] [INFO] org.eclipse.ease.ui.completions.java 0.8.0-SNAPSHOT  SUCCESS [  0.395 s]
23:07:46 [2020-10-17T03:07:46.177Z] [INFO] org.eclipse.ease.ui.scripts 0.8.0-SNAPSHOT ......... SUCCESS [  0.922 s]
23:07:46 [2020-10-17T03:07:46.177Z] [INFO] org.eclipse.ease.lang.javascript 0.8.0-SNAPSHOT .... SUCCESS [  0.296 s]
23:07:46 [2020-10-17T03:07:46.177Z] [INFO] org.eclipse.ease.lang.scriptarchive 0.8.0-SNAPSHOT . SUCCESS [  0.150 s]
23:07:46 [2020-10-17T03:07:46.177Z] [INFO] org.eclipse.ease.lang.python 0.8.0-SNAPSHOT ........ SUCCESS [  0.372 s]
23:07:46 [2020-10-17T03:07:46.177Z] [INFO] org.eclipse.ease.lang.python.py4j 0.8.0-SNAPSHOT ... SUCCESS [  0.288 s]
23:07:46 [2020-10-17T03:07:46.177Z] [INFO] org.eclipse.ease.lang.groovy 0.8.0-SNAPSHOT ........ SUCCESS [  0.221 s]
23:07:46 [2020-10-17T03:07:46.177Z] [INFO] org.eclipse.ease.lang.groovy.interpreter 0.8.0-SNAPSHOT SUCCESS [  0.256 s]
23:07:46 [2020-10-17T03:07:46.177Z] [INFO] org.eclipse.ease.lang.unittest 0.8.0-SNAPSHOT ...... SUCCESS [  0.601 s]
23:07:46 [2020-10-17T03:07:46.177Z] [INFO] org.eclipse.ease.lang.unittest.ui 0.8.0-SNAPSHOT ... SUCCESS [  0.523 s]
23:07:46 [2020-10-17T03:07:46.177Z] [INFO] org.eclipse.ease.lang.ruby 0.8.0-SNAPSHOT .......... SUCCESS [  0.214 s]
23:07:46 [2020-10-17T03:07:46.177Z] [INFO] org.eclipse.ease.lang.ruby.jruby 0.8.0-SNAPSHOT .... SUCCESS [  0.202 s]
23:07:46 [2020-10-17T03:07:46.177Z] [INFO] org.eclipse.ease.lang.javascript.nashorn 0.8.0-SNAPSHOT SUCCESS [  0.319 s]
23:07:46 [2020-10-17T03:07:46.177Z] [INFO] org.eclipse.ease.lang.javascript.rhino 0.8.0-SNAPSHOT SUCCESS [  0.387 s]
23:07:46 [2020-10-17T03:07:46.177Z] [INFO] org.eclipse.ease.lang.python.jython 0.8.0-SNAPSHOT . SUCCESS [  0.296 s]
23:07:46 [2020-10-17T03:07:46.177Z] [INFO] org.eclipse.ease.lang.javascript.ui 0.8.0-SNAPSHOT . SUCCESS [  0.278 s]
23:07:46 [2020-10-17T03:07:46.177Z] [INFO] org.eclipse.ease.lang.jvm.compiled 0.8.0-SNAPSHOT .. SUCCESS [  0.211 s]
23:07:46 [2020-10-17T03:07:46.177Z] [INFO] org.eclipse.ease.lang.scriptarchive.ui 0.8.0-SNAPSHOT SUCCESS [  0.284 s]
23:07:46 [2020-10-17T03:07:46.177Z] [INFO] org.eclipse.ease.help 0.8.0-SNAPSHOT ............... SUCCESS [  0.128 s]
23:07:46 [2020-10-17T03:07:46.177Z] [INFO] org.eclipse.ease.feature 0.8.0-SNAPSHOT ............ SUCCESS [  0.178 s]
23:07:46 [2020-10-17T03:07:46.177Z] [INFO] org.eclipse.ease.ui.feature 0.8.0-SNAPSHOT ......... SUCCESS [  0.272 s]
23:07:46 [2020-10-17T03:07:46.177Z] [INFO] org.eclipse.ease.lang.javascript.feature 0.8.0-SNAPSHOT SUCCESS [  0.065 s]
23:07:46 [2020-10-17T03:07:46.177Z] [INFO] org.eclipse.ease.lang.python.feature 0.8.0-SNAPSHOT  SUCCESS [  0.078 s]
23:07:46 [2020-10-17T03:07:46.177Z] [INFO] org.eclipse.ease.python.jython.feature 0.8.0-SNAPSHOT SUCCESS [  0.164 s]
23:07:46 [2020-10-17T03:07:46.177Z] [INFO] org.eclipse.ease.lang.python.py4j.feature 0.8.0-SNAPSHOT SUCCESS [  0.104 s]
23:07:46 [2020-10-17T03:07:46.177Z] [INFO] org.eclipse.ease.lang.jvm.feature 0.8.0-SNAPSHOT ... SUCCESS [  0.100 s]
23:07:46 [2020-10-17T03:07:46.177Z] [INFO] org.eclipse.ease.lang.groovy.feature 0.8.0-SNAPSHOT  SUCCESS [  0.055 s]
23:07:46 [2020-10-17T03:07:46.177Z] [INFO] org.eclipse.ease.lang.ruby.feature 0.8.0-SNAPSHOT .. SUCCESS [  0.072 s]
23:07:46 [2020-10-17T03:07:46.177Z] [INFO] org.eclipse.ease.lang.scriptarchive.feature 0.8.0-SNAPSHOT SUCCESS [  0.109 s]
23:07:46 [2020-10-17T03:07:46.177Z] [INFO] org.eclipse.ease.lang.unittest.feature 0.8.0-SNAPSHOT SUCCESS [  0.103 s]
23:07:46 [2020-10-17T03:07:46.177Z] [INFO] org.eclipse.ease.releng.target 0.8.0-SNAPSHOT ...... SUCCESS [  0.047 s]
23:07:46 [2020-10-17T03:07:46.177Z] [INFO] org.eclipse.ease.releng.p2 0.8.0-SNAPSHOT .......... SUCCESS [  3.100 s]
23:07:46 [2020-10-17T03:07:46.177Z] [INFO] org.eclipse.ease.testhelper 0.8.0-SNAPSHOT ......... SUCCESS [  0.209 s]
23:07:46 [2020-10-17T03:07:46.177Z] [INFO] org.eclipse.ease.test 0.8.0-SNAPSHOT ............... SUCCESS [ 15.827 s]
23:07:46 [2020-10-17T03:07:46.177Z] [INFO] org.eclipse.ease.lang.javascript.nashorn.test 0.8.0-SNAPSHOT SUCCESS [  3.739 s]
23:07:46 [2020-10-17T03:07:46.177Z] [INFO] org.eclipse.ease.lang.javascript.rhino.test 0.8.0-SNAPSHOT SUCCESS [ 14.624 s]
23:07:46 [2020-10-17T03:07:46.178Z] [INFO] org.eclipse.ease.lang.javascript.test 0.8.0-SNAPSHOT SUCCESS [  3.062 s]
23:07:46 [2020-10-17T03:07:46.178Z] [INFO] org.eclipse.ease.lang.python.test 0.8.0-SNAPSHOT ... SUCCESS [  2.491 s]
23:07:46 [2020-10-17T03:07:46.178Z] [INFO] org.eclipse.ease.lang.python.jython.test 0.8.0-SNAPSHOT SUCCESS [ 15.536 s]
23:07:46 [2020-10-17T03:07:46.178Z] [INFO] org.eclipse.ease.lang.scriptarchive.test 0.8.0-SNAPSHOT SUCCESS [  3.363 s]
23:07:46 [2020-10-17T03:07:46.178Z] [INFO] org.eclipse.ease.lang.unittest.test 0.8.0-SNAPSHOT . SUCCESS [  5.034 s]
23:07:46 [2020-10-17T03:07:46.178Z] [INFO] org.eclipse.ease.ui.scripts.test 0.8.0-SNAPSHOT .... SUCCESS [  2.665 s]
23:07:46 [2020-10-17T03:07:46.178Z] [INFO] org.eclipse.ease.ui.test 0.8.0-SNAPSHOT ............ SUCCESS [ 15.716 s]
23:07:46 [2020-10-17T03:07:46.178Z] [INFO] EASE (Incubation) 0.4.0-SNAPSHOT ................... SUCCESS [  0.184 s]
23:07:46 [2020-10-17T03:07:46.178Z] [INFO] ------------------------------------------------------------------------
23:07:46 [2020-10-17T03:07:46.178Z] [INFO] BUILD SUCCESS
23:07:46 [2020-10-17T03:07:46.178Z] [INFO] ------------------------------------------------------------------------
23:07:46 [2020-10-17T03:07:46.178Z] [INFO] Total time:  04:17 min
23:07:46 [2020-10-17T03:07:46.178Z] [INFO] Finished at: 2020-10-17T03:07:45Z
23:07:46 [2020-10-17T03:07:46.178Z] [INFO] ------------------------------------------------------------------------
23:07:46 [2020-10-17T03:07:46.178Z] [INFO] [jenkins-event-spy] Generated /home/jenkins/agent/workspace/ease.verify.core.target.luna@tmp/withMavenc1dd92fb/maven-spy-20201017-030328-3826578289281897619645.log
[Pipeline] }
23:07:47 [2020-10-17T03:07:47.984Z] [withMaven] Publishers: Pipeline Graph Publisher: 33 ms, Invoker Publisher: 1 ms, Junit Publisher: 1 ms, Dependencies Fingerprint Publisher: 673 ms
[Pipeline] // withMaven
[Pipeline] }
[Pipeline] // stage
[Pipeline] stage
[Pipeline] { (Test)
[Pipeline] sh
23:07:48 [2020-10-17T03:07:48.294Z] + cp 'releng/org.eclipse.ease.releng.target/previous targets/Luna.target' releng/org.eclipse.ease.releng.target/org.eclipse.ease.releng.target.target
[Pipeline] withMaven
23:07:48 [2020-10-17T03:07:48.300Z] [withMaven] Options: [org.jenkinsci.plugins.pipeline.maven.publishers.GeneratedArtifactsPublisher[disabled=true], org.jenkinsci.plugins.pipeline.maven.publishers.FindbugsAnalysisPublisher[disabled='false', healthy='', unHealthy='', thresholdLimit='low'], org.jenkinsci.plugins.pipeline.maven.publishers.TasksScannerPublisher[disabled='true', healthy='', unHealthy='', thresholdLimit='low']]
23:07:48 [2020-10-17T03:07:48.301Z] [withMaven] Available options: 
23:07:48 [2020-10-17T03:07:48.301Z] [withMaven] using JDK installation openjdk-jdk11-latest
23:07:48 [2020-10-17T03:07:48.306Z] [withMaven] using Maven installation 'apache-maven-latest'
[Pipeline] {
[Pipeline] sh
23:07:48 [2020-10-17T03:07:48.583Z] + mvn integration-test -f releng/org.eclipse.ease.releng/target-tests-pom.xml
23:07:48 [2020-10-17T03:07:48.584Z] ----- withMaven Wrapper script -----
23:07:48 [2020-10-17T03:07:48.584Z] Picked up JAVA_TOOL_OPTIONS: -Dmaven.ext.class.path="/home/jenkins/agent/workspace/ease.verify.core.target.luna@tmp/withMaven3aee9d47/pipeline-maven-spy.jar" -Dorg.jenkinsci.plugins.pipeline.maven.reportsFolder="/home/jenkins/agent/workspace/ease.verify.core.target.luna@tmp/withMaven3aee9d47" 
23:07:48 [2020-10-17T03:07:48.584Z] Apache Maven 3.6.3 (cecedd343002696d0abb50b32b541b8a6ba2883f)
23:07:48 [2020-10-17T03:07:48.584Z] Maven home: /opt/tools/apache-maven/latest
23:07:48 [2020-10-17T03:07:48.584Z] Java version: 11.0.2, vendor: Oracle Corporation, runtime: /opt/tools/java/openjdk/jdk-11/11.0.2+9
23:07:48 [2020-10-17T03:07:48.584Z] Default locale: en_US, platform encoding: UTF-8
23:07:48 [2020-10-17T03:07:48.584Z] OS name: "linux", version: "3.10.0-1062.el7.x86_64", arch: "amd64", family: "unix"
23:07:49 [2020-10-17T03:07:49.511Z] [INFO] [jenkins-event-spy] Generate /home/jenkins/agent/workspace/ease.verify.core.target.luna@tmp/withMaven3aee9d47/maven-spy-20201017-030749-14317868171530565580487.log.tmp ...
23:07:49 [2020-10-17T03:07:49.511Z] [INFO] Scanning for projects...
23:07:50 [2020-10-17T03:07:50.084Z] [WARNING] No explicit target runtime environment configuration. Build is platform dependent.
23:07:51 [2020-10-17T03:07:51.973Z] [WARNING] No explicit target runtime environment configuration. Build is platform dependent.
23:07:51 [2020-10-17T03:07:51.973Z] [WARNING] No explicit target runtime environment configuration. Build is platform dependent.
23:07:51 [2020-10-17T03:07:51.973Z] [WARNING] No explicit target runtime environment configuration. Build is platform dependent.
23:07:51 [2020-10-17T03:07:51.973Z] [WARNING] No explicit target runtime environment configuration. Build is platform dependent.
23:07:51 [2020-10-17T03:07:51.973Z] [WARNING] No explicit target runtime environment configuration. Build is platform dependent.
23:07:51 [2020-10-17T03:07:51.973Z] [WARNING] No explicit target runtime environment configuration. Build is platform dependent.
23:07:51 [2020-10-17T03:07:51.973Z] [WARNING] No explicit target runtime environment configuration. Build is platform dependent.
23:07:51 [2020-10-17T03:07:51.973Z] [WARNING] No explicit target runtime environment configuration. Build is platform dependent.
23:07:51 [2020-10-17T03:07:51.973Z] [INFO] Computing target platform for MavenProject: org.eclipse.ease:org.eclipse.ease.test:0.8.0-SNAPSHOT @ /home/jenkins/agent/workspace/ease.verify.core.target.luna/tests/org.eclipse.ease.test/pom.xml
23:07:51 [2020-10-17T03:07:51.973Z] [INFO] Fetching p2.index from http://download.eclipse.org/releases/luna/
23:07:51 [2020-10-17T03:07:51.973Z] [INFO] Fetching p2.index from http://download.eclipse.org/releases/luna/
23:07:51 [2020-10-17T03:07:51.973Z] [INFO] Adding repository http://download.eclipse.org/releases/luna
23:07:51 [2020-10-17T03:07:51.973Z] [INFO] Fetching compositeContent.jar from http://download.eclipse.org/releases/luna/ (518B)
23:07:51 [2020-10-17T03:07:51.973Z] [INFO] Fetching compositeContent.jar from http://download.eclipse.org/releases/luna/ (518B)
23:07:52 [2020-10-17T03:07:52.229Z] [INFO] Fetching p2.index from http://download.eclipse.org/releases/luna/201406250900/
23:07:52 [2020-10-17T03:07:52.229Z] [INFO] Fetching p2.index from http://download.eclipse.org/releases/luna/201406250900/
23:07:52 [2020-10-17T03:07:52.229Z] [INFO] Fetching content.jar from http://download.eclipse.org/releases/luna/201406250900/ (2.5MB)
23:07:52 [2020-10-17T03:07:52.229Z] [INFO] Fetching content.jar from http://download.eclipse.org/releases/luna/201406250900/ (2.5MB)
23:07:53 [2020-10-17T03:07:53.592Z] Oct 17, 2020 3:07:53 AM org.apache.http.impl.execchain.RetryExec execute
23:07:53 [2020-10-17T03:07:53.592Z] INFO: I/O exception (org.apache.http.NoHttpResponseException) caught when processing request to {}->http://download.eclipse.org:80: The target server failed to respond
23:07:53 [2020-10-17T03:07:53.592Z] Oct 17, 2020 3:07:53 AM org.apache.http.impl.execchain.RetryExec execute
23:07:53 [2020-10-17T03:07:53.592Z] INFO: Retrying request to {}->http://download.eclipse.org:80
23:07:53 [2020-10-17T03:07:53.592Z] [INFO] Fetching p2.index from http://download.eclipse.org/releases/luna/201409261001/
23:07:53 [2020-10-17T03:07:53.592Z] [INFO] Fetching p2.index from http://download.eclipse.org/releases/luna/201409261001/
23:07:53 [2020-10-17T03:07:53.592Z] [INFO] Fetching content.jar from http://download.eclipse.org/releases/luna/201409261001/ (2.59MB)
23:07:53 [2020-10-17T03:07:53.592Z] [INFO] Fetching content.jar from http://download.eclipse.org/releases/luna/201409261001/ (2.59MB)
23:07:54 [2020-10-17T03:07:54.519Z] [INFO] Fetching p2.index from http://download.eclipse.org/releases/luna/201501121000/
23:07:54 [2020-10-17T03:07:54.519Z] [INFO] Fetching p2.index from http://download.eclipse.org/releases/luna/201501121000/
23:07:54 [2020-10-17T03:07:54.774Z] [INFO] Fetching content.jar from http://download.eclipse.org/releases/luna/201501121000/ (2.59MB)
23:07:54 [2020-10-17T03:07:54.774Z] [INFO] Fetching content.jar from http://download.eclipse.org/releases/luna/201501121000/ (2.59MB)
23:07:55 [2020-10-17T03:07:55.337Z] [INFO] Fetching p2.index from http://download.eclipse.org/releases/luna/201502271000/
23:07:55 [2020-10-17T03:07:55.337Z] [INFO] Fetching p2.index from http://download.eclipse.org/releases/luna/201502271000/
23:07:55 [2020-10-17T03:07:55.593Z] [INFO] Fetching content.jar from http://download.eclipse.org/releases/luna/201502271000/ (2.61MB)
23:07:55 [2020-10-17T03:07:55.593Z] [INFO] Fetching content.jar from http://download.eclipse.org/releases/luna/201502271000/ (2.61MB)
23:07:56 [2020-10-17T03:07:56.520Z] [INFO] Fetching content.jar from http://download.eclipse.org/technology/epp/packages/luna/ (320.79kB)
23:07:56 [2020-10-17T03:07:56.520Z] [INFO] Fetching content.jar from http://download.eclipse.org/technology/epp/packages/luna/ (320.79kB)
23:07:57 [2020-10-17T03:07:57.080Z] [INFO] Adding repository https://bintray.com/artifact/download/pontesegger/ease-engines
23:07:57 [2020-10-17T03:07:57.336Z] [INFO] Adding repository http://download.eclipse.org/tools/orbit/downloads/drops/R20150124073747/repository
23:07:57 [2020-10-17T03:07:57.591Z] [INFO] Fetching content.jar from http://download.eclipse.org/tools/orbit/downloads/drops/R20150124073747/repository/ (188.24kB)
23:07:57 [2020-10-17T03:07:57.591Z] [INFO] Fetching content.jar from http://download.eclipse.org/tools/orbit/downloads/drops/R20150124073747/repository/ (188.24kB)
23:07:57 [2020-10-17T03:07:57.847Z] [INFO] Adding repository https://dl.bintray.com/py4j/py4j-eclipse/0.10.4
23:07:57 [2020-10-17T03:07:57.847Z] [INFO] Fetching content.jar from https://dl.bintray.com/py4j/py4j-eclipse/0.10.4/ (1.51kB)
23:07:57 [2020-10-17T03:07:57.847Z] [INFO] Fetching content.jar from https://dl.bintray.com/py4j/py4j-eclipse/0.10.4/ (1.51kB)
23:07:58 [2020-10-17T03:07:58.430Z] [INFO] Resolving dependencies of MavenProject: org.eclipse.ease:org.eclipse.ease.test:0.8.0-SNAPSHOT @ /home/jenkins/agent/workspace/ease.verify.core.target.luna/tests/org.eclipse.ease.test/pom.xml
23:07:58 [2020-10-17T03:07:58.686Z] Oct 17, 2020 3:07:58 AM org.apache.http.impl.execchain.RetryExec execute
23:07:58 [2020-10-17T03:07:58.686Z] INFO: I/O exception (org.apache.http.NoHttpResponseException) caught when processing request to {}->http://download.eclipse.org:80: The target server failed to respond
23:07:58 [2020-10-17T03:07:58.686Z] Oct 17, 2020 3:07:58 AM org.apache.http.impl.execchain.RetryExec execute
23:07:58 [2020-10-17T03:07:58.686Z] INFO: Retrying request to {}->http://download.eclipse.org:80
23:08:01 [2020-10-17T03:08:01.203Z] [INFO] Fetching &countryCode=us&timeZone=0&format=xml from http://www.eclipse.org/downloads/download.php?format=xml&file=/releases/luna/201406250900/
23:08:01 [2020-10-17T03:08:01.203Z] [INFO] Fetching javax.annotation_1.2.0.v201401042248.jar.pack.gz from http://download.eclipse.org/releases/luna/201406250900/plugins/ (21.11kB)
23:08:01 [2020-10-17T03:08:01.203Z] [INFO] Fetching javax.annotation_1.2.0.v201401042248.jar.pack.gz from http://download.eclipse.org/releases/luna/201406250900/plugins/ (21.11kB)
23:08:01 [2020-10-17T03:08:01.459Z] [INFO] Fetching javax.xml_1.3.4.v201005080400.jar.pack.gz from http://download.eclipse.org/releases/luna/201406250900/plugins/ (63.94kB)
23:08:01 [2020-10-17T03:08:01.459Z] [INFO] Fetching javax.xml_1.3.4.v201005080400.jar.pack.gz from http://download.eclipse.org/releases/luna/201406250900/plugins/ (63.94kB)
23:08:01 [2020-10-17T03:08:01.715Z] [INFO] Fetching &countryCode=us&timeZone=0&format=xml from http://www.eclipse.org/downloads/download.php?format=xml&file=/releases/luna/201502271000/
23:08:01 [2020-10-17T03:08:01.715Z] [INFO] Fetching org.eclipse.osgi_3.10.2.v20150203-1939.jar.pack.gz from http://download.eclipse.org/releases/luna/201502271000/plugins/ (387.71kB)
23:08:01 [2020-10-17T03:08:01.715Z] [INFO] Fetching org.eclipse.osgi_3.10.2.v20150203-1939.jar.pack.gz from http://download.eclipse.org/releases/luna/201502271000/plugins/ (387.71kB)
23:08:02 [2020-10-17T03:08:02.276Z] [INFO] Fetching org.apache.batik.css_1.7.0.v201011041433.jar.pack.gz from http://download.eclipse.org/releases/luna/201406250900/plugins/ (88.73kB)
23:08:02 [2020-10-17T03:08:02.276Z] [INFO] Fetching org.apache.batik.css_1.7.0.v201011041433.jar.pack.gz from http://download.eclipse.org/releases/luna/201406250900/plugins/ (88.73kB)
23:08:02 [2020-10-17T03:08:02.276Z] [INFO] Fetching org.apache.batik.util_1.7.0.v201011041433.jar.pack.gz from http://download.eclipse.org/releases/luna/201406250900/plugins/ (60.88kB)
23:08:02 [2020-10-17T03:08:02.276Z] [INFO] Fetching org.apache.batik.util_1.7.0.v201011041433.jar.pack.gz from http://download.eclipse.org/releases/luna/201406250900/plugins/ (60.88kB)
23:08:02 [2020-10-17T03:08:02.532Z] [INFO] Fetching org.apache.batik.util.gui_1.7.0.v200903091627.jar.pack.gz from http://download.eclipse.org/releases/luna/201406250900/plugins/ (77.67kB)
23:08:02 [2020-10-17T03:08:02.532Z] [INFO] Fetching org.apache.batik.util.gui_1.7.0.v200903091627.jar.pack.gz from http://download.eclipse.org/releases/luna/201406250900/plugins/ (77.67kB)
23:08:02 [2020-10-17T03:08:02.788Z] [INFO] Fetching org.eclipse.osgi.services_3.4.0.v20140312-2051.jar.pack.gz from http://download.eclipse.org/releases/luna/201406250900/plugins/ (33kB)
23:08:02 [2020-10-17T03:08:02.788Z] [INFO] Fetching org.eclipse.osgi.services_3.4.0.v20140312-2051.jar.pack.gz from http://download.eclipse.org/releases/luna/201406250900/plugins/ (33kB)
23:08:02 [2020-10-17T03:08:02.788Z] [INFO] Fetching &countryCode=us&timeZone=0&format=xml from http://www.eclipse.org/downloads/download.php?format=xml&file=/releases/luna/201409261001/
23:08:02 [2020-10-17T03:08:02.788Z] [INFO] Fetching org.eclipse.compare_3.5.501.v20140817-1445.jar.pack.gz from http://download.eclipse.org/releases/luna/201409261001/plugins/ (225.93kB)
23:08:02 [2020-10-17T03:08:02.788Z] [INFO] Fetching org.eclipse.compare_3.5.501.v20140817-1445.jar.pack.gz from http://download.eclipse.org/releases/luna/201409261001/plugins/ (225.93kB)
23:08:03 [2020-10-17T03:08:03.044Z] [INFO] Fetching org.eclipse.ui_3.106.1.v20141002-1150.jar.pack.gz from http://download.eclipse.org/releases/luna/201502271000/plugins/ (162.22kB)
23:08:03 [2020-10-17T03:08:03.044Z] [INFO] Fetching org.eclipse.ui_3.106.1.v20141002-1150.jar.pack.gz from http://download.eclipse.org/releases/luna/201502271000/plugins/ (162.22kB)
23:08:03 [2020-10-17T03:08:03.299Z] [INFO] Fetching org.eclipse.core.resources_3.9.1.v20140825-1431.jar from http://download.eclipse.org/releases/luna/201409261001/plugins/ (814.2kB)
23:08:03 [2020-10-17T03:08:03.299Z] [INFO] Fetching org.eclipse.core.resources_3.9.1.v20140825-1431.jar from http://download.eclipse.org/releases/luna/201409261001/plugins/ (814.2kB)
23:08:03 [2020-10-17T03:08:03.556Z] [INFO] Fetching org.eclipse.jface.text_3.9.2.v20141003-1326.jar.pack.gz from http://download.eclipse.org/releases/luna/201502271000/plugins/ (274.57kB)
23:08:03 [2020-10-17T03:08:03.557Z] [INFO] Fetching org.eclipse.jface.text_3.9.2.v20141003-1326.jar.pack.gz from http://download.eclipse.org/releases/luna/201502271000/plugins/ (274.57kB)
23:08:03 [2020-10-17T03:08:03.817Z] [INFO] Fetching org.eclipse.ui.ide_3.10.2.v20141118-1227.jar.pack.gz from http://download.eclipse.org/releases/luna/201502271000/plugins/ (709.38kB)
23:08:03 [2020-10-17T03:08:03.817Z] [INFO] Fetching org.eclipse.ui.ide_3.10.2.v20141118-1227.jar.pack.gz from http://download.eclipse.org/releases/luna/201502271000/plugins/ (709.38kB)
23:08:04 [2020-10-17T03:08:04.386Z] [INFO] Fetching org.eclipse.ui.views_3.7.0.v20140408-0703.jar.pack.gz from http://download.eclipse.org/releases/luna/201406250900/plugins/ (37.01kB)
23:08:04 [2020-10-17T03:08:04.641Z] [INFO] Fetching org.eclipse.ui.views_3.7.0.v20140408-0703.jar.pack.gz from http://download.eclipse.org/releases/luna/201406250900/plugins/ (37.01kB)
23:08:04 [2020-10-17T03:08:04.641Z] [INFO] Fetching org.eclipse.ui.workbench.texteditor_3.9.0.v20140411-1521.jar.pack.gz from http://download.eclipse.org/releases/luna/201406250900/plugins/ (176.86kB)
23:08:04 [2020-10-17T03:08:04.641Z] [INFO] Fetching org.eclipse.ui.workbench.texteditor_3.9.0.v20140411-1521.jar.pack.gz from http://download.eclipse.org/releases/luna/201406250900/plugins/ (176.86kB)
23:08:04 [2020-10-17T03:08:04.896Z] [INFO] Fetching org.eclipse.core.runtime_3.10.0.v20140318-2214.jar.pack.gz from http://download.eclipse.org/releases/luna/201406250900/plugins/ (33.47kB)
23:08:04 [2020-10-17T03:08:04.896Z] [INFO] Fetching org.eclipse.core.runtime_3.10.0.v20140318-2214.jar.pack.gz from http://download.eclipse.org/releases/luna/201406250900/plugins/ (33.47kB)
23:08:05 [2020-10-17T03:08:05.152Z] [INFO] Fetching org.eclipse.core.expressions_3.4.600.v20140128-0851.jar.pack.gz from http://download.eclipse.org/releases/luna/201406250900/plugins/ (29.39kB)
23:08:05 [2020-10-17T03:08:05.152Z] [INFO] Fetching org.eclipse.core.expressions_3.4.600.v20140128-0851.jar.pack.gz from http://download.eclipse.org/releases/luna/201406250900/plugins/ (29.39kB)
23:08:05 [2020-10-17T03:08:05.152Z] [INFO] Fetching org.eclipse.ui.editors_3.8.200.v20140401-1310.jar.pack.gz from http://download.eclipse.org/releases/luna/201406250900/plugins/ (159.82kB)
23:08:05 [2020-10-17T03:08:05.152Z] [INFO] Fetching org.eclipse.ui.editors_3.8.200.v20140401-1310.jar.pack.gz from http://download.eclipse.org/releases/luna/201406250900/plugins/ (159.82kB)
23:08:05 [2020-10-17T03:08:05.408Z] [INFO] Fetching org.eclipse.ui.forms_3.6.100.v20140422-1825.jar.pack.gz from http://download.eclipse.org/releases/luna/201406250900/plugins/ (97.59kB)
23:08:05 [2020-10-17T03:08:05.408Z] [INFO] Fetching org.eclipse.ui.forms_3.6.100.v20140422-1825.jar.pack.gz from http://download.eclipse.org/releases/luna/201406250900/plugins/ (97.59kB)
23:08:05 [2020-10-17T03:08:05.663Z] [INFO] Fetching org.eclipse.compare.core_3.5.400.v20130903-0736.jar.pack.gz from http://download.eclipse.org/releases/luna/201406250900/plugins/ (29.38kB)
23:08:05 [2020-10-17T03:08:05.663Z] [INFO] Fetching org.eclipse.compare.core_3.5.400.v20130903-0736.jar.pack.gz from http://download.eclipse.org/releases/luna/201406250900/plugins/ (29.38kB)
23:08:05 [2020-10-17T03:08:05.918Z] [INFO] Fetching com.ibm.icu_52.1.1.v201501240615.jar.pack.gz from http://download.eclipse.org/releases/luna/201502271000/plugins/ (7.77MB)
23:08:05 [2020-10-17T03:08:05.918Z] [INFO] Fetching com.ibm.icu_52.1.1.v201501240615.jar.pack.gz from http://download.eclipse.org/releases/luna/201502271000/plugins/ (7.77MB)
23:08:08 [2020-10-17T03:08:08.432Z] [INFO] Fetching org.eclipse.core.commands_3.6.100.v20140528-1422.jar.pack.gz from http://download.eclipse.org/releases/luna/201406250900/plugins/ (36.09kB)
23:08:08 [2020-10-17T03:08:08.432Z] [INFO] Fetching org.eclipse.core.commands_3.6.100.v20140528-1422.jar.pack.gz from http://download.eclipse.org/releases/luna/201406250900/plugins/ (36.09kB)
23:08:08 [2020-10-17T03:08:08.432Z] [INFO] Fetching org.eclipse.equinox.common_3.6.200.v20130402-1505.jar.pack.gz from http://download.eclipse.org/releases/luna/201406250900/plugins/ (43.57kB)
23:08:08 [2020-10-17T03:08:08.432Z] [INFO] Fetching org.eclipse.equinox.common_3.6.200.v20130402-1505.jar.pack.gz from http://download.eclipse.org/releases/luna/201406250900/plugins/ (43.57kB)
23:08:08 [2020-10-17T03:08:08.688Z] [INFO] Fetching org.eclipse.core.contenttype_3.4.200.v20140207-1251.jar.pack.gz from http://download.eclipse.org/releases/luna/201406250900/plugins/ (35.1kB)
23:08:08 [2020-10-17T03:08:08.688Z] [INFO] Fetching org.eclipse.core.contenttype_3.4.200.v20140207-1251.jar.pack.gz from http://download.eclipse.org/releases/luna/201406250900/plugins/ (35.1kB)
23:08:08 [2020-10-17T03:08:08.688Z] [INFO] Fetching org.eclipse.equinox.preferences_3.5.200.v20140224-1527.jar.pack.gz from http://download.eclipse.org/releases/luna/201406250900/plugins/ (48.93kB)
23:08:08 [2020-10-17T03:08:08.688Z] [INFO] Fetching org.eclipse.equinox.preferences_3.5.200.v20140224-1527.jar.pack.gz from http://download.eclipse.org/releases/luna/201406250900/plugins/ (48.93kB)
23:08:08 [2020-10-17T03:08:08.944Z] [INFO] Fetching org.eclipse.equinox.registry_3.5.400.v20140428-1507.jar.pack.gz from http://download.eclipse.org/releases/luna/201406250900/plugins/ (67.85kB)
23:08:08 [2020-10-17T03:08:08.944Z] [INFO] Fetching org.eclipse.equinox.registry_3.5.400.v20140428-1507.jar.pack.gz from http://download.eclipse.org/releases/luna/201406250900/plugins/ (67.85kB)
23:08:08 [2020-10-17T03:08:08.944Z] [INFO] Fetching org.eclipse.core.databinding_1.4.2.v20140729-1044.jar.pack.gz from http://download.eclipse.org/releases/luna/201409261001/plugins/ (52.4kB)
23:08:08 [2020-10-17T03:08:08.944Z] [INFO] Fetching org.eclipse.core.databinding_1.4.2.v20140729-1044.jar.pack.gz from http://download.eclipse.org/releases/luna/201409261001/plugins/ (52.4kB)
23:08:09 [2020-10-17T03:08:09.200Z] [INFO] Fetching org.eclipse.core.databinding.observable_1.4.1.v20140210-1835.jar.pack.gz from http://download.eclipse.org/releases/luna/201406250900/plugins/ (67.3kB)
23:08:09 [2020-10-17T03:08:09.200Z] [INFO] Fetching org.eclipse.core.databinding.observable_1.4.1.v20140210-1835.jar.pack.gz from http://download.eclipse.org/releases/luna/201406250900/plugins/ (67.3kB)
23:08:09 [2020-10-17T03:08:09.456Z] [INFO] Fetching org.eclipse.core.databinding.property_1.4.200.v20140214-0004.jar.pack.gz from http://download.eclipse.org/releases/luna/201406250900/plugins/ (37.4kB)
23:08:09 [2020-10-17T03:08:09.456Z] [INFO] Fetching org.eclipse.core.databinding.property_1.4.200.v20140214-0004.jar.pack.gz from http://download.eclipse.org/releases/luna/201406250900/plugins/ (37.4kB)
23:08:09 [2020-10-17T03:08:09.456Z] [INFO] Fetching org.eclipse.core.filebuffers_3.5.400.v20140127-1516.jar.pack.gz from http://download.eclipse.org/releases/luna/201406250900/plugins/ (37.95kB)
23:08:09 [2020-10-17T03:08:09.456Z] [INFO] Fetching org.eclipse.core.filebuffers_3.5.400.v20140127-1516.jar.pack.gz from http://download.eclipse.org/releases/luna/201406250900/plugins/ (37.95kB)
23:08:09 [2020-10-17T03:08:09.711Z] [INFO] Fetching org.eclipse.text_3.5.300.v20130515-1451.jar.pack.gz from http://download.eclipse.org/releases/luna/201406250900/plugins/ (78.99kB)
23:08:09 [2020-10-17T03:08:09.711Z] [INFO] Fetching org.eclipse.text_3.5.300.v20130515-1451.jar.pack.gz from http://download.eclipse.org/releases/luna/201406250900/plugins/ (78.99kB)
23:08:09 [2020-10-17T03:08:09.966Z] [INFO] Fetching org.eclipse.core.filesystem_1.4.100.v20140514-1614.jar.pack.gz from http://download.eclipse.org/releases/luna/201406250900/plugins/ (23.66kB)
23:08:09 [2020-10-17T03:08:09.966Z] [INFO] Fetching org.eclipse.core.filesystem_1.4.100.v20140514-1614.jar.pack.gz from http://download.eclipse.org/releases/luna/201406250900/plugins/ (23.66kB)
23:08:09 [2020-10-17T03:08:09.966Z] [INFO] Fetching org.eclipse.core.jobs_3.6.1.v20141014-1248.jar.pack.gz from http://download.eclipse.org/releases/luna/201502271000/plugins/ (40.01kB)
23:08:09 [2020-10-17T03:08:09.966Z] [INFO] Fetching org.eclipse.core.jobs_3.6.1.v20141014-1248.jar.pack.gz from http://download.eclipse.org/releases/luna/201502271000/plugins/ (40.01kB)
23:08:10 [2020-10-17T03:08:10.221Z] [INFO] Fetching org.eclipse.core.net_1.2.200.v20140124-2013.jar.pack.gz from http://download.eclipse.org/releases/luna/201406250900/plugins/ (30.23kB)
23:08:10 [2020-10-17T03:08:10.221Z] [INFO] Fetching org.eclipse.core.net_1.2.200.v20140124-2013.jar.pack.gz from http://download.eclipse.org/releases/luna/201406250900/plugins/ (30.23kB)
23:08:10 [2020-10-17T03:08:10.221Z] [INFO] Fetching org.eclipse.equinox.security_1.2.0.v20130424-1801.jar.pack.gz from http://download.eclipse.org/releases/luna/201406250900/plugins/ (40.07kB)
23:08:10 [2020-10-17T03:08:10.221Z] [INFO] Fetching org.eclipse.equinox.security_1.2.0.v20130424-1801.jar.pack.gz from http://download.eclipse.org/releases/luna/201406250900/plugins/ (40.07kB)
23:08:10 [2020-10-17T03:08:10.477Z] [INFO] Fetching org.eclipse.equinox.app_1.3.200.v20130910-1609.jar.pack.gz from http://download.eclipse.org/releases/luna/201406250900/plugins/ (39.03kB)
23:08:10 [2020-10-17T03:08:10.477Z] [INFO] Fetching org.eclipse.equinox.app_1.3.200.v20130910-1609.jar.pack.gz from http://download.eclipse.org/releases/luna/201406250900/plugins/ (39.03kB)
23:08:10 [2020-10-17T03:08:10.477Z] [INFO] Fetching org.eclipse.core.variables_3.2.800.v20130819-1716.jar.pack.gz from http://download.eclipse.org/releases/luna/201406250900/plugins/ (16.76kB)
23:08:10 [2020-10-17T03:08:10.477Z] [INFO] Fetching org.eclipse.core.variables_3.2.800.v20130819-1716.jar.pack.gz from http://download.eclipse.org/releases/luna/201406250900/plugins/ (16.76kB)
23:08:10 [2020-10-17T03:08:10.733Z] [INFO] Fetching org.eclipse.debug.core_3.9.1.v20140805-1629.jar.pack.gz from http://download.eclipse.org/releases/luna/201409261001/plugins/ (105.92kB)
23:08:10 [2020-10-17T03:08:10.733Z] [INFO] Fetching org.eclipse.debug.core_3.9.1.v20140805-1629.jar.pack.gz from http://download.eclipse.org/releases/luna/201409261001/plugins/ (105.92kB)
23:08:10 [2020-10-17T03:08:10.733Z] [INFO] Fetching org.eclipse.debug.ui_3.10.2.v20141014-1039.jar.pack.gz from http://download.eclipse.org/releases/luna/201502271000/plugins/ (807.92kB)
23:08:10 [2020-10-17T03:08:10.733Z] [INFO] Fetching org.eclipse.debug.ui_3.10.2.v20141014-1039.jar.pack.gz from http://download.eclipse.org/releases/luna/201502271000/plugins/ (807.92kB)
23:08:11 [2020-10-17T03:08:11.294Z] [INFO] Fetching org.eclipse.ui.console_3.5.300.v20140424-1437.jar.pack.gz from http://download.eclipse.org/releases/luna/201406250900/plugins/ (64.33kB)
23:08:11 [2020-10-17T03:08:11.294Z] [INFO] Fetching org.eclipse.ui.console_3.5.300.v20140424-1437.jar.pack.gz from http://download.eclipse.org/releases/luna/201406250900/plugins/ (64.33kB)
23:08:11 [2020-10-17T03:08:11.550Z] [INFO] Fetching org.eclipse.help_3.6.0.v20130326-1254.jar.pack.gz from http://download.eclipse.org/releases/luna/201406250900/plugins/ (107.95kB)
23:08:11 [2020-10-17T03:08:11.550Z] [INFO] Fetching org.eclipse.help_3.6.0.v20130326-1254.jar.pack.gz from http://download.eclipse.org/releases/luna/201406250900/plugins/ (107.95kB)
23:08:11 [2020-10-17T03:08:11.806Z] [INFO] Fetching org.eclipse.e4.core.commands_0.10.2.v20140424-2344.jar.pack.gz from http://download.eclipse.org/releases/luna/201406250900/plugins/ (12.71kB)
23:08:11 [2020-10-17T03:08:11.806Z] [INFO] Fetching org.eclipse.e4.core.commands_0.10.2.v20140424-2344.jar.pack.gz from http://download.eclipse.org/releases/luna/201406250900/plugins/ (12.71kB)
23:08:11 [2020-10-17T03:08:11.806Z] [INFO] Fetching org.eclipse.e4.core.di_1.4.0.v20140414-1837.jar.pack.gz from http://download.eclipse.org/releases/luna/201406250900/plugins/ (24.3kB)
23:08:11 [2020-10-17T03:08:11.806Z] [INFO] Fetching org.eclipse.e4.core.di_1.4.0.v20140414-1837.jar.pack.gz from http://download.eclipse.org/releases/luna/201406250900/plugins/ (24.3kB)
23:08:12 [2020-10-17T03:08:12.062Z] [INFO] Fetching org.eclipse.e4.core.contexts_1.3.100.v20140407-1019.jar.pack.gz from http://download.eclipse.org/releases/luna/201406250900/plugins/ (21.69kB)
23:08:12 [2020-10-17T03:08:12.062Z] [INFO] Fetching org.eclipse.e4.core.contexts_1.3.100.v20140407-1019.jar.pack.gz from http://download.eclipse.org/releases/luna/201406250900/plugins/ (21.69kB)
23:08:12 [2020-10-17T03:08:12.318Z] [INFO] Fetching org.eclipse.e4.core.services_1.2.1.v20140808-1251.jar.pack.gz from http://download.eclipse.org/releases/luna/201409261001/plugins/ (19.85kB)
23:08:12 [2020-10-17T03:08:12.318Z] [INFO] Fetching org.eclipse.e4.core.services_1.2.1.v20140808-1251.jar.pack.gz from http://download.eclipse.org/releases/luna/201409261001/plugins/ (19.85kB)
23:08:12 [2020-10-17T03:08:12.318Z] [INFO] Fetching org.eclipse.e4.core.di.extensions_0.12.0.v20140417-2033.jar.pack.gz from http://download.eclipse.org/releases/luna/201406250900/plugins/ (13.35kB)
23:08:12 [2020-10-17T03:08:12.318Z] [INFO] Fetching org.eclipse.e4.core.di.extensions_0.12.0.v20140417-2033.jar.pack.gz from http://download.eclipse.org/releases/luna/201406250900/plugins/ (13.35kB)
23:08:12 [2020-10-17T03:08:12.573Z] [INFO] Fetching org.eclipse.e4.ui.bindings_0.10.200.v20140424-2042.jar.pack.gz from http://download.eclipse.org/releases/luna/201406250900/plugins/ (22.76kB)
23:08:12 [2020-10-17T03:08:12.573Z] [INFO] Fetching org.eclipse.e4.ui.bindings_0.10.200.v20140424-2042.jar.pack.gz from http://download.eclipse.org/releases/luna/201406250900/plugins/ (22.76kB)
23:08:12 [2020-10-17T03:08:12.573Z] [INFO] Fetching org.eclipse.swt_3.103.2.v20150203-1313.jar.pack.gz from http://download.eclipse.org/releases/luna/201502271000/plugins/ (16.84kB)
23:08:12 [2020-10-17T03:08:12.573Z] [INFO] Fetching org.eclipse.swt_3.103.2.v20150203-1313.jar.pack.gz from http://download.eclipse.org/releases/luna/201502271000/plugins/ (16.84kB)
23:08:12 [2020-10-17T03:08:12.829Z] [INFO] Fetching org.eclipse.jface_3.10.2.v20141021-1035.jar.pack.gz from http://download.eclipse.org/releases/luna/201502271000/plugins/ (337.88kB)
23:08:12 [2020-10-17T03:08:12.829Z] [INFO] Fetching org.eclipse.jface_3.10.2.v20141021-1035.jar.pack.gz from http://download.eclipse.org/releases/luna/201502271000/plugins/ (337.88kB)
23:08:13 [2020-10-17T03:08:13.084Z] [INFO] Fetching org.eclipse.e4.ui.css.core_0.10.100.v20140424-2042.jar.pack.gz from http://download.eclipse.org/releases/luna/201406250900/plugins/ (57.57kB)
23:08:13 [2020-10-17T03:08:13.084Z] [INFO] Fetching org.eclipse.e4.ui.css.core_0.10.100.v20140424-2042.jar.pack.gz from http://download.eclipse.org/releases/luna/201406250900/plugins/ (57.57kB)
23:08:13 [2020-10-17T03:08:13.340Z] [INFO] Fetching org.eclipse.e4.ui.css.swt_0.11.101.v20140818-1343.jar.pack.gz from http://download.eclipse.org/releases/luna/201409261001/plugins/ (60.96kB)
23:08:13 [2020-10-17T03:08:13.340Z] [INFO] Fetching org.eclipse.e4.ui.css.swt_0.11.101.v20140818-1343.jar.pack.gz from http://download.eclipse.org/releases/luna/201409261001/plugins/ (60.96kB)
23:08:13 [2020-10-17T03:08:13.340Z] [INFO] Fetching org.eclipse.e4.ui.css.swt.theme_0.9.300.v20141126-1957.jar.pack.gz from http://download.eclipse.org/releases/luna/201502271000/plugins/ (14.99kB)
23:08:13 [2020-10-17T03:08:13.340Z] [INFO] Fetching org.eclipse.e4.ui.css.swt.theme_0.9.300.v20141126-1957.jar.pack.gz from http://download.eclipse.org/releases/luna/201502271000/plugins/ (14.99kB)
23:08:13 [2020-10-17T03:08:13.596Z] [INFO] Fetching org.eclipse.e4.ui.di_1.0.0.v20140328-2112.jar.pack.gz from http://download.eclipse.org/releases/luna/201406250900/plugins/ (8.55kB)
23:08:13 [2020-10-17T03:08:13.597Z] [INFO] Fetching org.eclipse.e4.ui.di_1.0.0.v20140328-2112.jar.pack.gz from http://download.eclipse.org/releases/luna/201406250900/plugins/ (8.55kB)
23:08:13 [2020-10-17T03:08:13.597Z] [INFO] Fetching org.eclipse.e4.ui.model.workbench_1.1.0.v20140512-1820.jar.pack.gz from http://download.eclipse.org/releases/luna/201406250900/plugins/ (99.31kB)
23:08:13 [2020-10-17T03:08:13.597Z] [INFO] Fetching org.eclipse.e4.ui.model.workbench_1.1.0.v20140512-1820.jar.pack.gz from http://download.eclipse.org/releases/luna/201406250900/plugins/ (99.31kB)
23:08:13 [2020-10-17T03:08:13.852Z] [INFO] Fetching org.eclipse.emf.ecore_2.10.2.v20150123-0348.jar.pack.gz from http://download.eclipse.org/releases/luna/201502271000/plugins/ (365.38kB)
23:08:13 [2020-10-17T03:08:13.852Z] [INFO] Fetching org.eclipse.emf.ecore_2.10.2.v20150123-0348.jar.pack.gz from http://download.eclipse.org/releases/luna/201502271000/plugins/ (365.38kB)
23:08:14 [2020-10-17T03:08:14.107Z] [INFO] Fetching org.eclipse.e4.ui.services_1.1.0.v20140328-1925.jar.pack.gz from http://download.eclipse.org/releases/luna/201406250900/plugins/ (12.44kB)
23:08:14 [2020-10-17T03:08:14.107Z] [INFO] Fetching org.eclipse.e4.ui.services_1.1.0.v20140328-1925.jar.pack.gz from http://download.eclipse.org/releases/luna/201406250900/plugins/ (12.44kB)
23:08:14 [2020-10-17T03:08:14.362Z] [INFO] Fetching org.eclipse.e4.ui.widgets_1.0.0.v20140514-1823.jar.pack.gz from http://download.eclipse.org/releases/luna/201406250900/plugins/ (9.1kB)
23:08:14 [2020-10-17T03:08:14.362Z] [INFO] Fetching org.eclipse.e4.ui.widgets_1.0.0.v20140514-1823.jar.pack.gz from http://download.eclipse.org/releases/luna/201406250900/plugins/ (9.1kB)
23:08:14 [2020-10-17T03:08:14.362Z] [INFO] Fetching org.eclipse.e4.ui.workbench_1.2.2.v20141212-1259.jar.pack.gz from http://download.eclipse.org/releases/luna/201502271000/plugins/ (91.24kB)
23:08:14 [2020-10-17T03:08:14.362Z] [INFO] Fetching org.eclipse.e4.ui.workbench_1.2.2.v20141212-1259.jar.pack.gz from http://download.eclipse.org/releases/luna/201502271000/plugins/ (91.24kB)
23:08:14 [2020-10-17T03:08:14.618Z] [INFO] Fetching org.eclipse.emf.ecore.change_2.10.0.v20150123-0348.jar.pack.gz from http://download.eclipse.org/releases/luna/201502271000/plugins/ (35.53kB)
23:08:14 [2020-10-17T03:08:14.618Z] [INFO] Fetching org.eclipse.emf.ecore.change_2.10.0.v20150123-0348.jar.pack.gz from http://download.eclipse.org/releases/luna/201502271000/plugins/ (35.53kB)
23:08:14 [2020-10-17T03:08:14.618Z] [INFO] Fetching org.eclipse.emf.ecore.xmi_2.10.2.v20150123-0348.jar.pack.gz from http://download.eclipse.org/releases/luna/201502271000/plugins/ (79.74kB)
23:08:14 [2020-10-17T03:08:14.618Z] [INFO] Fetching org.eclipse.emf.ecore.xmi_2.10.2.v20150123-0348.jar.pack.gz from http://download.eclipse.org/releases/luna/201502271000/plugins/ (79.74kB)
23:08:14 [2020-10-17T03:08:14.874Z] [INFO] Fetching org.eclipse.e4.ui.workbench.addons.swt_1.1.2.v20141126-1310.jar.pack.gz from http://download.eclipse.org/releases/luna/201502271000/plugins/ (49.64kB)
23:08:14 [2020-10-17T03:08:14.874Z] [INFO] Fetching org.eclipse.e4.ui.workbench.addons.swt_1.1.2.v20141126-1310.jar.pack.gz from http://download.eclipse.org/releases/luna/201502271000/plugins/ (49.64kB)
23:08:14 [2020-10-17T03:08:14.874Z] [INFO] Fetching org.eclipse.e4.ui.workbench.renderers.swt_0.12.2.v20150204-1353.jar.pack.gz from http://download.eclipse.org/releases/luna/201502271000/plugins/ (100.13kB)
23:08:14 [2020-10-17T03:08:14.874Z] [INFO] Fetching org.eclipse.e4.ui.workbench.renderers.swt_0.12.2.v20150204-1353.jar.pack.gz from http://download.eclipse.org/releases/luna/201502271000/plugins/ (100.13kB)
23:08:15 [2020-10-17T03:08:15.129Z] [INFO] Fetching org.eclipse.e4.ui.workbench.swt_0.12.100.v20141126-1150.jar.pack.gz from http://download.eclipse.org/releases/luna/201502271000/plugins/ (61.35kB)
23:08:15 [2020-10-17T03:08:15.129Z] [INFO] Fetching org.eclipse.e4.ui.workbench.swt_0.12.100.v20141126-1150.jar.pack.gz from http://download.eclipse.org/releases/luna/201502271000/plugins/ (61.35kB)
23:08:15 [2020-10-17T03:08:15.385Z] [INFO] Fetching org.eclipse.jface.databinding_1.6.200.v20140528-1422.jar.pack.gz from http://download.eclipse.org/releases/luna/201406250900/plugins/ (60.44kB)
23:08:15 [2020-10-17T03:08:15.385Z] [INFO] Fetching org.eclipse.jface.databinding_1.6.200.v20140528-1422.jar.pack.gz from http://download.eclipse.org/releases/luna/201406250900/plugins/ (60.44kB)
23:08:15 [2020-10-17T03:08:15.385Z] [INFO] Fetching org.eclipse.e4.ui.workbench3_0.12.0.v20140227-2118.jar.pack.gz from http://download.eclipse.org/releases/luna/201406250900/plugins/ (7.16kB)
23:08:15 [2020-10-17T03:08:15.640Z] [INFO] Fetching org.eclipse.e4.ui.workbench3_0.12.0.v20140227-2118.jar.pack.gz from http://download.eclipse.org/releases/luna/201406250900/plugins/ (7.16kB)
23:08:15 [2020-10-17T03:08:15.640Z] [INFO] Fetching org.eclipse.equinox.ds_1.4.200.v20131126-2331.jar.pack.gz from http://download.eclipse.org/releases/luna/201406250900/plugins/ (87.48kB)
23:08:15 [2020-10-17T03:08:15.640Z] [INFO] Fetching org.eclipse.equinox.ds_1.4.200.v20131126-2331.jar.pack.gz from http://download.eclipse.org/releases/luna/201406250900/plugins/ (87.48kB)
23:08:15 [2020-10-17T03:08:15.896Z] [INFO] Fetching org.eclipse.ecf.filetransfer_5.0.0.v20141221-2352.jar.pack.gz from http://download.eclipse.org/releases/luna/201502271000/plugins/ (18.1kB)
23:08:15 [2020-10-17T03:08:15.896Z] [INFO] Fetching org.eclipse.ecf.filetransfer_5.0.0.v20141221-2352.jar.pack.gz from http://download.eclipse.org/releases/luna/201502271000/plugins/ (18.1kB)
23:08:15 [2020-10-17T03:08:15.896Z] [INFO] Fetching org.junit_4.11.0.v201303080030.jar.pack.gz from http://download.eclipse.org/releases/luna/201406250900/plugins/ (222.27kB)
23:08:15 [2020-10-17T03:08:15.896Z] [INFO] Fetching org.junit_4.11.0.v201303080030.jar.pack.gz from http://download.eclipse.org/releases/luna/201406250900/plugins/ (222.27kB)
23:08:16 [2020-10-17T03:08:16.154Z] [INFO] Fetching &countryCode=us&timeZone=0&format=xml from http://www.eclipse.org/downloads/download.php?format=xml&file=/tools/orbit/downloads/drops/R20150124073747/repository/
23:08:16 [2020-10-17T03:08:16.154Z] [INFO] Fetching org.mockito_1.9.5.v201311280930.jar.pack.gz from http://download.eclipse.org/tools/orbit/downloads/drops/R20150124073747/repository/plugins/ (637.98kB)
23:08:16 [2020-10-17T03:08:16.154Z] [INFO] Fetching org.mockito_1.9.5.v201311280930.jar.pack.gz from http://download.eclipse.org/tools/orbit/downloads/drops/R20150124073747/repository/plugins/ (637.98kB)
23:08:16 [2020-10-17T03:08:16.718Z] [INFO] Fetching org.eclipse.ui.workbench_3.106.2.v20150204-1030.jar.pack.gz from http://download.eclipse.org/releases/luna/201502271000/plugins/ (991.98kB)
23:08:16 [2020-10-17T03:08:16.718Z] [INFO] Fetching org.eclipse.ui.workbench_3.106.2.v20150204-1030.jar.pack.gz from http://download.eclipse.org/releases/luna/201502271000/plugins/ (991.98kB)
23:08:17 [2020-10-17T03:08:17.279Z] [INFO] Fetching org.eclipse.equinox.p2.engine_2.3.0.v20140506-1720.jar.pack.gz from http://download.eclipse.org/releases/luna/201406250900/plugins/ (67.52kB)
23:08:17 [2020-10-17T03:08:17.279Z] [INFO] Fetching org.eclipse.equinox.p2.engine_2.3.0.v20140506-1720.jar.pack.gz from http://download.eclipse.org/releases/luna/201406250900/plugins/ (67.52kB)
23:08:17 [2020-10-17T03:08:17.535Z] [INFO] Fetching org.eclipse.ui.views.properties.tabbed_3.6.0.v20140519-0906.jar.pack.gz from http://download.eclipse.org/releases/luna/201406250900/plugins/ (35.98kB)
23:08:17 [2020-10-17T03:08:17.535Z] [INFO] Fetching org.eclipse.ui.views.properties.tabbed_3.6.0.v20140519-0906.jar.pack.gz from http://download.eclipse.org/releases/luna/201406250900/plugins/ (35.98kB)
23:08:17 [2020-10-17T03:08:17.791Z] [INFO] Fetching org.eclipse.ecf_3.4.0.v20141221-2352.jar.pack.gz from http://download.eclipse.org/releases/luna/201502271000/plugins/ (36.91kB)
23:08:17 [2020-10-17T03:08:17.791Z] [INFO] Fetching org.eclipse.ecf_3.4.0.v20141221-2352.jar.pack.gz from http://download.eclipse.org/releases/luna/201502271000/plugins/ (36.91kB)
23:08:17 [2020-10-17T03:08:17.791Z] [INFO] Fetching org.eclipse.ecf.identity_3.4.0.v20141221-2352.jar.pack.gz from http://download.eclipse.org/releases/luna/201502271000/plugins/ (24.17kB)
23:08:17 [2020-10-17T03:08:17.791Z] [INFO] Fetching org.eclipse.ecf.identity_3.4.0.v20141221-2352.jar.pack.gz from http://download.eclipse.org/releases/luna/201502271000/plugins/ (24.17kB)
23:08:18 [2020-10-17T03:08:18.046Z] [INFO] Fetching org.eclipse.equinox.concurrent_1.1.0.v20130327-1442.jar.pack.gz from http://download.eclipse.org/releases/luna/201406250900/plugins/ (11.04kB)
23:08:18 [2020-10-17T03:08:18.046Z] [INFO] Fetching org.eclipse.equinox.concurrent_1.1.0.v20130327-1442.jar.pack.gz from http://download.eclipse.org/releases/luna/201406250900/plugins/ (11.04kB)
23:08:18 [2020-10-17T03:08:18.046Z] [INFO] Fetching org.eclipse.emf.common_2.10.1.v20150123-0348.jar.pack.gz from http://download.eclipse.org/releases/luna/201502271000/plugins/ (103.44kB)
23:08:18 [2020-10-17T03:08:18.046Z] [INFO] Fetching org.eclipse.emf.common_2.10.1.v20150123-0348.jar.pack.gz from http://download.eclipse.org/releases/luna/201502271000/plugins/ (103.44kB)
23:08:18 [2020-10-17T03:08:18.302Z] [INFO] Fetching org.eclipse.equinox.bidi_0.10.0.v20130327-1442.jar.pack.gz from http://download.eclipse.org/releases/luna/201406250900/plugins/ (21.69kB)
23:08:18 [2020-10-17T03:08:18.302Z] [INFO] Fetching org.eclipse.equinox.bidi_0.10.0.v20130327-1442.jar.pack.gz from http://download.eclipse.org/releases/luna/201406250900/plugins/ (21.69kB)
23:08:18 [2020-10-17T03:08:18.302Z] [INFO] Fetching org.eclipse.equinox.util_1.0.500.v20130404-1337.jar.pack.gz from http://download.eclipse.org/releases/luna/201406250900/plugins/ (30.41kB)
23:08:18 [2020-10-17T03:08:18.302Z] [INFO] Fetching org.eclipse.equinox.util_1.0.500.v20130404-1337.jar.pack.gz from http://download.eclipse.org/releases/luna/201406250900/plugins/ (30.41kB)
23:08:18 [2020-10-17T03:08:18.559Z] [INFO] Fetching org.eclipse.equinox.p2.core_2.3.0.v20131211-1531.jar.pack.gz from http://download.eclipse.org/releases/luna/201406250900/plugins/ (27.9kB)
23:08:18 [2020-10-17T03:08:18.559Z] [INFO] Fetching org.eclipse.equinox.p2.core_2.3.0.v20131211-1531.jar.pack.gz from http://download.eclipse.org/releases/luna/201406250900/plugins/ (27.9kB)
23:08:18 [2020-10-17T03:08:18.559Z] [INFO] Fetching org.eclipse.equinox.p2.metadata_2.2.0.v20131211-1531.jar.pack.gz from http://download.eclipse.org/releases/luna/201406250900/plugins/ (95.96kB)
23:08:18 [2020-10-17T03:08:18.559Z] [INFO] Fetching org.eclipse.equinox.p2.metadata_2.2.0.v20131211-1531.jar.pack.gz from http://download.eclipse.org/releases/luna/201406250900/plugins/ (95.96kB)
23:08:18 [2020-10-17T03:08:18.814Z] [INFO] Fetching org.eclipse.equinox.p2.metadata.repository_1.2.100.v20131209-2144.jar.pack.gz from http://download.eclipse.org/releases/luna/201406250900/plugins/ (44.01kB)
23:08:18 [2020-10-17T03:08:18.814Z] [INFO] Fetching org.eclipse.equinox.p2.metadata.repository_1.2.100.v20131209-2144.jar.pack.gz from http://download.eclipse.org/releases/luna/201406250900/plugins/ (44.01kB)
23:08:19 [2020-10-17T03:08:19.070Z] [INFO] Fetching org.eclipse.equinox.p2.repository_2.3.0.v20131211-1531.jar.pack.gz from http://download.eclipse.org/releases/luna/201406250900/plugins/ (48.65kB)
23:08:19 [2020-10-17T03:08:19.070Z] [INFO] Fetching org.eclipse.equinox.p2.repository_2.3.0.v20131211-1531.jar.pack.gz from http://download.eclipse.org/releases/luna/201406250900/plugins/ (48.65kB)
23:08:19 [2020-10-17T03:08:19.070Z] [INFO] Fetching org.eclipse.ltk.core.refactoring_3.6.101.v20140817-1500.jar.pack.gz from http://download.eclipse.org/releases/luna/201409261001/plugins/ (94.21kB)
23:08:19 [2020-10-17T03:08:19.070Z] [INFO] Fetching org.eclipse.ltk.core.refactoring_3.6.101.v20140817-1500.jar.pack.gz from http://download.eclipse.org/releases/luna/201409261001/plugins/ (94.21kB)
23:08:19 [2020-10-17T03:08:19.325Z] [INFO] Fetching org.eclipse.ltk.ui.refactoring_3.7.100.v20140324-1358.jar.pack.gz from http://download.eclipse.org/releases/luna/201406250900/plugins/ (144.43kB)
23:08:19 [2020-10-17T03:08:19.325Z] [INFO] Fetching org.eclipse.ltk.ui.refactoring_3.7.100.v20140324-1358.jar.pack.gz from http://download.eclipse.org/releases/luna/201406250900/plugins/ (144.43kB)
23:08:19 [2020-10-17T03:08:19.580Z] [INFO] Fetching org.eclipse.ui.navigator_3.5.401.v20140724-1117.jar.pack.gz from http://download.eclipse.org/releases/luna/201409261001/plugins/ (109.52kB)
23:08:19 [2020-10-17T03:08:19.580Z] [INFO] Fetching org.eclipse.ui.navigator_3.5.401.v20140724-1117.jar.pack.gz from http://download.eclipse.org/releases/luna/201409261001/plugins/ (109.52kB)
23:08:19 [2020-10-17T03:08:19.580Z] [INFO] Fetching org.eclipse.team.core_3.7.0.v20130514-1224.jar.pack.gz from http://download.eclipse.org/releases/luna/201406250900/plugins/ (113.04kB)
23:08:19 [2020-10-17T03:08:19.835Z] [INFO] Fetching org.eclipse.team.core_3.7.0.v20130514-1224.jar.pack.gz from http://download.eclipse.org/releases/luna/201406250900/plugins/ (113.04kB)
23:08:19 [2020-10-17T03:08:19.836Z] [INFO] Fetching org.eclipse.team.ui_3.7.100.v20130710-1213.jar.pack.gz from http://download.eclipse.org/releases/luna/201406250900/plugins/ (367.73kB)
23:08:19 [2020-10-17T03:08:19.836Z] [INFO] Fetching org.eclipse.team.ui_3.7.100.v20130710-1213.jar.pack.gz from http://download.eclipse.org/releases/luna/201406250900/plugins/ (367.73kB)
23:08:20 [2020-10-17T03:08:20.397Z] [INFO] Fetching org.eclipse.ui.ide.application_1.0.501.v20141111-1238.jar.pack.gz from http://download.eclipse.org/releases/luna/201502271000/plugins/ (34.16kB)
23:08:20 [2020-10-17T03:08:20.397Z] [INFO] Fetching org.eclipse.ui.ide.application_1.0.501.v20141111-1238.jar.pack.gz from http://download.eclipse.org/releases/luna/201502271000/plugins/ (34.16kB)
23:08:20 [2020-10-17T03:08:20.397Z] [INFO] Fetching org.eclipse.ui.navigator.resources_3.4.700.v20140407-1004.jar.pack.gz from http://download.eclipse.org/releases/luna/201406250900/plugins/ (44.33kB)
23:08:20 [2020-10-17T03:08:20.397Z] [INFO] Fetching org.eclipse.ui.navigator.resources_3.4.700.v20140407-1004.jar.pack.gz from http://download.eclipse.org/releases/luna/201406250900/plugins/ (44.33kB)
23:08:20 [2020-10-17T03:08:20.653Z] [INFO] Fetching org.hamcrest.core_1.3.0.v201303031735.jar.pack.gz from http://download.eclipse.org/releases/luna/201406250900/plugins/ (19.79kB)
23:08:20 [2020-10-17T03:08:20.653Z] [INFO] Fetching org.hamcrest.core_1.3.0.v201303031735.jar.pack.gz from http://download.eclipse.org/releases/luna/201406250900/plugins/ (19.79kB)
23:08:20 [2020-10-17T03:08:20.909Z] [INFO] Fetching org.hamcrest.library_1.3.0.v201305281000.jar.pack.gz from http://download.eclipse.org/tools/orbit/downloads/drops/R20150124073747/repository/plugins/ (22.69kB)
23:08:20 [2020-10-17T03:08:20.910Z] [INFO] Fetching org.hamcrest.library_1.3.0.v201305281000.jar.pack.gz from http://download.eclipse.org/tools/orbit/downloads/drops/R20150124073747/repository/plugins/ (22.69kB)
23:08:20 [2020-10-17T03:08:20.910Z] [INFO] Fetching org.objenesis_1.0.0.v201105211943.jar.pack.gz from http://download.eclipse.org/tools/orbit/downloads/drops/R20150124073747/repository/plugins/ (12.35kB)
23:08:20 [2020-10-17T03:08:20.910Z] [INFO] Fetching org.objenesis_1.0.0.v201105211943.jar.pack.gz from http://download.eclipse.org/tools/orbit/downloads/drops/R20150124073747/repository/plugins/ (12.35kB)
23:08:21 [2020-10-17T03:08:21.166Z] [INFO] Fetching org.w3c.dom.smil_1.0.0.v200806040011.jar.pack.gz from http://download.eclipse.org/releases/luna/201406250900/plugins/ (12.78kB)
23:08:21 [2020-10-17T03:08:21.166Z] [INFO] Fetching org.w3c.dom.smil_1.0.0.v200806040011.jar.pack.gz from http://download.eclipse.org/releases/luna/201406250900/plugins/ (12.78kB)
23:08:21 [2020-10-17T03:08:21.166Z] [INFO] Fetching org.eclipse.equinox.launcher_1.3.0.v20140415-2008.jar.pack.gz from http://download.eclipse.org/releases/luna/201406250900/plugins/ (27.61kB)
23:08:21 [2020-10-17T03:08:21.421Z] [INFO] Fetching org.eclipse.equinox.launcher_1.3.0.v20140415-2008.jar.pack.gz from http://download.eclipse.org/releases/luna/201406250900/plugins/ (27.61kB)
23:08:21 [2020-10-17T03:08:21.421Z] [INFO] Fetching org.eclipse.swt.gtk.linux.x86_64_3.103.2.v20150203-1351.jar.pack.gz from http://download.eclipse.org/releases/luna/201502271000/plugins/ (1.19MB)
23:08:21 [2020-10-17T03:08:21.421Z] [INFO] Fetching org.eclipse.swt.gtk.linux.x86_64_3.103.2.v20150203-1351.jar.pack.gz from http://download.eclipse.org/releases/luna/201502271000/plugins/ (1.19MB)
23:08:21 [2020-10-17T03:08:21.982Z] [WARNING] The following locally built units have been used to resolve project dependencies:
23:08:21 [2020-10-17T03:08:21.982Z] [WARNING]   org.eclipse.ease/0.8.0.I202010051129
23:08:21 [2020-10-17T03:08:21.982Z] [WARNING]   org.eclipse.ease.ui/0.8.0.I202010061535
23:08:21 [2020-10-17T03:08:21.982Z] [WARNING]   org.eclipse.ease.classloader/0.8.0.I202010061535
23:08:21 [2020-10-17T03:08:21.982Z] [WARNING]   org.eclipse.ease.ui.scripts/0.8.0.I202010061535
23:08:21 [2020-10-17T03:08:21.982Z] [INFO] Resolving class path of MavenProject: org.eclipse.ease:org.eclipse.ease.test:0.8.0-SNAPSHOT @ /home/jenkins/agent/workspace/ease.verify.core.target.luna/tests/org.eclipse.ease.test/pom.xml
23:08:22 [2020-10-17T03:08:22.238Z] [INFO] Computing target platform for MavenProject: org.eclipse.ease:org.eclipse.ease.lang.javascript.nashorn.test:0.8.0-SNAPSHOT @ /home/jenkins/agent/workspace/ease.verify.core.target.luna/tests/org.eclipse.ease.lang.javascript.nashorn.test/pom.xml
23:08:22 [2020-10-17T03:08:22.238Z] [INFO] Resolving dependencies of MavenProject: org.eclipse.ease:org.eclipse.ease.lang.javascript.nashorn.test:0.8.0-SNAPSHOT @ /home/jenkins/agent/workspace/ease.verify.core.target.luna/tests/org.eclipse.ease.lang.javascript.nashorn.test/pom.xml
23:08:22 [2020-10-17T03:08:22.238Z] [WARNING] The following locally built units have been used to resolve project dependencies:
23:08:22 [2020-10-17T03:08:22.238Z] [WARNING]   org.eclipse.ease/0.8.0.I202010051129
23:08:22 [2020-10-17T03:08:22.238Z] [WARNING]   org.eclipse.ease.lang.javascript.nashorn/0.8.0.I202010061535
23:08:22 [2020-10-17T03:08:22.238Z] [WARNING]   org.eclipse.ease.ui/0.8.0.I202010061535
23:08:22 [2020-10-17T03:08:22.238Z] [WARNING]   org.eclipse.ease.lang.javascript/0.8.0.I202010061535
23:08:22 [2020-10-17T03:08:22.238Z] [WARNING]   org.eclipse.ease.classloader/0.8.0.I202010061535
23:08:22 [2020-10-17T03:08:22.238Z] [WARNING]   org.eclipse.ease.testhelper/0.8.0.I202003020926
23:08:22 [2020-10-17T03:08:22.238Z] [INFO] Resolving class path of MavenProject: org.eclipse.ease:org.eclipse.ease.lang.javascript.nashorn.test:0.8.0-SNAPSHOT @ /home/jenkins/agent/workspace/ease.verify.core.target.luna/tests/org.eclipse.ease.lang.javascript.nashorn.test/pom.xml
23:08:22 [2020-10-17T03:08:22.494Z] [INFO] Computing target platform for MavenProject: org.eclipse.ease:org.eclipse.ease.lang.javascript.rhino.test:0.8.0-SNAPSHOT @ /home/jenkins/agent/workspace/ease.verify.core.target.luna/tests/org.eclipse.ease.lang.javascript.rhino.test/pom.xml
23:08:22 [2020-10-17T03:08:22.494Z] [INFO] Resolving dependencies of MavenProject: org.eclipse.ease:org.eclipse.ease.lang.javascript.rhino.test:0.8.0-SNAPSHOT @ /home/jenkins/agent/workspace/ease.verify.core.target.luna/tests/org.eclipse.ease.lang.javascript.rhino.test/pom.xml
23:08:22 [2020-10-17T03:08:22.494Z] [INFO] Fetching org.mozilla.javascript_1.7.2.v201005080400.jar.pack.gz from http://download.eclipse.org/releases/luna/201406250900/plugins/ (340.53kB)
23:08:22 [2020-10-17T03:08:22.494Z] [INFO] Fetching org.mozilla.javascript_1.7.2.v201005080400.jar.pack.gz from http://download.eclipse.org/releases/luna/201406250900/plugins/ (340.53kB)
23:08:22 [2020-10-17T03:08:22.749Z] [INFO] Fetching org.eclipse.wst.jsdt.ui_1.1.500.v201409121658.jar.pack.gz from http://download.eclipse.org/releases/luna/201502271000/plugins/ (2.2MB)
23:08:22 [2020-10-17T03:08:22.749Z] [INFO] Fetching org.eclipse.wst.jsdt.ui_1.1.500.v201409121658.jar.pack.gz from http://download.eclipse.org/releases/luna/201502271000/plugins/ (2.2MB)
23:08:24 [2020-10-17T03:08:24.636Z] Oct 17, 2020 3:08:24 AM org.apache.http.impl.execchain.RetryExec execute
23:08:24 [2020-10-17T03:08:24.636Z] INFO: I/O exception (org.apache.http.NoHttpResponseException) caught when processing request to {}->http://download.eclipse.org:80: The target server failed to respond
23:08:24 [2020-10-17T03:08:24.636Z] Oct 17, 2020 3:08:24 AM org.apache.http.impl.execchain.RetryExec execute
23:08:24 [2020-10-17T03:08:24.636Z] INFO: Retrying request to {}->http://download.eclipse.org:80
23:08:24 [2020-10-17T03:08:24.636Z] [INFO] Fetching org.eclipse.wst.jsdt.debug.ui_1.0.400.v201402051800.jar.pack.gz from http://download.eclipse.org/releases/luna/201409261001/plugins/ (77.45kB)
23:08:24 [2020-10-17T03:08:24.636Z] [INFO] Fetching org.eclipse.wst.jsdt.debug.ui_1.0.400.v201402051800.jar.pack.gz from http://download.eclipse.org/releases/luna/201409261001/plugins/ (77.45kB)
23:08:24 [2020-10-17T03:08:24.636Z] [INFO] Fetching org.eclipse.search_3.9.100.v20140226-1637.jar.pack.gz from http://download.eclipse.org/releases/luna/201406250900/plugins/ (146.93kB)
23:08:24 [2020-10-17T03:08:24.636Z] [INFO] Fetching org.eclipse.search_3.9.100.v20140226-1637.jar.pack.gz from http://download.eclipse.org/releases/luna/201406250900/plugins/ (146.93kB)
23:08:24 [2020-10-17T03:08:24.636Z] [INFO] Fetching org.eclipse.wst.jsdt.core_1.3.300.v201410221502.jar.pack.gz from http://download.eclipse.org/releases/luna/201502271000/plugins/ (1.16MB)
23:08:24 [2020-10-17T03:08:24.636Z] [INFO] Fetching org.eclipse.wst.jsdt.core_1.3.300.v201410221502.jar.pack.gz from http://download.eclipse.org/releases/luna/201502271000/plugins/ (1.16MB)
23:08:25 [2020-10-17T03:08:25.562Z] [INFO] Fetching org.eclipse.wst.jsdt.debug.core_3.1.100.v201405212207.jar.pack.gz from http://download.eclipse.org/releases/luna/201409261001/plugins/ (48kB)
23:08:25 [2020-10-17T03:08:25.562Z] [INFO] Fetching org.eclipse.wst.jsdt.debug.core_3.1.100.v201405212207.jar.pack.gz from http://download.eclipse.org/releases/luna/201409261001/plugins/ (48kB)
23:08:25 [2020-10-17T03:08:25.562Z] [INFO] Fetching org.eclipse.wst.jsdt.manipulation_1.0.500.v201402051800.jar.pack.gz from http://download.eclipse.org/releases/luna/201409261001/plugins/ (19.43kB)
23:08:25 [2020-10-17T03:08:25.562Z] [INFO] Fetching org.eclipse.wst.jsdt.manipulation_1.0.500.v201402051800.jar.pack.gz from http://download.eclipse.org/releases/luna/201409261001/plugins/ (19.43kB)
23:08:25 [2020-10-17T03:08:25.562Z] [WARNING] The following locally built units have been used to resolve project dependencies:
23:08:25 [2020-10-17T03:08:25.562Z] [WARNING]   org.eclipse.ease/0.8.0.I202010051129
23:08:25 [2020-10-17T03:08:25.562Z] [WARNING]   org.eclipse.ease.ui/0.8.0.I202010061535
23:08:25 [2020-10-17T03:08:25.562Z] [WARNING]   org.eclipse.ease.lang.javascript/0.8.0.I202010061535
23:08:25 [2020-10-17T03:08:25.562Z] [WARNING]   org.eclipse.ease.classloader/0.8.0.I202010061535
23:08:25 [2020-10-17T03:08:25.562Z] [WARNING]   org.eclipse.ease.lang.javascript.rhino/0.8.0.I202008070902
23:08:25 [2020-10-17T03:08:25.562Z] [WARNING]   org.eclipse.ease.testhelper/0.8.0.I202003020926
23:08:25 [2020-10-17T03:08:25.562Z] [INFO] Resolving class path of MavenProject: org.eclipse.ease:org.eclipse.ease.lang.javascript.rhino.test:0.8.0-SNAPSHOT @ /home/jenkins/agent/workspace/ease.verify.core.target.luna/tests/org.eclipse.ease.lang.javascript.rhino.test/pom.xml
23:08:25 [2020-10-17T03:08:25.818Z] [INFO] Computing target platform for MavenProject: org.eclipse.ease:org.eclipse.ease.lang.javascript.test:0.8.0-SNAPSHOT @ /home/jenkins/agent/workspace/ease.verify.core.target.luna/tests/org.eclipse.ease.lang.javascript.test/pom.xml
23:08:25 [2020-10-17T03:08:25.818Z] [INFO] Resolving dependencies of MavenProject: org.eclipse.ease:org.eclipse.ease.lang.javascript.test:0.8.0-SNAPSHOT @ /home/jenkins/agent/workspace/ease.verify.core.target.luna/tests/org.eclipse.ease.lang.javascript.test/pom.xml
23:08:25 [2020-10-17T03:08:25.818Z] [WARNING] The following locally built units have been used to resolve project dependencies:
23:08:25 [2020-10-17T03:08:25.818Z] [WARNING]   org.eclipse.ease/0.8.0.I202010051129
23:08:25 [2020-10-17T03:08:25.818Z] [WARNING]   org.eclipse.ease.ui/0.8.0.I202010061535
23:08:25 [2020-10-17T03:08:25.818Z] [WARNING]   org.eclipse.ease.lang.javascript/0.8.0.I202010061535
23:08:25 [2020-10-17T03:08:25.818Z] [WARNING]   org.eclipse.ease.classloader/0.8.0.I202010061535
23:08:25 [2020-10-17T03:08:25.818Z] [WARNING]   org.eclipse.ease.lang.javascript.rhino/0.8.0.I202008070902
23:08:25 [2020-10-17T03:08:25.818Z] [INFO] Resolving class path of MavenProject: org.eclipse.ease:org.eclipse.ease.lang.javascript.test:0.8.0-SNAPSHOT @ /home/jenkins/agent/workspace/ease.verify.core.target.luna/tests/org.eclipse.ease.lang.javascript.test/pom.xml
23:08:25 [2020-10-17T03:08:25.818Z] [INFO] Computing target platform for MavenProject: org.eclipse.ease:org.eclipse.ease.lang.python.test:0.8.0-SNAPSHOT @ /home/jenkins/agent/workspace/ease.verify.core.target.luna/tests/org.eclipse.ease.lang.python.test/pom.xml
23:08:25 [2020-10-17T03:08:25.818Z] [INFO] Resolving dependencies of MavenProject: org.eclipse.ease:org.eclipse.ease.lang.python.test:0.8.0-SNAPSHOT @ /home/jenkins/agent/workspace/ease.verify.core.target.luna/tests/org.eclipse.ease.lang.python.test/pom.xml
23:08:25 [2020-10-17T03:08:25.818Z] [WARNING] The following locally built units have been used to resolve project dependencies:
23:08:25 [2020-10-17T03:08:25.818Z] [WARNING]   org.eclipse.ease/0.8.0.I202010051129
23:08:25 [2020-10-17T03:08:25.818Z] [WARNING]   org.eclipse.ease.lang.python/0.8.0.I202010061535
23:08:25 [2020-10-17T03:08:25.818Z] [WARNING]   org.eclipse.ease.ui/0.8.0.I202010061535
23:08:25 [2020-10-17T03:08:25.818Z] [WARNING]   org.eclipse.ease.classloader/0.8.0.I202010061535
23:08:25 [2020-10-17T03:08:25.818Z] [INFO] Resolving class path of MavenProject: org.eclipse.ease:org.eclipse.ease.lang.python.test:0.8.0-SNAPSHOT @ /home/jenkins/agent/workspace/ease.verify.core.target.luna/tests/org.eclipse.ease.lang.python.test/pom.xml
23:08:26 [2020-10-17T03:08:26.073Z] [INFO] Computing target platform for MavenProject: org.eclipse.ease:org.eclipse.ease.lang.python.jython.test:0.8.0-SNAPSHOT @ /home/jenkins/agent/workspace/ease.verify.core.target.luna/tests/org.eclipse.ease.lang.python.jython.test/pom.xml
23:08:26 [2020-10-17T03:08:26.073Z] [INFO] Resolving dependencies of MavenProject: org.eclipse.ease:org.eclipse.ease.lang.python.jython.test:0.8.0-SNAPSHOT @ /home/jenkins/agent/workspace/ease.verify.core.target.luna/tests/org.eclipse.ease.lang.python.jython.test/pom.xml
23:08:26 [2020-10-17T03:08:26.073Z] [WARNING] The following locally built units have been used to resolve project dependencies:
23:08:26 [2020-10-17T03:08:26.073Z] [WARNING]   org.eclipse.ease/0.8.0.I202010051129
23:08:26 [2020-10-17T03:08:26.073Z] [WARNING]   org.eclipse.ease.lang.python/0.8.0.I202010061535
23:08:26 [2020-10-17T03:08:26.073Z] [WARNING]   org.eclipse.ease.ui/0.8.0.I202010061535
23:08:26 [2020-10-17T03:08:26.073Z] [WARNING]   org.eclipse.ease.classloader/0.8.0.I202010061535
23:08:26 [2020-10-17T03:08:26.073Z] [WARNING]   org.eclipse.ease.testhelper/0.8.0.I202003020926
23:08:26 [2020-10-17T03:08:26.073Z] [WARNING]   org.eclipse.ease.lang.python.jython/0.8.0.I202010061535
23:08:26 [2020-10-17T03:08:26.073Z] [INFO] Resolving class path of MavenProject: org.eclipse.ease:org.eclipse.ease.lang.python.jython.test:0.8.0-SNAPSHOT @ /home/jenkins/agent/workspace/ease.verify.core.target.luna/tests/org.eclipse.ease.lang.python.jython.test/pom.xml
23:08:26 [2020-10-17T03:08:26.329Z] [INFO] Computing target platform for MavenProject: org.eclipse.ease:org.eclipse.ease.lang.python.py4j.test:0.8.0-SNAPSHOT @ /home/jenkins/agent/workspace/ease.verify.core.target.luna/tests/org.eclipse.ease.lang.python.py4j.test/pom.xml
23:08:26 [2020-10-17T03:08:26.329Z] [INFO] Resolving dependencies of MavenProject: org.eclipse.ease:org.eclipse.ease.lang.python.py4j.test:0.8.0-SNAPSHOT @ /home/jenkins/agent/workspace/ease.verify.core.target.luna/tests/org.eclipse.ease.lang.python.py4j.test/pom.xml
23:08:26 [2020-10-17T03:08:26.890Z] [INFO] Fetching py4j-java_0.10.4.bnd-LoVopg.jar from https://dl.bintray.com/py4j/py4j-eclipse/0.10.4/plugins/ (112.34kB)
23:08:26 [2020-10-17T03:08:26.890Z] [INFO] Fetching py4j-java_0.10.4.bnd-LoVopg.jar from https://dl.bintray.com/py4j/py4j-eclipse/0.10.4/plugins/ (112.34kB)
23:08:27 [2020-10-17T03:08:27.451Z] [INFO] Fetching py4j-python_0.10.4.bnd-2odeag.jar from https://dl.bintray.com/py4j/py4j-eclipse/0.10.4/plugins/ (74.83kB)
23:08:27 [2020-10-17T03:08:27.451Z] [INFO] Fetching py4j-python_0.10.4.bnd-2odeag.jar from https://dl.bintray.com/py4j/py4j-eclipse/0.10.4/plugins/ (74.83kB)
23:08:27 [2020-10-17T03:08:27.707Z] [WARNING] The following locally built units have been used to resolve project dependencies:
23:08:27 [2020-10-17T03:08:27.707Z] [WARNING]   org.eclipse.ease/0.8.0.I202010051129
23:08:27 [2020-10-17T03:08:27.707Z] [WARNING]   org.eclipse.ease.lang.python/0.8.0.I202010061535
23:08:27 [2020-10-17T03:08:27.707Z] [WARNING]   org.eclipse.ease.ui/0.8.0.I202010061535
23:08:27 [2020-10-17T03:08:27.707Z] [WARNING]   org.eclipse.ease.classloader/0.8.0.I202010061535
23:08:27 [2020-10-17T03:08:27.707Z] [WARNING]   org.eclipse.ease.testhelper/0.8.0.I202003020926
23:08:27 [2020-10-17T03:08:27.707Z] [WARNING]   org.eclipse.ease.lang.python.py4j/0.8.0.I202010061535
23:08:27 [2020-10-17T03:08:27.707Z] [INFO] Resolving class path of MavenProject: org.eclipse.ease:org.eclipse.ease.lang.python.py4j.test:0.8.0-SNAPSHOT @ /home/jenkins/agent/workspace/ease.verify.core.target.luna/tests/org.eclipse.ease.lang.python.py4j.test/pom.xml
23:08:27 [2020-10-17T03:08:27.707Z] [INFO] Computing target platform for MavenProject: org.eclipse.ease:org.eclipse.ease.lang.scriptarchive.test:0.8.0-SNAPSHOT @ /home/jenkins/agent/workspace/ease.verify.core.target.luna/tests/org.eclipse.ease.lang.scriptarchive.test/pom.xml
23:08:27 [2020-10-17T03:08:27.707Z] [INFO] Resolving dependencies of MavenProject: org.eclipse.ease:org.eclipse.ease.lang.scriptarchive.test:0.8.0-SNAPSHOT @ /home/jenkins/agent/workspace/ease.verify.core.target.luna/tests/org.eclipse.ease.lang.scriptarchive.test/pom.xml
23:08:27 [2020-10-17T03:08:27.707Z] [WARNING] The following locally built units have been used to resolve project dependencies:
23:08:27 [2020-10-17T03:08:27.707Z] [WARNING]   org.eclipse.ease/0.8.0.I202010051129
23:08:27 [2020-10-17T03:08:27.707Z] [WARNING]   org.eclipse.ease.ui/0.8.0.I202010061535
23:08:27 [2020-10-17T03:08:27.707Z] [WARNING]   org.eclipse.ease.lang.javascript/0.8.0.I202010061535
23:08:27 [2020-10-17T03:08:27.707Z] [WARNING]   org.eclipse.ease.classloader/0.8.0.I202010061535
23:08:27 [2020-10-17T03:08:27.707Z] [WARNING]   org.eclipse.ease.lang.javascript.rhino/0.8.0.I202008070902
23:08:27 [2020-10-17T03:08:27.707Z] [WARNING]   org.eclipse.ease.lang.scriptarchive/0.8.0.I202010061535
23:08:27 [2020-10-17T03:08:27.707Z] [INFO] Resolving class path of MavenProject: org.eclipse.ease:org.eclipse.ease.lang.scriptarchive.test:0.8.0-SNAPSHOT @ /home/jenkins/agent/workspace/ease.verify.core.target.luna/tests/org.eclipse.ease.lang.scriptarchive.test/pom.xml
23:08:27 [2020-10-17T03:08:27.963Z] [INFO] Computing target platform for MavenProject: org.eclipse.ease:org.eclipse.ease.ui.test:0.8.0-SNAPSHOT @ /home/jenkins/agent/workspace/ease.verify.core.target.luna/tests/org.eclipse.ease.ui.test/pom.xml
23:08:27 [2020-10-17T03:08:27.963Z] [INFO] Resolving dependencies of MavenProject: org.eclipse.ease:org.eclipse.ease.ui.test:0.8.0-SNAPSHOT @ /home/jenkins/agent/workspace/ease.verify.core.target.luna/tests/org.eclipse.ease.ui.test/pom.xml
23:08:27 [2020-10-17T03:08:27.963Z] [INFO] Fetching javax.servlet_3.0.0.v201112011016.jar.pack.gz from http://download.eclipse.org/releases/luna/201406250900/plugins/ (120kB)
23:08:27 [2020-10-17T03:08:27.963Z] [INFO] Fetching javax.servlet_3.0.0.v201112011016.jar.pack.gz from http://download.eclipse.org/releases/luna/201406250900/plugins/ (120kB)
23:08:27 [2020-10-17T03:08:27.963Z] [INFO] Fetching org.apache.lucene.analysis_3.5.0.v20120725-1805.jar from http://download.eclipse.org/releases/luna/201406250900/plugins/ (887.96kB)
23:08:28 [2020-10-17T03:08:28.219Z] [INFO] Fetching org.apache.lucene.analysis_3.5.0.v20120725-1805.jar from http://download.eclipse.org/releases/luna/201406250900/plugins/ (887.96kB)
23:08:28 [2020-10-17T03:08:28.219Z] [INFO] Fetching org.apache.lucene.core_3.5.0.v20120725-1805.jar from http://download.eclipse.org/releases/luna/201406250900/plugins/ (1.48MB)
23:08:28 [2020-10-17T03:08:28.219Z] [INFO] Fetching org.apache.lucene.core_3.5.0.v20120725-1805.jar from http://download.eclipse.org/releases/luna/201406250900/plugins/ (1.48MB)
23:08:28 [2020-10-17T03:08:28.474Z] [INFO] Fetching org.eclipse.jdt.ui_3.10.2.v20141014-1419.jar.pack.gz from http://download.eclipse.org/releases/luna/201502271000/plugins/ (2.89MB)
23:08:28 [2020-10-17T03:08:28.474Z] [INFO] Fetching org.eclipse.jdt.ui_3.10.2.v20141014-1419.jar.pack.gz from http://download.eclipse.org/releases/luna/201502271000/plugins/ (2.89MB)
23:08:30 [2020-10-17T03:08:30.362Z] Oct 17, 2020 3:08:30 AM org.apache.http.impl.execchain.RetryExec execute
23:08:30 [2020-10-17T03:08:30.362Z] INFO: I/O exception (org.apache.http.NoHttpResponseException) caught when processing request to {}->http://download.eclipse.org:80: The target server failed to respond
23:08:30 [2020-10-17T03:08:30.362Z] Oct 17, 2020 3:08:30 AM org.apache.http.impl.execchain.RetryExec execute
23:08:30 [2020-10-17T03:08:30.362Z] INFO: Retrying request to {}->http://download.eclipse.org:80
23:08:30 [2020-10-17T03:08:30.362Z] [INFO] Fetching org.eclipse.jdt.core_3.10.2.v20150120-1634.jar from http://download.eclipse.org/releases/luna/201502271000/plugins/ (5.32MB)
23:08:30 [2020-10-17T03:08:30.362Z] [INFO] Fetching org.eclipse.jdt.core_3.10.2.v20150120-1634.jar from http://download.eclipse.org/releases/luna/201502271000/plugins/ (5.32MB)
23:08:30 [2020-10-17T03:08:30.618Z] [INFO] Fetching org.objectweb.asm_5.0.1.v201404251740.jar.pack.gz from http://download.eclipse.org/releases/luna/201406250900/plugins/ (33.87kB)
23:08:30 [2020-10-17T03:08:30.618Z] [INFO] Fetching org.objectweb.asm_5.0.1.v201404251740.jar.pack.gz from http://download.eclipse.org/releases/luna/201406250900/plugins/ (33.87kB)
23:08:30 [2020-10-17T03:08:30.874Z] [INFO] Fetching org.eclipse.help.ui_4.0.100.v20140401-0608.jar.pack.gz from http://download.eclipse.org/releases/luna/201406250900/plugins/ (142.38kB)
23:08:30 [2020-10-17T03:08:30.874Z] [INFO] Fetching org.eclipse.help.ui_4.0.100.v20140401-0608.jar.pack.gz from http://download.eclipse.org/releases/luna/201406250900/plugins/ (142.38kB)
23:08:31 [2020-10-17T03:08:31.132Z] [INFO] Fetching org.eclipse.help.webapp_3.6.301.v20150115-1843.jar.pack.gz from http://download.eclipse.org/releases/luna/201502271000/plugins/ (223.29kB)
23:08:31 [2020-10-17T03:08:31.132Z] [INFO] Fetching org.eclipse.help.webapp_3.6.301.v20150115-1843.jar.pack.gz from http://download.eclipse.org/releases/luna/201502271000/plugins/ (223.29kB)
23:08:31 [2020-10-17T03:08:31.132Z] [INFO] Fetching org.eclipse.equinox.http.jetty_3.0.200.v20131021-1843.jar.pack.gz from http://download.eclipse.org/releases/luna/201406250900/plugins/ (14.19kB)
23:08:31 [2020-10-17T03:08:31.132Z] [INFO] Fetching org.eclipse.equinox.http.jetty_3.0.200.v20131021-1843.jar.pack.gz from http://download.eclipse.org/releases/luna/201406250900/plugins/ (14.19kB)
23:08:31 [2020-10-17T03:08:31.391Z] [INFO] Fetching org.eclipse.ui.browser_3.4.200.v20131003-1453.jar.pack.gz from http://download.eclipse.org/releases/luna/201406250900/plugins/ (73.54kB)
23:08:31 [2020-10-17T03:08:31.391Z] [INFO] Fetching org.eclipse.ui.browser_3.4.200.v20131003-1453.jar.pack.gz from http://download.eclipse.org/releases/luna/201406250900/plugins/ (73.54kB)
23:08:31 [2020-10-17T03:08:31.649Z] [INFO] Fetching org.eclipse.equinox.http.servlet_1.1.500.v20140318-1755.jar.pack.gz from http://download.eclipse.org/releases/luna/201406250900/plugins/ (18.7kB)
23:08:31 [2020-10-17T03:08:31.649Z] [INFO] Fetching org.eclipse.equinox.http.servlet_1.1.500.v20140318-1755.jar.pack.gz from http://download.eclipse.org/releases/luna/201406250900/plugins/ (18.7kB)
23:08:31 [2020-10-17T03:08:31.905Z] [INFO] Fetching org.eclipse.jetty.http_8.1.16.v20140903.jar.pack.gz from http://download.eclipse.org/releases/luna/201502271000/plugins/ (81.78kB)
23:08:31 [2020-10-17T03:08:31.905Z] [INFO] Fetching org.eclipse.jetty.http_8.1.16.v20140903.jar.pack.gz from http://download.eclipse.org/releases/luna/201502271000/plugins/ (81.78kB)
23:08:31 [2020-10-17T03:08:31.905Z] [INFO] Fetching org.eclipse.jetty.io_8.1.16.v20140903.jar.pack.gz from http://download.eclipse.org/releases/luna/201502271000/plugins/ (82.56kB)
23:08:31 [2020-10-17T03:08:31.905Z] [INFO] Fetching org.eclipse.jetty.io_8.1.16.v20140903.jar.pack.gz from http://download.eclipse.org/releases/luna/201502271000/plugins/ (82.56kB)
23:08:32 [2020-10-17T03:08:32.161Z] [INFO] Fetching org.eclipse.jetty.server_8.1.16.v20140903.jar.pack.gz from http://download.eclipse.org/releases/luna/201502271000/plugins/ (276.5kB)
23:08:32 [2020-10-17T03:08:32.161Z] [INFO] Fetching org.eclipse.jetty.server_8.1.16.v20140903.jar.pack.gz from http://download.eclipse.org/releases/luna/201502271000/plugins/ (276.5kB)
23:08:32 [2020-10-17T03:08:32.161Z] [INFO] Fetching org.eclipse.jetty.servlet_8.1.16.v20140903.jar.pack.gz from http://download.eclipse.org/releases/luna/201502271000/plugins/ (83.33kB)
23:08:32 [2020-10-17T03:08:32.161Z] [INFO] Fetching org.eclipse.jetty.servlet_8.1.16.v20140903.jar.pack.gz from http://download.eclipse.org/releases/luna/201502271000/plugins/ (83.33kB)
23:08:32 [2020-10-17T03:08:32.417Z] [INFO] Fetching org.eclipse.jetty.util_8.1.16.v20140903.jar.pack.gz from http://download.eclipse.org/releases/luna/201502271000/plugins/ (219.99kB)
23:08:32 [2020-10-17T03:08:32.417Z] [INFO] Fetching org.eclipse.jetty.util_8.1.16.v20140903.jar.pack.gz from http://download.eclipse.org/releases/luna/201502271000/plugins/ (219.99kB)
23:08:32 [2020-10-17T03:08:32.672Z] [INFO] Fetching org.eclipse.equinox.http.registry_1.1.300.v20130402-1529.jar.pack.gz from http://download.eclipse.org/releases/luna/201406250900/plugins/ (17.12kB)
23:08:32 [2020-10-17T03:08:32.672Z] [INFO] Fetching org.eclipse.equinox.http.registry_1.1.300.v20130402-1529.jar.pack.gz from http://download.eclipse.org/releases/luna/201406250900/plugins/ (17.12kB)
23:08:32 [2020-10-17T03:08:32.672Z] [INFO] Fetching org.eclipse.equinox.jsp.jasper_1.0.400.v20130327-1442.jar.pack.gz from http://download.eclipse.org/releases/luna/201406250900/plugins/ (13.37kB)
23:08:32 [2020-10-17T03:08:32.672Z] [INFO] Fetching org.eclipse.equinox.jsp.jasper_1.0.400.v20130327-1442.jar.pack.gz from http://download.eclipse.org/releases/luna/201406250900/plugins/ (13.37kB)
23:08:32 [2020-10-17T03:08:32.927Z] [INFO] Fetching org.eclipse.equinox.jsp.jasper.registry_1.0.300.v20130327-1442.jar.pack.gz from http://download.eclipse.org/releases/luna/201406250900/plugins/ (8.05kB)
23:08:32 [2020-10-17T03:08:32.927Z] [INFO] Fetching org.eclipse.equinox.jsp.jasper.registry_1.0.300.v20130327-1442.jar.pack.gz from http://download.eclipse.org/releases/luna/201406250900/plugins/ (8.05kB)
23:08:32 [2020-10-17T03:08:32.927Z] [INFO] Fetching org.eclipse.help.base_4.0.201.v20150204-1700.jar.pack.gz from http://download.eclipse.org/releases/luna/201502271000/plugins/ (146.41kB)
23:08:32 [2020-10-17T03:08:32.927Z] [INFO] Fetching org.eclipse.help.base_4.0.201.v20150204-1700.jar.pack.gz from http://download.eclipse.org/releases/luna/201502271000/plugins/ (146.41kB)
23:08:33 [2020-10-17T03:08:33.183Z] [INFO] Fetching org.eclipse.jdt.core.manipulation_1.5.0.v20130605-1748.jar.pack.gz from http://download.eclipse.org/releases/luna/201406250900/plugins/ (29.46kB)
23:08:33 [2020-10-17T03:08:33.183Z] [INFO] Fetching org.eclipse.jdt.core.manipulation_1.5.0.v20130605-1748.jar.pack.gz from http://download.eclipse.org/releases/luna/201406250900/plugins/ (29.46kB)
23:08:33 [2020-10-17T03:08:33.183Z] [INFO] Fetching org.eclipse.jdt.debug_3.8.102.v20150115-1323.jar.pack.gz from http://download.eclipse.org/releases/luna/201502271000/plugins/ (848.96kB)
23:08:33 [2020-10-17T03:08:33.183Z] [INFO] Fetching org.eclipse.jdt.debug_3.8.102.v20150115-1323.jar.pack.gz from http://download.eclipse.org/releases/luna/201502271000/plugins/ (848.96kB)
23:08:33 [2020-10-17T03:08:33.439Z] [INFO] Fetching org.eclipse.jdt.launching_3.7.102.v20141111-0953.jar.pack.gz from http://download.eclipse.org/releases/luna/201502271000/plugins/ (111.65kB)
23:08:33 [2020-10-17T03:08:33.439Z] [INFO] Fetching org.eclipse.jdt.launching_3.7.102.v20141111-0953.jar.pack.gz from http://download.eclipse.org/releases/luna/201502271000/plugins/ (111.65kB)
23:08:33 [2020-10-17T03:08:33.695Z] [INFO] Fetching org.eclipse.jetty.continuation_8.1.16.v20140903.jar.pack.gz from http://download.eclipse.org/releases/luna/201502271000/plugins/ (19.49kB)
23:08:33 [2020-10-17T03:08:33.695Z] [INFO] Fetching org.eclipse.jetty.continuation_8.1.16.v20140903.jar.pack.gz from http://download.eclipse.org/releases/luna/201502271000/plugins/ (19.49kB)
23:08:33 [2020-10-17T03:08:33.695Z] [INFO] Fetching org.eclipse.jetty.security_8.1.16.v20140903.jar.pack.gz from http://download.eclipse.org/releases/luna/201502271000/plugins/ (66.01kB)
23:08:33 [2020-10-17T03:08:33.695Z] [INFO] Fetching org.eclipse.jetty.security_8.1.16.v20140903.jar.pack.gz from http://download.eclipse.org/releases/luna/201502271000/plugins/ (66.01kB)
23:08:33 [2020-10-17T03:08:33.951Z] [WARNING] The following locally built units have been used to resolve project dependencies:
23:08:33 [2020-10-17T03:08:33.951Z] [WARNING]   org.eclipse.ease/0.8.0.I202010051129
23:08:33 [2020-10-17T03:08:33.951Z] [WARNING]   org.eclipse.ease.ui.completions.java/0.8.0.I202010061535
23:08:33 [2020-10-17T03:08:33.951Z] [WARNING]   org.eclipse.ease.ui/0.8.0.I202010061535
23:08:33 [2020-10-17T03:08:33.951Z] [WARNING]   org.eclipse.ease.classloader/0.8.0.I202010061535
23:08:33 [2020-10-17T03:08:33.951Z] [INFO] Resolving class path of MavenProject: org.eclipse.ease:org.eclipse.ease.ui.test:0.8.0-SNAPSHOT @ /home/jenkins/agent/workspace/ease.verify.core.target.luna/tests/org.eclipse.ease.ui.test/pom.xml
23:08:33 [2020-10-17T03:08:33.951Z] [WARNING] The project org.eclipse.ease:org.eclipse.ease.releng:pom:0.8.0-SNAPSHOT uses prerequisites which is only intended for maven-plugin projects but not for non maven-plugin projects. For such purposes you should use the maven-enforcer-plugin. See https://maven.apache.org/enforcer/enforcer-rules/requireMavenVersion.html
23:08:33 [2020-10-17T03:08:33.951Z] [WARNING] [jenkins-event-spy] Unexpected Maven project file name 'target-tests-pom.xml', problems may occur
23:08:33 [2020-10-17T03:08:33.951Z] [INFO] ------------------------------------------------------------------------
23:08:33 [2020-10-17T03:08:33.951Z] [INFO] Reactor Build Order:
23:08:33 [2020-10-17T03:08:33.951Z] [INFO] 
23:08:33 [2020-10-17T03:08:33.951Z] [INFO] org.eclipse.ease.releng                                            [pom]
23:08:33 [2020-10-17T03:08:33.951Z] [INFO] org.eclipse.ease.releng.target               [eclipse-target-definition]
23:08:33 [2020-10-17T03:08:33.951Z] [INFO] org.eclipse.ease.test                              [eclipse-test-plugin]
23:08:33 [2020-10-17T03:08:33.951Z] [INFO] org.eclipse.ease.lang.javascript.nashorn.test      [eclipse-test-plugin]
23:08:33 [2020-10-17T03:08:33.951Z] [INFO] org.eclipse.ease.lang.javascript.rhino.test        [eclipse-test-plugin]
23:08:33 [2020-10-17T03:08:33.951Z] [INFO] org.eclipse.ease.lang.javascript.test              [eclipse-test-plugin]
23:08:33 [2020-10-17T03:08:33.951Z] [INFO] org.eclipse.ease.lang.python.test                  [eclipse-test-plugin]
23:08:33 [2020-10-17T03:08:33.951Z] [INFO] org.eclipse.ease.lang.python.jython.test           [eclipse-test-plugin]
23:08:33 [2020-10-17T03:08:33.951Z] [INFO] org.eclipse.ease.lang.python.py4j.test             [eclipse-test-plugin]
23:08:33 [2020-10-17T03:08:33.951Z] [INFO] org.eclipse.ease.lang.scriptarchive.test           [eclipse-test-plugin]
23:08:33 [2020-10-17T03:08:33.951Z] [INFO] org.eclipse.ease.ui.test                           [eclipse-test-plugin]
23:08:33 [2020-10-17T03:08:33.951Z] [WARNING] [jenkins-event-spy] Unexpected Maven project file name 'target-tests-pom.xml', problems may occur
23:08:33 [2020-10-17T03:08:33.951Z] [INFO] 
23:08:33 [2020-10-17T03:08:33.951Z] [INFO] --------------< org.eclipse.ease:org.eclipse.ease.releng >--------------
23:08:33 [2020-10-17T03:08:33.951Z] [INFO] Building org.eclipse.ease.releng 0.8.0-SNAPSHOT                   [1/11]
23:08:33 [2020-10-17T03:08:33.951Z] [INFO] --------------------------------[ pom ]---------------------------------
23:08:33 [2020-10-17T03:08:33.951Z] [WARNING] [jenkins-event-spy] Unexpected Maven project file name 'target-tests-pom.xml', problems may occur
23:08:33 [2020-10-17T03:08:33.951Z] [INFO] 
23:08:33 [2020-10-17T03:08:33.951Z] [INFO] ----------< org.eclipse.ease:org.eclipse.ease.releng.target >-----------
23:08:33 [2020-10-17T03:08:33.951Z] [INFO] Building org.eclipse.ease.releng.target 0.8.0-SNAPSHOT            [2/11]
23:08:33 [2020-10-17T03:08:33.952Z] [INFO] ---------------------[ eclipse-target-definition ]----------------------
23:08:33 [2020-10-17T03:08:33.952Z] [INFO] 
23:08:33 [2020-10-17T03:08:33.952Z] [INFO] --- tycho-source-plugin:1.5.0:plugin-source (plugin-source) @ org.eclipse.ease.releng.target ---
23:08:33 [2020-10-17T03:08:33.952Z] [INFO] 
23:08:33 [2020-10-17T03:08:33.952Z] [INFO] --- tycho-packaging-plugin:1.5.0:package-target-definition (default-package-target-definition) @ org.eclipse.ease.releng.target ---
23:08:34 [2020-10-17T03:08:34.208Z] [INFO] 
23:08:34 [2020-10-17T03:08:34.208Z] [INFO] --- tycho-source-feature-plugin:1.5.0:source-feature (source-feature) @ org.eclipse.ease.releng.target ---
23:08:34 [2020-10-17T03:08:34.208Z] [INFO] 
23:08:34 [2020-10-17T03:08:34.208Z] [INFO] --- tycho-p2-plugin:1.5.0:p2-metadata (attached-p2-metadata) @ org.eclipse.ease.releng.target ---
23:08:34 [2020-10-17T03:08:34.208Z] [INFO] 
23:08:34 [2020-10-17T03:08:34.208Z] [INFO] ---------------< org.eclipse.ease:org.eclipse.ease.test >---------------
23:08:34 [2020-10-17T03:08:34.208Z] [INFO] Building org.eclipse.ease.test 0.8.0-SNAPSHOT                     [3/11]
23:08:34 [2020-10-17T03:08:34.208Z] [INFO] ------------------------[ eclipse-test-plugin ]-------------------------
23:08:34 [2020-10-17T03:08:34.208Z] [INFO] 
23:08:34 [2020-10-17T03:08:34.208Z] [INFO] --- tycho-packaging-plugin:1.5.0:build-qualifier (default-build-qualifier) @ org.eclipse.ease.test ---
23:08:34 [2020-10-17T03:08:34.208Z] [INFO] The project's OSGi version is 0.8.0.I201910171213
23:08:34 [2020-10-17T03:08:34.208Z] [INFO] 
23:08:34 [2020-10-17T03:08:34.208Z] [INFO] --- tycho-packaging-plugin:1.5.0:validate-id (default-validate-id) @ org.eclipse.ease.test ---
23:08:34 [2020-10-17T03:08:34.208Z] [INFO] 
23:08:34 [2020-10-17T03:08:34.208Z] [INFO] --- tycho-packaging-plugin:1.5.0:validate-version (default-validate-version) @ org.eclipse.ease.test ---
23:08:34 [2020-10-17T03:08:34.208Z] [INFO] 
23:08:34 [2020-10-17T03:08:34.208Z] [INFO] --- maven-resources-plugin:2.4.3:resources (default-resources) @ org.eclipse.ease.test ---
23:08:34 [2020-10-17T03:08:34.480Z] [INFO] Using 'UTF-8' encoding to copy filtered resources.
23:08:34 [2020-10-17T03:08:34.480Z] [INFO] skip non existing resourceDirectory /home/jenkins/agent/workspace/ease.verify.core.target.luna/tests/org.eclipse.ease.test/src/main/resources
23:08:34 [2020-10-17T03:08:34.480Z] [INFO] 
23:08:34 [2020-10-17T03:08:34.480Z] [INFO] --- tycho-compiler-plugin:1.5.0:compile (default-compile) @ org.eclipse.ease.test ---
23:08:34 [2020-10-17T03:08:34.480Z] [INFO] Nothing to compile - all classes are up to date
23:08:34 [2020-10-17T03:08:34.480Z] [INFO] 
23:08:34 [2020-10-17T03:08:34.480Z] [INFO] --- maven-resources-plugin:2.4.3:testResources (default-testResources) @ org.eclipse.ease.test ---
23:08:34 [2020-10-17T03:08:34.480Z] [INFO] Using 'UTF-8' encoding to copy filtered resources.
23:08:34 [2020-10-17T03:08:34.480Z] [INFO] skip non existing resourceDirectory /home/jenkins/agent/workspace/ease.verify.core.target.luna/tests/org.eclipse.ease.test/src/test/resources
23:08:34 [2020-10-17T03:08:34.480Z] [INFO] 
23:08:34 [2020-10-17T03:08:34.480Z] [INFO] --- tycho-source-plugin:1.5.0:plugin-source (plugin-source) @ org.eclipse.ease.test ---
23:08:34 [2020-10-17T03:08:34.480Z] [INFO] Building jar: /home/jenkins/agent/workspace/ease.verify.core.target.luna/tests/org.eclipse.ease.test/target/org.eclipse.ease.test-0.8.0-SNAPSHOT-sources.jar
23:08:34 [2020-10-17T03:08:34.480Z] [INFO] 
23:08:34 [2020-10-17T03:08:34.480Z] [INFO] --- target-platform-configuration:1.5.0:target-platform (default-target-platform) @ org.eclipse.ease.test ---
23:08:34 [2020-10-17T03:08:34.735Z] [INFO] 
23:08:34 [2020-10-17T03:08:34.736Z] [INFO] --- tycho-packaging-plugin:1.5.0:package-plugin (default-package-plugin) @ org.eclipse.ease.test ---
23:08:34 [2020-10-17T03:08:34.736Z] [INFO] Building jar: /home/jenkins/agent/workspace/ease.verify.core.target.luna/tests/org.eclipse.ease.test/target/org.eclipse.ease.test-0.8.0-SNAPSHOT.jar
23:08:34 [2020-10-17T03:08:34.736Z] [INFO] 
23:08:34 [2020-10-17T03:08:34.736Z] [INFO] --- tycho-p2-plugin:1.5.0:p2-metadata-default (default-p2-metadata-default) @ org.eclipse.ease.test ---
23:08:34 [2020-10-17T03:08:34.736Z] [INFO] 
23:08:34 [2020-10-17T03:08:34.736Z] [INFO] --- tycho-source-feature-plugin:1.5.0:source-feature (source-feature) @ org.eclipse.ease.test ---
23:08:34 [2020-10-17T03:08:34.736Z] [INFO] 
23:08:34 [2020-10-17T03:08:34.736Z] [INFO] --- tycho-p2-plugin:1.5.0:p2-metadata (attached-p2-metadata) @ org.eclipse.ease.test ---
23:08:34 [2020-10-17T03:08:34.736Z] [INFO] 
23:08:34 [2020-10-17T03:08:34.736Z] [INFO] --- tycho-surefire-plugin:1.5.0:test (default-test) @ org.eclipse.ease.test ---
23:08:34 [2020-10-17T03:08:34.736Z] [INFO] Expected eclipse log file: /home/jenkins/agent/workspace/ease.verify.core.target.luna/tests/org.eclipse.ease.test/target/work/data/.metadata/.log
23:08:34 [2020-10-17T03:08:34.736Z] [INFO] Command line:
23:08:34 [2020-10-17T03:08:34.736Z] 	[/opt/tools/java/openjdk/jdk-11/11.0.2+9/bin/java, -Dosgi.noShutdown=false, -Dosgi.os=linux, -Dosgi.ws=gtk, -Dosgi.arch=x86_64, -Dosgi.clean=true, -jar, /home/jenkins/.m2/repository/p2/osgi/bundle/org.eclipse.equinox.launcher/1.3.0.v20140415-2008/org.eclipse.equinox.launcher-1.3.0.v20140415-2008.jar, -data, /home/jenkins/agent/workspace/ease.verify.core.target.luna/tests/org.eclipse.ease.test/target/work/data, -install, /home/jenkins/agent/workspace/ease.verify.core.target.luna/tests/org.eclipse.ease.test/target/work, -configuration, /home/jenkins/agent/workspace/ease.verify.core.target.luna/tests/org.eclipse.ease.test/target/work/configuration, -application, org.eclipse.tycho.surefire.osgibooter.headlesstest, -testproperties, /home/jenkins/agent/workspace/ease.verify.core.target.luna/tests/org.eclipse.ease.test/target/surefire.properties]
23:08:34 [2020-10-17T03:08:34.736Z] Picked up JAVA_TOOL_OPTIONS: -Dmaven.ext.class.path="/home/jenkins/agent/workspace/ease.verify.core.target.luna@tmp/withMaven3aee9d47/pipeline-maven-spy.jar" -Dorg.jenkinsci.plugins.pipeline.maven.reportsFolder="/home/jenkins/agent/workspace/ease.verify.core.target.luna@tmp/withMaven3aee9d47" 
23:08:34 [2020-10-17T03:08:34.991Z] WARNING: An illegal reflective access operation has occurred
23:08:34 [2020-10-17T03:08:34.991Z] WARNING: Illegal reflective access by org.eclipse.osgi.storage.FrameworkExtensionInstaller (file:/home/jenkins/.m2/repository/p2/osgi/bundle/org.eclipse.osgi/3.10.2.v20150203-1939/org.eclipse.osgi-3.10.2.v20150203-1939.jar) to method java.net.URLClassLoader.addURL(java.net.URL)
23:08:34 [2020-10-17T03:08:34.991Z] WARNING: Please consider reporting this to the maintainers of org.eclipse.osgi.storage.FrameworkExtensionInstaller
23:08:34 [2020-10-17T03:08:34.992Z] WARNING: Use --illegal-access=warn to enable warnings of further illegal reflective access operations
23:08:34 [2020-10-17T03:08:34.992Z] WARNING: All illegal access operations will be denied in a future release
23:08:36 [2020-10-17T03:08:36.941Z] An error has occurred. See the log file
23:08:36 [2020-10-17T03:08:36.941Z] /home/jenkins/agent/workspace/ease.verify.core.target.luna/tests/org.eclipse.ease.test/target/work/configuration/1602904114935.log.
23:08:36 [2020-10-17T03:08:36.941Z] [INFO] ------------------------------------------------------------------------
23:08:36 [2020-10-17T03:08:36.941Z] [INFO] Reactor Summary for org.eclipse.ease.releng 0.8.0-SNAPSHOT:
23:08:36 [2020-10-17T03:08:36.941Z] [INFO] 
23:08:36 [2020-10-17T03:08:36.941Z] [INFO] org.eclipse.ease.releng ............................ SUCCESS [  0.001 s]
23:08:36 [2020-10-17T03:08:36.941Z] [INFO] org.eclipse.ease.releng.target ..................... SUCCESS [  0.139 s]
23:08:36 [2020-10-17T03:08:36.941Z] [INFO] org.eclipse.ease.test .............................. FAILURE [  2.611 s]
23:08:36 [2020-10-17T03:08:36.941Z] [INFO] org.eclipse.ease.lang.javascript.nashorn.test ...... SKIPPED
23:08:36 [2020-10-17T03:08:36.941Z] [INFO] org.eclipse.ease.lang.javascript.rhino.test ........ SKIPPED
23:08:36 [2020-10-17T03:08:36.941Z] [INFO] org.eclipse.ease.lang.javascript.test .............. SKIPPED
23:08:36 [2020-10-17T03:08:36.941Z] [INFO] org.eclipse.ease.lang.python.test .................. SKIPPED
23:08:36 [2020-10-17T03:08:36.941Z] [INFO] org.eclipse.ease.lang.python.jython.test ........... SKIPPED
23:08:36 [2020-10-17T03:08:36.941Z] [INFO] org.eclipse.ease.lang.python.py4j.test ............. SKIPPED
23:08:36 [2020-10-17T03:08:36.941Z] [INFO] org.eclipse.ease.lang.scriptarchive.test ........... SKIPPED
23:08:36 [2020-10-17T03:08:36.941Z] [INFO] org.eclipse.ease.ui.test ........................... SKIPPED
23:08:36 [2020-10-17T03:08:36.941Z] [INFO] ------------------------------------------------------------------------
23:08:36 [2020-10-17T03:08:36.941Z] [INFO] BUILD FAILURE
23:08:36 [2020-10-17T03:08:36.941Z] [INFO] ------------------------------------------------------------------------
23:08:36 [2020-10-17T03:08:36.941Z] [INFO] Total time:  47.433 s
23:08:36 [2020-10-17T03:08:36.941Z] [INFO] Finished at: 2020-10-17T03:08:36Z
23:08:36 [2020-10-17T03:08:36.941Z] [INFO] ------------------------------------------------------------------------
23:08:36 [2020-10-17T03:08:36.941Z] [WARNING] [jenkins-event-spy] Unexpected Maven project file name 'target-tests-pom.xml', problems may occur
23:08:36 [2020-10-17T03:08:36.941Z] [INFO] [jenkins-event-spy] Generated /home/jenkins/agent/workspace/ease.verify.core.target.luna@tmp/withMaven3aee9d47/maven-spy-20201017-030749-14317868171530565580487.log
23:08:36 [2020-10-17T03:08:36.941Z] [ERROR] Failed to execute goal org.eclipse.tycho:tycho-surefire-plugin:1.5.0:test (default-test) on project org.eclipse.ease.test: An unexpected error occured while launching the test runtime (return code 13). See log /home/jenkins/agent/workspace/ease.verify.core.target.luna/tests/org.eclipse.ease.test/target/work/data/.metadata/.log for details. -> [Help 1]
23:08:36 [2020-10-17T03:08:36.941Z] [ERROR] 
23:08:36 [2020-10-17T03:08:36.941Z] [ERROR] To see the full stack trace of the errors, re-run Maven with the -e switch.
23:08:36 [2020-10-17T03:08:36.941Z] [ERROR] Re-run Maven using the -X switch to enable full debug logging.
23:08:36 [2020-10-17T03:08:36.941Z] [ERROR] 
23:08:36 [2020-10-17T03:08:36.941Z] [ERROR] For more information about the errors and possible solutions, please read the following articles:
23:08:36 [2020-10-17T03:08:36.942Z] [ERROR] [Help 1] http://cwiki.apache.org/confluence/display/MAVEN/MojoFailureException
23:08:36 [2020-10-17T03:08:36.942Z] [ERROR] 
23:08:36 [2020-10-17T03:08:36.942Z] [ERROR] After correcting the problems, you can resume the build with the command
23:08:36 [2020-10-17T03:08:36.942Z] [ERROR]   mvn <args> -rf :org.eclipse.ease.test
[Pipeline] }
23:08:37 [2020-10-17T03:08:37.224Z] [withMaven] Publishers: 
[Pipeline] // withMaven
[Pipeline] }
[Pipeline] // stage
[Pipeline] stage
[Pipeline] { (Declarative: Post Actions)
[Pipeline] archiveArtifacts
23:08:37 [2020-10-17T03:08:37.251Z] Archiving artifacts
[Pipeline] emailext
23:08:48 [2020-10-17T03:08:48.170Z] Sending email to: christian.pontesegger@web.de
[Pipeline] }
[Pipeline] // stage
[Pipeline] }
[Pipeline] // timeout
[Pipeline] }
[Pipeline] // timestamps
[Pipeline] }
[Pipeline] // node
[Pipeline] End of Pipeline
ERROR: script returned exit code 1
Finished: FAILURE