FailedConsole Output

Skipping 606 KB.. Full Log
] [INFO] --- maven-install-plugin:2.3.1:install (default-install) @ org.eclipse.ease.test ---
20:31:54 [2020-08-29T00:31:54.883Z] [INFO] Installing /home/jenkins/agent/workspace/ease.verify.core.target.2020-03/tests/org.eclipse.ease.test/target/org.eclipse.ease.test-0.8.0-SNAPSHOT.jar to /home/jenkins/.m2/repository/org/eclipse/ease/org.eclipse.ease.test/0.8.0-SNAPSHOT/org.eclipse.ease.test-0.8.0-SNAPSHOT.jar
20:31:54 [2020-08-29T00:31:54.883Z] [INFO] Installing /home/jenkins/agent/workspace/ease.verify.core.target.2020-03/tests/org.eclipse.ease.test/pom.xml to /home/jenkins/.m2/repository/org/eclipse/ease/org.eclipse.ease.test/0.8.0-SNAPSHOT/org.eclipse.ease.test-0.8.0-SNAPSHOT.pom
20:31:54 [2020-08-29T00:31:54.883Z] [INFO] Installing /home/jenkins/agent/workspace/ease.verify.core.target.2020-03/tests/org.eclipse.ease.test/target/org.eclipse.ease.test-0.8.0-SNAPSHOT-sources.jar to /home/jenkins/.m2/repository/org/eclipse/ease/org.eclipse.ease.test/0.8.0-SNAPSHOT/org.eclipse.ease.test-0.8.0-SNAPSHOT-sources.jar
20:31:54 [2020-08-29T00:31:54.883Z] [INFO] Installing /home/jenkins/agent/workspace/ease.verify.core.target.2020-03/tests/org.eclipse.ease.test/target/p2content.xml to /home/jenkins/.m2/repository/org/eclipse/ease/org.eclipse.ease.test/0.8.0-SNAPSHOT/org.eclipse.ease.test-0.8.0-SNAPSHOT-p2metadata.xml
20:31:54 [2020-08-29T00:31:54.883Z] [INFO] Installing /home/jenkins/agent/workspace/ease.verify.core.target.2020-03/tests/org.eclipse.ease.test/target/p2artifacts.xml to /home/jenkins/.m2/repository/org/eclipse/ease/org.eclipse.ease.test/0.8.0-SNAPSHOT/org.eclipse.ease.test-0.8.0-SNAPSHOT-p2artifacts.xml
20:31:54 [2020-08-29T00:31:54.883Z] [INFO] Installing /home/jenkins/agent/workspace/ease.verify.core.target.2020-03/tests/org.eclipse.ease.test/target/p2content.xml to /home/jenkins/.m2/repository/org/eclipse/ease/org.eclipse.ease.test/0.8.0-SNAPSHOT/org.eclipse.ease.test-0.8.0-SNAPSHOT-p2metadata.xml
20:31:54 [2020-08-29T00:31:54.883Z] [INFO] Installing /home/jenkins/agent/workspace/ease.verify.core.target.2020-03/tests/org.eclipse.ease.test/target/p2artifacts.xml to /home/jenkins/.m2/repository/org/eclipse/ease/org.eclipse.ease.test/0.8.0-SNAPSHOT/org.eclipse.ease.test-0.8.0-SNAPSHOT-p2artifacts.xml
20:31:54 [2020-08-29T00:31:54.883Z] [INFO] 
20:31:54 [2020-08-29T00:31:54.883Z] [INFO] --- tycho-p2-plugin:1.3.0:update-local-index (default-update-local-index) @ org.eclipse.ease.test ---
20:31:54 [2020-08-29T00:31:54.883Z] [INFO] 
20:31:54 [2020-08-29T00:31:54.883Z] [INFO] ---< org.eclipse.ease:org.eclipse.ease.lang.javascript.nashorn.test >---
20:31:54 [2020-08-29T00:31:54.883Z] [INFO] Building org.eclipse.ease.lang.javascript.nashorn.test 0.8.0-SNAPSHOT [39/48]
20:31:54 [2020-08-29T00:31:54.883Z] [INFO] ------------------------[ eclipse-test-plugin ]-------------------------
20:31:54 [2020-08-29T00:31:54.883Z] [INFO] 
20:31:54 [2020-08-29T00:31:54.883Z] [INFO] --- maven-clean-plugin:2.5:clean (default-clean) @ org.eclipse.ease.lang.javascript.nashorn.test ---
20:31:54 [2020-08-29T00:31:54.883Z] [INFO] 
20:31:54 [2020-08-29T00:31:54.883Z] [INFO] --- tycho-packaging-plugin:1.3.0:build-qualifier (default-build-qualifier) @ org.eclipse.ease.lang.javascript.nashorn.test ---
20:31:54 [2020-08-29T00:31:54.883Z] [INFO] The project's OSGi version is 0.8.0.I201910171213
20:31:54 [2020-08-29T00:31:54.883Z] [INFO] 
20:31:54 [2020-08-29T00:31:54.883Z] [INFO] --- tycho-packaging-plugin:1.3.0:validate-id (default-validate-id) @ org.eclipse.ease.lang.javascript.nashorn.test ---
20:31:54 [2020-08-29T00:31:54.883Z] [INFO] 
20:31:54 [2020-08-29T00:31:54.883Z] [INFO] --- tycho-packaging-plugin:1.3.0:validate-version (default-validate-version) @ org.eclipse.ease.lang.javascript.nashorn.test ---
20:31:54 [2020-08-29T00:31:54.883Z] [INFO] 
20:31:54 [2020-08-29T00:31:54.883Z] [INFO] >>> maven-javadoc-plugin:2.9.1:javadoc (build-docs) > generate-sources @ org.eclipse.ease.lang.javascript.nashorn.test >>>
20:31:54 [2020-08-29T00:31:54.883Z] [INFO] 
20:31:54 [2020-08-29T00:31:54.883Z] [INFO] --- tycho-packaging-plugin:1.3.0:build-qualifier (default-build-qualifier) @ org.eclipse.ease.lang.javascript.nashorn.test ---
20:31:54 [2020-08-29T00:31:54.883Z] [INFO] The project's OSGi version is 0.8.0.I201910171213
20:31:54 [2020-08-29T00:31:54.884Z] [INFO] 
20:31:54 [2020-08-29T00:31:54.884Z] [INFO] --- tycho-packaging-plugin:1.3.0:validate-id (default-validate-id) @ org.eclipse.ease.lang.javascript.nashorn.test ---
20:31:54 [2020-08-29T00:31:54.884Z] [INFO] 
20:31:54 [2020-08-29T00:31:54.884Z] [INFO] --- tycho-packaging-plugin:1.3.0:validate-version (default-validate-version) @ org.eclipse.ease.lang.javascript.nashorn.test ---
20:31:54 [2020-08-29T00:31:54.884Z] [INFO] 
20:31:54 [2020-08-29T00:31:54.884Z] [INFO] <<< maven-javadoc-plugin:2.9.1:javadoc (build-docs) < generate-sources @ org.eclipse.ease.lang.javascript.nashorn.test <<<
20:31:54 [2020-08-29T00:31:54.884Z] [INFO] 
20:31:54 [2020-08-29T00:31:54.884Z] [INFO] 
20:31:54 [2020-08-29T00:31:54.884Z] [INFO] --- maven-javadoc-plugin:2.9.1:javadoc (build-docs) @ org.eclipse.ease.lang.javascript.nashorn.test ---
20:31:54 [2020-08-29T00:31:54.884Z] [ERROR] Error fetching link: http://help.eclipse.org/oxygen/topic/org.eclipse.platform.doc.isv/reference/api/package-list. Ignored it.
20:31:56 [2020-08-29T00:31:56.247Z] [INFO] 
20:31:56 [2020-08-29T00:31:56.247Z] Loading source files for package org.eclipse.ease.lang.javascript.nashorn...
20:31:56 [2020-08-29T00:31:56.247Z] Constructing Javadoc information...
20:31:56 [2020-08-29T00:31:56.247Z] WARNING: Cannot open location "/home/jenkins/agent/workspace/ease.verify.core.target.2020-03/tests/org.eclipse.ease.lang.javascript.nashorn.test/target/javadoc-bundle-options/package-list"
20:31:56 [2020-08-29T00:31:56.247Z] No plugin definition found, skipping
20:31:56 [2020-08-29T00:31:56.247Z] No plugin definition found, skipping
20:31:56 [2020-08-29T00:31:56.247Z] [WARNING] Javadoc Warnings
20:31:56 [2020-08-29T00:31:56.247Z] [WARNING] Picked up JAVA_TOOL_OPTIONS: -Dmaven.ext.class.path="/home/jenkins/agent/workspace/ease.verify.core.target.2020-03@tmp/withMavenfca47c90/pipeline-maven-spy.jar" -Dorg.jenkinsci.plugins.pipeline.maven.reportsFolder="/home/jenkins/agent/workspace/ease.verify.core.target.2020-03@tmp/withMavenfca47c90"
20:31:56 [2020-08-29T00:31:56.247Z] [INFO] 
20:31:56 [2020-08-29T00:31:56.247Z] [INFO] --- build-helper-maven-plugin:1.9.1:add-resource (add_help) @ org.eclipse.ease.lang.javascript.nashorn.test ---
20:31:56 [2020-08-29T00:31:56.247Z] [INFO] 
20:31:56 [2020-08-29T00:31:56.247Z] [INFO] --- maven-resources-plugin:2.4.3:resources (default-resources) @ org.eclipse.ease.lang.javascript.nashorn.test ---
20:31:56 [2020-08-29T00:31:56.247Z] [INFO] Using 'UTF-8' encoding to copy filtered resources.
20:31:56 [2020-08-29T00:31:56.247Z] [INFO] skip non existing resourceDirectory /home/jenkins/agent/workspace/ease.verify.core.target.2020-03/tests/org.eclipse.ease.lang.javascript.nashorn.test/src/main/resources
20:31:56 [2020-08-29T00:31:56.247Z] [INFO] skip non existing resourceDirectory /home/jenkins/agent/workspace/ease.verify.core.target.2020-03/tests/org.eclipse.ease.lang.javascript.nashorn.test/help
20:31:56 [2020-08-29T00:31:56.247Z] [INFO] 
20:31:56 [2020-08-29T00:31:56.247Z] [INFO] --- tycho-compiler-plugin:1.3.0:compile (default-compile) @ org.eclipse.ease.lang.javascript.nashorn.test ---
20:31:56 [2020-08-29T00:31:56.247Z] [INFO] Compiling 1 source file to /home/jenkins/agent/workspace/ease.verify.core.target.2020-03/tests/org.eclipse.ease.lang.javascript.nashorn.test/target/classes
20:31:56 [2020-08-29T00:31:56.247Z] [INFO] 
20:31:56 [2020-08-29T00:31:56.247Z] [INFO] --- maven-resources-plugin:2.4.3:testResources (default-testResources) @ org.eclipse.ease.lang.javascript.nashorn.test ---
20:31:56 [2020-08-29T00:31:56.247Z] [INFO] Using 'UTF-8' encoding to copy filtered resources.
20:31:56 [2020-08-29T00:31:56.247Z] [INFO] skip non existing resourceDirectory /home/jenkins/agent/workspace/ease.verify.core.target.2020-03/tests/org.eclipse.ease.lang.javascript.nashorn.test/src/test/resources
20:31:56 [2020-08-29T00:31:56.247Z] [INFO] 
20:31:56 [2020-08-29T00:31:56.247Z] [INFO] --- tycho-source-plugin:1.3.0:plugin-source (plugin-source) @ org.eclipse.ease.lang.javascript.nashorn.test ---
20:31:56 [2020-08-29T00:31:56.247Z] [WARNING] Bundle-Vendor header not found in /home/jenkins/agent/workspace/ease.verify.core.target.2020-03/tests/org.eclipse.ease.lang.javascript.nashorn.test/META-INF/MANIFEST.MF, fallback to 'unknown' for source bundle
20:31:56 [2020-08-29T00:31:56.247Z] [INFO] Building jar: /home/jenkins/agent/workspace/ease.verify.core.target.2020-03/tests/org.eclipse.ease.lang.javascript.nashorn.test/target/org.eclipse.ease.lang.javascript.nashorn.test-0.8.0-SNAPSHOT-sources.jar
20:31:56 [2020-08-29T00:31:56.247Z] [INFO] 
20:31:56 [2020-08-29T00:31:56.247Z] [INFO] --- target-platform-configuration:1.3.0:target-platform (default-target-platform) @ org.eclipse.ease.lang.javascript.nashorn.test ---
20:31:56 [2020-08-29T00:31:56.247Z] [INFO] 
20:31:56 [2020-08-29T00:31:56.247Z] [INFO] --- tycho-packaging-plugin:1.3.0:package-plugin (default-package-plugin) @ org.eclipse.ease.lang.javascript.nashorn.test ---
20:31:56 [2020-08-29T00:31:56.247Z] [INFO] Building jar: /home/jenkins/agent/workspace/ease.verify.core.target.2020-03/tests/org.eclipse.ease.lang.javascript.nashorn.test/target/org.eclipse.ease.lang.javascript.nashorn.test-0.8.0-SNAPSHOT.jar
20:31:56 [2020-08-29T00:31:56.247Z] [INFO] 
20:31:56 [2020-08-29T00:31:56.247Z] [INFO] --- tycho-p2-plugin:1.3.0:p2-metadata-default (default-p2-metadata-default) @ org.eclipse.ease.lang.javascript.nashorn.test ---
20:31:56 [2020-08-29T00:31:56.247Z] [INFO] 
20:31:56 [2020-08-29T00:31:56.247Z] [INFO] --- tycho-source-feature-plugin:1.3.0:source-feature (source-feature) @ org.eclipse.ease.lang.javascript.nashorn.test ---
20:31:56 [2020-08-29T00:31:56.247Z] [INFO] 
20:31:56 [2020-08-29T00:31:56.247Z] [INFO] --- tycho-p2-plugin:1.3.0:p2-metadata (attached-p2-metadata) @ org.eclipse.ease.lang.javascript.nashorn.test ---
20:31:56 [2020-08-29T00:31:56.247Z] [INFO] 
20:31:56 [2020-08-29T00:31:56.247Z] [INFO] --- tycho-surefire-plugin:1.3.0:test (default-test) @ org.eclipse.ease.lang.javascript.nashorn.test ---
20:31:56 [2020-08-29T00:31:56.247Z] [INFO] Expected eclipse log file: /home/jenkins/agent/workspace/ease.verify.core.target.2020-03/tests/org.eclipse.ease.lang.javascript.nashorn.test/target/work/data/.metadata/.log
20:31:56 [2020-08-29T00:31:56.247Z] [INFO] Command line:
20:31:56 [2020-08-29T00:31:56.247Z] 	[/opt/tools/java/oracle/jdk-8/1.8.0_202/jre/bin/java, -Dosgi.noShutdown=false, -Dosgi.os=linux, -Dosgi.ws=gtk, -Dosgi.arch=x86_64, -Dosgi.clean=true, -jar, /home/jenkins/.m2/repository/p2/osgi/bundle/org.eclipse.equinox.launcher/1.5.700.v20200207-2156/org.eclipse.equinox.launcher-1.5.700.v20200207-2156.jar, -data, /home/jenkins/agent/workspace/ease.verify.core.target.2020-03/tests/org.eclipse.ease.lang.javascript.nashorn.test/target/work/data, -install, /home/jenkins/agent/workspace/ease.verify.core.target.2020-03/tests/org.eclipse.ease.lang.javascript.nashorn.test/target/work, -configuration, /home/jenkins/agent/workspace/ease.verify.core.target.2020-03/tests/org.eclipse.ease.lang.javascript.nashorn.test/target/work/configuration, -application, org.eclipse.tycho.surefire.osgibooter.headlesstest, -testproperties, /home/jenkins/agent/workspace/ease.verify.core.target.2020-03/tests/org.eclipse.ease.lang.javascript.nashorn.test/target/surefire.properties]
20:31:56 [2020-08-29T00:31:56.248Z] Picked up JAVA_TOOL_OPTIONS: -Dmaven.ext.class.path="/home/jenkins/agent/workspace/ease.verify.core.target.2020-03@tmp/withMavenfca47c90/pipeline-maven-spy.jar" -Dorg.jenkinsci.plugins.pipeline.maven.reportsFolder="/home/jenkins/agent/workspace/ease.verify.core.target.2020-03@tmp/withMavenfca47c90" 
20:31:57 [2020-08-29T00:31:57.622Z] Running org.eclipse.ease.lang.javascript.nashorn.NashornEnvironmentTest
20:31:58 [2020-08-29T00:31:58.185Z] Tests run: 5, Failures: 0, Errors: 0, Skipped: 0, Time elapsed: 0.691 s - in org.eclipse.ease.lang.javascript.nashorn.NashornEnvironmentTest
20:31:58 [2020-08-29T00:31:58.185Z] reloadEnvironment(org.eclipse.ease.lang.javascript.nashorn.NashornEnvironmentTest)  Time elapsed: 0.42 s
20:31:58 [2020-08-29T00:31:58.185Z] bootstrappedEnvironment(org.eclipse.ease.lang.javascript.nashorn.NashornEnvironmentTest)  Time elapsed: 0.023 s
20:31:58 [2020-08-29T00:31:58.185Z] postMethodCallback(org.eclipse.ease.lang.javascript.nashorn.NashornEnvironmentTest)  Time elapsed: 0.11 s
20:31:58 [2020-08-29T00:31:58.185Z] preMethodCallback(org.eclipse.ease.lang.javascript.nashorn.NashornEnvironmentTest)  Time elapsed: 0.049 s
20:31:58 [2020-08-29T00:31:58.185Z] reloadFunctionDefinitions(org.eclipse.ease.lang.javascript.nashorn.NashornEnvironmentTest)  Time elapsed: 0.047 s
20:31:58 [2020-08-29T00:31:58.185Z] 
20:31:58 [2020-08-29T00:31:58.185Z] Results:
20:31:58 [2020-08-29T00:31:58.185Z] 
20:31:58 [2020-08-29T00:31:58.185Z] Tests run: 5, Failures: 0, Errors: 0, Skipped: 0
20:31:58 [2020-08-29T00:31:58.185Z] 
20:31:58 [2020-08-29T00:31:58.746Z] [INFO] All tests passed!
20:31:58 [2020-08-29T00:31:58.746Z] [INFO] 
20:31:58 [2020-08-29T00:31:58.746Z] [INFO] --- maven-install-plugin:2.3.1:install (default-install) @ org.eclipse.ease.lang.javascript.nashorn.test ---
20:31:58 [2020-08-29T00:31:58.746Z] [INFO] Installing /home/jenkins/agent/workspace/ease.verify.core.target.2020-03/tests/org.eclipse.ease.lang.javascript.nashorn.test/target/org.eclipse.ease.lang.javascript.nashorn.test-0.8.0-SNAPSHOT.jar to /home/jenkins/.m2/repository/org/eclipse/ease/org.eclipse.ease.lang.javascript.nashorn.test/0.8.0-SNAPSHOT/org.eclipse.ease.lang.javascript.nashorn.test-0.8.0-SNAPSHOT.jar
20:31:58 [2020-08-29T00:31:58.746Z] [INFO] Installing /home/jenkins/agent/workspace/ease.verify.core.target.2020-03/tests/org.eclipse.ease.lang.javascript.nashorn.test/pom.xml to /home/jenkins/.m2/repository/org/eclipse/ease/org.eclipse.ease.lang.javascript.nashorn.test/0.8.0-SNAPSHOT/org.eclipse.ease.lang.javascript.nashorn.test-0.8.0-SNAPSHOT.pom
20:31:58 [2020-08-29T00:31:58.746Z] [INFO] Installing /home/jenkins/agent/workspace/ease.verify.core.target.2020-03/tests/org.eclipse.ease.lang.javascript.nashorn.test/target/org.eclipse.ease.lang.javascript.nashorn.test-0.8.0-SNAPSHOT-sources.jar to /home/jenkins/.m2/repository/org/eclipse/ease/org.eclipse.ease.lang.javascript.nashorn.test/0.8.0-SNAPSHOT/org.eclipse.ease.lang.javascript.nashorn.test-0.8.0-SNAPSHOT-sources.jar
20:31:58 [2020-08-29T00:31:58.746Z] [INFO] Installing /home/jenkins/agent/workspace/ease.verify.core.target.2020-03/tests/org.eclipse.ease.lang.javascript.nashorn.test/target/p2content.xml to /home/jenkins/.m2/repository/org/eclipse/ease/org.eclipse.ease.lang.javascript.nashorn.test/0.8.0-SNAPSHOT/org.eclipse.ease.lang.javascript.nashorn.test-0.8.0-SNAPSHOT-p2metadata.xml
20:31:58 [2020-08-29T00:31:58.746Z] [INFO] Installing /home/jenkins/agent/workspace/ease.verify.core.target.2020-03/tests/org.eclipse.ease.lang.javascript.nashorn.test/target/p2artifacts.xml to /home/jenkins/.m2/repository/org/eclipse/ease/org.eclipse.ease.lang.javascript.nashorn.test/0.8.0-SNAPSHOT/org.eclipse.ease.lang.javascript.nashorn.test-0.8.0-SNAPSHOT-p2artifacts.xml
20:31:58 [2020-08-29T00:31:58.746Z] [INFO] Installing /home/jenkins/agent/workspace/ease.verify.core.target.2020-03/tests/org.eclipse.ease.lang.javascript.nashorn.test/target/p2content.xml to /home/jenkins/.m2/repository/org/eclipse/ease/org.eclipse.ease.lang.javascript.nashorn.test/0.8.0-SNAPSHOT/org.eclipse.ease.lang.javascript.nashorn.test-0.8.0-SNAPSHOT-p2metadata.xml
20:31:58 [2020-08-29T00:31:58.746Z] [INFO] Installing /home/jenkins/agent/workspace/ease.verify.core.target.2020-03/tests/org.eclipse.ease.lang.javascript.nashorn.test/target/p2artifacts.xml to /home/jenkins/.m2/repository/org/eclipse/ease/org.eclipse.ease.lang.javascript.nashorn.test/0.8.0-SNAPSHOT/org.eclipse.ease.lang.javascript.nashorn.test-0.8.0-SNAPSHOT-p2artifacts.xml
20:31:58 [2020-08-29T00:31:58.746Z] [INFO] 
20:31:58 [2020-08-29T00:31:58.746Z] [INFO] --- tycho-p2-plugin:1.3.0:update-local-index (default-update-local-index) @ org.eclipse.ease.lang.javascript.nashorn.test ---
20:31:58 [2020-08-29T00:31:58.746Z] [INFO] 
20:31:58 [2020-08-29T00:31:58.746Z] [INFO] ----< org.eclipse.ease:org.eclipse.ease.lang.javascript.rhino.test >----
20:31:58 [2020-08-29T00:31:58.746Z] [INFO] Building org.eclipse.ease.lang.javascript.rhino.test 0.8.0-SNAPSHOT [40/48]
20:31:58 [2020-08-29T00:31:58.746Z] [INFO] ------------------------[ eclipse-test-plugin ]-------------------------
20:31:58 [2020-08-29T00:31:58.746Z] [INFO] 
20:31:58 [2020-08-29T00:31:58.746Z] [INFO] --- maven-clean-plugin:2.5:clean (default-clean) @ org.eclipse.ease.lang.javascript.rhino.test ---
20:31:58 [2020-08-29T00:31:58.746Z] [INFO] 
20:31:58 [2020-08-29T00:31:58.746Z] [INFO] --- tycho-packaging-plugin:1.3.0:build-qualifier (default-build-qualifier) @ org.eclipse.ease.lang.javascript.rhino.test ---
20:31:58 [2020-08-29T00:31:58.746Z] [INFO] The project's OSGi version is 0.8.0.I201911291239
20:31:58 [2020-08-29T00:31:58.746Z] [INFO] 
20:31:58 [2020-08-29T00:31:58.746Z] [INFO] --- tycho-packaging-plugin:1.3.0:validate-id (default-validate-id) @ org.eclipse.ease.lang.javascript.rhino.test ---
20:31:58 [2020-08-29T00:31:58.746Z] [INFO] 
20:31:58 [2020-08-29T00:31:58.747Z] [INFO] --- tycho-packaging-plugin:1.3.0:validate-version (default-validate-version) @ org.eclipse.ease.lang.javascript.rhino.test ---
20:31:58 [2020-08-29T00:31:58.747Z] [INFO] 
20:31:58 [2020-08-29T00:31:58.747Z] [INFO] >>> maven-javadoc-plugin:2.9.1:javadoc (build-docs) > generate-sources @ org.eclipse.ease.lang.javascript.rhino.test >>>
20:31:58 [2020-08-29T00:31:58.747Z] [INFO] 
20:31:58 [2020-08-29T00:31:58.747Z] [INFO] --- tycho-packaging-plugin:1.3.0:build-qualifier (default-build-qualifier) @ org.eclipse.ease.lang.javascript.rhino.test ---
20:31:58 [2020-08-29T00:31:58.747Z] [INFO] The project's OSGi version is 0.8.0.I201911291239
20:31:58 [2020-08-29T00:31:58.747Z] [INFO] 
20:31:58 [2020-08-29T00:31:58.747Z] [INFO] --- tycho-packaging-plugin:1.3.0:validate-id (default-validate-id) @ org.eclipse.ease.lang.javascript.rhino.test ---
20:31:58 [2020-08-29T00:31:58.747Z] [INFO] 
20:31:58 [2020-08-29T00:31:58.747Z] [INFO] --- tycho-packaging-plugin:1.3.0:validate-version (default-validate-version) @ org.eclipse.ease.lang.javascript.rhino.test ---
20:31:58 [2020-08-29T00:31:58.747Z] [INFO] 
20:31:58 [2020-08-29T00:31:58.747Z] [INFO] <<< maven-javadoc-plugin:2.9.1:javadoc (build-docs) < generate-sources @ org.eclipse.ease.lang.javascript.rhino.test <<<
20:31:58 [2020-08-29T00:31:58.747Z] [INFO] 
20:31:58 [2020-08-29T00:31:58.747Z] [INFO] 
20:31:58 [2020-08-29T00:31:58.747Z] [INFO] --- maven-javadoc-plugin:2.9.1:javadoc (build-docs) @ org.eclipse.ease.lang.javascript.rhino.test ---
20:31:58 [2020-08-29T00:31:58.747Z] [ERROR] Error fetching link: http://help.eclipse.org/oxygen/topic/org.eclipse.platform.doc.isv/reference/api/package-list. Ignored it.
20:32:00 [2020-08-29T00:32:00.110Z] [INFO] 
20:32:00 [2020-08-29T00:32:00.110Z] Loading source files for package org.eclipse.ease.lang.javascript.rhino...
20:32:00 [2020-08-29T00:32:00.110Z] Constructing Javadoc information...
20:32:00 [2020-08-29T00:32:00.110Z] WARNING: Cannot open location "/home/jenkins/agent/workspace/ease.verify.core.target.2020-03/tests/org.eclipse.ease.lang.javascript.rhino.test/target/javadoc-bundle-options/package-list"
20:32:00 [2020-08-29T00:32:00.110Z] No plugin definition found, skipping
20:32:00 [2020-08-29T00:32:00.110Z] No plugin definition found, skipping
20:32:00 [2020-08-29T00:32:00.110Z] [WARNING] Javadoc Warnings
20:32:00 [2020-08-29T00:32:00.111Z] [WARNING] Picked up JAVA_TOOL_OPTIONS: -Dmaven.ext.class.path="/home/jenkins/agent/workspace/ease.verify.core.target.2020-03@tmp/withMavenfca47c90/pipeline-maven-spy.jar" -Dorg.jenkinsci.plugins.pipeline.maven.reportsFolder="/home/jenkins/agent/workspace/ease.verify.core.target.2020-03@tmp/withMavenfca47c90"
20:32:00 [2020-08-29T00:32:00.111Z] [INFO] 
20:32:00 [2020-08-29T00:32:00.111Z] [INFO] --- build-helper-maven-plugin:1.9.1:add-resource (add_help) @ org.eclipse.ease.lang.javascript.rhino.test ---
20:32:00 [2020-08-29T00:32:00.111Z] [INFO] 
20:32:00 [2020-08-29T00:32:00.111Z] [INFO] --- maven-resources-plugin:2.4.3:resources (default-resources) @ org.eclipse.ease.lang.javascript.rhino.test ---
20:32:00 [2020-08-29T00:32:00.111Z] [INFO] Using 'UTF-8' encoding to copy filtered resources.
20:32:00 [2020-08-29T00:32:00.111Z] [INFO] skip non existing resourceDirectory /home/jenkins/agent/workspace/ease.verify.core.target.2020-03/tests/org.eclipse.ease.lang.javascript.rhino.test/src/main/resources
20:32:00 [2020-08-29T00:32:00.111Z] [INFO] skip non existing resourceDirectory /home/jenkins/agent/workspace/ease.verify.core.target.2020-03/tests/org.eclipse.ease.lang.javascript.rhino.test/help
20:32:00 [2020-08-29T00:32:00.111Z] [INFO] 
20:32:00 [2020-08-29T00:32:00.111Z] [INFO] --- tycho-compiler-plugin:1.3.0:compile (default-compile) @ org.eclipse.ease.lang.javascript.rhino.test ---
20:32:00 [2020-08-29T00:32:00.111Z] [INFO] Compiling 4 source files to /home/jenkins/agent/workspace/ease.verify.core.target.2020-03/tests/org.eclipse.ease.lang.javascript.rhino.test/target/classes
20:32:00 [2020-08-29T00:32:00.111Z] [INFO] 
20:32:00 [2020-08-29T00:32:00.111Z] [INFO] --- maven-resources-plugin:2.4.3:testResources (default-testResources) @ org.eclipse.ease.lang.javascript.rhino.test ---
20:32:00 [2020-08-29T00:32:00.111Z] [INFO] Using 'UTF-8' encoding to copy filtered resources.
20:32:00 [2020-08-29T00:32:00.111Z] [INFO] skip non existing resourceDirectory /home/jenkins/agent/workspace/ease.verify.core.target.2020-03/tests/org.eclipse.ease.lang.javascript.rhino.test/src/test/resources
20:32:00 [2020-08-29T00:32:00.111Z] [INFO] 
20:32:00 [2020-08-29T00:32:00.111Z] [INFO] --- tycho-source-plugin:1.3.0:plugin-source (plugin-source) @ org.eclipse.ease.lang.javascript.rhino.test ---
20:32:00 [2020-08-29T00:32:00.111Z] [WARNING] Bundle-Vendor header not found in /home/jenkins/agent/workspace/ease.verify.core.target.2020-03/tests/org.eclipse.ease.lang.javascript.rhino.test/META-INF/MANIFEST.MF, fallback to 'unknown' for source bundle
20:32:00 [2020-08-29T00:32:00.111Z] [INFO] Building jar: /home/jenkins/agent/workspace/ease.verify.core.target.2020-03/tests/org.eclipse.ease.lang.javascript.rhino.test/target/org.eclipse.ease.lang.javascript.rhino.test-0.8.0-SNAPSHOT-sources.jar
20:32:00 [2020-08-29T00:32:00.111Z] [INFO] 
20:32:00 [2020-08-29T00:32:00.111Z] [INFO] --- target-platform-configuration:1.3.0:target-platform (default-target-platform) @ org.eclipse.ease.lang.javascript.rhino.test ---
20:32:00 [2020-08-29T00:32:00.111Z] [INFO] 
20:32:00 [2020-08-29T00:32:00.111Z] [INFO] --- tycho-packaging-plugin:1.3.0:package-plugin (default-package-plugin) @ org.eclipse.ease.lang.javascript.rhino.test ---
20:32:00 [2020-08-29T00:32:00.111Z] [INFO] Building jar: /home/jenkins/agent/workspace/ease.verify.core.target.2020-03/tests/org.eclipse.ease.lang.javascript.rhino.test/target/org.eclipse.ease.lang.javascript.rhino.test-0.8.0-SNAPSHOT.jar
20:32:00 [2020-08-29T00:32:00.111Z] [INFO] 
20:32:00 [2020-08-29T00:32:00.111Z] [INFO] --- tycho-p2-plugin:1.3.0:p2-metadata-default (default-p2-metadata-default) @ org.eclipse.ease.lang.javascript.rhino.test ---
20:32:00 [2020-08-29T00:32:00.111Z] [INFO] 
20:32:00 [2020-08-29T00:32:00.111Z] [INFO] --- tycho-source-feature-plugin:1.3.0:source-feature (source-feature) @ org.eclipse.ease.lang.javascript.rhino.test ---
20:32:00 [2020-08-29T00:32:00.111Z] [INFO] 
20:32:00 [2020-08-29T00:32:00.111Z] [INFO] --- tycho-p2-plugin:1.3.0:p2-metadata (attached-p2-metadata) @ org.eclipse.ease.lang.javascript.rhino.test ---
20:32:00 [2020-08-29T00:32:00.111Z] [INFO] 
20:32:00 [2020-08-29T00:32:00.111Z] [INFO] --- tycho-surefire-plugin:1.3.0:test (default-test) @ org.eclipse.ease.lang.javascript.rhino.test ---
20:32:00 [2020-08-29T00:32:00.367Z] [INFO] Expected eclipse log file: /home/jenkins/agent/workspace/ease.verify.core.target.2020-03/tests/org.eclipse.ease.lang.javascript.rhino.test/target/work/data/.metadata/.log
20:32:00 [2020-08-29T00:32:00.367Z] [INFO] Command line:
20:32:00 [2020-08-29T00:32:00.367Z] 	[/opt/tools/java/oracle/jdk-8/1.8.0_202/jre/bin/java, -Dosgi.noShutdown=false, -Dosgi.os=linux, -Dosgi.ws=gtk, -Dosgi.arch=x86_64, -Dosgi.clean=true, -jar, /home/jenkins/.m2/repository/p2/osgi/bundle/org.eclipse.equinox.launcher/1.5.700.v20200207-2156/org.eclipse.equinox.launcher-1.5.700.v20200207-2156.jar, -data, /home/jenkins/agent/workspace/ease.verify.core.target.2020-03/tests/org.eclipse.ease.lang.javascript.rhino.test/target/work/data, -install, /home/jenkins/agent/workspace/ease.verify.core.target.2020-03/tests/org.eclipse.ease.lang.javascript.rhino.test/target/work, -configuration, /home/jenkins/agent/workspace/ease.verify.core.target.2020-03/tests/org.eclipse.ease.lang.javascript.rhino.test/target/work/configuration, -application, org.eclipse.tycho.surefire.osgibooter.headlesstest, -testproperties, /home/jenkins/agent/workspace/ease.verify.core.target.2020-03/tests/org.eclipse.ease.lang.javascript.rhino.test/target/surefire.properties]
20:32:00 [2020-08-29T00:32:00.367Z] Picked up JAVA_TOOL_OPTIONS: -Dmaven.ext.class.path="/home/jenkins/agent/workspace/ease.verify.core.target.2020-03@tmp/withMavenfca47c90/pipeline-maven-spy.jar" -Dorg.jenkinsci.plugins.pipeline.maven.reportsFolder="/home/jenkins/agent/workspace/ease.verify.core.target.2020-03@tmp/withMavenfca47c90" 
20:32:01 [2020-08-29T00:32:01.755Z] Running org.eclipse.ease.lang.javascript.rhino.RhinoEnvironmentTest
20:32:02 [2020-08-29T00:32:02.015Z] Tests run: 5, Failures: 0, Errors: 0, Skipped: 0, Time elapsed: 0.409 s - in org.eclipse.ease.lang.javascript.rhino.RhinoEnvironmentTest
20:32:02 [2020-08-29T00:32:02.015Z] reloadEnvironment(org.eclipse.ease.lang.javascript.rhino.RhinoEnvironmentTest)  Time elapsed: 0.257 s
20:32:02 [2020-08-29T00:32:02.015Z] bootstrappedEnvironment(org.eclipse.ease.lang.javascript.rhino.RhinoEnvironmentTest)  Time elapsed: 0.015 s
20:32:02 [2020-08-29T00:32:02.015Z] postMethodCallback(org.eclipse.ease.lang.javascript.rhino.RhinoEnvironmentTest)  Time elapsed: 0.085 s
20:32:02 [2020-08-29T00:32:02.015Z] preMethodCallback(org.eclipse.ease.lang.javascript.rhino.RhinoEnvironmentTest)  Time elapsed: 0.015 s
20:32:02 [2020-08-29T00:32:02.015Z] reloadFunctionDefinitions(org.eclipse.ease.lang.javascript.rhino.RhinoEnvironmentTest)  Time elapsed: 0.021 s
20:32:02 [2020-08-29T00:32:02.015Z] Running org.eclipse.ease.lang.javascript.rhino.RhinoDebuggerEngineTest
20:32:02 [2020-08-29T00:32:02.015Z] org.eclipse.ease.ScriptExecutionException: JavaError: NotThere cannot be found by org.mozilla.javascript_1.7.10.v20190430-1943
20:32:02 [2020-08-29T00:32:02.015Z] 
20:32:02 [2020-08-29T00:32:02.015Z] Java Stacktrace:
20:32:02 [2020-08-29T00:32:02.016Z] java.lang.ClassNotFoundException: NotThere cannot be found by org.mozilla.javascript_1.7.10.v20190430-1943
20:32:02 [2020-08-29T00:32:02.016Z] 	at org.eclipse.osgi.internal.loader.BundleLoader.findClass(BundleLoader.java:516)
20:32:02 [2020-08-29T00:32:02.016Z] 	at org.eclipse.osgi.internal.loader.ModuleClassLoader.loadClass(ModuleClassLoader.java:171)
20:32:02 [2020-08-29T00:32:02.016Z] 	at java.lang.ClassLoader.loadClass(ClassLoader.java:357)
20:32:02 [2020-08-29T00:32:02.016Z] 	at java.lang.Class.forName0(Native Method)
20:32:02 [2020-08-29T00:32:02.016Z] 	at java.lang.Class.forName(Class.java:264)
20:32:02 [2020-08-29T00:32:02.016Z] 	at sun.reflect.NativeMethodAccessorImpl.invoke0(Native Method)
20:32:02 [2020-08-29T00:32:02.016Z] 	at sun.reflect.NativeMethodAccessorImpl.invoke(NativeMethodAccessorImpl.java:62)
20:32:02 [2020-08-29T00:32:02.016Z] 	at sun.reflect.DelegatingMethodAccessorImpl.invoke(DelegatingMethodAccessorImpl.java:43)
20:32:02 [2020-08-29T00:32:02.016Z] 	at java.lang.reflect.Method.invoke(Method.java:498)
20:32:02 [2020-08-29T00:32:02.016Z] 	at org.mozilla.javascript.MemberBox.invoke(MemberBox.java:126)
20:32:02 [2020-08-29T00:32:02.016Z] 	at org.mozilla.javascript.NativeJavaMethod.call(NativeJavaMethod.java:225)
20:32:02 [2020-08-29T00:32:02.016Z] 	at org.mozilla.javascript.Interpreter.interpretLoop(Interpreter.java:1573)
20:32:02 [2020-08-29T00:32:02.016Z] 	at org.mozilla.javascript.Interpreter.interpret(Interpreter.java:911)
20:32:02 [2020-08-29T00:32:02.016Z] 	at org.mozilla.javascript.InterpretedFunction.call(InterpretedFunction.java:109)
20:32:02 [2020-08-29T00:32:02.016Z] 	at org.mozilla.javascript.ContextFactory.doTopCall(ContextFactory.java:405)
20:32:02 [2020-08-29T00:32:02.016Z] 	at org.mozilla.javascript.ScriptRuntime.doTopCall(ScriptRuntime.java:3508)
20:32:02 [2020-08-29T00:32:02.016Z] 	at org.mozilla.javascript.InterpretedFunction.exec(InterpretedFunction.java:120)
20:32:02 [2020-08-29T00:32:02.016Z] 	at org.mozilla.javascript.Context.evaluateReader(Context.java:1293)
20:32:02 [2020-08-29T00:32:02.016Z] 	at org.eclipse.ease.lang.javascript.rhino.RhinoScriptEngine.internalExecute(RhinoScriptEngine.java:222)
20:32:02 [2020-08-29T00:32:02.016Z] 	at org.eclipse.ease.lang.javascript.rhino.RhinoScriptEngine.execute(RhinoScriptEngine.java:201)
20:32:02 [2020-08-29T00:32:02.016Z] 	at org.eclipse.ease.AbstractScriptEngine.inject(AbstractScriptEngine.java:222)
20:32:02 [2020-08-29T00:32:02.016Z] 	at org.eclipse.ease.AbstractScriptEngine.run(AbstractScriptEngine.java:272)
20:32:02 [2020-08-29T00:32:02.016Z] 	at org.eclipse.core.internal.jobs.Worker.run(Worker.java:63)
20:32:02 [2020-08-29T00:32:02.016Z] org.eclipse.ease.ScriptExecutionException: TypeError: Cannot call method "foobar" of undefined
20:32:02 [2020-08-29T00:32:02.016Z] org.eclipse.ease.ScriptExecutionException: ScriptException: test
20:32:02 [2020-08-29T00:32:02.016Z] org.eclipse.ease.ScriptExecutionException: JavaError: java.lang.Exception
20:32:02 [2020-08-29T00:32:02.016Z] 
20:32:02 [2020-08-29T00:32:02.016Z] Java Stacktrace:
20:32:02 [2020-08-29T00:32:02.016Z] java.lang.Exception
20:32:02 [2020-08-29T00:32:02.016Z] 	at sun.reflect.NativeConstructorAccessorImpl.newInstance0(Native Method)
20:32:02 [2020-08-29T00:32:02.016Z] 	at sun.reflect.NativeConstructorAccessorImpl.newInstance(NativeConstructorAccessorImpl.java:62)
20:32:02 [2020-08-29T00:32:02.016Z] 	at sun.reflect.DelegatingConstructorAccessorImpl.newInstance(DelegatingConstructorAccessorImpl.java:45)
20:32:02 [2020-08-29T00:32:02.016Z] 	at java.lang.reflect.Constructor.newInstance(Constructor.java:423)
20:32:02 [2020-08-29T00:32:02.016Z] 	at org.mozilla.javascript.MemberBox.newInstance(MemberBox.java:159)
20:32:02 [2020-08-29T00:32:02.016Z] 	at org.mozilla.javascript.NativeJavaClass.constructInternal(NativeJavaClass.java:266)
20:32:02 [2020-08-29T00:32:02.016Z] 	at org.mozilla.javascript.NativeJavaClass.constructSpecific(NativeJavaClass.java:205)
20:32:02 [2020-08-29T00:32:02.016Z] 	at org.mozilla.javascript.NativeJavaClass.construct(NativeJavaClass.java:166)
20:32:02 [2020-08-29T00:32:02.016Z] 	at org.mozilla.javascript.Interpreter.interpretLoop(Interpreter.java:1617)
20:32:02 [2020-08-29T00:32:02.016Z] 	at org.mozilla.javascript.Interpreter.interpret(Interpreter.java:911)
20:32:02 [2020-08-29T00:32:02.016Z] 	at org.mozilla.javascript.InterpretedFunction.call(InterpretedFunction.java:109)
20:32:02 [2020-08-29T00:32:02.016Z] 	at org.mozilla.javascript.ContextFactory.doTopCall(ContextFactory.java:405)
20:32:02 [2020-08-29T00:32:02.016Z] 	at org.mozilla.javascript.ScriptRuntime.doTopCall(ScriptRuntime.java:3508)
20:32:02 [2020-08-29T00:32:02.016Z] 	at org.mozilla.javascript.InterpretedFunction.exec(InterpretedFunction.java:120)
20:32:02 [2020-08-29T00:32:02.016Z] 	at org.mozilla.javascript.Context.evaluateReader(Context.java:1293)
20:32:02 [2020-08-29T00:32:02.016Z] 	at org.eclipse.ease.lang.javascript.rhino.RhinoScriptEngine.internalExecute(RhinoScriptEngine.java:222)
20:32:02 [2020-08-29T00:32:02.016Z] 	at org.eclipse.ease.lang.javascript.rhino.RhinoScriptEngine.execute(RhinoScriptEngine.java:201)
20:32:02 [2020-08-29T00:32:02.016Z] 	at org.eclipse.ease.AbstractScriptEngine.inject(AbstractScriptEngine.java:222)
20:32:02 [2020-08-29T00:32:02.016Z] 	at org.eclipse.ease.AbstractScriptEngine.run(AbstractScriptEngine.java:272)
20:32:02 [2020-08-29T00:32:02.016Z] 	at org.eclipse.core.internal.jobs.Worker.run(Worker.java:63)
20:32:02 [2020-08-29T00:32:02.272Z] org.eclipse.ease.ScriptExecutionException: ScriptException: JavaScript
20:32:02 [2020-08-29T00:32:02.272Z] org.eclipse.ease.ScriptExecutionException: SyntaxError: unterminated string literal (#1)
20:32:02 [2020-08-29T00:32:02.272Z] 'asdf
20:32:02 [2020-08-29T00:32:02.272Z]     ^
20:32:02 [2020-08-29T00:32:02.272Z] 	at <unknown source>:1
20:32:02 [2020-08-29T00:32:02.272Z] Tests run: 12, Failures: 0, Errors: 0, Skipped: 0, Time elapsed: 0.277 s - in org.eclipse.ease.lang.javascript.rhino.RhinoDebuggerEngineTest
20:32:02 [2020-08-29T00:32:02.272Z] getExceptionStackTrace(org.eclipse.ease.lang.javascript.rhino.RhinoDebuggerEngineTest)  Time elapsed: 0.093 s
20:32:02 [2020-08-29T00:32:02.272Z] causeWrappedException(org.eclipse.ease.lang.javascript.rhino.RhinoDebuggerEngineTest)  Time elapsed: 0.018 s
20:32:02 [2020-08-29T00:32:02.272Z] optionalModuleParameters(org.eclipse.ease.lang.javascript.rhino.RhinoDebuggerEngineTest)  Time elapsed: 0.033 s
20:32:02 [2020-08-29T00:32:02.272Z] simpleScriptCode(org.eclipse.ease.lang.javascript.rhino.RhinoDebuggerEngineTest)  Time elapsed: 0.012 s
20:32:02 [2020-08-29T00:32:02.272Z] causeRuntimeErrorException(org.eclipse.ease.lang.javascript.rhino.RhinoDebuggerEngineTest)  Time elapsed: 0.011 s
20:32:02 [2020-08-29T00:32:02.272Z] callModuleCode(org.eclipse.ease.lang.javascript.rhino.RhinoDebuggerEngineTest)  Time elapsed: 0.011 s
20:32:02 [2020-08-29T00:32:02.272Z] throwJavaClass(org.eclipse.ease.lang.javascript.rhino.RhinoDebuggerEngineTest)  Time elapsed: 0.012 s
20:32:02 [2020-08-29T00:32:02.272Z] throwJavaException(org.eclipse.ease.lang.javascript.rhino.RhinoDebuggerEngineTest)  Time elapsed: 0.011 s
20:32:02 [2020-08-29T00:32:02.272Z] accessJavaClasses(org.eclipse.ease.lang.javascript.rhino.RhinoDebuggerEngineTest)  Time elapsed: 0.01 s
20:32:02 [2020-08-29T00:32:02.272Z] accessEclipseClasses(org.eclipse.ease.lang.javascript.rhino.RhinoDebuggerEngineTest)  Time elapsed: 0.04 s
20:32:02 [2020-08-29T00:32:02.272Z] throwJavaScriptException(org.eclipse.ease.lang.javascript.rhino.RhinoDebuggerEngineTest)  Time elapsed: 0.013 s
20:32:02 [2020-08-29T00:32:02.272Z] causeSyntaxErrorException(org.eclipse.ease.lang.javascript.rhino.RhinoDebuggerEngineTest)  Time elapsed: 0.011 s
20:32:02 [2020-08-29T00:32:02.272Z] Running org.eclipse.ease.lang.javascript.rhino.RhinoScriptEngineTest
20:32:02 [2020-08-29T00:32:02.272Z] org.eclipse.ease.ScriptExecutionException: JavaError: NotThere cannot be found by org.mozilla.javascript_1.7.10.v20190430-1943
20:32:02 [2020-08-29T00:32:02.272Z] 	at <unknown source>
20:32:02 [2020-08-29T00:32:02.272Z] 
20:32:02 [2020-08-29T00:32:02.272Z] Java Stacktrace:
20:32:02 [2020-08-29T00:32:02.272Z] java.lang.ClassNotFoundException: NotThere cannot be found by org.mozilla.javascript_1.7.10.v20190430-1943
20:32:02 [2020-08-29T00:32:02.272Z] 	at org.eclipse.osgi.internal.loader.BundleLoader.findClass(BundleLoader.java:516)
20:32:02 [2020-08-29T00:32:02.272Z] 	at org.eclipse.osgi.internal.loader.ModuleClassLoader.loadClass(ModuleClassLoader.java:171)
20:32:02 [2020-08-29T00:32:02.272Z] 	at java.lang.ClassLoader.loadClass(ClassLoader.java:357)
20:32:02 [2020-08-29T00:32:02.272Z] 	at java.lang.Class.forName0(Native Method)
20:32:02 [2020-08-29T00:32:02.272Z] 	at java.lang.Class.forName(Class.java:264)
20:32:02 [2020-08-29T00:32:02.272Z] 	at sun.reflect.NativeMethodAccessorImpl.invoke0(Native Method)
20:32:02 [2020-08-29T00:32:02.272Z] 	at sun.reflect.NativeMethodAccessorImpl.invoke(NativeMethodAccessorImpl.java:62)
20:32:02 [2020-08-29T00:32:02.272Z] 	at sun.reflect.DelegatingMethodAccessorImpl.invoke(DelegatingMethodAccessorImpl.java:43)
20:32:02 [2020-08-29T00:32:02.272Z] 	at java.lang.reflect.Method.invoke(Method.java:498)
20:32:02 [2020-08-29T00:32:02.272Z] 	at org.mozilla.javascript.MemberBox.invoke(MemberBox.java:126)
20:32:02 [2020-08-29T00:32:02.272Z] 	at org.mozilla.javascript.NativeJavaMethod.call(NativeJavaMethod.java:225)
20:32:02 [2020-08-29T00:32:02.272Z] 	at org.mozilla.javascript.optimizer.OptRuntime.call1(OptRuntime.java:32)
20:32:02 [2020-08-29T00:32:02.272Z] 	at org.mozilla.javascript.gen.c_27._c_script_0(Unknown Source)
20:32:02 [2020-08-29T00:32:02.272Z] 	at org.mozilla.javascript.gen.c_27.call(Unknown Source)
20:32:02 [2020-08-29T00:32:02.272Z] 	at org.mozilla.javascript.ContextFactory.doTopCall(ContextFactory.java:405)
20:32:02 [2020-08-29T00:32:02.272Z] 	at org.mozilla.javascript.ScriptRuntime.doTopCall(ScriptRuntime.java:3508)
20:32:02 [2020-08-29T00:32:02.272Z] 	at org.mozilla.javascript.gen.c_27.call(Unknown Source)
20:32:02 [2020-08-29T00:32:02.272Z] 	at org.mozilla.javascript.gen.c_27.exec(Unknown Source)
20:32:02 [2020-08-29T00:32:02.272Z] 	at org.mozilla.javascript.Context.evaluateReader(Context.java:1293)
20:32:02 [2020-08-29T00:32:02.272Z] 	at org.eclipse.ease.lang.javascript.rhino.RhinoScriptEngine.internalExecute(RhinoScriptEngine.java:222)
20:32:02 [2020-08-29T00:32:02.272Z] 	at org.eclipse.ease.lang.javascript.rhino.RhinoScriptEngine.execute(RhinoScriptEngine.java:201)
20:32:02 [2020-08-29T00:32:02.272Z] 	at org.eclipse.ease.AbstractScriptEngine.inject(AbstractScriptEngine.java:222)
20:32:02 [2020-08-29T00:32:02.272Z] 	at org.eclipse.ease.AbstractScriptEngine.run(AbstractScriptEngine.java:272)
20:32:02 [2020-08-29T00:32:02.272Z] 	at org.eclipse.core.internal.jobs.Worker.run(Worker.java:63)
20:32:02 [2020-08-29T00:32:02.272Z] org.eclipse.ease.ScriptExecutionException: TypeError: Cannot call method "foobar" of undefined
20:32:02 [2020-08-29T00:32:02.272Z] 	at <unknown source>
20:32:02 [2020-08-29T00:32:02.273Z] org.eclipse.ease.ScriptExecutionException: ScriptException: test
20:32:02 [2020-08-29T00:32:02.273Z] 	at <unknown source>
20:32:02 [2020-08-29T00:32:02.273Z] org.eclipse.ease.ScriptExecutionException: JavaError: java.lang.Exception
20:32:02 [2020-08-29T00:32:02.273Z] 	at <unknown source>
20:32:02 [2020-08-29T00:32:02.273Z] 
20:32:02 [2020-08-29T00:32:02.273Z] Java Stacktrace:
20:32:02 [2020-08-29T00:32:02.273Z] java.lang.Exception
20:32:02 [2020-08-29T00:32:02.273Z] 	at sun.reflect.NativeConstructorAccessorImpl.newInstance0(Native Method)
20:32:02 [2020-08-29T00:32:02.273Z] 	at sun.reflect.NativeConstructorAccessorImpl.newInstance(NativeConstructorAccessorImpl.java:62)
20:32:02 [2020-08-29T00:32:02.273Z] 	at sun.reflect.DelegatingConstructorAccessorImpl.newInstance(DelegatingConstructorAccessorImpl.java:45)
20:32:02 [2020-08-29T00:32:02.273Z] 	at java.lang.reflect.Constructor.newInstance(Constructor.java:423)
20:32:02 [2020-08-29T00:32:02.273Z] 	at org.mozilla.javascript.MemberBox.newInstance(MemberBox.java:159)
20:32:02 [2020-08-29T00:32:02.273Z] 	at org.mozilla.javascript.NativeJavaClass.constructInternal(NativeJavaClass.java:266)
20:32:02 [2020-08-29T00:32:02.273Z] 	at org.mozilla.javascript.NativeJavaClass.constructSpecific(NativeJavaClass.java:205)
20:32:02 [2020-08-29T00:32:02.273Z] 	at org.mozilla.javascript.NativeJavaClass.construct(NativeJavaClass.java:166)
20:32:02 [2020-08-29T00:32:02.273Z] 	at org.mozilla.javascript.ScriptRuntime.newObject(ScriptRuntime.java:2655)
20:32:02 [2020-08-29T00:32:02.273Z] 	at org.mozilla.javascript.gen.c_45._c_script_0(Unknown Source)
20:32:02 [2020-08-29T00:32:02.273Z] 	at org.mozilla.javascript.gen.c_45.call(Unknown Source)
20:32:02 [2020-08-29T00:32:02.273Z] 	at org.mozilla.javascript.ContextFactory.doTopCall(ContextFactory.java:405)
20:32:02 [2020-08-29T00:32:02.273Z] 	at org.mozilla.javascript.ScriptRuntime.doTopCall(ScriptRuntime.java:3508)
20:32:02 [2020-08-29T00:32:02.273Z] 	at org.mozilla.javascript.gen.c_45.call(Unknown Source)
20:32:02 [2020-08-29T00:32:02.273Z] 	at org.mozilla.javascript.gen.c_45.exec(Unknown Source)
20:32:02 [2020-08-29T00:32:02.273Z] 	at org.mozilla.javascript.Context.evaluateReader(Context.java:1293)
20:32:02 [2020-08-29T00:32:02.273Z] 	at org.eclipse.ease.lang.javascript.rhino.RhinoScriptEngine.internalExecute(RhinoScriptEngine.java:222)
20:32:02 [2020-08-29T00:32:02.273Z] 	at org.eclipse.ease.lang.javascript.rhino.RhinoScriptEngine.execute(RhinoScriptEngine.java:201)
20:32:02 [2020-08-29T00:32:02.273Z] 	at org.eclipse.ease.AbstractScriptEngine.inject(AbstractScriptEngine.java:222)
20:32:02 [2020-08-29T00:32:02.273Z] 	at org.eclipse.ease.AbstractScriptEngine.run(AbstractScriptEngine.java:272)
20:32:02 [2020-08-29T00:32:02.273Z] 	at org.eclipse.core.internal.jobs.Worker.run(Worker.java:63)
20:32:02 [2020-08-29T00:32:02.273Z] org.eclipse.ease.ScriptExecutionException: ScriptException: JavaScript
20:32:02 [2020-08-29T00:32:02.273Z] 	at <unknown source>
20:32:02 [2020-08-29T00:32:02.273Z] org.eclipse.ease.ScriptExecutionException: SyntaxError: unterminated string literal (#1)
20:32:02 [2020-08-29T00:32:02.273Z] 'asdf
20:32:02 [2020-08-29T00:32:02.273Z]     ^
20:32:02 [2020-08-29T00:32:02.273Z] 	at <unknown source>
20:32:02 [2020-08-29T00:32:02.273Z] Tests run: 11, Failures: 0, Errors: 0, Skipped: 0, Time elapsed: 0.161 s - in org.eclipse.ease.lang.javascript.rhino.RhinoScriptEngineTest
20:32:02 [2020-08-29T00:32:02.273Z] causeWrappedException(org.eclipse.ease.lang.javascript.rhino.RhinoScriptEngineTest)  Time elapsed: 0.011 s
20:32:02 [2020-08-29T00:32:02.273Z] optionalModuleParameters(org.eclipse.ease.lang.javascript.rhino.RhinoScriptEngineTest)  Time elapsed: 0.008 s
20:32:02 [2020-08-29T00:32:02.273Z] simpleScriptCode(org.eclipse.ease.lang.javascript.rhino.RhinoScriptEngineTest)  Time elapsed: 0.041 s
20:32:02 [2020-08-29T00:32:02.273Z] causeRuntimeErrorException(org.eclipse.ease.lang.javascript.rhino.RhinoScriptEngineTest)  Time elapsed: 0.008 s
20:32:02 [2020-08-29T00:32:02.273Z] callModuleCode(org.eclipse.ease.lang.javascript.rhino.RhinoScriptEngineTest)  Time elapsed: 0.009 s
20:32:02 [2020-08-29T00:32:02.273Z] throwJavaClass(org.eclipse.ease.lang.javascript.rhino.RhinoScriptEngineTest)  Time elapsed: 0.008 s
20:32:02 [2020-08-29T00:32:02.273Z] throwJavaException(org.eclipse.ease.lang.javascript.rhino.RhinoScriptEngineTest)  Time elapsed: 0.013 s
20:32:02 [2020-08-29T00:32:02.273Z] accessJavaClasses(org.eclipse.ease.lang.javascript.rhino.RhinoScriptEngineTest)  Time elapsed: 0.008 s
20:32:02 [2020-08-29T00:32:02.273Z] accessEclipseClasses(org.eclipse.ease.lang.javascript.rhino.RhinoScriptEngineTest)  Time elapsed: 0.007 s
20:32:02 [2020-08-29T00:32:02.273Z] throwJavaScriptException(org.eclipse.ease.lang.javascript.rhino.RhinoScriptEngineTest)  Time elapsed: 0.007 s
20:32:02 [2020-08-29T00:32:02.273Z] causeSyntaxErrorException(org.eclipse.ease.lang.javascript.rhino.RhinoScriptEngineTest)  Time elapsed: 0.038 s
20:32:02 [2020-08-29T00:32:02.273Z] Running org.eclipse.ease.lang.javascript.rhino.RhinoDebugTest
20:32:02 [2020-08-29T00:32:02.528Z] Start of script
20:32:02 [2020-08-29T00:32:02.528Z] include file start
20:32:02 [2020-08-29T00:32:02.528Z] Include file processed
20:32:02 [2020-08-29T00:32:02.528Z] line after include file
20:32:02 [2020-08-29T00:32:02.528Z] Result of testMethod = 5
20:32:02 [2020-08-29T00:32:02.528Z] End of script
20:32:02 [2020-08-29T00:32:02.528Z] Start of script
20:32:02 [2020-08-29T00:32:02.784Z] include file start
20:32:02 [2020-08-29T00:32:02.784Z] Include file processed
20:32:02 [2020-08-29T00:32:02.784Z] line after include file
20:32:02 [2020-08-29T00:32:02.784Z] Result of testMethod = 5
20:32:02 [2020-08-29T00:32:02.784Z] End of script
20:32:02 [2020-08-29T00:32:02.784Z] Start of script
20:32:02 [2020-08-29T00:32:02.784Z] include file start
20:32:02 [2020-08-29T00:32:02.784Z] Include file processed
20:32:02 [2020-08-29T00:32:02.784Z] line after include file
20:32:02 [2020-08-29T00:32:02.784Z] Result of testMethod = 5
20:32:03 [2020-08-29T00:32:03.039Z] Start of script
20:32:03 [2020-08-29T00:32:03.039Z] include file start
20:32:03 [2020-08-29T00:32:03.039Z] Include file processed
20:32:03 [2020-08-29T00:32:03.039Z] line after include file
20:32:03 [2020-08-29T00:32:03.295Z] Result of testMethod = 5
20:32:03 [2020-08-29T00:32:03.295Z] End of script
20:32:03 [2020-08-29T00:32:03.551Z] Start of script
20:32:03 [2020-08-29T00:32:03.551Z] include file start
20:32:03 [2020-08-29T00:32:03.551Z] Include file processed
20:32:03 [2020-08-29T00:32:03.551Z] line after include file
20:32:03 [2020-08-29T00:32:03.551Z] Result of testMethod = 5
20:32:03 [2020-08-29T00:32:03.551Z] End of script
20:32:03 [2020-08-29T00:32:03.807Z] Start of script
20:32:03 [2020-08-29T00:32:03.807Z] include file start
20:32:03 [2020-08-29T00:32:03.807Z] Include file processed
20:32:03 [2020-08-29T00:32:03.807Z] line after include file
20:32:03 [2020-08-29T00:32:03.807Z] Result of testMethod = 5
20:32:03 [2020-08-29T00:32:03.807Z] End of script
20:32:04 [2020-08-29T00:32:04.062Z] Start of script
20:32:04 [2020-08-29T00:32:04.062Z] include file start
20:32:04 [2020-08-29T00:32:04.062Z] Include file processed
20:32:04 [2020-08-29T00:32:04.062Z] line after include file
20:32:04 [2020-08-29T00:32:04.062Z] Result of testMethod = 5
20:32:04 [2020-08-29T00:32:04.318Z] Start of script
20:32:04 [2020-08-29T00:32:04.318Z] include file start
20:32:04 [2020-08-29T00:32:04.318Z] Include file processed
20:32:04 [2020-08-29T00:32:04.318Z] line after include file
20:32:04 [2020-08-29T00:32:04.573Z] Result of testMethod = 5
20:32:04 [2020-08-29T00:32:04.573Z] End of script
20:32:04 [2020-08-29T00:32:04.573Z] Start of script
20:32:04 [2020-08-29T00:32:04.573Z] include file start
20:32:04 [2020-08-29T00:32:04.573Z] Include file processed
20:32:04 [2020-08-29T00:32:04.573Z] line after include file
20:32:04 [2020-08-29T00:32:04.573Z] Result of testMethod = 5
20:32:04 [2020-08-29T00:32:04.828Z] End of script
20:32:04 [2020-08-29T00:32:04.828Z] Start of script
20:32:04 [2020-08-29T00:32:04.828Z] include file start
20:32:04 [2020-08-29T00:32:04.828Z] Include file processed
20:32:04 [2020-08-29T00:32:04.828Z] line after include file
20:32:05 [2020-08-29T00:32:05.389Z] Start of script
20:32:05 [2020-08-29T00:32:05.389Z] include file start
20:32:05 [2020-08-29T00:32:05.389Z] Include file processed
20:32:05 [2020-08-29T00:32:05.389Z] line after include file
20:32:05 [2020-08-29T00:32:05.389Z] Result of testMethod = 5
20:32:05 [2020-08-29T00:32:05.389Z] End of script
20:32:05 [2020-08-29T00:32:05.389Z] Start of script
20:32:05 [2020-08-29T00:32:05.389Z] include file start
20:32:05 [2020-08-29T00:32:05.389Z] Include file processed
20:32:05 [2020-08-29T00:32:05.389Z] line after include file
20:32:05 [2020-08-29T00:32:05.646Z] Result of testMethod = 5
20:32:05 [2020-08-29T00:32:05.646Z] End of script
20:32:05 [2020-08-29T00:32:05.901Z] Start of script
20:32:06 [2020-08-29T00:32:06.157Z] include file start
20:32:06 [2020-08-29T00:32:06.157Z] Include file processed
20:32:06 [2020-08-29T00:32:06.157Z] line after include file
20:32:06 [2020-08-29T00:32:06.157Z] Result of testMethod = 5
20:32:06 [2020-08-29T00:32:06.157Z] End of script
20:32:06 [2020-08-29T00:32:06.157Z] Start of script
20:32:06 [2020-08-29T00:32:06.157Z] include file start
20:32:06 [2020-08-29T00:32:06.157Z] Include file processed
20:32:06 [2020-08-29T00:32:06.157Z] line after include file
20:32:06 [2020-08-29T00:32:06.414Z] Result of testMethod = 5
20:32:06 [2020-08-29T00:32:06.414Z] End of script
20:32:06 [2020-08-29T00:32:06.414Z] Start of script
20:32:06 [2020-08-29T00:32:06.414Z] include file start
20:32:06 [2020-08-29T00:32:06.414Z] Include file processed
20:32:06 [2020-08-29T00:32:06.414Z] line after include file
20:32:06 [2020-08-29T00:32:06.414Z] Result of testMethod = 5
20:32:06 [2020-08-29T00:32:06.669Z] Start of script
20:32:06 [2020-08-29T00:32:06.669Z] include file start
20:32:06 [2020-08-29T00:32:06.669Z] Include file processed
20:32:06 [2020-08-29T00:32:06.669Z] line after include file
20:32:06 [2020-08-29T00:32:06.924Z] Result of testMethod = 5
20:32:06 [2020-08-29T00:32:06.924Z] End of script
20:32:07 [2020-08-29T00:32:07.181Z] Start of script
20:32:07 [2020-08-29T00:32:07.181Z] include file start
20:32:07 [2020-08-29T00:32:07.181Z] Include file processed
20:32:07 [2020-08-29T00:32:07.181Z] line after include file
20:32:07 [2020-08-29T00:32:07.181Z] Result of testMethod = 5
20:32:07 [2020-08-29T00:32:07.437Z] End of script
20:32:07 [2020-08-29T00:32:07.437Z] Start of script
20:32:07 [2020-08-29T00:32:07.437Z] include file start
20:32:07 [2020-08-29T00:32:07.437Z] Include file processed
20:32:07 [2020-08-29T00:32:07.437Z] line after include file
20:32:07 [2020-08-29T00:32:07.692Z] Result of testMethod = 5
20:32:07 [2020-08-29T00:32:07.692Z] End of script
20:32:07 [2020-08-29T00:32:07.947Z] Start of script
20:32:07 [2020-08-29T00:32:07.947Z] include file start
20:32:07 [2020-08-29T00:32:07.947Z] Include file processed
20:32:07 [2020-08-29T00:32:07.947Z] line after include file
20:32:08 [2020-08-29T00:32:08.206Z] Result of testMethod = 5
20:32:08 [2020-08-29T00:32:08.206Z] End of script
20:32:08 [2020-08-29T00:32:08.206Z] Start of script
20:32:08 [2020-08-29T00:32:08.206Z] include file start
20:32:08 [2020-08-29T00:32:08.206Z] Include file processed
20:32:08 [2020-08-29T00:32:08.206Z] line after include file
20:32:08 [2020-08-29T00:32:08.206Z] Result of testMethod = 5
20:32:08 [2020-08-29T00:32:08.780Z] Start of script
20:32:08 [2020-08-29T00:32:08.780Z] include file start
20:32:08 [2020-08-29T00:32:08.780Z] Include file processed
20:32:08 [2020-08-29T00:32:08.780Z] line after include file
20:32:08 [2020-08-29T00:32:08.780Z] Result of testMethod = 5
20:32:08 [2020-08-29T00:32:08.780Z] End of script
20:32:08 [2020-08-29T00:32:08.780Z] Start of script
20:32:08 [2020-08-29T00:32:08.780Z] include file start
20:32:08 [2020-08-29T00:32:08.780Z] Include file processed
20:32:08 [2020-08-29T00:32:08.780Z] line after include file
20:32:09 [2020-08-29T00:32:09.035Z] Result of testMethod = 5
20:32:09 [2020-08-29T00:32:09.035Z] End of script
20:32:09 [2020-08-29T00:32:09.035Z] Start of script
20:32:09 [2020-08-29T00:32:09.035Z] include file start
20:32:09 [2020-08-29T00:32:09.035Z] Include file processed
20:32:09 [2020-08-29T00:32:09.035Z] line after include file
20:32:09 [2020-08-29T00:32:09.035Z] Result of testMethod = 5
20:32:09 [2020-08-29T00:32:09.035Z] End of script
20:32:09 [2020-08-29T00:32:09.291Z] Start of script
20:32:09 [2020-08-29T00:32:09.291Z] include file start
20:32:09 [2020-08-29T00:32:09.291Z] Include file processed
20:32:09 [2020-08-29T00:32:09.547Z] line after include file
20:32:09 [2020-08-29T00:32:09.547Z] Result of testMethod = 5
20:32:09 [2020-08-29T00:32:09.547Z] End of script
20:32:09 [2020-08-29T00:32:09.547Z] Start of script
20:32:09 [2020-08-29T00:32:09.547Z] include file start
20:32:09 [2020-08-29T00:32:09.547Z] Include file processed
20:32:09 [2020-08-29T00:32:09.547Z] line after include file
20:32:09 [2020-08-29T00:32:09.802Z] Start of script
20:32:10 [2020-08-29T00:32:10.057Z] include file start
20:32:10 [2020-08-29T00:32:10.057Z] Include file processed
20:32:10 [2020-08-29T00:32:10.057Z] line after include file
20:32:10 [2020-08-29T00:32:10.057Z] Result of testMethod = 5
20:32:10 [2020-08-29T00:32:10.057Z] End of script
20:32:10 [2020-08-29T00:32:10.057Z] Start of script
20:32:10 [2020-08-29T00:32:10.057Z] include file start
20:32:10 [2020-08-29T00:32:10.057Z] Include file processed
20:32:10 [2020-08-29T00:32:10.057Z] line after include file
20:32:10 [2020-08-29T00:32:10.057Z] Result of testMethod = 5
20:32:10 [2020-08-29T00:32:10.618Z] Start of script
20:32:10 [2020-08-29T00:32:10.618Z] include file start
20:32:10 [2020-08-29T00:32:10.618Z] Include file processed
20:32:10 [2020-08-29T00:32:10.618Z] line after include file
20:32:10 [2020-08-29T00:32:10.618Z] Result of testMethod = 5
20:32:10 [2020-08-29T00:32:10.618Z] End of script
20:32:10 [2020-08-29T00:32:10.618Z] Start of script
20:32:10 [2020-08-29T00:32:10.618Z] include file start
20:32:10 [2020-08-29T00:32:10.618Z] Include file processed
20:32:10 [2020-08-29T00:32:10.618Z] line after include file
20:32:10 [2020-08-29T00:32:10.874Z] Result of testMethod = 5
20:32:10 [2020-08-29T00:32:10.874Z] End of script
20:32:10 [2020-08-29T00:32:10.874Z] Start of script
20:32:10 [2020-08-29T00:32:10.874Z] include file start
20:32:10 [2020-08-29T00:32:10.874Z] Include file processed
20:32:10 [2020-08-29T00:32:10.874Z] line after include file
20:32:11 [2020-08-29T00:32:11.129Z] Result of testMethod = 5
20:32:11 [2020-08-29T00:32:11.129Z] End of script
20:32:11 [2020-08-29T00:32:11.385Z] Start of script
20:32:11 [2020-08-29T00:32:11.385Z] include file start
20:32:11 [2020-08-29T00:32:11.385Z] Include file processed
20:32:11 [2020-08-29T00:32:11.385Z] line after include file
20:32:11 [2020-08-29T00:32:11.385Z] Result of testMethod = 5
20:32:11 [2020-08-29T00:32:11.385Z] End of script
20:32:11 [2020-08-29T00:32:11.385Z] Start of script
20:32:11 [2020-08-29T00:32:11.385Z] include file start
20:32:11 [2020-08-29T00:32:11.385Z] Include file processed
20:32:11 [2020-08-29T00:32:11.385Z] line after include file
20:32:11 [2020-08-29T00:32:11.385Z] Result of testMethod = 5
20:32:11 [2020-08-29T00:32:11.947Z] Start of script
20:32:11 [2020-08-29T00:32:11.947Z] include file start
20:32:11 [2020-08-29T00:32:11.947Z] Include file processed
20:32:11 [2020-08-29T00:32:11.947Z] line after include file
20:32:11 [2020-08-29T00:32:11.947Z] Result of testMethod = 5
20:32:11 [2020-08-29T00:32:11.947Z] End of script
20:32:11 [2020-08-29T00:32:11.947Z] Start of script
20:32:11 [2020-08-29T00:32:11.947Z] include file start
20:32:11 [2020-08-29T00:32:11.947Z] Include file processed
20:32:11 [2020-08-29T00:32:11.947Z] line after include file
20:32:11 [2020-08-29T00:32:11.947Z] Result of testMethod = 5
20:32:12 [2020-08-29T00:32:12.508Z] Start of script
20:32:12 [2020-08-29T00:32:12.508Z] include file start
20:32:12 [2020-08-29T00:32:12.508Z] Include file processed
20:32:12 [2020-08-29T00:32:12.508Z] line after include file
20:32:12 [2020-08-29T00:32:12.508Z] Result of testMethod = 5
20:32:12 [2020-08-29T00:32:12.508Z] End of script
20:32:12 [2020-08-29T00:32:12.764Z] Start of script
20:32:12 [2020-08-29T00:32:12.764Z] include file start
20:32:12 [2020-08-29T00:32:12.764Z] Include file processed
20:32:12 [2020-08-29T00:32:12.764Z] line after include file
20:32:13 [2020-08-29T00:32:13.019Z] Result of testMethod = 5
20:32:13 [2020-08-29T00:32:13.020Z] End of script
20:32:13 [2020-08-29T00:32:13.020Z] Start of script
20:32:13 [2020-08-29T00:32:13.020Z] include file start
20:32:13 [2020-08-29T00:32:13.020Z] Include file processed
20:32:13 [2020-08-29T00:32:13.020Z] line after include file
20:32:13 [2020-08-29T00:32:13.020Z] Result of testMethod = 5
20:32:13 [2020-08-29T00:32:13.020Z] End of script
20:32:13 [2020-08-29T00:32:13.275Z] Tests run: 42, Failures: 0, Errors: 0, Skipped: 0, Time elapsed: 10.859 s - in org.eclipse.ease.lang.javascript.rhino.RhinoDebugTest
20:32:13 [2020-08-29T00:32:13.275Z] disconnectProcessInSuspendedState(org.eclipse.ease.lang.javascript.rhino.RhinoDebugTest)  Time elapsed: 0.218 s
20:32:13 [2020-08-29T00:32:13.275Z] stepReturnIncludeCommand(org.eclipse.ease.lang.javascript.rhino.RhinoDebugTest)  Time elapsed: 0.208 s
20:32:13 [2020-08-29T00:32:13.275Z] arrayVariableSorting(org.eclipse.ease.lang.javascript.rhino.RhinoDebugTest)  Time elapsed: 0.307 s
20:32:13 [2020-08-29T00:32:13.275Z] stepOverOnDebugTarget(org.eclipse.ease.lang.javascript.rhino.RhinoDebugTest)  Time elapsed: 0.307 s
20:32:13 [2020-08-29T00:32:13.275Z] hasDebugTarget(org.eclipse.ease.lang.javascript.rhino.RhinoDebugTest)  Time elapsed: 0.105 s
20:32:13 [2020-08-29T00:32:13.275Z] disconnectThreadInSuspendedState(org.eclipse.ease.lang.javascript.rhino.RhinoDebugTest)  Time elapsed: 0.205 s
20:32:13 [2020-08-29T00:32:13.275Z] stepReturnOnDebugTarget(org.eclipse.ease.lang.javascript.rhino.RhinoDebugTest)  Time elapsed: 0.307 s
20:32:13 [2020-08-29T00:32:13.275Z] nullVariable(org.eclipse.ease.lang.javascript.rhino.RhinoDebugTest)  Time elapsed: 0.308 s
20:32:13 [2020-08-29T00:32:13.275Z] stepOverOnStackFrame(org.eclipse.ease.lang.javascript.rhino.RhinoDebugTest)  Time elapsed: 0.306 s
20:32:13 [2020-08-29T00:32:13.275Z] resumeOnDebugTarget(org.eclipse.ease.lang.javascript.rhino.RhinoDebugTest)  Time elapsed: 0.206 s
20:32:13 [2020-08-29T00:32:13.275Z] modifyVariableKeepingType(org.eclipse.ease.lang.javascript.rhino.RhinoDebugTest)  Time elapsed: 0.406 s
20:32:13 [2020-08-29T00:32:13.275Z] resumeOnLastIncludeLine(org.eclipse.ease.lang.javascript.rhino.RhinoDebugTest)  Time elapsed: 0.206 s
20:32:13 [2020-08-29T00:32:13.275Z] stepReturnOnStackFrame(org.eclipse.ease.lang.javascript.rhino.RhinoDebugTest)  Time elapsed: 0.307 s
20:32:13 [2020-08-29T00:32:13.275Z] terminateStackFrameInSuspendedState(org.eclipse.ease.lang.javascript.rhino.RhinoDebugTest)  Time elapsed: 0.206 s
20:32:13 [2020-08-29T00:32:13.275Z] breakpointLocation(org.eclipse.ease.lang.javascript.rhino.RhinoDebugTest)  Time elapsed: 0.206 s
20:32:13 [2020-08-29T00:32:13.275Z] stepReturnOnThread(org.eclipse.ease.lang.javascript.rhino.RhinoDebugTest)  Time elapsed: 0.307 s
20:32:13 [2020-08-29T00:32:13.275Z] javaClassVariable(org.eclipse.ease.lang.javascript.rhino.RhinoDebugTest)  Time elapsed: 0.307 s
20:32:13 [2020-08-29T00:32:13.275Z] stepIntoOnThread(org.eclipse.ease.lang.javascript.rhino.RhinoDebugTest)  Time elapsed: 0.306 s
20:32:13 [2020-08-29T00:32:13.275Z] terminateThreadInSuspendedState(org.eclipse.ease.lang.javascript.rhino.RhinoDebugTest)  Time elapsed: 0.205 s
20:32:13 [2020-08-29T00:32:13.275Z] resumeOnThread(org.eclipse.ease.lang.javascript.rhino.RhinoDebugTest)  Time elapsed: 0.205 s
20:32:13 [2020-08-29T00:32:13.275Z] stepIntoOnStackFrame(org.eclipse.ease.lang.javascript.rhino.RhinoDebugTest)  Time elapsed: 0.307 s
20:32:13 [2020-08-29T00:32:13.275Z] terminateProcessInSuspendedState(org.eclipse.ease.lang.javascript.rhino.RhinoDebugTest)  Time elapsed: 0.205 s
20:32:13 [2020-08-29T00:32:13.275Z] stepOverOnProcess(org.eclipse.ease.lang.javascript.rhino.RhinoDebugTest)  Time elapsed: 0.306 s
20:32:13 [2020-08-29T00:32:13.275Z] nativeArrayVariable(org.eclipse.ease.lang.javascript.rhino.RhinoDebugTest)  Time elapsed: 0.305 s
20:32:13 [2020-08-29T00:32:13.275Z] disconnectDebugTargetInSuspendedState(org.eclipse.ease.lang.javascript.rhino.RhinoDebugTest)  Time elapsed: 0.206 s
20:32:13 [2020-08-29T00:32:13.275Z] stepIntoOnProcess(org.eclipse.ease.lang.javascript.rhino.RhinoDebugTest)  Time elapsed: 0.306 s
20:32:13 [2020-08-29T00:32:13.275Z] terminatedState(org.eclipse.ease.lang.javascript.rhino.RhinoDebugTest)  Time elapsed: 0.104 s
20:32:13 [2020-08-29T00:32:13.275Z] stepOverIncludeCommand(org.eclipse.ease.lang.javascript.rhino.RhinoDebugTest)  Time elapsed: 0.305 s
20:32:13 [2020-08-29T00:32:13.275Z] innerScopeVariableBeforeOuterScopeVariable(org.eclipse.ease.lang.javascript.rhino.RhinoDebugTest)  Time elapsed: 0.305 s
20:32:13 [2020-08-29T00:32:13.275Z] stepIntoIncludeCommand(org.eclipse.ease.lang.javascript.rhino.RhinoDebugTest)  Time elapsed: 0.304 s
20:32:13 [2020-08-29T00:32:13.275Z] primitiveStringVariable(org.eclipse.ease.lang.javascript.rhino.RhinoDebugTest)  Time elapsed: 0.306 s
20:32:13 [2020-08-29T00:32:13.275Z] resumeOnProcess(org.eclipse.ease.lang.javascript.rhino.RhinoDebugTest)  Time elapsed: 0.204 s
20:32:13 [2020-08-29T00:32:13.275Z] stepIntoOnDebugTarget(org.eclipse.ease.lang.javascript.rhino.RhinoDebugTest)  Time elapsed: 0.305 s
20:32:13 [2020-08-29T00:32:13.275Z] stepOverOnThread(org.eclipse.ease.lang.javascript.rhino.RhinoDebugTest)  Time elapsed: 0.305 s
20:32:13 [2020-08-29T00:32:13.275Z] suspendedState(org.eclipse.ease.lang.javascript.rhino.RhinoDebugTest)  Time elapsed: 0.204 s
20:32:13 [2020-08-29T00:32:13.275Z] primitiveDoubleVariable(org.eclipse.ease.lang.javascript.rhino.RhinoDebugTest)  Time elapsed: 0.304 s
20:32:13 [2020-08-29T00:32:13.275Z] resumeOnStackFrame(org.eclipse.ease.lang.javascript.rhino.RhinoDebugTest)  Time elapsed: 0.205 s
20:32:13 [2020-08-29T00:32:13.275Z] nativeObjectVariable(org.eclipse.ease.lang.javascript.rhino.RhinoDebugTest)  Time elapsed: 0.305 s
20:32:13 [2020-08-29T00:32:13.275Z] terminateDebugTargetInSuspendedState(org.eclipse.ease.lang.javascript.rhino.RhinoDebugTest)  Time elapsed: 0.205 s
20:32:13 [2020-08-29T00:32:13.275Z] disconnectStackFrameInSuspendedState(org.eclipse.ease.lang.javascript.rhino.RhinoDebugTest)  Time elapsed: 0.205 s
20:32:13 [2020-08-29T00:32:13.275Z] stepReturnOnProcess(org.eclipse.ease.lang.javascript.rhino.RhinoDebugTest)  Time elapsed: 0.306 s
20:32:13 [2020-08-29T00:32:13.275Z] evaluateWatchExpression(org.eclipse.ease.lang.javascript.rhino.RhinoDebugTest)  Time elapsed: 0.207 s
20:32:13 [2020-08-29T00:32:13.275Z] 
20:32:13 [2020-08-29T00:32:13.275Z] Results:
20:32:13 [2020-08-29T00:32:13.275Z] 
20:32:13 [2020-08-29T00:32:13.275Z] Tests run: 70, Failures: 0, Errors: 0, Skipped: 0
20:32:13 [2020-08-29T00:32:13.275Z] 
20:32:13 [2020-08-29T00:32:13.836Z] [INFO] All tests passed!
20:32:13 [2020-08-29T00:32:13.836Z] [INFO] 
20:32:13 [2020-08-29T00:32:13.837Z] [INFO] --- maven-install-plugin:2.3.1:install (default-install) @ org.eclipse.ease.lang.javascript.rhino.test ---
20:32:13 [2020-08-29T00:32:13.837Z] [INFO] Installing /home/jenkins/agent/workspace/ease.verify.core.target.2020-03/tests/org.eclipse.ease.lang.javascript.rhino.test/target/org.eclipse.ease.lang.javascript.rhino.test-0.8.0-SNAPSHOT.jar to /home/jenkins/.m2/repository/org/eclipse/ease/org.eclipse.ease.lang.javascript.rhino.test/0.8.0-SNAPSHOT/org.eclipse.ease.lang.javascript.rhino.test-0.8.0-SNAPSHOT.jar
20:32:13 [2020-08-29T00:32:13.837Z] [INFO] Installing /home/jenkins/agent/workspace/ease.verify.core.target.2020-03/tests/org.eclipse.ease.lang.javascript.rhino.test/pom.xml to /home/jenkins/.m2/repository/org/eclipse/ease/org.eclipse.ease.lang.javascript.rhino.test/0.8.0-SNAPSHOT/org.eclipse.ease.lang.javascript.rhino.test-0.8.0-SNAPSHOT.pom
20:32:13 [2020-08-29T00:32:13.837Z] [INFO] Installing /home/jenkins/agent/workspace/ease.verify.core.target.2020-03/tests/org.eclipse.ease.lang.javascript.rhino.test/target/org.eclipse.ease.lang.javascript.rhino.test-0.8.0-SNAPSHOT-sources.jar to /home/jenkins/.m2/repository/org/eclipse/ease/org.eclipse.ease.lang.javascript.rhino.test/0.8.0-SNAPSHOT/org.eclipse.ease.lang.javascript.rhino.test-0.8.0-SNAPSHOT-sources.jar
20:32:13 [2020-08-29T00:32:13.837Z] [INFO] Installing /home/jenkins/agent/workspace/ease.verify.core.target.2020-03/tests/org.eclipse.ease.lang.javascript.rhino.test/target/p2content.xml to /home/jenkins/.m2/repository/org/eclipse/ease/org.eclipse.ease.lang.javascript.rhino.test/0.8.0-SNAPSHOT/org.eclipse.ease.lang.javascript.rhino.test-0.8.0-SNAPSHOT-p2metadata.xml
20:32:13 [2020-08-29T00:32:13.837Z] [INFO] Installing /home/jenkins/agent/workspace/ease.verify.core.target.2020-03/tests/org.eclipse.ease.lang.javascript.rhino.test/target/p2artifacts.xml to /home/jenkins/.m2/repository/org/eclipse/ease/org.eclipse.ease.lang.javascript.rhino.test/0.8.0-SNAPSHOT/org.eclipse.ease.lang.javascript.rhino.test-0.8.0-SNAPSHOT-p2artifacts.xml
20:32:13 [2020-08-29T00:32:13.837Z] [INFO] Installing /home/jenkins/agent/workspace/ease.verify.core.target.2020-03/tests/org.eclipse.ease.lang.javascript.rhino.test/target/p2content.xml to /home/jenkins/.m2/repository/org/eclipse/ease/org.eclipse.ease.lang.javascript.rhino.test/0.8.0-SNAPSHOT/org.eclipse.ease.lang.javascript.rhino.test-0.8.0-SNAPSHOT-p2metadata.xml
20:32:13 [2020-08-29T00:32:13.837Z] [INFO] Installing /home/jenkins/agent/workspace/ease.verify.core.target.2020-03/tests/org.eclipse.ease.lang.javascript.rhino.test/target/p2artifacts.xml to /home/jenkins/.m2/repository/org/eclipse/ease/org.eclipse.ease.lang.javascript.rhino.test/0.8.0-SNAPSHOT/org.eclipse.ease.lang.javascript.rhino.test-0.8.0-SNAPSHOT-p2artifacts.xml
20:32:13 [2020-08-29T00:32:13.837Z] [INFO] 
20:32:13 [2020-08-29T00:32:13.837Z] [INFO] --- tycho-p2-plugin:1.3.0:update-local-index (default-update-local-index) @ org.eclipse.ease.lang.javascript.rhino.test ---
20:32:13 [2020-08-29T00:32:13.837Z] [INFO] 
20:32:13 [2020-08-29T00:32:13.837Z] [INFO] -------< org.eclipse.ease:org.eclipse.ease.lang.javascript.test >-------
20:32:13 [2020-08-29T00:32:13.837Z] [INFO] Building org.eclipse.ease.lang.javascript.test 0.8.0-SNAPSHOT    [41/48]
20:32:13 [2020-08-29T00:32:13.837Z] [INFO] ------------------------[ eclipse-test-plugin ]-------------------------
20:32:13 [2020-08-29T00:32:13.837Z] [INFO] 
20:32:13 [2020-08-29T00:32:13.837Z] [INFO] --- maven-clean-plugin:2.5:clean (default-clean) @ org.eclipse.ease.lang.javascript.test ---
20:32:13 [2020-08-29T00:32:13.837Z] [INFO] 
20:32:13 [2020-08-29T00:32:13.837Z] [INFO] --- tycho-packaging-plugin:1.3.0:build-qualifier (default-build-qualifier) @ org.eclipse.ease.lang.javascript.test ---
20:32:13 [2020-08-29T00:32:13.837Z] [INFO] The project's OSGi version is 0.8.0.I201910171213
20:32:13 [2020-08-29T00:32:13.837Z] [INFO] 
20:32:13 [2020-08-29T00:32:13.837Z] [INFO] --- tycho-packaging-plugin:1.3.0:validate-id (default-validate-id) @ org.eclipse.ease.lang.javascript.test ---
20:32:13 [2020-08-29T00:32:13.837Z] [INFO] 
20:32:13 [2020-08-29T00:32:13.837Z] [INFO] --- tycho-packaging-plugin:1.3.0:validate-version (default-validate-version) @ org.eclipse.ease.lang.javascript.test ---
20:32:13 [2020-08-29T00:32:13.837Z] [INFO] 
20:32:13 [2020-08-29T00:32:13.837Z] [INFO] >>> maven-javadoc-plugin:2.9.1:javadoc (build-docs) > generate-sources @ org.eclipse.ease.lang.javascript.test >>>
20:32:13 [2020-08-29T00:32:13.837Z] [INFO] 
20:32:13 [2020-08-29T00:32:13.837Z] [INFO] --- tycho-packaging-plugin:1.3.0:build-qualifier (default-build-qualifier) @ org.eclipse.ease.lang.javascript.test ---
20:32:13 [2020-08-29T00:32:13.837Z] [INFO] The project's OSGi version is 0.8.0.I201910171213
20:32:13 [2020-08-29T00:32:13.837Z] [INFO] 
20:32:13 [2020-08-29T00:32:13.837Z] [INFO] --- tycho-packaging-plugin:1.3.0:validate-id (default-validate-id) @ org.eclipse.ease.lang.javascript.test ---
20:32:13 [2020-08-29T00:32:13.837Z] [INFO] 
20:32:13 [2020-08-29T00:32:13.837Z] [INFO] --- tycho-packaging-plugin:1.3.0:validate-version (default-validate-version) @ org.eclipse.ease.lang.javascript.test ---
20:32:13 [2020-08-29T00:32:13.837Z] [INFO] 
20:32:13 [2020-08-29T00:32:13.837Z] [INFO] <<< maven-javadoc-plugin:2.9.1:javadoc (build-docs) < generate-sources @ org.eclipse.ease.lang.javascript.test <<<
20:32:13 [2020-08-29T00:32:13.837Z] [INFO] 
20:32:13 [2020-08-29T00:32:13.837Z] [INFO] 
20:32:13 [2020-08-29T00:32:13.837Z] [INFO] --- maven-javadoc-plugin:2.9.1:javadoc (build-docs) @ org.eclipse.ease.lang.javascript.test ---
20:32:13 [2020-08-29T00:32:13.837Z] [ERROR] Error fetching link: http://help.eclipse.org/oxygen/topic/org.eclipse.platform.doc.isv/reference/api/package-list. Ignored it.
20:32:15 [2020-08-29T00:32:15.200Z] [INFO] 
20:32:15 [2020-08-29T00:32:15.200Z] Loading source files for package org.eclipse.ease.lang.javascript...
20:32:15 [2020-08-29T00:32:15.200Z] Constructing Javadoc information...
20:32:15 [2020-08-29T00:32:15.200Z] WARNING: Cannot open location "/home/jenkins/agent/workspace/ease.verify.core.target.2020-03/tests/org.eclipse.ease.lang.javascript.test/target/javadoc-bundle-options/package-list"
20:32:15 [2020-08-29T00:32:15.200Z] No plugin definition found, skipping
20:32:15 [2020-08-29T00:32:15.200Z] No plugin definition found, skipping
20:32:15 [2020-08-29T00:32:15.200Z] [WARNING] Javadoc Warnings
20:32:15 [2020-08-29T00:32:15.200Z] [WARNING] Picked up JAVA_TOOL_OPTIONS: -Dmaven.ext.class.path="/home/jenkins/agent/workspace/ease.verify.core.target.2020-03@tmp/withMavenfca47c90/pipeline-maven-spy.jar" -Dorg.jenkinsci.plugins.pipeline.maven.reportsFolder="/home/jenkins/agent/workspace/ease.verify.core.target.2020-03@tmp/withMavenfca47c90"
20:32:15 [2020-08-29T00:32:15.200Z] [INFO] 
20:32:15 [2020-08-29T00:32:15.200Z] [INFO] --- build-helper-maven-plugin:1.9.1:add-resource (add_help) @ org.eclipse.ease.lang.javascript.test ---
20:32:15 [2020-08-29T00:32:15.200Z] [INFO] 
20:32:15 [2020-08-29T00:32:15.200Z] [INFO] --- maven-resources-plugin:2.4.3:resources (default-resources) @ org.eclipse.ease.lang.javascript.test ---
20:32:15 [2020-08-29T00:32:15.200Z] [INFO] Using 'UTF-8' encoding to copy filtered resources.
20:32:15 [2020-08-29T00:32:15.200Z] [INFO] skip non existing resourceDirectory /home/jenkins/agent/workspace/ease.verify.core.target.2020-03/tests/org.eclipse.ease.lang.javascript.test/src/main/resources
20:32:15 [2020-08-29T00:32:15.200Z] [INFO] skip non existing resourceDirectory /home/jenkins/agent/workspace/ease.verify.core.target.2020-03/tests/org.eclipse.ease.lang.javascript.test/help
20:32:15 [2020-08-29T00:32:15.200Z] [INFO] 
20:32:15 [2020-08-29T00:32:15.200Z] [INFO] --- tycho-compiler-plugin:1.3.0:compile (default-compile) @ org.eclipse.ease.lang.javascript.test ---
20:32:15 [2020-08-29T00:32:15.200Z] [INFO] Compiling 2 source files to /home/jenkins/agent/workspace/ease.verify.core.target.2020-03/tests/org.eclipse.ease.lang.javascript.test/target/classes
20:32:15 [2020-08-29T00:32:15.200Z] [INFO] 
20:32:15 [2020-08-29T00:32:15.200Z] [INFO] --- maven-resources-plugin:2.4.3:testResources (default-testResources) @ org.eclipse.ease.lang.javascript.test ---
20:32:15 [2020-08-29T00:32:15.200Z] [INFO] Using 'UTF-8' encoding to copy filtered resources.
20:32:15 [2020-08-29T00:32:15.200Z] [INFO] skip non existing resourceDirectory /home/jenkins/agent/workspace/ease.verify.core.target.2020-03/tests/org.eclipse.ease.lang.javascript.test/src/test/resources
20:32:15 [2020-08-29T00:32:15.200Z] [INFO] 
20:32:15 [2020-08-29T00:32:15.200Z] [INFO] --- tycho-source-plugin:1.3.0:plugin-source (plugin-source) @ org.eclipse.ease.lang.javascript.test ---
20:32:15 [2020-08-29T00:32:15.200Z] [WARNING] Bundle-Vendor header not found in /home/jenkins/agent/workspace/ease.verify.core.target.2020-03/tests/org.eclipse.ease.lang.javascript.test/META-INF/MANIFEST.MF, fallback to 'unknown' for source bundle
20:32:15 [2020-08-29T00:32:15.200Z] [INFO] Building jar: /home/jenkins/agent/workspace/ease.verify.core.target.2020-03/tests/org.eclipse.ease.lang.javascript.test/target/org.eclipse.ease.lang.javascript.test-0.8.0-SNAPSHOT-sources.jar
20:32:15 [2020-08-29T00:32:15.200Z] [INFO] 
20:32:15 [2020-08-29T00:32:15.200Z] [INFO] --- target-platform-configuration:1.3.0:target-platform (default-target-platform) @ org.eclipse.ease.lang.javascript.test ---
20:32:15 [2020-08-29T00:32:15.200Z] [INFO] 
20:32:15 [2020-08-29T00:32:15.200Z] [INFO] --- tycho-packaging-plugin:1.3.0:package-plugin (default-package-plugin) @ org.eclipse.ease.lang.javascript.test ---
20:32:15 [2020-08-29T00:32:15.200Z] [INFO] Building jar: /home/jenkins/agent/workspace/ease.verify.core.target.2020-03/tests/org.eclipse.ease.lang.javascript.test/target/org.eclipse.ease.lang.javascript.test-0.8.0-SNAPSHOT.jar
20:32:15 [2020-08-29T00:32:15.200Z] [INFO] 
20:32:15 [2020-08-29T00:32:15.200Z] [INFO] --- tycho-p2-plugin:1.3.0:p2-metadata-default (default-p2-metadata-default) @ org.eclipse.ease.lang.javascript.test ---
20:32:15 [2020-08-29T00:32:15.200Z] [INFO] 
20:32:15 [2020-08-29T00:32:15.200Z] [INFO] --- tycho-source-feature-plugin:1.3.0:source-feature (source-feature) @ org.eclipse.ease.lang.javascript.test ---
20:32:15 [2020-08-29T00:32:15.200Z] [INFO] 
20:32:15 [2020-08-29T00:32:15.200Z] [INFO] --- tycho-p2-plugin:1.3.0:p2-metadata (attached-p2-metadata) @ org.eclipse.ease.lang.javascript.test ---
20:32:15 [2020-08-29T00:32:15.200Z] [INFO] 
20:32:15 [2020-08-29T00:32:15.200Z] [INFO] --- tycho-surefire-plugin:1.3.0:test (default-test) @ org.eclipse.ease.lang.javascript.test ---
20:32:15 [2020-08-29T00:32:15.200Z] [INFO] Expected eclipse log file: /home/jenkins/agent/workspace/ease.verify.core.target.2020-03/tests/org.eclipse.ease.lang.javascript.test/target/work/data/.metadata/.log
20:32:15 [2020-08-29T00:32:15.201Z] [INFO] Command line:
20:32:15 [2020-08-29T00:32:15.201Z] 	[/opt/tools/java/oracle/jdk-8/1.8.0_202/jre/bin/java, -Dosgi.noShutdown=false, -Dosgi.os=linux, -Dosgi.ws=gtk, -Dosgi.arch=x86_64, -Dosgi.clean=true, -jar, /home/jenkins/.m2/repository/p2/osgi/bundle/org.eclipse.equinox.launcher/1.5.700.v20200207-2156/org.eclipse.equinox.launcher-1.5.700.v20200207-2156.jar, -data, /home/jenkins/agent/workspace/ease.verify.core.target.2020-03/tests/org.eclipse.ease.lang.javascript.test/target/work/data, -install, /home/jenkins/agent/workspace/ease.verify.core.target.2020-03/tests/org.eclipse.ease.lang.javascript.test/target/work, -configuration, /home/jenkins/agent/workspace/ease.verify.core.target.2020-03/tests/org.eclipse.ease.lang.javascript.test/target/work/configuration, -application, org.eclipse.tycho.surefire.osgibooter.headlesstest, -testproperties, /home/jenkins/agent/workspace/ease.verify.core.target.2020-03/tests/org.eclipse.ease.lang.javascript.test/target/surefire.properties]
20:32:15 [2020-08-29T00:32:15.201Z] Picked up JAVA_TOOL_OPTIONS: -Dmaven.ext.class.path="/home/jenkins/agent/workspace/ease.verify.core.target.2020-03@tmp/withMavenfca47c90/pipeline-maven-spy.jar" -Dorg.jenkinsci.plugins.pipeline.maven.reportsFolder="/home/jenkins/agent/workspace/ease.verify.core.target.2020-03@tmp/withMavenfca47c90" 
20:32:16 [2020-08-29T00:32:16.565Z] Running org.eclipse.ease.lang.javascript.JavaScriptCompletionContextTest
20:32:16 [2020-08-29T00:32:16.565Z] Tests run: 8, Failures: 0, Errors: 0, Skipped: 0, Time elapsed: 0.251 s - in org.eclipse.ease.lang.javascript.JavaScriptCompletionContextTest
20:32:16 [2020-08-29T00:32:16.565Z] verifyStaticClassTypes(org.eclipse.ease.lang.javascript.JavaScriptCompletionContextTest)  Time elapsed: 0.005 s
20:32:16 [2020-08-29T00:32:16.565Z] verifyClassInstanceTypes(org.eclipse.ease.lang.javascript.JavaScriptCompletionContextTest)  Time elapsed: 0.005 s
20:32:16 [2020-08-29T00:32:16.565Z] verifyTypesForScriptEngine(org.eclipse.ease.lang.javascript.JavaScriptCompletionContextTest)  Time elapsed: 0.173 s
20:32:16 [2020-08-29T00:32:16.565Z] verifyPackageTypes(org.eclipse.ease.lang.javascript.JavaScriptCompletionContextTest)  Time elapsed: 0.001 s
20:32:16 [2020-08-29T00:32:16.565Z] definedVariableTypes(org.eclipse.ease.lang.javascript.JavaScriptCompletionContextTest)  Time elapsed: 0.001 s
20:32:16 [2020-08-29T00:32:16.565Z] verifyStringLiteralTypes(org.eclipse.ease.lang.javascript.JavaScriptCompletionContextTest)  Time elapsed: 0 s
20:32:16 [2020-08-29T00:32:16.565Z] verifyUnknownTypes(org.eclipse.ease.lang.javascript.JavaScriptCompletionContextTest)  Time elapsed: 0 s
20:32:16 [2020-08-29T00:32:16.565Z] verifyNoneTypes(org.eclipse.ease.lang.javascript.JavaScriptCompletionContextTest)  Time elapsed: 0 s
20:32:16 [2020-08-29T00:32:16.565Z] Running org.eclipse.ease.lang.javascript.JavaScriptCodeFactoryTest
20:32:16 [2020-08-29T00:32:16.565Z] Tests run: 1, Failures: 0, Errors: 0, Skipped: 0, Time elapsed: 0.004 s - in org.eclipse.ease.lang.javascript.JavaScriptCodeFactoryTest
20:32:16 [2020-08-29T00:32:16.565Z] testCommentCreator(org.eclipse.ease.lang.javascript.JavaScriptCodeFactoryTest)  Time elapsed: 0.003 s
20:32:16 [2020-08-29T00:32:16.565Z] 
20:32:16 [2020-08-29T00:32:16.565Z] Results:
20:32:16 [2020-08-29T00:32:16.565Z] 
20:32:16 [2020-08-29T00:32:16.565Z] Tests run: 9, Failures: 0, Errors: 0, Skipped: 0
20:32:16 [2020-08-29T00:32:16.565Z] 
20:32:17 [2020-08-29T00:32:17.127Z] [INFO] All tests passed!
20:32:17 [2020-08-29T00:32:17.127Z] [INFO] 
20:32:17 [2020-08-29T00:32:17.127Z] [INFO] --- maven-install-plugin:2.3.1:install (default-install) @ org.eclipse.ease.lang.javascript.test ---
20:32:17 [2020-08-29T00:32:17.127Z] [INFO] Installing /home/jenkins/agent/workspace/ease.verify.core.target.2020-03/tests/org.eclipse.ease.lang.javascript.test/target/org.eclipse.ease.lang.javascript.test-0.8.0-SNAPSHOT.jar to /home/jenkins/.m2/repository/org/eclipse/ease/org.eclipse.ease.lang.javascript.test/0.8.0-SNAPSHOT/org.eclipse.ease.lang.javascript.test-0.8.0-SNAPSHOT.jar
20:32:17 [2020-08-29T00:32:17.127Z] [INFO] Installing /home/jenkins/agent/workspace/ease.verify.core.target.2020-03/tests/org.eclipse.ease.lang.javascript.test/pom.xml to /home/jenkins/.m2/repository/org/eclipse/ease/org.eclipse.ease.lang.javascript.test/0.8.0-SNAPSHOT/org.eclipse.ease.lang.javascript.test-0.8.0-SNAPSHOT.pom
20:32:17 [2020-08-29T00:32:17.127Z] [INFO] Installing /home/jenkins/agent/workspace/ease.verify.core.target.2020-03/tests/org.eclipse.ease.lang.javascript.test/target/org.eclipse.ease.lang.javascript.test-0.8.0-SNAPSHOT-sources.jar to /home/jenkins/.m2/repository/org/eclipse/ease/org.eclipse.ease.lang.javascript.test/0.8.0-SNAPSHOT/org.eclipse.ease.lang.javascript.test-0.8.0-SNAPSHOT-sources.jar
20:32:17 [2020-08-29T00:32:17.127Z] [INFO] Installing /home/jenkins/agent/workspace/ease.verify.core.target.2020-03/tests/org.eclipse.ease.lang.javascript.test/target/p2content.xml to /home/jenkins/.m2/repository/org/eclipse/ease/org.eclipse.ease.lang.javascript.test/0.8.0-SNAPSHOT/org.eclipse.ease.lang.javascript.test-0.8.0-SNAPSHOT-p2metadata.xml
20:32:17 [2020-08-29T00:32:17.127Z] [INFO] Installing /home/jenkins/agent/workspace/ease.verify.core.target.2020-03/tests/org.eclipse.ease.lang.javascript.test/target/p2artifacts.xml to /home/jenkins/.m2/repository/org/eclipse/ease/org.eclipse.ease.lang.javascript.test/0.8.0-SNAPSHOT/org.eclipse.ease.lang.javascript.test-0.8.0-SNAPSHOT-p2artifacts.xml
20:32:17 [2020-08-29T00:32:17.127Z] [INFO] Installing /home/jenkins/agent/workspace/ease.verify.core.target.2020-03/tests/org.eclipse.ease.lang.javascript.test/target/p2content.xml to /home/jenkins/.m2/repository/org/eclipse/ease/org.eclipse.ease.lang.javascript.test/0.8.0-SNAPSHOT/org.eclipse.ease.lang.javascript.test-0.8.0-SNAPSHOT-p2metadata.xml
20:32:17 [2020-08-29T00:32:17.127Z] [INFO] Installing /home/jenkins/agent/workspace/ease.verify.core.target.2020-03/tests/org.eclipse.ease.lang.javascript.test/target/p2artifacts.xml to /home/jenkins/.m2/repository/org/eclipse/ease/org.eclipse.ease.lang.javascript.test/0.8.0-SNAPSHOT/org.eclipse.ease.lang.javascript.test-0.8.0-SNAPSHOT-p2artifacts.xml
20:32:17 [2020-08-29T00:32:17.127Z] [INFO] 
20:32:17 [2020-08-29T00:32:17.127Z] [INFO] --- tycho-p2-plugin:1.3.0:update-local-index (default-update-local-index) @ org.eclipse.ease.lang.javascript.test ---
20:32:17 [2020-08-29T00:32:17.127Z] [INFO] 
20:32:17 [2020-08-29T00:32:17.127Z] [INFO] ---------< org.eclipse.ease:org.eclipse.ease.lang.python.test >---------
20:32:17 [2020-08-29T00:32:17.127Z] [INFO] Building org.eclipse.ease.lang.python.test 0.8.0-SNAPSHOT        [42/48]
20:32:17 [2020-08-29T00:32:17.127Z] [INFO] ------------------------[ eclipse-test-plugin ]-------------------------
20:32:17 [2020-08-29T00:32:17.128Z] [INFO] 
20:32:17 [2020-08-29T00:32:17.128Z] [INFO] --- maven-clean-plugin:2.5:clean (default-clean) @ org.eclipse.ease.lang.python.test ---
20:32:17 [2020-08-29T00:32:17.128Z] [INFO] 
20:32:17 [2020-08-29T00:32:17.128Z] [INFO] --- tycho-packaging-plugin:1.3.0:build-qualifier (default-build-qualifier) @ org.eclipse.ease.lang.python.test ---
20:32:17 [2020-08-29T00:32:17.128Z] [INFO] The project's OSGi version is 0.8.0.I201910171213
20:32:17 [2020-08-29T00:32:17.128Z] [INFO] 
20:32:17 [2020-08-29T00:32:17.128Z] [INFO] --- tycho-packaging-plugin:1.3.0:validate-id (default-validate-id) @ org.eclipse.ease.lang.python.test ---
20:32:17 [2020-08-29T00:32:17.128Z] [INFO] 
20:32:17 [2020-08-29T00:32:17.128Z] [INFO] --- tycho-packaging-plugin:1.3.0:validate-version (default-validate-version) @ org.eclipse.ease.lang.python.test ---
20:32:17 [2020-08-29T00:32:17.128Z] [INFO] 
20:32:17 [2020-08-29T00:32:17.128Z] [INFO] >>> maven-javadoc-plugin:2.9.1:javadoc (build-docs) > generate-sources @ org.eclipse.ease.lang.python.test >>>
20:32:17 [2020-08-29T00:32:17.128Z] [INFO] 
20:32:17 [2020-08-29T00:32:17.128Z] [INFO] --- tycho-packaging-plugin:1.3.0:build-qualifier (default-build-qualifier) @ org.eclipse.ease.lang.python.test ---
20:32:17 [2020-08-29T00:32:17.128Z] [INFO] The project's OSGi version is 0.8.0.I201910171213
20:32:17 [2020-08-29T00:32:17.128Z] [INFO] 
20:32:17 [2020-08-29T00:32:17.128Z] [INFO] --- tycho-packaging-plugin:1.3.0:validate-id (default-validate-id) @ org.eclipse.ease.lang.python.test ---
20:32:17 [2020-08-29T00:32:17.128Z] [INFO] 
20:32:17 [2020-08-29T00:32:17.128Z] [INFO] --- tycho-packaging-plugin:1.3.0:validate-version (default-validate-version) @ org.eclipse.ease.lang.python.test ---
20:32:17 [2020-08-29T00:32:17.128Z] [INFO] 
20:32:17 [2020-08-29T00:32:17.128Z] [INFO] <<< maven-javadoc-plugin:2.9.1:javadoc (build-docs) < generate-sources @ org.eclipse.ease.lang.python.test <<<
20:32:17 [2020-08-29T00:32:17.128Z] [INFO] 
20:32:17 [2020-08-29T00:32:17.128Z] [INFO] 
20:32:17 [2020-08-29T00:32:17.128Z] [INFO] --- maven-javadoc-plugin:2.9.1:javadoc (build-docs) @ org.eclipse.ease.lang.python.test ---
20:32:17 [2020-08-29T00:32:17.383Z] [ERROR] Error fetching link: http://help.eclipse.org/oxygen/topic/org.eclipse.platform.doc.isv/reference/api/package-list. Ignored it.
20:32:18 [2020-08-29T00:32:18.309Z] [INFO] 
20:32:18 [2020-08-29T00:32:18.309Z] Loading source files for package org.eclipse.ease.lang.python...
20:32:18 [2020-08-29T00:32:18.309Z] Constructing Javadoc information...
20:32:18 [2020-08-29T00:32:18.309Z] WARNING: Cannot open location "/home/jenkins/agent/workspace/ease.verify.core.target.2020-03/tests/org.eclipse.ease.lang.python.test/target/javadoc-bundle-options/package-list"
20:32:18 [2020-08-29T00:32:18.309Z] No plugin definition found, skipping
20:32:18 [2020-08-29T00:32:18.309Z] No plugin definition found, skipping
20:32:18 [2020-08-29T00:32:18.309Z] [WARNING] Javadoc Warnings
20:32:18 [2020-08-29T00:32:18.309Z] [WARNING] Picked up JAVA_TOOL_OPTIONS: -Dmaven.ext.class.path="/home/jenkins/agent/workspace/ease.verify.core.target.2020-03@tmp/withMavenfca47c90/pipeline-maven-spy.jar" -Dorg.jenkinsci.plugins.pipeline.maven.reportsFolder="/home/jenkins/agent/workspace/ease.verify.core.target.2020-03@tmp/withMavenfca47c90"
20:32:18 [2020-08-29T00:32:18.309Z] [INFO] 
20:32:18 [2020-08-29T00:32:18.309Z] [INFO] --- build-helper-maven-plugin:1.9.1:add-resource (add_help) @ org.eclipse.ease.lang.python.test ---
20:32:18 [2020-08-29T00:32:18.309Z] [INFO] 
20:32:18 [2020-08-29T00:32:18.309Z] [INFO] --- maven-resources-plugin:2.4.3:resources (default-resources) @ org.eclipse.ease.lang.python.test ---
20:32:18 [2020-08-29T00:32:18.309Z] [INFO] Using 'UTF-8' encoding to copy filtered resources.
20:32:18 [2020-08-29T00:32:18.309Z] [INFO] skip non existing resourceDirectory /home/jenkins/agent/workspace/ease.verify.core.target.2020-03/tests/org.eclipse.ease.lang.python.test/src/main/resources
20:32:18 [2020-08-29T00:32:18.309Z] [INFO] skip non existing resourceDirectory /home/jenkins/agent/workspace/ease.verify.core.target.2020-03/tests/org.eclipse.ease.lang.python.test/help
20:32:18 [2020-08-29T00:32:18.309Z] [INFO] 
20:32:18 [2020-08-29T00:32:18.309Z] [INFO] --- tycho-compiler-plugin:1.3.0:compile (default-compile) @ org.eclipse.ease.lang.python.test ---
20:32:18 [2020-08-29T00:32:18.309Z] [INFO] Compiling 1 source file to /home/jenkins/agent/workspace/ease.verify.core.target.2020-03/tests/org.eclipse.ease.lang.python.test/target/classes
20:32:18 [2020-08-29T00:32:18.309Z] [INFO] 
20:32:18 [2020-08-29T00:32:18.309Z] [INFO] --- maven-resources-plugin:2.4.3:testResources (default-testResources) @ org.eclipse.ease.lang.python.test ---
20:32:18 [2020-08-29T00:32:18.309Z] [INFO] Using 'UTF-8' encoding to copy filtered resources.
20:32:18 [2020-08-29T00:32:18.309Z] [INFO] skip non existing resourceDirectory /home/jenkins/agent/workspace/ease.verify.core.target.2020-03/tests/org.eclipse.ease.lang.python.test/src/test/resources
20:32:18 [2020-08-29T00:32:18.309Z] [INFO] 
20:32:18 [2020-08-29T00:32:18.309Z] [INFO] --- tycho-source-plugin:1.3.0:plugin-source (plugin-source) @ org.eclipse.ease.lang.python.test ---
20:32:18 [2020-08-29T00:32:18.309Z] [WARNING] Bundle-Vendor header not found in /home/jenkins/agent/workspace/ease.verify.core.target.2020-03/tests/org.eclipse.ease.lang.python.test/META-INF/MANIFEST.MF, fallback to 'unknown' for source bundle
20:32:18 [2020-08-29T00:32:18.309Z] [INFO] Building jar: /home/jenkins/agent/workspace/ease.verify.core.target.2020-03/tests/org.eclipse.ease.lang.python.test/target/org.eclipse.ease.lang.python.test-0.8.0-SNAPSHOT-sources.jar
20:32:18 [2020-08-29T00:32:18.309Z] [INFO] 
20:32:18 [2020-08-29T00:32:18.309Z] [INFO] --- target-platform-configuration:1.3.0:target-platform (default-target-platform) @ org.eclipse.ease.lang.python.test ---
20:32:18 [2020-08-29T00:32:18.309Z] [INFO] 
20:32:18 [2020-08-29T00:32:18.309Z] [INFO] --- tycho-packaging-plugin:1.3.0:package-plugin (default-package-plugin) @ org.eclipse.ease.lang.python.test ---
20:32:18 [2020-08-29T00:32:18.309Z] [INFO] Building jar: /home/jenkins/agent/workspace/ease.verify.core.target.2020-03/tests/org.eclipse.ease.lang.python.test/target/org.eclipse.ease.lang.python.test-0.8.0-SNAPSHOT.jar
20:32:18 [2020-08-29T00:32:18.309Z] [INFO] 
20:32:18 [2020-08-29T00:32:18.309Z] [INFO] --- tycho-p2-plugin:1.3.0:p2-metadata-default (default-p2-metadata-default) @ org.eclipse.ease.lang.python.test ---
20:32:18 [2020-08-29T00:32:18.309Z] [INFO] 
20:32:18 [2020-08-29T00:32:18.310Z] [INFO] --- tycho-source-feature-plugin:1.3.0:source-feature (source-feature) @ org.eclipse.ease.lang.python.test ---
20:32:18 [2020-08-29T00:32:18.310Z] [INFO] 
20:32:18 [2020-08-29T00:32:18.310Z] [INFO] --- tycho-p2-plugin:1.3.0:p2-metadata (attached-p2-metadata) @ org.eclipse.ease.lang.python.test ---
20:32:18 [2020-08-29T00:32:18.310Z] [INFO] 
20:32:18 [2020-08-29T00:32:18.310Z] [INFO] --- tycho-surefire-plugin:1.3.0:test (default-test) @ org.eclipse.ease.lang.python.test ---
20:32:18 [2020-08-29T00:32:18.568Z] [INFO] Expected eclipse log file: /home/jenkins/agent/workspace/ease.verify.core.target.2020-03/tests/org.eclipse.ease.lang.python.test/target/work/data/.metadata/.log
20:32:18 [2020-08-29T00:32:18.568Z] [INFO] Command line:
20:32:18 [2020-08-29T00:32:18.568Z] 	[/opt/tools/java/oracle/jdk-8/1.8.0_202/jre/bin/java, -Dosgi.noShutdown=false, -Dosgi.os=linux, -Dosgi.ws=gtk, -Dosgi.arch=x86_64, -Dosgi.clean=true, -jar, /home/jenkins/.m2/repository/p2/osgi/bundle/org.eclipse.equinox.launcher/1.5.700.v20200207-2156/org.eclipse.equinox.launcher-1.5.700.v20200207-2156.jar, -data, /home/jenkins/agent/workspace/ease.verify.core.target.2020-03/tests/org.eclipse.ease.lang.python.test/target/work/data, -install, /home/jenkins/agent/workspace/ease.verify.core.target.2020-03/tests/org.eclipse.ease.lang.python.test/target/work, -configuration, /home/jenkins/agent/workspace/ease.verify.core.target.2020-03/tests/org.eclipse.ease.lang.python.test/target/work/configuration, -application, org.eclipse.tycho.surefire.osgibooter.headlesstest, -testproperties, /home/jenkins/agent/workspace/ease.verify.core.target.2020-03/tests/org.eclipse.ease.lang.python.test/target/surefire.properties]
20:32:18 [2020-08-29T00:32:18.568Z] Picked up JAVA_TOOL_OPTIONS: -Dmaven.ext.class.path="/home/jenkins/agent/workspace/ease.verify.core.target.2020-03@tmp/withMavenfca47c90/pipeline-maven-spy.jar" -Dorg.jenkinsci.plugins.pipeline.maven.reportsFolder="/home/jenkins/agent/workspace/ease.verify.core.target.2020-03@tmp/withMavenfca47c90" 
20:32:19 [2020-08-29T00:32:19.953Z] Running org.eclipse.ease.lang.python.PythonCodeFactoryTest
20:32:19 [2020-08-29T00:32:19.953Z] Tests run: 1, Failures: 0, Errors: 0, Skipped: 0, Time elapsed: 0.026 s - in org.eclipse.ease.lang.python.PythonCodeFactoryTest
20:32:19 [2020-08-29T00:32:19.953Z] testCommentCreator(org.eclipse.ease.lang.python.PythonCodeFactoryTest)  Time elapsed: 0.005 s
20:32:19 [2020-08-29T00:32:19.954Z] 
20:32:19 [2020-08-29T00:32:19.954Z] Results:
20:32:19 [2020-08-29T00:32:19.954Z] 
20:32:19 [2020-08-29T00:32:19.954Z] Tests run: 1, Failures: 0, Errors: 0, Skipped: 0
20:32:19 [2020-08-29T00:32:19.954Z] 
20:32:20 [2020-08-29T00:32:20.209Z] [INFO] All tests passed!
20:32:20 [2020-08-29T00:32:20.209Z] [INFO] 
20:32:20 [2020-08-29T00:32:20.209Z] [INFO] --- maven-install-plugin:2.3.1:install (default-install) @ org.eclipse.ease.lang.python.test ---
20:32:20 [2020-08-29T00:32:20.209Z] [INFO] Installing /home/jenkins/agent/workspace/ease.verify.core.target.2020-03/tests/org.eclipse.ease.lang.python.test/target/org.eclipse.ease.lang.python.test-0.8.0-SNAPSHOT.jar to /home/jenkins/.m2/repository/org/eclipse/ease/org.eclipse.ease.lang.python.test/0.8.0-SNAPSHOT/org.eclipse.ease.lang.python.test-0.8.0-SNAPSHOT.jar
20:32:20 [2020-08-29T00:32:20.209Z] [INFO] Installing /home/jenkins/agent/workspace/ease.verify.core.target.2020-03/tests/org.eclipse.ease.lang.python.test/pom.xml to /home/jenkins/.m2/repository/org/eclipse/ease/org.eclipse.ease.lang.python.test/0.8.0-SNAPSHOT/org.eclipse.ease.lang.python.test-0.8.0-SNAPSHOT.pom
20:32:20 [2020-08-29T00:32:20.209Z] [INFO] Installing /home/jenkins/agent/workspace/ease.verify.core.target.2020-03/tests/org.eclipse.ease.lang.python.test/target/org.eclipse.ease.lang.python.test-0.8.0-SNAPSHOT-sources.jar to /home/jenkins/.m2/repository/org/eclipse/ease/org.eclipse.ease.lang.python.test/0.8.0-SNAPSHOT/org.eclipse.ease.lang.python.test-0.8.0-SNAPSHOT-sources.jar
20:32:20 [2020-08-29T00:32:20.209Z] [INFO] Installing /home/jenkins/agent/workspace/ease.verify.core.target.2020-03/tests/org.eclipse.ease.lang.python.test/target/p2content.xml to /home/jenkins/.m2/repository/org/eclipse/ease/org.eclipse.ease.lang.python.test/0.8.0-SNAPSHOT/org.eclipse.ease.lang.python.test-0.8.0-SNAPSHOT-p2metadata.xml
20:32:20 [2020-08-29T00:32:20.209Z] [INFO] Installing /home/jenkins/agent/workspace/ease.verify.core.target.2020-03/tests/org.eclipse.ease.lang.python.test/target/p2artifacts.xml to /home/jenkins/.m2/repository/org/eclipse/ease/org.eclipse.ease.lang.python.test/0.8.0-SNAPSHOT/org.eclipse.ease.lang.python.test-0.8.0-SNAPSHOT-p2artifacts.xml
20:32:20 [2020-08-29T00:32:20.209Z] [INFO] Installing /home/jenkins/agent/workspace/ease.verify.core.target.2020-03/tests/org.eclipse.ease.lang.python.test/target/p2content.xml to /home/jenkins/.m2/repository/org/eclipse/ease/org.eclipse.ease.lang.python.test/0.8.0-SNAPSHOT/org.eclipse.ease.lang.python.test-0.8.0-SNAPSHOT-p2metadata.xml
20:32:20 [2020-08-29T00:32:20.209Z] [INFO] Installing /home/jenkins/agent/workspace/ease.verify.core.target.2020-03/tests/org.eclipse.ease.lang.python.test/target/p2artifacts.xml to /home/jenkins/.m2/repository/org/eclipse/ease/org.eclipse.ease.lang.python.test/0.8.0-SNAPSHOT/org.eclipse.ease.lang.python.test-0.8.0-SNAPSHOT-p2artifacts.xml
20:32:20 [2020-08-29T00:32:20.209Z] [INFO] 
20:32:20 [2020-08-29T00:32:20.209Z] [INFO] --- tycho-p2-plugin:1.3.0:update-local-index (default-update-local-index) @ org.eclipse.ease.lang.python.test ---
20:32:20 [2020-08-29T00:32:20.209Z] [INFO] 
20:32:20 [2020-08-29T00:32:20.209Z] [INFO] -----< org.eclipse.ease:org.eclipse.ease.lang.python.jython.test >------
20:32:20 [2020-08-29T00:32:20.209Z] [INFO] Building org.eclipse.ease.lang.python.jython.test 0.8.0-SNAPSHOT [43/48]
20:32:20 [2020-08-29T00:32:20.209Z] [INFO] ------------------------[ eclipse-test-plugin ]-------------------------
20:32:20 [2020-08-29T00:32:20.209Z] [INFO] 
20:32:20 [2020-08-29T00:32:20.209Z] [INFO] --- maven-clean-plugin:2.5:clean (default-clean) @ org.eclipse.ease.lang.python.jython.test ---
20:32:20 [2020-08-29T00:32:20.209Z] [INFO] 
20:32:20 [2020-08-29T00:32:20.209Z] [INFO] --- tycho-packaging-plugin:1.3.0:build-qualifier (default-build-qualifier) @ org.eclipse.ease.lang.python.jython.test ---
20:32:20 [2020-08-29T00:32:20.465Z] [INFO] The project's OSGi version is 0.8.0.I201911291239
20:32:20 [2020-08-29T00:32:20.465Z] [INFO] 
20:32:20 [2020-08-29T00:32:20.465Z] [INFO] --- tycho-packaging-plugin:1.3.0:validate-id (default-validate-id) @ org.eclipse.ease.lang.python.jython.test ---
20:32:20 [2020-08-29T00:32:20.465Z] [INFO] 
20:32:20 [2020-08-29T00:32:20.465Z] [INFO] --- tycho-packaging-plugin:1.3.0:validate-version (default-validate-version) @ org.eclipse.ease.lang.python.jython.test ---
20:32:20 [2020-08-29T00:32:20.465Z] [INFO] 
20:32:20 [2020-08-29T00:32:20.465Z] [INFO] >>> maven-javadoc-plugin:2.9.1:javadoc (build-docs) > generate-sources @ org.eclipse.ease.lang.python.jython.test >>>
20:32:20 [2020-08-29T00:32:20.465Z] [INFO] 
20:32:20 [2020-08-29T00:32:20.465Z] [INFO] --- tycho-packaging-plugin:1.3.0:build-qualifier (default-build-qualifier) @ org.eclipse.ease.lang.python.jython.test ---
20:32:20 [2020-08-29T00:32:20.465Z] [INFO] The project's OSGi version is 0.8.0.I201911291239
20:32:20 [2020-08-29T00:32:20.465Z] [INFO] 
20:32:20 [2020-08-29T00:32:20.465Z] [INFO] --- tycho-packaging-plugin:1.3.0:validate-id (default-validate-id) @ org.eclipse.ease.lang.python.jython.test ---
20:32:20 [2020-08-29T00:32:20.465Z] [INFO] 
20:32:20 [2020-08-29T00:32:20.465Z] [INFO] --- tycho-packaging-plugin:1.3.0:validate-version (default-validate-version) @ org.eclipse.ease.lang.python.jython.test ---
20:32:20 [2020-08-29T00:32:20.466Z] [INFO] 
20:32:20 [2020-08-29T00:32:20.466Z] [INFO] <<< maven-javadoc-plugin:2.9.1:javadoc (build-docs) < generate-sources @ org.eclipse.ease.lang.python.jython.test <<<
20:32:20 [2020-08-29T00:32:20.466Z] [INFO] 
20:32:20 [2020-08-29T00:32:20.466Z] [INFO] 
20:32:20 [2020-08-29T00:32:20.466Z] [INFO] --- maven-javadoc-plugin:2.9.1:javadoc (build-docs) @ org.eclipse.ease.lang.python.jython.test ---
20:32:20 [2020-08-29T00:32:20.466Z] [ERROR] Error fetching link: http://help.eclipse.org/oxygen/topic/org.eclipse.platform.doc.isv/reference/api/package-list. Ignored it.
20:32:21 [2020-08-29T00:32:21.829Z] [INFO] 
20:32:21 [2020-08-29T00:32:21.829Z] Loading source files for package org.eclipse.ease.lang.python.jython.debugger...
20:32:21 [2020-08-29T00:32:21.829Z] Constructing Javadoc information...
20:32:21 [2020-08-29T00:32:21.829Z] WARNING: Cannot open location "/home/jenkins/agent/workspace/ease.verify.core.target.2020-03/tests/org.eclipse.ease.lang.python.jython.test/target/javadoc-bundle-options/package-list"
20:32:21 [2020-08-29T00:32:21.829Z] No plugin definition found, skipping
20:32:21 [2020-08-29T00:32:21.829Z] No plugin definition found, skipping
20:32:21 [2020-08-29T00:32:21.829Z] [WARNING] Javadoc Warnings
20:32:21 [2020-08-29T00:32:21.829Z] [WARNING] Picked up JAVA_TOOL_OPTIONS: -Dmaven.ext.class.path="/home/jenkins/agent/workspace/ease.verify.core.target.2020-03@tmp/withMavenfca47c90/pipeline-maven-spy.jar" -Dorg.jenkinsci.plugins.pipeline.maven.reportsFolder="/home/jenkins/agent/workspace/ease.verify.core.target.2020-03@tmp/withMavenfca47c90"
20:32:21 [2020-08-29T00:32:21.829Z] [INFO] 
20:32:21 [2020-08-29T00:32:21.829Z] [INFO] --- build-helper-maven-plugin:1.9.1:add-resource (add_help) @ org.eclipse.ease.lang.python.jython.test ---
20:32:21 [2020-08-29T00:32:21.829Z] [INFO] 
20:32:21 [2020-08-29T00:32:21.829Z] [INFO] --- maven-resources-plugin:2.4.3:resources (default-resources) @ org.eclipse.ease.lang.python.jython.test ---
20:32:21 [2020-08-29T00:32:21.829Z] [INFO] Using 'UTF-8' encoding to copy filtered resources.
20:32:21 [2020-08-29T00:32:21.829Z] [INFO] skip non existing resourceDirectory /home/jenkins/agent/workspace/ease.verify.core.target.2020-03/tests/org.eclipse.ease.lang.python.jython.test/src/main/resources
20:32:21 [2020-08-29T00:32:21.829Z] [INFO] skip non existing resourceDirectory /home/jenkins/agent/workspace/ease.verify.core.target.2020-03/tests/org.eclipse.ease.lang.python.jython.test/help
20:32:21 [2020-08-29T00:32:21.829Z] [INFO] 
20:32:21 [2020-08-29T00:32:21.829Z] [INFO] --- tycho-compiler-plugin:1.3.0:compile (default-compile) @ org.eclipse.ease.lang.python.jython.test ---
20:32:21 [2020-08-29T00:32:21.829Z] [INFO] Compiling 1 source file to /home/jenkins/agent/workspace/ease.verify.core.target.2020-03/tests/org.eclipse.ease.lang.python.jython.test/target/classes
20:32:21 [2020-08-29T00:32:21.829Z] [INFO] 
20:32:21 [2020-08-29T00:32:21.829Z] [INFO] --- maven-resources-plugin:2.4.3:testResources (default-testResources) @ org.eclipse.ease.lang.python.jython.test ---
20:32:21 [2020-08-29T00:32:21.829Z] [INFO] Using 'UTF-8' encoding to copy filtered resources.
20:32:21 [2020-08-29T00:32:21.829Z] [INFO] skip non existing resourceDirectory /home/jenkins/agent/workspace/ease.verify.core.target.2020-03/tests/org.eclipse.ease.lang.python.jython.test/src/test/resources
20:32:21 [2020-08-29T00:32:21.829Z] [INFO] 
20:32:21 [2020-08-29T00:32:21.829Z] [INFO] --- tycho-source-plugin:1.3.0:plugin-source (plugin-source) @ org.eclipse.ease.lang.python.jython.test ---
20:32:21 [2020-08-29T00:32:21.829Z] [WARNING] Bundle-Vendor header not found in /home/jenkins/agent/workspace/ease.verify.core.target.2020-03/tests/org.eclipse.ease.lang.python.jython.test/META-INF/MANIFEST.MF, fallback to 'unknown' for source bundle
20:32:21 [2020-08-29T00:32:21.829Z] [INFO] Building jar: /home/jenkins/agent/workspace/ease.verify.core.target.2020-03/tests/org.eclipse.ease.lang.python.jython.test/target/org.eclipse.ease.lang.python.jython.test-0.8.0-SNAPSHOT-sources.jar
20:32:21 [2020-08-29T00:32:21.829Z] [INFO] 
20:32:21 [2020-08-29T00:32:21.829Z] [INFO] --- target-platform-configuration:1.3.0:target-platform (default-target-platform) @ org.eclipse.ease.lang.python.jython.test ---
20:32:21 [2020-08-29T00:32:21.829Z] [INFO] 
20:32:21 [2020-08-29T00:32:21.829Z] [INFO] --- tycho-packaging-plugin:1.3.0:package-plugin (default-package-plugin) @ org.eclipse.ease.lang.python.jython.test ---
20:32:21 [2020-08-29T00:32:21.829Z] [INFO] Building jar: /home/jenkins/agent/workspace/ease.verify.core.target.2020-03/tests/org.eclipse.ease.lang.python.jython.test/target/org.eclipse.ease.lang.python.jython.test-0.8.0-SNAPSHOT.jar
20:32:21 [2020-08-29T00:32:21.829Z] [INFO] 
20:32:21 [2020-08-29T00:32:21.829Z] [INFO] --- tycho-p2-plugin:1.3.0:p2-metadata-default (default-p2-metadata-default) @ org.eclipse.ease.lang.python.jython.test ---
20:32:21 [2020-08-29T00:32:21.829Z] [INFO] 
20:32:21 [2020-08-29T00:32:21.829Z] [INFO] --- tycho-source-feature-plugin:1.3.0:source-feature (source-feature) @ org.eclipse.ease.lang.python.jython.test ---
20:32:21 [2020-08-29T00:32:21.829Z] [INFO] 
20:32:21 [2020-08-29T00:32:21.830Z] [INFO] --- tycho-p2-plugin:1.3.0:p2-metadata (attached-p2-metadata) @ org.eclipse.ease.lang.python.jython.test ---
20:32:21 [2020-08-29T00:32:21.830Z] [INFO] 
20:32:21 [2020-08-29T00:32:21.830Z] [INFO] --- tycho-surefire-plugin:1.3.0:test (default-test) @ org.eclipse.ease.lang.python.jython.test ---
20:32:22 [2020-08-29T00:32:22.085Z] [INFO] Expected eclipse log file: /home/jenkins/agent/workspace/ease.verify.core.target.2020-03/tests/org.eclipse.ease.lang.python.jython.test/target/work/data/.metadata/.log
20:32:22 [2020-08-29T00:32:22.085Z] [INFO] Command line:
20:32:22 [2020-08-29T00:32:22.085Z] 	[/opt/tools/java/oracle/jdk-8/1.8.0_202/jre/bin/java, -Dosgi.noShutdown=false, -Dosgi.os=linux, -Dosgi.ws=gtk, -Dosgi.arch=x86_64, -Dosgi.clean=true, -jar, /home/jenkins/.m2/repository/p2/osgi/bundle/org.eclipse.equinox.launcher/1.5.700.v20200207-2156/org.eclipse.equinox.launcher-1.5.700.v20200207-2156.jar, -data, /home/jenkins/agent/workspace/ease.verify.core.target.2020-03/tests/org.eclipse.ease.lang.python.jython.test/target/work/data, -install, /home/jenkins/agent/workspace/ease.verify.core.target.2020-03/tests/org.eclipse.ease.lang.python.jython.test/target/work, -configuration, /home/jenkins/agent/workspace/ease.verify.core.target.2020-03/tests/org.eclipse.ease.lang.python.jython.test/target/work/configuration, -application, org.eclipse.tycho.surefire.osgibooter.headlesstest, -testproperties, /home/jenkins/agent/workspace/ease.verify.core.target.2020-03/tests/org.eclipse.ease.lang.python.jython.test/target/surefire.properties]
20:32:22 [2020-08-29T00:32:22.085Z] Picked up JAVA_TOOL_OPTIONS: -Dmaven.ext.class.path="/home/jenkins/agent/workspace/ease.verify.core.target.2020-03@tmp/withMavenfca47c90/pipeline-maven-spy.jar" -Dorg.jenkinsci.plugins.pipeline.maven.reportsFolder="/home/jenkins/agent/workspace/ease.verify.core.target.2020-03@tmp/withMavenfca47c90" 
20:32:23 [2020-08-29T00:32:23.977Z] Running org.eclipse.ease.lang.python.jython.debugger.JythonDebugTest
20:32:25 [2020-08-29T00:32:25.353Z] Start of script
20:32:25 [2020-08-29T00:32:25.353Z] include file start
20:32:25 [2020-08-29T00:32:25.353Z] include file processed
20:32:25 [2020-08-29T00:32:25.353Z] Result of testMethod = 5
20:32:25 [2020-08-29T00:32:25.353Z] End of script
20:32:25 [2020-08-29T00:32:25.609Z] Start of script
20:32:25 [2020-08-29T00:32:25.609Z] include file start
20:32:25 [2020-08-29T00:32:25.609Z] include file processed
20:32:25 [2020-08-29T00:32:25.609Z] Result of testMethod = 5
20:32:25 [2020-08-29T00:32:25.609Z] End of script
20:32:25 [2020-08-29T00:32:25.864Z] Start of script
20:32:25 [2020-08-29T00:32:25.864Z] include file start
20:32:25 [2020-08-29T00:32:25.864Z] include file processed
20:32:25 [2020-08-29T00:32:25.864Z] Result of testMethod = 5
20:32:25 [2020-08-29T00:32:25.864Z] Traceback (most recent call last):
20:32:25 [2020-08-29T00:32:25.864Z]   File "(none)", line 184, in run
20:32:25 [2020-08-29T00:32:25.864Z]   File "__ref_L/Debug Test/Main.py_btljuykris", line 23, in <module>
20:32:25 [2020-08-29T00:32:25.864Z]   File "(none)", line 161, in trace_dispatch
20:32:25 [2020-08-29T00:32:25.864Z] org.eclipse.ease.ExitException: 
20:32:25 [2020-08-29T00:32:25.864Z] 
20:32:25 [2020-08-29T00:32:25.864Z] org.eclipse.ease.ExitException: org.eclipse.ease.ExitException: 
20:32:26 [2020-08-29T00:32:26.121Z] Start of script
20:32:26 [2020-08-29T00:32:26.121Z] include file start
20:32:26 [2020-08-29T00:32:26.121Z] include file processed
20:32:26 [2020-08-29T00:32:26.376Z] Result of testMethod = 5
20:32:26 [2020-08-29T00:32:26.376Z] End of script
20:32:26 [2020-08-29T00:32:26.632Z] Start of script
20:32:26 [2020-08-29T00:32:26.632Z] include file start
20:32:26 [2020-08-29T00:32:26.632Z] include file processed
20:32:26 [2020-08-29T00:32:26.632Z] Result of testMethod = 5
20:32:26 [2020-08-29T00:32:26.632Z] End of script
20:32:26 [2020-08-29T00:32:26.632Z] Start of script
20:32:26 [2020-08-29T00:32:26.632Z] include file start
20:32:26 [2020-08-29T00:32:26.632Z] include file processed
20:32:26 [2020-08-29T00:32:26.888Z] Result of testMethod = 5
20:32:26 [2020-08-29T00:32:26.888Z] End of script
20:32:27 [2020-08-29T00:32:27.144Z] Start of script
20:32:27 [2020-08-29T00:32:27.144Z] include file start
20:32:27 [2020-08-29T00:32:27.144Z] include file processed
20:32:27 [2020-08-29T00:32:27.144Z] Result of testMethod = 5
20:32:27 [2020-08-29T00:32:27.144Z] Traceback (most recent call last):
20:32:27 [2020-08-29T00:32:27.144Z]   File "(none)", line 184, in run
20:32:27 [2020-08-29T00:32:27.144Z]   File "__ref_L/Debug Test/Main.py_avivauykdj", line 23, in <module>
20:32:27 [2020-08-29T00:32:27.144Z]   File "(none)", line 161, in trace_dispatch
20:32:27 [2020-08-29T00:32:27.144Z] org.eclipse.ease.ExitException: 
20:32:27 [2020-08-29T00:32:27.144Z] 
20:32:27 [2020-08-29T00:32:27.144Z] org.eclipse.ease.ExitException: org.eclipse.ease.ExitException: 
20:32:27 [2020-08-29T00:32:27.399Z] Start of script
20:32:27 [2020-08-29T00:32:27.399Z] include file start
20:32:27 [2020-08-29T00:32:27.399Z] include file processed
20:32:27 [2020-08-29T00:32:27.399Z] Result of testMethod = 5
20:32:27 [2020-08-29T00:32:27.399Z] End of script
20:32:27 [2020-08-29T00:32:27.655Z] Start of script
20:32:27 [2020-08-29T00:32:27.655Z] include file start
20:32:27 [2020-08-29T00:32:27.655Z] include file processed
20:32:27 [2020-08-29T00:32:27.655Z] Result of testMethod = 5
20:32:27 [2020-08-29T00:32:27.655Z] End of script
20:32:27 [2020-08-29T00:32:27.911Z] Start of script
20:32:27 [2020-08-29T00:32:27.911Z] include file start
20:32:27 [2020-08-29T00:32:27.911Z] include file processed
20:32:28 [2020-08-29T00:32:28.166Z] Traceback (most recent call last):
20:32:28 [2020-08-29T00:32:28.166Z]   File "(none)", line 184, in run
20:32:28 [2020-08-29T00:32:28.166Z]   File "__ref_L/Debug Test/Main.py_bplulgcfpq", line 22, in <module>
20:32:28 [2020-08-29T00:32:28.166Z]   File "(none)", line 161, in trace_dispatch
20:32:28 [2020-08-29T00:32:28.166Z] org.eclipse.ease.ExitException: 
20:32:28 [2020-08-29T00:32:28.166Z] 
20:32:28 [2020-08-29T00:32:28.166Z] org.eclipse.ease.ExitException: org.eclipse.ease.ExitException: 
20:32:28 [2020-08-29T00:32:28.422Z] Start of script
20:32:28 [2020-08-29T00:32:28.422Z] include file start
20:32:28 [2020-08-29T00:32:28.422Z] include file processed
20:32:28 [2020-08-29T00:32:28.422Z] Result of testMethod = 5
20:32:28 [2020-08-29T00:32:28.422Z] End of script
20:32:28 [2020-08-29T00:32:28.678Z] Start of script
20:32:28 [2020-08-29T00:32:28.678Z] include file start
20:32:28 [2020-08-29T00:32:28.678Z] include file processed
20:32:28 [2020-08-29T00:32:28.678Z] Result of testMethod = 5
20:32:28 [2020-08-29T00:32:28.678Z] End of script
20:32:28 [2020-08-29T00:32:28.934Z] Traceback (most recent call last):
20:32:28 [2020-08-29T00:32:28.934Z]   File "(none)", line 184, in run
20:32:28 [2020-08-29T00:32:28.934Z]   File "__ref_L/Debug Test/Main.py_jbyzlhxsco", line 1, in <module>
20:32:28 [2020-08-29T00:32:28.934Z]   File "(none)", line 161, in trace_dispatch
20:32:28 [2020-08-29T00:32:28.934Z] org.eclipse.ease.ExitException: 
20:32:28 [2020-08-29T00:32:28.934Z] 
20:32:28 [2020-08-29T00:32:28.934Z] org.eclipse.ease.ExitException: org.eclipse.ease.ExitException: 
20:32:29 [2020-08-29T00:32:29.188Z] Start of script
20:32:29 [2020-08-29T00:32:29.188Z] include file start
20:32:29 [2020-08-29T00:32:29.188Z] include file processed
20:32:29 [2020-08-29T00:32:29.188Z] Result of testMethod = 5
20:32:29 [2020-08-29T00:32:29.188Z] End of script
20:32:29 [2020-08-29T00:32:29.188Z] Start of script
20:32:29 [2020-08-29T00:32:29.189Z] include file start
20:32:29 [2020-08-29T00:32:29.189Z] include file processed
20:32:29 [2020-08-29T00:32:29.443Z] Result of testMethod = 5
20:32:29 [2020-08-29T00:32:29.444Z] End of script
20:32:29 [2020-08-29T00:32:29.699Z] Start of script
20:32:29 [2020-08-29T00:32:29.699Z] include file start
20:32:29 [2020-08-29T00:32:29.699Z] include file processed
20:32:29 [2020-08-29T00:32:29.699Z] Result of testMethod = 5
20:32:29 [2020-08-29T00:32:29.699Z] Traceback (most recent call last):
20:32:29 [2020-08-29T00:32:29.699Z]   File "(none)", line 184, in run
20:32:29 [2020-08-29T00:32:29.699Z]   File "__ref_L/Debug Test/Main.py_xorqymjefl", line 23, in <module>
20:32:29 [2020-08-29T00:32:29.699Z]   File "(none)", line 161, in trace_dispatch
20:32:29 [2020-08-29T00:32:29.699Z] org.eclipse.ease.ExitException: 
20:32:29 [2020-08-29T00:32:29.699Z] 
20:32:29 [2020-08-29T00:32:29.699Z] org.eclipse.ease.ExitException: org.eclipse.ease.ExitException: 
20:32:29 [2020-08-29T00:32:29.955Z] Start of script
20:32:29 [2020-08-29T00:32:29.955Z] include file start
20:32:29 [2020-08-29T00:32:29.955Z] include file processed
20:32:29 [2020-08-29T00:32:29.955Z] Result of testMethod = 5
20:32:29 [2020-08-29T00:32:29.955Z] End of script
20:32:30 [2020-08-29T00:32:30.211Z] Start of script
20:32:30 [2020-08-29T00:32:30.211Z] include file start
20:32:30 [2020-08-29T00:32:30.211Z] include file processed
20:32:30 [2020-08-29T00:32:30.211Z] Result of testMethod = 5
20:32:30 [2020-08-29T00:32:30.211Z] End of script
20:32:30 [2020-08-29T00:32:30.211Z] Start of script
20:32:30 [2020-08-29T00:32:30.211Z] include file start
20:32:30 [2020-08-29T00:32:30.211Z] include file processed
20:32:30 [2020-08-29T00:32:30.211Z] Result of testMethod = 5
20:32:30 [2020-08-29T00:32:30.469Z] End of script
20:32:30 [2020-08-29T00:32:30.470Z] Start of script
20:32:30 [2020-08-29T00:32:30.470Z] include file start
20:32:30 [2020-08-29T00:32:30.470Z] include file processed
20:32:30 [2020-08-29T00:32:30.730Z] Result of testMethod = 5
20:32:30 [2020-08-29T00:32:30.730Z] End of script
20:32:30 [2020-08-29T00:32:30.992Z] Traceback (most recent call last):
20:32:30 [2020-08-29T00:32:30.992Z]   File "(none)", line 184, in run
20:32:30 [2020-08-29T00:32:30.992Z]   File "__ref_L/Debug Test/Main.py_txdmrxzcwm", line 1, in <module>
20:32:30 [2020-08-29T00:32:30.992Z]   File "(none)", line 161, in trace_dispatch
20:32:30 [2020-08-29T00:32:30.992Z] org.eclipse.ease.ExitException: 
20:32:30 [2020-08-29T00:32:30.992Z] 
20:32:30 [2020-08-29T00:32:30.992Z] org.eclipse.ease.ExitException: org.eclipse.ease.ExitException: 
20:32:30 [2020-08-29T00:32:30.992Z] Start of script
20:32:30 [2020-08-29T00:32:30.992Z] include file start
20:32:30 [2020-08-29T00:32:30.992Z] include file processed
20:32:31 [2020-08-29T00:32:31.250Z] Result of testMethod = 5
20:32:31 [2020-08-29T00:32:31.250Z] End of script
20:32:31 [2020-08-29T00:32:31.250Z] Start of script
20:32:31 [2020-08-29T00:32:31.250Z] include file start
20:32:31 [2020-08-29T00:32:31.250Z] include file processed
20:32:31 [2020-08-29T00:32:31.250Z] Result of testMethod = 5
20:32:31 [2020-08-29T00:32:31.505Z] Traceback (most recent call last):
20:32:31 [2020-08-29T00:32:31.505Z]   File "(none)", line 184, in run
20:32:31 [2020-08-29T00:32:31.505Z]   File "__ref_L/Debug Test/Main.py_uippiuhqbj", line 23, in <module>
20:32:31 [2020-08-29T00:32:31.505Z]   File "(none)", line 161, in trace_dispatch
20:32:31 [2020-08-29T00:32:31.505Z] org.eclipse.ease.ExitException: 
20:32:31 [2020-08-29T00:32:31.505Z] 
20:32:31 [2020-08-29T00:32:31.505Z] org.eclipse.ease.ExitException: org.eclipse.ease.ExitException: 
20:32:31 [2020-08-29T00:32:31.760Z] Start of script
20:32:31 [2020-08-29T00:32:31.760Z] include file start
20:32:31 [2020-08-29T00:32:31.761Z] include file processed
20:32:31 [2020-08-29T00:32:31.761Z] Result of testMethod = 5
20:32:31 [2020-08-29T00:32:31.761Z] End of script
20:32:31 [2020-08-29T00:32:31.761Z] Start of script
20:32:31 [2020-08-29T00:32:31.761Z] include file start
20:32:31 [2020-08-29T00:32:31.761Z] include file processed
20:32:32 [2020-08-29T00:32:32.016Z] Result of testMethod = 5
20:32:32 [2020-08-29T00:32:32.016Z] End of script
20:32:32 [2020-08-29T00:32:32.016Z] Start of script
20:32:32 [2020-08-29T00:32:32.271Z] include file start
20:32:32 [2020-08-29T00:32:32.271Z] include file processed
20:32:32 [2020-08-29T00:32:32.271Z] Result of testMethod = 5
20:32:32 [2020-08-29T00:32:32.271Z] End of script
20:32:32 [2020-08-29T00:32:32.271Z] Start of script
20:32:32 [2020-08-29T00:32:32.271Z] include file start
20:32:32 [2020-08-29T00:32:32.271Z] include file processed
20:32:32 [2020-08-29T00:32:32.526Z] Result of testMethod = 5
20:32:32 [2020-08-29T00:32:32.526Z] End of script
20:32:32 [2020-08-29T00:32:32.526Z] Start of script
20:32:32 [2020-08-29T00:32:32.527Z] include file start
20:32:32 [2020-08-29T00:32:32.527Z] include file processed
20:32:32 [2020-08-29T00:32:32.782Z] Traceback (most recent call last):
20:32:32 [2020-08-29T00:32:32.782Z]   File "(none)", line 184, in run
20:32:32 [2020-08-29T00:32:32.782Z]   File "__ref_L/Debug Test/Main.py_czrbsvvewb", line 21, in <module>
20:32:32 [2020-08-29T00:32:32.782Z]   File "__ref_L/Debug Test/Main.py_czrbsvvewb", line 18, in testMethod
20:32:32 [2020-08-29T00:32:32.782Z]   File "(none)", line 161, in trace_dispatch
20:32:32 [2020-08-29T00:32:32.782Z] org.eclipse.ease.ExitException: 
20:32:32 [2020-08-29T00:32:32.782Z] 
20:32:32 [2020-08-29T00:32:32.782Z] org.eclipse.ease.ExitException: org.eclipse.ease.ExitException: 
20:32:32 [2020-08-29T00:32:32.782Z] Start of script
20:32:33 [2020-08-29T00:32:33.038Z] include file start
20:32:33 [2020-08-29T00:32:33.038Z] include file processed
20:32:33 [2020-08-29T00:32:33.038Z] Result of testMethod = 5
20:32:33 [2020-08-29T00:32:33.038Z] End of script
20:32:33 [2020-08-29T00:32:33.038Z] Start of script
20:32:33 [2020-08-29T00:32:33.038Z] include file start
20:32:33 [2020-08-29T00:32:33.038Z] include file processed
20:32:33 [2020-08-29T00:32:33.038Z] Result of testMethod = 5
20:32:33 [2020-08-29T00:32:33.293Z] Traceback (most recent call last):
20:32:33 [2020-08-29T00:32:33.293Z]   File "(none)", line 184, in run
20:32:33 [2020-08-29T00:32:33.293Z]   File "__ref_L/Debug Test/Main.py_kgmfdimmvx", line 23, in <module>
20:32:33 [2020-08-29T00:32:33.293Z]   File "(none)", line 161, in trace_dispatch
20:32:33 [2020-08-29T00:32:33.293Z] org.eclipse.ease.ExitException: 
20:32:33 [2020-08-29T00:32:33.293Z] 
20:32:33 [2020-08-29T00:32:33.293Z] org.eclipse.ease.ExitException: org.eclipse.ease.ExitException: 
20:32:33 [2020-08-29T00:32:33.549Z] Start of script
20:32:33 [2020-08-29T00:32:33.549Z] include file start
20:32:33 [2020-08-29T00:32:33.549Z] include file processed
20:32:33 [2020-08-29T00:32:33.549Z] Result of testMethod = 5
20:32:33 [2020-08-29T00:32:33.549Z] End of script
20:32:33 [2020-08-29T00:32:33.549Z] Start of script
20:32:33 [2020-08-29T00:32:33.549Z] include file start
20:32:33 [2020-08-29T00:32:33.549Z] include file processed
20:32:33 [2020-08-29T00:32:33.805Z] Result of testMethod = 5
20:32:33 [2020-08-29T00:32:33.805Z] End of script
20:32:34 [2020-08-29T00:32:34.061Z] Start of script
20:32:34 [2020-08-29T00:32:34.061Z] include file start
20:32:34 [2020-08-29T00:32:34.061Z] include file processed
20:32:34 [2020-08-29T00:32:34.061Z] Result of testMethod = 5
20:32:34 [2020-08-29T00:32:34.061Z] End of script
20:32:34 [2020-08-29T00:32:34.316Z] Start of script
20:32:34 [2020-08-29T00:32:34.316Z] include file start
20:32:34 [2020-08-29T00:32:34.317Z] include file processed
20:32:34 [2020-08-29T00:32:34.317Z] Result of testMethod = 5
20:32:34 [2020-08-29T00:32:34.317Z] End of script
20:32:34 [2020-08-29T00:32:34.573Z] Start of script
20:32:34 [2020-08-29T00:32:34.573Z] include file start
20:32:34 [2020-08-29T00:32:34.573Z] include file processed
20:32:34 [2020-08-29T00:32:34.573Z] Result of testMethod = 5
20:32:34 [2020-08-29T00:32:34.573Z] Traceback (most recent call last):
20:32:34 [2020-08-29T00:32:34.573Z]   File "(none)", line 184, in run
20:32:34 [2020-08-29T00:32:34.573Z]   File "__ref_L/Debug Test/Main.py_lkfxyaoooa", line 23, in <module>
20:32:34 [2020-08-29T00:32:34.573Z]   File "(none)", line 161, in trace_dispatch
20:32:34 [2020-08-29T00:32:34.573Z] org.eclipse.ease.ExitException: 
20:32:34 [2020-08-29T00:32:34.573Z] 
20:32:34 [2020-08-29T00:32:34.573Z] org.eclipse.ease.ExitException: org.eclipse.ease.ExitException: 
20:32:34 [2020-08-29T00:32:34.829Z] Start of script
20:32:34 [2020-08-29T00:32:34.829Z] include file start
20:32:34 [2020-08-29T00:32:34.829Z] include file processed
20:32:34 [2020-08-29T00:32:34.829Z] Result of testMethod = 5
20:32:34 [2020-08-29T00:32:34.829Z] End of script
20:32:35 [2020-08-29T00:32:35.085Z] Start of script
20:32:35 [2020-08-29T00:32:35.085Z] include file start
20:32:35 [2020-08-29T00:32:35.085Z] include file processed
20:32:35 [2020-08-29T00:32:35.085Z] Result of testMethod = 5
20:32:35 [2020-08-29T00:32:35.085Z] Traceback (most recent call last):
20:32:35 [2020-08-29T00:32:35.085Z]   File "(none)", line 184, in run
20:32:35 [2020-08-29T00:32:35.085Z]   File "__ref_L/Debug Test/Main.py_vhxbketpwa", line 23, in <module>
20:32:35 [2020-08-29T00:32:35.085Z]   File "(none)", line 161, in trace_dispatch
20:32:35 [2020-08-29T00:32:35.085Z] org.eclipse.ease.ExitException: 
20:32:35 [2020-08-29T00:32:35.085Z] 
20:32:35 [2020-08-29T00:32:35.085Z] org.eclipse.ease.ExitException: org.eclipse.ease.ExitException: 
20:32:35 [2020-08-29T00:32:35.340Z] Traceback (most recent call last):
20:32:35 [2020-08-29T00:32:35.340Z]   File "(none)", line 184, in run
20:32:35 [2020-08-29T00:32:35.340Z]   File "__ref_L/Debug Test/Main.py_gqftnivzow", line 1, in <module>
20:32:35 [2020-08-29T00:32:35.340Z]   File "(none)", line 161, in trace_dispatch
20:32:35 [2020-08-29T00:32:35.340Z] org.eclipse.ease.ExitException: 
20:32:35 [2020-08-29T00:32:35.340Z] 
20:32:35 [2020-08-29T00:32:35.340Z] org.eclipse.ease.ExitException: org.eclipse.ease.ExitException: 
20:32:35 [2020-08-29T00:32:35.596Z] Start of script
20:32:35 [2020-08-29T00:32:35.596Z] include file start
20:32:35 [2020-08-29T00:32:35.596Z] include file processed
20:32:35 [2020-08-29T00:32:35.596Z] Result of testMethod = 5
20:32:35 [2020-08-29T00:32:35.596Z] End of script
20:32:35 [2020-08-29T00:32:35.596Z] Start of script
20:32:35 [2020-08-29T00:32:35.596Z] include file start
20:32:35 [2020-08-29T00:32:35.596Z] include file processed
20:32:35 [2020-08-29T00:32:35.852Z] Result of testMethod = 5
20:32:35 [2020-08-29T00:32:35.852Z] End of script
20:32:36 [2020-08-29T00:32:36.107Z] Start of script
20:32:36 [2020-08-29T00:32:36.107Z] include file start
20:32:36 [2020-08-29T00:32:36.107Z] include file processed
20:32:36 [2020-08-29T00:32:36.107Z] Result of testMethod = 5
20:32:36 [2020-08-29T00:32:36.107Z] End of script
20:32:36 [2020-08-29T00:32:36.107Z] Tests run: 42, Failures: 1, Errors: 0, Skipped: 0, Time elapsed: 12.159 s <<< FAILURE! - in org.eclipse.ease.lang.python.jython.debugger.JythonDebugTest
20:32:36 [2020-08-29T00:32:36.107Z] disconnectProcessInSuspendedState(org.eclipse.ease.lang.python.jython.debugger.JythonDebugTest)  Time elapsed: 1.484 s
20:32:36 [2020-08-29T00:32:36.107Z] stepReturnIncludeCommand(org.eclipse.ease.lang.python.jython.debugger.JythonDebugTest)  Time elapsed: 0.212 s
20:32:36 [2020-08-29T00:32:36.107Z] arrayVariableSorting(org.eclipse.ease.lang.python.jython.debugger.JythonDebugTest)  Time elapsed: 0.309 s
20:32:36 [2020-08-29T00:32:36.107Z] stepOverOnDebugTarget(org.eclipse.ease.lang.python.jython.debugger.JythonDebugTest)  Time elapsed: 0.309 s
20:32:36 [2020-08-29T00:32:36.107Z] hasDebugTarget(org.eclipse.ease.lang.python.jython.debugger.JythonDebugTest)  Time elapsed: 0.106 s
20:32:36 [2020-08-29T00:32:36.107Z] disconnectThreadInSuspendedState(org.eclipse.ease.lang.python.jython.debugger.JythonDebugTest)  Time elapsed: 0.209 s
20:32:36 [2020-08-29T00:32:36.107Z] stepReturnOnDebugTarget(org.eclipse.ease.lang.python.jython.debugger.JythonDebugTest)  Time elapsed: 0.307 s
20:32:36 [2020-08-29T00:32:36.108Z] nullVariable(org.eclipse.ease.lang.python.jython.debugger.JythonDebugTest)  Time elapsed: 0.306 s
20:32:36 [2020-08-29T00:32:36.108Z] stepOverOnStackFrame(org.eclipse.ease.lang.python.jython.debugger.JythonDebugTest)  Time elapsed: 0.307 s
20:32:36 [2020-08-29T00:32:36.108Z] resumeOnDebugTarget(org.eclipse.ease.lang.python.jython.debugger.JythonDebugTest)  Time elapsed: 0.206 s
20:32:36 [2020-08-29T00:32:36.108Z] modifyVariableKeepingType(org.eclipse.ease.lang.python.jython.debugger.JythonDebugTest)  Time elapsed: 0.505 s
20:32:36 [2020-08-29T00:32:36.108Z] resumeOnLastIncludeLine(org.eclipse.ease.lang.python.jython.debugger.JythonDebugTest)  Time elapsed: 0.206 s
20:32:36 [2020-08-29T00:32:36.108Z] stepReturnOnStackFrame(org.eclipse.ease.lang.python.jython.debugger.JythonDebugTest)  Time elapsed: 0.307 s
20:32:36 [2020-08-29T00:32:36.108Z] terminateStackFrameInSuspendedState(org.eclipse.ease.lang.python.jython.debugger.JythonDebugTest)  Time elapsed: 0.207 s
20:32:36 [2020-08-29T00:32:36.108Z] breakpointLocation(org.eclipse.ease.lang.python.jython.debugger.JythonDebugTest)  Time elapsed: 0.206 s
20:32:36 [2020-08-29T00:32:36.108Z] stepReturnOnThread(org.eclipse.ease.lang.python.jython.debugger.JythonDebugTest)  Time elapsed: 0.308 s
20:32:36 [2020-08-29T00:32:36.108Z] javaClassVariable(org.eclipse.ease.lang.python.jython.debugger.JythonDebugTest)  Time elapsed: 0.307 s
20:32:36 [2020-08-29T00:32:36.108Z] stepIntoOnThread(org.eclipse.ease.lang.python.jython.debugger.JythonDebugTest)  Time elapsed: 0.307 s
20:32:36 [2020-08-29T00:32:36.108Z] terminateThreadInSuspendedState(org.eclipse.ease.lang.python.jython.debugger.JythonDebugTest)  Time elapsed: 0.106 s  <<< FAILURE!
20:32:36 [2020-08-29T00:32:36.108Z] java.lang.AssertionError: expected:<1> but was:<0>
20:32:36 [2020-08-29T00:32:36.108Z] 
20:32:36 [2020-08-29T00:32:36.108Z] resumeOnThread(org.eclipse.ease.lang.python.jython.debugger.JythonDebugTest)  Time elapsed: 0.207 s
20:32:36 [2020-08-29T00:32:36.108Z] stepIntoOnStackFrame(org.eclipse.ease.lang.python.jython.debugger.JythonDebugTest)  Time elapsed: 0.306 s
20:32:36 [2020-08-29T00:32:36.108Z] terminateProcessInSuspendedState(org.eclipse.ease.lang.python.jython.debugger.JythonDebugTest)  Time elapsed: 0.206 s
20:32:36 [2020-08-29T00:32:36.108Z] stepOverOnProcess(org.eclipse.ease.lang.python.jython.debugger.JythonDebugTest)  Time elapsed: 0.306 s
20:32:36 [2020-08-29T00:32:36.108Z] nativeArrayVariable(org.eclipse.ease.lang.python.jython.debugger.JythonDebugTest)  Time elapsed: 0.306 s
20:32:36 [2020-08-29T00:32:36.108Z] disconnectDebugTargetInSuspendedState(org.eclipse.ease.lang.python.jython.debugger.JythonDebugTest)  Time elapsed: 0.205 s
20:32:36 [2020-08-29T00:32:36.108Z] stepIntoOnProcess(org.eclipse.ease.lang.python.jython.debugger.JythonDebugTest)  Time elapsed: 0.306 s
20:32:36 [2020-08-29T00:32:36.108Z] terminatedState(org.eclipse.ease.lang.python.jython.debugger.JythonDebugTest)  Time elapsed: 0.104 s
20:32:36 [2020-08-29T00:32:36.108Z] stepOverIncludeCommand(org.eclipse.ease.lang.python.jython.debugger.JythonDebugTest)  Time elapsed: 0.305 s
20:32:36 [2020-08-29T00:32:36.108Z] innerScopeVariableBeforeOuterScopeVariable(org.eclipse.ease.lang.python.jython.debugger.JythonDebugTest)  Time elapsed: 0.306 s
20:32:36 [2020-08-29T00:32:36.108Z] stepIntoIncludeCommand(org.eclipse.ease.lang.python.jython.debugger.JythonDebugTest)  Time elapsed: 0.304 s
20:32:36 [2020-08-29T00:32:36.108Z] primitiveStringVariable(org.eclipse.ease.lang.python.jython.debugger.JythonDebugTest)  Time elapsed: 0.306 s
20:32:36 [2020-08-29T00:32:36.108Z] resumeOnProcess(org.eclipse.ease.lang.python.jython.debugger.JythonDebugTest)  Time elapsed: 0.205 s
20:32:36 [2020-08-29T00:32:36.108Z] stepIntoOnDebugTarget(org.eclipse.ease.lang.python.jython.debugger.JythonDebugTest)  Time elapsed: 0.305 s
20:32:36 [2020-08-29T00:32:36.108Z] stepOverOnThread(org.eclipse.ease.lang.python.jython.debugger.JythonDebugTest)  Time elapsed: 0.306 s
20:32:36 [2020-08-29T00:32:36.108Z] suspendedState(org.eclipse.ease.lang.python.jython.debugger.JythonDebugTest)  Time elapsed: 0.204 s
20:32:36 [2020-08-29T00:32:36.108Z] primitiveDoubleVariable(org.eclipse.ease.lang.python.jython.debugger.JythonDebugTest)  Time elapsed: 0.306 s
20:32:36 [2020-08-29T00:32:36.108Z] resumeOnStackFrame(org.eclipse.ease.lang.python.jython.debugger.JythonDebugTest)  Time elapsed: 0.204 s
20:32:36 [2020-08-29T00:32:36.108Z] nativeObjectVariable(org.eclipse.ease.lang.python.jython.debugger.JythonDebugTest)  Time elapsed: 0.305 s
20:32:36 [2020-08-29T00:32:36.108Z] terminateDebugTargetInSuspendedState(org.eclipse.ease.lang.python.jython.debugger.JythonDebugTest)  Time elapsed: 0.205 s
20:32:36 [2020-08-29T00:32:36.108Z] disconnectStackFrameInSuspendedState(org.eclipse.ease.lang.python.jython.debugger.JythonDebugTest)  Time elapsed: 0.206 s
20:32:36 [2020-08-29T00:32:36.108Z] stepReturnOnProcess(org.eclipse.ease.lang.python.jython.debugger.JythonDebugTest)  Time elapsed: 0.305 s
20:32:36 [2020-08-29T00:32:36.108Z] evaluateWatchExpression(org.eclipse.ease.lang.python.jython.debugger.JythonDebugTest)  Time elapsed: 0.207 s
20:32:36 [2020-08-29T00:32:36.108Z] 
20:32:36 [2020-08-29T00:32:36.108Z] Results:
20:32:36 [2020-08-29T00:32:36.108Z] 
20:32:36 [2020-08-29T00:32:36.108Z] Failures: 
20:32:36 [2020-08-29T00:32:36.108Z]   JythonDebugTest>AbstractDebugTest.terminateThreadInSuspendedState:488->AbstractDebugTest.terminateTestTemplate:473 expected:<1> but was:<0>
20:32:36 [2020-08-29T00:32:36.108Z] 
20:32:36 [2020-08-29T00:32:36.108Z] Tests run: 42, Failures: 1, Errors: 0, Skipped: 0
20:32:36 [2020-08-29T00:32:36.108Z] 
20:32:36 [2020-08-29T00:32:36.669Z] [INFO] ------------------------------------------------------------------------
20:32:36 [2020-08-29T00:32:36.669Z] [INFO] Reactor Summary:
20:32:36 [2020-08-29T00:32:36.669Z] [INFO] 
20:32:36 [2020-08-29T00:32:36.669Z] [INFO] org.eclipse.ease.releng 0.8.0-SNAPSHOT ............. SUCCESS [  6.044 s]
20:32:36 [2020-08-29T00:32:36.669Z] [INFO] org.eclipse.ease.classloader 0.8.0-SNAPSHOT ........ SUCCESS [  4.356 s]
20:32:36 [2020-08-29T00:32:36.669Z] [INFO] org.eclipse.ease 0.8.0-SNAPSHOT .................... SUCCESS [  2.457 s]
20:32:36 [2020-08-29T00:32:36.669Z] [INFO] org.eclipse.ease.ui 0.8.0-SNAPSHOT ................. SUCCESS [  2.521 s]
20:32:36 [2020-08-29T00:32:36.669Z] [INFO] org.eclipse.ease.ui.completions.java 0.8.0-SNAPSHOT  SUCCESS [  1.701 s]
20:32:36 [2020-08-29T00:32:36.669Z] [INFO] org.eclipse.ease.ui.scripts 0.8.0-SNAPSHOT ......... SUCCESS [  2.302 s]
20:32:36 [2020-08-29T00:32:36.669Z] [INFO] org.eclipse.ease.lang.javascript 0.8.0-SNAPSHOT .... SUCCESS [  1.379 s]
20:32:36 [2020-08-29T00:32:36.669Z] [INFO] org.eclipse.ease.lang.scriptarchive 0.8.0-SNAPSHOT . SUCCESS [  1.316 s]
20:32:36 [2020-08-29T00:32:36.669Z] [INFO] org.eclipse.ease.lang.python 0.8.0-SNAPSHOT ........ SUCCESS [  1.594 s]
20:32:36 [2020-08-29T00:32:36.669Z] [INFO] org.eclipse.ease.lang.python.py4j 0.8.0-SNAPSHOT ... SUCCESS [  1.472 s]
20:32:36 [2020-08-29T00:32:36.669Z] [INFO] org.eclipse.ease.lang.groovy 0.8.0-SNAPSHOT ........ SUCCESS [  1.300 s]
20:32:36 [2020-08-29T00:32:36.669Z] [INFO] org.eclipse.ease.lang.groovy.interpreter 0.8.0-SNAPSHOT SUCCESS [  1.370 s]
20:32:36 [2020-08-29T00:32:36.669Z] [INFO] org.eclipse.ease.lang.unittest 0.8.0-SNAPSHOT ...... SUCCESS [  1.893 s]
20:32:36 [2020-08-29T00:32:36.669Z] [INFO] org.eclipse.ease.lang.unittest.ui 0.8.0-SNAPSHOT ... SUCCESS [  1.952 s]
20:32:36 [2020-08-29T00:32:36.669Z] [INFO] org.eclipse.ease.lang.ruby 0.8.0-SNAPSHOT .......... SUCCESS [  1.280 s]
20:32:36 [2020-08-29T00:32:36.669Z] [INFO] org.eclipse.ease.lang.ruby.jruby 0.8.0-SNAPSHOT .... SUCCESS [  1.369 s]
20:32:36 [2020-08-29T00:32:36.669Z] [INFO] org.eclipse.ease.lang.javascript.nashorn 0.8.0-SNAPSHOT SUCCESS [  1.331 s]
20:32:36 [2020-08-29T00:32:36.669Z] [INFO] org.eclipse.ease.lang.javascript.rhino 0.8.0-SNAPSHOT SUCCESS [  1.564 s]
20:32:36 [2020-08-29T00:32:36.669Z] [INFO] org.eclipse.ease.lang.python.jython 0.8.0-SNAPSHOT . SUCCESS [  1.502 s]
20:32:36 [2020-08-29T00:32:36.669Z] [INFO] org.eclipse.ease.lang.javascript.ui 0.8.0-SNAPSHOT . SUCCESS [  1.478 s]
20:32:36 [2020-08-29T00:32:36.669Z] [INFO] org.eclipse.ease.lang.jvm.compiled 0.8.0-SNAPSHOT .. SUCCESS [  1.331 s]
20:32:36 [2020-08-29T00:32:36.669Z] [INFO] org.eclipse.ease.lang.scriptarchive.ui 0.8.0-SNAPSHOT SUCCESS [  1.432 s]
20:32:36 [2020-08-29T00:32:36.669Z] [INFO] org.eclipse.ease.help 0.8.0-SNAPSHOT ............... SUCCESS [  0.091 s]
20:32:36 [2020-08-29T00:32:36.669Z] [INFO] org.eclipse.ease.feature 0.8.0-SNAPSHOT ............ SUCCESS [  0.130 s]
20:32:36 [2020-08-29T00:32:36.669Z] [INFO] org.eclipse.ease.ui.feature 0.8.0-SNAPSHOT ......... SUCCESS [  0.209 s]
20:32:36 [2020-08-29T00:32:36.669Z] [INFO] org.eclipse.ease.lang.javascript.feature 0.8.0-SNAPSHOT SUCCESS [  0.080 s]
20:32:36 [2020-08-29T00:32:36.669Z] [INFO] org.eclipse.ease.lang.python.feature 0.8.0-SNAPSHOT  SUCCESS [  0.097 s]
20:32:36 [2020-08-29T00:32:36.669Z] [INFO] org.eclipse.ease.python.jython.feature 0.8.0-SNAPSHOT SUCCESS [  0.085 s]
20:32:36 [2020-08-29T00:32:36.669Z] [INFO] org.eclipse.ease.lang.python.py4j.feature 0.8.0-SNAPSHOT SUCCESS [  0.071 s]
20:32:36 [2020-08-29T00:32:36.669Z] [INFO] org.eclipse.ease.lang.jvm.feature 0.8.0-SNAPSHOT ... SUCCESS [  0.164 s]
20:32:36 [2020-08-29T00:32:36.669Z] [INFO] org.eclipse.ease.lang.groovy.feature 0.8.0-SNAPSHOT  SUCCESS [  0.072 s]
20:32:36 [2020-08-29T00:32:36.669Z] [INFO] org.eclipse.ease.lang.ruby.feature 0.8.0-SNAPSHOT .. SUCCESS [  0.080 s]
20:32:36 [2020-08-29T00:32:36.669Z] [INFO] org.eclipse.ease.lang.scriptarchive.feature 0.8.0-SNAPSHOT SUCCESS [  0.079 s]
20:32:36 [2020-08-29T00:32:36.669Z] [INFO] org.eclipse.ease.lang.unittest.feature 0.8.0-SNAPSHOT SUCCESS [  0.082 s]
20:32:36 [2020-08-29T00:32:36.670Z] [INFO] org.eclipse.ease.releng.target 0.8.0-SNAPSHOT ...... SUCCESS [  0.009 s]
20:32:36 [2020-08-29T00:32:36.670Z] [INFO] org.eclipse.ease.releng.p2 0.8.0-SNAPSHOT .......... SUCCESS [  2.765 s]
20:32:36 [2020-08-29T00:32:36.670Z] [INFO] org.eclipse.ease.testhelper 0.8.0-SNAPSHOT ......... SUCCESS [  1.535 s]
20:32:36 [2020-08-29T00:32:36.670Z] [INFO] org.eclipse.ease.test 0.8.0-SNAPSHOT ............... SUCCESS [ 16.328 s]
20:32:36 [2020-08-29T00:32:36.670Z] [INFO] org.eclipse.ease.lang.javascript.nashorn.test 0.8.0-SNAPSHOT SUCCESS [  3.891 s]
20:32:36 [2020-08-29T00:32:36.670Z] [INFO] org.eclipse.ease.lang.javascript.rhino.test 0.8.0-SNAPSHOT SUCCESS [ 15.038 s]
20:32:36 [2020-08-29T00:32:36.670Z] [INFO] org.eclipse.ease.lang.javascript.test 0.8.0-SNAPSHOT SUCCESS [  3.427 s]
20:32:36 [2020-08-29T00:32:36.670Z] [INFO] org.eclipse.ease.lang.python.test 0.8.0-SNAPSHOT ... SUCCESS [  3.142 s]
20:32:36 [2020-08-29T00:32:36.670Z] [INFO] org.eclipse.ease.lang.python.jython.test 0.8.0-SNAPSHOT FAILURE [ 16.451 s]
20:32:36 [2020-08-29T00:32:36.670Z] [INFO] org.eclipse.ease.lang.python.py4j.test 0.8.0-SNAPSHOT SKIPPED
20:32:36 [2020-08-29T00:32:36.670Z] [INFO] org.eclipse.ease.lang.scriptarchive.test 0.8.0-SNAPSHOT SKIPPED
20:32:36 [2020-08-29T00:32:36.670Z] [INFO] org.eclipse.ease.lang.unittest.test 0.8.0-SNAPSHOT . SKIPPED
20:32:36 [2020-08-29T00:32:36.670Z] [INFO] org.eclipse.ease.ui.test 0.8.0-SNAPSHOT ............ SKIPPED
20:32:36 [2020-08-29T00:32:36.670Z] [INFO] EASE (Incubation) 0.4.0-SNAPSHOT ................... SKIPPED
20:32:36 [2020-08-29T00:32:36.670Z] [INFO] ------------------------------------------------------------------------
20:32:36 [2020-08-29T00:32:36.670Z] [INFO] BUILD FAILURE
20:32:36 [2020-08-29T00:32:36.670Z] [INFO] ------------------------------------------------------------------------
20:32:36 [2020-08-29T00:32:36.670Z] [INFO] Total time:  04:09 min
20:32:36 [2020-08-29T00:32:36.670Z] [INFO] Finished at: 2020-08-29T00:32:36Z
20:32:36 [2020-08-29T00:32:36.670Z] [INFO] ------------------------------------------------------------------------
20:32:36 [2020-08-29T00:32:36.670Z] [INFO] [jenkins-event-spy] Generated /home/jenkins/agent/workspace/ease.verify.core.target.2020-03@tmp/withMavenfca47c90/maven-spy-20200829-002826-8876988998098530408298.log
20:32:36 [2020-08-29T00:32:36.670Z] [ERROR] Failed to execute goal org.eclipse.tycho:tycho-surefire-plugin:1.3.0:test (default-test) on project org.eclipse.ease.lang.python.jython.test: There are test failures.
20:32:36 [2020-08-29T00:32:36.670Z] [ERROR] 
20:32:36 [2020-08-29T00:32:36.670Z] [ERROR] Please refer to /home/jenkins/agent/workspace/ease.verify.core.target.2020-03/tests/org.eclipse.ease.lang.python.jython.test/target/surefire-reports for the individual test results.
20:32:36 [2020-08-29T00:32:36.670Z] [ERROR] -> [Help 1]
20:32:36 [2020-08-29T00:32:36.670Z] [ERROR] 
20:32:36 [2020-08-29T00:32:36.670Z] [ERROR] To see the full stack trace of the errors, re-run Maven with the -e switch.
20:32:36 [2020-08-29T00:32:36.670Z] [ERROR] Re-run Maven using the -X switch to enable full debug logging.
20:32:36 [2020-08-29T00:32:36.670Z] [ERROR] 
20:32:36 [2020-08-29T00:32:36.670Z] [ERROR] For more information about the errors and possible solutions, please read the following articles:
20:32:36 [2020-08-29T00:32:36.670Z] [ERROR] [Help 1] http://cwiki.apache.org/confluence/display/MAVEN/MojoFailureException
20:32:36 [2020-08-29T00:32:36.670Z] [ERROR] 
20:32:36 [2020-08-29T00:32:36.670Z] [ERROR] After correcting the problems, you can resume the build with the command
20:32:36 [2020-08-29T00:32:36.670Z] [ERROR]   mvn <args> -rf :org.eclipse.ease.lang.python.jython.test
[Pipeline] }
20:32:39 [2020-08-29T00:32:39.332Z] [withMaven] Publishers: Pipeline Graph Publisher: 29 ms, Invoker Publisher: 1 ms, Junit Publisher: 1 ms, Dependencies Fingerprint Publisher: 1024 ms, Findbugs Publisher: 1 ms
[Pipeline] // withMaven
[Pipeline] }
[Pipeline] // stage
[Pipeline] stage
[Pipeline] { (Test)
Stage "Test" skipped due to earlier failure(s)
[Pipeline] }
[Pipeline] // stage
[Pipeline] stage
[Pipeline] { (Declarative: Post Actions)
[Pipeline] archiveArtifacts
20:32:39 [2020-08-29T00:32:39.384Z] Archiving artifacts
[Pipeline] emailext
20:32:56 [2020-08-29T00:32:56.302Z] Sending email to: christian.pontesegger@web.de
[Pipeline] }
[Pipeline] // stage
[Pipeline] }
[Pipeline] // timeout
[Pipeline] }
[Pipeline] // timestamps
[Pipeline] }
[Pipeline] // node
[Pipeline] End of Pipeline
ERROR: script returned exit code 1
Finished: FAILURE