Console Output

Skipping 97 KB.. Full Log
stractScriptEngine.java:190)
20:37:10 [2021-11-27T01:37:10.816Z] 	at org.eclipse.ease.AbstractScriptEngine.run(AbstractScriptEngine.java:243)
20:37:10 [2021-11-27T01:37:10.816Z] 	at org.eclipse.core.internal.jobs.Worker.run(Worker.java:63)
20:37:10 [2021-11-27T01:37:10.816Z] org.eclipse.ease.ScriptExecutionException: ScriptException: test
20:37:11 [2021-11-27T01:37:11.073Z] org.eclipse.ease.ScriptExecutionException: ScriptException: JavaScript
20:37:11 [2021-11-27T01:37:11.074Z] org.eclipse.ease.ScriptExecutionException: SyntaxError: unterminated string literal (#1)
20:37:11 [2021-11-27T01:37:11.074Z] 'asdf
20:37:11 [2021-11-27T01:37:11.074Z]     ^
20:37:11 [2021-11-27T01:37:11.074Z] 	at <unknown source>:1
20:37:11 [2021-11-27T01:37:11.074Z] org.eclipse.ease.ScriptExecutionException: TypeError: Cannot call method "foobar" of undefined
20:37:11 [2021-11-27T01:37:11.074Z] org.eclipse.ease.ScriptExecutionException: JavaError: NotThere cannot be found by org.mozilla.javascript_1.7.10.v20190430-1943
20:37:11 [2021-11-27T01:37:11.074Z] 
20:37:11 [2021-11-27T01:37:11.074Z] Java Stacktrace:
20:37:11 [2021-11-27T01:37:11.074Z] java.lang.ClassNotFoundException: NotThere cannot be found by org.mozilla.javascript_1.7.10.v20190430-1943
20:37:11 [2021-11-27T01:37:11.074Z] 	at org.eclipse.osgi.internal.loader.BundleLoader.findClass(BundleLoader.java:516)
20:37:11 [2021-11-27T01:37:11.074Z] 	at org.eclipse.osgi.internal.loader.ModuleClassLoader.loadClass(ModuleClassLoader.java:171)
20:37:11 [2021-11-27T01:37:11.074Z] 	at java.base/java.lang.ClassLoader.loadClass(ClassLoader.java:522)
20:37:11 [2021-11-27T01:37:11.074Z] 	at java.base/java.lang.Class.forName0(Native Method)
20:37:11 [2021-11-27T01:37:11.074Z] 	at java.base/java.lang.Class.forName(Class.java:377)
20:37:11 [2021-11-27T01:37:11.074Z] 	at java.base/jdk.internal.reflect.NativeMethodAccessorImpl.invoke0(Native Method)
20:37:11 [2021-11-27T01:37:11.074Z] 	at java.base/jdk.internal.reflect.NativeMethodAccessorImpl.invoke(NativeMethodAccessorImpl.java:64)
20:37:11 [2021-11-27T01:37:11.074Z] 	at java.base/jdk.internal.reflect.DelegatingMethodAccessorImpl.invoke(DelegatingMethodAccessorImpl.java:43)
20:37:11 [2021-11-27T01:37:11.074Z] 	at java.base/java.lang.reflect.Method.invoke(Method.java:564)
20:37:11 [2021-11-27T01:37:11.074Z] 	at org.mozilla.javascript.MemberBox.invoke(MemberBox.java:126)
20:37:11 [2021-11-27T01:37:11.074Z] 	at org.mozilla.javascript.NativeJavaMethod.call(NativeJavaMethod.java:225)
20:37:11 [2021-11-27T01:37:11.074Z] 	at org.mozilla.javascript.Interpreter.interpretLoop(Interpreter.java:1573)
20:37:11 [2021-11-27T01:37:11.074Z] 	at org.mozilla.javascript.Interpreter.interpret(Interpreter.java:911)
20:37:11 [2021-11-27T01:37:11.074Z] 	at org.mozilla.javascript.InterpretedFunction.call(InterpretedFunction.java:109)
20:37:11 [2021-11-27T01:37:11.074Z] 	at org.mozilla.javascript.ContextFactory.doTopCall(ContextFactory.java:405)
20:37:11 [2021-11-27T01:37:11.074Z] 	at org.mozilla.javascript.ScriptRuntime.doTopCall(ScriptRuntime.java:3508)
20:37:11 [2021-11-27T01:37:11.074Z] 	at org.mozilla.javascript.InterpretedFunction.exec(InterpretedFunction.java:120)
20:37:11 [2021-11-27T01:37:11.074Z] 	at org.mozilla.javascript.Context.evaluateReader(Context.java:1293)
20:37:11 [2021-11-27T01:37:11.074Z] 	at org.eclipse.ease.lang.javascript.rhino.RhinoScriptEngine.internalExecute(RhinoScriptEngine.java:226)
20:37:11 [2021-11-27T01:37:11.074Z] 	at org.eclipse.ease.lang.javascript.rhino.RhinoScriptEngine.execute(RhinoScriptEngine.java:205)
20:37:11 [2021-11-27T01:37:11.074Z] 	at org.eclipse.ease.AbstractScriptEngine.inject(AbstractScriptEngine.java:190)
20:37:11 [2021-11-27T01:37:11.074Z] 	at org.eclipse.ease.AbstractScriptEngine.run(AbstractScriptEngine.java:243)
20:37:11 [2021-11-27T01:37:11.074Z] 	at org.eclipse.core.internal.jobs.Worker.run(Worker.java:63)
20:37:11 [2021-11-27T01:37:11.074Z] org.eclipse.ease.ScriptExecutionException: TypeError: Cannot call method "substr" of null
20:37:11 [2021-11-27T01:37:11.074Z] 	at mainFile.js,throwOnNull():4
20:37:11 [2021-11-27T01:37:11.074Z] 	at includeFile.js,subCall():2
20:37:11 [2021-11-27T01:37:11.074Z] 	at mainFile.js:7
20:37:11 [2021-11-27T01:37:11.074Z] Tests run: 12, Failures: 0, Errors: 0, Skipped: 0, Time elapsed: 0.397 s - in org.eclipse.ease.lang.javascript.rhino.RhinoDebuggerEngineTest
20:37:11 [2021-11-27T01:37:11.074Z] execute_java_class_instantiation  Time elapsed: 0.12 s
20:37:11 [2021-11-27T01:37:11.074Z] execute_environment_module_code_with_optional_parameters  Time elapsed: 0.021 s
20:37:11 [2021-11-27T01:37:11.074Z] execute_throws_java_exception  Time elapsed: 0.045 s
20:37:11 [2021-11-27T01:37:11.074Z] execute_throws_java_class  Time elapsed: 0.016 s
20:37:11 [2021-11-27T01:37:11.074Z] execute_javascript_assignment  Time elapsed: 0.016 s
20:37:11 [2021-11-27T01:37:11.074Z] execute_eclipse_class_instantiation  Time elapsed: 0.015 s
20:37:11 [2021-11-27T01:37:11.074Z] execute_throws_javascript_object  Time elapsed: 0.014 s
20:37:11 [2021-11-27T01:37:11.074Z] execute_throws_syntax_error  Time elapsed: 0.055 s
20:37:11 [2021-11-27T01:37:11.075Z] execute_throws_javascript_runtime_error  Time elapsed: 0.012 s
20:37:11 [2021-11-27T01:37:11.075Z] execute_environment_module_code  Time elapsed: 0.014 s
20:37:11 [2021-11-27T01:37:11.075Z] execute_throws_wrapped_java_exception  Time elapsed: 0.014 s
20:37:11 [2021-11-27T01:37:11.075Z] getExceptionStackTrace_returns_script_trace_over_multiple_files  Time elapsed: 0.05 s
20:37:11 [2021-11-27T01:37:11.075Z] Running org.eclipse.ease.lang.javascript.rhino.RhinoScriptEngineTest
20:37:11 [2021-11-27T01:37:11.352Z] org.eclipse.ease.ScriptExecutionException: JavaError: java.lang.Exception
20:37:11 [2021-11-27T01:37:11.352Z] 	at <unknown source>
20:37:11 [2021-11-27T01:37:11.352Z] 
20:37:11 [2021-11-27T01:37:11.352Z] Java Stacktrace:
20:37:11 [2021-11-27T01:37:11.352Z] java.lang.Exception
20:37:11 [2021-11-27T01:37:11.352Z] 	at java.base/jdk.internal.reflect.NativeConstructorAccessorImpl.newInstance0(Native Method)
20:37:11 [2021-11-27T01:37:11.352Z] 	at java.base/jdk.internal.reflect.NativeConstructorAccessorImpl.newInstance(NativeConstructorAccessorImpl.java:64)
20:37:11 [2021-11-27T01:37:11.352Z] 	at java.base/jdk.internal.reflect.DelegatingConstructorAccessorImpl.newInstance(DelegatingConstructorAccessorImpl.java:45)
20:37:11 [2021-11-27T01:37:11.352Z] 	at java.base/java.lang.reflect.Constructor.newInstanceWithCaller(Constructor.java:500)
20:37:11 [2021-11-27T01:37:11.352Z] 	at java.base/java.lang.reflect.Constructor.newInstance(Constructor.java:481)
20:37:11 [2021-11-27T01:37:11.352Z] 	at org.mozilla.javascript.MemberBox.newInstance(MemberBox.java:159)
20:37:11 [2021-11-27T01:37:11.352Z] 	at org.mozilla.javascript.NativeJavaClass.constructInternal(NativeJavaClass.java:266)
20:37:11 [2021-11-27T01:37:11.352Z] 	at org.mozilla.javascript.NativeJavaClass.constructSpecific(NativeJavaClass.java:205)
20:37:11 [2021-11-27T01:37:11.352Z] 	at org.mozilla.javascript.NativeJavaClass.construct(NativeJavaClass.java:166)
20:37:11 [2021-11-27T01:37:11.352Z] 	at org.mozilla.javascript.ScriptRuntime.newObject(ScriptRuntime.java:2655)
20:37:11 [2021-11-27T01:37:11.352Z] 	at org.mozilla.javascript.gen.c_33._c_script_0(Unknown Source)
20:37:11 [2021-11-27T01:37:11.352Z] 	at org.mozilla.javascript.gen.c_33.call(Unknown Source)
20:37:11 [2021-11-27T01:37:11.352Z] 	at org.mozilla.javascript.ContextFactory.doTopCall(ContextFactory.java:405)
20:37:11 [2021-11-27T01:37:11.352Z] 	at org.mozilla.javascript.ScriptRuntime.doTopCall(ScriptRuntime.java:3508)
20:37:11 [2021-11-27T01:37:11.352Z] 	at org.mozilla.javascript.gen.c_33.call(Unknown Source)
20:37:11 [2021-11-27T01:37:11.352Z] 	at org.mozilla.javascript.gen.c_33.exec(Unknown Source)
20:37:11 [2021-11-27T01:37:11.352Z] 	at org.mozilla.javascript.Context.evaluateReader(Context.java:1293)
20:37:11 [2021-11-27T01:37:11.352Z] 	at org.eclipse.ease.lang.javascript.rhino.RhinoScriptEngine.internalExecute(RhinoScriptEngine.java:226)
20:37:11 [2021-11-27T01:37:11.352Z] 	at org.eclipse.ease.lang.javascript.rhino.RhinoScriptEngine.execute(RhinoScriptEngine.java:205)
20:37:11 [2021-11-27T01:37:11.352Z] 	at org.eclipse.ease.AbstractScriptEngine.inject(AbstractScriptEngine.java:190)
20:37:11 [2021-11-27T01:37:11.352Z] 	at org.eclipse.ease.AbstractScriptEngine.run(AbstractScriptEngine.java:243)
20:37:11 [2021-11-27T01:37:11.352Z] 	at org.eclipse.core.internal.jobs.Worker.run(Worker.java:63)
20:37:11 [2021-11-27T01:37:11.352Z] org.eclipse.ease.ScriptExecutionException: ScriptException: test
20:37:11 [2021-11-27T01:37:11.352Z] 	at <unknown source>
20:37:11 [2021-11-27T01:37:11.352Z] org.eclipse.ease.ScriptExecutionException: ScriptException: JavaScript
20:37:11 [2021-11-27T01:37:11.352Z] 	at <unknown source>
20:37:11 [2021-11-27T01:37:11.352Z] org.eclipse.ease.ScriptExecutionException: SyntaxError: unterminated string literal (#1)
20:37:11 [2021-11-27T01:37:11.352Z] 'asdf
20:37:11 [2021-11-27T01:37:11.353Z]     ^
20:37:11 [2021-11-27T01:37:11.353Z] 	at <unknown source>
20:37:11 [2021-11-27T01:37:11.353Z] org.eclipse.ease.ScriptExecutionException: TypeError: Cannot call method "foobar" of undefined
20:37:11 [2021-11-27T01:37:11.353Z] 	at <unknown source>
20:37:11 [2021-11-27T01:37:11.353Z] org.eclipse.ease.ScriptExecutionException: JavaError: NotThere cannot be found by org.mozilla.javascript_1.7.10.v20190430-1943
20:37:11 [2021-11-27T01:37:11.353Z] 	at <unknown source>
20:37:11 [2021-11-27T01:37:11.353Z] 
20:37:11 [2021-11-27T01:37:11.353Z] Java Stacktrace:
20:37:11 [2021-11-27T01:37:11.353Z] java.lang.ClassNotFoundException: NotThere cannot be found by org.mozilla.javascript_1.7.10.v20190430-1943
20:37:11 [2021-11-27T01:37:11.353Z] 	at org.eclipse.osgi.internal.loader.BundleLoader.findClass(BundleLoader.java:516)
20:37:11 [2021-11-27T01:37:11.353Z] 	at org.eclipse.osgi.internal.loader.ModuleClassLoader.loadClass(ModuleClassLoader.java:171)
20:37:11 [2021-11-27T01:37:11.353Z] 	at java.base/java.lang.ClassLoader.loadClass(ClassLoader.java:522)
20:37:11 [2021-11-27T01:37:11.353Z] 	at java.base/java.lang.Class.forName0(Native Method)
20:37:11 [2021-11-27T01:37:11.353Z] 	at java.base/java.lang.Class.forName(Class.java:377)
20:37:11 [2021-11-27T01:37:11.353Z] 	at java.base/jdk.internal.reflect.NativeMethodAccessorImpl.invoke0(Native Method)
20:37:11 [2021-11-27T01:37:11.353Z] 	at java.base/jdk.internal.reflect.NativeMethodAccessorImpl.invoke(NativeMethodAccessorImpl.java:64)
20:37:11 [2021-11-27T01:37:11.353Z] 	at java.base/jdk.internal.reflect.DelegatingMethodAccessorImpl.invoke(DelegatingMethodAccessorImpl.java:43)
20:37:11 [2021-11-27T01:37:11.353Z] 	at java.base/java.lang.reflect.Method.invoke(Method.java:564)
20:37:11 [2021-11-27T01:37:11.353Z] 	at org.mozilla.javascript.MemberBox.invoke(MemberBox.java:126)
20:37:11 [2021-11-27T01:37:11.353Z] 	at org.mozilla.javascript.NativeJavaMethod.call(NativeJavaMethod.java:225)
20:37:11 [2021-11-27T01:37:11.353Z] 	at org.mozilla.javascript.optimizer.OptRuntime.call1(OptRuntime.java:32)
20:37:11 [2021-11-27T01:37:11.353Z] 	at org.mozilla.javascript.gen.c_56._c_script_0(Unknown Source)
20:37:11 [2021-11-27T01:37:11.353Z] 	at org.mozilla.javascript.gen.c_56.call(Unknown Source)
20:37:11 [2021-11-27T01:37:11.353Z] 	at org.mozilla.javascript.ContextFactory.doTopCall(ContextFactory.java:405)
20:37:11 [2021-11-27T01:37:11.353Z] 	at org.mozilla.javascript.ScriptRuntime.doTopCall(ScriptRuntime.java:3508)
20:37:11 [2021-11-27T01:37:11.353Z] 	at org.mozilla.javascript.gen.c_56.call(Unknown Source)
20:37:11 [2021-11-27T01:37:11.353Z] 	at org.mozilla.javascript.gen.c_56.exec(Unknown Source)
20:37:11 [2021-11-27T01:37:11.353Z] 	at org.mozilla.javascript.Context.evaluateReader(Context.java:1293)
20:37:11 [2021-11-27T01:37:11.353Z] 	at org.eclipse.ease.lang.javascript.rhino.RhinoScriptEngine.internalExecute(RhinoScriptEngine.java:226)
20:37:11 [2021-11-27T01:37:11.353Z] 	at org.eclipse.ease.lang.javascript.rhino.RhinoScriptEngine.execute(RhinoScriptEngine.java:205)
20:37:11 [2021-11-27T01:37:11.353Z] 	at org.eclipse.ease.AbstractScriptEngine.inject(AbstractScriptEngine.java:190)
20:37:11 [2021-11-27T01:37:11.353Z] 	at org.eclipse.ease.AbstractScriptEngine.run(AbstractScriptEngine.java:243)
20:37:11 [2021-11-27T01:37:11.353Z] 	at org.eclipse.core.internal.jobs.Worker.run(Worker.java:63)
20:37:11 [2021-11-27T01:37:11.353Z] Tests run: 11, Failures: 0, Errors: 0, Skipped: 0, Time elapsed: 0.238 s - in org.eclipse.ease.lang.javascript.rhino.RhinoScriptEngineTest
20:37:11 [2021-11-27T01:37:11.353Z] execute_java_class_instantiation  Time elapsed: 0.026 s
20:37:11 [2021-11-27T01:37:11.353Z] execute_environment_module_code_with_optional_parameters  Time elapsed: 0.015 s
20:37:11 [2021-11-27T01:37:11.353Z] execute_throws_java_exception  Time elapsed: 0.051 s
20:37:11 [2021-11-27T01:37:11.353Z] execute_throws_java_class  Time elapsed: 0.015 s
20:37:11 [2021-11-27T01:37:11.353Z] execute_javascript_assignment  Time elapsed: 0.014 s
20:37:11 [2021-11-27T01:37:11.353Z] execute_eclipse_class_instantiation  Time elapsed: 0.019 s
20:37:11 [2021-11-27T01:37:11.353Z] execute_throws_javascript_object  Time elapsed: 0.014 s
20:37:11 [2021-11-27T01:37:11.353Z] execute_throws_syntax_error  Time elapsed: 0.036 s
20:37:11 [2021-11-27T01:37:11.353Z] execute_throws_javascript_runtime_error  Time elapsed: 0.013 s
20:37:11 [2021-11-27T01:37:11.353Z] execute_environment_module_code  Time elapsed: 0.013 s
20:37:11 [2021-11-27T01:37:11.353Z] execute_throws_wrapped_java_exception  Time elapsed: 0.017 s
20:37:11 [2021-11-27T01:37:11.353Z] Running org.eclipse.ease.lang.javascript.rhino.RhinoDebugTest
20:37:11 [2021-11-27T01:37:11.610Z] Start of script
20:37:11 [2021-11-27T01:37:11.610Z] include file start
20:37:11 [2021-11-27T01:37:11.610Z] Include file processed
20:37:11 [2021-11-27T01:37:11.610Z] line after include file
20:37:11 [2021-11-27T01:37:11.611Z] Result of testMethod = 5
20:37:11 [2021-11-27T01:37:11.611Z] End of script
20:37:11 [2021-11-27T01:37:11.611Z] Start of script
20:37:11 [2021-11-27T01:37:11.868Z] include file start
20:37:11 [2021-11-27T01:37:11.868Z] Include file processed
20:37:11 [2021-11-27T01:37:11.868Z] line after include file
20:37:11 [2021-11-27T01:37:11.868Z] Result of testMethod = 5
20:37:11 [2021-11-27T01:37:11.868Z] End of script
20:37:11 [2021-11-27T01:37:11.868Z] Start of script
20:37:11 [2021-11-27T01:37:11.868Z] include file start
20:37:11 [2021-11-27T01:37:11.868Z] Include file processed
20:37:11 [2021-11-27T01:37:11.868Z] line after include file
20:37:11 [2021-11-27T01:37:11.868Z] Result of testMethod = 5
20:37:12 [2021-11-27T01:37:12.124Z] org.eclipse.ease.ScriptEngineCancellationException: Terminated on user request
20:37:12 [2021-11-27T01:37:12.124Z] 	at org.eclipse.ease.debugging.AbstractEaseDebugger.handleEventsInSuspendedState(AbstractEaseDebugger.java:331)
20:37:12 [2021-11-27T01:37:12.124Z] 	at org.eclipse.ease.debugging.AbstractEaseDebugger.suspend(AbstractEaseDebugger.java:257)
20:37:12 [2021-11-27T01:37:12.124Z] 	at org.eclipse.ease.debugging.AbstractEaseDebugger.processLine(AbstractEaseDebugger.java:492)
20:37:12 [2021-11-27T01:37:12.124Z] 	at org.eclipse.ease.lang.javascript.rhino.debugger.RhinoDebugger.access$4(RhinoDebugger.java:1)
20:37:12 [2021-11-27T01:37:12.125Z] 	at org.eclipse.ease.lang.javascript.rhino.debugger.RhinoDebugger$RhinoDebugFrame.onLineChange(RhinoDebugger.java:124)
20:37:12 [2021-11-27T01:37:12.125Z] 	at org.mozilla.javascript.Interpreter.interpretLoop(Interpreter.java:1931)
20:37:12 [2021-11-27T01:37:12.125Z] 	at org.mozilla.javascript.Interpreter.interpret(Interpreter.java:911)
20:37:12 [2021-11-27T01:37:12.125Z] 	at org.mozilla.javascript.InterpretedFunction.call(InterpretedFunction.java:109)
20:37:12 [2021-11-27T01:37:12.125Z] 	at org.mozilla.javascript.ContextFactory.doTopCall(ContextFactory.java:405)
20:37:12 [2021-11-27T01:37:12.125Z] 	at org.mozilla.javascript.ScriptRuntime.doTopCall(ScriptRuntime.java:3508)
20:37:12 [2021-11-27T01:37:12.125Z] 	at org.mozilla.javascript.InterpretedFunction.exec(InterpretedFunction.java:120)
20:37:12 [2021-11-27T01:37:12.125Z] 	at org.mozilla.javascript.Context.evaluateReader(Context.java:1293)
20:37:12 [2021-11-27T01:37:12.125Z] 	at org.eclipse.ease.lang.javascript.rhino.RhinoScriptEngine.internalExecute(RhinoScriptEngine.java:226)
20:37:12 [2021-11-27T01:37:12.125Z] 	at org.eclipse.ease.lang.javascript.rhino.RhinoScriptEngine.execute(RhinoScriptEngine.java:205)
20:37:12 [2021-11-27T01:37:12.125Z] 	at org.eclipse.ease.AbstractScriptEngine.inject(AbstractScriptEngine.java:190)
20:37:12 [2021-11-27T01:37:12.125Z] 	at org.eclipse.ease.AbstractScriptEngine.run(AbstractScriptEngine.java:243)
20:37:12 [2021-11-27T01:37:12.125Z] 	at org.eclipse.core.internal.jobs.Worker.run(Worker.java:63)
20:37:12 [2021-11-27T01:37:12.125Z] Start of script
20:37:12 [2021-11-27T01:37:12.125Z] include file start
20:37:12 [2021-11-27T01:37:12.125Z] Include file processed
20:37:12 [2021-11-27T01:37:12.125Z] line after include file
20:37:12 [2021-11-27T01:37:12.382Z] Result of testMethod = 5
20:37:12 [2021-11-27T01:37:12.382Z] End of script
20:37:12 [2021-11-27T01:37:12.639Z] Start of script
20:37:12 [2021-11-27T01:37:12.639Z] include file start
20:37:12 [2021-11-27T01:37:12.639Z] Include file processed
20:37:12 [2021-11-27T01:37:12.639Z] line after include file
20:37:12 [2021-11-27T01:37:12.639Z] Result of testMethod = 5
20:37:12 [2021-11-27T01:37:12.639Z] End of script
20:37:12 [2021-11-27T01:37:12.639Z] Start of script
20:37:12 [2021-11-27T01:37:12.639Z] include file start
20:37:12 [2021-11-27T01:37:12.639Z] Include file processed
20:37:12 [2021-11-27T01:37:12.639Z] line after include file
20:37:12 [2021-11-27T01:37:12.897Z] Result of testMethod = 5
20:37:12 [2021-11-27T01:37:12.897Z] End of script
20:37:12 [2021-11-27T01:37:12.897Z] Start of script
20:37:13 [2021-11-27T01:37:13.156Z] include file start
20:37:13 [2021-11-27T01:37:13.156Z] Include file processed
20:37:13 [2021-11-27T01:37:13.156Z] line after include file
20:37:13 [2021-11-27T01:37:13.156Z] Result of testMethod = 5
20:37:13 [2021-11-27T01:37:13.156Z] org.eclipse.ease.ScriptEngineCancellationException: Terminated on user request
20:37:13 [2021-11-27T01:37:13.156Z] 	at org.eclipse.ease.debugging.AbstractEaseDebugger.handleEventsInSuspendedState(AbstractEaseDebugger.java:331)
20:37:13 [2021-11-27T01:37:13.156Z] 	at org.eclipse.ease.debugging.AbstractEaseDebugger.suspend(AbstractEaseDebugger.java:257)
20:37:13 [2021-11-27T01:37:13.156Z] 	at org.eclipse.ease.debugging.AbstractEaseDebugger.processLine(AbstractEaseDebugger.java:492)
20:37:13 [2021-11-27T01:37:13.156Z] 	at org.eclipse.ease.lang.javascript.rhino.debugger.RhinoDebugger.access$4(RhinoDebugger.java:1)
20:37:13 [2021-11-27T01:37:13.156Z] 	at org.eclipse.ease.lang.javascript.rhino.debugger.RhinoDebugger$RhinoDebugFrame.onLineChange(RhinoDebugger.java:124)
20:37:13 [2021-11-27T01:37:13.156Z] 	at org.mozilla.javascript.Interpreter.interpretLoop(Interpreter.java:1931)
20:37:13 [2021-11-27T01:37:13.156Z] 	at org.mozilla.javascript.Interpreter.interpret(Interpreter.java:911)
20:37:13 [2021-11-27T01:37:13.156Z] 	at org.mozilla.javascript.InterpretedFunction.call(InterpretedFunction.java:109)
20:37:13 [2021-11-27T01:37:13.156Z] 	at org.mozilla.javascript.ContextFactory.doTopCall(ContextFactory.java:405)
20:37:13 [2021-11-27T01:37:13.156Z] 	at org.mozilla.javascript.ScriptRuntime.doTopCall(ScriptRuntime.java:3508)
20:37:13 [2021-11-27T01:37:13.156Z] 	at org.mozilla.javascript.InterpretedFunction.exec(InterpretedFunction.java:120)
20:37:13 [2021-11-27T01:37:13.156Z] 	at org.mozilla.javascript.Context.evaluateReader(Context.java:1293)
20:37:13 [2021-11-27T01:37:13.156Z] 	at org.eclipse.ease.lang.javascript.rhino.RhinoScriptEngine.internalExecute(RhinoScriptEngine.java:226)
20:37:13 [2021-11-27T01:37:13.156Z] 	at org.eclipse.ease.lang.javascript.rhino.RhinoScriptEngine.execute(RhinoScriptEngine.java:205)
20:37:13 [2021-11-27T01:37:13.156Z] 	at org.eclipse.ease.AbstractScriptEngine.inject(AbstractScriptEngine.java:190)
20:37:13 [2021-11-27T01:37:13.156Z] 	at org.eclipse.ease.AbstractScriptEngine.run(AbstractScriptEngine.java:243)
20:37:13 [2021-11-27T01:37:13.157Z] 	at org.eclipse.core.internal.jobs.Worker.run(Worker.java:63)
20:37:13 [2021-11-27T01:37:13.414Z] Start of script
20:37:13 [2021-11-27T01:37:13.414Z] include file start
20:37:13 [2021-11-27T01:37:13.414Z] Include file processed
20:37:13 [2021-11-27T01:37:13.414Z] line after include file
20:37:13 [2021-11-27T01:37:13.414Z] Result of testMethod = 5
20:37:13 [2021-11-27T01:37:13.414Z] End of script
20:37:13 [2021-11-27T01:37:13.671Z] Start of script
20:37:13 [2021-11-27T01:37:13.671Z] include file start
20:37:13 [2021-11-27T01:37:13.671Z] Include file processed
20:37:13 [2021-11-27T01:37:13.671Z] line after include file
20:37:13 [2021-11-27T01:37:13.671Z] Result of testMethod = 5
20:37:13 [2021-11-27T01:37:13.671Z] End of script
20:37:13 [2021-11-27T01:37:13.928Z] Start of script
20:37:13 [2021-11-27T01:37:13.928Z] include file start
20:37:13 [2021-11-27T01:37:13.929Z] Include file processed
20:37:13 [2021-11-27T01:37:13.929Z] line after include file
20:37:14 [2021-11-27T01:37:14.186Z] org.eclipse.ease.ScriptEngineCancellationException: Terminated on user request
20:37:14 [2021-11-27T01:37:14.186Z] 	at org.eclipse.ease.debugging.AbstractEaseDebugger.handleEventsInSuspendedState(AbstractEaseDebugger.java:331)
20:37:14 [2021-11-27T01:37:14.186Z] 	at org.eclipse.ease.debugging.AbstractEaseDebugger.suspend(AbstractEaseDebugger.java:257)
20:37:14 [2021-11-27T01:37:14.186Z] 	at org.eclipse.ease.debugging.AbstractEaseDebugger.processLine(AbstractEaseDebugger.java:512)
20:37:14 [2021-11-27T01:37:14.186Z] 	at org.eclipse.ease.lang.javascript.rhino.debugger.RhinoDebugger.access$4(RhinoDebugger.java:1)
20:37:14 [2021-11-27T01:37:14.186Z] 	at org.eclipse.ease.lang.javascript.rhino.debugger.RhinoDebugger$RhinoDebugFrame.onLineChange(RhinoDebugger.java:124)
20:37:14 [2021-11-27T01:37:14.186Z] 	at org.mozilla.javascript.Interpreter.interpretLoop(Interpreter.java:1931)
20:37:14 [2021-11-27T01:37:14.186Z] 	at org.mozilla.javascript.Interpreter.interpret(Interpreter.java:911)
20:37:14 [2021-11-27T01:37:14.186Z] 	at org.mozilla.javascript.InterpretedFunction.call(InterpretedFunction.java:109)
20:37:14 [2021-11-27T01:37:14.186Z] 	at org.mozilla.javascript.ContextFactory.doTopCall(ContextFactory.java:405)
20:37:14 [2021-11-27T01:37:14.186Z] 	at org.mozilla.javascript.ScriptRuntime.doTopCall(ScriptRuntime.java:3508)
20:37:14 [2021-11-27T01:37:14.186Z] 	at org.mozilla.javascript.InterpretedFunction.exec(InterpretedFunction.java:120)
20:37:14 [2021-11-27T01:37:14.186Z] 	at org.mozilla.javascript.Context.evaluateReader(Context.java:1293)
20:37:14 [2021-11-27T01:37:14.186Z] 	at org.eclipse.ease.lang.javascript.rhino.RhinoScriptEngine.internalExecute(RhinoScriptEngine.java:226)
20:37:14 [2021-11-27T01:37:14.186Z] 	at org.eclipse.ease.lang.javascript.rhino.RhinoScriptEngine.execute(RhinoScriptEngine.java:205)
20:37:14 [2021-11-27T01:37:14.186Z] 	at org.eclipse.ease.AbstractScriptEngine.inject(AbstractScriptEngine.java:190)
20:37:14 [2021-11-27T01:37:14.186Z] 	at org.eclipse.ease.AbstractScriptEngine.run(AbstractScriptEngine.java:243)
20:37:14 [2021-11-27T01:37:14.186Z] 	at org.eclipse.core.internal.jobs.Worker.run(Worker.java:63)
20:37:14 [2021-11-27T01:37:14.186Z] Start of script
20:37:14 [2021-11-27T01:37:14.186Z] include file start
20:37:14 [2021-11-27T01:37:14.444Z] Include file processed
20:37:14 [2021-11-27T01:37:14.444Z] line after include file
20:37:14 [2021-11-27T01:37:14.444Z] Result of testMethod = 5
20:37:14 [2021-11-27T01:37:14.444Z] End of script
20:37:14 [2021-11-27T01:37:14.444Z] Start of script
20:37:14 [2021-11-27T01:37:14.444Z] include file start
20:37:14 [2021-11-27T01:37:14.444Z] Include file processed
20:37:14 [2021-11-27T01:37:14.444Z] line after include file
20:37:14 [2021-11-27T01:37:14.701Z] Result of testMethod = 5
20:37:14 [2021-11-27T01:37:14.701Z] End of script
20:37:14 [2021-11-27T01:37:14.959Z] org.eclipse.ease.ScriptEngineCancellationException: Terminated on user request
20:37:14 [2021-11-27T01:37:14.959Z] 	at org.eclipse.ease.debugging.AbstractEaseDebugger.handleEventsInSuspendedState(AbstractEaseDebugger.java:331)
20:37:14 [2021-11-27T01:37:14.959Z] 	at org.eclipse.ease.debugging.AbstractEaseDebugger.suspend(AbstractEaseDebugger.java:257)
20:37:14 [2021-11-27T01:37:14.959Z] 	at org.eclipse.ease.debugging.AbstractEaseDebugger.processLine(AbstractEaseDebugger.java:492)
20:37:14 [2021-11-27T01:37:14.959Z] 	at org.eclipse.ease.lang.javascript.rhino.debugger.RhinoDebugger.access$4(RhinoDebugger.java:1)
20:37:14 [2021-11-27T01:37:14.959Z] 	at org.eclipse.ease.lang.javascript.rhino.debugger.RhinoDebugger$RhinoDebugFrame.onLineChange(RhinoDebugger.java:124)
20:37:14 [2021-11-27T01:37:14.959Z] 	at org.mozilla.javascript.Interpreter.interpretLoop(Interpreter.java:1931)
20:37:14 [2021-11-27T01:37:14.959Z] 	at org.mozilla.javascript.Interpreter.interpret(Interpreter.java:911)
20:37:14 [2021-11-27T01:37:14.959Z] 	at org.mozilla.javascript.InterpretedFunction.call(InterpretedFunction.java:109)
20:37:14 [2021-11-27T01:37:14.959Z] 	at org.mozilla.javascript.ContextFactory.doTopCall(ContextFactory.java:405)
20:37:14 [2021-11-27T01:37:14.959Z] 	at org.mozilla.javascript.ScriptRuntime.doTopCall(ScriptRuntime.java:3508)
20:37:14 [2021-11-27T01:37:14.959Z] 	at org.mozilla.javascript.InterpretedFunction.exec(InterpretedFunction.java:120)
20:37:14 [2021-11-27T01:37:14.959Z] 	at org.mozilla.javascript.Context.evaluateReader(Context.java:1293)
20:37:14 [2021-11-27T01:37:14.959Z] 	at org.eclipse.ease.lang.javascript.rhino.RhinoScriptEngine.internalExecute(RhinoScriptEngine.java:226)
20:37:14 [2021-11-27T01:37:14.959Z] 	at org.eclipse.ease.lang.javascript.rhino.RhinoScriptEngine.execute(RhinoScriptEngine.java:205)
20:37:14 [2021-11-27T01:37:14.959Z] 	at org.eclipse.ease.AbstractScriptEngine.inject(AbstractScriptEngine.java:190)
20:37:14 [2021-11-27T01:37:14.959Z] 	at org.eclipse.ease.AbstractScriptEngine.run(AbstractScriptEngine.java:243)
20:37:14 [2021-11-27T01:37:14.959Z] 	at org.eclipse.core.internal.jobs.Worker.run(Worker.java:63)
20:37:14 [2021-11-27T01:37:14.959Z] Start of script
20:37:14 [2021-11-27T01:37:14.959Z] include file start
20:37:14 [2021-11-27T01:37:14.959Z] Include file processed
20:37:14 [2021-11-27T01:37:14.959Z] line after include file
20:37:14 [2021-11-27T01:37:14.959Z] Result of testMethod = 5
20:37:14 [2021-11-27T01:37:14.959Z] End of script
20:37:15 [2021-11-27T01:37:15.216Z] Start of script
20:37:15 [2021-11-27T01:37:15.216Z] include file start
20:37:15 [2021-11-27T01:37:15.216Z] Include file processed
20:37:15 [2021-11-27T01:37:15.216Z] line after include file
20:37:15 [2021-11-27T01:37:15.473Z] Result of testMethod = 5
20:37:15 [2021-11-27T01:37:15.473Z] End of script
20:37:15 [2021-11-27T01:37:15.473Z] Start of script
20:37:15 [2021-11-27T01:37:15.473Z] include file start
20:37:15 [2021-11-27T01:37:15.473Z] Include file processed
20:37:15 [2021-11-27T01:37:15.473Z] line after include file
20:37:15 [2021-11-27T01:37:15.474Z] Result of testMethod = 5
20:37:15 [2021-11-27T01:37:15.730Z] org.eclipse.ease.ScriptEngineCancellationException: Terminated on user request
20:37:15 [2021-11-27T01:37:15.731Z] 	at org.eclipse.ease.debugging.AbstractEaseDebugger.handleEventsInSuspendedState(AbstractEaseDebugger.java:331)
20:37:15 [2021-11-27T01:37:15.731Z] 	at org.eclipse.ease.debugging.AbstractEaseDebugger.suspend(AbstractEaseDebugger.java:257)
20:37:15 [2021-11-27T01:37:15.731Z] 	at org.eclipse.ease.debugging.AbstractEaseDebugger.processLine(AbstractEaseDebugger.java:492)
20:37:15 [2021-11-27T01:37:15.731Z] 	at org.eclipse.ease.lang.javascript.rhino.debugger.RhinoDebugger.access$4(RhinoDebugger.java:1)
20:37:15 [2021-11-27T01:37:15.731Z] 	at org.eclipse.ease.lang.javascript.rhino.debugger.RhinoDebugger$RhinoDebugFrame.onLineChange(RhinoDebugger.java:124)
20:37:15 [2021-11-27T01:37:15.731Z] 	at org.mozilla.javascript.Interpreter.interpretLoop(Interpreter.java:1931)
20:37:15 [2021-11-27T01:37:15.731Z] 	at org.mozilla.javascript.Interpreter.interpret(Interpreter.java:911)
20:37:15 [2021-11-27T01:37:15.731Z] 	at org.mozilla.javascript.InterpretedFunction.call(InterpretedFunction.java:109)
20:37:15 [2021-11-27T01:37:15.731Z] 	at org.mozilla.javascript.ContextFactory.doTopCall(ContextFactory.java:405)
20:37:15 [2021-11-27T01:37:15.731Z] 	at org.mozilla.javascript.ScriptRuntime.doTopCall(ScriptRuntime.java:3508)
20:37:15 [2021-11-27T01:37:15.731Z] 	at org.mozilla.javascript.InterpretedFunction.exec(InterpretedFunction.java:120)
20:37:15 [2021-11-27T01:37:15.731Z] 	at org.mozilla.javascript.Context.evaluateReader(Context.java:1293)
20:37:15 [2021-11-27T01:37:15.731Z] 	at org.eclipse.ease.lang.javascript.rhino.RhinoScriptEngine.internalExecute(RhinoScriptEngine.java:226)
20:37:15 [2021-11-27T01:37:15.731Z] 	at org.eclipse.ease.lang.javascript.rhino.RhinoScriptEngine.execute(RhinoScriptEngine.java:205)
20:37:15 [2021-11-27T01:37:15.731Z] 	at org.eclipse.ease.AbstractScriptEngine.inject(AbstractScriptEngine.java:190)
20:37:15 [2021-11-27T01:37:15.731Z] 	at org.eclipse.ease.AbstractScriptEngine.run(AbstractScriptEngine.java:243)
20:37:15 [2021-11-27T01:37:15.731Z] 	at org.eclipse.core.internal.jobs.Worker.run(Worker.java:63)
20:37:15 [2021-11-27T01:37:15.731Z] Start of script
20:37:15 [2021-11-27T01:37:15.731Z] include file start
20:37:15 [2021-11-27T01:37:15.731Z] Include file processed
20:37:15 [2021-11-27T01:37:15.731Z] line after include file
20:37:15 [2021-11-27T01:37:15.989Z] Result of testMethod = 5
20:37:15 [2021-11-27T01:37:15.989Z] End of script
20:37:16 [2021-11-27T01:37:16.247Z] org.eclipse.ease.ScriptEngineCancellationException: Terminated on user request
20:37:16 [2021-11-27T01:37:16.247Z] 	at org.eclipse.ease.debugging.AbstractEaseDebugger.handleEventsInSuspendedState(AbstractEaseDebugger.java:331)
20:37:16 [2021-11-27T01:37:16.247Z] 	at org.eclipse.ease.debugging.AbstractEaseDebugger.suspend(AbstractEaseDebugger.java:257)
20:37:16 [2021-11-27T01:37:16.247Z] 	at org.eclipse.ease.debugging.AbstractEaseDebugger.processLine(AbstractEaseDebugger.java:492)
20:37:16 [2021-11-27T01:37:16.247Z] 	at org.eclipse.ease.lang.javascript.rhino.debugger.RhinoDebugger.access$4(RhinoDebugger.java:1)
20:37:16 [2021-11-27T01:37:16.247Z] 	at org.eclipse.ease.lang.javascript.rhino.debugger.RhinoDebugger$RhinoDebugFrame.onLineChange(RhinoDebugger.java:124)
20:37:16 [2021-11-27T01:37:16.247Z] 	at org.mozilla.javascript.Interpreter.interpretLoop(Interpreter.java:1931)
20:37:16 [2021-11-27T01:37:16.247Z] 	at org.mozilla.javascript.Interpreter.interpret(Interpreter.java:911)
20:37:16 [2021-11-27T01:37:16.247Z] 	at org.mozilla.javascript.InterpretedFunction.call(InterpretedFunction.java:109)
20:37:16 [2021-11-27T01:37:16.247Z] 	at org.mozilla.javascript.ContextFactory.doTopCall(ContextFactory.java:405)
20:37:16 [2021-11-27T01:37:16.247Z] 	at org.mozilla.javascript.ScriptRuntime.doTopCall(ScriptRuntime.java:3508)
20:37:16 [2021-11-27T01:37:16.247Z] 	at org.mozilla.javascript.InterpretedFunction.exec(InterpretedFunction.java:120)
20:37:16 [2021-11-27T01:37:16.247Z] 	at org.mozilla.javascript.Context.evaluateReader(Context.java:1293)
20:37:16 [2021-11-27T01:37:16.247Z] 	at org.eclipse.ease.lang.javascript.rhino.RhinoScriptEngine.internalExecute(RhinoScriptEngine.java:226)
20:37:16 [2021-11-27T01:37:16.247Z] 	at org.eclipse.ease.lang.javascript.rhino.RhinoScriptEngine.execute(RhinoScriptEngine.java:205)
20:37:16 [2021-11-27T01:37:16.247Z] 	at org.eclipse.ease.AbstractScriptEngine.inject(AbstractScriptEngine.java:190)
20:37:16 [2021-11-27T01:37:16.247Z] 	at org.eclipse.ease.AbstractScriptEngine.run(AbstractScriptEngine.java:243)
20:37:16 [2021-11-27T01:37:16.247Z] 	at org.eclipse.core.internal.jobs.Worker.run(Worker.java:63)
20:37:16 [2021-11-27T01:37:16.247Z] Start of script
20:37:16 [2021-11-27T01:37:16.247Z] include file start
20:37:16 [2021-11-27T01:37:16.247Z] Include file processed
20:37:16 [2021-11-27T01:37:16.247Z] line after include file
20:37:16 [2021-11-27T01:37:16.247Z] Result of testMethod = 5
20:37:16 [2021-11-27T01:37:16.504Z] End of script
20:37:16 [2021-11-27T01:37:16.504Z] Start of script
20:37:16 [2021-11-27T01:37:16.504Z] include file start
20:37:16 [2021-11-27T01:37:16.504Z] Include file processed
20:37:16 [2021-11-27T01:37:16.504Z] line after include file
20:37:16 [2021-11-27T01:37:16.762Z] Result of testMethod = 5
20:37:16 [2021-11-27T01:37:16.762Z] End of script
20:37:17 [2021-11-27T01:37:17.018Z] org.eclipse.ease.ScriptEngineCancellationException: Terminated on user request
20:37:17 [2021-11-27T01:37:17.019Z] 	at org.eclipse.ease.debugging.AbstractEaseDebugger.handleEventsInSuspendedState(AbstractEaseDebugger.java:331)
20:37:17 [2021-11-27T01:37:17.019Z] 	at org.eclipse.ease.debugging.AbstractEaseDebugger.suspend(AbstractEaseDebugger.java:257)
20:37:17 [2021-11-27T01:37:17.019Z] 	at org.eclipse.ease.debugging.AbstractEaseDebugger.processLine(AbstractEaseDebugger.java:492)
20:37:17 [2021-11-27T01:37:17.019Z] 	at org.eclipse.ease.lang.javascript.rhino.debugger.RhinoDebugger.access$4(RhinoDebugger.java:1)
20:37:17 [2021-11-27T01:37:17.019Z] 	at org.eclipse.ease.lang.javascript.rhino.debugger.RhinoDebugger$RhinoDebugFrame.onLineChange(RhinoDebugger.java:124)
20:37:17 [2021-11-27T01:37:17.019Z] 	at org.mozilla.javascript.Interpreter.interpretLoop(Interpreter.java:1931)
20:37:17 [2021-11-27T01:37:17.019Z] 	at org.mozilla.javascript.Interpreter.interpret(Interpreter.java:911)
20:37:17 [2021-11-27T01:37:17.019Z] 	at org.mozilla.javascript.InterpretedFunction.call(InterpretedFunction.java:109)
20:37:17 [2021-11-27T01:37:17.019Z] 	at org.mozilla.javascript.ContextFactory.doTopCall(ContextFactory.java:405)
20:37:17 [2021-11-27T01:37:17.019Z] 	at org.mozilla.javascript.ScriptRuntime.doTopCall(ScriptRuntime.java:3508)
20:37:17 [2021-11-27T01:37:17.019Z] 	at org.mozilla.javascript.InterpretedFunction.exec(InterpretedFunction.java:120)
20:37:17 [2021-11-27T01:37:17.019Z] 	at org.mozilla.javascript.Context.evaluateReader(Context.java:1293)
20:37:17 [2021-11-27T01:37:17.019Z] 	at org.eclipse.ease.lang.javascript.rhino.RhinoScriptEngine.internalExecute(RhinoScriptEngine.java:226)
20:37:17 [2021-11-27T01:37:17.019Z] 	at org.eclipse.ease.lang.javascript.rhino.RhinoScriptEngine.execute(RhinoScriptEngine.java:205)
20:37:17 [2021-11-27T01:37:17.019Z] 	at org.eclipse.ease.AbstractScriptEngine.inject(AbstractScriptEngine.java:190)
20:37:17 [2021-11-27T01:37:17.019Z] 	at org.eclipse.ease.AbstractScriptEngine.run(AbstractScriptEngine.java:243)
20:37:17 [2021-11-27T01:37:17.019Z] 	at org.eclipse.core.internal.jobs.Worker.run(Worker.java:63)
20:37:17 [2021-11-27T01:37:17.019Z] Start of script
20:37:17 [2021-11-27T01:37:17.019Z] include file start
20:37:17 [2021-11-27T01:37:17.019Z] Include file processed
20:37:17 [2021-11-27T01:37:17.019Z] line after include file
20:37:17 [2021-11-27T01:37:17.276Z] Result of testMethod = 5
20:37:17 [2021-11-27T01:37:17.276Z] End of script
20:37:17 [2021-11-27T01:37:17.276Z] Start of script
20:37:17 [2021-11-27T01:37:17.276Z] include file start
20:37:17 [2021-11-27T01:37:17.276Z] Include file processed
20:37:17 [2021-11-27T01:37:17.276Z] line after include file
20:37:17 [2021-11-27T01:37:17.276Z] Result of testMethod = 5
20:37:17 [2021-11-27T01:37:17.534Z] WARNING: An illegal reflective access operation has occurred
20:37:17 [2021-11-27T01:37:17.534Z] WARNING: Illegal reflective access by org.eclipse.ease.debugging.model.EaseDebugValue (file:/home/jenkins/.m2/repository/org/eclipse/ease/org.eclipse.ease/0.9.0-SNAPSHOT/org.eclipse.ease-0.9.0-SNAPSHOT.jar) to field java.lang.String.hash
20:37:17 [2021-11-27T01:37:17.534Z] WARNING: Please consider reporting this to the maintainers of org.eclipse.ease.debugging.model.EaseDebugValue
20:37:17 [2021-11-27T01:37:17.534Z] WARNING: Use --illegal-access=warn to enable warnings of further illegal reflective access operations
20:37:17 [2021-11-27T01:37:17.534Z] WARNING: All illegal access operations will be denied in a future release
20:37:17 [2021-11-27T01:37:17.534Z] org.eclipse.ease.ScriptEngineCancellationException: Terminated on user request
20:37:17 [2021-11-27T01:37:17.534Z] 	at org.eclipse.ease.debugging.AbstractEaseDebugger.handleEventsInSuspendedState(AbstractEaseDebugger.java:331)
20:37:17 [2021-11-27T01:37:17.534Z] 	at org.eclipse.ease.debugging.AbstractEaseDebugger.suspend(AbstractEaseDebugger.java:257)
20:37:17 [2021-11-27T01:37:17.534Z] 	at org.eclipse.ease.debugging.AbstractEaseDebugger.processLine(AbstractEaseDebugger.java:492)
20:37:17 [2021-11-27T01:37:17.534Z] 	at org.eclipse.ease.lang.javascript.rhino.debugger.RhinoDebugger.access$4(RhinoDebugger.java:1)
20:37:17 [2021-11-27T01:37:17.534Z] 	at org.eclipse.ease.lang.javascript.rhino.debugger.RhinoDebugger$RhinoDebugFrame.onLineChange(RhinoDebugger.java:124)
20:37:17 [2021-11-27T01:37:17.534Z] 	at org.mozilla.javascript.Interpreter.interpretLoop(Interpreter.java:1931)
20:37:17 [2021-11-27T01:37:17.534Z] 	at org.mozilla.javascript.Interpreter.interpret(Interpreter.java:911)
20:37:17 [2021-11-27T01:37:17.534Z] 	at org.mozilla.javascript.InterpretedFunction.call(InterpretedFunction.java:109)
20:37:17 [2021-11-27T01:37:17.535Z] 	at org.mozilla.javascript.ContextFactory.doTopCall(ContextFactory.java:405)
20:37:17 [2021-11-27T01:37:17.535Z] 	at org.mozilla.javascript.ScriptRuntime.doTopCall(ScriptRuntime.java:3508)
20:37:17 [2021-11-27T01:37:17.535Z] 	at org.mozilla.javascript.InterpretedFunction.exec(InterpretedFunction.java:120)
20:37:17 [2021-11-27T01:37:17.535Z] 	at org.mozilla.javascript.Context.evaluateReader(Context.java:1293)
20:37:17 [2021-11-27T01:37:17.535Z] 	at org.eclipse.ease.lang.javascript.rhino.RhinoScriptEngine.internalExecute(RhinoScriptEngine.java:226)
20:37:17 [2021-11-27T01:37:17.535Z] 	at org.eclipse.ease.lang.javascript.rhino.RhinoScriptEngine.execute(RhinoScriptEngine.java:205)
20:37:17 [2021-11-27T01:37:17.535Z] 	at org.eclipse.ease.AbstractScriptEngine.inject(AbstractScriptEngine.java:190)
20:37:17 [2021-11-27T01:37:17.535Z] 	at org.eclipse.ease.AbstractScriptEngine.run(AbstractScriptEngine.java:243)
20:37:17 [2021-11-27T01:37:17.535Z] 	at org.eclipse.core.internal.jobs.Worker.run(Worker.java:63)
20:37:17 [2021-11-27T01:37:17.792Z] Start of script
20:37:17 [2021-11-27T01:37:17.792Z] include file start
20:37:17 [2021-11-27T01:37:17.792Z] Include file processed
20:37:17 [2021-11-27T01:37:17.792Z] line after include file
20:37:17 [2021-11-27T01:37:17.792Z] Result of testMethod = 5
20:37:17 [2021-11-27T01:37:17.792Z] End of script
20:37:17 [2021-11-27T01:37:17.792Z] Start of script
20:37:17 [2021-11-27T01:37:17.792Z] include file start
20:37:17 [2021-11-27T01:37:17.792Z] Include file processed
20:37:17 [2021-11-27T01:37:17.792Z] line after include file
20:37:18 [2021-11-27T01:37:18.050Z] Result of testMethod = 5
20:37:18 [2021-11-27T01:37:18.050Z] End of script
20:37:18 [2021-11-27T01:37:18.050Z] Start of script
20:37:18 [2021-11-27T01:37:18.050Z] include file start
20:37:18 [2021-11-27T01:37:18.050Z] Include file processed
20:37:18 [2021-11-27T01:37:18.050Z] line after include file
20:37:18 [2021-11-27T01:37:18.050Z] Result of testMethod = 5
20:37:18 [2021-11-27T01:37:18.050Z] End of script
20:37:18 [2021-11-27T01:37:18.307Z] Start of script
20:37:18 [2021-11-27T01:37:18.307Z] include file start
20:37:18 [2021-11-27T01:37:18.307Z] Include file processed
20:37:18 [2021-11-27T01:37:18.564Z] line after include file
20:37:18 [2021-11-27T01:37:18.564Z] Result of testMethod = 5
20:37:18 [2021-11-27T01:37:18.564Z] End of script
20:37:18 [2021-11-27T01:37:18.564Z] Start of script
20:37:18 [2021-11-27T01:37:18.564Z] include file start
20:37:18 [2021-11-27T01:37:18.564Z] Include file processed
20:37:18 [2021-11-27T01:37:18.564Z] line after include file
20:37:18 [2021-11-27T01:37:18.822Z] org.eclipse.ease.ScriptEngineCancellationException: Terminated on user request
20:37:18 [2021-11-27T01:37:18.822Z] 	at org.eclipse.ease.debugging.AbstractEaseDebugger.handleEventsInSuspendedState(AbstractEaseDebugger.java:331)
20:37:18 [2021-11-27T01:37:18.822Z] 	at org.eclipse.ease.debugging.AbstractEaseDebugger.suspend(AbstractEaseDebugger.java:257)
20:37:18 [2021-11-27T01:37:18.822Z] 	at org.eclipse.ease.debugging.AbstractEaseDebugger.processLine(AbstractEaseDebugger.java:492)
20:37:18 [2021-11-27T01:37:18.822Z] 	at org.eclipse.ease.lang.javascript.rhino.debugger.RhinoDebugger.access$4(RhinoDebugger.java:1)
20:37:18 [2021-11-27T01:37:18.822Z] 	at org.eclipse.ease.lang.javascript.rhino.debugger.RhinoDebugger$RhinoDebugFrame.onLineChange(RhinoDebugger.java:124)
20:37:18 [2021-11-27T01:37:18.822Z] 	at org.mozilla.javascript.Interpreter.interpretLoop(Interpreter.java:1931)
20:37:18 [2021-11-27T01:37:18.822Z] 	at org.mozilla.javascript.Interpreter.interpret(Interpreter.java:911)
20:37:18 [2021-11-27T01:37:18.823Z] 	at org.mozilla.javascript.InterpretedFunction.call(InterpretedFunction.java:109)
20:37:18 [2021-11-27T01:37:18.823Z] 	at org.mozilla.javascript.ContextFactory.doTopCall(ContextFactory.java:405)
20:37:18 [2021-11-27T01:37:18.823Z] 	at org.mozilla.javascript.ScriptRuntime.doTopCall(ScriptRuntime.java:3508)
20:37:18 [2021-11-27T01:37:18.823Z] 	at org.mozilla.javascript.InterpretedFunction.exec(InterpretedFunction.java:120)
20:37:18 [2021-11-27T01:37:18.823Z] 	at org.mozilla.javascript.Context.evaluateReader(Context.java:1293)
20:37:18 [2021-11-27T01:37:18.823Z] 	at org.eclipse.ease.lang.javascript.rhino.RhinoScriptEngine.internalExecute(RhinoScriptEngine.java:226)
20:37:18 [2021-11-27T01:37:18.823Z] 	at org.eclipse.ease.lang.javascript.rhino.RhinoScriptEngine.execute(RhinoScriptEngine.java:205)
20:37:18 [2021-11-27T01:37:18.823Z] 	at org.eclipse.ease.AbstractScriptEngine.inject(AbstractScriptEngine.java:190)
20:37:18 [2021-11-27T01:37:18.823Z] 	at org.eclipse.ease.AbstractScriptEngine.run(AbstractScriptEngine.java:243)
20:37:18 [2021-11-27T01:37:18.823Z] 	at org.eclipse.core.internal.jobs.Worker.run(Worker.java:63)
20:37:18 [2021-11-27T01:37:18.823Z] Start of script
20:37:19 [2021-11-27T01:37:19.080Z] include file start
20:37:19 [2021-11-27T01:37:19.080Z] Include file processed
20:37:19 [2021-11-27T01:37:19.080Z] line after include file
20:37:19 [2021-11-27T01:37:19.080Z] Result of testMethod = 5
20:37:19 [2021-11-27T01:37:19.080Z] End of script
20:37:19 [2021-11-27T01:37:19.080Z] Start of script
20:37:19 [2021-11-27T01:37:19.080Z] include file start
20:37:19 [2021-11-27T01:37:19.080Z] Include file processed
20:37:19 [2021-11-27T01:37:19.080Z] line after include file
20:37:19 [2021-11-27T01:37:19.080Z] Result of testMethod = 5
20:37:19 [2021-11-27T01:37:19.338Z] org.eclipse.ease.ScriptEngineCancellationException: Terminated on user request
20:37:19 [2021-11-27T01:37:19.338Z] 	at org.eclipse.ease.debugging.AbstractEaseDebugger.handleEventsInSuspendedState(AbstractEaseDebugger.java:331)
20:37:19 [2021-11-27T01:37:19.338Z] 	at org.eclipse.ease.debugging.AbstractEaseDebugger.suspend(AbstractEaseDebugger.java:257)
20:37:19 [2021-11-27T01:37:19.338Z] 	at org.eclipse.ease.debugging.AbstractEaseDebugger.processLine(AbstractEaseDebugger.java:492)
20:37:19 [2021-11-27T01:37:19.338Z] 	at org.eclipse.ease.lang.javascript.rhino.debugger.RhinoDebugger.access$4(RhinoDebugger.java:1)
20:37:19 [2021-11-27T01:37:19.338Z] 	at org.eclipse.ease.lang.javascript.rhino.debugger.RhinoDebugger$RhinoDebugFrame.onLineChange(RhinoDebugger.java:124)
20:37:19 [2021-11-27T01:37:19.338Z] 	at org.mozilla.javascript.Interpreter.interpretLoop(Interpreter.java:1931)
20:37:19 [2021-11-27T01:37:19.339Z] 	at org.mozilla.javascript.Interpreter.interpret(Interpreter.java:911)
20:37:19 [2021-11-27T01:37:19.339Z] 	at org.mozilla.javascript.InterpretedFunction.call(InterpretedFunction.java:109)
20:37:19 [2021-11-27T01:37:19.339Z] 	at org.mozilla.javascript.ContextFactory.doTopCall(ContextFactory.java:405)
20:37:19 [2021-11-27T01:37:19.339Z] 	at org.mozilla.javascript.ScriptRuntime.doTopCall(ScriptRuntime.java:3508)
20:37:19 [2021-11-27T01:37:19.339Z] 	at org.mozilla.javascript.InterpretedFunction.exec(InterpretedFunction.java:120)
20:37:19 [2021-11-27T01:37:19.339Z] 	at org.mozilla.javascript.Context.evaluateReader(Context.java:1293)
20:37:19 [2021-11-27T01:37:19.339Z] 	at org.eclipse.ease.lang.javascript.rhino.RhinoScriptEngine.internalExecute(RhinoScriptEngine.java:226)
20:37:19 [2021-11-27T01:37:19.339Z] 	at org.eclipse.ease.lang.javascript.rhino.RhinoScriptEngine.execute(RhinoScriptEngine.java:205)
20:37:19 [2021-11-27T01:37:19.339Z] 	at org.eclipse.ease.AbstractScriptEngine.inject(AbstractScriptEngine.java:190)
20:37:19 [2021-11-27T01:37:19.339Z] 	at org.eclipse.ease.AbstractScriptEngine.run(AbstractScriptEngine.java:243)
20:37:19 [2021-11-27T01:37:19.339Z] 	at org.eclipse.core.internal.jobs.Worker.run(Worker.java:63)
20:37:19 [2021-11-27T01:37:19.597Z] Start of script
20:37:19 [2021-11-27T01:37:19.597Z] include file start
20:37:19 [2021-11-27T01:37:19.597Z] Include file processed
20:37:19 [2021-11-27T01:37:19.597Z] line after include file
20:37:19 [2021-11-27T01:37:19.597Z] Result of testMethod = 5
20:37:19 [2021-11-27T01:37:19.597Z] End of script
20:37:19 [2021-11-27T01:37:19.597Z] Start of script
20:37:19 [2021-11-27T01:37:19.597Z] include file start
20:37:19 [2021-11-27T01:37:19.597Z] Include file processed
20:37:19 [2021-11-27T01:37:19.597Z] line after include file
20:37:19 [2021-11-27T01:37:19.854Z] Result of testMethod = 5
20:37:19 [2021-11-27T01:37:19.854Z] End of script
20:37:19 [2021-11-27T01:37:19.854Z] Start of script
20:37:19 [2021-11-27T01:37:19.854Z] include file start
20:37:19 [2021-11-27T01:37:19.854Z] Include file processed
20:37:19 [2021-11-27T01:37:19.854Z] line after include file
20:37:20 [2021-11-27T01:37:20.111Z] Result of testMethod = 5
20:37:20 [2021-11-27T01:37:20.111Z] End of script
20:37:20 [2021-11-27T01:37:20.368Z] Start of script
20:37:20 [2021-11-27T01:37:20.368Z] include file start
20:37:20 [2021-11-27T01:37:20.368Z] Include file processed
20:37:20 [2021-11-27T01:37:20.368Z] line after include file
20:37:20 [2021-11-27T01:37:20.368Z] Result of testMethod = 5
20:37:20 [2021-11-27T01:37:20.368Z] End of script
20:37:20 [2021-11-27T01:37:20.369Z] Start of script
20:37:20 [2021-11-27T01:37:20.369Z] include file start
20:37:20 [2021-11-27T01:37:20.369Z] Include file processed
20:37:20 [2021-11-27T01:37:20.369Z] line after include file
20:37:20 [2021-11-27T01:37:20.369Z] Result of testMethod = 5
20:37:20 [2021-11-27T01:37:20.625Z] org.eclipse.ease.ScriptEngineCancellationException: Terminated on user request
20:37:20 [2021-11-27T01:37:20.625Z] 	at org.eclipse.ease.debugging.AbstractEaseDebugger.handleEventsInSuspendedState(AbstractEaseDebugger.java:331)
20:37:20 [2021-11-27T01:37:20.625Z] 	at org.eclipse.ease.debugging.AbstractEaseDebugger.suspend(AbstractEaseDebugger.java:257)
20:37:20 [2021-11-27T01:37:20.625Z] 	at org.eclipse.ease.debugging.AbstractEaseDebugger.processLine(AbstractEaseDebugger.java:492)
20:37:20 [2021-11-27T01:37:20.625Z] 	at org.eclipse.ease.lang.javascript.rhino.debugger.RhinoDebugger.access$4(RhinoDebugger.java:1)
20:37:20 [2021-11-27T01:37:20.625Z] 	at org.eclipse.ease.lang.javascript.rhino.debugger.RhinoDebugger$RhinoDebugFrame.onLineChange(RhinoDebugger.java:124)
20:37:20 [2021-11-27T01:37:20.625Z] 	at org.mozilla.javascript.Interpreter.interpretLoop(Interpreter.java:1931)
20:37:20 [2021-11-27T01:37:20.626Z] 	at org.mozilla.javascript.Interpreter.interpret(Interpreter.java:911)
20:37:20 [2021-11-27T01:37:20.626Z] 	at org.mozilla.javascript.InterpretedFunction.call(InterpretedFunction.java:109)
20:37:20 [2021-11-27T01:37:20.626Z] 	at org.mozilla.javascript.ContextFactory.doTopCall(ContextFactory.java:405)
20:37:20 [2021-11-27T01:37:20.626Z] 	at org.mozilla.javascript.ScriptRuntime.doTopCall(ScriptRuntime.java:3508)
20:37:20 [2021-11-27T01:37:20.626Z] 	at org.mozilla.javascript.InterpretedFunction.exec(InterpretedFunction.java:120)
20:37:20 [2021-11-27T01:37:20.626Z] 	at org.mozilla.javascript.Context.evaluateReader(Context.java:1293)
20:37:20 [2021-11-27T01:37:20.626Z] 	at org.eclipse.ease.lang.javascript.rhino.RhinoScriptEngine.internalExecute(RhinoScriptEngine.java:226)
20:37:20 [2021-11-27T01:37:20.626Z] 	at org.eclipse.ease.lang.javascript.rhino.RhinoScriptEngine.execute(RhinoScriptEngine.java:205)
20:37:20 [2021-11-27T01:37:20.626Z] 	at org.eclipse.ease.AbstractScriptEngine.inject(AbstractScriptEngine.java:190)
20:37:20 [2021-11-27T01:37:20.626Z] 	at org.eclipse.ease.AbstractScriptEngine.run(AbstractScriptEngine.java:243)
20:37:20 [2021-11-27T01:37:20.626Z] 	at org.eclipse.core.internal.jobs.Worker.run(Worker.java:63)
20:37:20 [2021-11-27T01:37:20.883Z] Start of script
20:37:20 [2021-11-27T01:37:20.883Z] include file start
20:37:20 [2021-11-27T01:37:20.883Z] Include file processed
20:37:20 [2021-11-27T01:37:20.883Z] line after include file
20:37:20 [2021-11-27T01:37:20.883Z] Result of testMethod = 5
20:37:20 [2021-11-27T01:37:20.883Z] End of script
20:37:20 [2021-11-27T01:37:20.883Z] Start of script
20:37:20 [2021-11-27T01:37:20.883Z] include file start
20:37:20 [2021-11-27T01:37:20.883Z] Include file processed
20:37:20 [2021-11-27T01:37:20.883Z] line after include file
20:37:20 [2021-11-27T01:37:20.883Z] Result of testMethod = 5
20:37:21 [2021-11-27T01:37:21.140Z] org.eclipse.ease.ScriptEngineCancellationException: Terminated on user request
20:37:21 [2021-11-27T01:37:21.140Z] 	at org.eclipse.ease.debugging.AbstractEaseDebugger.handleEventsInSuspendedState(AbstractEaseDebugger.java:331)
20:37:21 [2021-11-27T01:37:21.140Z] 	at org.eclipse.ease.debugging.AbstractEaseDebugger.suspend(AbstractEaseDebugger.java:257)
20:37:21 [2021-11-27T01:37:21.140Z] 	at org.eclipse.ease.debugging.AbstractEaseDebugger.processLine(AbstractEaseDebugger.java:492)
20:37:21 [2021-11-27T01:37:21.140Z] 	at org.eclipse.ease.lang.javascript.rhino.debugger.RhinoDebugger.access$4(RhinoDebugger.java:1)
20:37:21 [2021-11-27T01:37:21.140Z] 	at org.eclipse.ease.lang.javascript.rhino.debugger.RhinoDebugger$RhinoDebugFrame.onLineChange(RhinoDebugger.java:124)
20:37:21 [2021-11-27T01:37:21.140Z] 	at org.mozilla.javascript.Interpreter.interpretLoop(Interpreter.java:1931)
20:37:21 [2021-11-27T01:37:21.140Z] 	at org.mozilla.javascript.Interpreter.interpret(Interpreter.java:911)
20:37:21 [2021-11-27T01:37:21.140Z] 	at org.mozilla.javascript.InterpretedFunction.call(InterpretedFunction.java:109)
20:37:21 [2021-11-27T01:37:21.140Z] 	at org.mozilla.javascript.ContextFactory.doTopCall(ContextFactory.java:405)
20:37:21 [2021-11-27T01:37:21.140Z] 	at org.mozilla.javascript.ScriptRuntime.doTopCall(ScriptRuntime.java:3508)
20:37:21 [2021-11-27T01:37:21.140Z] 	at org.mozilla.javascript.InterpretedFunction.exec(InterpretedFunction.java:120)
20:37:21 [2021-11-27T01:37:21.140Z] 	at org.mozilla.javascript.Context.evaluateReader(Context.java:1293)
20:37:21 [2021-11-27T01:37:21.140Z] 	at org.eclipse.ease.lang.javascript.rhino.RhinoScriptEngine.internalExecute(RhinoScriptEngine.java:226)
20:37:21 [2021-11-27T01:37:21.140Z] 	at org.eclipse.ease.lang.javascript.rhino.RhinoScriptEngine.execute(RhinoScriptEngine.java:205)
20:37:21 [2021-11-27T01:37:21.140Z] 	at org.eclipse.ease.AbstractScriptEngine.inject(AbstractScriptEngine.java:190)
20:37:21 [2021-11-27T01:37:21.140Z] 	at org.eclipse.ease.AbstractScriptEngine.run(AbstractScriptEngine.java:243)
20:37:21 [2021-11-27T01:37:21.140Z] 	at org.eclipse.core.internal.jobs.Worker.run(Worker.java:63)
20:37:21 [2021-11-27T01:37:21.397Z] org.eclipse.ease.ScriptEngineCancellationException: Terminated on user request
20:37:21 [2021-11-27T01:37:21.397Z] 	at org.eclipse.ease.debugging.AbstractEaseDebugger.handleEventsInSuspendedState(AbstractEaseDebugger.java:331)
20:37:21 [2021-11-27T01:37:21.397Z] 	at org.eclipse.ease.debugging.AbstractEaseDebugger.suspend(AbstractEaseDebugger.java:257)
20:37:21 [2021-11-27T01:37:21.397Z] 	at org.eclipse.ease.debugging.AbstractEaseDebugger.processLine(AbstractEaseDebugger.java:492)
20:37:21 [2021-11-27T01:37:21.397Z] 	at org.eclipse.ease.lang.javascript.rhino.debugger.RhinoDebugger.access$4(RhinoDebugger.java:1)
20:37:21 [2021-11-27T01:37:21.397Z] 	at org.eclipse.ease.lang.javascript.rhino.debugger.RhinoDebugger$RhinoDebugFrame.onLineChange(RhinoDebugger.java:124)
20:37:21 [2021-11-27T01:37:21.397Z] 	at org.mozilla.javascript.Interpreter.interpretLoop(Interpreter.java:1931)
20:37:21 [2021-11-27T01:37:21.397Z] 	at org.mozilla.javascript.Interpreter.interpret(Interpreter.java:911)
20:37:21 [2021-11-27T01:37:21.397Z] 	at org.mozilla.javascript.InterpretedFunction.call(InterpretedFunction.java:109)
20:37:21 [2021-11-27T01:37:21.397Z] 	at org.mozilla.javascript.ContextFactory.doTopCall(ContextFactory.java:405)
20:37:21 [2021-11-27T01:37:21.397Z] 	at org.mozilla.javascript.ScriptRuntime.doTopCall(ScriptRuntime.java:3508)
20:37:21 [2021-11-27T01:37:21.397Z] 	at org.mozilla.javascript.InterpretedFunction.exec(InterpretedFunction.java:120)
20:37:21 [2021-11-27T01:37:21.397Z] 	at org.mozilla.javascript.Context.evaluateReader(Context.java:1293)
20:37:21 [2021-11-27T01:37:21.397Z] 	at org.eclipse.ease.lang.javascript.rhino.RhinoScriptEngine.internalExecute(RhinoScriptEngine.java:226)
20:37:21 [2021-11-27T01:37:21.397Z] 	at org.eclipse.ease.lang.javascript.rhino.RhinoScriptEngine.execute(RhinoScriptEngine.java:205)
20:37:21 [2021-11-27T01:37:21.397Z] 	at org.eclipse.ease.AbstractScriptEngine.inject(AbstractScriptEngine.java:190)
20:37:21 [2021-11-27T01:37:21.397Z] 	at org.eclipse.ease.AbstractScriptEngine.run(AbstractScriptEngine.java:243)
20:37:21 [2021-11-27T01:37:21.398Z] 	at org.eclipse.core.internal.jobs.Worker.run(Worker.java:63)
20:37:21 [2021-11-27T01:37:21.654Z] Start of script
20:37:21 [2021-11-27T01:37:21.654Z] include file start
20:37:21 [2021-11-27T01:37:21.654Z] Include file processed
20:37:21 [2021-11-27T01:37:21.654Z] line after include file
20:37:21 [2021-11-27T01:37:21.654Z] Result of testMethod = 5
20:37:21 [2021-11-27T01:37:21.654Z] End of script
20:37:21 [2021-11-27T01:37:21.654Z] Start of script
20:37:21 [2021-11-27T01:37:21.654Z] include file start
20:37:21 [2021-11-27T01:37:21.654Z] Include file processed
20:37:21 [2021-11-27T01:37:21.654Z] line after include file
20:37:21 [2021-11-27T01:37:21.911Z] Result of testMethod = 5
20:37:21 [2021-11-27T01:37:21.911Z] End of script
20:37:21 [2021-11-27T01:37:21.911Z] Start of script
20:37:21 [2021-11-27T01:37:21.911Z] include file start
20:37:21 [2021-11-27T01:37:21.911Z] Include file processed
20:37:21 [2021-11-27T01:37:21.911Z] line after include file
20:37:21 [2021-11-27T01:37:21.911Z] Result of testMethod = 5
20:37:22 [2021-11-27T01:37:22.167Z] End of script
20:37:22 [2021-11-27T01:37:22.167Z] Tests run: 41, Failures: 0, Errors: 0, Skipped: 0, Time elapsed: 10.849 s - in org.eclipse.ease.lang.javascript.rhino.RhinoDebugTest
20:37:22 [2021-11-27T01:37:22.167Z] disconnectProcessInSuspendedState  Time elapsed: 0.296 s
20:37:22 [2021-11-27T01:37:22.167Z] stepReturnIncludeCommand  Time elapsed: 0.208 s
20:37:22 [2021-11-27T01:37:22.167Z] arrayVariableSorting  Time elapsed: 0.305 s
20:37:22 [2021-11-27T01:37:22.167Z] stepOverOnDebugTarget  Time elapsed: 0.307 s
20:37:22 [2021-11-27T01:37:22.167Z] disconnectThreadInSuspendedState  Time elapsed: 0.206 s
20:37:22 [2021-11-27T01:37:22.167Z] stepReturnOnDebugTarget  Time elapsed: 0.307 s
20:37:22 [2021-11-27T01:37:22.167Z] nullVariable  Time elapsed: 0.306 s
20:37:22 [2021-11-27T01:37:22.168Z] stepOverOnStackFrame  Time elapsed: 0.307 s
20:37:22 [2021-11-27T01:37:22.168Z] resumeOnDebugTarget  Time elapsed: 0.205 s
20:37:22 [2021-11-27T01:37:22.168Z] modifyVariableKeepingType  Time elapsed: 0.407 s
20:37:22 [2021-11-27T01:37:22.168Z] resumeOnLastIncludeLine  Time elapsed: 0.206 s
20:37:22 [2021-11-27T01:37:22.168Z] stepReturnOnStackFrame  Time elapsed: 0.308 s
20:37:22 [2021-11-27T01:37:22.168Z] terminateStackFrameInSuspendedState  Time elapsed: 0.207 s
20:37:22 [2021-11-27T01:37:22.168Z] breakpointLocation  Time elapsed: 0.206 s
20:37:22 [2021-11-27T01:37:22.168Z] stepReturnOnThread  Time elapsed: 0.306 s
20:37:22 [2021-11-27T01:37:22.168Z] javaClassVariable  Time elapsed: 0.308 s
20:37:22 [2021-11-27T01:37:22.168Z] stepIntoOnThread  Time elapsed: 0.307 s
20:37:22 [2021-11-27T01:37:22.168Z] terminateThreadInSuspendedState  Time elapsed: 0.205 s
20:37:22 [2021-11-27T01:37:22.168Z] resumeOnThread  Time elapsed: 0.205 s
20:37:22 [2021-11-27T01:37:22.168Z] stepIntoOnStackFrame  Time elapsed: 0.305 s
20:37:22 [2021-11-27T01:37:22.168Z] terminateProcessInSuspendedState  Time elapsed: 0.205 s
20:37:22 [2021-11-27T01:37:22.168Z] stepOverOnProcess  Time elapsed: 0.305 s
20:37:22 [2021-11-27T01:37:22.168Z] nativeArrayVariable  Time elapsed: 0.306 s
20:37:22 [2021-11-27T01:37:22.168Z] disconnectDebugTargetInSuspendedState  Time elapsed: 0.205 s
20:37:22 [2021-11-27T01:37:22.168Z] stepIntoOnProcess  Time elapsed: 0.306 s
20:37:22 [2021-11-27T01:37:22.168Z] terminatedState  Time elapsed: 0.104 s
20:37:22 [2021-11-27T01:37:22.168Z] stepOverIncludeCommand  Time elapsed: 0.305 s
20:37:22 [2021-11-27T01:37:22.168Z] innerScopeVariableBeforeOuterScopeVariable  Time elapsed: 0.304 s
20:37:22 [2021-11-27T01:37:22.168Z] stepIntoIncludeCommand  Time elapsed: 0.305 s
20:37:22 [2021-11-27T01:37:22.168Z] primitiveStringVariable  Time elapsed: 0.305 s
20:37:22 [2021-11-27T01:37:22.168Z] resumeOnProcess  Time elapsed: 0.204 s
20:37:22 [2021-11-27T01:37:22.168Z] stepIntoOnDebugTarget  Time elapsed: 0.305 s
20:37:22 [2021-11-27T01:37:22.168Z] stepOverOnThread  Time elapsed: 0.307 s
20:37:22 [2021-11-27T01:37:22.168Z] suspendedState  Time elapsed: 0.205 s
20:37:22 [2021-11-27T01:37:22.168Z] primitiveDoubleVariable  Time elapsed: 0.305 s
20:37:22 [2021-11-27T01:37:22.168Z] resumeOnStackFrame  Time elapsed: 0.204 s
20:37:22 [2021-11-27T01:37:22.168Z] nativeObjectVariable  Time elapsed: 0.305 s
20:37:22 [2021-11-27T01:37:22.168Z] terminateDebugTargetInSuspendedState  Time elapsed: 0.206 s
20:37:22 [2021-11-27T01:37:22.168Z] disconnectStackFrameInSuspendedState  Time elapsed: 0.205 s
20:37:22 [2021-11-27T01:37:22.168Z] stepReturnOnProcess  Time elapsed: 0.306 s
20:37:22 [2021-11-27T01:37:22.168Z] evaluateWatchExpression  Time elapsed: 0.216 s
20:37:22 [2021-11-27T01:37:22.168Z] 
20:37:22 [2021-11-27T01:37:22.168Z] Results:
20:37:22 [2021-11-27T01:37:22.168Z] 
20:37:22 [2021-11-27T01:37:22.168Z] Tests run: 69, Failures: 0, Errors: 0, Skipped: 0
20:37:22 [2021-11-27T01:37:22.168Z] 
20:37:22 [2021-11-27T01:37:22.425Z] [INFO] All tests passed!
20:37:22 [2021-11-27T01:37:22.425Z] [INFO] 
20:37:22 [2021-11-27T01:37:22.425Z] [INFO] -------< org.eclipse.ease:org.eclipse.ease.lang.javascript.test >-------
20:37:22 [2021-11-27T01:37:22.425Z] [INFO] Building org.eclipse.ease.lang.javascript.test 0.9.0-SNAPSHOT      [5/9]
20:37:22 [2021-11-27T01:37:22.425Z] [INFO] ------------------------[ eclipse-test-plugin ]-------------------------
20:37:22 [2021-11-27T01:37:22.425Z] [INFO] 
20:37:22 [2021-11-27T01:37:22.425Z] [INFO] --- tycho-packaging-plugin:2.2.0:build-qualifier (default-build-qualifier) @ org.eclipse.ease.lang.javascript.test ---
20:37:22 [2021-11-27T01:37:22.425Z] [INFO] The project's OSGi version is 0.9.0.I202107211616
20:37:22 [2021-11-27T01:37:22.425Z] [INFO] 
20:37:22 [2021-11-27T01:37:22.425Z] [INFO] --- tycho-packaging-plugin:2.2.0:validate-id (default-validate-id) @ org.eclipse.ease.lang.javascript.test ---
20:37:22 [2021-11-27T01:37:22.425Z] [INFO] 
20:37:22 [2021-11-27T01:37:22.425Z] [INFO] --- tycho-packaging-plugin:2.2.0:validate-version (default-validate-version) @ org.eclipse.ease.lang.javascript.test ---
20:37:22 [2021-11-27T01:37:22.425Z] [INFO] 
20:37:22 [2021-11-27T01:37:22.425Z] [INFO] --- maven-resources-plugin:2.4.3:resources (default-resources) @ org.eclipse.ease.lang.javascript.test ---
20:37:22 [2021-11-27T01:37:22.425Z] [INFO] Using 'UTF-8' encoding to copy filtered resources.
20:37:22 [2021-11-27T01:37:22.425Z] [INFO] skip non existing resourceDirectory /home/jenkins/agent/workspace/ease.verify.core.target.2020-03/tests/org.eclipse.ease.lang.javascript.test/src/main/resources
20:37:22 [2021-11-27T01:37:22.425Z] [INFO] 
20:37:22 [2021-11-27T01:37:22.425Z] [INFO] --- tycho-compiler-plugin:2.2.0:compile (default-compile) @ org.eclipse.ease.lang.javascript.test ---
20:37:22 [2021-11-27T01:37:22.426Z] [INFO] Nothing to compile - all classes are up to date
20:37:22 [2021-11-27T01:37:22.426Z] [INFO] 
20:37:22 [2021-11-27T01:37:22.426Z] [INFO] --- maven-resources-plugin:2.4.3:testResources (default-testResources) @ org.eclipse.ease.lang.javascript.test ---
20:37:22 [2021-11-27T01:37:22.426Z] [INFO] Using 'UTF-8' encoding to copy filtered resources.
20:37:22 [2021-11-27T01:37:22.426Z] [INFO] skip non existing resourceDirectory /home/jenkins/agent/workspace/ease.verify.core.target.2020-03/tests/org.eclipse.ease.lang.javascript.test/src/test/resources
20:37:22 [2021-11-27T01:37:22.426Z] [INFO] 
20:37:22 [2021-11-27T01:37:22.426Z] [INFO] --- target-platform-configuration:2.2.0:target-platform (default-target-platform) @ org.eclipse.ease.lang.javascript.test ---
20:37:22 [2021-11-27T01:37:22.426Z] [INFO] 
20:37:22 [2021-11-27T01:37:22.426Z] [INFO] --- tycho-packaging-plugin:2.2.0:package-plugin (default-package-plugin) @ org.eclipse.ease.lang.javascript.test ---
20:37:22 [2021-11-27T01:37:22.426Z] [INFO] Building jar: /home/jenkins/agent/workspace/ease.verify.core.target.2020-03/tests/org.eclipse.ease.lang.javascript.test/target/org.eclipse.ease.lang.javascript.test-0.9.0-SNAPSHOT.jar
20:37:22 [2021-11-27T01:37:22.426Z] [INFO] 
20:37:22 [2021-11-27T01:37:22.426Z] [INFO] --- tycho-p2-plugin:2.2.0:p2-metadata-default (default-p2-metadata-default) @ org.eclipse.ease.lang.javascript.test ---
20:37:22 [2021-11-27T01:37:22.426Z] [INFO] 
20:37:22 [2021-11-27T01:37:22.426Z] [INFO] --- jacoco-maven-plugin:0.8.6:prepare-agent (jacoco-initialize) @ org.eclipse.ease.lang.javascript.test ---
20:37:22 [2021-11-27T01:37:22.426Z] [INFO] tycho.testArgLine set to -javaagent:/home/jenkins/.m2/repository/org/jacoco/org.jacoco.agent/0.8.6/org.jacoco.agent-0.8.6-runtime.jar=destfile=/home/jenkins/agent/workspace/ease.verify.core.target.2020-03/tests/org.eclipse.ease.lang.javascript.test/target/jacoco.exec,output=file
20:37:22 [2021-11-27T01:37:22.426Z] [INFO] 
20:37:22 [2021-11-27T01:37:22.426Z] [INFO] --- tycho-surefire-plugin:2.2.0:test (default-test) @ org.eclipse.ease.lang.javascript.test ---
20:37:22 [2021-11-27T01:37:22.683Z] [INFO] Executing Test Runtime with timeout 0, logs (if any) will be placed at: /home/jenkins/agent/workspace/ease.verify.core.target.2020-03/tests/org.eclipse.ease.lang.javascript.test/target/work/data/.metadata/.log
20:37:22 [2021-11-27T01:37:22.683Z] [INFO] Command line:
20:37:22 [2021-11-27T01:37:22.683Z] 	[/opt/tools/java/openjdk/jdk-15/15.0.2+7/bin/java, -Dosgi.noShutdown=false, -Dosgi.os=linux, -Dosgi.ws=gtk, -Dosgi.arch=x86_64, -javaagent:/home/jenkins/.m2/repository/org/jacoco/org.jacoco.agent/0.8.6/org.jacoco.agent-0.8.6-runtime.jar=destfile=/home/jenkins/agent/workspace/ease.verify.core.target.2020-03/tests/org.eclipse.ease.lang.javascript.test/target/jacoco.exec,output=file, -Dosgi.clean=true, -jar, /home/jenkins/.m2/repository/p2/osgi/bundle/org.eclipse.equinox.launcher/1.5.700.v20200207-2156/org.eclipse.equinox.launcher-1.5.700.v20200207-2156.jar, -data, /home/jenkins/agent/workspace/ease.verify.core.target.2020-03/tests/org.eclipse.ease.lang.javascript.test/target/work/data, -install, /home/jenkins/agent/workspace/ease.verify.core.target.2020-03/tests/org.eclipse.ease.lang.javascript.test/target/work, -configuration, /home/jenkins/agent/workspace/ease.verify.core.target.2020-03/tests/org.eclipse.ease.lang.javascript.test/target/work/configuration, -application, org.eclipse.tycho.surefire.osgibooter.headlesstest, -testproperties, /home/jenkins/agent/workspace/ease.verify.core.target.2020-03/tests/org.eclipse.ease.lang.javascript.test/target/surefire.properties]
20:37:22 [2021-11-27T01:37:22.683Z] Picked up JAVA_TOOL_OPTIONS: -Dmaven.ext.class.path="/home/jenkins/agent/workspace/ease.verify.core.target.2020-03@tmp/withMaven3be7748d/pipeline-maven-spy.jar" -Dorg.jenkinsci.plugins.pipeline.maven.reportsFolder="/home/jenkins/agent/workspace/ease.verify.core.target.2020-03@tmp/withMaven3be7748d" 
20:37:25 [2021-11-27T01:37:25.227Z] Running org.eclipse.ease.lang.javascript.JavaScriptCodeFactoryTest
20:37:25 [2021-11-27T01:37:25.227Z] Tests run: 11, Failures: 0, Errors: 0, Skipped: 0, Time elapsed: 0.102 s - in org.eclipse.ease.lang.javascript.JavaScriptCodeFactoryTest
20:37:25 [2021-11-27T01:37:25.227Z] getSaveVariableName_creates_random_string_for_invalid_characters  Time elapsed: 0.068 s
20:37:25 [2021-11-27T01:37:25.227Z] getNullString_equals_null  Time elapsed: 0.004 s
20:37:25 [2021-11-27T01:37:25.228Z] getSaveVariableName_prefixes_keywords_with_underscore  Time elapsed: 0.001 s
20:37:25 [2021-11-27T01:37:25.228Z] getSaveVariableName_does_not_alter_save_name  Time elapsed: 0.001 s
20:37:25 [2021-11-27T01:37:25.228Z] classInstantiation_creates_instance_with_parameters  Time elapsed: 0.001 s
20:37:25 [2021-11-27T01:37:25.228Z] createCommentedString_creates_block_comment  Time elapsed: 0.002 s
20:37:25 [2021-11-27T01:37:25.228Z] createCommentedString_creates_single_line_comment  Time elapsed: 0.001 s
20:37:25 [2021-11-27T01:37:25.228Z] classInstantiation_creates_default_instance  Time elapsed: 0 s
20:37:25 [2021-11-27T01:37:25.228Z] createCommentedString_creates_multi_line_comment  Time elapsed: 0.001 s
20:37:25 [2021-11-27T01:37:25.228Z] getSaveVariableName_replaces_invalid_characters  Time elapsed: 0.001 s
20:37:25 [2021-11-27T01:37:25.228Z] getSaveVariableName_prefixes_numbers_with_underscore  Time elapsed: 0.001 s
20:37:25 [2021-11-27T01:37:25.228Z] 
20:37:25 [2021-11-27T01:37:25.228Z] Results:
20:37:25 [2021-11-27T01:37:25.228Z] 
20:37:25 [2021-11-27T01:37:25.228Z] Tests run: 11, Failures: 0, Errors: 0, Skipped: 0
20:37:25 [2021-11-27T01:37:25.228Z] 
20:37:25 [2021-11-27T01:37:25.496Z] [INFO] All tests passed!
20:37:25 [2021-11-27T01:37:25.496Z] [INFO] 
20:37:25 [2021-11-27T01:37:25.496Z] [INFO] ---------< org.eclipse.ease:org.eclipse.ease.lang.python.test >---------
20:37:25 [2021-11-27T01:37:25.496Z] [INFO] Building org.eclipse.ease.lang.python.test 0.9.0-SNAPSHOT          [6/9]
20:37:25 [2021-11-27T01:37:25.496Z] [INFO] ------------------------[ eclipse-test-plugin ]-------------------------
20:37:25 [2021-11-27T01:37:25.496Z] [INFO] 
20:37:25 [2021-11-27T01:37:25.496Z] [INFO] --- tycho-packaging-plugin:2.2.0:build-qualifier (default-build-qualifier) @ org.eclipse.ease.lang.python.test ---
20:37:25 [2021-11-27T01:37:25.496Z] [INFO] The project's OSGi version is 0.9.0.I202111151120
20:37:25 [2021-11-27T01:37:25.496Z] [INFO] 
20:37:25 [2021-11-27T01:37:25.497Z] [INFO] --- tycho-packaging-plugin:2.2.0:validate-id (default-validate-id) @ org.eclipse.ease.lang.python.test ---
20:37:25 [2021-11-27T01:37:25.497Z] [INFO] 
20:37:25 [2021-11-27T01:37:25.497Z] [INFO] --- tycho-packaging-plugin:2.2.0:validate-version (default-validate-version) @ org.eclipse.ease.lang.python.test ---
20:37:25 [2021-11-27T01:37:25.497Z] [INFO] 
20:37:25 [2021-11-27T01:37:25.497Z] [INFO] --- maven-resources-plugin:2.4.3:resources (default-resources) @ org.eclipse.ease.lang.python.test ---
20:37:25 [2021-11-27T01:37:25.497Z] [INFO] Using 'UTF-8' encoding to copy filtered resources.
20:37:25 [2021-11-27T01:37:25.497Z] [INFO] skip non existing resourceDirectory /home/jenkins/agent/workspace/ease.verify.core.target.2020-03/tests/org.eclipse.ease.lang.python.test/src/main/resources
20:37:25 [2021-11-27T01:37:25.497Z] [INFO] 
20:37:25 [2021-11-27T01:37:25.497Z] [INFO] --- tycho-compiler-plugin:2.2.0:compile (default-compile) @ org.eclipse.ease.lang.python.test ---
20:37:25 [2021-11-27T01:37:25.497Z] [INFO] Nothing to compile - all classes are up to date
20:37:25 [2021-11-27T01:37:25.497Z] [INFO] 
20:37:25 [2021-11-27T01:37:25.497Z] [INFO] --- maven-resources-plugin:2.4.3:testResources (default-testResources) @ org.eclipse.ease.lang.python.test ---
20:37:25 [2021-11-27T01:37:25.497Z] [INFO] Using 'UTF-8' encoding to copy filtered resources.
20:37:25 [2021-11-27T01:37:25.497Z] [INFO] skip non existing resourceDirectory /home/jenkins/agent/workspace/ease.verify.core.target.2020-03/tests/org.eclipse.ease.lang.python.test/src/test/resources
20:37:25 [2021-11-27T01:37:25.497Z] [INFO] 
20:37:25 [2021-11-27T01:37:25.497Z] [INFO] --- target-platform-configuration:2.2.0:target-platform (default-target-platform) @ org.eclipse.ease.lang.python.test ---
20:37:25 [2021-11-27T01:37:25.497Z] [INFO] 
20:37:25 [2021-11-27T01:37:25.497Z] [INFO] --- tycho-packaging-plugin:2.2.0:package-plugin (default-package-plugin) @ org.eclipse.ease.lang.python.test ---
20:37:25 [2021-11-27T01:37:25.497Z] [INFO] Building jar: /home/jenkins/agent/workspace/ease.verify.core.target.2020-03/tests/org.eclipse.ease.lang.python.test/target/org.eclipse.ease.lang.python.test-0.9.0-SNAPSHOT.jar
20:37:25 [2021-11-27T01:37:25.497Z] [INFO] 
20:37:25 [2021-11-27T01:37:25.497Z] [INFO] --- tycho-p2-plugin:2.2.0:p2-metadata-default (default-p2-metadata-default) @ org.eclipse.ease.lang.python.test ---
20:37:25 [2021-11-27T01:37:25.497Z] [INFO] 
20:37:25 [2021-11-27T01:37:25.497Z] [INFO] --- jacoco-maven-plugin:0.8.6:prepare-agent (jacoco-initialize) @ org.eclipse.ease.lang.python.test ---
20:37:25 [2021-11-27T01:37:25.497Z] [INFO] tycho.testArgLine set to -javaagent:/home/jenkins/.m2/repository/org/jacoco/org.jacoco.agent/0.8.6/org.jacoco.agent-0.8.6-runtime.jar=destfile=/home/jenkins/agent/workspace/ease.verify.core.target.2020-03/tests/org.eclipse.ease.lang.python.test/target/jacoco.exec,output=file
20:37:25 [2021-11-27T01:37:25.497Z] [INFO] 
20:37:25 [2021-11-27T01:37:25.497Z] [INFO] --- tycho-surefire-plugin:2.2.0:test (default-test) @ org.eclipse.ease.lang.python.test ---
20:37:26 [2021-11-27T01:37:26.430Z] [INFO] Executing Test Runtime with timeout 0, logs (if any) will be placed at: /home/jenkins/agent/workspace/ease.verify.core.target.2020-03/tests/org.eclipse.ease.lang.python.test/target/work/data/.metadata/.log
20:37:26 [2021-11-27T01:37:26.430Z] [INFO] Command line:
20:37:26 [2021-11-27T01:37:26.430Z] 	[/opt/tools/java/openjdk/jdk-15/15.0.2+7/bin/java, -Dosgi.noShutdown=false, -Dosgi.os=linux, -Dosgi.ws=gtk, -Dosgi.arch=x86_64, -javaagent:/home/jenkins/.m2/repository/org/jacoco/org.jacoco.agent/0.8.6/org.jacoco.agent-0.8.6-runtime.jar=destfile=/home/jenkins/agent/workspace/ease.verify.core.target.2020-03/tests/org.eclipse.ease.lang.python.test/target/jacoco.exec,output=file, -Dosgi.clean=true, -jar, /home/jenkins/.m2/repository/p2/osgi/bundle/org.eclipse.equinox.launcher/1.5.700.v20200207-2156/org.eclipse.equinox.launcher-1.5.700.v20200207-2156.jar, -data, /home/jenkins/agent/workspace/ease.verify.core.target.2020-03/tests/org.eclipse.ease.lang.python.test/target/work/data, -install, /home/jenkins/agent/workspace/ease.verify.core.target.2020-03/tests/org.eclipse.ease.lang.python.test/target/work, -configuration, /home/jenkins/agent/workspace/ease.verify.core.target.2020-03/tests/org.eclipse.ease.lang.python.test/target/work/configuration, -application, org.eclipse.tycho.surefire.osgibooter.headlesstest, -testproperties, /home/jenkins/agent/workspace/ease.verify.core.target.2020-03/tests/org.eclipse.ease.lang.python.test/target/surefire.properties]
20:37:26 [2021-11-27T01:37:26.430Z] Picked up JAVA_TOOL_OPTIONS: -Dmaven.ext.class.path="/home/jenkins/agent/workspace/ease.verify.core.target.2020-03@tmp/withMaven3be7748d/pipeline-maven-spy.jar" -Dorg.jenkinsci.plugins.pipeline.maven.reportsFolder="/home/jenkins/agent/workspace/ease.verify.core.target.2020-03@tmp/withMaven3be7748d" 
20:37:29 [2021-11-27T01:37:29.026Z] Running org.eclipse.ease.lang.python.PythonCodeFactoryTest
20:37:29 [2021-11-27T01:37:29.608Z] Tests run: 3, Failures: 0, Errors: 0, Skipped: 0, Time elapsed: 0.691 s - in org.eclipse.ease.lang.python.PythonCodeFactoryTest
20:37:29 [2021-11-27T01:37:29.608Z] createFunctionWrapper_creates_return_andParameters_for_Py4J  Time elapsed: 0.675 s
20:37:29 [2021-11-27T01:37:29.608Z] testCommentCreator  Time elapsed: 0.001 s
20:37:29 [2021-11-27T01:37:29.608Z] createFunctionWrapper_creates_void_return_types_for_Py4J  Time elapsed: 0.001 s
20:37:29 [2021-11-27T01:37:29.608Z] Running org.eclipse.ease.lang.python.PyDevPathImporterTest
20:37:29 [2021-11-27T01:37:29.865Z] Tests run: 6, Failures: 0, Errors: 0, Skipped: 0, Time elapsed: 0.386 s - in org.eclipse.ease.lang.python.PyDevPathImporterTest
20:37:29 [2021-11-27T01:37:29.865Z] createEngine_registers_engine_execution_listener  Time elapsed: 0.005 s
20:37:29 [2021-11-27T01:37:29.865Z] notify_does_not_throwwhen_PyDev_plugins_are_not_available  Time elapsed: 0.225 s
20:37:29 [2021-11-27T01:37:29.865Z] notify_registers_project_paths_for_engine_executed_file  Time elapsed: 0.149 s
20:37:29 [2021-11-27T01:37:29.865Z] notify_does_not_throw_for_non_PyDev_project  Time elapsed: 0.001 s
20:37:29 [2021-11-27T01:37:29.865Z] notify_escapes_path_on_windows  Time elapsed: 0.001 s
20:37:29 [2021-11-27T01:37:29.866Z] notify_registers_project_paths  Time elapsed: 0.002 s
20:37:29 [2021-11-27T01:37:29.866Z] 
20:37:29 [2021-11-27T01:37:29.866Z] Results:
20:37:29 [2021-11-27T01:37:29.866Z] 
20:37:29 [2021-11-27T01:37:29.866Z] Tests run: 9, Failures: 0, Errors: 0, Skipped: 0
20:37:29 [2021-11-27T01:37:29.866Z] 
20:37:30 [2021-11-27T01:37:30.123Z] [INFO] All tests passed!
20:37:30 [2021-11-27T01:37:30.123Z] [INFO] 
20:37:30 [2021-11-27T01:37:30.123Z] [INFO] -----< org.eclipse.ease:org.eclipse.ease.lang.python.jython.test >------
20:37:30 [2021-11-27T01:37:30.123Z] [INFO] Building org.eclipse.ease.lang.python.jython.test 0.9.0-SNAPSHOT   [7/9]
20:37:30 [2021-11-27T01:37:30.123Z] [INFO] ------------------------[ eclipse-test-plugin ]-------------------------
20:37:30 [2021-11-27T01:37:30.123Z] [INFO] 
20:37:30 [2021-11-27T01:37:30.123Z] [INFO] --- tycho-packaging-plugin:2.2.0:build-qualifier (default-build-qualifier) @ org.eclipse.ease.lang.python.jython.test ---
20:37:30 [2021-11-27T01:37:30.123Z] [INFO] The project's OSGi version is 0.9.0.I202106220815
20:37:30 [2021-11-27T01:37:30.123Z] [INFO] 
20:37:30 [2021-11-27T01:37:30.123Z] [INFO] --- tycho-packaging-plugin:2.2.0:validate-id (default-validate-id) @ org.eclipse.ease.lang.python.jython.test ---
20:37:30 [2021-11-27T01:37:30.123Z] [INFO] 
20:37:30 [2021-11-27T01:37:30.123Z] [INFO] --- tycho-packaging-plugin:2.2.0:validate-version (default-validate-version) @ org.eclipse.ease.lang.python.jython.test ---
20:37:30 [2021-11-27T01:37:30.123Z] [INFO] 
20:37:30 [2021-11-27T01:37:30.124Z] [INFO] --- maven-resources-plugin:2.4.3:resources (default-resources) @ org.eclipse.ease.lang.python.jython.test ---
20:37:30 [2021-11-27T01:37:30.124Z] [INFO] Using 'UTF-8' encoding to copy filtered resources.
20:37:30 [2021-11-27T01:37:30.124Z] [INFO] skip non existing resourceDirectory /home/jenkins/agent/workspace/ease.verify.core.target.2020-03/tests/org.eclipse.ease.lang.python.jython.test/src/main/resources
20:37:30 [2021-11-27T01:37:30.124Z] [INFO] 
20:37:30 [2021-11-27T01:37:30.124Z] [INFO] --- tycho-compiler-plugin:2.2.0:compile (default-compile) @ org.eclipse.ease.lang.python.jython.test ---
20:37:30 [2021-11-27T01:37:30.124Z] [INFO] Nothing to compile - all classes are up to date
20:37:30 [2021-11-27T01:37:30.124Z] [INFO] 
20:37:30 [2021-11-27T01:37:30.124Z] [INFO] --- maven-resources-plugin:2.4.3:testResources (default-testResources) @ org.eclipse.ease.lang.python.jython.test ---
20:37:30 [2021-11-27T01:37:30.124Z] [INFO] Using 'UTF-8' encoding to copy filtered resources.
20:37:30 [2021-11-27T01:37:30.124Z] [INFO] skip non existing resourceDirectory /home/jenkins/agent/workspace/ease.verify.core.target.2020-03/tests/org.eclipse.ease.lang.python.jython.test/src/test/resources
20:37:30 [2021-11-27T01:37:30.124Z] [INFO] 
20:37:30 [2021-11-27T01:37:30.124Z] [INFO] --- target-platform-configuration:2.2.0:target-platform (default-target-platform) @ org.eclipse.ease.lang.python.jython.test ---
20:37:30 [2021-11-27T01:37:30.124Z] [INFO] 
20:37:30 [2021-11-27T01:37:30.124Z] [INFO] --- tycho-packaging-plugin:2.2.0:package-plugin (default-package-plugin) @ org.eclipse.ease.lang.python.jython.test ---
20:37:30 [2021-11-27T01:37:30.124Z] [INFO] Building jar: /home/jenkins/agent/workspace/ease.verify.core.target.2020-03/tests/org.eclipse.ease.lang.python.jython.test/target/org.eclipse.ease.lang.python.jython.test-0.9.0-SNAPSHOT.jar
20:37:30 [2021-11-27T01:37:30.124Z] [INFO] 
20:37:30 [2021-11-27T01:37:30.124Z] [INFO] --- tycho-p2-plugin:2.2.0:p2-metadata-default (default-p2-metadata-default) @ org.eclipse.ease.lang.python.jython.test ---
20:37:30 [2021-11-27T01:37:30.124Z] [INFO] 
20:37:30 [2021-11-27T01:37:30.124Z] [INFO] --- jacoco-maven-plugin:0.8.6:prepare-agent (jacoco-initialize) @ org.eclipse.ease.lang.python.jython.test ---
20:37:30 [2021-11-27T01:37:30.124Z] [INFO] tycho.testArgLine set to -javaagent:/home/jenkins/.m2/repository/org/jacoco/org.jacoco.agent/0.8.6/org.jacoco.agent-0.8.6-runtime.jar=destfile=/home/jenkins/agent/workspace/ease.verify.core.target.2020-03/tests/org.eclipse.ease.lang.python.jython.test/target/jacoco.exec,output=file
20:37:30 [2021-11-27T01:37:30.124Z] [INFO] 
20:37:30 [2021-11-27T01:37:30.124Z] [INFO] --- tycho-surefire-plugin:2.2.0:test (default-test) @ org.eclipse.ease.lang.python.jython.test ---
20:37:30 [2021-11-27T01:37:30.700Z] [INFO] Executing Test Runtime with timeout 0, logs (if any) will be placed at: /home/jenkins/agent/workspace/ease.verify.core.target.2020-03/tests/org.eclipse.ease.lang.python.jython.test/target/work/data/.metadata/.log
20:37:30 [2021-11-27T01:37:30.700Z] [INFO] Command line:
20:37:30 [2021-11-27T01:37:30.700Z] 	[/opt/tools/java/openjdk/jdk-15/15.0.2+7/bin/java, -Dosgi.noShutdown=false, -Dosgi.os=linux, -Dosgi.ws=gtk, -Dosgi.arch=x86_64, -javaagent:/home/jenkins/.m2/repository/org/jacoco/org.jacoco.agent/0.8.6/org.jacoco.agent-0.8.6-runtime.jar=destfile=/home/jenkins/agent/workspace/ease.verify.core.target.2020-03/tests/org.eclipse.ease.lang.python.jython.test/target/jacoco.exec,output=file, -Dosgi.clean=true, -jar, /home/jenkins/.m2/repository/p2/osgi/bundle/org.eclipse.equinox.launcher/1.5.700.v20200207-2156/org.eclipse.equinox.launcher-1.5.700.v20200207-2156.jar, -data, /home/jenkins/agent/workspace/ease.verify.core.target.2020-03/tests/org.eclipse.ease.lang.python.jython.test/target/work/data, -install, /home/jenkins/agent/workspace/ease.verify.core.target.2020-03/tests/org.eclipse.ease.lang.python.jython.test/target/work, -configuration, /home/jenkins/agent/workspace/ease.verify.core.target.2020-03/tests/org.eclipse.ease.lang.python.jython.test/target/work/configuration, -application, org.eclipse.tycho.surefire.osgibooter.headlesstest, -testproperties, /home/jenkins/agent/workspace/ease.verify.core.target.2020-03/tests/org.eclipse.ease.lang.python.jython.test/target/surefire.properties]
20:37:30 [2021-11-27T01:37:30.700Z] Picked up JAVA_TOOL_OPTIONS: -Dmaven.ext.class.path="/home/jenkins/agent/workspace/ease.verify.core.target.2020-03@tmp/withMaven3be7748d/pipeline-maven-spy.jar" -Dorg.jenkinsci.plugins.pipeline.maven.reportsFolder="/home/jenkins/agent/workspace/ease.verify.core.target.2020-03@tmp/withMaven3be7748d" 
20:37:33 [2021-11-27T01:37:33.255Z] WARNING: An illegal reflective access operation has occurred
20:37:33 [2021-11-27T01:37:33.255Z] WARNING: Illegal reflective access by org.python.core.PySystemState (file:/home/jenkins/agent/workspace/ease.verify.core.target.2020-03/tests/org.eclipse.ease.lang.python.jython.test/target/work/plugins/org.jython_2.7.0.I202104151016/jython.jar) to method java.io.Console.encoding()
20:37:33 [2021-11-27T01:37:33.255Z] WARNING: Please consider reporting this to the maintainers of org.python.core.PySystemState
20:37:33 [2021-11-27T01:37:33.255Z] WARNING: Use --illegal-access=warn to enable warnings of further illegal reflective access operations
20:37:33 [2021-11-27T01:37:33.255Z] WARNING: All illegal access operations will be denied in a future release
20:37:33 [2021-11-27T01:37:33.822Z] Running org.eclipse.ease.lang.python.jython.debugger.JythonDebugTest
20:37:35 [2021-11-27T01:37:35.734Z] Start of script
20:37:35 [2021-11-27T01:37:35.734Z] include file start
20:37:35 [2021-11-27T01:37:35.734Z] include file processed
20:37:35 [2021-11-27T01:37:35.734Z] Result of testMethod = 5
20:37:35 [2021-11-27T01:37:35.734Z] End of script
20:37:35 [2021-11-27T01:37:35.992Z] Start of script
20:37:35 [2021-11-27T01:37:35.992Z] include file start
20:37:35 [2021-11-27T01:37:35.992Z] include file processed
20:37:35 [2021-11-27T01:37:35.992Z] Result of testMethod = 5
20:37:35 [2021-11-27T01:37:35.992Z] End of script
20:37:36 [2021-11-27T01:37:36.250Z] Start of script
20:37:36 [2021-11-27T01:37:36.250Z] include file start
20:37:36 [2021-11-27T01:37:36.250Z] include file processed
20:37:36 [2021-11-27T01:37:36.250Z] Result of testMethod = 5
20:37:36 [2021-11-27T01:37:36.250Z] Traceback (most recent call last):
20:37:36 [2021-11-27T01:37:36.250Z]   File "(none)", line 184, in run
20:37:36 [2021-11-27T01:37:36.250Z]   File "__ref_L/Debug Test/Main.py_qmlimnvgmq", line 23, in <module>
20:37:36 [2021-11-27T01:37:36.250Z]   File "(none)", line 161, in trace_dispatch
20:37:36 [2021-11-27T01:37:36.250Z] 	at org.eclipse.ease.debugging.AbstractEaseDebugger.handleEventsInSuspendedState(AbstractEaseDebugger.java:331)
20:37:36 [2021-11-27T01:37:36.250Z] 	at org.eclipse.ease.debugging.AbstractEaseDebugger.suspend(AbstractEaseDebugger.java:257)
20:37:36 [2021-11-27T01:37:36.250Z] 	at org.eclipse.ease.debugging.AbstractEaseDebugger.processLine(AbstractEaseDebugger.java:492)
20:37:36 [2021-11-27T01:37:36.250Z] 	at org.eclipse.ease.lang.python.debugger.PythonDebugger.traceDispatch(PythonDebugger.java:179)
20:37:36 [2021-11-27T01:37:36.250Z] 	at org.eclipse.ease.lang.python.jython.debugger.JythonDebugger.traceDispatch(JythonDebugger.java:46)
20:37:36 [2021-11-27T01:37:36.250Z] 	at jdk.internal.reflect.GeneratedMethodAccessor25.invoke(Unknown Source)
20:37:36 [2021-11-27T01:37:36.250Z] 	at java.base/jdk.internal.reflect.DelegatingMethodAccessorImpl.invoke(DelegatingMethodAccessorImpl.java:43)
20:37:36 [2021-11-27T01:37:36.250Z] 	at java.base/java.lang.reflect.Method.invoke(Method.java:564)
20:37:36 [2021-11-27T01:37:36.250Z] 
20:37:36 [2021-11-27T01:37:36.250Z] org.eclipse.ease.ScriptEngineCancellationException: org.eclipse.ease.ScriptEngineCancellationException: Terminated on user request
20:37:36 [2021-11-27T01:37:36.508Z] Start of script
20:37:36 [2021-11-27T01:37:36.508Z] include file start
20:37:36 [2021-11-27T01:37:36.508Z] include file processed
20:37:36 [2021-11-27T01:37:36.800Z] Result of testMethod = 5
20:37:36 [2021-11-27T01:37:36.800Z] End of script
20:37:37 [2021-11-27T01:37:37.057Z] Start of script
20:37:37 [2021-11-27T01:37:37.057Z] include file start
20:37:37 [2021-11-27T01:37:37.057Z] include file processed
20:37:37 [2021-11-27T01:37:37.057Z] Result of testMethod = 5
20:37:37 [2021-11-27T01:37:37.057Z] End of script
20:37:37 [2021-11-27T01:37:37.057Z] Start of script
20:37:37 [2021-11-27T01:37:37.057Z] include file start
20:37:37 [2021-11-27T01:37:37.057Z] include file processed
20:37:37 [2021-11-27T01:37:37.314Z] Result of testMethod = 5
20:37:37 [2021-11-27T01:37:37.314Z] End of script
20:37:37 [2021-11-27T01:37:37.314Z] Start of script
20:37:37 [2021-11-27T01:37:37.314Z] include file start
20:37:37 [2021-11-27T01:37:37.314Z] include file processed
20:37:37 [2021-11-27T01:37:37.314Z] Result of testMethod = 5
20:37:37 [2021-11-27T01:37:37.571Z] Traceback (most recent call last):
20:37:37 [2021-11-27T01:37:37.571Z]   File "(none)", line 184, in run
20:37:37 [2021-11-27T01:37:37.571Z]   File "__ref_L/Debug Test/Main.py_qvulpmhrzt", line 23, in <module>
20:37:37 [2021-11-27T01:37:37.571Z]   File "(none)", line 161, in trace_dispatch
20:37:37 [2021-11-27T01:37:37.571Z] 	at org.eclipse.ease.debugging.AbstractEaseDebugger.handleEventsInSuspendedState(AbstractEaseDebugger.java:331)
20:37:37 [2021-11-27T01:37:37.571Z] 	at org.eclipse.ease.debugging.AbstractEaseDebugger.suspend(AbstractEaseDebugger.java:257)
20:37:37 [2021-11-27T01:37:37.571Z] 	at org.eclipse.ease.debugging.AbstractEaseDebugger.processLine(AbstractEaseDebugger.java:492)
20:37:37 [2021-11-27T01:37:37.571Z] 	at org.eclipse.ease.lang.python.debugger.PythonDebugger.traceDispatch(PythonDebugger.java:179)
20:37:37 [2021-11-27T01:37:37.571Z] 	at org.eclipse.ease.lang.python.jython.debugger.JythonDebugger.traceDispatch(JythonDebugger.java:46)
20:37:37 [2021-11-27T01:37:37.571Z] 	at jdk.internal.reflect.GeneratedMethodAccessor25.invoke(Unknown Source)
20:37:37 [2021-11-27T01:37:37.571Z] 	at java.base/jdk.internal.reflect.DelegatingMethodAccessorImpl.invoke(DelegatingMethodAccessorImpl.java:43)
20:37:37 [2021-11-27T01:37:37.571Z] 	at java.base/java.lang.reflect.Method.invoke(Method.java:564)
20:37:37 [2021-11-27T01:37:37.571Z] 
20:37:37 [2021-11-27T01:37:37.571Z] org.eclipse.ease.ScriptEngineCancellationException: org.eclipse.ease.ScriptEngineCancellationException: Terminated on user request
20:37:37 [2021-11-27T01:37:37.829Z] Start of script
20:37:37 [2021-11-27T01:37:37.829Z] include file start
20:37:37 [2021-11-27T01:37:37.829Z] include file processed
20:37:37 [2021-11-27T01:37:37.829Z] Result of testMethod = 5
20:37:37 [2021-11-27T01:37:37.829Z] End of script
20:37:38 [2021-11-27T01:37:38.085Z] Start of script
20:37:38 [2021-11-27T01:37:38.086Z] include file start
20:37:38 [2021-11-27T01:37:38.086Z] include file processed
20:37:38 [2021-11-27T01:37:38.086Z] Result of testMethod = 5
20:37:38 [2021-11-27T01:37:38.086Z] End of script
20:37:38 [2021-11-27T01:37:38.342Z] Start of script
20:37:38 [2021-11-27T01:37:38.343Z] include file start
20:37:38 [2021-11-27T01:37:38.343Z] include file processed
20:37:38 [2021-11-27T01:37:38.600Z] Traceback (most recent call last):
20:37:38 [2021-11-27T01:37:38.600Z]   File "(none)", line 184, in run
20:37:38 [2021-11-27T01:37:38.600Z]   File "__ref_L/Debug Test/Main.py_ihytyjstev", line 22, in <module>
20:37:38 [2021-11-27T01:37:38.600Z]   File "(none)", line 161, in trace_dispatch
20:37:38 [2021-11-27T01:37:38.600Z] 	at org.eclipse.ease.debugging.AbstractEaseDebugger.handleEventsInSuspendedState(AbstractEaseDebugger.java:331)
20:37:38 [2021-11-27T01:37:38.600Z] 	at org.eclipse.ease.debugging.AbstractEaseDebugger.suspend(AbstractEaseDebugger.java:257)
20:37:38 [2021-11-27T01:37:38.600Z] 	at org.eclipse.ease.debugging.AbstractEaseDebugger.processLine(AbstractEaseDebugger.java:512)
20:37:38 [2021-11-27T01:37:38.600Z] 	at org.eclipse.ease.lang.python.debugger.PythonDebugger.traceDispatch(PythonDebugger.java:179)
20:37:38 [2021-11-27T01:37:38.600Z] 	at org.eclipse.ease.lang.python.jython.debugger.JythonDebugger.traceDispatch(JythonDebugger.java:46)
20:37:38 [2021-11-27T01:37:38.600Z] 	at jdk.internal.reflect.GeneratedMethodAccessor25.invoke(Unknown Source)
20:37:38 [2021-11-27T01:37:38.600Z] 	at java.base/jdk.internal.reflect.DelegatingMethodAccessorImpl.invoke(DelegatingMethodAccessorImpl.java:43)
20:37:38 [2021-11-27T01:37:38.600Z] 	at java.base/java.lang.reflect.Method.invoke(Method.java:564)
20:37:38 [2021-11-27T01:37:38.600Z] 
20:37:38 [2021-11-27T01:37:38.600Z] org.eclipse.ease.ScriptEngineCancellationException: org.eclipse.ease.ScriptEngineCancellationException: Terminated on user request
20:37:38 [2021-11-27T01:37:38.857Z] Start of script
20:37:38 [2021-11-27T01:37:38.857Z] include file start
20:37:38 [2021-11-27T01:37:38.857Z] include file processed
20:37:38 [2021-11-27T01:37:38.858Z] Result of testMethod = 5
20:37:38 [2021-11-27T01:37:38.858Z] End of script
20:37:38 [2021-11-27T01:37:38.858Z] Start of script
20:37:38 [2021-11-27T01:37:38.858Z] include file start
20:37:38 [2021-11-27T01:37:38.858Z] include file processed
20:37:39 [2021-11-27T01:37:39.114Z] Result of testMethod = 5
20:37:39 [2021-11-27T01:37:39.114Z] End of script
20:37:39 [2021-11-27T01:37:39.371Z] Traceback (most recent call last):
20:37:39 [2021-11-27T01:37:39.371Z]   File "(none)", line 184, in run
20:37:39 [2021-11-27T01:37:39.371Z]   File "__ref_L/Debug Test/Main.py_bmazxwnxjo", line 1, in <module>
20:37:39 [2021-11-27T01:37:39.371Z]   File "(none)", line 161, in trace_dispatch
20:37:39 [2021-11-27T01:37:39.371Z] 	at org.eclipse.ease.debugging.AbstractEaseDebugger.handleEventsInSuspendedState(AbstractEaseDebugger.java:331)
20:37:39 [2021-11-27T01:37:39.371Z] 	at org.eclipse.ease.debugging.AbstractEaseDebugger.suspend(AbstractEaseDebugger.java:257)
20:37:39 [2021-11-27T01:37:39.371Z] 	at org.eclipse.ease.debugging.AbstractEaseDebugger.processLine(AbstractEaseDebugger.java:492)
20:37:39 [2021-11-27T01:37:39.371Z] 	at org.eclipse.ease.lang.python.debugger.PythonDebugger.traceDispatch(PythonDebugger.java:179)
20:37:39 [2021-11-27T01:37:39.371Z] 	at org.eclipse.ease.lang.python.jython.debugger.JythonDebugger.traceDispatch(JythonDebugger.java:46)
20:37:39 [2021-11-27T01:37:39.371Z] 	at jdk.internal.reflect.GeneratedMethodAccessor25.invoke(Unknown Source)
20:37:39 [2021-11-27T01:37:39.371Z] 	at java.base/jdk.internal.reflect.DelegatingMethodAccessorImpl.invoke(DelegatingMethodAccessorImpl.java:43)
20:37:39 [2021-11-27T01:37:39.371Z] 	at java.base/java.lang.reflect.Method.invoke(Method.java:564)
20:37:39 [2021-11-27T01:37:39.371Z] 
20:37:39 [2021-11-27T01:37:39.371Z] org.eclipse.ease.ScriptEngineCancellationException: org.eclipse.ease.ScriptEngineCancellationException: Terminated on user request
20:37:39 [2021-11-27T01:37:39.371Z] Start of script
20:37:39 [2021-11-27T01:37:39.629Z] include file start
20:37:39 [2021-11-27T01:37:39.629Z] include file processed
20:37:39 [2021-11-27T01:37:39.629Z] Result of testMethod = 5
20:37:39 [2021-11-27T01:37:39.629Z] End of script
20:37:39 [2021-11-27T01:37:39.629Z] Start of script
20:37:39 [2021-11-27T01:37:39.629Z] include file start
20:37:39 [2021-11-27T01:37:39.629Z] include file processed
20:37:39 [2021-11-27T01:37:39.885Z] Result of testMethod = 5
20:37:39 [2021-11-27T01:37:39.885Z] End of script
20:37:39 [2021-11-27T01:37:39.885Z] Start of script
20:37:39 [2021-11-27T01:37:39.885Z] include file start
20:37:39 [2021-11-27T01:37:39.885Z] include file processed
20:37:39 [2021-11-27T01:37:39.885Z] Result of testMethod = 5
20:37:40 [2021-11-27T01:37:40.143Z] Traceback (most recent call last):
20:37:40 [2021-11-27T01:37:40.143Z]   File "(none)", line 184, in run
20:37:40 [2021-11-27T01:37:40.143Z]   File "__ref_L/Debug Test/Main.py_bittnzahpc", line 23, in <module>
20:37:40 [2021-11-27T01:37:40.143Z]   File "(none)", line 161, in trace_dispatch
20:37:40 [2021-11-27T01:37:40.143Z] 	at org.eclipse.ease.debugging.AbstractEaseDebugger.handleEventsInSuspendedState(AbstractEaseDebugger.java:331)
20:37:40 [2021-11-27T01:37:40.143Z] 	at org.eclipse.ease.debugging.AbstractEaseDebugger.suspend(AbstractEaseDebugger.java:257)
20:37:40 [2021-11-27T01:37:40.143Z] 	at org.eclipse.ease.debugging.AbstractEaseDebugger.processLine(AbstractEaseDebugger.java:492)
20:37:40 [2021-11-27T01:37:40.143Z] 	at org.eclipse.ease.lang.python.debugger.PythonDebugger.traceDispatch(PythonDebugger.java:179)
20:37:40 [2021-11-27T01:37:40.143Z] 	at org.eclipse.ease.lang.python.jython.debugger.JythonDebugger.traceDispatch(JythonDebugger.java:46)
20:37:40 [2021-11-27T01:37:40.143Z] 	at jdk.internal.reflect.GeneratedMethodAccessor25.invoke(Unknown Source)
20:37:40 [2021-11-27T01:37:40.143Z] 	at java.base/jdk.internal.reflect.DelegatingMethodAccessorImpl.invoke(DelegatingMethodAccessorImpl.java:43)
20:37:40 [2021-11-27T01:37:40.143Z] 	at java.base/java.lang.reflect.Method.invoke(Method.java:564)
20:37:40 [2021-11-27T01:37:40.143Z] 
20:37:40 [2021-11-27T01:37:40.143Z] org.eclipse.ease.ScriptEngineCancellationException: org.eclipse.ease.ScriptEngineCancellationException: Terminated on user request
20:37:40 [2021-11-27T01:37:40.143Z] Start of script
20:37:40 [2021-11-27T01:37:40.401Z] include file start
20:37:40 [2021-11-27T01:37:40.401Z] include file processed
20:37:40 [2021-11-27T01:37:40.401Z] Result of testMethod = 5
20:37:40 [2021-11-27T01:37:40.401Z] End of script
20:37:40 [2021-11-27T01:37:40.658Z] Traceback (most recent call last):
20:37:40 [2021-11-27T01:37:40.658Z]   File "(none)", line 184, in run
20:37:40 [2021-11-27T01:37:40.658Z]   File "__ref_L/Debug Test/Main.py_selfzashrq", line 1, in <module>
20:37:40 [2021-11-27T01:37:40.658Z]   File "(none)", line 161, in trace_dispatch
20:37:40 [2021-11-27T01:37:40.658Z] 	at org.eclipse.ease.debugging.AbstractEaseDebugger.handleEventsInSuspendedState(AbstractEaseDebugger.java:331)
20:37:40 [2021-11-27T01:37:40.658Z] 	at org.eclipse.ease.debugging.AbstractEaseDebugger.suspend(AbstractEaseDebugger.java:257)
20:37:40 [2021-11-27T01:37:40.658Z] 	at org.eclipse.ease.debugging.AbstractEaseDebugger.processLine(AbstractEaseDebugger.java:492)
20:37:40 [2021-11-27T01:37:40.658Z] 	at org.eclipse.ease.lang.python.debugger.PythonDebugger.traceDispatch(PythonDebugger.java:179)
20:37:40 [2021-11-27T01:37:40.658Z] 	at org.eclipse.ease.lang.python.jython.debugger.JythonDebugger.traceDispatch(JythonDebugger.java:46)
20:37:40 [2021-11-27T01:37:40.658Z] 	at jdk.internal.reflect.GeneratedMethodAccessor25.invoke(Unknown Source)
20:37:40 [2021-11-27T01:37:40.658Z] 	at java.base/jdk.internal.reflect.DelegatingMethodAccessorImpl.invoke(DelegatingMethodAccessorImpl.java:43)
20:37:40 [2021-11-27T01:37:40.658Z] 	at java.base/java.lang.reflect.Method.invoke(Method.java:564)
20:37:40 [2021-11-27T01:37:40.658Z] 
20:37:40 [2021-11-27T01:37:40.658Z] org.eclipse.ease.ScriptEngineCancellationException: org.eclipse.ease.ScriptEngineCancellationException: Terminated on user request
20:37:40 [2021-11-27T01:37:40.659Z] Start of script
20:37:40 [2021-11-27T01:37:40.915Z] include file start
20:37:40 [2021-11-27T01:37:40.915Z] include file processed
20:37:40 [2021-11-27T01:37:40.915Z] Result of testMethod = 5
20:37:40 [2021-11-27T01:37:40.915Z] End of script
20:37:40 [2021-11-27T01:37:40.915Z] Start of script
20:37:40 [2021-11-27T01:37:40.915Z] include file start
20:37:40 [2021-11-27T01:37:40.915Z] include file processed
20:37:41 [2021-11-27T01:37:41.172Z] Result of testMethod = 5
20:37:41 [2021-11-27T01:37:41.172Z] End of script
20:37:41 [2021-11-27T01:37:41.430Z] Traceback (most recent call last):
20:37:41 [2021-11-27T01:37:41.430Z]   File "(none)", line 184, in run
20:37:41 [2021-11-27T01:37:41.430Z]   File "__ref_L/Debug Test/Main.py_ujfueigcxd", line 1, in <module>
20:37:41 [2021-11-27T01:37:41.430Z]   File "(none)", line 161, in trace_dispatch
20:37:41 [2021-11-27T01:37:41.430Z] 	at org.eclipse.ease.debugging.AbstractEaseDebugger.handleEventsInSuspendedState(AbstractEaseDebugger.java:331)
20:37:41 [2021-11-27T01:37:41.430Z] 	at org.eclipse.ease.debugging.AbstractEaseDebugger.suspend(AbstractEaseDebugger.java:257)
20:37:41 [2021-11-27T01:37:41.430Z] 	at org.eclipse.ease.debugging.AbstractEaseDebugger.processLine(AbstractEaseDebugger.java:492)
20:37:41 [2021-11-27T01:37:41.430Z] 	at org.eclipse.ease.lang.python.debugger.PythonDebugger.traceDispatch(PythonDebugger.java:179)
20:37:41 [2021-11-27T01:37:41.430Z] 	at org.eclipse.ease.lang.python.jython.debugger.JythonDebugger.traceDispatch(JythonDebugger.java:46)
20:37:41 [2021-11-27T01:37:41.430Z] 	at jdk.internal.reflect.GeneratedMethodAccessor25.invoke(Unknown Source)
20:37:41 [2021-11-27T01:37:41.430Z] 	at java.base/jdk.internal.reflect.DelegatingMethodAccessorImpl.invoke(DelegatingMethodAccessorImpl.java:43)
20:37:41 [2021-11-27T01:37:41.430Z] 	at java.base/java.lang.reflect.Method.invoke(Method.java:564)
20:37:41 [2021-11-27T01:37:41.430Z] 
20:37:41 [2021-11-27T01:37:41.430Z] org.eclipse.ease.ScriptEngineCancellationException: org.eclipse.ease.ScriptEngineCancellationException: Terminated on user request
20:37:41 [2021-11-27T01:37:41.430Z] Start of script
20:37:41 [2021-11-27T01:37:41.430Z] include file start
20:37:41 [2021-11-27T01:37:41.430Z] include file processed
20:37:41 [2021-11-27T01:37:41.687Z] Result of testMethod = 5
20:37:41 [2021-11-27T01:37:41.687Z] End of script
20:37:41 [2021-11-27T01:37:41.687Z] Start of script
20:37:41 [2021-11-27T01:37:41.945Z] include file start
20:37:41 [2021-11-27T01:37:41.945Z] include file processed
20:37:41 [2021-11-27T01:37:41.945Z] Result of testMethod = 5
20:37:41 [2021-11-27T01:37:41.945Z] Traceback (most recent call last):
20:37:41 [2021-11-27T01:37:41.945Z]   File "(none)", line 184, in run
20:37:41 [2021-11-27T01:37:41.945Z]   File "__ref_L/Debug Test/Main.py_gqcpiwwyyz", line 23, in <module>
20:37:41 [2021-11-27T01:37:41.945Z]   File "(none)", line 161, in trace_dispatch
20:37:41 [2021-11-27T01:37:41.945Z] 	at org.eclipse.ease.debugging.AbstractEaseDebugger.handleEventsInSuspendedState(AbstractEaseDebugger.java:331)
20:37:41 [2021-11-27T01:37:41.945Z] 	at org.eclipse.ease.debugging.AbstractEaseDebugger.suspend(AbstractEaseDebugger.java:257)
20:37:41 [2021-11-27T01:37:41.945Z] 	at org.eclipse.ease.debugging.AbstractEaseDebugger.processLine(AbstractEaseDebugger.java:492)
20:37:41 [2021-11-27T01:37:41.945Z] 	at org.eclipse.ease.lang.python.debugger.PythonDebugger.traceDispatch(PythonDebugger.java:179)
20:37:41 [2021-11-27T01:37:41.945Z] 	at org.eclipse.ease.lang.python.jython.debugger.JythonDebugger.traceDispatch(JythonDebugger.java:46)
20:37:41 [2021-11-27T01:37:41.945Z] 	at jdk.internal.reflect.GeneratedMethodAccessor25.invoke(Unknown Source)
20:37:41 [2021-11-27T01:37:41.945Z] 	at java.base/jdk.internal.reflect.DelegatingMethodAccessorImpl.invoke(DelegatingMethodAccessorImpl.java:43)
20:37:41 [2021-11-27T01:37:41.945Z] 	at java.base/java.lang.reflect.Method.invoke(Method.java:564)
20:37:41 [2021-11-27T01:37:41.945Z] 
20:37:41 [2021-11-27T01:37:41.945Z] org.eclipse.ease.ScriptEngineCancellationException: org.eclipse.ease.ScriptEngineCancellationException: Terminated on user request
20:37:42 [2021-11-27T01:37:42.202Z] Start of script
20:37:42 [2021-11-27T01:37:42.202Z] include file start
20:37:42 [2021-11-27T01:37:42.202Z] include file processed
20:37:42 [2021-11-27T01:37:42.202Z] Result of testMethod = 5
20:37:42 [2021-11-27T01:37:42.202Z] End of script
20:37:42 [2021-11-27T01:37:42.202Z] Start of script
20:37:42 [2021-11-27T01:37:42.202Z] include file start
20:37:42 [2021-11-27T01:37:42.202Z] include file processed
20:37:42 [2021-11-27T01:37:42.460Z] Result of testMethod = 5
20:37:42 [2021-11-27T01:37:42.460Z] End of script
20:37:42 [2021-11-27T01:37:42.717Z] Start of script
20:37:42 [2021-11-27T01:37:42.717Z] include file start
20:37:42 [2021-11-27T01:37:42.717Z] include file processed
20:37:42 [2021-11-27T01:37:42.717Z] Result of testMethod = 5
20:37:42 [2021-11-27T01:37:42.717Z] End of script
20:37:42 [2021-11-27T01:37:42.717Z] Start of script
20:37:42 [2021-11-27T01:37:42.717Z] include file start
20:37:42 [2021-11-27T01:37:42.717Z] include file processed
20:37:42 [2021-11-27T01:37:42.975Z] Result of testMethod = 5
20:37:42 [2021-11-27T01:37:42.976Z] End of script
20:37:42 [2021-11-27T01:37:42.976Z] Start of script
20:37:42 [2021-11-27T01:37:42.976Z] include file start
20:37:42 [2021-11-27T01:37:42.976Z] include file processed
20:37:43 [2021-11-27T01:37:43.233Z] Traceback (most recent call last):
20:37:43 [2021-11-27T01:37:43.233Z]   File "(none)", line 184, in run
20:37:43 [2021-11-27T01:37:43.233Z]   File "__ref_L/Debug Test/Main.py_eylmeurycy", line 21, in <module>
20:37:43 [2021-11-27T01:37:43.233Z]   File "__ref_L/Debug Test/Main.py_eylmeurycy", line 18, in testMethod
20:37:43 [2021-11-27T01:37:43.233Z]   File "(none)", line 161, in trace_dispatch
20:37:43 [2021-11-27T01:37:43.233Z] 	at org.eclipse.ease.debugging.AbstractEaseDebugger.handleEventsInSuspendedState(AbstractEaseDebugger.java:331)
20:37:43 [2021-11-27T01:37:43.233Z] 	at org.eclipse.ease.debugging.AbstractEaseDebugger.suspend(AbstractEaseDebugger.java:257)
20:37:43 [2021-11-27T01:37:43.233Z] 	at org.eclipse.ease.debugging.AbstractEaseDebugger.processLine(AbstractEaseDebugger.java:492)
20:37:43 [2021-11-27T01:37:43.233Z] 	at org.eclipse.ease.lang.python.debugger.PythonDebugger.traceDispatch(PythonDebugger.java:179)
20:37:43 [2021-11-27T01:37:43.233Z] 	at org.eclipse.ease.lang.python.jython.debugger.JythonDebugger.traceDispatch(JythonDebugger.java:46)
20:37:43 [2021-11-27T01:37:43.233Z] 	at jdk.internal.reflect.GeneratedMethodAccessor25.invoke(Unknown Source)
20:37:43 [2021-11-27T01:37:43.233Z] 	at java.base/jdk.internal.reflect.DelegatingMethodAccessorImpl.invoke(DelegatingMethodAccessorImpl.java:43)
20:37:43 [2021-11-27T01:37:43.233Z] 	at java.base/java.lang.reflect.Method.invoke(Method.java:564)
20:37:43 [2021-11-27T01:37:43.233Z] 
20:37:43 [2021-11-27T01:37:43.233Z] org.eclipse.ease.ScriptEngineCancellationException: org.eclipse.ease.ScriptEngineCancellationException: Terminated on user request
20:37:43 [2021-11-27T01:37:43.233Z] Start of script
20:37:43 [2021-11-27T01:37:43.491Z] include file start
20:37:43 [2021-11-27T01:37:43.491Z] include file processed
20:37:43 [2021-11-27T01:37:43.491Z] Result of testMethod = 5
20:37:43 [2021-11-27T01:37:43.491Z] End of script
20:37:43 [2021-11-27T01:37:43.752Z] Start of script
20:37:43 [2021-11-27T01:37:43.752Z] include file start
20:37:43 [2021-11-27T01:37:43.752Z] include file processed
20:37:43 [2021-11-27T01:37:43.752Z] Result of testMethod = 5
20:37:43 [2021-11-27T01:37:43.752Z] Traceback (most recent call last):
20:37:43 [2021-11-27T01:37:43.752Z]   File "(none)", line 184, in run
20:37:43 [2021-11-27T01:37:43.752Z]   File "__ref_L/Debug Test/Main.py_mduitlmeyw", line 23, in <module>
20:37:43 [2021-11-27T01:37:43.752Z]   File "(none)", line 161, in trace_dispatch
20:37:43 [2021-11-27T01:37:43.753Z] 	at org.eclipse.ease.debugging.AbstractEaseDebugger.handleEventsInSuspendedState(AbstractEaseDebugger.java:331)
20:37:43 [2021-11-27T01:37:43.753Z] 	at org.eclipse.ease.debugging.AbstractEaseDebugger.suspend(AbstractEaseDebugger.java:257)
20:37:43 [2021-11-27T01:37:43.753Z] 	at org.eclipse.ease.debugging.AbstractEaseDebugger.processLine(AbstractEaseDebugger.java:492)
20:37:43 [2021-11-27T01:37:43.753Z] 	at org.eclipse.ease.lang.python.debugger.PythonDebugger.traceDispatch(PythonDebugger.java:179)
20:37:43 [2021-11-27T01:37:43.753Z] 	at org.eclipse.ease.lang.python.jython.debugger.JythonDebugger.traceDispatch(JythonDebugger.java:46)
20:37:43 [2021-11-27T01:37:43.753Z] 	at jdk.internal.reflect.GeneratedMethodAccessor25.invoke(Unknown Source)
20:37:43 [2021-11-27T01:37:43.753Z] 	at java.base/jdk.internal.reflect.DelegatingMethodAccessorImpl.invoke(DelegatingMethodAccessorImpl.java:43)
20:37:43 [2021-11-27T01:37:43.753Z] 	at java.base/java.lang.reflect.Method.invoke(Method.java:564)
20:37:43 [2021-11-27T01:37:43.753Z] 
20:37:43 [2021-11-27T01:37:43.753Z] org.eclipse.ease.ScriptEngineCancellationException: org.eclipse.ease.ScriptEngineCancellationException: Terminated on user request
20:37:44 [2021-11-27T01:37:44.009Z] Start of script
20:37:44 [2021-11-27T01:37:44.009Z] include file start
20:37:44 [2021-11-27T01:37:44.009Z] include file processed
20:37:44 [2021-11-27T01:37:44.009Z] Result of testMethod = 5
20:37:44 [2021-11-27T01:37:44.009Z] End of script
20:37:44 [2021-11-27T01:37:44.267Z] Start of script
20:37:44 [2021-11-27T01:37:44.267Z] include file start
20:37:44 [2021-11-27T01:37:44.267Z] include file processed
20:37:44 [2021-11-27T01:37:44.267Z] Result of testMethod = 5
20:37:44 [2021-11-27T01:37:44.267Z] End of script
20:37:44 [2021-11-27T01:37:44.524Z] Start of script
20:37:44 [2021-11-27T01:37:44.524Z] include file start
20:37:44 [2021-11-27T01:37:44.524Z] include file processed
20:37:44 [2021-11-27T01:37:44.524Z] Result of testMethod = 5
20:37:44 [2021-11-27T01:37:44.524Z] End of script
20:37:44 [2021-11-27T01:37:44.782Z] Start of script
20:37:44 [2021-11-27T01:37:44.782Z] include file start
20:37:44 [2021-11-27T01:37:44.782Z] include file processed
20:37:44 [2021-11-27T01:37:44.782Z] Result of testMethod = 5
20:37:44 [2021-11-27T01:37:44.782Z] End of script
20:37:45 [2021-11-27T01:37:45.039Z] Start of script
20:37:45 [2021-11-27T01:37:45.039Z] include file start
20:37:45 [2021-11-27T01:37:45.039Z] include file processed
20:37:45 [2021-11-27T01:37:45.039Z] Result of testMethod = 5
20:37:45 [2021-11-27T01:37:45.039Z] Traceback (most recent call last):
20:37:45 [2021-11-27T01:37:45.039Z]   File "(none)", line 184, in run
20:37:45 [2021-11-27T01:37:45.039Z]   File "__ref_L/Debug Test/Main.py_oujmkciikg", line 23, in <module>
20:37:45 [2021-11-27T01:37:45.039Z]   File "(none)", line 161, in trace_dispatch
20:37:45 [2021-11-27T01:37:45.039Z] 	at org.eclipse.ease.debugging.AbstractEaseDebugger.handleEventsInSuspendedState(AbstractEaseDebugger.java:331)
20:37:45 [2021-11-27T01:37:45.039Z] 	at org.eclipse.ease.debugging.AbstractEaseDebugger.suspend(AbstractEaseDebugger.java:257)
20:37:45 [2021-11-27T01:37:45.039Z] 	at org.eclipse.ease.debugging.AbstractEaseDebugger.processLine(AbstractEaseDebugger.java:492)
20:37:45 [2021-11-27T01:37:45.039Z] 	at org.eclipse.ease.lang.python.debugger.PythonDebugger.traceDispatch(PythonDebugger.java:179)
20:37:45 [2021-11-27T01:37:45.039Z] 	at org.eclipse.ease.lang.python.jython.debugger.JythonDebugger.traceDispatch(JythonDebugger.java:46)
20:37:45 [2021-11-27T01:37:45.039Z] 	at jdk.internal.reflect.GeneratedMethodAccessor25.invoke(Unknown Source)
20:37:45 [2021-11-27T01:37:45.039Z] 	at java.base/jdk.internal.reflect.DelegatingMethodAccessorImpl.invoke(DelegatingMethodAccessorImpl.java:43)
20:37:45 [2021-11-27T01:37:45.039Z] 	at java.base/java.lang.reflect.Method.invoke(Method.java:564)
20:37:45 [2021-11-27T01:37:45.039Z] 
20:37:45 [2021-11-27T01:37:45.040Z] org.eclipse.ease.ScriptEngineCancellationException: org.eclipse.ease.ScriptEngineCancellationException: Terminated on user request
20:37:45 [2021-11-27T01:37:45.297Z] Start of script
20:37:45 [2021-11-27T01:37:45.297Z] include file start
20:37:45 [2021-11-27T01:37:45.297Z] include file processed
20:37:45 [2021-11-27T01:37:45.297Z] Result of testMethod = 5
20:37:45 [2021-11-27T01:37:45.297Z] End of script
20:37:45 [2021-11-27T01:37:45.554Z] Start of script
20:37:45 [2021-11-27T01:37:45.554Z] include file start
20:37:45 [2021-11-27T01:37:45.554Z] include file processed
20:37:45 [2021-11-27T01:37:45.554Z] Result of testMethod = 5
20:37:45 [2021-11-27T01:37:45.554Z] Traceback (most recent call last):
20:37:45 [2021-11-27T01:37:45.554Z]   File "(none)", line 184, in run
20:37:45 [2021-11-27T01:37:45.554Z]   File "__ref_L/Debug Test/Main.py_epgzyejvld", line 23, in <module>
20:37:45 [2021-11-27T01:37:45.554Z]   File "(none)", line 161, in trace_dispatch
20:37:45 [2021-11-27T01:37:45.554Z] 	at org.eclipse.ease.debugging.AbstractEaseDebugger.handleEventsInSuspendedState(AbstractEaseDebugger.java:331)
20:37:45 [2021-11-27T01:37:45.555Z] 	at org.eclipse.ease.debugging.AbstractEaseDebugger.suspend(AbstractEaseDebugger.java:257)
20:37:45 [2021-11-27T01:37:45.555Z] 	at org.eclipse.ease.debugging.AbstractEaseDebugger.processLine(AbstractEaseDebugger.java:492)
20:37:45 [2021-11-27T01:37:45.555Z] 	at org.eclipse.ease.lang.python.debugger.PythonDebugger.traceDispatch(PythonDebugger.java:179)
20:37:45 [2021-11-27T01:37:45.555Z] 	at org.eclipse.ease.lang.python.jython.debugger.JythonDebugger.traceDispatch(JythonDebugger.java:46)
20:37:45 [2021-11-27T01:37:45.555Z] 	at jdk.internal.reflect.GeneratedMethodAccessor25.invoke(Unknown Source)
20:37:45 [2021-11-27T01:37:45.555Z] 	at java.base/jdk.internal.reflect.DelegatingMethodAccessorImpl.invoke(DelegatingMethodAccessorImpl.java:43)
20:37:45 [2021-11-27T01:37:45.555Z] 	at java.base/java.lang.reflect.Method.invoke(Method.java:564)
20:37:45 [2021-11-27T01:37:45.555Z] 
20:37:45 [2021-11-27T01:37:45.555Z] org.eclipse.ease.ScriptEngineCancellationException: org.eclipse.ease.ScriptEngineCancellationException: Terminated on user request
20:37:45 [2021-11-27T01:37:45.811Z] Traceback (most recent call last):
20:37:45 [2021-11-27T01:37:45.811Z]   File "(none)", line 184, in run
20:37:45 [2021-11-27T01:37:45.811Z]   File "__ref_L/Debug Test/Main.py_tmvljynmlg", line 1, in <module>
20:37:45 [2021-11-27T01:37:45.812Z]   File "(none)", line 161, in trace_dispatch
20:37:45 [2021-11-27T01:37:45.812Z] 	at org.eclipse.ease.debugging.AbstractEaseDebugger.handleEventsInSuspendedState(AbstractEaseDebugger.java:331)
20:37:45 [2021-11-27T01:37:45.812Z] 	at org.eclipse.ease.debugging.AbstractEaseDebugger.suspend(AbstractEaseDebugger.java:257)
20:37:45 [2021-11-27T01:37:45.812Z] 	at org.eclipse.ease.debugging.AbstractEaseDebugger.processLine(AbstractEaseDebugger.java:492)
20:37:45 [2021-11-27T01:37:45.812Z] 	at org.eclipse.ease.lang.python.debugger.PythonDebugger.traceDispatch(PythonDebugger.java:179)
20:37:45 [2021-11-27T01:37:45.812Z] 	at org.eclipse.ease.lang.python.jython.debugger.JythonDebugger.traceDispatch(JythonDebugger.java:46)
20:37:45 [2021-11-27T01:37:45.812Z] 	at jdk.internal.reflect.GeneratedMethodAccessor25.invoke(Unknown Source)
20:37:45 [2021-11-27T01:37:45.812Z] 	at java.base/jdk.internal.reflect.DelegatingMethodAccessorImpl.invoke(DelegatingMethodAccessorImpl.java:43)
20:37:45 [2021-11-27T01:37:45.812Z] 	at java.base/java.lang.reflect.Method.invoke(Method.java:564)
20:37:45 [2021-11-27T01:37:45.812Z] 
20:37:45 [2021-11-27T01:37:45.812Z] org.eclipse.ease.ScriptEngineCancellationException: org.eclipse.ease.ScriptEngineCancellationException: Terminated on user request
20:37:46 [2021-11-27T01:37:46.069Z] Start of script
20:37:46 [2021-11-27T01:37:46.069Z] include file start
20:37:46 [2021-11-27T01:37:46.069Z] include file processed
20:37:46 [2021-11-27T01:37:46.069Z] Result of testMethod = 5
20:37:46 [2021-11-27T01:37:46.069Z] End of script
20:37:46 [2021-11-27T01:37:46.326Z] Start of script
20:37:46 [2021-11-27T01:37:46.326Z] include file start
20:37:46 [2021-11-27T01:37:46.326Z] include file processed
20:37:46 [2021-11-27T01:37:46.326Z] Result of testMethod = 5
20:37:46 [2021-11-27T01:37:46.326Z] End of script
20:37:46 [2021-11-27T01:37:46.583Z] Start of script
20:37:46 [2021-11-27T01:37:46.583Z] include file start
20:37:46 [2021-11-27T01:37:46.583Z] include file processed
20:37:46 [2021-11-27T01:37:46.584Z] Result of testMethod = 5
20:37:46 [2021-11-27T01:37:46.584Z] End of script
20:37:46 [2021-11-27T01:37:46.841Z] Tests run: 41, Failures: 0, Errors: 0, Skipped: 0, Time elapsed: 13.018 s - in org.eclipse.ease.lang.python.jython.debugger.JythonDebugTest
20:37:46 [2021-11-27T01:37:46.841Z] disconnectProcessInSuspendedState  Time elapsed: 2.201 s
20:37:46 [2021-11-27T01:37:46.841Z] stepReturnIncludeCommand  Time elapsed: 0.213 s
20:37:46 [2021-11-27T01:37:46.841Z] arrayVariableSorting  Time elapsed: 0.308 s
20:37:46 [2021-11-27T01:37:46.841Z] stepOverOnDebugTarget  Time elapsed: 0.408 s
20:37:46 [2021-11-27T01:37:46.841Z] disconnectThreadInSuspendedState  Time elapsed: 0.214 s
20:37:46 [2021-11-27T01:37:46.841Z] stepReturnOnDebugTarget  Time elapsed: 0.307 s
20:37:46 [2021-11-27T01:37:46.841Z] nullVariable  Time elapsed: 0.307 s
20:37:46 [2021-11-27T01:37:46.841Z] stepOverOnStackFrame  Time elapsed: 0.307 s
20:37:46 [2021-11-27T01:37:46.841Z] resumeOnDebugTarget  Time elapsed: 0.206 s
20:37:46 [2021-11-27T01:37:46.841Z] modifyVariableKeepingType  Time elapsed: 0.506 s
20:37:46 [2021-11-27T01:37:46.841Z] resumeOnLastIncludeLine  Time elapsed: 0.205 s
20:37:46 [2021-11-27T01:37:46.841Z] stepReturnOnStackFrame  Time elapsed: 0.306 s
20:37:46 [2021-11-27T01:37:46.841Z] terminateStackFrameInSuspendedState  Time elapsed: 0.205 s
20:37:46 [2021-11-27T01:37:46.841Z] breakpointLocation  Time elapsed: 0.205 s
20:37:46 [2021-11-27T01:37:46.841Z] stepReturnOnThread  Time elapsed: 0.306 s
20:37:46 [2021-11-27T01:37:46.841Z] javaClassVariable  Time elapsed: 0.316 s
20:37:46 [2021-11-27T01:37:46.841Z] stepIntoOnThread  Time elapsed: 0.307 s
20:37:46 [2021-11-27T01:37:46.841Z] terminateThreadInSuspendedState  Time elapsed: 0.207 s
20:37:46 [2021-11-27T01:37:46.841Z] resumeOnThread  Time elapsed: 0.206 s
20:37:46 [2021-11-27T01:37:46.841Z] stepIntoOnStackFrame  Time elapsed: 0.306 s
20:37:46 [2021-11-27T01:37:46.841Z] terminateProcessInSuspendedState  Time elapsed: 0.205 s
20:37:46 [2021-11-27T01:37:46.841Z] stepOverOnProcess  Time elapsed: 0.306 s
20:37:46 [2021-11-27T01:37:46.841Z] nativeArrayVariable  Time elapsed: 0.306 s
20:37:46 [2021-11-27T01:37:46.841Z] disconnectDebugTargetInSuspendedState  Time elapsed: 0.206 s
20:37:46 [2021-11-27T01:37:46.841Z] stepIntoOnProcess  Time elapsed: 0.308 s
20:37:46 [2021-11-27T01:37:46.841Z] terminatedState  Time elapsed: 0.105 s
20:37:46 [2021-11-27T01:37:46.841Z] stepOverIncludeCommand  Time elapsed: 0.305 s
20:37:46 [2021-11-27T01:37:46.841Z] innerScopeVariableBeforeOuterScopeVariable  Time elapsed: 0.323 s
20:37:46 [2021-11-27T01:37:46.841Z] stepIntoIncludeCommand  Time elapsed: 0.305 s
20:37:46 [2021-11-27T01:37:46.841Z] primitiveStringVariable  Time elapsed: 0.309 s
20:37:46 [2021-11-27T01:37:46.841Z] resumeOnProcess  Time elapsed: 0.204 s
20:37:46 [2021-11-27T01:37:46.841Z] stepIntoOnDebugTarget  Time elapsed: 0.306 s
20:37:46 [2021-11-27T01:37:46.841Z] stepOverOnThread  Time elapsed: 0.305 s
20:37:46 [2021-11-27T01:37:46.841Z] suspendedState  Time elapsed: 0.204 s
20:37:46 [2021-11-27T01:37:46.841Z] primitiveDoubleVariable  Time elapsed: 0.305 s
20:37:46 [2021-11-27T01:37:46.841Z] resumeOnStackFrame  Time elapsed: 0.204 s
20:37:46 [2021-11-27T01:37:46.841Z] nativeObjectVariable  Time elapsed: 0.304 s
20:37:46 [2021-11-27T01:37:46.841Z] terminateDebugTargetInSuspendedState  Time elapsed: 0.205 s
20:37:46 [2021-11-27T01:37:46.841Z] disconnectStackFrameInSuspendedState  Time elapsed: 0.206 s
20:37:46 [2021-11-27T01:37:46.842Z] stepReturnOnProcess  Time elapsed: 0.306 s
20:37:46 [2021-11-27T01:37:46.842Z] evaluateWatchExpression  Time elapsed: 0.217 s
20:37:46 [2021-11-27T01:37:46.842Z] 
20:37:46 [2021-11-27T01:37:46.842Z] Results:
20:37:46 [2021-11-27T01:37:46.842Z] 
20:37:46 [2021-11-27T01:37:46.842Z] Tests run: 41, Failures: 0, Errors: 0, Skipped: 0
20:37:46 [2021-11-27T01:37:46.842Z] 
20:37:47 [2021-11-27T01:37:47.099Z] [INFO] All tests passed!
20:37:47 [2021-11-27T01:37:47.099Z] [INFO] 
20:37:47 [2021-11-27T01:37:47.099Z] [INFO] -----< org.eclipse.ease:org.eclipse.ease.lang.scriptarchive.test >------
20:37:47 [2021-11-27T01:37:47.099Z] [INFO] Building org.eclipse.ease.lang.scriptarchive.test 0.9.0-SNAPSHOT   [8/9]
20:37:47 [2021-11-27T01:37:47.099Z] [INFO] ------------------------[ eclipse-test-plugin ]-------------------------
20:37:47 [2021-11-27T01:37:47.099Z] [INFO] 
20:37:47 [2021-11-27T01:37:47.099Z] [INFO] --- tycho-packaging-plugin:2.2.0:build-qualifier (default-build-qualifier) @ org.eclipse.ease.lang.scriptarchive.test ---
20:37:47 [2021-11-27T01:37:47.099Z] [INFO] The project's OSGi version is 0.9.0.I202106220815
20:37:47 [2021-11-27T01:37:47.099Z] [INFO] 
20:37:47 [2021-11-27T01:37:47.099Z] [INFO] --- tycho-packaging-plugin:2.2.0:validate-id (default-validate-id) @ org.eclipse.ease.lang.scriptarchive.test ---
20:37:47 [2021-11-27T01:37:47.099Z] [INFO] 
20:37:47 [2021-11-27T01:37:47.099Z] [INFO] --- tycho-packaging-plugin:2.2.0:validate-version (default-validate-version) @ org.eclipse.ease.lang.scriptarchive.test ---
20:37:47 [2021-11-27T01:37:47.099Z] [INFO] 
20:37:47 [2021-11-27T01:37:47.099Z] [INFO] --- maven-resources-plugin:2.4.3:resources (default-resources) @ org.eclipse.ease.lang.scriptarchive.test ---
20:37:47 [2021-11-27T01:37:47.099Z] [INFO] Using 'UTF-8' encoding to copy filtered resources.
20:37:47 [2021-11-27T01:37:47.099Z] [INFO] skip non existing resourceDirectory /home/jenkins/agent/workspace/ease.verify.core.target.2020-03/tests/org.eclipse.ease.lang.scriptarchive.test/src/main/resources
20:37:47 [2021-11-27T01:37:47.099Z] [INFO] 
20:37:47 [2021-11-27T01:37:47.099Z] [INFO] --- tycho-compiler-plugin:2.2.0:compile (default-compile) @ org.eclipse.ease.lang.scriptarchive.test ---
20:37:47 [2021-11-27T01:37:47.099Z] [INFO] Nothing to compile - all classes are up to date
20:37:47 [2021-11-27T01:37:47.099Z] [INFO] 
20:37:47 [2021-11-27T01:37:47.099Z] [INFO] --- maven-resources-plugin:2.4.3:testResources (default-testResources) @ org.eclipse.ease.lang.scriptarchive.test ---
20:37:47 [2021-11-27T01:37:47.099Z] [INFO] Using 'UTF-8' encoding to copy filtered resources.
20:37:47 [2021-11-27T01:37:47.099Z] [INFO] skip non existing resourceDirectory /home/jenkins/agent/workspace/ease.verify.core.target.2020-03/tests/org.eclipse.ease.lang.scriptarchive.test/src/test/resources
20:37:47 [2021-11-27T01:37:47.099Z] [INFO] 
20:37:47 [2021-11-27T01:37:47.099Z] [INFO] --- target-platform-configuration:2.2.0:target-platform (default-target-platform) @ org.eclipse.ease.lang.scriptarchive.test ---
20:37:47 [2021-11-27T01:37:47.099Z] [INFO] 
20:37:47 [2021-11-27T01:37:47.099Z] [INFO] --- tycho-packaging-plugin:2.2.0:package-plugin (default-package-plugin) @ org.eclipse.ease.lang.scriptarchive.test ---
20:37:47 [2021-11-27T01:37:47.099Z] [INFO] Building jar: /home/jenkins/agent/workspace/ease.verify.core.target.2020-03/tests/org.eclipse.ease.lang.scriptarchive.test/target/org.eclipse.ease.lang.scriptarchive.test-0.9.0-SNAPSHOT.jar
20:37:47 [2021-11-27T01:37:47.099Z] [INFO] 
20:37:47 [2021-11-27T01:37:47.100Z] [INFO] --- tycho-p2-plugin:2.2.0:p2-metadata-default (default-p2-metadata-default) @ org.eclipse.ease.lang.scriptarchive.test ---
20:37:47 [2021-11-27T01:37:47.100Z] [INFO] 
20:37:47 [2021-11-27T01:37:47.100Z] [INFO] --- jacoco-maven-plugin:0.8.6:prepare-agent (jacoco-initialize) @ org.eclipse.ease.lang.scriptarchive.test ---
20:37:47 [2021-11-27T01:37:47.100Z] [INFO] tycho.testArgLine set to -javaagent:/home/jenkins/.m2/repository/org/jacoco/org.jacoco.agent/0.8.6/org.jacoco.agent-0.8.6-runtime.jar=destfile=/home/jenkins/agent/workspace/ease.verify.core.target.2020-03/tests/org.eclipse.ease.lang.scriptarchive.test/target/jacoco.exec,output=file
20:37:47 [2021-11-27T01:37:47.100Z] [INFO] 
20:37:47 [2021-11-27T01:37:47.100Z] [INFO] --- tycho-surefire-plugin:2.2.0:test (default-test) @ org.eclipse.ease.lang.scriptarchive.test ---
20:37:47 [2021-11-27T01:37:47.100Z] [INFO] Executing Test Runtime with timeout 0, logs (if any) will be placed at: /home/jenkins/agent/workspace/ease.verify.core.target.2020-03/tests/org.eclipse.ease.lang.scriptarchive.test/target/work/data/.metadata/.log
20:37:47 [2021-11-27T01:37:47.100Z] [INFO] Command line:
20:37:47 [2021-11-27T01:37:47.100Z] 	[/opt/tools/java/openjdk/jdk-15/15.0.2+7/bin/java, -Dosgi.noShutdown=false, -Dosgi.os=linux, -Dosgi.ws=gtk, -Dosgi.arch=x86_64, -javaagent:/home/jenkins/.m2/repository/org/jacoco/org.jacoco.agent/0.8.6/org.jacoco.agent-0.8.6-runtime.jar=destfile=/home/jenkins/agent/workspace/ease.verify.core.target.2020-03/tests/org.eclipse.ease.lang.scriptarchive.test/target/jacoco.exec,output=file, -Dosgi.clean=true, -jar, /home/jenkins/.m2/repository/p2/osgi/bundle/org.eclipse.equinox.launcher/1.5.700.v20200207-2156/org.eclipse.equinox.launcher-1.5.700.v20200207-2156.jar, -data, /home/jenkins/agent/workspace/ease.verify.core.target.2020-03/tests/org.eclipse.ease.lang.scriptarchive.test/target/work/data, -install, /home/jenkins/agent/workspace/ease.verify.core.target.2020-03/tests/org.eclipse.ease.lang.scriptarchive.test/target/work, -configuration, /home/jenkins/agent/workspace/ease.verify.core.target.2020-03/tests/org.eclipse.ease.lang.scriptarchive.test/target/work/configuration, -application, org.eclipse.tycho.surefire.osgibooter.headlesstest, -testproperties, /home/jenkins/agent/workspace/ease.verify.core.target.2020-03/tests/org.eclipse.ease.lang.scriptarchive.test/target/surefire.properties]
20:37:47 [2021-11-27T01:37:47.100Z] Picked up JAVA_TOOL_OPTIONS: -Dmaven.ext.class.path="/home/jenkins/agent/workspace/ease.verify.core.target.2020-03@tmp/withMaven3be7748d/pipeline-maven-spy.jar" -Dorg.jenkinsci.plugins.pipeline.maven.reportsFolder="/home/jenkins/agent/workspace/ease.verify.core.target.2020-03@tmp/withMaven3be7748d" 
20:37:49 [2021-11-27T01:37:49.723Z] Running org.eclipse.ease.lang.scriptarchive.ArchiveEngineTest
20:37:50 [2021-11-27T01:37:50.666Z] We are running from a zip file!
20:37:50 [2021-11-27T01:37:50.666Z] org.eclipse.ease.ScriptExecutionException: SyntaxError: missing ; before statement (workspace://__EASE_ScriptArchive_1/scripts/Master.js#3)
20:37:50 [2021-11-27T01:37:50.666Z] this is an error
20:37:50 [2021-11-27T01:37:50.666Z]        ^
20:37:50 [2021-11-27T01:37:50.666Z] 	at Master.js,workspace://__EASE_ScriptArchive_1/scripts/Master.js
20:37:50 [2021-11-27T01:37:50.666Z] org.eclipse.ease.ScriptExecutionException: SyntaxError: missing ; before statement (workspace://__EASE_ScriptArchive_1/scripts/Master.js#3)
20:37:50 [2021-11-27T01:37:50.666Z] this is an error
20:37:50 [2021-11-27T01:37:50.666Z]        ^
20:37:50 [2021-11-27T01:37:50.666Z] 	at Master.js,workspace://__EASE_ScriptArchive_1/scripts/Master.js
20:37:50 [2021-11-27T01:37:50.666Z] Tests run: 7, Failures: 0, Errors: 0, Skipped: 0, Time elapsed: 0.841 s - in org.eclipse.ease.lang.scriptarchive.ArchiveEngineTest
20:37:50 [2021-11-27T01:37:50.666Z] executeWithManifest  Time elapsed: 0.645 s
20:37:50 [2021-11-27T01:37:50.666Z] zipFileRegistration  Time elapsed: 0.044 s
20:37:50 [2021-11-27T01:37:50.666Z] engineIdRegistration  Time elapsed: 0.001 s
20:37:50 [2021-11-27T01:37:50.666Z] jarFileRegistration  Time elapsed: 0.001 s
20:37:50 [2021-11-27T01:37:50.666Z] sarFileRegistration  Time elapsed: 0.001 s
20:37:50 [2021-11-27T01:37:50.666Z] executeWithErrors  Time elapsed: 0.049 s
20:37:50 [2021-11-27T01:37:50.667Z] executeWithIncludes  Time elapsed: 0.087 s
20:37:50 [2021-11-27T01:37:50.667Z] 
20:37:50 [2021-11-27T01:37:50.667Z] Results:
20:37:50 [2021-11-27T01:37:50.667Z] 
20:37:50 [2021-11-27T01:37:50.667Z] Tests run: 7, Failures: 0, Errors: 0, Skipped: 0
20:37:50 [2021-11-27T01:37:50.667Z] 
20:37:50 [2021-11-27T01:37:50.923Z] [INFO] All tests passed!
20:37:50 [2021-11-27T01:37:50.923Z] [INFO] 
20:37:50 [2021-11-27T01:37:50.923Z] [INFO] -------------< org.eclipse.ease:org.eclipse.ease.ui.test >--------------
20:37:50 [2021-11-27T01:37:50.923Z] [INFO] Building org.eclipse.ease.ui.test 0.9.0-SNAPSHOT                   [9/9]
20:37:50 [2021-11-27T01:37:50.923Z] [INFO] ------------------------[ eclipse-test-plugin ]-------------------------
20:37:50 [2021-11-27T01:37:50.923Z] [INFO] 
20:37:50 [2021-11-27T01:37:50.923Z] [INFO] --- tycho-packaging-plugin:2.2.0:build-qualifier (default-build-qualifier) @ org.eclipse.ease.ui.test ---
20:37:50 [2021-11-27T01:37:50.923Z] [INFO] The project's OSGi version is 0.9.0.I202110141644
20:37:50 [2021-11-27T01:37:50.923Z] [INFO] 
20:37:50 [2021-11-27T01:37:50.923Z] [INFO] --- tycho-packaging-plugin:2.2.0:validate-id (default-validate-id) @ org.eclipse.ease.ui.test ---
20:37:50 [2021-11-27T01:37:50.923Z] [INFO] 
20:37:50 [2021-11-27T01:37:50.923Z] [INFO] --- tycho-packaging-plugin:2.2.0:validate-version (default-validate-version) @ org.eclipse.ease.ui.test ---
20:37:50 [2021-11-27T01:37:50.924Z] [INFO] 
20:37:50 [2021-11-27T01:37:50.924Z] [INFO] --- maven-resources-plugin:2.4.3:resources (default-resources) @ org.eclipse.ease.ui.test ---
20:37:50 [2021-11-27T01:37:50.924Z] [INFO] Using 'UTF-8' encoding to copy filtered resources.
20:37:50 [2021-11-27T01:37:50.924Z] [INFO] skip non existing resourceDirectory /home/jenkins/agent/workspace/ease.verify.core.target.2020-03/tests/org.eclipse.ease.ui.test/src/main/resources
20:37:50 [2021-11-27T01:37:50.924Z] [INFO] 
20:37:50 [2021-11-27T01:37:50.924Z] [INFO] --- tycho-compiler-plugin:2.2.0:compile (default-compile) @ org.eclipse.ease.ui.test ---
20:37:50 [2021-11-27T01:37:50.924Z] [INFO] Nothing to compile - all classes are up to date
20:37:50 [2021-11-27T01:37:50.924Z] [INFO] 
20:37:50 [2021-11-27T01:37:50.924Z] [INFO] --- maven-resources-plugin:2.4.3:testResources (default-testResources) @ org.eclipse.ease.ui.test ---
20:37:50 [2021-11-27T01:37:50.924Z] [INFO] Using 'UTF-8' encoding to copy filtered resources.
20:37:50 [2021-11-27T01:37:50.924Z] [INFO] skip non existing resourceDirectory /home/jenkins/agent/workspace/ease.verify.core.target.2020-03/tests/org.eclipse.ease.ui.test/src/test/resources
20:37:50 [2021-11-27T01:37:50.924Z] [INFO] 
20:37:50 [2021-11-27T01:37:50.924Z] [INFO] --- target-platform-configuration:2.2.0:target-platform (default-target-platform) @ org.eclipse.ease.ui.test ---
20:37:50 [2021-11-27T01:37:50.924Z] [INFO] 
20:37:50 [2021-11-27T01:37:50.924Z] [INFO] --- tycho-packaging-plugin:2.2.0:package-plugin (default-package-plugin) @ org.eclipse.ease.ui.test ---
20:37:50 [2021-11-27T01:37:50.924Z] [INFO] Building jar: /home/jenkins/agent/workspace/ease.verify.core.target.2020-03/tests/org.eclipse.ease.ui.test/target/org.eclipse.ease.ui.test-0.9.0-SNAPSHOT.jar
20:37:50 [2021-11-27T01:37:50.924Z] [INFO] 
20:37:50 [2021-11-27T01:37:50.924Z] [INFO] --- tycho-p2-plugin:2.2.0:p2-metadata-default (default-p2-metadata-default) @ org.eclipse.ease.ui.test ---
20:37:50 [2021-11-27T01:37:50.924Z] [INFO] 
20:37:50 [2021-11-27T01:37:50.924Z] [INFO] --- jacoco-maven-plugin:0.8.6:prepare-agent (jacoco-initialize) @ org.eclipse.ease.ui.test ---
20:37:50 [2021-11-27T01:37:50.924Z] [INFO] tycho.testArgLine set to -javaagent:/home/jenkins/.m2/repository/org/jacoco/org.jacoco.agent/0.8.6/org.jacoco.agent-0.8.6-runtime.jar=destfile=/home/jenkins/agent/workspace/ease.verify.core.target.2020-03/tests/org.eclipse.ease.ui.test/target/jacoco.exec,output=file
20:37:50 [2021-11-27T01:37:50.924Z] [INFO] 
20:37:50 [2021-11-27T01:37:50.924Z] [INFO] --- tycho-surefire-plugin:2.2.0:test (default-test) @ org.eclipse.ease.ui.test ---
20:37:50 [2021-11-27T01:37:50.924Z] [INFO] Executing Test Runtime with timeout 0, logs (if any) will be placed at: /home/jenkins/agent/workspace/ease.verify.core.target.2020-03/tests/org.eclipse.ease.ui.test/target/work/data/.metadata/.log
20:37:50 [2021-11-27T01:37:50.924Z] [INFO] Command line:
20:37:50 [2021-11-27T01:37:50.925Z] 	[/opt/tools/java/openjdk/jdk-15/15.0.2+7/bin/java, -Dosgi.noShutdown=false, -Dosgi.os=linux, -Dosgi.ws=gtk, -Dosgi.arch=x86_64, -javaagent:/home/jenkins/.m2/repository/org/jacoco/org.jacoco.agent/0.8.6/org.jacoco.agent-0.8.6-runtime.jar=destfile=/home/jenkins/agent/workspace/ease.verify.core.target.2020-03/tests/org.eclipse.ease.ui.test/target/jacoco.exec,output=file, -Dosgi.clean=true, -jar, /home/jenkins/.m2/repository/p2/osgi/bundle/org.eclipse.equinox.launcher/1.5.700.v20200207-2156/org.eclipse.equinox.launcher-1.5.700.v20200207-2156.jar, -data, /home/jenkins/agent/workspace/ease.verify.core.target.2020-03/tests/org.eclipse.ease.ui.test/target/work/data, -install, /home/jenkins/agent/workspace/ease.verify.core.target.2020-03/tests/org.eclipse.ease.ui.test/target/work, -configuration, /home/jenkins/agent/workspace/ease.verify.core.target.2020-03/tests/org.eclipse.ease.ui.test/target/work/configuration, -application, org.eclipse.tycho.surefire.osgibooter.headlesstest, -testproperties, /home/jenkins/agent/workspace/ease.verify.core.target.2020-03/tests/org.eclipse.ease.ui.test/target/surefire.properties]
20:37:50 [2021-11-27T01:37:50.925Z] Picked up JAVA_TOOL_OPTIONS: -Dmaven.ext.class.path="/home/jenkins/agent/workspace/ease.verify.core.target.2020-03@tmp/withMaven3be7748d/pipeline-maven-spy.jar" -Dorg.jenkinsci.plugins.pipeline.maven.reportsFolder="/home/jenkins/agent/workspace/ease.verify.core.target.2020-03@tmp/withMaven3be7748d" 
20:37:54 [2021-11-27T01:37:54.218Z] Running org.eclipse.ease.ui.views.shell.dropins.variables.HiddenVariablesFilterTest
20:37:54 [2021-11-27T01:37:54.502Z] Tests run: 3, Failures: 0, Errors: 0, Skipped: 0, Time elapsed: 0.602 s - in org.eclipse.ease.ui.views.shell.dropins.variables.HiddenVariablesFilterTest
20:37:54 [2021-11-27T01:37:54.502Z] select_accepts_unknown_classes  Time elapsed: 0.195 s
20:37:54 [2021-11-27T01:37:54.503Z] select_accepts_script_variables  Time elapsed: 0.395 s
20:37:54 [2021-11-27T01:37:54.503Z] select_declines_hidden_script_variables  Time elapsed: 0 s
20:37:54 [2021-11-27T01:37:54.503Z] Running org.eclipse.ease.ui.views.shell.dropins.variables.VariablesContentProviderTest
20:37:54 [2021-11-27T01:37:54.503Z] Tests run: 5, Failures: 0, Errors: 0, Skipped: 0, Time elapsed: 0.096 s - in org.eclipse.ease.ui.views.shell.dropins.variables.VariablesContentProviderTest
20:37:54 [2021-11-27T01:37:54.503Z] hasChildren_true_when_child_nodes_are_available  Time elapsed: 0.06 s
20:37:54 [2021-11-27T01:37:54.503Z] getChildren_is_empty_when_no_child_nodes_are_available  Time elapsed: 0.001 s
20:37:54 [2021-11-27T01:37:54.503Z] getElements_contains_variables_from_engine  Time elapsed: 0.032 s
20:37:54 [2021-11-27T01:37:54.503Z] hasChildren_false_when_no_child_nodes_are_available  Time elapsed: 0 s
20:37:54 [2021-11-27T01:37:54.503Z] getChildren_not_empty_when_child_nodes_are_available  Time elapsed: 0 s
20:37:54 [2021-11-27T01:37:54.503Z] Running org.eclipse.ease.ui.views.shell.dropins.variables.VariablesComparatorTest
20:37:54 [2021-11-27T01:37:54.760Z] Tests run: 1, Failures: 0, Errors: 0, Skipped: 0, Time elapsed: 0.081 s - in org.eclipse.ease.ui.views.shell.dropins.variables.VariablesComparatorTest
20:37:54 [2021-11-27T01:37:54.760Z] lastExecutionResult_comes_before_debugVariable  Time elapsed: 0.081 s
20:37:54 [2021-11-27T01:37:54.760Z] Running org.eclipse.ease.ui.views.shell.dropins.variables.ContentLabelProviderTest
20:37:54 [2021-11-27T01:37:54.760Z] Tests run: 1, Failures: 0, Errors: 0, Skipped: 0, Time elapsed: 0.005 s - in org.eclipse.ease.ui.views.shell.dropins.variables.ContentLabelProviderTest
20:37:54 [2021-11-27T01:37:54.760Z] getText_returns_variable_content  Time elapsed: 0.005 s
20:37:54 [2021-11-27T01:37:54.760Z] Running org.eclipse.ease.ui.views.shell.dropins.variables.VariablesLabelProviderTest
20:37:54 [2021-11-27T01:37:54.760Z] Tests run: 1, Failures: 0, Errors: 0, Skipped: 0, Time elapsed: 0.002 s - in org.eclipse.ease.ui.views.shell.dropins.variables.VariablesLabelProviderTest
20:37:54 [2021-11-27T01:37:54.760Z] getText_returns_variable_name  Time elapsed: 0.002 s
20:37:54 [2021-11-27T01:37:54.760Z] Running org.eclipse.ease.ui.views.shell.dropins.modules.ModulesStackLabelProviderTest
20:37:54 [2021-11-27T01:37:54.760Z] Tests run: 3, Failures: 0, Errors: 0, Skipped: 0, Time elapsed: 0.074 s - in org.eclipse.ease.ui.views.shell.dropins.modules.ModulesStackLabelProviderTest
20:37:54 [2021-11-27T01:37:54.760Z] getText_null_returns_empty_string  Time elapsed: 0.001 s
20:37:54 [2021-11-27T01:37:54.760Z] getText_returns_definition_name  Time elapsed: 0.072 s
20:37:54 [2021-11-27T01:37:54.760Z] getText_returns_full_class_name_name  Time elapsed: 0.001 s
20:37:54 [2021-11-27T01:37:54.760Z] Running org.eclipse.ease.ui.views.shell.dropins.modules.ModulesStackContentProviderTest
20:37:54 [2021-11-27T01:37:54.760Z] Tests run: 2, Failures: 0, Errors: 0, Skipped: 0, Time elapsed: 0.077 s - in org.eclipse.ease.ui.views.shell.dropins.modules.ModulesStackContentProviderTest
20:37:54 [2021-11-27T01:37:54.760Z] getElements_returns_modules  Time elapsed: 0.077 s
20:37:54 [2021-11-27T01:37:54.760Z] getElements_returns_empty_list_without_environment  Time elapsed: 0 s
20:37:54 [2021-11-27T01:37:54.760Z] Running org.eclipse.ease.ui.completion.provider.LoadModuleCompletionProviderTest
20:37:55 [2021-11-27T01:37:55.018Z] Tests run: 12, Failures: 0, Errors: 0, Skipped: 0, Time elapsed: 0.119 s - in org.eclipse.ease.ui.completion.provider.LoadModuleCompletionProviderTest
20:37:55 [2021-11-27T01:37:55.018Z] getProposals_contains_root_entry_with_absolute_filter  Time elapsed: 0.046 s
20:37:55 [2021-11-27T01:37:55.018Z] getProposals_contains_root_entry_with_relative_filter  Time elapsed: 0.002 s
20:37:55 [2021-11-27T01:37:55.018Z] getProposals_contains_category_with_relative_filter  Time elapsed: 0.001 s
20:37:55 [2021-11-27T01:37:55.018Z] getProposals_does_not_contain_root_entry_on_filter_mismatch  Time elapsed: 0.002 s
20:37:55 [2021-11-27T01:37:55.018Z] isActive_equals_false{String}[1]  Time elapsed: 0.033 s
20:37:55 [2021-11-27T01:37:55.018Z] isActive_equals_false{String}[2]  Time elapsed: 0.002 s
20:37:55 [2021-11-27T01:37:55.018Z] isActive_equals_false{String}[3]  Time elapsed: 0.002 s
20:37:55 [2021-11-27T01:37:55.018Z] getProposals_contains_root_entry  Time elapsed: 0.001 s
20:37:55 [2021-11-27T01:37:55.018Z] isActive_equals_true{String}[1]  Time elapsed: 0.001 s
20:37:55 [2021-11-27T01:37:55.018Z] isActive_equals_true{String}[2]  Time elapsed: 0.001 s
20:37:55 [2021-11-27T01:37:55.018Z] getProposals_contains_child_entry_with_absolute_filter  Time elapsed: 0.001 s
20:37:55 [2021-11-27T01:37:55.018Z] getProposals_does_not_contain_entry_on_completed_input  Time elapsed: 0 s
20:37:55 [2021-11-27T01:37:55.018Z] Running org.eclipse.ease.ui.completion.provider.AbstractFileLocationCompletionProviderTest
20:37:55 [2021-11-27T01:37:55.018Z] Tests run: 22, Failures: 0, Errors: 0, Skipped: 0, Time elapsed: 0.106 s - in org.eclipse.ease.ui.completion.provider.AbstractFileLocationCompletionProviderTest
20:37:55 [2021-11-27T01:37:55.018Z] getProposals_does_not_contain_back_proposal_for_project  Time elapsed: 0.08 s
20:37:55 [2021-11-27T01:37:55.018Z] getProposals_does_not_contain_project_root_with_file_resource  Time elapsed: 0.001 s
20:37:55 [2021-11-27T01:37:55.018Z] getProposals_contains_project_root_files_for_project_root  Time elapsed: 0.001 s
20:37:55 [2021-11-27T01:37:55.018Z] getProposals_contains_files_for_workspace_folder  Time elapsed: 0 s
20:37:55 [2021-11-27T01:37:55.018Z] getProposals_contains_back_for_workspace_folder  Time elapsed: 0 s
20:37:55 [2021-11-27T01:37:55.018Z] getProposals_contains_root_file_systems  Time elapsed: 0.001 s
20:37:55 [2021-11-27T01:37:55.018Z] getProposals_contains_files_for_project  Time elapsed: 0 s
20:37:55 [2021-11-27T01:37:55.018Z] back_proposal_contains_correct_replacement_string_for_absolute_workspace_folder_link  Time elapsed: 0 s
20:37:55 [2021-11-27T01:37:55.018Z] getProposals_does_not_contain_project_root_without_resource  Time elapsed: 0 s
20:37:55 [2021-11-27T01:37:55.018Z] getProposals_contains_project_root_with_workspace_resource  Time elapsed: 0 s
20:37:55 [2021-11-27T01:37:55.018Z] getProposals_contains_back_for_project_folder  Time elapsed: 0.001 s
20:37:55 [2021-11-27T01:37:55.018Z] getProposals_contains_project_root_folders_for_workspace_project_with_back_path  Time elapsed: 0 s
20:37:55 [2021-11-27T01:37:55.018Z] getProposals_contains_projects_for_workspace_root  Time elapsed: 0.001 s
20:37:55 [2021-11-27T01:37:55.018Z] getProposals_contains_project_root_folders_for_workspace_project  Time elapsed: 0 s
20:37:55 [2021-11-27T01:37:55.018Z] getProposals_contains_filesystem_root  Time elapsed: 0.001 s
20:37:55 [2021-11-27T01:37:55.018Z] getProposals_contains_files_for_project_folder  Time elapsed: 0.001 s
20:37:55 [2021-11-27T01:37:55.018Z] getProposals_contains_workspace_root  Time elapsed: 0 s
20:37:55 [2021-11-27T01:37:55.018Z] getProposals_does_not_contain_back_proposal  Time elapsed: 0.001 s
20:37:55 [2021-11-27T01:37:55.018Z] getProposals_contains_files_for_filesystem  Time elapsed: 0 s
20:37:55 [2021-11-27T01:37:55.018Z] getProposals_contains_project_root_files_for_workspace_project  Time elapsed: 0 s
20:37:55 [2021-11-27T01:37:55.018Z] getProposals_contains_back_for_filesystem  Time elapsed: 0 s
20:37:55 [2021-11-27T01:37:55.018Z] back_proposal_contains_correct_replacement_string_for_relative_workspace_folder_link  Time elapsed: 0 s
20:37:55 [2021-11-27T01:37:55.018Z] Running org.eclipse.ease.ui.completion.provider.VariablesCompletionProviderTest
20:37:55 [2021-11-27T01:37:55.018Z] Tests run: 18, Failures: 0, Errors: 0, Skipped: 0, Time elapsed: 0.025 s - in org.eclipse.ease.ui.completion.provider.VariablesCompletionProviderTest
20:37:55 [2021-11-27T01:37:55.019Z] prepareProposals_instance_contains_integer_variable  Time elapsed: 0.003 s
20:37:55 [2021-11-27T01:37:55.019Z] prepareProposals_instance_contains_string_variable  Time elapsed: 0.001 s
20:37:55 [2021-11-27T01:37:55.019Z] prepareProposals_instance_contains_string_variable_for_filter_input_case_insensitive  Time elapsed: 0.001 s
20:37:55 [2021-11-27T01:37:55.019Z] prepareProposals_instance_contains_string_variable_for_filter_input  Time elapsed: 0.001 s
20:37:55 [2021-11-27T01:37:55.019Z] prepareProposals_does_not_contain_internal_variable  Time elapsed: 0 s
20:37:55 [2021-11-27T01:37:55.019Z] isActive_equals_false{String}[1]  Time elapsed: 0.001 s
20:37:55 [2021-11-27T01:37:55.019Z] isActive_equals_false{String}[2]  Time elapsed: 0.002 s
20:37:55 [2021-11-27T01:37:55.019Z] isActive_equals_false{String}[3]  Time elapsed: 0.001 s
20:37:55 [2021-11-27T01:37:55.019Z] isActive_equals_false{String}[4]  Time elapsed: 0.001 s
20:37:55 [2021-11-27T01:37:55.019Z] isActive_equals_false{String}[5]  Time elapsed: 0.001 s
20:37:55 [2021-11-27T01:37:55.019Z] isActive_equals_true{String}[1]  Time elapsed: 0 s
20:37:55 [2021-11-27T01:37:55.019Z] isActive_equals_true{String}[2]  Time elapsed: 0 s
20:37:55 [2021-11-27T01:37:55.019Z] isActive_equals_true{String}[3]  Time elapsed: 0 s
20:37:55 [2021-11-27T01:37:55.019Z] isActive_equals_true{String}[4]  Time elapsed: 0.001 s
20:37:55 [2021-11-27T01:37:55.019Z] isActive_equals_true{String}[5]  Time elapsed: 0.001 s
20:37:55 [2021-11-27T01:37:55.019Z] isActive_equals_true{String}[6]  Time elapsed: 0.001 s
20:37:55 [2021-11-27T01:37:55.019Z] isActive_equals_true{String}[7]  Time elapsed: 0.001 s
20:37:55 [2021-11-27T01:37:55.019Z] isActive_equals_true{String}[8]  Time elapsed: 0.001 s
20:37:55 [2021-11-27T01:37:55.019Z] Running org.eclipse.ease.ui.completion.provider.AbstractPathCompletionProviderTest
20:37:55 [2021-11-27T01:37:55.019Z] Tests run: 11, Failures: 0, Errors: 0, Skipped: 0, Time elapsed: 0.005 s - in org.eclipse.ease.ui.completion.provider.AbstractPathCompletionProviderTest
20:37:55 [2021-11-27T01:37:55.019Z] filter_keeps_only_lower_level_on_matching_filter  Time elapsed: 0.001 s
20:37:55 [2021-11-27T01:37:55.019Z] filter_removes_nothing_if_context_is_empty  Time elapsed: 0 s
20:37:55 [2021-11-27T01:37:55.019Z] getPathsFromElements_is_empty_for_root_elements_only  Time elapsed: 0 s
20:37:55 [2021-11-27T01:37:55.019Z] filter_keeps_only_1st_level_on_empty_filter  Time elapsed: 0 s
20:37:55 [2021-11-27T01:37:55.019Z] filter_keeps_only_1st_level_on_matching_filter  Time elapsed: 0.001 s
20:37:55 [2021-11-27T01:37:55.019Z] getPathsFromElements_is_empty_for_empty_element  Time elapsed: 0 s
20:37:55 [2021-11-27T01:37:55.019Z] filter_removes_mismatches_on_same_level  Time elapsed: 0 s
20:37:55 [2021-11-27T01:37:55.019Z] filter_matches_next_level  Time elapsed: 0 s
20:37:55 [2021-11-27T01:37:55.019Z] filter_matches_relative_paths  Time elapsed: 0 s
20:37:55 [2021-11-27T01:37:55.019Z] getPathsFromElements_contains_parent_paths  Time elapsed: 0 s
20:37:55 [2021-11-27T01:37:55.019Z] getPathsFromElements_contains_all_hierarchies  Time elapsed: 0 s
20:37:55 [2021-11-27T01:37:55.019Z] Running org.eclipse.ease.ui.completion.provider.AbstractCompletionProviderTest
20:37:55 [2021-11-27T01:37:55.300Z] Tests run: 16, Failures: 0, Errors: 0, Skipped: 0, Time elapsed: 0.026 s - in org.eclipse.ease.ui.completion.provider.AbstractCompletionProviderTest
20:37:55 [2021-11-27T01:37:55.300Z] isStringParameter_equals_true{String}[1]  Time elapsed: 0.001 s
20:37:55 [2021-11-27T01:37:55.300Z] isStringParameter_equals_true{String}[2]  Time elapsed: 0.001 s
20:37:55 [2021-11-27T01:37:55.300Z] isStringParameter_equals_true{String}[3]  Time elapsed: 0.001 s
20:37:55 [2021-11-27T01:37:55.300Z] isStringParameter_equals_true{String}[4]  Time elapsed: 0.001 s
20:37:55 [2021-11-27T01:37:55.300Z] isMethodParameter_equals_true  Time elapsed: 0 s
20:37:55 [2021-11-27T01:37:55.301Z] isMethodParameter_equals_true_for_2nd_parameter  Time elapsed: 0 s
20:37:55 [2021-11-27T01:37:55.301Z] isValid_equals_false_for_invalid_context  Time elapsed: 0.012 s
20:37:55 [2021-11-27T01:37:55.301Z] isStringParameter_equals_false{String}[1]  Time elapsed: 0.001 s
20:37:55 [2021-11-27T01:37:55.301Z] isStringParameter_equals_false{String}[2]  Time elapsed: 0 s
20:37:55 [2021-11-27T01:37:55.301Z] isStringParameter_equals_false{String}[3]  Time elapsed: 0.001 s
20:37:55 [2021-11-27T01:37:55.301Z] isStringParameter_equals_false{String}[4]  Time elapsed: 0 s
20:37:55 [2021-11-27T01:37:55.301Z] isStringParameter_equals_false{String}[5]  Time elapsed: 0 s
20:37:55 [2021-11-27T01:37:55.301Z] isMethodParameter_equals_false_when_no_method_is_detected  Time elapsed: 0.001 s
20:37:55 [2021-11-27T01:37:55.301Z] isValid_equals_true_for_valid_context  Time elapsed: 0 s
20:37:55 [2021-11-27T01:37:55.301Z] isMethodParameter_equals_false_for_wrong_method_name  Time elapsed: 0.001 s
20:37:55 [2021-11-27T01:37:55.301Z] isMethodParameter_equals_false_for_wrong_parameter_index  Time elapsed: 0.001 s
20:37:55 [2021-11-27T01:37:55.301Z] Running org.eclipse.ease.ui.completion.provider.LoadedModuleCompletionProviderTest
20:37:55 [2021-11-27T01:37:55.301Z] Tests run: 15, Failures: 0, Errors: 0, Skipped: 0, Time elapsed: 0.022 s - in org.eclipse.ease.ui.completion.provider.LoadedModuleCompletionProviderTest
20:37:55 [2021-11-27T01:37:55.301Z] method_proposal_contains_opening_bracket_when_method_has_mandatory_parameters  Time elapsed: 0.006 s
20:37:55 [2021-11-27T01:37:55.301Z] method_proposal_contains_full_method_call_when_method_has_only_optional_parameters  Time elapsed: 0.002 s
20:37:55 [2021-11-27T01:37:55.301Z] getProposals_contains_constant_methods  Time elapsed: 0.002 s
20:37:55 [2021-11-27T01:37:55.301Z] getProposals_contains_module_methods  Time elapsed: 0.002 s
20:37:55 [2021-11-27T01:37:55.301Z] isActive_equals_false{String}[1]  Time elapsed: 0 s
20:37:55 [2021-11-27T01:37:55.301Z] isActive_equals_false{String}[2]  Time elapsed: 0.001 s
20:37:55 [2021-11-27T01:37:55.301Z] isActive_equals_false{String}[3]  Time elapsed: 0 s
20:37:55 [2021-11-27T01:37:55.301Z] isActive_equals_false{String}[4]  Time elapsed: 0 s
20:37:55 [2021-11-27T01:37:55.301Z] isActive_equals_true{String}[1]  Time elapsed: 0 s
20:37:55 [2021-11-27T01:37:55.301Z] isActive_equals_true{String}[2]  Time elapsed: 0 s
20:37:55 [2021-11-27T01:37:55.301Z] isActive_equals_true{String}[3]  Time elapsed: 0 s
20:37:55 [2021-11-27T01:37:55.301Z] isActive_equals_true{String}[4]  Time elapsed: 0.001 s
20:37:55 [2021-11-27T01:37:55.301Z] isActive_equals_true{String}[5]  Time elapsed: 0 s
20:37:55 [2021-11-27T01:37:55.301Z] isActive_equals_true{String}[6]  Time elapsed: 0 s
20:37:55 [2021-11-27T01:37:55.301Z] method_proposal_contains_full_method_call_when_method_has_no_parameters  Time elapsed: 0.002 s
20:37:55 [2021-11-27T01:37:55.301Z] Running org.eclipse.ease.ui.completion.provider.LocationResolverTest
20:37:55 [2021-11-27T01:37:55.301Z] Tests run: 1, Failures: 0, Errors: 0, Skipped: 0, Time elapsed: 0 s - in org.eclipse.ease.ui.completion.provider.LocationResolverTest
20:37:55 [2021-11-27T01:37:55.301Z] getParentString_has_no_trailing_slashes  Time elapsed: 0 s
20:37:55 [2021-11-27T01:37:55.301Z] Running org.eclipse.ease.ui.completion.BasicContextTest
20:37:55 [2021-11-27T01:37:55.301Z] Tests run: 12, Failures: 0, Errors: 0, Skipped: 0, Time elapsed: 0.006 s - in org.eclipse.ease.ui.completion.BasicContextTest
20:37:55 [2021-11-27T01:37:55.301Z] isValid_equals_true  Time elapsed: 0 s
20:37:55 [2021-11-27T01:37:55.301Z] getScriptEngine_returns_engine  Time elapsed: 0.001 s
20:37:55 [2021-11-27T01:37:55.301Z] getFilter_removes_string_literal_start  Time elapsed: 0 s
20:37:55 [2021-11-27T01:37:55.301Z] getLoadedModules_detects_modules_from_ScriptEngine  Time elapsed: 0 s
20:37:55 [2021-11-27T01:37:55.301Z] getFilter_contains_parameter_prefix  Time elapsed: 0.001 s
20:37:55 [2021-11-27T01:37:55.301Z] getLoadedModules_contains_environment_on_resource  Time elapsed: 0 s
20:37:55 [2021-11-27T01:37:55.301Z] getLoadedModules_does_not_contain_environment_twice_on_resource  Time elapsed: 0.001 s
20:37:55 [2021-11-27T01:37:55.301Z] getFilter_is_empty  Time elapsed: 0 s
20:37:55 [2021-11-27T01:37:55.301Z] getFilter_keeps_spaces_in_string_literal  Time elapsed: 0.001 s
20:37:55 [2021-11-27T01:37:55.301Z] getLoadedModules_detects_loadModule_commands  Time elapsed: 0 s
20:37:55 [2021-11-27T01:37:55.301Z] getFilter_is_empty_for_empty_input  Time elapsed: 0 s
20:37:55 [2021-11-27T01:37:55.301Z] isInvalid_equals_true  Time elapsed: 0.001 s
20:37:55 [2021-11-27T01:37:55.302Z] Running org.eclipse.ease.ui.completion.tokenizer.BracketMatcherTest
20:37:55 [2021-11-27T01:37:55.302Z] Tests run: 9, Failures: 0, Errors: 0, Skipped: 0, Time elapsed: 0.003 s - in org.eclipse.ease.ui.completion.tokenizer.BracketMatcherTest
20:37:55 [2021-11-27T01:37:55.302Z] getOpenBrackets_returns_open_brackets_only  Time elapsed: 0 s
20:37:55 [2021-11-27T01:37:55.302Z] getBrackets_detects_1  Time elapsed: 0 s
20:37:55 [2021-11-27T01:37:55.302Z] getBrackets_detects_2  Time elapsed: 0 s
20:37:55 [2021-11-27T01:37:55.302Z] getBrackets_detects_3  Time elapsed: 0 s
20:37:55 [2021-11-27T01:37:55.302Z] hasOpenBrackets_equals_true  Time elapsed: 0 s
20:37:55 [2021-11-27T01:37:55.302Z] getBrackets_is_empty  Time elapsed: 0 s
20:37:55 [2021-11-27T01:37:55.302Z] hasOpenBrackets_equals_false  Time elapsed: 0 s
20:37:55 [2021-11-27T01:37:55.302Z] getBrackets_detects_open_brackets  Time elapsed: 0 s
20:37:55 [2021-11-27T01:37:55.302Z] getBrackets_detects_nested  Time elapsed: 0 s
20:37:55 [2021-11-27T01:37:55.302Z] Running org.eclipse.ease.ui.completion.tokenizer.InputTokenizerTest
20:37:55 [2021-11-27T01:37:55.302Z] Tests run: 68, Failures: 0, Errors: 0, Skipped: 0, Time elapsed: 0.057 s - in org.eclipse.ease.ui.completion.tokenizer.InputTokenizerTest
20:37:55 [2021-11-27T01:37:55.302Z] getTokens_detects_method_chaining  Time elapsed: 0.001 s
20:37:55 [2021-11-27T01:37:55.302Z] isDelimiter_equals_true{String}[1]  Time elapsed: 0 s
20:37:55 [2021-11-27T01:37:55.302Z] isDelimiter_equals_true{String}[2]  Time elapsed: 0 s
20:37:55 [2021-11-27T01:37:55.302Z] isDelimiter_equals_true{String}[3]  Time elapsed: 0 s
20:37:55 [2021-11-27T01:37:55.302Z] isDelimiter_equals_true{String}[4]  Time elapsed: 0.001 s
20:37:55 [2021-11-27T01:37:55.302Z] isDelimiter_equals_true{String}[5]  Time elapsed: 0 s
20:37:55 [2021-11-27T01:37:55.302Z] isDelimiter_equals_true{String}[6]  Time elapsed: 0 s
20:37:55 [2021-11-27T01:37:55.302Z] isDelimiter_equals_true{String}[7]  Time elapsed: 0 s
20:37:55 [2021-11-27T01:37:55.302Z] getTokens_detects_package_fragments  Time elapsed: 0 s
20:37:55 [2021-11-27T01:37:55.302Z] getTokens_detects_javascript_method_call  Time elapsed: 0.001 s
20:37:55 [2021-11-27T01:37:55.302Z] getTokens_detects_incomplete_package  Time elapsed: 0 s
20:37:55 [2021-11-27T01:37:55.302Z] getTokens_detects_module_methods_call_chain  Time elapsed: 0.001 s
20:37:55 [2021-11-27T01:37:55.302Z] getTokens_splits_string_literal  Time elapsed: 0 s
20:37:55 [2021-11-27T01:37:55.302Z] getTokens_detects_static_method_call  Time elapsed: 0 s
20:37:55 [2021-11-27T01:37:55.302Z] getTokens_detects_method_call_chain  Time elapsed: 0.001 s
20:37:55 [2021-11-27T01:37:55.302Z] getTokens_simplifies_multiply_operations  Time elapsed: 0 s
20:37:55 [2021-11-27T01:37:55.302Z] getTokens_detects_method_call_parameter_prefix  Time elapsed: 0.001 s
20:37:55 [2021-11-27T01:37:55.302Z] getTokens_detects_method_call_parameters_with_prefix  Time elapsed: 0 s
20:37:55 [2021-11-27T01:37:55.302Z] getTokens_detects_package  Time elapsed: 0 s
20:37:55 [2021-11-27T01:37:55.302Z] getTokens_detects_partial_package  Time elapsed: 0 s
20:37:55 [2021-11-27T01:37:55.302Z] getTokens_simplifies_plus_operations  Time elapsed: 0 s
20:37:55 [2021-11-27T01:37:55.302Z] getTokens_detects_class  Time elapsed: 0 s
20:37:55 [2021-11-27T01:37:55.302Z] getTokens_detects_opened_module_method  Time elapsed: 0.001 s
20:37:55 [2021-11-27T01:37:55.302Z] getTokens_simplifies_brackets_recursively  Time elapsed: 0 s
20:37:55 [2021-11-27T01:37:55.302Z] getTokens_detects_method_call_parameter  Time elapsed: 0 s
20:37:55 [2021-11-27T01:37:55.302Z] getTokens_simplifies_brackets  Time elapsed: 0 s
20:37:55 [2021-11-27T01:37:55.302Z] getTokens_removes_new_operator  Time elapsed: 0 s
20:37:55 [2021-11-27T01:37:55.302Z] isDelimiter_equals_false{String}[1]  Time elapsed: 0 s
20:37:55 [2021-11-27T01:37:55.302Z] isDelimiter_equals_false{String}[2]  Time elapsed: 0 s
20:37:55 [2021-11-27T01:37:55.302Z] isDelimiter_equals_false{String}[3]  Time elapsed: 0 s
20:37:55 [2021-11-27T01:37:55.302Z] getTokens_detects_method_call_parameters  Time elapsed: 0 s
20:37:55 [2021-11-27T01:37:55.302Z] getTokens_detects_class_instantiation  Time elapsed: 0.001 s
20:37:55 [2021-11-27T01:37:55.302Z] getTokens_detects_method_call  Time elapsed: 0 s
20:37:55 [2021-11-27T01:37:55.302Z] getTokens_simplifies_divide_operations  Time elapsed: 0 s
20:37:55 [2021-11-27T01:37:55.302Z] getTokens_removes_left_hand_side_of_assignment  Time elapsed: 0.001 s
20:37:55 [2021-11-27T01:37:55.302Z] getTokens_detects_javascript_class_instantiation  Time elapsed: 0 s
20:37:55 [2021-11-27T01:37:55.302Z] getTokens_simplifies_for_loop  Time elapsed: 0 s
20:37:55 [2021-11-27T01:37:55.302Z] getTokens_detects_resolved_javascript_variable_2  Time elapsed: 0.001 s
20:37:55 [2021-11-27T01:37:55.303Z] getTokens_simplifies_minus_operations  Time elapsed: 0 s
20:37:55 [2021-11-27T01:37:55.303Z] getTokens_detects_class_instantiation_2  Time elapsed: 0 s
20:37:55 [2021-11-27T01:37:55.303Z] getTokens_detects_class_instantiation_3  Time elapsed: 0 s
20:37:55 [2021-11-27T01:37:55.303Z] getTokens_simplifies_assignments  Time elapsed: 0 s
20:37:55 [2021-11-27T01:37:55.303Z] getTokens_detects_inner_class  Time elapsed: 0 s
20:37:55 [2021-11-27T01:37:55.303Z] getTokens_detects_static_method_call_with_dot_prefix  Time elapsed: 0 s
20:37:55 [2021-11-27T01:37:55.303Z] getTokens_detects_class_2  Time elapsed: 0 s
20:37:55 [2021-11-27T01:37:55.303Z] isTextFilter_equals_false{String}[1]  Time elapsed: 0 s
20:37:55 [2021-11-27T01:37:55.303Z] isTextFilter_equals_false{String}[2]  Time elapsed: 0.001 s
20:37:55 [2021-11-27T01:37:55.303Z] isTextFilter_equals_false{String}[3]  Time elapsed: 0 s
20:37:55 [2021-11-27T01:37:55.303Z] isTextFilter_equals_false{String}[4]  Time elapsed: 0 s
20:37:55 [2021-11-27T01:37:55.303Z] isTextFilter_equals_false{String}[5]  Time elapsed: 0 s
20:37:55 [2021-11-27T01:37:55.303Z] getTokens_does_not_split_within_string_literal  Time elapsed: 0 s
20:37:55 [2021-11-27T01:37:55.303Z] getTokens_1  Time elapsed: 0 s
20:37:55 [2021-11-27T01:37:55.303Z] isTextFilter_equals_true{String}[1]  Time elapsed: 0 s
20:37:55 [2021-11-27T01:37:55.303Z] isTextFilter_equals_true{String}[2]  Time elapsed: 0 s
20:37:55 [2021-11-27T01:37:55.303Z] getTokens_detects_opened_module_method_with_filter  Time elapsed: 0 s
20:37:55 [2021-11-27T01:37:55.303Z] getTokens_detects_method_call_request_with_filter  Time elapsed: 0 s
20:37:55 [2021-11-27T01:37:55.303Z] getTokens_for_empty_input  Time elapsed: 0 s
20:37:55 [2021-11-27T01:37:55.303Z] getTokens_detects_package_with_class_prefix  Time elapsed: 0 s
20:37:55 [2021-11-27T01:37:55.303Z] getTokens_detects_module_methods  Time elapsed: 0 s
20:37:55 [2021-11-27T01:37:55.303Z] getTokens_detects_completed_method  Time elapsed: 0 s
20:37:55 [2021-11-27T01:37:55.303Z] getTokens_detects_resolved_javascript_variable_with_method  Time elapsed: 0 s
20:37:55 [2021-11-27T01:37:55.303Z] getTokens_detects_resolved_javascript_variable  Time elapsed: 0 s
20:37:55 [2021-11-27T01:37:55.303Z] getTokens_simplifies_string_literal_1  Time elapsed: 0 s
20:37:55 [2021-11-27T01:37:55.303Z] getTokens_simplifies_string_literal_2  Time elapsed: 0 s
20:37:55 [2021-11-27T01:37:55.303Z] getTokens_is_empty_after_string_literal  Time elapsed: 0 s
20:37:55 [2021-11-27T01:37:55.303Z] getTokens_detects_static_method_call_chain  Time elapsed: 0 s
20:37:55 [2021-11-27T01:37:55.303Z] getTokens_detects_opened_module_method_with_parameter  Time elapsed: 0 s
20:37:55 [2021-11-27T01:37:55.303Z] getTokens_detects_javascript_object_call  Time elapsed: 0 s
20:37:55 [2021-11-27T01:37:55.303Z] Running org.eclipse.ease.ui.completion.tokenizer.TokenListTest
20:37:55 [2021-11-27T01:37:55.303Z] Tests run: 1, Failures: 0, Errors: 0, Skipped: 0, Time elapsed: 0 s - in org.eclipse.ease.ui.completion.tokenizer.TokenListTest
20:37:55 [2021-11-27T01:37:55.303Z] new_TokenList_is_empty  Time elapsed: 0 s
20:37:55 [2021-11-27T01:37:55.303Z] Running org.eclipse.ease.ui.completion.ScriptCompletionProposalTest
20:37:55 [2021-11-27T01:37:55.303Z] Tests run: 8, Failures: 0, Errors: 0, Skipped: 0, Time elapsed: 0.002 s - in org.eclipse.ease.ui.completion.ScriptCompletionProposalTest
20:37:55 [2021-11-27T01:37:55.303Z] getCursorPosition_equals_end_of_inserted_text  Time elapsed: 0 s
20:37:55 [2021-11-27T01:37:55.303Z] getCursorPosition_equals_end_of_appended_text  Time elapsed: 0 s
20:37:55 [2021-11-27T01:37:55.303Z] compareTo_lists_higher_priority_first  Time elapsed: 0 s
20:37:55 [2021-11-27T01:37:55.303Z] getContent_inserts_replacement_text  Time elapsed: 0 s
20:37:55 [2021-11-27T01:37:55.303Z] getCursorPosition_equals_end_of_set_text  Time elapsed: 0.001 s
20:37:55 [2021-11-27T01:37:55.303Z] getContent_sets_replacement_text  Time elapsed: 0 s
20:37:55 [2021-11-27T01:37:55.303Z] compareTo_lists_same_prio_in_alphabetic_order  Time elapsed: 0 s
20:37:55 [2021-11-27T01:37:55.303Z] getContent_appends_replacement_text  Time elapsed: 0 s
20:37:55 [2021-11-27T01:37:55.303Z] Running org.eclipse.ease.ui.completion.CodeCompletionAggregatorTest
20:37:55 [2021-11-27T01:37:55.303Z] Tests run: 4, Failures: 0, Errors: 0, Skipped: 0, Time elapsed: 0.088 s - in org.eclipse.ease.ui.completion.CodeCompletionAggregatorTest
20:37:55 [2021-11-27T01:37:55.303Z] context_for_empty_input  Time elapsed: 0.076 s
20:37:55 [2021-11-27T01:37:55.303Z] context_for_root_package_with_suffix  Time elapsed: 0.002 s
20:37:55 [2021-11-27T01:37:55.303Z] getProposals_contains_proposal_from_local_provider  Time elapsed: 0.009 s
20:37:55 [2021-11-27T01:37:55.304Z] context_for_root_package  Time elapsed: 0.001 s
20:37:55 [2021-11-27T01:37:55.304Z] Running org.eclipse.ease.ui.dnd.ModulesDropHandlerTest
20:37:55 [2021-11-27T01:37:55.304Z] Tests run: 2, Failures: 0, Errors: 0, Skipped: 0, Time elapsed: 0.018 s - in org.eclipse.ease.ui.dnd.ModulesDropHandlerTest
20:37:55 [2021-11-27T01:37:55.304Z] accepts_true_for_ModuleEntry  Time elapsed: 0.017 s
20:37:55 [2021-11-27T01:37:55.304Z] accepts_true_for_ModuleDefinition  Time elapsed: 0 s
20:37:55 [2021-11-27T01:37:55.304Z] Running org.eclipse.ease.ui.help.hovers.ModuleHelpTest
20:37:55 [2021-11-27T01:37:55.304Z] Tests run: 4, Failures: 0, Errors: 0, Skipped: 4, Time elapsed: 0.002 s - in org.eclipse.ease.ui.help.hovers.ModuleHelpTest
20:37:55 [2021-11-27T01:37:55.304Z] getModuleHelpLocation skipped
20:37:55 [2021-11-27T01:37:55.304Z] getModuleHelp skipped
20:37:55 [2021-11-27T01:37:55.304Z] getMethodHelp skipped
20:37:55 [2021-11-27T01:37:55.304Z] getConstantHelp skipped
20:37:55 [2021-11-27T01:37:55.304Z] 
20:37:55 [2021-11-27T01:37:55.304Z] Results:
20:37:55 [2021-11-27T01:37:55.304Z] 
20:37:55 [2021-11-27T01:37:55.304Z] Tests run: 219, Failures: 0, Errors: 0, Skipped: 4
20:37:55 [2021-11-27T01:37:55.304Z] 
20:37:55 [2021-11-27T01:37:55.561Z] [INFO] All tests passed!
20:37:55 [2021-11-27T01:37:55.561Z] [INFO] ------------------------------------------------------------------------
20:37:55 [2021-11-27T01:37:55.561Z] [INFO] Reactor Summary for org.eclipse.ease.releng 0.9.0-SNAPSHOT:
20:37:55 [2021-11-27T01:37:55.561Z] [INFO] 
20:37:55 [2021-11-27T01:37:55.561Z] [INFO] org.eclipse.ease.releng ............................ SUCCESS [  0.001 s]
20:37:55 [2021-11-27T01:37:55.561Z] [INFO] org.eclipse.ease.releng.target ..................... SUCCESS [  0.118 s]
20:37:55 [2021-11-27T01:37:55.561Z] [INFO] org.eclipse.ease.test .............................. SUCCESS [ 27.630 s]
20:37:55 [2021-11-27T01:37:55.561Z] [INFO] org.eclipse.ease.lang.javascript.rhino.test ........ SUCCESS [ 15.564 s]
20:37:55 [2021-11-27T01:37:55.561Z] [INFO] org.eclipse.ease.lang.javascript.test .............. SUCCESS [  3.077 s]
20:37:55 [2021-11-27T01:37:55.561Z] [INFO] org.eclipse.ease.lang.python.test .................. SUCCESS [  4.555 s]
20:37:55 [2021-11-27T01:37:55.561Z] [INFO] org.eclipse.ease.lang.python.jython.test ........... SUCCESS [ 16.921 s]
20:37:55 [2021-11-27T01:37:55.561Z] [INFO] org.eclipse.ease.lang.scriptarchive.test ........... SUCCESS [  3.925 s]
20:37:55 [2021-11-27T01:37:55.561Z] [INFO] org.eclipse.ease.ui.test ........................... SUCCESS [  4.679 s]
20:37:55 [2021-11-27T01:37:55.561Z] [INFO] ------------------------------------------------------------------------
20:37:55 [2021-11-27T01:37:55.561Z] [INFO] BUILD SUCCESS
20:37:55 [2021-11-27T01:37:55.561Z] [INFO] ------------------------------------------------------------------------
20:37:55 [2021-11-27T01:37:55.561Z] [INFO] Total time:  01:54 min
20:37:55 [2021-11-27T01:37:55.561Z] [INFO] Finished at: 2021-11-27T01:37:55Z
20:37:55 [2021-11-27T01:37:55.561Z] [INFO] ------------------------------------------------------------------------
20:37:55 [2021-11-27T01:37:55.561Z] [WARNING] [jenkins-event-spy] Unexpected Maven project file name 'target-tests-pom.xml', problems may occur
20:37:55 [2021-11-27T01:37:55.561Z] [INFO] [jenkins-event-spy] Generated /home/jenkins/agent/workspace/ease.verify.core.target.2020-03@tmp/withMaven3be7748d/maven-spy-20211127-013600-9311975083950653339968.log